##TITLE=1H_Ser DNG-CO-PrN
 CDCl3, 8 sc, 
 11.4.2019
##JCAMPDX= 6.0         $$ Bruker NMR JCAMP-DX V2.0
##DATA TYPE= NMR FID
##DATA CLASS= NTUPLES
##ORIGIN= UXNMR, Bruker Analytische Messtechnik GmbH
##OWNER= root
$$ XWIN-NMR		Version 3.5
$$ Thu Apr 11 13:53:51 2019 Russian Standard Time (UT+4h)  she@DPX200
##.OBSERVE FREQUENCY= 200.1315
##.OBSERVE NUCLEUS= ^1H
##.DELAY= (6, 6)
##.ACQUISITION MODE= SIMULTANEOUS
##.ACQUISITION SCHEME= undefined
##.AVERAGES= 8
##.DIGITISER RES= 18
##SPECTROMETER/DATA SYSTEM= spect
##.PULSE SEQUENCE= zg30
##.SOLVENT NAME= CDCl3
##.SHIFT REFERENCE= (INTERNAL, CDCl3, 0, 15.7039)
##AUDIT TRAIL= $$ (NUMBER, WHEN, WHO, WHERE, WHAT)
$$ ##TITLE= Audit trail, XWIN-NMR		Version 3.5
$$ ##JCAMPDX= 5.01
$$ ##ORIGIN= Bruker BioSpin GmbH
$$ ##OWNER= she
$$ F:/spectra/data/she/nmr/H-F/1/audita.txt
$$ ##AUDIT TRAIL=  $$ (NUMBER, WHEN, WHO, WHERE, WHAT)
(   1,<2019-04-11 13:52:40.25 +0400>,<she>,<DPX200>,
      <created by zg, POWCHK disabled, PULCHK disabled
       configuration hash MD5:
       00 E9 B6 7A A2 85 ED C7 34 08 36 98 17 FE 4E 26
       data hash MD5: 16K
       4D 2F 86 BB A9 1E AB 38 56 22 20 09 AC 42 FA 62>)
$$ ##END=
$$ 
$$ hash MD5
$$ 50 54 D2 CD E6 84 80 32 19 F9 15 E1 14 36 B7 DA
##$RELAX= 
##$RELAX= 
##$RELAX= 
##$RELAX= 
##$RELAX= 
##$RELAX= 
$$ Bruker specific parameters
$$ --------------------------
##$DU= <F:/spectra>
##$EXPNO= 1
##$NAME= <H-F>
##$PROCNO= 1
##$TYPE= <nmr>
##$USER= <she>
##$AMP= (0..31)
100 100 100 100 100 100 100 100 100 100 100 100 100 100 100 100 100 100 
100 100 100 100 100 100 100 100 100 100 100 100 100 100 
##$AQSEQ= 0
##$AQ_mod= 1
##$AUNM= <au_zg>
##$AUTOPOS= <>
##$BF1= 200.13
##$BF2= 200.13
##$BF3= 200.13
##$BF4= 200.13
##$BF5= 200.13
##$BF6= 200.13
##$BF7= 200.13
##$BF8= 200.13
##$BYTORDA= 1
##$CFDGTYP= 0
##$CFRGTYP= 5
##$CHEMSTR= <none>
##$CNST= (0..31)
1 1 145 1 1 1 1 1 1 1 1 1 1 1 1 1 1 1 1 1 1 1 1 1 1 1 1 1 1 1 1 1 
##$CPDPRG= <>
##$CPDPRG1= <>
##$CPDPRG2= <>
##$CPDPRG3= <>
##$CPDPRG4= <mlev>
##$CPDPRG5= <mlev>
##$CPDPRG6= <mlev>
##$CPDPRG7= <mlev>
##$CPDPRG8= <mlev>
##$CPDPRGB= <>
##$CPDPRGT= <>
##$D= (0..31)
0 1.2 0 0 0 0 0 0 0 0 0 0.03 0 0 0 0 0 0 0 0 0 0 0 0 0 0 0 0 0 0 0 0 
##$DATE= 1554976359
##$DBL= (0..7)
120 120 120 120 120 120 120 120 
##$DBP= (0..7)
150 150 150 150 150 150 150 150 
##$DBP07= 0
##$DBPNAM0= <>
##$DBPNAM1= <>
##$DBPNAM2= <>
##$DBPNAM3= <>
##$DBPNAM4= <>
##$DBPNAM5= <>
##$DBPNAM6= <>
##$DBPNAM7= <>
##$DBPOAL= (0..7)
0.5 0.5 0.5 0.5 0.5 0.5 0.5 0.5 
##$DBPOFFS= (0..7)
0 0 0 0 0 0 0 0 
##$DE= 6
##$DECBNUC= <off>
##$DECIM= 24
##$DECNUC= <off>
##$DECSTAT= 4
##$DIGMOD= 1
##$DIGTYP= 9
##$DL= (0..7)
0 120 120 120 120 120 120 120 
##$DP= (0..7)
150 150 150 150 150 150 150 150 
##$DP07= 0
##$DPNAME0= <>
##$DPNAME1= <>
##$DPNAME2= <>
##$DPNAME3= <>
##$DPNAME4= <>
##$DPNAME5= <>
##$DPNAME6= <>
##$DPNAME7= <>
##$DPOAL= (0..7)
0.5 0.5 0.5 0.5 0.5 0.5 0.5 0.5 
##$DPOFFS= (0..7)
0 0 0 0 0 0 0 0 
##$DQDMODE= 0
##$DR= 18
##$DS= 0
##$DSLIST= <SSSSSSSSSSSSSSS>
$$ [...]
##$SUBNAM2= <"">
##$SUBNAM3= <"">
##$SUBNAM4= <"">
##$SUBNAM5= <"">
##$SUBNAM6= <"">
##$SUBNAM7= <"">
##$SUBNAM8= <"">
##$SUBNAM9= <"">
##$SW= 24.9337058887773
##$SWIBOX= (0..15)
0 0 2 0 0 0 0 0 0 0 0 0 0 0 0 0 
##$SW_h= 4990.01996007984
##$TD= 16384
##$TD0= 1
##$TE= 0
##$TE2= 300
##$TE3= 300
##$TEG= 300
##$TL= (0..7)
0 120 120 120 120 120 120 120 
##$TP= (0..7)
150 150 150 150 150 150 150 150 
##$TP07= 0
##$TPNAME0= <>
##$TPNAME1= <>
##$TPNAME2= <>
##$TPNAME3= <>
##$TPNAME4= <>
##$TPNAME5= <>
##$TPNAME6= <>
##$TPNAME7= <>
##$TPOAL= (0..7)
0.5 0.5 0.5 0.5 0.5 0.5 0.5 0.5 
##$TPOFFS= (0..7)
0 0 0 0 0 0 0 0 
##$TUNHIN= 0
##$TUNHOUT= 0
##$TUNXOUT= 0
##$USERA1= <user>
##$USERA2= <user>
##$USERA3= <user>
##$USERA4= <user>
##$USERA5= <user>
##$V9= 5
##$VALIST= <valist>
##$VCLIST= <CCCCCCCCCCCCCCC>
##$VD= 0
##$VDLIST= <DDDDDDDDDDDDDDD>
##$VPLIST= <PPPPPPPPPPPPPPP>
##$VTLIST= <TTTTTTTTTTTTTTT>
##$WBST= 1024
##$WBSW= 4
##$XGAIN= (0..3)
0 0 0 0 
##$XL= 0
##$YL= 0
##$YMAX_a= 140420
##$YMIN_a= -289241
##$ZGOPTNS= <>
##$ZL1= 120
##$ZL2= 120
##$ZL3= 120
##$ZL4= 120
##$ABSF1= 10
##$ABSF2= 0
##$ABSG= 5
##$ABSL= 3
##$ALPHA= 0
##$AQORDER= 0
##$ASSFAC= 0
##$ASSFACI= 0
##$ASSFACX= 0
##$ASSWID= 0
##$AUNMP= <proc_1d>
##$AZFE= 0.1
##$AZFW= 0.1
##$BCFW= 1
##$BC_mod= 2
##$BYTORDP= 1
##$COROFFS= 0
##$CY= 11.3945322036743
##$DATMOD= 1
##$DC= 2
##$DFILT= <>
##$DTYPP= 0
##$F1P= 18.9103706918063
##$F2P= -1.10871071338519
##$FCOR= 0.5
##$FTSIZE= 0
##$FT_mod= 4
##$GAMMA= 1
##$GB= 0.15
##$INTBC= 1
##$INTSCL= 1
##$ISEN= 128
##$LB= 0.24
##$LEV0= 0
##$LPBIN= 0
##$MAXI= 10000
##$MC2= 0
##$MEAN= 0
##$ME_mod= 0
##$MI= 1.114404
##$NCOEF= 0
##$NC_proc= 0
##$NLEV= 6
##$NOISF1= 3.799351
##$NOISF2= 2.8
##$NSP= 1
##$NTH_PI= 0
##$NZP= 0
##$OFFSET= 15.70392
##$PC= 1
##$PHC0= -8854.646
##$PHC1= 21.60026
##$PH_mod= 1
##$PKNL= yes
##$PPARMOD= 0
##$PSCAL= 0
##$PSIGN= 0
##$REVERSE= no
##$SF= 200.130013532006
##$SI= 16384
##$SIGF1= 3
##$SIGF2= 2
##$SINO= 400
##$SIOLD= 16384
##$SREGLST= <1H.CDCl3>
##$SSB= 0
##$STSI= 0
##$STSR= 0
##$SW_p= 3612.71676300578
##$SYMM= 0
##$S_DEV= 0
##$TDeff= 0
##$TDoff= 0
##$TI= <>
##$TILT= no
##$TM1= 0
##$TM2= 0
##$TOPLEV= 0
##$USERP1= <user>
##$USERP2= <user>
##$USERP3= <user>
##$USERP4= <user>
##$USERP5= <user>
##$WDW= 1
##$XDIM= 8192
##$YMAX_p= 0
##$YMIN_p= 0
$$ End of Bruker specific parameters
$$ ---------------------------------
##NTUPLES= NMR FID
##VAR_NAME=  TIME,          FID/REAL,        FID/IMAG
##SYMBOL=    X,             R,               I
##VAR_TYPE=  INDEPENDENT,   DEPENDENT,       DEPENDENT
##VAR_FORM=  AFFN,          ASDF,            ASDF
##VAR_DIM=   8192,          8192,            8192
##UNITS=     SECONDS,       ARBITRARY UNITS, ARBITRARY UNITS
##FACTOR=    0.0002004,     1,               1
##FIRST=     0,             0,               0
##LAST=      1.6414764,     0,               0
##MIN=       0,             -289241,         0
##MAX=       1.6414764,     140420,          0
$$ Real data points
##PAGE= N=1
##DATA TABLE= (X++(R..R)), XYDATA
0@%%%%%%Qj6J6j7K5l2M0n0N8p2Q8j05J27j51J77k08K41k77L18l67M20m78N45o15
30c25O94p82Q76r81J096j223J362j515J683j864K066k289K533k805L106l445L825
47B012m254M746n312N975o765P721q910J0436j2474J5356j9779K7510m4915J54852
61A26199k9037k78505N9727P6938J1855j779R7462K0529o1489m3310O6122L0726
73G5438q2803j09882L4325J01329L9177p557J5995n2600j08452l517J16526M8661
85F6640l5289k119J3974n1952m5646K1005J4051l8971L927J01189R3611m8534
97I1886j34027m0116O5768K823n9692L7891R5313k0652p0013M7122P3865o2454
109B7714j13824r759O5843M7827J8923Q565j8799n5302m4203L6958Q5158J2419
$$ y = [0, 0, 0, 0, 0, 0, 0, 8, -8, 8, -9, 16, -16, 24, -26, 32, -40, 48, -57, 70, -81, 96, -112, 129, -148, 170, -197, 223, -255, 290, -325, 369, -413, 463, -518, 578, -645, 717, -798, 885, -979, 1087, -1202, 1331, -1474, 1632, -1813, 2012, -2242, 2504, -2808, 3167, -3598, 4123, -4787, 5649, -6825, 8531, -11248, 16262, -28653, 126199, 97162, -181343, -121616, -44678, -32823, -34602, 62860, 83389, 21900, -21410, 44712, 75438, -7365, -117247, -82922, 18407, 57584, 50027, 66022, 13422, -95030, -98547, 17979, 66640, 31351, 29232, 43206, -8746, -54392, -33387, -19336, -58307, -54380, 46809, 140420, 91886, -42141, -82257, -16489, -13666, -73358, -35467, 59846, 39194, -30819, 16303, 90168, 27714, -86110, -95869, -30026, 17801, 36724, 45289, 26490, -28812, -73015, -36057, 49101, 61520]
121F1520o7394l5292J3533J035J9823N3955j3476q1661m637P5851J2950m4824
133h617O091K6494l9170n2294L4701Q5105J3602p9112m5803N5308M1004m8936
145a1627k0359O4612P013q2987j1880P9119J6761n2017Q47M2126r235m6937j3531
158c8095K6050K3404j613m248J7718N226l1408j3614K0499j1142l1112K6123M2954
171C0742j6232j1405M4618K788p8345m1362M3248M1402j595n55J7147l24l6851
184f724l2285K7733M9192j7421m7858J7182M0472k4474k9922L0274J7821l7249
196a3259j2245L8665K4441p185j8648k8286k5116L515K5877L1366K2636p502k3882
209A0377p595j0142k4400R322L4891j1279l2603K9482M7283j8423l5723P554L436
$$ y = [61520, -5874, -41166, -27633, -26598, -6775, 47180, 33704, -47957, -52594, 23257, 36207, -8617, -2526, 23968, -15202, -67496, -32795, 52310, 65912, -13200, -59003, -3695, 37309, -11627, -31986, 32626, 39639, -43348, -55228, 23891, 40652, -11365, -10518, 31608, 22373, -24564, -38095, -12045, 11359, 9746, 5498, 23216, 28442, -2966, -16580, 3919, -7223, -38335, -12212, 30742, 14510, 3105, 47723, 50511, -27834, -69196, -25948, 15454, 13859, 13304, 30451, 30127, -6724, -39009, -11276, 37916, 20495, -27363, -10181, 30291, 5817, -24105, 6169, 23990, -13259, -25504, 13161, 37602, 30417, 11769, -16517, -41633, -38118, -12241, 19125, 41761, 34259, 10377, 2782, -7360, -31760, -22438, 12453, 1174, -31429, -1947, 45336, 26913, -8810, -1256, 2180]
222B180k9007o197L3271K7177r501l2141r517K5855J0897k3767K340L5023q772
235A7841m4390J526K6672j1258j2523K4410J5397j2040k468N306r728j0471l094
248a4820k955L150O843L840J6265J9206j9202l3429M214J1829j3795N952L2800
261A9898m606l5356J824K7440K379j1444k190j924j239M94k178P779J2694j5080
275a509k3623J5916K8489o031r646O730j2304k2635R962K0162j134L29Q292o925
289F073q357O287p61q782K361J571m420J0504J0730r612l405Q688j2301j5941
303a7365J6747J7175j2873n326J2589n186j2585M750N344n80O865m65j1411J799
317e22P397r587l227J4249j406j1515J0342Q360j2869n514P543o745o588J4177
$$ y = [2180, -26827, -33024, 247, 27424, 17923, -14218, -23735, 2120, 13017, -10750, -8410, 26613, 17841, -26549, -25023, 1649, -9609, -22132, 2278, 17675, 5635, 3167, 8473, -1255, -11726, -14820, -17775, -14625, -7782, -3942, 12323, 31529, 12327, -21102, -16888, -5059, -18854, -12902, 19898, 15292, -20064, -18240, 9200, 11579, 135, -2055, -3979, -5218, -4724, -6902, 877, 13571, -1509, -25132, -9216, 19273, 13242, 3596, 10326, -1978, -24613, -14651, 5511, 4377, 4706, 12998, 6073, -2284, 4003, 3242, -5540, -3179, -1608, -6028, 4476, 15206, 5594, 2189, 10877, -1424, -17365, -618, 16557, 3684, -1642, 10947, 5761, -6824, -2074, 3270, 2690, 9555, 9090, -2321, -522, 6875, -2712, -5939, 8310, 6904, -4611, 5731, 14091, 1222, -4292, 3251, -3494, -10082, 4095]
331D095O672o214L250J83j4966l078J0790n88j610R617k910j1066O756P013j3090
346e146j889J1112m563o725J0741L266j0658M63L424q136K968J3299l878r038
360d760M927k596j0396O904J0518o471j326R444n485q617O955o13j0433N372R889
375C312o454K40J1121o246j1769N226K357p812O336R322p061k929Q408n306q872
390a0127Q499L124r002N582Q837q885l486R145m646j0061Q552O205o790M202Q053
405I202r484o122P353l005o428R666N092p385L684P344r523o014P747l671p937
420i481J0686Q662o355J113N213j0437p409Q362K3m196J0109N588r868L31N603
435G944j0119n427R739O10n255J0524O576j0808m124L400q926l523J2930M571
$$ y = [4095, 10767, 4553, 7803, 7986, -6980, -10058, 732, 144, -1466, 8151, 5241, -5825, 931, 7944, -5146, -7035, 4077, -486, -7211, 3530, 6796, -3862, -3399, 25, -8111, -5143, 8156, 4278, -4760, 167, -2429, -12825, -5921, 4597, -1874, -3200, 6244, 759, -7858, -903, -1516, -11949, -6577, 3312, -3142, -2902, 8219, 1973, -9796, -4570, -2213, -10025, -3689, 5633, -1428, -4357, 4051, -1255, -10127, -1628, 1496, -7506, -1924, 6913, -1972, -5458, 3687, -959, -11020, -2468, 3737, -3053, 1149, 9202, -282, -6404, 949, -2056, -8484, 1182, 6274, -1111, 2573, 9917, 394, -5620, 2127, -1544, -9481, 1205, 9867, 3512, 4625, 9838, -599, -8008, 354, 377, -3819, 6290, 11878, 2010, 2341, 7944, -2175, -7602, 2137, 2747, -2508, 8016, 14592, 3784, -340, 3060, -5866, -9389, 3541, 8112]
449H112l931O086R62j4359k529O912m973j775J2750K237p832N003K439j3897l703
464h498P338k822l54J3826K820r897L22j596j2153L20J2628r6j780R662k901j2032
480e213K170L657r664K39J1157j715k937J0079m60j3375r98K744o726M032J3767
495F757j136n975M009l798j1913M164P482n713J707J0802l757p345O605r29j1829
510a0869K218P069l924K901J1685l623j0042K313j869q728O009J1146l001j029
524B56O298o303p779N245R12p736O029Q700o117Q19R305o845j2469N035M259n131
540e522M710J0828l447n714J181n221m450P840K878m769O938N545j1515l356J0951
555F877m712j1921Q633R675o439j76Q229m757q574K22J73J763R108M5q235L949
$$ y = [8112, 4181, 10267, 11229, -3130, -5659, 1253, -3720, -5495, 7255, 9492, 1660, 6663, 9102, -4795, -8498, -1160, -3982, -4336, 9490, 12310, 2413, 2735, 1139, -11014, -10694, 1934, 1838, 58, 9720, 6819, -5213, -3043, 614, -9050, -8811, 2346, 631, -2306, 7773, 7313, -6062, -7060, -4316, -11042, -7010, 6757, 5621, -354, 3655, -143, -12056, -7892, -410, -6123, -4416, 6386, 2629, -4716, 1889, 960, -10869, -8651, -1582, -5506, -2605, 9080, 5457, -4585, -2272, -4141, -12869, -6860, 4286, 1285, 256, 6554, 251, -7528, -2283, -1371, -9107, -3078, 5622, -495, 324, 9629, 2784, -9685, -4650, -391, -5522, -812, 10016, 6569, 855, 2036, -3185, -7635, 205, 3083, -1686, 5252, 10797, -718, -4074, 6877, 2165, -9756, -1123, 8552, 2113, 1937, 10166, 5409, -3165, -2943, -2770, -1007, 8101, 8146, -89, 3860]
571C860K969j1425m26J3695l666j2717R481J0826r454n931P000k750o455N031
585C8M750k43J007m086p385O502N987r115r24J1929m916j0877R263O859j3180
600d391l815J2231N41p529L285J732n916J029L771j532J630N98o967J063R625
615E355n053r257P718M139j0494M540J4630r545j6055O540R486m065M02N464m831
630a026o030K160L099M118J136j0854m882J3879N349j1454J860Q223j3841r916
644a8179J9618J2950j4358q044P661p75n787M246N218j430m123l688O124J1470
658A0903o606j7687O101J5478r935q430J7923N636k0667m021J7116N47j2313P78
672e177Q084K816j276m691j535L594l966n750J1644J1709j3908j0843J4401M728
$$ y = [3860, 6829, -4596, -5022, 8673, 5007, -7710, 1771, 12597, 3143, -2788, 4212, 1462, -4993, 38, 4788, 4545, 5552, 1466, -5919, 583, 6570, -2545, -3469, 8460, 3544, -7333, 1930, 8789, -4391, -8206, 4025, 4566, -2963, 322, 2054, -3862, -2833, 938, -594, 1036, 1634, -5333, -4270, 5355, 302, -8955, -1237, 2902, -7592, -3052, 11578, 2033, -14022, -7482, 2004, -2061, -1659, 3805, -1026, -7056, -4896, -1797, 2321, 3457, -7397, -12279, 1600, 6949, -4505, -2645, 5578, -8263, -18179, 1439, 14389, 31, -8013, -352, -1127, -6914, -2668, 2550, 1120, -3003, -6691, -567, 10903, 4297, -13390, -7289, 8189, -1746, -10176, 7747, 13383, -7284, -11305, 5811, 6358, -5955, -5177, 2907, 5723, 4447, -244, -1779, 1815, -2151, -7901, 3743, 15452, 1544, -9299, 5102, 9830]
686I830j4904P48J1436p885p411J4930J0055j1461j0021J70J906K410L209L039
700F051M219l899j4591J110J7861l200j8263Q223J6206q944r691J2331K312j7523
714g798l879J3470M666k213J072R82k367o050p983M020J1726j882n753J1844L089
729A2944k1947o198K0832K415j8448N548J7810p714j3900P684R895r896j4839
742a5814K583J9645J2283j3551j4579Q942J813k0421L540L0671K470k6734j447
755a0599J7760m669j3924M402P218k862j522N979N170k305j2429o921J0546P312
769C156p476K849J2850r370j6508J0099R931j6250m281K3842R393j7053r721M015
783d524j583m067M822J2630Q257j2057j8592O369J9893o168j7879P904J1831q732
$$ y = [9830, -5074, -4326, 7110, -775, -8186, 6744, 16799, 5338, -4683, -4513, -2607, -197, 3012, 6051, 10270, 6371, -8220, -7110, 10751, 7551, -10712, -2489, 13717, 4773, -4918, 7413, 9725, -7798, -11677, 1793, 6459, 4246, 5318, 6300, 3933, -2117, -10100, -6080, 5646, 3764, -1989, 9855, 12944, -9003, -15201, 5631, 8046, -10402, -4854, 12956, 5242, -8658, -974, 8921, -975, -15814, -13231, 6414, 18697, 5146, -9433, -491, 1322, -19099, -15559, 15112, 17582, -9152, -10599, 7161, 2492, -11432, -7030, 188, -2674, -4196, 1783, 6953, 4648, -7781, -14702, -4156, 3156, -4320, -1471, 11379, 2009, -14499, -4400, 5531, -10719, -15000, 8842, 18235, 1182, -8539, -4524, -6107, -10174, -5352, 7278, 15535, 3478, -15114, -8745, 11148, 4980, -12899, -4995, 6836, -1896]
797a896M35J6940m959k3558m708J2832R589Q253M189j0913j6274m753P010J2765
811D952P068p723n317Q832j133j4152N457J2901j6103j5456K4773K4887j5394
824A3592k0974L753M836q350k732J2414J5223j379j7924n669J3609k475k0327
837a6403M178K7547L039j5646R42J355j5069n387J5548Q657k623J05j152m037
851A054r37j690l936q08j59M128J7036R785k0611k0487N959M274p601J3531K4868
866B4406o322k6778n510J1341L960l897k822K997P234J65o971M204N668j6080
880h405j4926J4616J9685l94l336k012j4582r818J0229Q796J074O610L651j2175
894i87q896M735K357l170q51J991Q959R521q320j5118M639O905j3352m418K2193
$$ y = [-1896, -1461, 15479, 10520, -13038, -17746, -4914, 4675, 12928, 17117, 6204, -10070, -14823, -7813, 4952, 12020, 4297, -1020, 7812, 6679, -7473, -2016, 10885, -5218, -20674, 4099, 28986, 13592, -7382, -3629, 1207, -7143, -9875, 2539, 17762, 16383, -1541, -7210, 6399, 3924, -16403, -12225, 15322, 18361, 2715, 3657, 5012, -10057, -15444, 104, 8761, 6138, 6243, 5091, 1054, 117, -1573, -5509, -6317, -6476, -2348, 14688, 24473, 3862, -16625, -10666, -6392, -13993, -462, 24406, 18084, -8694, -14204, -2863, 1097, -2800, -5622, -2625, 4609, 4774, -2197, 2007, 7675, -8405, -23331, -8715, 10970, 10576, 7240, 5228, -9354, -19172, -8943, -147, 927, 7537, 11188, -987, -9883, -5148, -2791, -5961, -6812, -4821, 4138, 13659, 5339, -9779, -5140, 1765, -11587, -16005, 6188]
909F188R688j5229o677Q432j147r676j905N968J0814O206q225r000J044k360p052
924a2931J0265J7045l251j1637k02j254m828O757M753r928l045J3157O964m153
938G712j569m895j1007l227O722J1208J2269k078j9397p763J3276N169r232L626
952H14Q586q535q801R221Q081l919o093m737K59J0719N965p723l798K859o839
967c941n717J0426P754l965o77J290n908r22N261n422o442R918O383p576k491
982b029N859j47l654P59k112j859L113k375k600J0384O642j3282q017Q688L567
997B937n251K396K047o913j441N099K077L083K440r118r300O801Q655k320j90
1012A002N38p584k573P680K769j436L278k425j0499J895J1023k263o939K228J442
$$ y = [6188, 15876, 647, -6030, 2402, 1255, -8421, -10326, -4358, 6456, 12662, 4437, -4563, -3519, -5879, -12931, -2666, 14379, 11128, -509, -711, -1965, -6793, -36, 4717, -5211, -8256, 4901, 11865, 7712, 6143, 1248, -9759, -12986, -6264, 4944, 17213, 15135, -4262, -12025, 1251, 6420, -2812, 814, 9400, 865, -7936, 1285, 9366, 5447, -646, -5383, -5124, 5595, 11560, 3837, 39, 2898, -3941, -9658, 768, 8522, 4557, 3880, 5170, -738, -1660, 3601, -1821, -8263, 1655, 8038, 462, -2029, 3830, 3683, 29, 788, -1324, -3183, -70, -2445, -5045, 5339, 11981, -1301, -9318, -630, 2937, -2314, 82, 2129, -4784, -6225, -1126, 951, 4034, 6474, -2644, -11944, -5143, 3512, 1192, 1002, 1540, -6044, -8617, -937, 1832, 396, 3674, 1249, -9250, -7355, 3668, 1405, -5534, -3306, -1864]
1027a864j350M881L502m804j579j391p949P61J2910K460p102K552L471p239k923
1042e664M389q56j476N066o01l679N313K083p741l38O494l225m241O137K029m490
1058h00J270N65n833J779Q352j595l112M616k333j0024J441P218m98J578M218
1073F842l924l468M843j172o933J986L422m458J882R484p0o475K13k940n598N107
1089a259O862k705o34L637n352n110N786L010m873J930L931m056j338M375l919
1104B85n479M269K336k455N328N607o430n876O33l284l432Q355N473k302J949
1119D977K409q327m824L656j662k636P067L981l273J309K808p813m694L607l01
1134c716r75P666L653o227j695P08n898j662Q058J768k448M227P41q008j425L089
$$ y = [-1864, -3214, 1667, 5169, 365, -1214, -2605, -10554, -9793, 3117, 5577, -1525, 1027, 4498, -2741, -5664, -1275, -2131, -3607, 1459, 858, -2821, 2492, 4575, -3166, -3504, 2990, -235, -4476, 1661, 3690, -800, 470, 1035, -4798, -3019, 5333, 3738, 626, 5242, 2909, -7115, -5674, 1544, 1046, 2624, 6842, 2918, -550, 4293, 3121, -3812, -1826, 1596, -2862, -980, 8504, 8434, 1959, 2172, -768, -6366, -1259, 5603, 2898, 2264, 5901, 549, -4561, 1225, 4235, -638, 1292, 5223, 1167, -171, 4204, 285, -5194, -925, 1411, -1044, 4284, 9891, 3461, -2415, -1782, -5066, -8498, -143, 5330, 3028, 4977, 7386, -941, -5765, -2109, -3771, -6407, 660, 4641, 1368, 2677, 5485, -2328, -7022, -3415, -3716, -4691, 2975, 6628, 401, -1294, -586, -6484, -8146, -88, 1680, -768, 3459, 4200, -3808, -5233, -2144]
1150b144m175k74Q255J752l104L559l96r412k216M346k180Q82R298K232n156J078
1166B345j354p922j35N006j850R91Q165L84o387J873J076p725j149O181p87RO729
1183E450J14o139P70O9n655J209O207j016r05N913r29p071Q70J840n944J034Q204
1200D021L35j229M251k177q416q20K385k568K905Q888q24k479L160l625j0184
1215f377L65L873j564M362R681L70n686p09n648q757L183P220N18M174P485m100
1231H390q539o66l011n775M250Q719J884K109L811p677r218M57j261k924R569
1246A18J0755j853l930J29q054r598L209N845J953O904N448m874n009j478q236
1261h671m960Q038N843N73O747M994r872r984M69k112j809Q670Q252m57k98n38
$$ y = [-2144, -6319, -6593, 1662, 3414, 310, 3869, 3473, -5939, -8155, -3809, -5989, -5107, 4191, 6423, 1267, 2345, 991, -6931, -7066, -2060, -3910, -2919, 5246, 5630, -757, 1116, 2192, -5533, -6682, -501, -1288, -1279, 5450, 5564, -575, 195, 264, -5391, -4182, 2025, 1009, 104, 6017, 5088, -1983, -1113, 727, -5217, -4183, 4021, 4356, 3127, 7378, 5201, -3215, -4035, -1650, -4218, -1313, 7575, 6751, 4272, 7432, 3807, -6377, -6012, -2139, -3703, 659, 10340, 10710, 5024, 4315, -1333, -10090, -6907, 313, 831, 5005, 12490, 8390, -149, -815, -3826, -9601, -5351, 3368, 5252, 7361, 11172, 3495, -5723, -5266, -6527, -9451, 118, 10873, 9020, 5090, 5219, -2835, -12433, -9224, -3379, -1426, 5478, 10926, 6052, 1043, -435, -8671, -13631, -5593, 250, 823, 7570, 12564, 2692, -7292, -6823, -8935, -10744, -2074, 6178, 5721, 5423, 4885]
1277D885q803m937K316l94M56J0107M528n760j098O16q904m501P311L019k29N771
1293D383L453o776l655k3n514r84Q872L675r72K683j373p734p53L825l456l09
1309d658P195Q79l465N009J089r855l180N782o30l89P580J608n883j511J067k758
1325b120J216K439l495O58O718j507m773M370J174r842Q6R562j085m419M499K279
1341E760n089j127J416j599M17K205j757K022M497m624o335N884L534q021j329
1356d146Q732q64n248N000K317o475l319L083L38J651L183k565j924K851k861
1371b47m073N384K951p351r8Q087j436n667M110M34p207N64O703q83j849K830
1387B252k104l192K078K98k534K889K070m495R37N067m476m428N814J002o814
$$ y = [4885, -3918, -8855, -6539, -6933, -6477, 3630, 8158, 2398, 1300, 1916, -6988, -11489, -4178, -1159, -1388, 4383, 7836, 1060, -2595, -2618, -8132, -9116, -244, 3431, 2459, 5142, 3769, -3965, -4718, -893, -4349, -4658, 2537, 3416, -49, 4960, 6049, -3806, -6986, -1204, -1834, -2223, 5357, 6965, 1082, -429, 638, -2120, -904, 1535, -1960, -1302, 5416, 3909, -864, 3506, 4680, -5162, -5076, 4486, 3401, -1018, 3481, 5760, 671, -456, 960, -639, -222, 1983, 226, 2248, 6745, 2121, -4214, 1670, 5204, -2817, -4146, 4586, 3722, -1526, 3474, 5791, -684, -4003, -920, -582, 1069, 4252, 1687, -237, 2614, -247, -4320, 1064, 4015, -3336, -3434, 4653, 3217, -2450, 1660, 2094, -5113, -4549, 2154, 1271, -578, 2252, 148, -3044, -966, -668, -3202, -313, 1757, -2738, -1801, 3266, -1210, -5638, 176, 1178, -5636]
1402e636K629P003m189m345N148P28n314M10K658l33J417O66l731R23K848m513
1418c631j388Q650m56r417K392Q314n475m975P011K525p217m74M974L90o22j081
1434d80k542K238K611l834q34O743j287r439M266Q857m921o355O499K466o922
1449b934N59N880q59k591J50j030J157L063l183j907N086n68o775M111O632n621
1465A170m526O502Q10o931K300N879l539k153L004r89j934K469o03j902K738M50
1481B745l593K299L455n572k213O324r94n766M754M855o267l131N530j067m251
1496b892L108L273k320M1M47l082M25J729l077R13O614l499o646N327M670p635
1512b604k916P686r10n981M288N340l226l810q31p11J834L540k125J8L147m619
$$ y = [-5636, -3007, 3996, -193, -4538, 610, 1338, -3976, -3566, -908, -1241, 176, 842, -2889, -1966, 882, -3631, -5019, 3631, 3175, -6242, -3850, 4464, -1011, -5986, 1025, 3550, -3667, -4141, 833, 1223, 601, -480, -3022, -784, 1827, -2007, -2841, 3902, 2615, -6824, -2558, 6299, 1378, -4977, 1522, 3988, -2934, -2375, 3505, 2646, 55, 205, -825, 332, 3395, 212, -1695, 3391, 2823, -3952, 159, 6791, 1170, -3356, 3146, 3956, -2975, -675, 5204, 1665, -488, 2516, 1527, -407, 2062, 1459, -443, 2295, 2745, -848, 1451, 4906, -666, -2879, 3445, 2451, -3315, 1439, 6294, 27, -3104, 2426, 1359, -2892, 216, 3489, 1169, 1210, 1657, -1425, -1000, 729, -2348, -1435, 5179, 1680, -4966, 361, 5031, -2604, -5520, 2166, 1256, -4725, -437, 4903, 1677, -2133, -2964, -3675, -1841, 1699, -426, -408, 2739, -1880]
1528a880n312O741N054p770l019P515Q4n122L845K896o274k679L369J875J224
1543E47K178l412k168J942r85l012N158K582p023j77Q078j394o566L403K332n461
1559c978L78N331p39k330K298n04k393K725j22l874K297L425l743K07N077l723
1575C32m522N443K630o441N45N615l482k518O271J214n271j687J060m93K821L053
1591D570k477m79K368m806l676P101K048p703O68Q541j638l895K908j288o958
1606d716K17M779J792L626K043n958l923K034j737j633N491K686m911J501N299
1621F590m083n955K926o13m188M387P748r63l045j643m644k303L690R98M33N674
1637E009J375p258j167L094m612m300O465M239j863K002J384n703k815K323l122
$$ y = [-1880, -7192, -451, 4603, -3167, -6186, 1329, 1413, -3709, 136, 3032, -3242, -5921, -2552, -677, 547, 2725, -687, -2855, -913, -1898, -4910, 248, 2830, -4193, -4370, 3708, 2314, -4252, -849, 1483, -3978, -3600, 1731, 992, -1338, 960, 456, -1937, 788, 666, -3208, -911, 2514, -1229, -1022, 4055, 332, -4190, 1253, 3883, -2558, -2013, 3602, 120, -2398, 3873, 5087, -184, -1871, -811, -1304, 1517, 4570, 2093, 1614, 3982, -824, -4500, 2601, 4649, -3054, -2386, 6155, 4517, 622, 3530, 2242, -4716, -4499, 280, 2072, 5698, 7741, 1783, -2140, -106, -1843, -3476, 2015, 4701, -210, 1291, 6590, 2507, -3448, -522, -1135, -5323, -936, 6812, 5849, 2804, 1161, -3483, -5786, -2096, -1098, -665, 5009, 6384, -874, -2041, 1053, -3559, -7859, -1394, 2845, 982, 2984, 4368, -1335, -4150, -1827, -4949]
1652d949j76N970K411l224K288J096o573l270K312N6J768P203N1p020k22K023
1668b56m789K02O272o07m398L128K529j273J92j867n630l6P446N03o51L844k279
1685B330q459P85N629o71o06L186k556k907M826J792m619n74J767l708L74P124
1701C713Q92l604L30j770l691L163L607l837o53N854p94m726L230J607n318o20
1717b617L909m58q2L574k020k979L167j62o021J314N432j275p69M331j774o139
1733b569Q61J727j624L535L830m172k846M225j46m164J456Q87l828J765N534m86
1749C985j755R94n007n059O046N057k802j98K320l780l062L794J082k934J886
1764E67O18l025K384L980l704m735K739J30k057M190L336m322j794J605k999q67
$$ y = [-4949, -5125, 845, 3256, 32, 2320, 3416, -3157, -6427, -4115, -4059, -2291, 4912, 4963, -2057, -2279, -256, -5045, -4843, 1429, 822, -3576, -448, 2081, 808, 1000, -867, -6497, -6533, 913, 1416, 765, 4609, 2330, -6129, -5344, 285, -386, -992, 2194, -362, -3269, 1557, 3349, -1270, -1844, -77, -3785, -3411, 3713, 4605, 1001, 1331, -439, -4130, -967, 2640, -1197, -1850, 4004, 3210, -1516, 1714, 3321, -1997, -2617, 1292, 834, 752, 4326, 2306, -673, 2494, 2332, -3689, -2375, 3057, 1782, 1013, 5344, 3570, -2569, -1708, 19, -1605, 1930, 5760, 1588, -1258, 2967, 2821, -1343, 113, 1000, -2828, -1063, 4471, 3985, 2230, 3224, -1783, -6842, -796, 4261, 1459, 1261, 3581, -199, -3261, 533, 1615, -1319, 567, 1185, -1840, 544, 4524, 820, -3915, -1176, -1046, -3103, 1087, 4423, 101, -1693, -88, -3087, -3954]
1780c954N381K36l949K127J987l930j126L576j151j783K987J93l400K268J631
1795A093m273n7M929k285l093L983J030l597P46J535l290O35M343j174k244K216
1811D97q96m685K964M776k915r75K821k825k608M035J357l244J482J845l458K42
1827a587M892j996l934K070O81k848L628L519l678k011K231k095j903M931J596
1842C496l888N70K279l256n42M093j447l235K903K184l247J237K970l921j911
1857a715L194o28j735L599J669m752N41K155l087q91M588k11l006K442O58l794
1873i73L93L398k562j734L501k58k419K570J011m398j08K952k509j00M619o06
1889B777m680J896J361l578L44M017j630j549L018j191l142K548Q52m303J080
$$ y = [-3954, 1427, 1663, -2286, -159, 1828, -2102, -3228, 348, -803, -2586, 401, 594, -2806, -538, 1093, -3180, -3237, 1692, -593, -3686, 297, 1327, -2270, -1524, 11, -3279, -2644, 1699, 525, -1719, 497, -399, -5084, -2120, 2656, -259, -1234, 1587, -1238, -3846, 189, 1546, -1698, -216, 1629, -1829, -1587, 3305, 1309, -2625, -555, 126, -2722, 906, 4425, 747, -1264, 967, -1128, -3031, 1900, 3496, -392, 178, 2457, -799, -1341, 2752, 1305, -1930, 973, 3157, -90, 1147, 4117, 196, -1715, 1479, 851, -884, 2715, 4384, -368, 173, 2328, -759, -1650, 2938, 2727, -279, 2163, 2821, -973, -580, 2818, 256, -1478, 2023, 1765, -654, 1916, 2927, -1471, -1579, 1373, -1136, -1236, 3383, 2777, -1903, -7, 1354, -2224, -1880, 2137, 507, -1042, 1976, 785, -2357, 191, 1043, -3260, -2180]
1904b180M237j542k384L634q35m383J247J956k270J930L202k597k433K952j287
1919g53m147L140L623k938l80K946j738k229J893j142k597L671K342k762O74L304
1935B907l955m259L393J967j697K185K256l525j696K023j285j708L752J050k475
1950a067J922J893m120j158K776k522q13N380J578m008N08J463m286j560M390
1965C76J133o86K225l09l638O81J183m164J549N365m28l494K929L80n563m56L860
1982I43n30R36L097j546k822J512j245m041K278M755j081n97L176k378n116R87
1998a672J349j416L559L338l091j513K716l145m715L099L581j482J294L185k867
2013B220l029P9j939j311N036K841k618R44N87n008k222M023J30j675L533K919
$$ y = [-2180, 2057, 515, -1869, 1765, 930, -3453, -2206, -250, -2520, -590, 2612, 15, -2418, 534, -753, -4900, -1760, 1863, -1075, -1455, 1491, -247, -2476, -583, -1725, -4322, -651, 1691, -1071, -397, 2907, -1048, -5307, -1914, 53, -1644, 541, 2797, -728, -2424, -401, -1686, -3394, 358, 1408, -1067, 855, 2748, -1372, -2530, 246, -2276, -3089, 2291, 3869, -139, 369, 1832, -2454, -4014, 376, 1509, 823, 3048, 2739, -899, -218, 965, -3199, -1650, 3715, 3287, -207, 2722, 3102, -2461, -2917, 943, 413, 1349, 4446, 2900, 78, 1590, 345, -3696, -1418, 3337, 2256, 1659, 4835, 2457, -2659, -1672, -323, -1739, 1820, 5158, 2067, 554, 3270, 125, -4590, -1491, 2090, 608, 1902, 5087, 2220, -809, -730, -2669, -3980, 1056, 3897, 1279, 2223, 2810, -2198, -4420, -397, -267, -1942, 1591, 4510]
2029D510l911j891J608k842k683M037K082l25K327n68m326r20J121k856J567O393
2045C323j39m694J521J433n228j375M514N06n51K132J02k587M4n91l218K130M171
2062A493j000j072L184j780n344J165K837j395J468M089k507l573J612o91k491
2077d005K686L592j752j26J991k674k524J613k57j026L902K232l196j47K155l852
2093a388l647M459L168k227J842K533l889l477R23r9O15L840P62j471J130j216
2109A858m963K52M333j628j170N533K346n558j293J460k901k270L914L159M32
2124C504J389k048l801J47j15k780L197O487k234l907K735j58n500k08M310n75
2140D43r76L441Q69k720o88j789k603K020L274m24J422K868l914n043K186J329
$$ y = [4510, 599, -1292, 316, -2526, -5209, -1172, 910, 585, 2912, 2344, -1982, -2902, -1781, -4637, -3070, 3323, 3184, -1510, 11, 1444, -3784, -5159, -645, -139, -690, 1442, 1544, -1043, -999, -1590, -4808, -2678, 1493, 493, -579, 2605, 825, -4519, -3354, -517, -1912, -444, 3645, 1138, -2435, -823, -1514, -4005, -1319, 2273, 521, 395, 2386, -288, -2812, -1199, -1456, -2482, 1420, 3652, 456, 309, 2464, -1388, -5035, -576, 2592, 365, 2207, 4740, 851, -2626, -1703, -1802, -1187, 2653, 3415, 1944, 3074, 1858, -3105, -2853, 1480, -148, -1318, 4215, 6561, 1003, -290, 1170, -1731, -4001, -87, 3072, 3504, 4893, 2845, -956, -809, -924, -3704, -507, 5980, 3746, -161, 2574, 2416, -3084, -3292, 1018, 443, -533, 2908, 3777, 1057, 369, -1420, -4023, -2003, 1271, 847, 2269, 5137, 1223, -3820, -1634, -305]
2156c05l016J750M639j464k006K117q55m106O11J299j260K016L423j848j411J053
2172F37k545k607K766J580j781J900L092l534k486K960j139l030K805L233k523
2187f72p28K287j060j579Q19o26j356K865N28j678J720J772m299k186M813n1l548
2204b979K672K671l243j231L488q03k142O81k71m46K529J235k452J022R57l940
2220b252j262N183N49l680J879K897l654j028K946p96j939J516R63j176J170Q96
2236B212k697L31J662k194o06L520O33l160J444J663l423j142L920n40j995K298
2252A926Q42l186O05J810j617r67K340j344r95L217k26k976J000O01l110J175
2268i05M278j065l087J798M22l572R76L312j445j587J924j16j504J559l99k602
$$ y = [-305, -3321, -1571, 3068, 1604, -402, 1715, 860, -3246, -2635, -1336, -2596, -580, 2843, 995, -416, 637, -1908, -4515, -1749, -169, -1950, -50, 3042, -492, -2978, -18, -1157, -4187, -1382, 1851, -672, -1400, 887, -173, -1752, -933, -1559, -2915, -50, 478, -1200, 520, 2292, -2007, -4193, 620, 569, -2979, -307, 2364, -879, -2110, 1378, 575, -1567, -886, -1157, -1603, 926, 2161, -291, 731, 1688, -2252, -3514, 1669, 2218, -1462, 417, 3314, -340, -1368, 1578, 782, -1157, 359, 1322, 146, 1316, 2212, -485, -154, 1508, -686, -1292, 2228, 2861, -299, 1145, 2808, -615, -1757, 2163, 1623, -372, 1926, 2768, -418, 187, 1997, 380, -587, 1753, 409, -586, 2631, 2405, -571, 429, 1030, -2080, -905, 3373, 2308, -779, 1019, 1441, -2131, -1155, 2157, 712, -875, 1049, 933, -571, 988, 589, -2013]
2284b013J199J961k520J120L479k549l697K565J097l486J162L566r79k389K090
2299F06q67k247J208Q28j561J803K296l097n87K696k081k923K863J659k836J379
2315h61L210j975k722J318l54j998K824J806j564L6J476k814q48K765j044k361
2331c106L073J629k436Q94K230k778l358K278J401j155L023J725l384r78J228
2346B86k203l23L173j32j663K255J776l080l77J509k956j248L694K025k146J709
2362B299P25l746j299K352r09o9K625M91j619J048K79l246m27K525j378m88M044
2379C207Q52l739L79Q93l380n39K885K67m32L114L86l420m79J54k662J118L601
2396B205q6j594K323q24l327N36J424l000q3M078J78q54J665j308m236k61K001
$$ y = [-2013, -814, 1147, -1373, -253, 3226, 677, -3020, -455, 642, -2844, -1682, 1884, 905, -1484, 606, -261, -2508, -1300, -472, -2033, -230, 2066, -1031, -1618, 1078, -1003, -3926, -1063, 596, -2240, -861, 2349, 374, -2348, -1030, -1384, -3382, -558, 1248, -316, -280, 1196, -1618, -2466, 299, -745, -3106, -33, 1596, -840, 54, 2284, -494, -3852, -1574, -173, -1328, 1695, 3420, 36, -942, 286, -1917, -2240, 933, 801, -862, 1393, 3169, 89, -288, 1221, -1735, -2983, 711, 2736, 590, 2299, 3024, -722, -2021, 331, -578, -647, 1978, 2469, 850, 1898, 2177, -1069, -1496, 1029, -349, -837, 3207, 4059, 320, 699, 1592, -1788, -2327, 558, 825, 393, 3507, 3893, 473, -6, 148, -2514, -1396, 2205, 2119, 525, 2848, 2024, -1303, -767, 657, -2343, -2426, 1652, 1830, 976, 2641, 1333, -2903, -3164, -1163]
2413a163K7J216L426j977l119J585j84k748J489K082j837K77L604j012l023M83
2429h74j032k431K311L910o50q93J035j905k926J774Q48j975J656K402j235n99
2445e84K610k294l265J596J064j477J859K519j819j390J469r00k366K030J082
2460A34k044J251K780k015j725J820n78k213K846J272k927Q00K351j434j304K309
2476A323j279k315K080J754j063M90J490l503j447K973J93j709J942J089k215
2491a97N90K707j516k238O91r83j413L676K812k445p86J422l327j306L566L18
2507A571k409J313K005k216O32J806k526k237K461O56j055J842J463l478j284
2522a456K033r10m27L063J32k882Q49J291l441l94K621j24n70K685K59l351L93
$$ y = [-1163, -1136, 80, 3506, 1529, -1590, -5, -189, -2937, -1448, 634, -1203, -926, 2678, 1666, -1357, -874, -1906, -4337, -2026, 1884, 1234, 341, 1376, -529, -3455, -1681, -833, -2808, -1152, 1250, 15, -584, 2026, -268, -3533, -1937, -873, -2350, -491, 2028, 209, -1181, 288, -612, -2978, -948, 134, -1910, -659, 2121, 106, -1619, 201, -377, -2590, 256, 1528, -1399, -599, 1752, 318, -986, 1323, 44, -2271, -191, 1563, 500, 990, 2480, -1023, -2470, 503, 696, -1013, 929, 2018, -197, 393, 3100, 1584, -654, 37, -946, -2359, 1317, 4129, 1684, 898, 2320, -1007, -2313, 1253, 1571, -838, 475, 2480, 264, 896, 2702, 176, -2061, 400, 1056, 1, 1843, 3306, -172, -1456, 577, -333, -760, 2303, 2435, -447, 402, 1693, -1748, -2142, 479, 355, -215, 2470, 2729, -622, -229]
2539b29M94k525qL244o44j354K668N73l067j62O67j898M50L282o83j877J599j161
2557f31k656J889L470j764j122J462j521k259J882J111k008J652J868j645K07
2572f5J906k495l634J667J446j001K916K464k588k327J034j179j428L146J083
2587I45k531J074J806j997p37J797o46k167K530J860k574K18J077k490o71K876
2603C70K0m23K333N22l622n64J565k495k06M098P62j356J346M49l659l47J307
2620A00j104m99K823L93j452K259K66l827l93K615r57r07L174m48k722O15J265
2637A201j625J118K350j781j185J917j439k513J996J572k639O57L818o49k291
2652E07J093q12l218J041J964q39J571J792k215j413J637r60k848K046J972k340
$$ y = [-229, 265, -2260, -2268, 976, 332, -1022, 1646, 2219, -848, -1010, -343, -2241, -1791, 1491, 808, -1069, 530, -631, -3287, -1398, 2072, 308, -814, 648, -873, -3132, -1250, -139, -2147, -495, 1373, -272, -65, 1841, -654, -4288, -2621, -1175, -2176, 740, 3204, 616, -1711, -677, -1856, -3284, -138, 945, -1586, -512, 1294, -703, -1440, 357, -289, -2456, 74, 1934, -640, -422, 655, -1835, -2506, 370, 390, -33, 2300, 2822, -800, -1364, 201, -2294, -2500, 1598, 2360, 1004, 2350, 2799, -860, -1207, 100, -1004, -1503, 1320, 1713, 261, 2520, 2786, -1041, -1434, 1181, 224, -683, 2491, 2043, -679, -64, 1201, -424, 694, 3044, 1263, 78, 1995, 556, -1957, 39, 1611, -1028, -371, 3447, 2798, 507, 1600, 788, -2430, -1389, 575, -264, 1307, 3099, 884, -529, 1108, 148, -2700, -654, 1318, -1022]
2668a022p8K787m55k182J470k79j965J435J313j724k18J960j895j860K482J417
2684A186j483J214O86k791j068J477j024j308L152J036j849J190J810l140j599
2699b511J727j573j466L172K243j459J64J298l287q68J935n15p00K223O15l034
2715b036J220J768k694l12K860k82k148J514J126k562l44J542p21N47K431n14
2731A395j207J657j375m012J381L027j317j71L415k34k817K37P40j937L09J010
2747A01n00M52K980j362j814J422j14k686Q31K711j153j157K069q73k128K196
2763I75J513k089k2J932j989j536K484j63j679J419J278j621M88J407k291j587
2779a481K527n27j638K174J510l032l37K382r09r99K229k67k901M82J199j911
$$ y = [-1022, -1100, 1687, 1232, -950, 520, 241, -1724, -289, 1024, -700, -918, 1042, -853, -2713, -231, 1186, -297, 917, 1603, -1188, -2256, -779, -1803, -3111, 41, 1077, -772, 418, 2228, -912, -2511, -784, -2357, -3823, -651, 1592, 133, 297, 1595, -1692, -2560, -625, -1140, -1840, 383, 998, -2036, -816, 952, -1742, -2054, 806, 524, -1624, -110, 1016, -1546, -1890, -348, -1069, -522, 1909, 1395, 188, 1845, 470, -3542, -2161, 866, -451, -622, 2793, 2559, -258, -21, 719, -1218, -909, 101, -399, 53, 3033, 1671, -143, 1279, 1165, -1521, -690, 2021, 868, -289, 1780, 907, -1221, 975, 2488, 399, 377, 2309, 320, -1216, 1268, 1105, -574, 845, 2123, 502, 990, 2397, 106, -1481, 1046, 519, -1119, 1055, 2565, -467, -804, 1578, 669, -330, 1899, 1632, -1269, -787, 412, -1499]
2795a499J84K544L91j193J522j116k990J302M07k410J379L948o17k282J945m98
2811A017l859l15K030QJ247K339j498j249L39k063k676L563K798j975m7K412j853
2828B18l665J624N53r97J875K330q42k21j17k847k636K005J631N9L104J923l379
2845F18k097N28j972j246L519K147j216J255J604l107k326R81q51o66L120J835
2861B126r81O90J94l980j268K591J17J54K994P86l575k41O82k512j33L652P52
2878B048j348J715K74k858p31L94o87J56L034R1r85K053j189m296O51L017j587
2895b48l2K983L48l379O52Q26j692K40J644j171rK117j230j923J830J75k881J252
2913d98K836j673j291J915r90k317J748J749j270M5J343j652j412K233m97j364
$$ y = [-1499, -1315, 1229, 1620, 427, 1949, 833, -2157, -855, -448, -2858, -1479, 2469, 1852, -430, 1515, 1017, -2842, -3157, -1127, -1119, 128, 2467, 969, -280, 59, -2004, -4680, -1117, 1681, -294, -341, 2071, 218, -3447, -1823, -1270, -2267, -392, 1938, 1096, 875, 758, -2089, -4725, -2720, -1089, -1030, 2074, 3997, 618, -1479, -951, -2923, -4169, -650, 1497, 281, 1536, 3140, 33, -2293, -1312, -2163, -2829, 291, 2126, 1145, 1835, 2029, -1951, -3219, -628, -511, -357, 2637, 3423, -152, -393, 289, -2223, -2356, 1296, 2048, 700, 2415, 2689, -169, -900, -506, -1193, -1037, 1997, 2088, 1103, 3156, 1967, -2329, -1678, 1339, -248, -280, 2703, 3051, -328, 324, 1150, -542, -302, 1342, 171, 162, 2279, 1049, -874, 956, 1131, -1750, -498, 2338, 665, -626, 1289, 299, -2018, -270, 1479, 209, 254, 1597, -55, -1467, 766, 269, -1095]
2929a095J351N95k533Q39K141j538j131K145l46k488J405J374j886n1K173j713
2945g58r75K321J09k061R04M14k071L70K445r91o60J980j072k695J974J499k271
2962a538K77K159j168j439J990M82k502O27Q36j075L05K314j292j328J838r10
2978d24k291K176K046k151l60K413j353k410J933J155j687R18J313j978K27J411
2994I38o47j598K011n28j733K257J779k358o22J771j278j718K002J554j843L73
3010C60J426j939n38K247o90j349J732L5k032J285J676k001q26K254q31j793K253
3027A269J399k598k6J631j832m78K370k40k309J673M04j837P00J590j604r54K015
3044A173r89j129J927O68k236j72K145j716r39K545r9k271J074P97j523N51J752
$$ y = [-1095, 256, 851, -1682, -843, 1298, -240, -1371, 774, 428, -2060, -655, 719, -1167, -1218, 955, -758, -1733, 588, 697, -1364, -460, -46, -2117, -1747, 698, -293, -953, 1027, -45, -2740, -766, 733, -1538, -1261, 898, -270, -1709, 281, 763, -1739, -1112, -276, -1351, -1046, 1268, -24, -1352, 486, -424, -2715, -539, 1507, -644, -1004, 1409, 56, -2354, -421, 734, -953, -35, 1278, -700, -473, 938, 291, -1307, 704, 176, -1557, 700, 2479, 121, -501, 1270, -8, -1726, 276, 1830, -13, 360, 1786, -153, -691, 1556, 866, -483, 1249, 1284, -748, 537, 2213, 212, -614, 1640, 809, -984, 1269, 2668, 70, 44, 1675, -157, -635, 1735, 1495, -814, 859, 1263, -574, 126, 1716, 112, -842, 1173, 184, -945, 982, 1650, -586, -758, 1387, -329, -1268, 1277, 1178, -1093, -19, 778, -745, -194, 1558]
3061A558k234m74J691o03j544J994R76k471J30J538j303p40K074l19k146J386
3077d87O25j884Q03K158j770j299J997j73j426J150J001k147l52K022q92n40K348
3094A134r82k388J267J455j706J93K034j532j466K195o5j883J709J051k686K69
3110a401K204p88j502K071K4k308J196J818k058N72J789j431j714J912N88j908
3126i36J231J579j799p12J365r23r47K391j08k033J008J590j863k04K125j035
3142G29j786J578J018j797J406R14k154q06K376o88j237K341j2l090R24J795j400
3159A11m92K343j218j425K003K96k113N69J286j946m64K418k2j631J078K50k106
3176a063Q80J514j617o01K524j186j812J852N03k143M12J619j093m34K073j422
$$ y = [1558, -676, -1150, 541, -62, -1606, 388, 1364, -1107, -977, 561, -742, -1482, 592, 273, -1873, -487, 138, -1746, -943, 1215, -555, -1854, 143, -30, -1456, -306, 695, -1452, -1804, 218, -674, -1214, 1134, 152, -2236, -969, 486, -1220, -1027, 1007, -525, -1991, 204, 139, -1744, -35, 1016, -1670, -1401, 803, 15, -1487, 584, 608, -1700, -504, 1314, -744, -172, 1617, 186, -1528, 384, 972, -936, 295, 1874, 75, -637, 728, -195, -1142, 1249, 1141, -892, 116, 1706, -157, -361, 1764, 729, -1057, 521, 1539, -258, 1148, 2062, -92, -898, 1478, 790, -447, 1894, 1882, -1208, -284, 1511, 111, -381, 1962, 744, -681, 1322, 1618, -495, 74, 1360, -586, -1050, 1368, 1346, -285, 793, 1043, -1063, -183, 1331, -286, -887, 1637, 451, -1361, 491, 994, -1149, -737, 882, -211, -645, 1428, 6]
3192Fj691J311J146k350O46K034j400q08J679l06j980J075P07j540J302J303j813
3209f79j317K144M7k149J365R20j986J55K173r85o39J180p03k196K158J307j971
3226a176M04J617j779r82K233j41j997J367N13j631Q17K562j218j923J363m50
3242d21j466K111J576j880l31J602j693j132K387m19j706J233J577j289R6J328
3258A573j227k022J763J57p00J787R50k218m44J664j554j358K467Q38j568J058
3274A166J034j921q46J456q90j099K766J96k095R89J586k368o80J334o06j028
3290a006K864M98j810J68K65k127l72L127p76j019J292L39j903O35R13j598j003
3307a513J807q8n36K090j54k125l69J070j381M05K483j196j895J413P76k052Q63
$$ y = [6, -1685, -374, 772, -1578, -932, 1102, -298, -1106, 573, 267, -1713, -638, 69, -1471, -169, 1134, -679, -1996, 148, 195, -1954, -589, 331, -1655, -1500, 673, -312, -951, 229, -474, -2670, -512, 795, -1176, -772, 845, -934, -1916, 317, 176, -1821, -454, 59, -1572, -755, 1807, 589, -1334, 29, -421, -1887, 224, 1800, -80, -411, 1191, -502, -1634, 753, 334, -1372, -139, 1438, 149, 245, 1573, 346, -1676, 87, 244, -456, 1331, 2281, 63, -381, 1283, -271, -1629, 838, 1676, 108, 1166, 2200, 279, -567, 889, -1, -1100, 1666, 1862, -233, 756, 2342, -26, -706, 628, 22, -1006, 1858, 2356, 546, 714, 979, -1148, -1520, 1607, 831, -188, 1104, 1443, -460, 175, 1088, -510, -1513, 294, 206, -330, 1760, 1606, -519, -888, 182, -1199, -794, 1689, 493, -1402, 11, 787, -1265, -402]
3324d02J268j983p01K062k67n49J111l1k231O72J429j156k81J983p16j482J071
3341b03J040k020k04J619j562m80K406l76j410J365O66k555K08J628j187R6K335
3358A366m67k079O83K89k042R17K030r63j69K130j099j849J116J90j956L2K644
3375G73m22k73J375r29k218L98Q11l08J452J707j339j871J625n92j823J607J206
3392A179j561L07K082m38j634N57p43j480J625K000r82N15J546k887j772J879
3408A93L53j574J775J876j745m35Q67r37j588J326K35p12J508J104j819l39J374
3425A462j714j477K503L92j452Q22J295j967o97J356j81j094J824j63j467L20
3441b38J191k320L10J883j014j421K553P08k026j13O98j758l92K175l1o56J634
$$ y = [-402, 866, -1117, -1818, 244, -23, -572, 539, 508, -1723, -1051, 378, -778, -1059, 924, 208, -1274, -203, 837, -1183, -1387, 232, -1330, -1810, 596, 220, -1190, 175, 841, -1714, -1506, 122, -1065, -969, 1366, 899, -1180, -497, -208, -2250, -1333, 697, -266, -435, 1695, 596, -1253, -137, 53, -1903, -1871, 773, 351, 78, 1453, 524, -1694, -1296, -485, -793, 659, 2366, 1027, -844, 781, 189, -1634, -27, 1179, -382, -75, 2007, 1569, -65, 492, -251, -1731, -106, 1894, 912, 1427, 2973, 86, -1686, 193, 546, -1028, 747, 2623, 878, 443, 1310, 373, -1215, 111, 346, -366, 1142, 2246, 427, 88, 1462, -252, -1729, 774, 1166, -286, 536, 1831, -136, -833, 523, 342, -752, 1072, 909, -558, -238, 953, -1367, -1057, 826, -188, -1609, 944, 1652, -374, -487, 211, -1547, -1939, 236, 205, -451, 1183]
3458A183j71k408L60J339j246p26K050n46j031J352N01k082O55Q17j546J31K251
3475H83p15j747J629J02k024P91J552r00o83J307m69j110P80N05j453J168J152
3492G68j540J10K063j065k249J150Q85j399P17K457j048q07P71q40j707J389N17
3509A72j162J033J309j389r58K702q62j938J037J501j673j35K081j183j494J268
3525C09J00r09J624Q22j661l06J022j979r0K164K76j418J520P66j923j82R81j342
3543b26j320K198L47j062J351J275k339l44R42p61q30J543P7j519R23J044j496
3560a97K26J802j464j575J620k26j721J435J526j933j10J578o46j064J275q5j742
3577a301O54O49j137Q04K125j890j079J640L54k421J039J402j853q01J603K47
$$ y = [1183, 1012, -1396, -1036, 303, -943, -1669, 381, -165, -1196, 156, 657, -1425, -770, 47, -1499, -1368, 883, 168, -1579, 50, 152, -1872, -1081, 471, -429, -1112, 195, -274, -1384, -604, -99, -1552, -384, 768, -772, -662, 1401, 336, -1913, -763, 122, -1277, -560, 1897, 849, 42, 813, -27, -1734, -345, 172, -990, 43, 1352, -37, -995, 1707, 845, -1093, -56, 1445, -228, -363, 1718, 535, -959, 309, 409, -500, 1124, 1946, 285, -21, 1001, -978, -1068, 1096, 1372, -46, 1474, 2240, 317, 135, 1116, -226, -1546, 652, 999, -63, 1288, 2563, 224, -120, 822, 61, -769, 774, 851, -668, 255, 1299, -197, 29, 1831, 367, -1208, 412, 186, -1535, -100, 1426, -507, -617, 961, 315, -749, 526, 441, -1301, -647, 2, -1135, -331, 1794, -96, -1175, 465, 819, -1602, -563, 839, -1014, -1815, -212, 35]
3593C5o91J342M3j561M61J08j525l8J832q20p96J974Q90j732J35R32k087j213
3611b711K129r4k55J869K82j872K03O61j113n84J536l38j072J530M75j687N03
3628e38J751j581q06J842J35j936J228L67j771K77J816m92J13J526q38j977M42
3645d42N78j337J211J657j435j70J941o17k183J109J38j774M82K110o99j62J395
3662A802o94j300M41O08j381N54J224j591n12K130K08j490J045P02k325j6J762
3679A167j085n53J511l04j343J500R05j708o6R99j632n09J808l74j254J546Q94
3696A502j667J23J582r71j137O03j13j685R19J799q85%J156j252j117J299p3j721
3714a638J045Q98j393O03K030r60j001Q72n50j757M33J551r95M31J235r25p34
$$ y = [35, -656, 686, 729, -832, -371, -263, -1788, -1826, 6, -814, -1610, 364, 1254, -478, -343, 589, -1498, -2711, -582, -676, -931, 938, 1220, -652, -449, 212, -901, -1485, 51, -287, -1359, 171, 646, -1041, -538, 1213, -368, -1174, 668, 803, -1133, 95, 462, -1309, -1032, 784, 292, 405, 1931, 1093, -884, -442, 136, -1201, 10, 1667, 232, 62, 2003, 1386, -797, 312, 450, -1324, -842, 1268, 569, 407, 1802, 1108, -192, 249, 857, -524, 30, 1254, -337, -849, 1281, 1489, -1, 1044, 1746, -579, -595, 1167, 82, -471, 1040, 736, -607, 893, 1798, 90, 24, 1023, -609, -1118, 690, 316, -938, 608, 1502, -165, -42, 1540, 569, -568, 35, -78, -1763, -844, 955, 70, 70, 1226, -26, -1143, 156, 83, -1638, -593, 305, -1088, -485, 1545, 585, -416, 456, -94, -1851, -1418, 133, -862, -431, 804, -121, -855]
3731h55J362k54j784N19O93j292L50J968m54j160J354l7j896P11J420j426k16
3748i97J133n27j375J505O11j091Q96J107k071M35R88r00j436J255P79j141J467
3765F38J395j264j065P10j391r91J532R90l57N62J139j454r98J419q16j467J225
3782a93J073r61J002J171j325j157Q77l57o09J536P16j340k44P70j287n72K086
3799A186p0j277J190N80j917J63N87p48p51J683M85p95J178M18k227m05O95q11
3817h36o9K058J45q42O06j24j686j26J494r13p02J727J45j400R12N40j948K9J112
3836A22n04k95J500k37j688M23O87j099P10J761j304j292J195j84j235J120P58
3853D38j532K06J563n53q14J004n75j399N36J089q27N15J400p84j697J240J54
$$ y = [-855, 507, 253, -1531, -1012, -319, -1611, -1261, 707, 253, -907, 447, 410, -1486, -775, 645, -781, -997, 136, -391, -1766, -261, 350, -741, 155, 1262, -809, -374, 614, -286, -1722, -467, 312, -829, 638, 2033, 769, -296, 414, -977, -1968, -436, 554, 197, 759, 1898, 444, -554, 865, 49, -1418, -193, 880, -81, 921, 2092, 767, -390, 487, 130, -479, 1057, 1773, 433, 189, 959, -328, -900, 1186, 1116, -161, 1029, 1609, -308, -145, 442, -306, -1057, 626, 1111, 316, 1494, 1912, -315, -720, -25, -836, -905, 1153, 1298, 456, 1062, 938, -748, -874, 620, -293, -995, 732, 877, -523, 389, 929, -1019, -990, 122, -382, -677, 823, 586, -1102, -679, 8, -1091, -381, 1380, 76, -1216, -21, -205, -1440, -320, 438, -1094, -888, 675, 122, -692, 312, -263, -1662, -1126, -37, -864, -349, 1051, 267, -1430, -190, -36]
3870c6j471J074P07j151l11J623p54n87J141J76j475M34J143j433P2J495j001
3887c54q56J005O39q40R57P27j539j063J697m53r60J476L81j317P59J085j186
3904A58q69J457n50r80J264R27j482O49R80j849m28J464k46j056J746j7j523L15
3922d0J272j100o23J756o29j356J351P23j573L20P95j021k92J580k33j220R51
3939F61M05j919L80J148o41k34J267j57j307P67K76j283M59J123j448m09J698
3956G86R2j198M97O18j914N61J294o50p17J262n70j163J057O95j541J60J585j263
3974d09p58J826J10j317k63Q38j417N61J316m26r76J153j36j557J309M93j231
3991h84l08J805q40o20J512k3k265L52J347j294L17J826l45q53L71o59j183J377
$$ y = [-36, -1507, -433, 274, -877, -1188, 435, -319, -906, 235, 411, -1064, -630, 513, -920, -848, 647, -354, -1210, -205, 434, -406, 551, 1278, -261, -1324, 373, -80, -1040, 436, 817, -500, 259, 1344, 158, -711, 746, 196, -784, 480, 1407, -75, 574, 1554, -295, -723, 741, 495, -561, 1185, 1168, -355, -40, 1232, 132, -491, 1265, 636, -720, 631, 1354, -219, 101, 896, -125, -417, 1163, 930, -290, 661, 1066, -853, -473, 675, 34, -200, 1067, 910, -397, 370, 646, -637, -178, 945, -503, -912, 786, 878, -320, 177, 795, -1119, -558, 736, 86, -631, 631, 61, -1102, -45, 650, -891, -731, 854, -409, -1167, 659, 769, -548, -811, 27, -1390, -829, 487, 61, -915, 238, 102, -1455, -146, 347, -884, -1192, 613, -227, -847, 665, 642, -1623, -1271, 76, -1218, -901, 925, 580, -273, 98, -561, -1744, -367]
4009c67O59p57L0J842j662j035J481j28j285M50J220o90J52J698j157j189J054
4026C16m27j389J448J749j245k83N36m69j107R53M07q01P36R91j142l75J717j427
4044A88j316J166O04q05J176Q51j416q22N94o30n82J726Q78j506O27L80q30p93
4062e10J275l70j528J749N23r78L18P03j347r10J686l12n52J175K67j467J19J437
4080A278j817m68J672k52j319J523K89j162j62Q33p75l68J129l21o13J403j21
4097G49j972L58J361j314k60J792J88k012O63K41r89P86J066j306p12J415j78
4114a24q26J148K45j693J72J286l73o56J464n05j544O27J060j033J36J288j055
4131c83n18Q76j13o78N77N76j746N44J845r08o63R88J35j829R65Q92j004L84O74
$$ y = [-367, 292, -465, -435, 1407, -255, -1290, 191, 63, -1222, -772, 448, -242, -90, 1608, 451, -738, 316, -111, -1500, -52, 1697, 452, 169, 705, 236, -871, 82, 489, -312, 424, 1415, 273, -102, 1615, 188, -1128, 38, 642, -163, 1013, 1864, 448, -374, 220, -410, -992, 734, 1612, 106, 733, 1113, 283, -510, 765, 395, -1133, 616, 1139, 161, 479, 1182, -165, -1075, 611, 299, -253, 922, 1189, -278, -159, 1278, -539, -1007, 665, 413, -906, 617, 906, -256, -418, 415, -360, -728, 401, 80, -533, 870, 749, -1223, -865, 496, -818, -1078, 714, 902, -1110, -447, -206, -1195, -409, 657, -649, -1361, 54, -124, -950, 198, 443, -1250, -1078, 208, -165, -821, 643, 138, -1406, -779, 281, -752, -616, 672, -383, -901, -25, -138, -816, -239, 337, -1409, -865, 980, 72, -591, 397, 532, -1297, -332, 560, -444, -60, 614]
4150F14n92r43J353r4j278R61P48j212J31J040o97o00J546m90j284J280P78j472
4168b11K4J274q60p65R66N67p83J82R43j192m01J327n36q63J785n43j578P33J308
4187A377j262o94K267j008j549J548M70j327K23Q36j174MJ479p51n80Q91nj786
4205a041J035J230j380o2Q81p26j016J517M05j357O24M88j114j05J568o68j147
4222h68O50O06j453P95J193j036p60J167l56j646J810M45j429N40O95j067m85
4239a199J856n62j291Q89Q01j411N6J505q19n26J007n65j147J717N26j723J32
4256g54J090j451j67J716j93j280P41O71j248K63J260q69n85J242o60j189J819
4273D06M59j698L45J302j230k75J542J05j958R47N44r66L09J189j036l33Q43j26
$$ y = [614, 22, -921, 432, 338, -940, 21, 769, -443, -312, 728, 31, -569, 977, 487, -797, 483, 1261, -211, -187, 1087, 227, -538, 428, 995, 212, 394, 1337, 145, -256, 1071, 535, -328, 1457, 914, -664, 69, 1377, 115, -579, 1688, 680, -869, 679, 1149, -178, 45, 881, -293, -289, 1190, 439, -141, 750, 745, -1041, -6, 1224, -156, -218, 663, -63, -1079, 438, 843, -514, 110, 598, -516, -621, 947, 279, -868, -218, 388, -1065, -270, 923, -113, -873, 294, -62, -1708, 102, 547, -882, -342, 353, -714, -1199, 657, 95, -1196, -307, 494, -917, -861, 644, -175, -701, 306, -259, -1406, 311, 837, -886, -754, 336, -1115, -1282, 434, 241, -1039, -298, 373, -875, -612, 648, -221, -806, 436, -224, -1413, 406, 865, -833, -488, 814, -416, -691, 851, 956, -1002, -55, 489, -477, -168, 1021, -15, -348, 495, 369]
4291C69j163J347N02j406J1J243o10j091J945l92j044L26J311j507J21J195o39
4308E18o95Q68J42j265R22R88j382n64J586j058k56J309kj650M43J276j416O4
4326a72J582r79r53J270q6j506J035J128j576j83J186l21j038J441k3j657P63
4343h9Q97j512Q0J546q91r14Q79M85j269P38N58j071l18Q50r0p71J123k06j253
4362a228Q54Q31r91k84J376m79j519J266L35j156N80R25j121l51J168o36l30J164
4380D04m8j657O47J194j156j18J524r06r05Q34P24j443L46J096j157k07J024P5
4398B71j018J009P6j678J035J022q71l42J649p98j415J201O90j478K66J541r19
4415B41o74J408l01j149M83P14j583N29J516p20p59J496q18j278J030P93j069
$$ y = [369, -794, 553, 1055, -351, -340, 903, 293, -798, 1147, 755, -289, 37, 1348, -159, -38, 1157, 518, -177, 691, 833, -432, 490, 1478, 96, -468, 1118, 60, -196, 1113, 1111, -539, -96, 1180, -236, -172, 1410, 431, -522, 748, 662, -844, 191, 1319, -257, -440, 746, 425, -613, 828, 805, -852, -89, 808, -704, -624, 922, 31, -883, -4, 481, -788, -50, 508, -563, -881, -31, -121, -892, 231, 25, -1228, -374, 457, -534, -818, 558, 79, -1440, -174, 161, -995, -415, 510, -611, -962, 206, -430, -760, 404, 356, -1301, -654, 540, -616, -734, 790, -116, -1021, -187, 537, -906, -560, 536, -621, -828, 196, 271, -747, 262, 338, -1340, -305, 717, -154, -496, 1153, 355, -1060, 141, 831, -647, -381, 1160, 241, -433, 975, 674, -475, 8, 722, -861, -332, 1184, 464, -295, 1201, 383, -895, 135, 928, -141]
4432a41L96J363j295n87P98mj189Q21P82j157O22R92n04j281J101j86j722J465
4450B74J500j394n0J089j710p33J483K25j071P78Q15j257l17J124q33o52O67L13
4468B51n38Q20Q39j481k32M92r07o78J619P76j227O13K13j448j04J518o94n24
4486f92J102r2r49O16L89j210k05J565r32o76J467L10j546K61Q38j315j82J470
4504B19J22j645J363j63j398P70J322j392RJ076l55p78J436j20j715Q13R08j242
4522g70l74J869p48q25P32N87j053L28P73j137m02J237j09j096J488O18j438K78
4540d2M86j207Q9J416j53r85P13P79j593L73O10m82m96J145J11p33M78O82j503
4559c12k43Q58m88L30J471o01j449P35k15p81N66J278l44p17J226k57j674M28
$$ y = [-141, 255, 1618, 323, -264, 534, 530, -659, 162, 944, -213, 409, 1401, 897, -384, 717, 531, -1191, 274, 1774, 380, 330, 1419, -291, -1024, 459, 684, -387, 391, 1206, -51, -368, 756, -77, -729, -62, 251, -287, 533, 1372, -109, -341, 151, -756, -1434, 185, 961, -266, 347, 560, -888, -992, 526, -168, -692, 410, 318, -631, -15, 374, -836, -1041, 524, -408, -1084, 383, 693, -853, -592, 246, -1069, -1251, 219, 341, -1304, 59, -104, -1502, -732, 590, -802, -793, 283, -72, -850, 586, 466, -1249, -436, 472, -770, -1144, 725, -23, -848, -116, 471, -582, -254, 519, -618, -1020, 217, 108, -988, 500, 1118, -320, -42, 444, -763, -674, 742, 589, -396, 317, 1096, -497, -124, 486, 4, -492, 653, 764, 31, 509, 1191, -312, -555, 303, -185, 145, 1616, 1015, -434, 301, 86, -695, -129, 1149, 805, 88, 1314, 1057, -617, -189]
4577a89P20j429K91J934n31q05J155o49j407O08N20m59M50J562j299p12P06o25
4595a59p22N72J225r90p6J219p65q84J184n18j200J142J016j317P0R24j187j038
4613a504J389L43q78R60Q12j453k95J257j598k22J513m4j121Q55L34j014L0R56
4631C20q39j003J325O42j103P82M63j300k81J149l21j022J376J21j620O89J121
4648D99j306R1J115j32j310J118N68j423L31Q50j011k65J648k07j231J344J29
4665H08j830K82J290r11j54J181l93r77J110K88j211J88J363j526M6J538m79q95
4683b82J028O4j174L05J109p91m81J477r31j147J102L62n96N65P07j289n08J402
4701I22m63j006P75N82j154L19J324j082k57P43n79q85J207P37j268K17Q13q70
$$ y = [-189, 531, -898, -607, 1327, 796, -9, 1146, 497, -910, -302, 218, -241, 209, 1771, 472, -240, 466, -159, -881, -309, 916, -74, -150, 1069, 304, -580, 604, 86, -1114, 28, 1044, -273, -203, 721, -466, -1504, -115, 228, -650, 310, 1122, -331, -626, 631, -967, -1189, 324, 280, -841, 14, 348, -666, -636, 320, -519, -1522, -197, 445, -658, 124, 587, -713, -994, 155, -166, -1188, 188, 309, -1311, -622, 499, -807, -716, 399, 267, -1043, 75, 643, -780, -449, 401, -610, -875, 773, 566, -665, 679, 808, -1022, -740, 550, -361, -515, 666, 273, -704, 406, 694, -517, -329, 1034, -492, -446, 1092, 613, -282, 746, 810, -364, -59, 1050, 259, -222, 1255, 324, -823, 279, 641, 45, 610, 1317, 28, -480, 922, 459, -547, 228, 810, -344, -25, 1299, 217, -40, 703, 124, -761, 446, 1183, -85, 132, 945, 75]
4719G5p40J363l3r01L97N59j358L95J064l69p41R60m64r62Q67O07j426L93Q97
4738E83r30n80J095K66j052O81K66j050q7J253r59k93J148j70j275P62Q31j173
4756f84M5O78m28j042J773R2j302N38Q18j181J33J142p35m32M81Q5j549J302J019
4775G53q34m44J021o28r50R24n8n78O39J099j299q8J147r10j043Q16L03n91J052
4794C31M90r57j51L86l60n22J069N11j195L69R15j050n21J469o49p95J117Q14
4812A271j503P16N69j309l64J224n80k26J246L56j336J23O95j423o4J304m79p67
4830e47J410K49j161J37O78q93l91Q95J05p39J132j72j026n3Q66o49P3R21k77
4849E58q71M54P03j048K60R15j392k2J281o02j081J331L29j619j71J585o44m83
$$ y = [75, -665, 698, 665, -236, 161, 720, -638, -243, 821, 452, -289, 671, 207, -755, 112, 719, -707, -314, 583, -347, -927, 168, 434, -618, 63, 329, -721, -808, 445, -514, -807, 341, 171, -1104, -342, 489, -684, -639, 39, -389, -1431, 342, 434, -868, -330, 488, -693, -560, 582, -153, -585, -104, -19, -1568, -266, 753, -81, -525, 496, -132, -1082, -158, -216, -794, -155, 944, -355, -443, 704, -206, -1249, -433, -130, -721, 331, 821, -136, -287, 99, -261, -783, 286, 797, -398, -29, 886, -164, -685, 784, 135, -660, 457, 1271, -232, 484, 1053, -256, -620, 604, 24, -202, 1044, 1400, 64, 187, 882, -541, -605, 699, 220, -547, 863, 1112, -49, 88, 766, -127, -518, 377, 482, -257, 875, 703, -323, -376, 490, -159, -86, 835, 558, -313, 141, 844, -204, 56, 971, -421, -443, 838, 236, -845, 486, 815, -804, -975, 610, -34, -517]
4867e17J086m49j016O86K43j214J031O85j121m15J208L96j099N80J91j278j58
4884a161J286o63j80J316k42j334Q26O62j349O5R71l10m04J007j58q77K36M36
4902A27j370K7J621m65m53Q83j17j365M49N48o89K82J446r63p81J059K90j471
4920i42L61J108j034L85J118n19r21P02k03j483R67J250p17J88R94o86r65M95
4938I8J75r34M60J281r55J20J344q65r00M42J14j281J042J075k50p67N32p18j212
4957a199J176P61j103Q50Q14r91k07O01m77q53N55Q49j018L53J238j048n78P77
4975E00k59j125J008O57p26K22N83j117k52Q07l81o38J182m1j010L29J197j027
4993i1j099R84j30n07J316K24r06l02P82q57m80J497l72l72O66J60j340j70J247
$$ y = [-517, 569, 120, -896, -210, 33, -1181, -150, 535, -586, -1001, 207, 603, -496, 84, 275, -1003, -1161, 125, -538, -718, 598, 356, -978, -152, 510, -839, -774, 197, -113, -517, 490, 332, -545, -309, 127, -1243, -1216, 405, -60, -513, 370, 253, -1112, -663, -115, -804, -522, 924, -39, -820, 239, 529, -942, -581, 527, -507, -122, 996, 477, -444, 258, 55, -1428, -461, 789, 72, 260, 1254, 568, -397, 98, 273, -661, -201, 1080, 125, 245, 1589, 724, -176, 266, 380, -901, 141, 1216, 966, 199, 731, 13, -1199, -23, 738, -365, 485, 1299, 308, 101, 702, 225, -628, -73, 776, -242, 111, 1349, 301, -277, 500, 241, -884, 124, 781, 55, 277, 860, -257, -509, 298, -83, -721, 461, 420, -590, -261, 936, -91, -1190, -206, -336, -843, 473, 697, -209, -511, 271, -586, -1066, 431, 59, -313, 353, 513, -827, -997, 250]
5012B50l82o82J086k12j009J089L56j022l90Q42k11o25J260l33o61M16L50j063
5030i41L87J027p31o92J351o06j025J141M86r58k79Q77q2o77R42M44j314M82M87
5049C19p58K54P44n51o94J100j30r20P90L92p43k30Q77j28p79Q28J40q56J63O80
5069D98p40K52P14m00p47P93L08j212Q76O70r51m87J483p41o21Q89K32j060L13
5088F9N25l75m30J110n26r21P53L13o23L30O89j025r5O81l13p74R10M99j171K63
5108a11P85l35p75J232n54p81J018p0q24K23J017j306k25J129k82q31J180M0j297
5127g67N53P55r43n54J244n21o83R13P9p00P00M14j127n06J189J97r76R57L59
5146E83j587M51O35n95l81J216j74j013O62M63j210L80O99r63o4J089L70j233
$$ y = [250, -132, -814, 272, 60, -949, 140, 496, -526, -916, -74, -285, -910, 350, 17, -644, -228, 122, -941, -554, 473, -258, -950, 401, -205, -1230, -89, 397, -561, -840, 37, -45, -722, 220, 664, -650, -168, 319, -439, -185, 559, 8, -686, 414, 284, -636, 154, 546, -197, -427, 450, 322, -457, 371, 511, -345, -182, 498, -242, 10, 724, 324, -423, 370, 678, -534, 342, 1012, 61, -426, 1057, 316, -305, 584, 816, -244, 69, 594, 219, -211, 899, 373, -548, 205, 518, -105, 225, 914, -111, -206, 475, 162, -612, 298, 797, -374, -111, 674, 339, -436, 796, 242, -539, 479, 409, -415, -192, 825, -481, -706, 423, 141, -690, 490, 530, -767, -214, 541, -402, -956, 288, -233, -916, -3, 76, -624, 76, 490, -637, -1143, 46, 243, -733, 224, 583, -1004, -553, 82, -513, -894, 322, 148, -865, -203, 260, -950, -570, 129, -834, -898, 191, 561, -672]
5164f72P99L33j450L25Q28l00l15P14J13r32L22M55r22L88Q02n98l37R66J39j254
5184e96N25N58r43l67J590m52o45Q81k77r49O70R52r08J39O37p03l42R10j6q71
5204b07N94O7p99K86Q73l61o52P77N8j110M42J199r19j81Q38m19q85Q11M24p03
5224A33N7M00n30r1R10o63p14P26Q6q70N23Q01p56m17Q31m74m58J164M0j049L90
5245C9M56o76j94J166k69r61N35K53j300P53Q50r97J86R29m70j098N12O94j323
5264i15P38N23o02m21J190o07p97O97K03p39J70J414r07m99N32m16p85J238M55
5283D72p58MN94j140N8N75K47j012Q20N87o71o1P57q64n13R98n2l90P50K98q79
5304a80m40K99l64j19J488j04j097N23M87q99L73Q27p42o04J082k9j014Q17N12
$$ y = [-672, 127, 460, -990, -665, 163, -137, -452, 262, 375, -557, -235, 220, -702, -314, 488, -110, -447, 519, 658, -596, -71, 487, -456, -823, 767, 315, -330, 551, 274, -675, -5, 947, 39, 178, 815, 112, -230, 680, 664, -207, 387, 454, -345, -59, 814, 453, -199, 578, 636, -474, -32, 1167, 248, 67, 905, 486, -399, 412, 836, 133, 190, 590, 60, -31, 879, 216, -498, 228, 314, -556, -33, 768, 12, -405, 426, -48, -506, 658, 698, -351, 39, 495, -181, -375, 791, 522, -439, 96, 349, -951, -198, 652, -345, -159, 770, 300, -798, -286, 408, -915, -177, 346, -256, -677, 513, -94, -891, -194, 9, -730, -560, 854, -53, -552, -20, -436, -1221, 17, 472, -286, -282, 312, -828, -770, -195, 52, -960, -140, 447, -224, -285, 472, -392, -905, 93, 41, -349, 401, 699, -180, -620, -321, -685, -804, 684, 580, -517, 6, 493, -406, -33, 794, 52, -552, 530, 501, -513, 304, 816]
5323H16j443K33J177n99l65J074l62r57L27M23p12J35J404o78n72L97M24r85L96
5342A33L92n47N9P52n06n49O23pq54M16Q81m21k98J110j159q56J190j56m41O15
5362C77N04n18o84R60m97n20Q76Lp64M74M24o95m75J114p28l25O74L89q49J64
5382i6N93j025k25Q01l64n56J448J13j463N00M66n61j53M14J35n98O71M98j366
5401g68J4P14n92J65Q28k97p77P13R6j283O60P10o98K22N35Rj164N55L30n54N89
5422GO87j254J39O47r8r75Q85J39r29K17R49k90l52O55p14k81M58N99o89J66O68
5443F34o87k31N21J42o98L76N50j205O10N92n91l66P56j19p29O35N72p96N3N05
5463E24m08o53R12L66q82L84L67q14N4J082m61p58R47q9j039P34N02p10m37J209
$$ y = [816, -627, -394, 783, 184, -181, 893, 531, -426, -99, 324, -388, -253, 1151, 473, -99, 298, 722, -263, 133, 525, -22, 37, 789, 283, -266, 357, 350, -504, -88, 793, 372, 74, 1184, 25, -831, 359, 203, -238, 377, 881, 363, -321, 639, 142, -378, 498, 501, -263, 211, 635, -60, -535, 579, -149, -474, 200, 589, -260, -96, 497, -528, -753, 48, -316, -872, 576, 689, -774, -274, 192, -369, -522, -108, 27, -571, 100, 598, -768, -754, -40, -632, -467, 361, 64, -713, 0, 96, -1187, -527, 183, -515, -293, 242, 251, -913, -358, -28, -582, 7, 694, -560, -421, 226, 128, -847, 38, 177, -752, -535, 414, 124, -228, 427, -287, -568, -110, 489, -200, -34, 634, -53, -284, 237, 379, -319, 57, 607, -598, 12, 604, 13, -353, 403, 284, -445, 190, 762, -34, 19, 524, 116, -537, 375, 741, -141, 243, 610, -204, -150, 932, 471, -287, 660, 571, -468, 266, 768, 58, -379, 830]
5483H30p30p62Q57Q71j074L26M94j044K67P03o78l95P23L49j023M56M71q00LM83
5503C27m64l98R54Lo69k9N17p27J8R70k75r24J410n40j005M69R95j011k69R78
5523C30n92p95J333L88j419K93M67n29j29Q86p7j188P04L55l73Q4M62q48J28O12
5543I2l61l48M56L03p86M37Q18j092l41J287n41m56K48N36o86K89P27j154k07
5562g79O19q3k36P66O24j311J08O73j045K84P21P0p09M89N2l22J70M34q68j79
5582e22J061l99j95M88J58r77N3R96l57r8O08r7p82N9O39o28m3Q00n94l61P34
5603E43k2p48N50N92j348M97P41n34k14Q63n08j050Q16J44o35L99J007q58l67
5622a32N40m0q03K61J122j126K31O02p34K6L74p4j103P04O24n01k78Q77m64n70
$$ y = [830, 100, -662, 195, 1066, -8, 318, 812, -232, 35, 738, 60, -335, 388, 737, -286, 170, 641, -159, -156, 327, -137, -535, 419, 422, -247, -276, 241, -486, -468, 502, 227, -697, 713, 173, -832, -363, 632, -379, -648, 330, -262, -1057, 276, 664, -755, -462, 5, -524, -653, 233, 156, -1032, -328, 27, -346, -262, 200, -648, -520, 92, -269, -617, -161, 142, -644, -207, 611, -481, -822, 465, -76, -532, -284, 252, -434, -145, 582, -572, -779, -160, -243, -479, 287, 911, -400, -292, 381, -664, -380, 341, 411, -298, 191, 243, -79, 91, 525, -343, -522, 539, 140, -55, 433, 591, -386, -333, 663, 306, 208, 816, 719, -63, -4, 635, 7, -36, 764, 170, -191, 543, 521, -227, 323, 915, -433, 64, 805, 271, 57, 920, 412, -638, 178, 322, -313, 86, 1093, 235, -132, 408, 368, -435, -174, 948, -178, 53, 655, -79, -53, 321, 247, -856, -152, 472, -29, -307, 570, 106, -464]
5642d64L37K74n76L81O53j102J34Q79q00k87N69j57o48M57O88o80M9O80n45r15
5662a073R60N21r33L39L47p44N7R31n25n52N19L75j171M89J110p46l77Q48o88
5681c13k57L53M09o07K09P54r57l93J189j17j121J144k97k71OJ204r39m23M91
5700F4l07l93P15O28q72K86N04j013J6R32l04p74Q16J89n51L27N26r86j18P63
5720D48n6q29P29P32r87qN85n63k87P73j08l92M18M75j000K08O17o18o37Q04K3
5741C27o46J079K72j196K05L51m97j29Q39q6l12N7J47o23p3P69l95m39Q21j70
5761C01o88M29N71r68k28R17l08l4N09K7j052N74L20j026J6J150n92m06N77L1
5781A20q94L39O61o15j06Q71p11m93Q80K92q36M41K53r18K54J031l06r44N68j49
$$ y = [-464, -127, 147, -429, -48, 605, -497, -363, 516, -284, -571, -2, -159, -807, -350, 338, -342, -293, 387, -158, -1073, -113, 408, -525, -186, 161, -583, -526, 405, -120, -672, -153, 222, -949, -460, 650, -96, -473, 375, -313, -570, -217, 192, -415, -206, 548, -409, -802, 387, 270, -851, 293, -4, -275, -269, 935, -4, -427, 64, -243, -636, 79, 707, -165, 121, 625, -388, -372, 560, 256, -518, 298, 487, -64, 263, 789, -197, -315, 448, 392, -437, 292, 1024, 37, 29, 614, 51, -236, 537, 429, 37, 455, 930, -70, 138, 755, 137, -500, 304, 327, -319, 760, 1032, -164, 41, 392, -105, -234, 605, 519, 207, 264, 411, -212, -285, 484, 89, -350, 471, 301, -387, 42, 613, -355, -583, 334, 26, -8, 501, 528, -524, 50, 370, -656, -640, 510, -82, -488, 89, 120, -774, -435, 226, -389, -495, 376, -335, -828, 52, 344, -492, -51, 202, -716, -462, 569, 263, -681, -113, -262]
5801b62o46P63M51o68k68O47l91j80Q30j79p71J88O09m03k96J166m73r01Q11O7
5821I4r44N33R16p76k87Q67o40l13M51O03o82J8O87o92kQ44o52n23M54O39p43
5842a48J65N46m23n01Q46m8q67R45K23r11k3R19p34k11J013m55r48P23P51j092
5862b30N17N76p93n33Q67J48q77O33N95q21l61P30j45l92M87k6p48L47N62n52
5882a6M0O01l76o75O98J42p10L91N87j259M44Q39o82k66Q95l74q90P28J34m24
5902a73j42O75m85n55P54J5o60N72M85j175k6Q43q0o24P40r4r26Q10P37r96j88
5923d93P40n39m24N63M04o72J21P84j065j19R40r5o26Q03k14p78K43Q56q55R4
5943c32Q70p73m09M89J37j91N8M86p92k61J125j64j68n3N79j261O03O61m54j53
$$ y = [-262, -908, -145, 306, -362, -630, 17, -374, -554, 276, 97, -674, -486, 123, -280, -576, 590, 117, -784, 27, 94, -850, -317, 599, -177, -464, 403, -237, -550, -99, 504, -178, -160, 527, -165, -167, 677, 25, -498, -44, 595, -148, 17, 563, 140, -361, 485, 437, -430, 515, 738, -173, -196, 723, -11, -222, 791, 336, -612, 111, 862, -230, 287, 863, 70, -463, 404, 552, -325, 308, 903, 82, -279, 451, 306, -86, 401, 375, -373, -26, 536, -16, 24, 625, 249, -426, 272, 414, -296, 95, 682, -577, -133, 706, 24, -242, 653, 279, -611, 117, 251, -173, -315, 360, -125, -680, 74, 89, -571, 1, 486, -689, -715, 128, 48, -576, 164, 70, -856, -46, 691, -305, -493, 247, -292, -716, -153, 251, -421, -300, 484, -581, -700, 240, 145, -481, 322, 108, -670, -427, 429, -426, -332, 538, -235, -644, -155, -18, -209, -151, 335, -457, -718, 407, 243, 75, 22, 601, -660, -57, 604, 150, -3]
5963cN90m22p68P40K82o56J71O34q26O8O10Rq53P57J10q96L27O47n04l05R73m82
5985B03m16M39Q9o35L53O99o30k78R20k28j016P66J55p60N53O46l53o52O16l74
6005I7j68M3M77o12K12O46n38n29R55j46j032O41M08q97K35Q91q38j37K28J08
6025D4j095R49M47k34j42M62o49m63Q82l21m84O86K12m77j22K99l09p26O66L54
6045b1m55N88M65p27l27O65q86j91R82K52r83K80O75o34j44P81r08K7O15j97k58
6066d01O96M10j476j91P16m0l71J133j35q49L39K83p75J80R13n16k87O49K22n03
6086cJ98K27r05j86P01J78m36R55j82o37l11P98q72j16J417n15l74N19J39p72
6106a77K21M33n69P3J43J97j49L00J01r13M34M17o01r4R45k11o60R9O74q67J56
$$ y = [-3, 587, 165, -603, 137, 419, -237, -66, 568, -258, -190, 420, 429, -424, 333, 443, -453, -126, 521, 17, -288, 685, 203, -213, 226, 315, -320, 33, 732, 102, -176, 744, 516, -500, 266, 421, -339, 214, 860, 507, -145, 471, 97, -71, -28, 449, -163, 49, 695, 157, -372, 583, 437, -595, 46, 454, -443, -208, 683, -155, -292, -64, 44, -1051, -102, 345, 111, -31, 431, -218, -681, 201, -120, -604, 82, 294, -183, -305, -6, -315, -1041, -375, -21, -476, 112, 577, -150, -477, 188, -698, -889, 93, 345, -638, -358, 317, -317, -461, 320, -588, -561, 54, -143, -401, 295, 705, -771, -962, -246, -286, -657, 476, 341, -508, -169, 114, -661, -481, 432, -84, -371, 278, 500, -3, 195, 422, -483, -669, 32, 210, -226, 729, 547, -90, -401, 397, -475, -591, 826, 311, -63, 456, 595, -177, 44, 477, -92, -19, 124, 321, 172, 472, 573, -340, 94, 511, -90, -184, 761, 550, -110, -11, 663, -204, -48]
6127d8O98m86l25N89K45p56O21O3j011J71Q54m08JN54l34n51L38m9p81M89L88
6148B62l71q1O95k20q32N23J4k55j88O37k43J48L65k97q61N79L44p96L78P71n16
6169E6o57O24J97p56N00R0o94M11M37j03p16N17j85o78O98M42M0l26M42r18m40
6190a019Q10K39j018Q70L34k68j3O30q09m55M31K5l84M28O65n85K18K14n25n84
6210g96P83L19k83l83Q65p30k08O50l32o87J090k6p42M92P03p75j11Q43n77p12
6230f17J123L07p60O4L36q02RO34r7k15M60J39n97L76M60q80j95Q49k68m04M50
6251C72M37q11J56K17n77OQ47k48r38Q46N38r20k6M44l3p16P91l07o62R61K81
6272F58j121M07N01o15L25J69K9o15L56J72p54L92N98m42n24N78N9m53L02K23
$$ y = [-48, 650, 164, -161, 428, 673, -83, 538, 601, -410, -239, 615, 207, 208, 762, 428, -123, 215, 166, -615, -126, 262, -109, -190, 505, 285, -547, -24, -10, -265, -453, 184, -59, 89, 454, 157, -704, -125, 219, -577, -199, 572, 56, -601, 23, 220, -536, -36, 54, -640, -229, 208, 105, -611, -94, -279, -957, -259, 183, 223, -103, 339, -579, -1019, -209, 30, -988, -118, 216, -52, -65, 565, -244, -699, -268, -243, -627, -199, 466, -119, 99, 313, -212, -796, -13, 306, 23, -360, 505, -225, -433, 217, -115, -802, 288, 262, -480, 12, 715, -60, -171, 672, 95, -617, 506, 813, 53, 117, 453, -349, -340, 294, 197, -18, 442, 581, -16, 360, 820, -60, -255, 594, 326, -78, 372, 809, -2, 154, 371, -206, -200, 647, 399, -539, 307, 845, -75, -101, 343, 310, -406, 385, 78, -584, 377, 658, -463, -56, 445, -170, 155, 324, 353, -262, 94, 266, -488, -96, 502, 60, -464, 114, 173, -280, 22, 245]
6292B45o32O0M63k72K1L08L0r57L75K40l89J85O75p31m54Q84k43j36K69M39o94
6313c14j12K55j00k86R43l37p25O38L16o67N6P87o35l54L33K71n46M66Q13p55
6333D7k49M70k74k97O60m41k27K99K72o36M28P74j002l38O12n0n10M47M62n88
6353a41j41N62m67L8O93l33n11M66K09n48J13O72l85n20Q07l08n53L22K26k07
6373fk83M89q0j79N38K01p30J98M33p95K35P64p54k13N73J33m48L66Q1n54j70
6394b01P25l39o54P87K44q06K04P15m78l19N56m72k80M10L59n11J55K93n83J80
6414a5L96l31o49O52L29q03J14N39m04P5L41l6p12L89K75p37N63R8o54r7Q52m93
6436c08l17O52L67j406M72M44j8j0M70j73m92K10K66p37j2P59p32r2J028j98m63
$$ y = [245, -387, -327, 136, -136, -115, 193, 223, -734, -359, -119, -508, -323, 352, -379, -833, 51, -192, -328, -59, 380, -314, -426, -171, -271, -557, 386, 49, -676, -38, 278, -389, -333, 454, -181, -535, -202, 69, -477, -11, 802, 47, -202, 268, -6, -303, 357, -84, -311, -12, 260, -376, 52, 826, -176, -514, 98, 48, -462, -15, 447, -141, -282, 280, -187, -149, 544, 211, -300, 166, 375, -173, -60, 612, 227, -293, 514, 206, -347, -25, 201, -6, -289, 200, 120, -59, 479, 680, -50, 148, 581, -214, 21, 785, 31, -182, 391, 524, 76, 442, 523, -31, -201, 524, 185, -469, 318, 562, -244, -40, 675, 197, -122, 434, -38, -318, 92, 451, -60, 95, 388, -195, -15, 381, 50, -599, 53, 382, -421, -307, 232, -172, -97, 244, 208, -504, -115, 160, -577, -14, 84, -570, -667, 185, -308, -625, 27, 394, -1012, -540, -96, -114, -124, 346, 173, -319, -109, 157, -580, -592, 167, -565, -657, 371, 173, -290]
6457b90L72K2q57M80M47Pm99M12J0p16J72P98n17j36N52j63p83Q64N25j401M62
6478b39N88m49j95J067n65l59M55j30p82P08N84o68J8N59o61k25O67j7n23K8O09
6499D70k71n25R03l49l42K62K90p98N88K15m37k49L95J51n50O65J32r46N85K27
6519D16n34J85M96j82m28K37L7o12P89K23n98kK18M3m52L96L6n37J99L54l98j60
6541b74O97k31o22L02R4m52J76Q10p41L9M08m58m37N87Pj51J01M13m91k7P40n92
6563a02o14M97k5m49O20N14q23o7N94r1p45P76J07m61J99J40m99m06P20N9n52
6584f08O70N8p00K98N97p90k66P79k6k30L24M09j182k20R20j01o08P92k49j55
6604b88L64L29n94J8M71m27l31L60J83k34N58R3n00j74P54l55k69N57j89n86N00
$$ y = [-290, 82, 104, -753, -273, 174, 181, -318, 94, 104, -612, -440, 358, -159, -295, 257, 94, -689, 175, 700, -701, -239, 349, -100, -295, 772, 207, -152, 303, 173, -609, 99, 683, 15, 33, 592, -69, -294, 373, 356, -167, -139, 470, 199, -326, 577, 228, -114, 148, 438, -360, 228, 443, 6, -243, 152, 303, -247, 418, 550, -396, 189, 416, -118, 67, 563, 381, -47, 190, 227, -385, 404, 627, 29, 27, 245, 288, -164, 232, 268, -269, -70, 284, -114, -274, 423, 192, -430, -128, -34, -486, -310, 500, -241, -202, 206, -252, -689, -102, -95, -246, -145, 268, -223, -250, 490, -102, -716, -219, -244, -693, -73, 441, -382, -449, 145, 54, -691, 85, 192, -269, -70, 70, -429, -835, -115, -56, -608, 62, 120, -580, -282, 315, -475, -741, 38, 12, -218, 106, 515, -667, -887, 33, -68, -676, 116, -133, -288, 76, 405, -189, -171, 300, -127, -458, -98, 85, -149, 409, 502, 2, -172, 582, 227, -42, 515, 326, -260, 240]
6625B40L40m40k15L69o7n09O64o7o77N02L95m08m72P84R1o26O87m09l00J35J80
6646A97m08N6M79k38m90P25p2o3j85P43p20l39Q51k85k49K82nn02M23L0n17J43
6668a44N44o77Q7O9N97p45K8K62l93Q0O86m28o21P70J43r67K71Q55n74j62m1M92
6690A32q26M49L08k20l40P05j87n38N36K04n00oN28q57J30O41l61l03P79J00q66
6711d92K17M64o72l1M33j31j44Q72l8q98N65J75r74K65P01l54m91P17q0n65K52
6732b09N55k58j78M17l35k63N61K7o86L96K38m15J91L26k38o52N44O5n06O64L79
6753F23n95j12N98o36p0M94K67m58R0J08k35j53N04l57J04j5l47n4J69O37m04
6774A58k39M84j94k30L13J60p27M87M11n21l40N61o25J36M65j96j51J43K47l69
$$ y = [240, 580, 140, -75, 294, 227, -282, 382, 315, -362, 140, 535, 127, -345, 439, 530, -96, 591, 182, -118, 17, 197, -211, -155, 324, 86, -404, 321, 249, 186, 1, 744, 24, -315, 536, 251, 2, 284, 279, -223, 200, 230, -287, -144, 400, -277, -190, -121, 476, -269, -241, 21, -372, -292, 394, -34, -655, 115, 258, -709, -438, 417, -157, -319, -360, 132, -694, -245, 63, -157, -497, 208, 21, -517, 19, 223, -277, -283, 245, -612, -482, 159, -202, -505, 274, 374, -492, -275, 189, -483, -514, -81, -212, -356, 516, 478, -420, 145, 320, -654, -389, 312, -42, -533, 184, 104, -461, -209, 346, 88, -90, 327, -8, -271, 290, 317, -369, 27, 265, -150, 41, 367, 129, -523, 21, 86, -420, 244, 623, 28, -84, 514, -122, -192, 302, 569, 111, 201, 309, 74, -79, 425, 68, 172, 157, -190, -244, -75, 562, 158, -81, 403, 209, -21, 292, 452, -275, 212, 623, 102, -238, 323, -302, -166, 299, 103, -48, 95, 342, -27]
6794b7j11L44p7l29L50P6m70K59J24o58J20Q78l10l60J46K34n88J81N16k95l42
6815c39K96J78n53P85k99o19L59Nl39L94K78k79l30J41K99n62M91L63l36l19N61
6836A75k09k97M35K0l56k83R94m46k78K41J80n75J67N21q61N52l4j00m09Q44l
6857B78m77M65j00m83K82K51m43M37l28M15p52N96J63m55n7N96l22k39L10j28
6877Ik10L72L3m57oP82j37n04O70p5m56J64M11n01k62O51l61j90M81m02L9j6O75
6900G10o88K13J30l53Q7K52J48p40M9O51m10K66J72m69m92O99K98o40J53L45n44
6921a63RO32n48l89N67K59p03J99N48m94j03M05k83j82K2K27j55J89J97o31J33
6942b64L84o50K58J41M03p86K51Q58p22j06M01l91k87O19J70o34L02K10l35j32
$$ y = [-27, -138, 206, 129, -200, 150, 226, -244, 15, 139, -519, -399, 479, 169, -191, -45, 189, -399, -218, 298, 3, -339, -43, 135, -418, 367, 68, -551, -192, -187, -526, -132, 146, -133, -463, -322, -23, -585, -94, 269, -67, -386, 175, -34, -331, 104, 124, -232, -515, 479, 33, -245, -4, 176, -399, -232, 289, -572, -20, -54, -154, -563, 281, 278, -199, 266, 166, -317, -35, 216, -227, 210, -118, 297, -455, 141, 304, -151, -208, 388, 66, -173, 137, 9, -201, 171, 204, -253, -259, 523, 386, -118, 552, 477, 21, 185, 596, 95, -167, 484, 123, -67, 414, 12, 51, 35, 710, 22, 235, 365, 12, 99, 351, 499, -241, -192, 459, 49, 315, 487, 18, -474, 225, 523, -117, 36, 381, -163, -154, 478, -70, -459, 108, 367, -336, -137, 411, -83, -186, 219, -64, -246, -224, 3, -152, 37, 234, -397, -264, 120, -530, -272, -131, 272, -514, -263, 595, -127, -233, 168, -223, -510, 109, 279, -355, -53, 157, -178, -310]
6962c10K13L02m16R3R6k45N9N19o48l92Q47r5o95P33L93r79O39jn42j49M84q4
6984a78k83N54m7o45K20P82l86j82N71l45l64N03K16o80K41L20j05l11M06o8k05
7005A4J47j09p13M40P39n30J43k34O02q21N26J24k92q0N18o41J7L90J86l30K77
7026C73J53l20l76O55n44PL03J3n37L70N36o26k46O19k36l66N75J72o64L49k79
7047f9j7J71L27J7p11K47N11p33N72p6l29k15M63K36o29M16k69l71J26P01n95
7068b27K6M92k8p34O05m9l70L42K49m28J9J7j76p4M82O5n09N0M68m83k37O52j84
7091c2j99J51J81l70M67N0l40k70L33r2m33L48M05p23Q6Q73o54Q3pJ38l83N08
7113A20j74k6j43K45j27k02L97o9k18L30j04m1j12L54l34j08N81k07k26K23K32
$$ y = [-310, -97, 205, -211, -118, -22, -267, -208, 311, -337, -729, 118, 23, -672, 61, 454, -525, 114, 113, -429, -578, -94, -178, -461, 93, 46, -599, -379, 403, 17, -165, 406, 61, -303, 200, 416, -264, -23, 297, 192, -119, 287, 219, 14, 161, 52, -661, -221, 518, -12, 131, -103, 499, -322, 204, 328, 36, -44, 474, -167, -150, 240, 426, 96, 373, 526, 206, -170, 485, -59, -52, 251, 264, -273, 97, 633, 7, -239, 380, 144, -222, 353, 525, -139, 210, -69, -86, 85, 412, 429, -282, -35, 476, -257, 315, 239, -90, -305, 158, 394, -235, 181, -88, -459, -333, 368, -227, -201, 291, 263, -471, 134, 85, -285, 57, 306, -122, -103, -86, -262, -336, 146, 211, -298, -248, 220, -263, -500, 152, -32, -231, -80, 101, -269, 198, 248, -92, -362, -29, -121, -554, -206, 199, -524, -438, 435, -219, -136, -143, -5, -388, 120, -54, -80, -223, 22, -105, -307, 90, 21, -197, 133, 29, -12, -124, 230, -104, -212, 369, 162, -64, 159, 391]
7134C91k80k67K70m22j71J039n06j62R8N32r01L75K67j14j94M25j78k54L19l59
7154i2JJ58L59l97j08M10k63j07L00J52n55j63J006n27k21L91l62j44M97k49p0
7175A6K03K39l53k53L33km04J10M05m12n5M64r7m99O05k51n10M78l5l04L62J98
7197B38j55l07L02p0o42M48J13l43k32J125o94L30n8J48q58K30K98j56K5L23k56
7218a91l74P20L11q70K89m3k14j13N67j91l78J87K36m53J25N72j22K4Ol48k96
7239e56N54l9j47j0O60n02n89P42k57n97Q05O8k47K43L40n13k22K82J23p50Q53
7260B41K33p04K44O90m69m02J78K20n61J096p46J54j99N52m75n9K10j62m30P10
7280C21J04m62p0M88l84k49M86R8m87L85K72r90M10K14m3l52K19L54l91L62J51
$$ y = [391, 111, -156, 114, -308, -479, 560, 54, -108, -10, 522, -379, -4, 263, 149, -45, 380, 202, -52, 267, -92, -91, 67, 426, 29, -79, 331, 68, -39, 261, 413, -142, -305, 701, 174, -47, 344, -18, -162, 335, 86, 16, 219, 458, 105, -148, 185, 183, -221, -111, 294, -118, -173, 291, 194, -305, 300, 49, -461, 17, -18, -322, 40, 238, 83, -224, 78, 8, -634, -186, -73, -416, -648, 477, -217, 113, 55, 203, -655, -425, -127, -283, -258, 65, -191, -565, 155, 466, -404, -115, -158, -372, -485, 82, -109, -487, -300, -64, -517, -392, 180, 58, 82, 88, -260, -556, -2, -41, -188, -198, 462, -40, -629, 113, -144, -741, 64, 132, -115, 128, 468, -45, -267, 15, 138, -612, 241, 474, -230, 14, 704, 235, -167, 11, 231, -330, 766, 20, 174, -25, 527, 52, -7, 203, 41, -389, 321, 425, -37, -107, 381, -3, -252, 234, 332, -155, 230, 502, -488, -78, 136, 93, -259, -40, 314, -77, 285, 436]
7301D36j76j56J91o79J29K45J40r3J92J22m38K34J58l43k82M48r2L36k77J12l56
7322a49K8K99j94n35P67j94l47J73K89j61k58O56k68n39K38q4q8M06J0l76l21
7343f48P02l50j70N52P2k89lO7l80J27M56n5k60J01J73k50l10M45l46J46M09j47
7365D2M4nK7o44M66J41p95L72M87p6o3J91k11j12L7M57m74l16N95K92m31N7k4
7388E7j39j59P12k31m75P81m45m55J69P05o18k3M90j80j96N1m4p1L12J31o35L94
7410A31P46o48J05K36l59n39M07J25J22l62M39m97K19K01j83n8QM01o68R7M46
7431C69j8l51K28l35J27l9J56m8j51K35l81l12M46L02k10J0K96n72K29J75m22
7452b66o5J68L1l41L95K83m73J23J6m0r1M38o1j22m37L42k42J71M11k58o21O14
$$ y = [436, 260, 104, 295, -384, -255, -10, 130, 37, 229, 351, -87, 147, 305, -38, -320, 128, 36, 372, 95, 207, -149, -121, 178, -16, -551, 216, 22, -325, -152, 137, -24, -282, 374, 106, -433, -195, -279, -367, 39, 49, -327, -648, 54, -296, -466, 86, 158, -131, -134, -67, -447, -320, 136, 81, -179, -78, 95, -155, -465, -20, -366, -220, 189, 42, 86, 81, 108, -536, -70, 71, -724, -352, 135, 59, -4, 187, -24, -136, -99, 358, -116, -432, 163, 455, 24, 81, 57, -82, -241, 471, 240, -235, 546, 101, -354, -185, 520, -98, -121, 369, 189, -7, 44, 0, -71, 241, 372, -263, 131, 877, 229, 334, 570, 211, -328, 79, 204, 326, -36, 403, -94, 125, 326, 143, 85, 93, 494, -174, -77, 369, 351, 0, 228, -107, 20, -19, 137, 89, -62, 173, -208, -520, -74, 228, 18, 28, 324, -248, -19, 156, -266, -331, -163, -132, -473, -78, 205, -268, -145, -129, -169, -260, 178, 117, -5, -442, -100, -342, -171, 240, -18, -639, -25]
7474b5j74m15L76N92m33k13M41k73J27j90K74k45k66N48l12j04M43K17n47M61
7494B82j23n79L93L26m56j76M56m16l3L28N1k38R7L04l09k12M17k03P8k35O58
7515D10n47K81L85p34J93L34m73l46N15L08l70LK55k75j52N24l9j51K56k64rN7
7537A61K52p1m64K32K50n90O79p3l45k30L74l83L21O1J75m16M05j20m45K91K64
7558C28k16k65L75M3m89K07L00n61K21K26Jj28L32J07m25j79M72n23J47O02l25
7579B50p60O20p9j55L92j37m12j31L67j13J04J0L26m98K26j06k79J88O34n78k97
7600d28M31j46k40N13J40l39l30J1L45k1K16j7j84j53O99m42n3J95n13l71O45
7621d2j45M8L42k90q1j35K40J2J10J14J01n63J27L44m76J53M35j60n43O14N6n06
$$ y = [-25, -199, -614, -238, 354, -79, -292, 149, -124, 3, -187, 87, -158, -424, 124, -188, -292, 151, 368, -179, 282, 159, -420, -27, 299, -157, -333, 123, -293, -326, 2, 53, -185, -88, 216, -93, -305, 112, -91, -13, -248, 410, -137, 144, 529, -205, -12, 322, -151, -497, 18, 326, -44, -41, 214, -61, -213, 311, 272, 121, 377, 113, 104, 161, 413, 342, -122, 110, 360, -230, 449, 376, 31, -199, 175, -208, 113, 174, 349, -67, 338, 218, -227, 64, 328, 112, -153, 222, 265, -224, -17, 283, -278, -57, 169, 170, 42, 374, 481, 56, -123, 349, -174, -27, 575, 250, -510, 110, 31, -124, 268, 131, -281, -412, -45, -158, -54, -44, 282, -216, 10, -96, -375, -187, 447, -131, -428, 3, -143, -383, 130, 270, -69, -399, -388, -43, -64, 152, 135, -49, -202, 497, 55, 2, 197, -316, -687, -42, -187, -139, 203, -87, -168, -303, -63, -51, 59, 173, 274, -289, -162, 182, -294, -141, 294, 134, -409, 205, 261, -245]
7643b45P09k60k05l01M68P9l99L52M01l84n37M57k40j01O47m22j63K75R1k07m0
7664b5M81j07l96M9M8l7K26Q4m1l20M03K3m91N26q8l73J74R4m55L21K64m55k19
7687c14N01O4k56J90J58n43j8M78l55J67M01k30n13M84k16r0k82P66n25L8m1R9
7709c7K46J0k10m70L69L45k39l04K18K77m20L04J90l53k5J81k57j53K46M12m75
7730a45L34k72m52L12L99m32J60Nq7l79M07J98l18r5L92l18j26M22j84j10N26
7751B37m43j25J3M35J26m58L75j8l55J07J93l77K03K71n76J4M64K00n88J95M65
7772C58k58j82J56j70j20K28O1l71J36O14m08p9J61J3k26J33L6l42L64J56n05
7793b45K32M3L76n51N4K58j99K21K96m78K18j69L54p02N20J34m48K18k11q3J94
$$ y = [-245, 464, 204, -1, -302, 166, 245, -154, 198, 599, 215, -322, 135, -105, -206, 441, 19, -144, 131, 222, 15, -25, 456, 349, -47, 2, 50, 13, 239, 323, 282, -38, 365, 388, -103, 423, 335, -38, 136, 230, -225, 96, 360, -95, -314, 187, 251, -5, 185, 343, -200, -218, 260, -95, 72, 473, 243, -270, 214, -2, -92, -374, 392, -133, -95, -136, -37, 209, 219, 9, -461, -92, 253, 14, -290, -72, 205, -215, 89, 279, -74, -99, 82, -175, -328, -82, 330, -145, 189, -83, -535, -223, 176, -256, -96, -91, -178, -557, -150, 48, -270, -365, 27, -291, -417, 5, -179, -289, 237, -206, -331, -318, 117, 243, -215, 160, 142, -213, -106, 87, -290, -87, 184, -392, -378, 86, 286, -302, -107, 358, 100, -82, 74, -96, -216, 12, 73, -298, -162, 452, 44, -35, 126, 139, -87, 46, 82, -260, 104, 260, -245, -13, 30, 406, -145, -91, 167, -32, 189, 485, 7, 225, 56, 410, -292, 228, 362, -86, 132, -79, -162, 32]
7814C2L33k42l88M87K07n50J42M83m64k29K90j70l25N54L58n79K3k8k16J47L21
7835A86j50l0j85L80k07J10Q5j00m09O59m51r3L84k95j87J51M66k15m93M56o9
7856gL3j19J91j80mj49j40N9L22k8j82M38j57j33J95j25k45k83M74L82n63J28
7878i3K53l52jK56O7m00K69M9q8j18J56j59L1K57m34M18J33k03j06l94O07l14
7900a66p0K93k73J68l38Q32l31k76K13l1l5J81J91j30j21K28l55J08nk64L52o3
7922A08j83l31P66J52l33l22M10j88J78K9m89j09N75J0m32L13L30m6k25K01m17
7943cJ15N9J12l98M4J22j61O4K98m5l18L19J80n22j03L89n3l3P8l14J97M1J09
7966A77k29l2J82m24O1L01m9l47L90O3o30J99L55j10J70l0P9n91L21P4k07Q7K74
$$ y = [32, 365, 123, -265, 222, 429, -121, 21, 504, 40, -189, 101, -69, -394, 160, 518, -61, -38, -66, -282, -135, 186, 36, 6, -179, 201, -6, 104, 189, 89, -320, 339, -112, -205, 179, -116, -303, -152, 314, 99, -394, 62, -7, 26, -93, 98, -82, -86, -235, -375, -316, 6, -22, -204, 234, 77, -56, 139, 14, -231, -514, -40, 342, -221, -93, 160, -192, -193, 63, 130, -270, -1, 48, -40, -158, -2, -161, -130, 127, -307, 111, 244, 41, -65, -459, 148, -166, -236, 57, -216, -48, -386, 446, 115, -161, 52, 21, -14, 167, 358, 228, 107, 335, -20, 88, 83, -181, 171, 108, -75, -406, 360, 512, 179, -143, 267, 79, 257, 286, -203, -312, 263, 273, -159, 154, 484, 438, 213, 414, -3, 112, 171, 283, -115, -71, 51, -110, -46, 252, 207, -111, 208, 388, -134, -237, 152, 99, 66, 144, -170, 27, 68, 177, -52, -84, 98, -326, -265, 36, -13, -360, 30, 93, -537, -338, 17, -93, 77, 47, 126, -465, -144, -70, -277, -190, 84]
7989H4j49k6j4L84q32P08j15j69qR0J33j16m5J0J35j78K21k33P1K33k81k08J50
8012a55R0j36N01j24l62K12O0k86M3K17k9j02PJ49k41J28L5j83p5L86P6k31k5
8035d5M18m24p3M01%k46k8L67n08P3M02k45n17O05J47n91K53L84j2k15M9l34K30
8058I1M73l96l85M39l00L00m26K28L16k45j10L41k39p5K96m76J71J54m26J21N57
8079D09l17K51l13j42K00j50K62k29M4m1j15K29R4K32n59M5R2j3L3K47k62j54
8101a57K05m0P0p7k38j76J98j47M25k92J41J42j63J04L08n62J87J74j40m05L02
8122a41j40k46M91R5M4l93M80k13j70K10K27l62K87m0j71j16L36M07p22J46O5
8143G4j65J40K5k81MN33j61l55M00k54k68j03O72l10j91M38k73n1q0K27M2r1M84
$$ y = [84, -65, -91, -105, 279, -553, 155, 40, -129, -137, -47, 86, -30, -75, -65, 70, -108, 113, -120, -49, 184, -97, -305, -155, -65, -201, 300, 176, -186, 26, 86, -200, -157, 60, 31, -71, -64, 85, -156, -28, 7, -176, -251, 135, 211, -20, -45, 373, -51, -124, 277, 277, 31, 3, 370, -138, -65, 337, 92, -425, 180, 327, -264, -11, 373, 361, 146, 195, -139, 91, 564, 168, -217, 222, -78, 222, -204, 24, 340, 95, -15, 326, 87, 12, 308, -168, 3, 157, -269, -148, 409, 92, 343, 30, -112, 88, -62, 200, -29, 15, -26, -141, 88, 182, 414, -145, -100, -8, -21, 12, 259, -3, -157, 48, 8, 78, 1, -237, -413, -215, -362, 63, -229, -88, 54, -109, -5, 303, -259, -72, 102, -38, -443, -141, -281, -527, -36, 59, 103, -290, 190, -23, -193, 17, 244, -118, 169, 129, -42, -158, 178, 585, -137, 9, 74, -91, 49, 74, -207, -203, 330, 169, -186, 214, -40, -308, -411, 261, -49, -240, 198, -75, -126, -206, 21, 63, -28, 456]
8166D56k40k33o0M49m04P8J00l3L6j56K07j52K7q5J06j82L86k99L6K02k74R2J31
8189A88k66R0
$$ y = [456, 216, -17, -77, 372, -32, 46, 146, 113, 149, -7, 200, 48, 75, -10, 96, -86, 300, 1, 37, 239, -35, 57, 188, -78, 12]
8191A2
$$ Imaginary data points
##PAGE= N=2
##DATA TABLE= (X++(I..I)), XYDATA
0@%%%%%%%%%Qj6J6j6J6k1K9l2L7m5N6o4P2q5R8j14J29j45J66j89K13k39K68l00
33a58L35l75M18m65N17n74O36p02P76q60R53j058J173j303J455j628J827k064
51a097K352k709L158l750M568n773P736j1463K0969q7601k15631J40706J78740
64C0205J7938k4717N5352M42q6101m5725N4880K4800p6941o8587P2149J20266
76G3961J3481o0480k5205l6415o4996L2295J28561L4204p6937l5340J2404l6152
88d0619l2073M0947L9740j6220J0553P5060L6948r3311j32536o258J03668L4252
100B0151m9010K7108Q3327k9272q7148K6747O1411o5840r8010L3189J03511M2706
112F8870j8278k6929l1435l8970j0036N3342P0824j2728q3508l0049M2091K4467
$$ y = [0, 0, 0, 0, 0, 0, 0, 0, 0, 0, 8, -8, 8, -8, 8, -13, 16, -16, 21, -24, 32, -32, 40, -45, 53, -61, 68, -77, 89, -100, 113, -126, 142, -158, 177, -198, 220, -245, 272, -302, 334, -368, 408, -452, 501, -557, 616, -687, 768, -860, 967, -1097, 1255, -1454, 1704, -2046, 2522, -3251, 4485, -6978, 13991, -73610, -289241, -148535, 30205, 48143, 23426, 78778, 79220, -6881, -52606, 2274, 27074, -49867, -118454, -46305, 73961, 87442, 26962, 1757, -34658, -99654, -67359, 61202, 95406, 18469, -16871, -4467, -40619, -72692, -31745, 7995, -8225, 2328, 77388, 114336, 21025, -111511, -117769, -14101, 20151, -28859, -1751, 81576, 52304, -34844, -8097, 53314, -12526, -110536, -77347, 26164, 68870, 50592, 23663, -7772, -46742, -56778, -3436, 67388, 54660, -28848, -58897, -16806, 7661]
124G661Q778K7445k0040p2118M617Q3029J0850o1884p485L1607k4109l4591M4234
137b006P2212j2348q6885l4398O6519M7011m9317l0672N4883J2172p5177p623
149d5629Q5305J6240o5990r899M3517r760m5921j15M0563K4034j0063j5125N813
162A2970N6k8310j2923K6103N057k2337K3497M1594j9866l1006K4011j232o7628
175e0014k1292O8676N0566j6298k0691L122p069l0538j5984L4297M3726k1195
187A7306n0425J6443M4727k0804l5725K7759K3949l3427j2725L9844J6866k7870
199E918k7341j5209k783K3835L5451J9400j652k5036l2614p452N071o372J3417
212a5367L4922o086l2227K1779L9833k7597m7034Q682J7642j6529N06L5377J8278
$$ y = [7661, 16439, 43884, 23844, -48274, -43657, 39372, 50222, -11662, -19147, 12460, -11649, -46240, -2006, 70206, 57858, -29027, -63425, 3094, 50105, 788, -29884, 24999, 37171, -38006, -45629, 39676, 55916, -10074, -19973, 23544, 13784, -32137, -32252, 8311, 32345, 22282, 7157, 12970, 13026, -15284, -28207, -2104, 2953, -19384, 4113, 45707, 25841, -5165, 18846, 17614, -50014, -71306, -2630, 47936, 31638, 10947, 14069, 7000, -23538, -39522, -5225, 38501, 17306, -33119, -16676, 28051, 7247, -28478, -719, 23230, -10197, -22922, 16922, 33788, 5918, -21423, -36632, -39415, -15580, 19871, 39271, 37619, 12583, -20031, -27483, -22412, -28784, -15367, 19555, 13469, -18758, 3021, 42854, 15257, -31777, -23095, -5453, -21982, -21476, 13901, 32179]
225C2179k2682l1861k108K9392J2791k3548n335K8351q143m2390N074L8037k876
238F881j6780K1050J3384k0379j1193N783o684q965M707N937P019R377L055M273
252A7465M385k2021l0980J0343K5760n218o28K5227o129l6106L129L2360K31k0019
266b201k873L041J39K916J054L642P117j1689j8083J7667K7823j1834k1724L711
280a294l983j4397J4244K5306l806j0350M308o091j0139N602L297p756K499P078
294D518k711N719Q265j2091r171P732n083j1920J6579J7997j5051j2051J1552
307D284j345j2906N852J0374k874M42j17j0552M7R857n418n150J3067J195j3567
322f811N516R536j2708q578J0952j01n697J1794P742j1487l699J836j0873j221
$$ y = [32179, 9497, -22364, -24472, 4920, 17711, -5837, -11172, 17179, 9036, -33354, -28280, 9757, 6881, -9899, 11151, 24535, 4156, -7037, -1254, -7938, -16903, -12196, -6259, 760, 10137, 13192, 17465, 21850, -171, -31151, -20808, 4952, -266, -894, 24333, 18204, -17902, -14773, 17587, 17818, -2201, -5074, -2033, -1894, 1022, 2076, 5718, 12835, 1146, -16937, 730, 28553, 16719, -5005, -1294, -5277, -19674, -5430, 19876, 16070, 5720, 10028, 3937, -6202, -600, 2697, -5059, -2560, 4518, 1807, 7526, 15791, 3700, -5471, 2261, -2822, -14742, 1837, 19834, 4783, -7268, 4284, 2939, -9967, -4115, 6259, 3385, 3827, 3710, -6842, -6795, 3062, -2356, -7506, 5561, 6756, -6811, -1295, 8241, -4467, -13045, -2093, -2194, -7891, 3903, 11645, 158, -3541, -1705, -12578, -13799]
336a3799J4861K752n689N410j609j1893M391R565j0245m674J2757p73q861Q367
350E60M780j1535j932P642m183N08J1600l584j3044L845L449p115N643J2443o929
365B148o457Q292l083j0224N827M522p870M074J1220n421n136Q803m505j2877
379a0687O067P886n483K486J0131p380o581P443j759q926P665O683q426J378R279
394I776p757o641Q911j188r239P940Q898p692o40O590p927q130Q836J817o472
409b918P936O743q706j771O571p875p392R057J747p027Q645R012r541m879M876
424D478p460o317J0441M775n483O151M094j1046m273P221n935n709J1433M666
438G036p109M809N632j2807o832O572k655j818J2433N550r291l22J083j2572j913
$$ y = [-13799, 1062, 3814, -1875, 3535, 1926, -9967, -5576, 3989, -6256, -10930, 1827, 1054, -7807, 560, 5340, -6195, -8127, -485, -4668, -4160, 7440, 3856, -9188, -5343, -1894, -9009, -3366, 9077, 2148, -4309, 3983, 900, -9324, -3497, 1025, -6845, -2771, 8449, 3028, -2108, 6695, 2190, -10687, -4620, 3266, -2217, 269, 10400, 3020, -3561, 3882, 2123, -6803, 862, 7545, -881, 497, 9776, 2019, -4622, 4289, 3101, -6138, 1802, 10700, 3008, 2368, 8958, 1031, -7099, 1737, 3554, -2918, 5018, 11761, 3055, 1284, 7855, -20, -7412, 1645, 3392, -3635, 5010, 14022, 4481, -398, 4478, -2982, -9299, 1142, 5917, 434, 6585, 10679, -367, -4640, 2581, -3354, -9063, 2370, 7036, -73, 4736, 10368, -2439, -9271, -2699, -5354, -7172, 5261, 10811, 1520, 1198, 2281, -10291, -12204]
453a2204J1402J25l088J0307J929j1523m9L623j0172l205J1542K047k661R394
467G467J761j4453l648L577o756K564J4770J026p161L976j430j2712J869Q184
481i66n507m52J2029l6p391N070j80j3184p15R242j591J891J1940k433j1738J043
497b978J70q512N233J1189l782k156R196l945j0140M249K522r110K297J1193k012
512C414j420Q134m964j2403K300M327m924N544J2234m840o497M064m028q245O242
527a062N250n896L294R463n755n098O773m750j1773O152R756l883J437Q256n327
542F837r977J679l09k722P618N117o087J687M888j0480n230J1141q08j1079P671
557e4J1716p673n337O521l430r610K757N416J944M955r05r511M49N817q351j754
$$ y = [-12204, -802, -677, -3765, 6542, 8471, -3052, -3101, 522, -9650, -12855, -1313, 734, -1927, 7467, 9228, -5225, -8873, -5296, -12052, -9488, 5282, 6308, -853, 3123, 1693, -11019, -9150, -966, -6473, -6925, 5104, 5068, -2323, 2747, 2567, -10617, -11332, -2090, -3681, -1790, 10150, 7717, -4021, -2978, -2808, -11320, -6087, 5102, 1320, -836, 8360, 4415, -5725, -1476, 1046, -8064, -5767, 5426, 3414, 1994, 10128, 5164, -7239, -4939, -612, -5536, 8, 12242, 7402, 905, 4969, 941, -7304, -1062, 4188, -1708, 1586, 11049, 5294, 196, 6969, 2219, -9554, -3402, 6354, 2471, 3908, 12164, 6837, -3140, -1461, -1770, -4492, 3126, 8243, 2156, 3843, 8731, -1749, -6979, 4162, 3354, -7725, -54, 11662, 3989, -1348, 5173, 1743, -7867, -5110, 306, 2250, 7205, 6300, -3211, -2762, 3055, -5296, -7050]
573g050J3240j053j3525O584J2106j0571q859Q463J408o966M814O246l522k302
587i87k383n269N619P800p695l438J0736k139j1911O469Q800j1323n311J3655
601B623K234j0107J342M363n155J42N364j504j156R69m206L92Q573l366r836P099
617b229P118q793m7J2545p431j6575R181J3619m788l772L999l716n950M203N166
632B530J021j223p057l084J2752N821j3266k301R377p930q333J8683J2294j8799
646D85j0945J0325L544n840L487N508l215m283r38M789P394o390j5602O268J7426
661A2013o926j1497J3950O628k0431n107J9338K498j4638M98J0936P93n498l958
675a401j233L883L31l982P786Q909j3233j2216J3534P901j4909j979J3972m011
$$ y = [-7050, 6190, 5137, -8388, -1804, 10302, -269, -9128, -665, 743, -6223, -1409, 4837, 1315, -987, -3370, -8639, -3020, 4780, -2915, -6353, 4383, 2244, -9667, -3198, 5602, -5721, -11032, 2623, 4857, -5250, -3908, 455, -4700, -4558, 806, -698, -1854, -885, -5091, -4699, 3874, 508, -9328, -2229, 4889, -3904, -3951, 8594, 1163, -15412, -6231, 7388, 2600, -1172, 2827, -889, -6839, -2636, 2530, 3551, 2328, -4729, -7813, 4939, 10760, -2506, -4807, 4570, -3360, -11693, 6990, 19284, 485, -10460, -135, 3409, -2431, 1056, 6564, 3349, -934, -1872, 2917, 10311, 3921, -11681, -5413, 12013, 5087, -6410, 7540, 14168, -6263, -11370, 7968, 10466, -4172, -3674, 7262, 8055, 2557, -1401, -2634, 1249, 1580, -2402, 5384, 14293, 1060, -11156, 2378, 10279, -4630, -6609, 7363, 3352]
689C352r010J2021Q004j5053j1026N324O656K639K317m65k55m395j0307K092J6868
704H762j568j7836N668J7591q267j4264R647N344j5294k155J6883N024p417k390
718b72l47l473l775k214O098J1373k060r148N874L109j8240n127K3311N154j9724
733i461K297J7968p136j6556P506J0849r173j1207Q216J8640N123j8325j5906
746a7165J0337Q135j2643K611K7069n97l0479l118K1931j562j5830N462J1270
759E421l044l280M439K046n123r437k557J2847Q799p804k541R122p659j5440J0025
774d186J4139j1920n520K0831O486k2568j1213R777M643j640N096R043L31j3411
788a12j4854R096K0483o053j9009P554J5576p591o213J1686m067k1648O90K1150
$$ y = [3352, -5658, 6363, 14367, -686, -11712, -6388, 268, 2907, 5224, 4759, 4504, 109, -10198, -8106, 8762, 7194, -10642, -4974, 12617, 4350, -9914, -267, 5077, -10217, -12372, 4511, 9535, 2118, -272, -619, -4092, -7867, -10081, -3983, 7390, 5330, -3818, 2056, 5165, -13075, -18202, 5109, 10263, -9461, -7164, 10804, 3668, -12888, -5382, 5467, -3706, -14913, -6697, 11943, 17066, -1259, -17165, -6828, 1307, -11336, -8725, 18344, 17747, -12732, -15850, 6081, 4519, -11311, -5849, 5421, 2377, -903, 3536, 5582, 459, -8978, -11535, 1312, 10111, 2307, -234, 8888, 1229, -14211, -4186, 9953, -1967, -7487, 13344, 19830, -2738, -13951, -4174, 469, -1171, 3925, 12968, 13299, -112, -14966, -5870, 14613, 8560, -10449, -2895, 12681, 5090, -1123, 10563, 6496, -15152, -14462, 6688]
802F688R147j990m161j3158j2493M006J4048J0726J551j1123p984P119J189j2014
816h449L869J3955j0358j2903K2135K0205k2115k5468P635J2981m211j477J2180
829G979Q837q516j8643m362J5076K879j5795M899K6209r22k3512l788O684q135
843a1110j904J7995Q600r134n380r45l797o48J228j168K109M426L835Q232O46
858A2985k1837j7903J3220J5427l157O688J6311j2205k9161j060J9350N760n511
871a093k318L286N449j307q321P21M840j0131q907J7906J9415p348j3789l483
885e080p776k815J4734J1938k859j245o82j1997p383Q553O443k239o39M592M958
900H503K782r631j4373N279J1649p307l771J8968P504k0338r778J1439K072q900
$$ y = [6688, 15835, 13845, 9684, -3474, -15967, -11961, 2087, 12813, 14364, 3241, -4743, 2376, 3565, -8449, -4580, 9375, -983, -13886, 8249, 28454, 6339, -19129, -11494, 1487, -2724, -4201, 7979, 16816, 8300, -10343, -14705, 371, 3250, -12545, -7646, 18563, 17641, -5871, -9659, -2975, -11110, -13014, 4981, 13581, 4447, -933, -1878, -5675, -6323, -5095, -6263, -4154, 272, 4107, 12339, 12985, -8852, -26755, -13535, 1892, -1265, 5423, 21734, 9529, -19632, -20692, -1342, 4418, -1093, -3411, -125, 5324, 4017, -4304, -3583, 1257, -8874, -17781, 125, 19540, 12192, -1597, -5080, -12856, -15671, -937, 11001, 8142, 6897, 6215, -5782, -13165, -4612, 1831, -408, -1047, 3545, 8503, 11285, 1654, -12719, -7440, 4209, -3098, -6869, 12099, 19603, -735, -10513, 926, 2998, -5902]
914e902J749R000O639K7j0546j0111L906M686k497Q076J3134p363j6953K29M659
929a267k176M730N862p703l124J2703M670j0116o083k586n319K282J2108R157
943A3138K767q220j8359m852J7401P750j0107q96Q547p096q933R807Q359p426
957A880p280n58L401R095L050j0722o124M496j233l364R786P638p042n247J201
972a023l302j613N977k065n145Q434O990r209m967O801O4n150O82O73j478K958
988a373J208k601O824M032j3168q463J1423O455o916j23L675m986j641P020K289
1003C655j838m30o802o454R235J0011m102m964J059m210j609Q714L567m630p02
1018E00r58p605K653J1687k252r032K946M785j587K065K059n635l943J296k722
$$ y = [-5902, -4153, 4847, 11486, 11513, 967, -9144, -5238, -552, -3049, 5027, 18161, 10798, -6155, -5926, -1267, -3443, 1287, 7149, -554, -3678, 9025, 13695, 3579, -2504, -5090, -10409, -8127, 3981, 13138, 15905, 7685, -10674, -15526, 1875, 9625, -482, -1378, 7169, 73, -8860, 947, 9306, 1880, -5400, -5958, -2557, 6538, 9588, -1134, -7258, -2762, -3995, -7359, 2427, 10065, 3023, -2224, -1023, -4325, -5938, 39, -2026, -7171, 1263, 8253, -956, -5923, 878, 942, -4208, -3526, -2853, -4331, -1373, -165, -2766, 4058, 8090, -5078, -13541, -2118, 4337, -2579, -2702, 973, -4013, -5654, 1366, 3655, 1817, 1387, -5415, -11869, -2634, 7377, 3275, -1689, -630, -4840, -6449, 2265, 5832, 1202, 500, -458, -8063, -5410, 6277, 4025, -5007, -2061, 2724, 1137, 3202, 5261, -374, -4317, -3021, -5743]
1033e743K516J2073J339j0048r08M270n416l626O902J345k835L757P31m318K263
1048B302K881o658j483P043j196n253N014L038n588l20K858l874J295P870k409
1063E520o394K257k71p911K984R881l99k469K157l765m924M093J003o545K339
1078b444N630k507j20P642k094r313q87J699l254N448P044l682m663K828l248
1093a921m381O056M544n354m15M560m102l087L933j603m961N478M861l590J587
1108A605L583p473p193L558J765j221P947N442n559k863O52o398m036O395K707
1123a089k109N444M135o118k174K377n603m174O401L526j335M670K311q398l355
1138e491K982k337n78Q624K875n892O11J143p268j330N894k54n96P253J248o217
$$ y = [-5743, -3227, 8846, 10185, 137, -771, 3499, -1917, -5543, 1359, 2704, -131, 3626, 4357, 39, 2302, 5183, -1475, -2958, 4085, 2889, -2364, 2650, 5688, 100, -220, 2638, -1236, 59, 7929, 5520, -874, 1383, 1112, -6799, -3815, 6066, 5667, 3198, 5355, 1590, -3334, 759, 1762, -4783, -2444, 3186, 679, 559, 8201, 6107, -3206, -4093, -2394, -5648, -200, 6844, 3162, -1501, 1327, -1921, -6302, -246, 4298, -1056, -1471, 3089, -1013, -4100, -167, -1770, -6731, -1253, 3608, 18, 1605, 5188, -2285, -9478, -5920, -4155, -5376, 2571, 8013, 2454, -409, 243, -6155, -10191, -3796, -1089, -3198, 2246, 6381, 263, -1911, 466, -5137, -9311, -2910, 616, -719, 3951, 6262, -2136, -5491, -2509, -4846, -5424, 3200, 6075, 183, 794, 1937, -5331, -6661, -767, -1021, -1617, 5636, 6884, 667]
1154F67l03Q6p332p33Q309J414q23O453M15q183k004Q69m798J244Q043J52j501
1171A975N627r31q253k04L065n147j7P806N64k598L936l90p193n45L033l020R17
1188a375P563j086m107L490o12p315L23M378k778N13Q227L7n843J206j451p605
1204f435N80O521N9K123O133k651o782O68k454p111K439Q805M52J400O537l469
1220F815j0226k141j066l951O305J0297L3j093K447o199j0758J082L468j973N726
1235a234R102j025l867k08p829p885M181N729M30P341P883o813r786r55l373m927
1251a3236P218R745J555J255J023q144p556P63j562q63J0307P958k690l20Q67
1266F320j1077r097N050M948J442P673O496o089n801j665n423k645O558M016R74
$$ y = [667, 364, 450, -6882, -7615, 694, 2108, 1285, 7738, 8153, -30, -2034, -1165, -5963, -4719, 3324, 3476, 1975, 7602, 6671, -1582, -1786, 1279, -3868, -3885, 3921, 4485, 1887, 5823, 5433, -1760, -2305, 728, -2292, -1375, 6188, 5102, 995, 4485, 3873, -3442, -3119, 1259, -1519, -1006, 7221, 7258, 1415, 2621, 1170, -6435, -5855, 666, 725, 2848, 8981, 6330, -452, 216, -2238, -9349, -6910, 1895, 2347, 3747, 10284, 6815, -3411, -5552, -6618, -10569, -4264, 6033, 6066, 4973, 7420, 1221, -9537, -8455, -4987, -6960, -1234, 7868, 6843, 2976, 2768, -5061, -12946, -8765, -3036, -2606, 4735, 12618, 5805, -3981, -4936, -8309, -13236, -6018, 3727, 5282, 6537, 7560, -584, -8140, -7377, -8939, -9802, 505, 8463, 5773, 5453, 6320, -4757, -13854, -8804, -3856, -2414, 5259, 11755, 5666, -135, -1800, -7223, -9868, -3310, 706, 1680]
1281A680O428J826r416m234J841m263j891R763N390l012J498Q86q136m786L028
1296c398k96J214Q992L139n246j527j334o102l17O488n79j447O576O93o028J765
1312B593J037q397k368Q506K846k320M357M98p681k308L276r05L89L500j967j034
1328B2N315r83p095K590K847p224j13J0365p8o798J817L441n752k411L838N7n07
1345f69K713j208q70L289l259o006M541N439p144j968Q834rp122K899L252o465
1361c753k750N146K029J21J733k835l413K650n12l588M488L983o645j191Q039
1376C502j026p096K030L192n891O78P337m11m013J472o25l912K438K497k359J380
1392h07L228l971j291N353k705n269N274L153o657J090P609l903n692M632K445
$$ y = [1680, 8108, 9934, 518, -3716, -1875, -6138, -8029, 1734, 7124, 4112, 5610, 6496, -1640, -6426, -3398, -3694, -2480, 6512, 9651, 4405, 2878, 1544, -4558, -4875, 1613, 1034, -413, 6163, 6856, 828, 2593, 3630, -4767, -7135, 1371, 4217, 1897, 6254, 6752, -929, -3237, 39, -866, -477, 3023, 1056, 22, 5337, 4354, -2741, -151, 2696, -4528, -4641, 5724, 5646, -1152, 665, 4106, -1646, -4057, -219, -162, -669, 2044, 836, -34, 3255, -4, -6010, -1469, 3970, -3174, -5142, 3692, 3683, -3439, -540, 2712, -3753, -6503, -1357, 672, 793, 2526, -309, -3722, -1072, -1584, -5172, -684, 3299, -3346, -4537, 3502, 2476, -4620, -2590, 602, -5289, -4611, 2726, 2315, -1698, -226, -851, -4763, -2325, 172, -2187, -807, 2421, -1550, -2841, 2512, -193, -5462, -188, 2965, -3692, -2602, 5007, 1104, -4588, 44, 2489]
1407B489n320K36M418n95o29Q55l343O84L255k637j790O643K89r092J500R156
1423F119m382o270O490L346p256q97O359J85k920o11j038J278L260k537k536N598
1439D188j82q414K828R280m637p414N727L965o938k45O563r74m213Q6P80P56J855
1456C011k045k671M025J079o394K251P011m759n783N476K420o396J374O367l361
1471A605l966K826P21k782J901R40k617J577J675l907J205L529m742k724O124
1486A365J157o159K596N698o633m386O295J234m861K525L798k994j685Q96j620
1501b774M6K704j785j66N117k298o969M013N745o382m065P761J394o357K827N190
1517D001m094n212J674J273J999K917j844k459K392k207m499N728N671p392l614
$$ y = [2489, -2831, -2595, 1823, 1228, 599, 1454, -1889, -1205, 2050, -587, -2377, 4266, 4555, -4537, -3037, 6119, 1737, -4533, 1957, 5303, -1953, -2850, 3509, 3694, 774, 163, -875, 403, 3663, 1126, -1410, 4188, 4006, -4408, -1580, 7700, 3063, -4351, 1376, 5341, -1597, -1842, 4721, 3747, -466, -380, 400, 1156, 3011, 966, -1705, 2320, 3399, -2995, -744, 6267, 1508, -4275, 1201, 3621, -2775, -1401, 4966, 1605, -2361, 465, 1186, -1596, 305, 1245, -1372, 205, 1880, -2027, -822, 2707, -2035, -4759, 1365, 2522, -3637, -1041, 4657, -1976, -6362, -67, 1167, -3694, -1169, 2629, -365, -2050, -1154, -2774, -2728, -24, -1809, -1975, 3142, 844, -6125, -2112, 3633, -2749, -6814, 947, 2341, -4016, -1189, 4001, -93, -5305, -3631, -2358, -359, 2558, 714, -1745, 647, -1560, -6059, -331, 5340, -2052, -5666]
1532e666P817J526o274K207L150n654k366N823K772j163N35k853k714K677R24
1547G41k607L527L123o222j717P852k24q085K256M800m469q25N904m99m097J578
1563A036O16k408J583P07k949J965L883l087j740M174k234n031M861L314n781
1578a091q62O057j297m482M786J463o262j935L836R15J457K127l442k394K739
1593A615k932l239O311L030o957l91P647p72o726J354O74m924J446O691J554q46
1609C535m77n582m305M152J557j523M792K499n552j123M961l841o351L727L279
1624b52k783L259P010l728o975j009j654J64N523K903j336K030J41p684k048N365
1640a074j750l479O827M966l820j735P79m750k453M003J019n52N146K113n452
$$ y = [-5666, 2151, 3677, -2597, -390, 2760, -2894, -5260, 563, 3335, 2172, 2707, -146, -2860, -183, 741, -1866, 1661, 4784, -1438, -3155, 4697, 4473, -3612, -1356, 3444, -1025, -1850, 4054, 3555, -542, 1036, 1652, -756, 827, 1534, -1415, 550, 4433, 1346, -394, 3780, 1546, -3485, 1376, 4690, -1091, -1953, 4104, 2807, -1675, 3111, 4574, -1688, -3623, 213, 1128, 2585, 4712, 1270, -1124, 1615, -1317, -4556, 1755, 4785, -2172, -2563, 5084, 4312, -2414, -1060, -386, -5310, -3864, 2827, 4381, 3535, 3058, -2524, -6829, -2677, -1120, -2643, 2149, 4648, -904, -2027, 2934, -907, -7258, -3531, -252, -3035, 224, 7234, 3506, -3469, -4478, -6132, -5968, -445, 2458, 1122, 3152, 3293, -4391, -6439, -1074, -2824, -6303, 524, 5490, 1670, -65, 714, -4036, -6489, -2486, -1467, -2019, 3127, 5240, -212]
1655b12q49J474n454k322N760K744Q58L916j451q354n47M287k195p81O727L57
1671C958n737J692L718k976j894O4l006J267P680R08l892J057k227o693K069Q029
1687D017m78l023K459j110l366L329K873n583j806L566j068J42N914qn815j058
1703a015O24k275K887M350l613j741N018n04n755J752L073m428q14M944K83j181
1719A605J685j891l442K092J369m812J089O549j220k906K172j197n937J611M037
1734H04r76R25L765m552m082M554Q95m584R61K955k584J008M582j440m073M49
1750a393k459k755O095O146m367k796J714k502l101M227K796l590J004J473k362
$$ y = [-212, -1061, 413, -5041, -7363, -1603, 1141, 1999, 5915, 4464, -3890, -4437, -150, -2345, -3126, 3601, 3958, -1779, -87, 3631, 655, -1239, -1175, -4181, -2914, 4766, 5674, 1782, 2839, 612, -6081, -4012, 4017, 3539, 516, 2975, 1865, -1501, 1828, 4701, -882, -2688, 878, -190, -48, 5866, 5858, 43, -1015, -391, -2666, 221, 4571, 958, -783, 4235, 3731, -2024, -272, 2801, -1627, -2441, 2503, 2786, 1605, 3290, 1399, -2043, 49, 1418, -3394, -2305, 4244, 3024, 118, 2290, 1093, -4844, -3233, 804, -172, 753, 4518, -34, -4116, 438, 1333, -3251, -2290, 665, -1919, -911, 3671, 2231, -1842, -1393, -3852, -6607, -512, 5634, 1267, -1529, 185, -2317, -5418, -1191, 1605, -1985, -981, 492, -1870]
$$ [...]
8191C17
##END NTUPLES=NMR FID
##END=
