##TITLE=1H_Ser DNG-CO-Gli
 CDCl3, 8 sc, 
 14.3.2019
##JCAMPDX= 6.0         $$ Bruker NMR JCAMP-DX V2.0
##DATA TYPE= NMR FID
##DATA CLASS= NTUPLES
##ORIGIN= UXNMR, Bruker Analytische Messtechnik GmbH
##OWNER= root
$$ XWIN-NMR		Version 3.5
$$ Thu Mar 14 15:18:47 2019 Russian Standard Time (UT+4h)  she@DPX200
##.OBSERVE FREQUENCY= 200.1315
##.OBSERVE NUCLEUS= ^1H
##.DELAY= (6, 6)
##.ACQUISITION MODE= SIMULTANEOUS
##.ACQUISITION SCHEME= undefined
##.AVERAGES= 8
##.DIGITISER RES= 18
##SPECTROMETER/DATA SYSTEM= spect
##.PULSE SEQUENCE= zg30
##.SOLVENT NAME= CDCl3
##.SHIFT REFERENCE= (INTERNAL, CDCl3, 0, 15.7039)
##AUDIT TRAIL= $$ (NUMBER, WHEN, WHO, WHERE, WHAT)
$$ ##TITLE= Audit trail, XWIN-NMR		Version 3.5
$$ ##JCAMPDX= 5.01
$$ ##ORIGIN= Bruker BioSpin GmbH
$$ ##OWNER= she
$$ F:/spectra/data/she/nmr/H-F/1/audita.txt
$$ ##AUDIT TRAIL=  $$ (NUMBER, WHEN, WHO, WHERE, WHAT)
(   1,<2019-03-14 15:17:05.26 +0400>,<she>,<DPX200>,
      <created by zg, POWCHK disabled, PULCHK disabled
       configuration hash MD5:
       00 E9 B6 7A A2 85 ED C7 34 08 36 98 17 FE 4E 26
       data hash MD5: 16K
       8C 5B 31 42 2D 5F D2 45 59 BB 7E 6E 20 77 5E DF>)
$$ ##END=
$$ 
$$ hash MD5
$$ 62 29 BD F4 22 B4 37 31 ED 45 D7 99 07 4C D9 2E
##$RELAX= 
##$RELAX= 
##$RELAX= 
##$RELAX= 
##$RELAX= 
##$RELAX= 
$$ Bruker specific parameters
$$ --------------------------
##$DU= <F:/spectra>
##$EXPNO= 1
##$NAME= <H-F>
##$PROCNO= 1
##$TYPE= <nmr>
##$USER= <she>
##$AMP= (0..31)
100 100 100 100 100 100 100 100 100 100 100 100 100 100 100 100 100 100 
100 100 100 100 100 100 100 100 100 100 100 100 100 100 
##$AQSEQ= 0
##$AQ_mod= 1
##$AUNM= <au_zg>
##$AUTOPOS= <>
##$BF1= 200.13
##$BF2= 200.13
##$BF3= 200.13
##$BF4= 200.13
##$BF5= 200.13
##$BF6= 200.13
##$BF7= 200.13
##$BF8= 200.13
##$BYTORDA= 1
##$CFDGTYP= 0
##$CFRGTYP= 5
##$CHEMSTR= <none>
##$CNST= (0..31)
1 1 145 1 1 1 1 1 1 1 1 1 1 1 1 1 1 1 1 1 1 1 1 1 1 1 1 1 1 1 1 1 
##$CPDPRG= <>
##$CPDPRG1= <>
##$CPDPRG2= <>
##$CPDPRG3= <>
##$CPDPRG4= <mlev>
##$CPDPRG5= <mlev>
##$CPDPRG6= <mlev>
##$CPDPRG7= <mlev>
##$CPDPRG8= <mlev>
##$CPDPRGB= <>
##$CPDPRGT= <>
##$D= (0..31)
0 1.2 0 0 0 0 0 0 0 0 0 0.03 0 0 0 0 0 0 0 0 0 0 0 0 0 0 0 0 0 0 0 0 
##$DATE= 1552562224
##$DBL= (0..7)
120 120 120 120 120 120 120 120 
##$DBP= (0..7)
150 150 150 150 150 150 150 150 
##$DBP07= 0
##$DBPNAM0= <>
##$DBPNAM1= <>
##$DBPNAM2= <>
##$DBPNAM3= <>
##$DBPNAM4= <>
##$DBPNAM5= <>
##$DBPNAM6= <>
##$DBPNAM7= <>
##$DBPOAL= (0..7)
0.5 0.5 0.5 0.5 0.5 0.5 0.5 0.5 
##$DBPOFFS= (0..7)
0 0 0 0 0 0 0 0 
##$DE= 6
##$DECBNUC= <off>
##$DECIM= 24
##$DECNUC= <off>
##$DECSTAT= 4
##$DIGMOD= 1
##$DIGTYP= 9
##$DL= (0..7)
0 120 120 120 120 120 120 120 
##$DP= (0..7)
150 150 150 150 150 150 150 150 
##$DP07= 0
##$DPNAME0= <>
##$DPNAME1= <>
##$DPNAME2= <>
##$DPNAME3= <>
##$DPNAME4= <>
##$DPNAME5= <>
##$DPNAME6= <>
##$DPNAME7= <>
##$DPOAL= (0..7)
0.5 0.5 0.5 0.5 0.5 0.5 0.5 0.5 
##$DPOFFS= (0..7)
0 0 0 0 0 0 0 0 
##$DQDMODE= 0
##$DR= 18
##$DS= 0
##$DSLIST= <SSSSSSSSSSSSSSS>
$$ [...]
##$SUBNAM2= <"">
##$SUBNAM3= <"">
##$SUBNAM4= <"">
##$SUBNAM5= <"">
##$SUBNAM6= <"">
##$SUBNAM7= <"">
##$SUBNAM8= <"">
##$SUBNAM9= <"">
##$SW= 24.9337058887773
##$SWIBOX= (0..15)
0 0 2 0 0 0 0 0 0 0 0 0 0 0 0 0 
##$SW_h= 4990.01996007984
##$TD= 16384
##$TD0= 1
##$TE= 0
##$TE2= 300
##$TE3= 300
##$TEG= 300
##$TL= (0..7)
0 120 120 120 120 120 120 120 
##$TP= (0..7)
150 150 150 150 150 150 150 150 
##$TP07= 0
##$TPNAME0= <>
##$TPNAME1= <>
##$TPNAME2= <>
##$TPNAME3= <>
##$TPNAME4= <>
##$TPNAME5= <>
##$TPNAME6= <>
##$TPNAME7= <>
##$TPOAL= (0..7)
0.5 0.5 0.5 0.5 0.5 0.5 0.5 0.5 
##$TPOFFS= (0..7)
0 0 0 0 0 0 0 0 
##$TUNHIN= 0
##$TUNHOUT= 0
##$TUNXOUT= 0
##$USERA1= <user>
##$USERA2= <user>
##$USERA3= <user>
##$USERA4= <user>
##$USERA5= <user>
##$V9= 5
##$VALIST= <valist>
##$VCLIST= <CCCCCCCCCCCCCCC>
##$VD= 0
##$VDLIST= <DDDDDDDDDDDDDDD>
##$VPLIST= <PPPPPPPPPPPPPPP>
##$VTLIST= <TTTTTTTTTTTTTTT>
##$WBST= 1024
##$WBSW= 4
##$XGAIN= (0..3)
0 0 0 0 
##$XL= 0
##$YL= 0
##$YMAX_a= 193515
##$YMIN_a= -320751
##$ZGOPTNS= <>
##$ZL1= 120
##$ZL2= 120
##$ZL3= 120
##$ZL4= 120
##$ABSF1= 10
##$ABSF2= 0
##$ABSG= 5
##$ABSL= 3
##$ALPHA= 0
##$AQORDER= 0
##$ASSFAC= 0
##$ASSFACI= 0
##$ASSFACX= 0
##$ASSWID= 0
##$AUNMP= <proc_1d>
##$AZFE= 0.1
##$AZFW= 0.1
##$BCFW= 1
##$BC_mod= 2
##$BYTORDP= 1
##$COROFFS= 0
##$CY= 11.3945322036743
##$DATMOD= 1
##$DC= 2
##$DFILT= <>
##$DTYPP= 0
##$F1P= 18.9103706918063
##$F2P= -1.10871071338519
##$FCOR= 0.5
##$FTSIZE= 0
##$FT_mod= 4
##$GAMMA= 1
##$GB= 0.15
##$INTBC= 1
##$INTSCL= 1
##$ISEN= 128
##$LB= 0.24
##$LEV0= 0
##$LPBIN= 0
##$MAXI= 10000
##$MC2= 0
##$MEAN= 0
##$ME_mod= 0
##$MI= 1.114404
##$NCOEF= 0
##$NC_proc= 0
##$NLEV= 6
##$NOISF1= 3.799351
##$NOISF2= 2.8
##$NSP= 1
##$NTH_PI= 0
##$NZP= 0
##$OFFSET= 15.70392
##$PC= 1
##$PHC0= -9227.759
##$PHC1= 23.60026
##$PH_mod= 1
##$PKNL= yes
##$PPARMOD= 0
##$PSCAL= 0
##$PSIGN= 0
##$REVERSE= no
##$SF= 200.130013532006
##$SI= 16384
##$SIGF1= 3
##$SIGF2= 2
##$SINO= 400
##$SIOLD= 16384
##$SREGLST= <1H.CDCl3>
##$SSB= 0
##$STSI= 0
##$STSR= 0
##$SW_p= 3612.71676300578
##$SYMM= 0
##$S_DEV= 0
##$TDeff= 0
##$TDoff= 0
##$TI= <>
##$TILT= no
##$TM1= 0
##$TM2= 0
##$TOPLEV= 0
##$USERP1= <user>
##$USERP2= <user>
##$USERP3= <user>
##$USERP4= <user>
##$USERP5= <user>
##$WDW= 1
##$XDIM= 8192
##$YMAX_p= 0
##$YMIN_p= 0
$$ End of Bruker specific parameters
$$ ---------------------------------
##NTUPLES= NMR FID
##VAR_NAME=  TIME,          FID/REAL,        FID/IMAG
##SYMBOL=    X,             R,               I
##VAR_TYPE=  INDEPENDENT,   DEPENDENT,       DEPENDENT
##VAR_FORM=  AFFN,          ASDF,            ASDF
##VAR_DIM=   8192,          8192,            8192
##UNITS=     SECONDS,       ARBITRARY UNITS, ARBITRARY UNITS
##FACTOR=    0.0002004,     1,               1
##FIRST=     0,             0,               0
##LAST=      1.6414764,     0,               0
##MIN=       0,             -320751,         0
##MAX=       1.6414764,     193515,          0
$$ Real data points
##PAGE= N=1
##DATA TABLE= (X++(R..R)), XYDATA
$$ [...]
3994C827M628k1527P245J9750j4740p508J7816q192j8120J7627J1165j8192M773
4007a448J4398j8330r658K1641j239j5404J5256O776k3180L056J9210j2748p301
4020h971J9350n417k0034J5018J1712j7498L100J7111j7215j2683K0489N39j4866
4033i365J5200R284k3612q67J8234j1683p661K2034j955k1495J1038J1012j7844
4046g680K491J9833j3893j4315J8715Q61j6980J4406J2057k1860l455J8021j0219
4059b018r483K2514J394k2034P550J0697j8096J492K2877j0169j5094J6239J09
4072E978j9547J2624J5622j8891l746J7575r810j2707K0662M241k0878O273J2093
4085I489j8938p57K3240p225j5265J5107Q19k1067J0448J7392j5840m373J8062
$$ y = [3827, 8455, -13072, -5827, 13923, -817, -8325, 9491, 1299, -16821, 806, 11971, -6221, -1448, 12950, -5380, -15038, 6603, 5364, -10040, 5216, 11992, -11188, -8132, 11078, -1670, -8971, 10379, 4962, -15072, -54, 11658, -5840, -2740, 14371, -2844, -15527, 4962, 5501, -9365, 5835, 15119, -8493, -9360, 8874, -2809, -10470, 11564, 9609, -11886, -848, 10164, -7680, -5189, 14644, 751, -13564, 5151, 6012, -10968, 3438, 15495, -6365, -9820, 8201, -2018, -11501, 11013, 12407, -9627, -2077, 8620, -9476, -7984, 14893, 4724, -10370, 5869, 5978, -13569, -945, 14677, -4214, -7960, 9615, -195, -12902, 7760, 12001, -8877, -2604, 9489, -9449, -10206, 13034, 5809, -9456, 5651, 6470, -14597, -4149, 13243, -2597, -6970, 11092]
4098A1092j0932j5867J9209P223j9078P042J3352j9495n146K2126m914j4994J5896
4111E514L167k2202P193J8371j4056n258J8665r329j8070J6682Q925j7570P105
4124h63J5076j9250q785K0532k984j4710J6470O302k2895L228J7979j2791n785
4137h476K0542n964k0169J3054R408j7571O071J8116j6323j1176J8641k329j5728
4150a1904J5794R778k2165L43J7524j2285p324K2174k794k1022J0854R156j7952
4163i823M354K0736j3022j3048J6871j866j7422J5007J2850j9722j664J7044j3094
4176b799r774K1777J465j9826R273R698j9470J771K1814j0283j3493J6109r07
4189E355j9542J3140J5745j7781k318J6612j3247j2785K0620M779j8751R114J0998
$$ y = [11092, 160, -15707, 3502, 10725, -8353, -1311, 12041, -7454, -12600, 9526, 4612, -10382, 5514, 8681, -13521, -6328, 12043, -2013, -7271, 11394, 2065, -16005, 677, 9602, -7968, -863, 14213, -5037, -13822, 6710, 3726, -10984, 5486, 11788, -11107, -7879, 10100, -2691, -8476, 12066, 6102, -14067, -1013, 8395, -9176, -3105, 15011, -1312, -12488, 6153, 3824, -11904, 3890, 13668, -8497, -8154, 9370, -2915, -10239, 11935, 9141, -11881, -1027, 8129, -9823, -5469, 15267, 2245, -10803, 6068, 4202, -13220, 1787, 14637, -5085, -6749, 10295, -2799, -12573, 9204, 10669, -9157, 116, 9814, -9656, -7885, 13929, 3646, -9847, 6262, 5355, -14187, -1047, 14698, -3083, -5401, 11211, -2036, -14821, 5799, 10578, -8173, 941, 11939]
4202A1939k0369k317K2080p575j3242J6382N26k1250R840J6534j5837k502J7722
4215A1931j1755j5696J8843O197j7869Q554J2727j9816n617K1591n466j3269J6997
4228G352K482k2620O058J7288j4384l135J9818r533j8045J5841O913j7749Q425
4241a289J5293j8586p903J9303m253j3524J7390N985k2891L327J6061j3724m526
4254i337K1597o085j9240J3819O623j8203P248J8404j6140j0108J7950m190j5370
4267a3032J7293R126k1114J346J5894j4123o397K1871k468j9470J1786P432j9050
4280a0906N206K0544j3257j1084J7011m757j7191J5652J2271j8931N86J6169j4257
4293b944j0052K1115N65j8170J0988Q610k0045K305K0700j0536j1345J6965k900
$$ y = [11939, -8430, -10747, 11333, 3758, -9484, 6898, 7424, -13826, -3986, 12548, -3289, -5791, 11931, 176, -15520, 3323, 9520, -8349, 205, 12932, -6884, -12501, 9090, 3624, -9645, 7352, 9834, -12786, -6728, 10560, -3824, -6959, 12859, 3326, -14719, 1122, 8035, -9714, -1289, 14004, -4582, -12485, 6818, 2565, -10959, 6431, 12416, -10475, -7148, 8913, -4811, -9337, 12260, 6175, -13065, 754, 7377, -10826, -3578, 14826, -1314, -11422, 6528, 2338, -13032, 4261, 13387, -7727, -6381, 9513, -4610, -11007, 10864, 8396, -11074, 712, 8144, -10906, -5700, 14844, 1587, -9497, 7514, 2757, -14434, 1218, 13489, -5442, -4856, 11313, -2944, -12996, 8119, 8684, -9486, 1502, 10112, -9933, -7628, 13072, 2536, -8809, 8156, 5256]
4306E256k0032J3569J4748j6993o96J6555j3968j3465K0204L635j6891J0968J0154
4319A3044k1113k568K0296p866j1325J8336q5k1337R810J4326j6221j125J8674
4332A2846j2006j5327J8236M858j7284J0468J2314k0644n647J9965o468j1262
4344i951J8978K432k2614N736J4143j4995j700K1320q661j7163J4975M326j7853
4357a1027R217J6085j8446o968J8987n800j3993J8367N436k2146L923J5063j5103
4370f405k880K2329o254j8067J2530M883j8964Q450J9178j5450q526J7171o649
4383A346j5942J7064R701j9536K672J5074j5220o908K1521k951j7505J2111O717
4396H144j9802N365K0022j2721r714J6374m968j8202J5763J2304j7669J685J5027
$$ y = [5256, -14776, -1207, 13541, -3452, -4148, 12407, -1561, -15026, 5178, 8813, -8078, 2890, 13044, -8069, -10637, 9659, 1793, -9532, 8804, 8719, -12618, -2808, 11518, -4703, -5828, 12846, 840, -14487, 3749, 8607, -8677, 1791, 14105, -6539, -12186, 7779, 1311, -9951, 9027, 11459, -11155, -5419, 8724, -6271, -7971, 13349, 4688, -12475, 2500, 6826, -11027, -1810, 14275, -4171, -11139, 7848, 2048, -11945, 6422, 11858, -10288, -6365, 8698, -6405, -9285, 13044, 6790, -11277, 1253, 6136, -12828, -4378, 14800, -650, -9176, 7995, 1346, -14596, 2468, 12169, -7367, -4695, 10379, -4841, -11749, 9772, 6821, -10684, 1427, 8144, -11658, -6293, 13729, 1008, -8706, 7668, 2700, -15502, 261, 12565, -5104, -3419, 11608]
4409A1608j5573r975K0898N21j6400J2090P978k0942J336J9440j0317r516J8180
4422I328l059j9863J2169J2882j6937Q18J7268j3652j2479J8943K664j6891J1679
4435B870R774k0760j841J9712r224r192J8746q50k1659R183J2692j5488M92J9680
4449A4135j1480j5014J6335K312j6894J1728J2873j9077l915J8108q096j2040
4461a1025J9151K122k1414P073J3457j5243q16K0407q862j6801J4294K766j7180
4474a2071J0480J6492j6408o639J6357q492j3758J8708O570j9741N832J3199j6803
4487f274l987K1224n697j6392J3997M074j8592P903J7667j5059p666J6525p124
4500E99j5546J7543R381j8061L742J3018j7314o614K0934j775j5128J3790N046
$$ y = [11608, -3965, -13940, 6958, 7479, -8921, 3169, 11147, -9795, -8459, 10981, 664, -8852, 9328, 6269, -13594, -1425, 11457, -5480, -4662, 12606, -1046, -13525, 5418, 8082, -8809, 2870, 12644, -8116, -9957, 9755, 531, -8661, 10085, 9235, -12424, -3241, 9451, -6037, -5545, 14135, 2655, -12359, 3976, 6288, -10606, 1122, 13995, -5082, -8997, 9111, 1015, -11025, 8126, 10248, -11166, -4093, 9364, -5879, -6695, 13712, 4850, -11951, 2343, 5109, -12071, -1591, 14901, -1507, -8146, 8211, -281, -14039, 4669, 11239, -8502, -2670, 10529, -6274, -10261, 10963, 5266, -11126, 2871, 6945, -11647, -3744, 13923, -1136, -8802, 7723, 599, -14947, 2596, 11977, -6084, -2342, 10676, -6638, -13252, 7682, 5907, -9221, 4569, 9615]
4513I615k0741M312J7782j2385p402J7753n665j7450J4966J0376j7426K981J5102
4526A1818j6389r374K0013J88j4863J3088P192k1841J240J8260j0119p404J8773
4539A0582l876j9903J1494J0944j5894K773J7415j3454j2431J7810K06j5450J2228
4552B444J0445j9944j640J7722r499q537J8939p62k0570Q563J1745j6326J820
4565e600J9686j1256j3995J5700R19j6725J2314J2817j8156l986J6817r284j0991
4578a1740J9581L169j9665O698J1473j7123q75K0564q009j4174J4682J909j8238
4591a1748J0192J5380j6390m852J6395r154j3182J8434N927j8218N834J1863j7249
4604f768l784K0559n205j3632J3400K962j9931P082J7401j3615n344J6929q095
$$ y = [9615, -11126, -6814, 10968, -1417, -8819, 8934, 3269, -14181, 785, 11161, -6265, -3284, 11818, -4571, -13945, 6068, 6256, -8607, 4481, 11673, -10168, -8928, 9332, -787, -8191, 10582, 6706, -13197, -1703, 9241, -6653, -3880, 13535, 81, -12350, 5460, 5666, -9784, 2444, 12889, -7055, -8695, 9027, -472, -9009, 9930, 9168, -11402, -2839, 8906, -7420, -5600, 14086, 2830, -11165, 4535, 5454, -11271, 1043, 13860, -4296, -8282, 8535, -749, -11740, 7841, 11010, -8655, -1957, 9516, -7607, -8482, 12082, 4073, -10101, 4581, 6490, -11748, -1556, 13824, -2566, -7418, 8977, -177, -13359, 5075, 11002, -7216, -1382, 10481, -6768, -10552, 10007, 4802, -8830, 4570, 7532, -12399, -5317, 12084, -1531, -6875, 10054, 1959]
4617A959j5872J5756P683j6993N259J3455j6648o392J9689k667j4327J3677M512
4630I091k1013M311J7067j1145n322J7760o257j8199J3400Q761j6384M652J6066
4643A2788j5219r737J8108j604j4227J3687P474k0129J074J6358j0436o845J8593
4656I885l222j8851J0620J0091j6051L959J7433j3609j2168J6300j208j4454J3828
4669B553J0731j8489j775J5722j1171q259J8897j8j8376Q969R761j6241K046J9131
4683A3481j0783j2838J4699j79j6325J2580J2968j6980k945J5163j0647j0232
4695a2038J8866L152j7452P031R874j7236q50J9520p186j2504J4577P84j8030
4708a1492R385J4001j4626l597J5473r209j3011J7426N939j6634O598J0679j7881
$$ y = [1959, -13913, 1843, 9526, -7467, -2208, 11247, -5401, -11793, 7896, 5229, -9098, 4579, 9091, -11922, -7611, 9456, -1689, -7011, 10749, 4492, -13707, -307, 8454, -7930, -3278, 12788, -2431, -12168, 5940, 4336, -9891, 3796, 11270, -8859, -7785, 8573, -1863, -8708, 9885, 6663, -12188, -1568, 8523, -7528, -3569, 13864, 255, -11913, 4387, 3179, -11275, 2553, 13284, -5205, -6980, 8742, -2429, -10688, 8209, 8191, -10185, -1216, 8545, -7696, -5650, 13481, 2698, -10140, 4559, 4380, -11945, 635, 13603, -3377, -6322, 8841, -1806, -12038, 6828, 9980, -7472, -441, 9433, -7803, -8653, 10867, 3681, -8823, 5754, 6538, -11492, -2107, 11894, -2732, -6329, 9144, -65, -13076, 4350, 10289, -6345, 253, 10932, -6949]
4721f949m345J9035m172j1965J4876K396j9803O333J4893j2680m114J7004p998
4734B511j5628J5066O725j5874O146J2801j6458o813J8215l169j2092J4189M378
4747I997k0254L085J5406j1065m097J8070n729j7153J1635O804j5862N717J6009
4760A2563j4309q483J6412k590j3859J3716P654j9394J001J4784j0530n489J8857
4773A0333k898j7738R155P275j5890M848J7516j1386j0593J4942k767j4975J3223
4786A045J0765j6812q48J4665j1286q555J8685N3j6534Q625Q283j6705K614J8200
4800A2195r399j1580J3749j574j5956J1908J2784j4807j632J4150j1051j1283
4812a2496J7441L038j5466P974R431j6968j023J8593p214j1370J4088j19j8030
$$ y = [-6949, -11294, 7741, 3569, -8396, 6480, 8876, -10927, -4594, 10299, -2381, -6495, 10509, 2511, -13117, 1949, 8674, -7200, -1054, 11747, -4711, -11524, 6691, 3522, -8570, 5619, 9997, -10257, -7172, 8234, -2831, -6928, 11142, 5413, -11740, -105, 6699, -9163, -3446, 12563, -1746, -10229, 6183, 3593, -10266, 3450, 11104, -8290, -7289, 7495, -3035, -8524, 10333, 7435, -10303, -1148, 6127, -9763, -4915, 12601, 1215, -9378, 5564, 2797, -12178, 1045, 11810, -5002, -5850, 8815, -2471, -11026, 7659, 7712, -8822, -197, 8086, -8619, -6005, 12195, 2796, -8784, 4965, 3391, -12565, -657, 12127, -2680, -4312, 9838, -1213, -12496, 4945, 7983, -7483, 491, 9922, -7046, -8069, 10524, 3310, -8060, 6028, 5909, -12121]
4825a2121R101J3738j3297j769J5206j0187j3344J5544M888j4954Q004J0966j6964
4838e189m427J7674n462j0570J4107K053j8448N828J3792j2090k731J6504p894
4851C147j5329J3387N640j4389P301J2904j5449o947J5646m520j1346J4980N003
4864A0028j7936L571J3070j2304l817J7066n529j5455J1412O236j4184O136J4698
4877A2992j4144q447J3847l520j2112J4870Q688j7217R35J1855j2301o170J8193
4890G469j497j4890J0505O338j6307L227J6071j1325q724J3971k348j3823J3263
4903A930R767j5992o87J2383j1613p907J8400J164j3876Q564O148j7055P24J6872
4917H822p883q100J4376j795j6399R805J0737j3998l36J3832j0467r619J6403
$$ y = [-12121, -3020, 10718, -2579, -4348, 10858, 671, -12673, 2871, 7759, -7195, 809, 11775, -5189, -9616, 8058, 2596, -7974, 6133, 8186, -10262, -4434, 9358, -2732, -5463, 11041, 3147, -12182, 1205, 6845, -7544, -243, 12661, -2788, -9735, 5911, 1391, -9955, 5025, 10028, -7908, -4337, 8733, -3571, -7388, 9678, 4149, -11306, 106, 6342, -7842, -1706, 12992, -1152, -9599, 4248, 728, -11384, 3486, 12174, -5043, -4108, 7747, -4554, -10724, 7469, 5972, -8918, 1587, 7925, -8382, -5155, 10916, -409, -9133, 4838, 2490, -11333, 1930, 11697, -4295, -4982, 7401, -4212, -12119, 6281, 7445, -6431, 2133, 8281, -8774, -8050, 8822, 939, -7161, 7215, 5420, -10979, -1174, 9563, -4435, -4771, 9061, -1406, -11025, 5378]
4930E378K544j4189P661P835j7171j664J7433n802q236J4617r31j8207P188J1042
4944G498j2042J8J5643r048j2386J3647L331j4155P889J0185j5614l573J5866
4957G259n014r476J4528J606j8115M805J1956j1798q45J6194o779j4238J1623
4970A706L521j3820Q001J2543j3773o144J4423n341j0953J4500N064j6535K831
4983c977J2030j1996l167J7187m805j4113R535M432j4128O009J4912j1779p138
4996f998J3461n354j2585J3771P185j4878J784J2032j2271n259J6825j830j3947
5009h064R350M892j5643M073J5281r384o907J3019m001j4534J1934R224j3982
5022d742J679J2070j2458p895J6588N43j2954R634N772j6176M54J5493q097p232
$$ y = [5378, 7922, -6267, 1394, 9229, -7942, -9606, 7827, 2025, -6211, 8406, 7475, -10732, -3544, 7498, -4544, -4526, 11117, 2069, -10317, 3330, 6661, -7494, 395, 10580, -5034, -8607, 7259, 2245, -7231, 7297, 8903, -9212, -4407, 7549, -4249, -5094, 11100, 4321, -9917, 1706, 5227, -8593, -592, 11951, -1822, -7966, 6457, 1116, -9837, 4663, 9727, -6808, -3977, 8053, -3943, -7110, 10077, 5272, -8841, 694, 5126, -9002, -2993, 11919, 140, -6998, 6463, 1109, -11476, 2295, 9480, -5398, -3614, 8418, -3853, -9112, 7713, 5883, -8064, 1286, 6178, -9465, -5392, 9889, 505, -6402, 6617, 2616, -11918, 16, 9240, -4742, -3063, 9007, -3451, -11346, 5242, 5785, -7169, 2465, 8237, -7939, -7485, 8008, -89, -7321]
5036g321J4215k079j5602R646R673j2440N73J2893j1080r834J4692J492j1991
5049g163R863P578j6072j829J4071o719p410J4569J11j6369P048J0179j2232J21
5063d254J4803r106j1758J2781J648j2232R151J0435j4834m051J3711o142q596
5076h444J5042J926j6040M498R957j1815q79J6343o190j2317J0643K104j3904
5089i076P536J2488j2914m488J2996n811r959J4210M936j5709K980R715j2416
5102e512k737J7065l036j2164R724K532j5389N717J3559j0399n403J3020n551
5115A426j1659J2670O798j3994K718R993j2274n126J6026j413j1685R778K919
5128F177j4827K915J4322q492n534J2880m726j4068J0517Q068j2049K725J2440
$$ y = [-7321, 6894, 4815, -10787, -1141, 8532, -3908, -3335, 9558, -1522, -11356, 3336, 4828, -7163, 2700, 10278, -5794, -7623, 6448, -271, -7681, 6888, 6999, -9370, -2322, 7857, -4375, -4254, 10549, 1443, -10315, 2466, 4114, -8118, 1033, 11468, -3366, -7417, 6294, 152, -8444, 6598, 8524, -7516, -3018, 6939, -4876, -5755, 10588, 4398, -7919, 2724, 4828, -9076, -1540, 10948, -1966, -6454, 6542, 731, -9228, 4982, 9918, -5791, -2811, 6904, -5512, -8249, 8816, 5780, -6384, 3340, 5872, -9517, -3800, 9759, -640, -6043, 6977, 1426, -10233, 2437, 9235, -4759, -2041, 7952, -4322, -9448, 6578, 5165, -6520, 3258, 6177, -8650, -5735, 8587, 95, -5439, 7441, 2715, -11353, -836, 7232, -4817, -2092, 10348]
5141A0348j2230p636J3961n11j1953R529O397j4994J028J4112p612o158J3184
5154G465l168j5660Q473Q873j1186K957J3368j0255j0597J2293J55j1425R678
5167I71Q533j4235j432J2867p329p003J4088o70j4627O875Q651j1617O99J4427
5181A0198q381j1014J1697O49j1663R503J0415j3948l651J1546p325q010J5085
5194E101K982j3657M953Q346j2821j311J4951n959j0535J1022J830j2959P679
5207c78J1673j2418m438J1788p312r521J4318M808j2483L754Q663j3468l360J5250
5221F876l330j0131J0401K339j4594N101J2422r742m293J2230o039j1393J1854
5234A701O549j2763L728R402j2345n618J5044j457j0592J0556L395j5564K282
$$ y = [10348, -1882, -9518, 4443, 3932, -8021, 1508, 7905, -7089, -6061, 8051, 439, -5719, 7465, 4297, -11363, -2890, 5983, -5203, -2246, 11122, 867, -9730, 2563, 2718, -8707, 971, 9504, -4731, -6163, 6704, -625, -7628, 6460, 5790, -8837, -1962, 6689, -4928, -4229, 10198, 1817, -9197, 2500, 3149, -8514, 989, 11404, -2544, -6195, 5351, -1974, -9984, 5101, 8083, -5574, -621, 7725, -5096, -6407, 8544, 2585, -7950, 3072, 4902, -8057, -378, 11295, -1123, -5561, 6227, -1085, -10606, 3712, 8520, -3963, -209, 8454, -5014, -8374, 6876, 3546, -6585, 3816, 6155, -8439, -3338, 9084, -658, -4951, 7279, 1240, -10153, 1701, 8250, -4513, -785, 8617, -3728, -9346, 5698, 4241, -6351, 4205, 7600, -7964, -5682]
5247e682J2530q372l848J3375m100j3301R478O336j2043L546J1435j1420p555
5260i621J3806n06j0037J0013N312j5490j04J1818p351m197J4156j951j4022P402
5274g72O295j2097L067J2877r460q817J2186m27j0966R835P563j4015j241J1234
5288E262p255o016J4333O36j4161N636P080j2699J816J4885p164r477J1028o74
5302C230j2531Q269J0312j2181j888J1487p687q011J3604K668j3522N123P167
5315F040j1729o15J4619m666r628J0197J48j4092P108J1391j0410k449J2052p448
5329E18r967J2227M009j2194N424Q054j2600k668J4212l769r075J0186J730j4522
5343h435M594J1688r009k784J2467o343j1818J0891M591j0913M936J0020j2466
$$ y = [-5682, 6848, -1524, -5372, 8003, 3903, -9398, 80, 6416, -5627, -2081, 9354, -2066, -9621, 4185, 3679, -6358, 3655, 8967, -6523, -6627, 5191, -2160, -6357, 7799, 5848, -8174, -772, 5523, -6574, -3507, 9370, -90, -8907, 3279, 2852, -8114, 1721, 9284, -4731, -5972, 5262, -1993, -8009, 6324, 6960, -7201, -1565, 5515, -7184, -5368, 9517, 2353, -7124, 3904, 3230, -9301, -1032, 9280, -2901, -4789, 6698, -989, -9000, 4604, 7272, -6250, -1127, 6040, -5689, -6304, 8315, 3649, -5979, 4218, 4366, -9726, -2618, 8773, -1637, -4086, 7966, 518, -9449, 2778, 6787, -5407, 17, 8071, -4529, -7197, 7015, 3246, -5829, 4357, 6087, -8435, -3841, 7847, -1162, -3946, 8521, 2178, -9640, 1251, 5842, -5071, -135, 9885, -2581]
5356b581n560J3182k744r257J1153L530j4312K411J1082q764l035J3136m492j2518
5370h769Q486N631j1228M730J1395j0895p355J1741k059r664J0940O331j4312
5383e028K50J1170q592m755J4147j975j3038P513N368j1448L028J2817q944q018
5397g505J0981j438j0877J0254P975j2810j126J0746q966o063J4470L12j2129
5410f176O038N720j2150Q98J3899o658q021J0815j272j2507Q544R318j1365j302
5424d219J0569p823q050J3350K382j1492N440O824j3305o82J3801m286q246J0660
5438D923j66j3868O596J0097r520j883J1727p350j0110J1664L511j1121O119P960
5452H579j3060k747J3116m114p891J0984J252j4198M479J0049q811j297J1850
$$ y = [-2581, -8141, 5041, 2297, -6960, 4193, 7723, -6589, -4178, 6904, -1860, -4895, 8241, 3749, -8769, -283, 5348, -5880, -1150, 10245, -650, -8005, 3736, 1677, -7987, 2953, 9284, -5028, -4778, 6392, -2200, -6955, 7192, 5217, -7821, -308, 5060, -6388, -3360, 9457, 513, -7505, 3476, 2038, -8839, 1415, 9390, -3420, -4546, 6200, -2766, -8829, 5641, 5953, -6176, -138, 5582, -6568, -5670, 8229, 1571, -6450, 4365, 3093, -9414, -870, 8448, -2917, -4219, 6350, -1473, -9523, 3827, 6209, -5283, 157, 6981, -6324, -7006, 6795, 2509, -5737, 4923, 4757, -9111, -2515, 7582, -1938, -3821, 7906, 556, -9554, 2110, 5621, -5500, 619, 8579, -4481, -7228, 5888, 1774, -6117, 4867, 6119, -8079, -3600, 6449, -2362, -3659, 8191]
5465H191n675j1170R866L911j0911N371R912j1396n215J1652l086q160J1342L308
5479G940j3906K218R693q420k988J3842m251j1811Q430L885j1339N116J1675j0434
5493c50o410J0996l199r138J1172N398j2848J312R259q894m766J3989j216j2042
5507f737P602M567j2406L039J2934q506o697J0685k449j1126R961P660j1751j01
5521c325R976r198o483J3723P65j1073O567N186j2792Q50J3057o139o697J0766
5535E183k058j2494Q118Q799j0708O2J0308q465q295J2453K021j0600O745O234
5549G303j3317q78J2958n004o962J1624o30j3992O094R188r875m04J2213p445
5563H73r630J0764K341j0698P174P928j2606k965J2068m323p108J1299J534j3723
$$ y = [8191, 2516, -8654, 1212, 5123, -5788, -417, 9495, -1901, -7116, 4536, 1450, -6710, 4632, 7940, -5966, -3748, 5945, -2475, -5463, 8379, 4128, -7683, 747, 4632, -6707, -1591, 10084, -350, -6760, 4236, 1037, -8101, 3071, 8469, -4379, -3067, 6192, -2702, -7468, 6521, 5305, -6737, 865, 5432, -6974, -3935, 8999, 493, -6204, 4481, 2032, -9094, 867, 8527, -3224, -3325, 6651, -2547, -9030, 4693, 5458, -5615, 952, 6138, -6654, -5804, 7253, 1114, -5583, 5183, 3125, -9369, -1251, 7548, -3160, -3098, 7210, -1255, -9550, 2903, 4924, -5676, 1069, 7303, -6014, -6892, 6066, 1062, -5900, 5724, 5094, -8898, -2804, 6384, -3491, -3895, 8318, 873, -8757, 2007, 4348, -6350, 824, 8752, -3854, -6819, 5249, 926, -6182, 5117, 6651, -7072]
5577g072M145Q795r097j282J3209n903j1079R639K847j0668O268R895j1251m648
5591f202J1470m599q354J1807L966j3086K147R275j0210k248J3733l629j0917
5604f847Q508L078j1547M656J1521r507n697J0751l611r802J1277N787j2345J307
5618b471R298j0091m157J3826j332j0697P728L591j3089L127J2099p516n192J0775
5632E899l396j1376R208P230j1564J478R821r560n751J2676m0j0226P695M654
5646F748j3182Q03J2429o641n501J1461k688j2719P769P972j0073J139J0901r272
5660h54q219J1552Q75j0045Q233O589j3067j498J1846n515o494J1479M71j3180
5674g827N521Q331r997K30J2267p845r402J0460J753j0373P868Q170j2215l394
$$ y = [-7072, -2927, 5868, -3229, -4511, 8698, 2795, -8284, 1355, 4202, -6466, -198, 9697, -1554, -6202, 5268, 669, -7685, 4122, 8088, -4998, -2851, 6424, -3786, -6034, 7699, 4070, -6847, 1661, 4739, -6808, -2152, 9369, -138, -5835, 4916, 1305, -8497, 2780, 8567, -3778, -2471, 6827, -3264, -7421, 6405, 5073, -5624, 2104, 5695, -7394, -4267, 7832, 316, -4876, 5899, 2503, -8873, 335, 7565, -3999, -2521, 7300, -2260, -8011, 4665, 4625, -5601, 2094, 6748, -6434, -5631, 6798, 157, -5344, 6117, 3429, -9290, -1521, 6451, -3622, -2483, 8418, -854, -9073, 2479, 3354, -6691, 1542, 8131, -4936, -6434, 5412, -103, -6597, 4882, 5353, -7827, -2306, 6025, -3972, -3742, 8525, 680, -8722, 1738, 3491, -6882, 986, 9156, -3059, -6453]
5688f453J1236n649o574J2260K230j2862L789P765j0329m07J2535m851r762R443
5702B371J718j1488O631R472j0638l931J0897m782q054J1962L776j2948L039P734
5716E759j0520j814J4000l207r582Q206J861j2367M632J1002q495m144J0912m626
5730A617j0410J0395N346j1051K350Q721j0047m570J3716j815j0200Q334L590
5743E976j3369L140J1702p215m463J0841m288j1239Q351P096j0438K221J0298
5756H613j0358o173J1991m72r894Q594N316j3247M66J1542o524m939J1727k361
5770D281j2685P301O856j0074J831J1004q688q204J1348K3r571Q156O735j2812
5784d499j053J0862o091n763J2438l48j2587N482O965j0439J055J2357p102q771
$$ y = [-6453, 4783, -866, -7440, 4820, 7050, -5812, -2023, 5742, -4587, -4994, 7541, 2690, -7072, 2371, 4089, -7399, -768, 8704, -1934, -5865, 5032, 250, -7804, 4158, 7934, -5014, -1975, 5759, -4761, -6575, 7425, 4218, -5364, 2842, 4703, -7664, -3032, 7970, -525, -4669, 6243, 1617, -8793, 1602, 6948, -4103, -1753, 6968, -3079, -7649, 6067, 4252, -5948, 2386, 5976, -7393, -4253, 7449, 234, -4229, 6612, 2324, -8915, -564, 6532, -3906, -1685, 8613, -1745, -7918, 4073, 3601, -6293, 2301, 7617, -5630, -5164, 6378, -146, -5085, 6642, 4281, -8404, -1103, 5753, -4321, -2490, 8514, -174, -8378, 2970, 2993, -6578, 1578, 8313, -4499, -5552, 5310, -781, -6544, 5894, 5546, -7041, -1559, 5406, -5033, -3978, 8379, 1277, -7494]
5798g494R944L34j0580P872Q392j1257k539J0495o360o433J2114J710j2304M481
5812a625P038j0609l79J3247n114r026R312O38j1966O679J0032r532k941J0136
5826E890o083q884J1522M251j1460L906P780j1323k309J3242l368r086R147J634
5840D859j2550M696J0739q214l561J0379m963j0503J0318N106j0563L741Q550
5853H034j0683m909J2106j542q733R036L131j3091K472J0625p146l700J1412l966
5867C046j1381Q683N460j0327L389J0032j0026o691J1476r10r114R307M974j3221
5881e303O58J0696p501m025J1905j796j1856O874N650j0199K174J1256q407p431
5895g305J0547o50r612R014O454j2507n55J0131p218n435J2519K57j1724N620
$$ y = [-7494, 2450, 2784, -7796, 76, 8468, -2789, -5328, 5167, -1193, -7626, 4488, 6198, -6106, -1625, 5413, -5196, -5575, 7672, 2558, -6468, 2844, 3482, -8484, -1805, 8227, -1305, -4246, 5890, -193, -9077, 2445, 6696, -4764, -858, 6922, -4401, -6710, 6532, 3164, -5922, 3225, 4859, -7691, -2995, 7744, -470, -4031, 6348, 1385, -9118, 1200, 6306, -4257, -516, 8034, -2649, -7558, 4548, 3006, -5727, 3309, 6440, -6651, -4179, 6446, -700, -4400, 7012, 3046, -8335, 348, 5808, -4519, -1130, 8902, -1124, -7815, 3661, 2751, -6363, 2944, 7918, -5303, -4645, 6051, -1450, -5475, 6430, 4634, -7222, -348, 5302, -4897, -2723, 8533, 126, -7305, 3242, 2592, -7020, 1994, 8448, -4059, -4614, 5517, -1701, -7136, 5383, 5640, -6084, -464]
5909d64N724j0880J150J2466o579p899R866m20j1207P691Q594j0754j683J0154
5923E759p087o887J1998J870j1170M978O285j1230l13J2717m749p847Q925Q4j1885
5938h552O324R745r207k105J0459o521r321J1351L453j0554M802P497j1586k556
5952f771J2486l827p609R714J528j3142M465R996q521k371J1067n425j0131R750
5966A209M329r766M085Q576j0935m968J1706k540p629R890L260j2843J995R299
5980E668q003k778J2104l443j0909P950M539j0292L961J0001r824n742J0737j690
5994B279q966R706M898j2608P04R446p634l715J2459j390j1740O696M389j0176
6008e652K869J1448p930o232R657k003r987Q732O972j1345q1R223p372n178J2303
$$ y = [-464, 5260, -5620, -4470, 7996, 1417, -6482, 3384, 2964, -8243, -552, 8042, -2712, -4395, 5759, -1328, -8215, 3783, 5653, -5517, -539, 5746, -5484, -5797, 6920, 2171, -5676, 3249, 3333, -8552, -2228, 7517, -1690, -3795, 6664, 143, -9178, 2173, 5626, -4928, -126, 7371, -4215, -6771, 5715, 1888, -5721, 3993, 5521, -7621, -3156, 6840, -1681, -4052, 7015, 1590, -8541, 1209, 5538, -4228, -143, 8433, -2502, -7470, 4236, 1696, -5933, 3957, 7217, -5626, -3631, 5668, -2335, -5113, 6991, 3548, -7361, 589, 5128, -5164, -1203, 8798, -1026, -6768, 3969, 2279, -6687, 3019, 7917, -4691, -3987, 5459, -2175, -5890, 6569, 5179, -6561, 135, 4524, -5652, -2783, 8665, 735, -5497, 4160, 2157, -7830, 902, 7874, -3471, -3552, 5671, -1701, -6879, 5424]
6023E424j74j0956N998M770j1197J419J2485o152p139R632j392j0967P751Q069
6037G571j0235n82R386p040p496J1800J726j0292N739N681j1316j009J2046m882
6051A097o825J0129k59j1761N561Q450q874j093J0221o580q736J0536L000r984
6065e118N574O857j1412k713J1662m014o534R740J267j2340L758R190q581j300
6079c964J1262n317j0017R041K916r402M890Q737j0138m343J0945l219p796J0158
6093C753L002j2395K326Q789q011k132J1990l517j0360P427L362j0241L959J0131
6107H083q324n310R836l048q362R502N252j1794J633Q041p977l635J2061j249
6121D709j0442O837L922j0915K569J0892o855o171R826k112r869Q601O584j0560
$$ y = [5424, 5250, -5706, 292, 5062, -6135, -4716, 7769, 1617, -5522, 4110, 2718, -8249, -498, 7571, -2664, -3246, 6140, -900, -8396, 3404, 5130, -5162, 577, 6258, -5058, -6067, 5979, 1097, -5728, 4401, 4142, -7619, -2058, 6392, -2482, -3575, 6646, 66, -8670, 1866, 4866, -5118, 456, 7313, -4099, -6812, 4850, 836, -5698, 4042, 5309, -7031, -3273, 5917, -2664, -3964, 7298, 1981, -8036, 1005, 3921, -5481, -591, 8146, -1992, -6335, 4610, 1391, -6405, 3753, 6755, -5640, -3314, 5475, -2536, -4668, 7322, 3805, -6555, 872, 4234, -6007, -2048, 8083, -241, -5551, 4285, 1237, -7125, 2377, 7629, -4165, -2532, 5509, -2468, -6103, 5958, 4709, -5733, 1104, 5026, -5889, -3320, 7572, 717, -5454, 4372, 2260, -7609, 992, 7576, -2984]
6135b984N03Q673q401n199J2015N35j0134O273M509j1578R75J1556n541n874R575
6150D903k080j0803P396P027q982o1R623p836p327J0956J485r565O166N792j1601
6165d907p31J1230m754o161J0030p89j1633N761P468q903P2J0588o598q646R652
6180A679J937r359N982P176j0618k365J0222m229o443J0001J458j1844L879P540
6194E016q062r91J0957m672r502Q226K472r600N311Q667r567l566R296l813p077
6209f905R998L569j1345K271P645q400k200J1669l262r201P688K120r803M260
6223a896R562q320m399R331l404q341R214N109j0356J734P264r048k971J1455
6237D934j029q993O800L274j0838K601J0290o969m466R219k694r857Q241N994
$$ y = [-2984, -2481, 6192, -2209, -7408, 4607, 5142, -4992, 1281, 5790, -5788, -4813, 6743, 1202, -4672, 4903, 2823, -7980, -584, 6443, -2539, -2600, 7023, -813, -8140, 2816, 4301, -5264, 902, 6694, -4907, -5638, 5592, 838, -5323, 4707, 3918, -7715, -1954, 5514, -3389, -3317, 7271, 673, -7973, 1679, 3616, -5743, 239, 7415, -3203, -5568, 4654, 425, -6018, 3983, 5441, -6403, -2524, 5016, -3046, -4037, 6920, 2248, -7254, 972, 3444, -6156, -845, 7822, -1745, -5311, 3985, 172, -6905, 3093, 6662, -4683, -2412, 5233, -3167, -5367, 6302, 3040, -6161, 1527, 3647, -6156, -1896, 7666, -654, -5053, 4278, 874, -7467, 1747, 6856, -3500, -1766, 5498, -3550, -6521, 4934, 3905, -5088, 1712, 4986, -5852, -3251, 7039, 70, -4396, 4823, 2129, -7728, 513, 6507]
6251F507r088J037Q142q115n572J0989n2q464O551M319j1445P31J0197n420m905
6266d588J0135k061j0667O538O291q600R02R263p832o712J0356N70q834O756N062
6281F579j0990j114J0129m460n181J0309k17j1131M198O402q456O62J0309o003
6295A036p600Q816R40q875N812P157j0055k584R591m442n772J0180J388j1272
6309e680L827O488q526m70J1081m328q473P767J412r544N311Q673r041k926Q674
6324D245m259o948R498L277j0265K708O770q668j742J1140l015q037P216J902
6338C822j0491M062R402p290l250Q821m357q586Q849M563r315K278P494q716l132
6353e846J0873j806q124P067K470j0649K452R963o254l692R081l444r392P298
$$ y = [6507, -2581, -1544, 6598, -1517, -7089, 3900, 3848, -4616, 1935, 6254, -5191, -4460, 5737, 317, -4588, 5547, 3486, -7181, -643, 5648, -2952, -2050, 7213, -619, -7331, 3025, 3595, -5239, 1517, 6579, -4411, -5525, 4604, 144, -5037, 5272, 5055, -6076, -1878, 4524, -3932, -3270, 7039, 1036, -6564, 2252, 3192, -5683, 129, 7286, -2769, -5353, 4238, -204, -5976, 4204, 5592, -5680, -1853, 4635, -3891, -4361, 6720, 2392, -6081, 1686, 3098, -6446, -1135, 7538, -1503, -4429, 4245, -14, -6962, 2536, 5813, -4452, -1744, 5026, -3642, -5384, 5756, 2741, -5296, 1920, 3822, -6669, -2607, 6795, -495, -3745, 5076, 719, -7867, 982, 5545, -3770, -1492, 6002, -2714, -5846, 5027, 3221, -4903, 2164, 4634, -6015, -3563, 6400, 146, -3546, 5535, 2091, -7301, -3]
6367cN399q541K044P958p855n375R519l3q209P579M000j0799M90R136n909l847
6383d446R583j884r732N701N624q237J832R037p403o604Q737K37p856P090N440
6398G119r826j236Q275n272m531J0005M9r765M465N572q338N33R788n989p167
6413f318Q358N75q728O595O876r236k216Q162n185n407J0356J670r736L545N661
6428D972r480m66J1042m348o707P520N78r282M858Q009q093k678Q540n023o629
6443g187R498K866r056L036N658q708j626J0327k328p004P281R46j0199L676Q592
6458E772o772k274Q619m514q256Q184L991q299K777O724q416l681J0090j631o722
6473d408P220K001j0676K263Q444n983k757R340k817r137O773M203q180K450P881
$$ y = [-3, 5396, -3145, -1101, 6857, -998, -6373, 3146, 3113, -5096, 2483, 6483, -4316, -3826, 5310, -599, -4446, 5137, 3253, -6479, -778, 4846, -3391, -1559, 7478, 75, -6529, 2208, 2445, -5411, 1679, 7119, -2707, -3943, 4332, -940, -5471, 4534, 4583, -5182, -717, 4855, -3483, -2950, 6838, 849, -6318, 2040, 2615, -6113, 482, 7358, -1878, -4094, 4068, -1117, -6524, 3832, 5502, -4234, -689, 4972, -4508, -4974, 6068, 1720, -4987, 2533, 3111, -6171, -1313, 6696, -1397, -4075, 4465, -558, -7187, 2311, 5177, -3879, -843, 4815, -3893, -5519, 4808, 2480, -4524, 2757, 3703, -6496, -2820, 5772, -1000, -3274, 5345, 831, -7425, 759, 4750, -3549, -772, 5952, -2464, -6145, 3945, 2314, -4408, 2812, 4813, -5863, -3600, 4844, -1139, -3896, 5444, 2627, -6510, 263, 4466, -3714, -1264, 6617]
6488F617p762m944R185q54o979P359L446j0342M92Q130n787k783R673j638r042
6503e229M794M559q350K210Q598o045n765Q132q76p639O894N125r422n26Q002
6518D462n443m049R569J27r244M205M353q448J305R867m829o412P401n22q713
6533f371N989O375p998r90P922n389n596R217J248q220L686M775q532m50R849
6548E515l444o150O792Qr226M955P170o837j251P667n327o847Q249K811p966L830
6564e1N311q321k233R220k336o368P564J179r600K923P735o643j518Q192m387
6579F67p600P460L422p817L469O456q260l612Q620j723n846P731K207r917J739
6594c004P556o281k200Q932k400q303O024L230p563L057P385p143m584P896j423
$$ y = [6617, -1145, -6089, 3096, 2242, -4737, 2622, 6068, -4274, -3782, 4348, -1439, -4222, 5451, 3813, -5229, -435, 4124, -4226, -2016, 6582, 537, -5228, 2904, 2028, -5611, 1283, 6408, -3014, -3540, 4462, -981, -5030, 4539, 4666, -4578, -373, 3980, -4468, -3163, 6704, 1875, -4537, 2864, 2342, -6371, -382, 5993, -2005, -2995, 4927, -462, -6058, 3159, 4407, -3813, -127, 4648, -3884, -4334, 5515, 2071, -4079, 2713, 2721, -6505, -1550, 5620, -1217, -2468, 5199, -128, -6975, 1274, 4085, -3881, -51, 5260, -3061, -5294, 3926, 1590, -4778, 2786, 3965, -5635, -2712, 5023, -1620, -3138, 5054, 667, -6933, 527, 3949, -3868, -399, 6057, -2203, -5815, 2805, 1082, -4764, 2967, 5174, -4743, -3004, 4552, -1729, -3929, 5003, 2603, -5700, 324, 3554, -4009, -952, 6433, -710, -5294, 2602, 1179]
6609A179o189P203L660r430M73P115n643k938R600j124q863N028L600p971K085
6624b215Q513n560n095P539j611p239O612N107q454k07P244n736l963R101K01
6639D237q140M466L637q567R52R205m392n314P139q19q668O049N678o669r73O986
6655D807n410n289Q549J382p625M197M420q643o70Q972l392n211P249j34r035
6670e833M477O006o297o66P706m965o553P447K090p014L552N479q280k312Q620
6685C457k668n034P297J151r314K208P043o055o29P910l716p596O396K271o873
6700d152L729O163p164l462P666k440n619P550K679q952J483O126n774j819R078
6715E092k413p785N165K720p246K836P890o461m235P211k200o167P117M155q526
$$ y = [1179, -5010, 2193, 5853, -3577, -3104, 4011, -1632, -4570, 5030, 3906, -4957, 71, 3671, -4300, -2215, 6298, 738, -4357, 3182, 1571, -5668, 944, 6051, -2403, -2610, 4634, -1102, -5065, 4036, 4237, -3903, 563, 4200, -4367, -3415, 5790, 1398, -3916, 3223, 2404, -6264, -215, 5463, -1206, -2179, 4807, -603, -5892, 2657, 4039, -3586, 611, 5031, -3612, -4282, 4690, 1298, -3913, 3336, 3202, -5833, -1356, 4650, -1647, -2313, 5393, 428, -6125, 1322, 3412, -3602, -50, 5429, -2851, -5163, 3457, 789, -4245, 3052, 4203, -5111, -2903, 4140, -1915, -2544, 5366, 1650, -5946, 450, 2721, -4152, -423, 5740, -1424, -4886, 2780, 340, -5279, 2271, 4950, -4002, -2519, 3607, -2167, -3986, 5092, 2679, -5106, 59, 2779, -4467, -1631, 6259, -202, -4437, 2774, 574, -5593, 1524, 5679, -2847]
6730b847Q81O110o154k839Q697o61p686M983L054p810K003Q215n290m814O923
6745B765j669p016O509N135p698L76O415o316l887Q611L98p254M827L164q179
6760c819L08Q317m005m159O740j309p908N550N460o904J22O533n418n610Q149
6775B047J387o798M629L684q460o45Q039l155l968P182l48q697L430N453n916
6790b136k35P685m696o490P485J415o913M454N338q056j951P474k757n072P911
6805C456Q48q761K429N725o139m62Q147l466o914N808K062p243M004O227o994
6820a273k749O831k957n126P742K668q614J543N497o221j406Q502j709o670M763
6835H21K042p581K606P510n774l565O810k530o039O759L966p685J049N902o838
$$ y = [-2847, -1966, 4144, -2010, -4849, 3848, 3187, -4499, 484, 3538, -4272, -2269, 5946, 656, -4158, 2765, 1096, -5920, 589, 5724, -1974, -1598, 4817, -1499, -5386, 3225, 3623, -3631, 1196, 4360, -3819, -3511, 4806, 801, -3358, 3382, 2073, -5835, -285, 5175, -1729, -1607, 4926, -492, -6102, 2047, 3434, -3364, 1265, 4949, -3511, -4156, 3883, 728, -3240, 3942, 3594, -5103, -1673, 3780, -2136, -2371, 5314, 618, -5872, 1613, 3028, -3885, 569, 5907, -2149, -4100, 3374, 617, -4455, 3456, 4304, -4457, -2028, 3697, -2442, -2904, 5243, 1777, -5137, 671, 2733, -4510, -506, 5721, -1273, -4022, 2809, -148, -5274, 2468, 5136, -3478, -1935, 3562, -2659, -4065, 4437, 2728, -3942, 821, 2863, -4718, -2112, 5398, -376, -3941, 2869, 339, -5700, 1059, 5025, -2660, -1611, 4291, -2547]
6850b547k901R122q19o252M660K417q451J603Q010m772l597P308k081p292N712
6865A20M475p011R31O101n993m073Q303L82o803M682L364q508M30P765l798l476
6881c109P143j485q251M829N039o307R07O533n315n166P334N54o448M910M196
6896E364q378q81P387l131m128P515o3q196L107N230o391Q38P377m279o229O425
6912A567Q49o684M526N566p557j992P124l562m304P744J169q035K464M601o045
6927b569p02Q399k980o353N469J201p387M151O192o336k535O670l143n289P101
6942A889K513p750K150M790o222j505Q530j934o267N137J319q081L375P073n073
6957e6k864O525l120o573O967K986o847J967N342o391l225Q516j170n884N361
$$ y = [-2547, -5448, 3674, 2855, -3397, 1263, 3680, -4771, -3168, 4842, 70, -3527, 3781, 1700, -5592, 120, 4595, -2416, -1485, 4616, -1377, -5450, 2853, 3235, -3568, 1114, 4478, -4030, -3600, 4165, 367, -3109, 4034, 2549, -5702, -873, 4166, -2141, -1234, 5299, -16, -5182, 2152, 2706, -3742, 1168, 5364, -3014, -3895, 3492, 361, -3767, 3748, 3685, -4511, -1404, 3826, -2565, -1727, 5650, 1371, -4858, 1567, 2416, -4268, 258, 5824, -1733, -3725, 3399, -163, -4467, 3277, 4446, -3589, -1125, 3476, -2569, -3271, 5128, 2148, -4205, 1264, 2465, -4922, -771, 5421, -915, -3450, 3220, 77, -5212, 1889, 4402, -3348, -1198, 3592, -2630, -4135, 4395, 2461, -3806, 1331, 2650, -5431, -2056, 5017, -56, -2920, 3605, 485, -6088, 879, 3865, -2982, -1015, 4327, -2064, -5289, 3227, 2057, -3827, 1534]
6972A534J980q278J958P276m937k624O966k364p308N567L815n869J358O370o753
6987a309l901P139nn414N210L198q268J26O985m245k931P498j508p826M724M175
7003C648o450J333O989n474m840O558k70n452M980M450p895o70O598m006l581
7018d082P776J91p926L505L752o346J018P297l974n462N956J40o289M690N268
7033E514p056j523O494l757m675Q237J356q033K711M581o945l39Q069k942n473
7048c781N521P32p256L700O142n843j655O047l536n479P046K734o999K158M744
7063D275o885j851Q049j306n808N617R24p881K626O616n247j844O896l326o516
7078e661O216K957o694K244N744o672k989P633p76n845N735K083p793P76O968
$$ y = [1534, 3514, -4764, -2806, 4470, -467, -3091, 3875, 1511, -5797, -230, 3585, -2284, -926, 5444, -1309, -5210, 1929, 1924, -3490, 1720, 4918, -3350, -3224, 3761, -484, -3415, 4083, 2575, -5251, -527, 3648, -2802, -1469, 5520, 46, -4794, 1764, 1494, -3958, 1022, 5472, -2423, -3093, 3505, -501, -4082, 3694, 3885, -4041, -536, 3216, -3130, -2112, 5185, 1211, -4251, 1705, 1845, -4444, 246, 5514, -1542, -3065, 3429, -328, -5003, 3234, 4590, -3443, -732, 3849, -3096, -3435, 4634, 1692, -3781, 1740, 2472, -4784, -1084, 5058, -785, -2440, 3607, 71, -5408, 1638, 4372, -2627, -469, 4275, -2610, -4461, 3588, 2282, -3526, 2091, 3015, -4866, -2240, 4376, -871, -2715, 4181, 855, -5661, 555, 3512, -3182, -938, 4806, -1866, -4855, 2778, 2002, -3843, 1892, 3975, -3818, -3042, 3926]
7093C926m481k336P223k535o959M917L439n946J733O535o477l820O924o99n608
7108d164N428L344p408n1N993m217k545P494r85p315M064L634o611J684P119n099
7124C65m858O436p83n913N843M392p650l09N916m336l768Q046L43p618L656L844
7140C606o889P11P758l990m961O044l29o942N051N286o310j187O001m439m333
7155d923P421J685o849K712M086p416o07Q029k775m718O294k89p249L523N989
7170D913o111j481O635l764n546P030J916o147K650M640p277j923P894j784n081
7185c436O247R08q162K578N796m956j350O618k914o390N440L038o527K929N354
7200E173p076k800P098j326m839O212K080q414J077O122n052j638P685k207o520
$$ y = [3926, -555, -2891, 4332, 1797, -5162, -245, 3194, -2752, -1019, 5516, -961, -4781, 2143, 1444, -4164, 1264, 4608, -2800, -2851, 3142, -1075, -3620, 3874, 2889, -4426, -362, 3272, -3339, -1655, 5464, 365, -4493, 1943, 1160, -4753, 1090, 5482, -2168, -2477, 3439, -897, -4665, 3381, 3724, -3894, -238, 3606, -3283, -2572, 5186, 1196, -3765, 2279, 1950, -4992, 59, 5345, -965, -2152, 3849, -590, -4923, 2498, 4183, -2666, 46, 4132, -3284, -3891, 4138, 1363, -3355, 2939, 2650, -4599, -1076, 4913, -1198, -2679, 3956, 192, -5354, 1676, 3592, -2555, 95, 4735, -2542, -4465, 3429, 1645, -3436, 2811, 3719, -4443, -1865, 3931, -1025, -2375, 4243, 1329, -5061, 379, 3417, -3110, -181, 5173, -1903, -4703, 2395, 1069, -3770, 2442, 4522, -3892, -2815, 3307, -1745, -3383, 4302, 2095, -4425]
7215d425M481K827o586K487O141n699l760O926j323n692O309K695p376J53N854
7230C012m579k271P645q59o946M395K360o874J976P155m569m027O152j018o260
7245d708N179L794o678r4O158m949l136P733J39p227L785L211p164J049P553l408
7261A237m247N611q11p107M601N226o198K5O269m804m786P275P03o724L846M475
7277D591p523n01P729l191m202O059l88p618M000N301n458k03O650m622n652O421
7293A393J627o162L577M376o805k055P354k400m489O743Q21p998K177N521n156
7308a476r41P078l495o240N628J990o193L668N430o399k932O349k088m630O379
7323B128K346p831J315N759n500j464P525k412o531M981K208o814L228O539n692
$$ y = [-4425, 56, 2883, -3703, -1216, 4925, -774, -4534, 2392, 1069, -4623, 1686, 4381, -2995, -2842, 3012, -1567, -3838, 3807, 2948, -3998, 397, 2757, -4117, -2141, 5014, 445, -3582, 2570, 1552, -4708, 471, 4265, -2413, -2507, 3651, -1298, -4434, 3299, 3438, -3789, -4, 3207, -3957, -2908, 4645, 1237, -3010, 2601, 1790, -5317, -716, 4510, -1688, -1663, 4606, -198, -4984, 2291, 2994, -3730, 116, 4591, -2932, -3433, 4296, 1105, -3097, 2962, 2574, -5044, -1044, 4257, -1201, -1404, 5246, 624, -5028, 1393, 3020, -3142, 435, 4811, -1994, -4049, 3305, 905, -3584, 3159, 3980, -4018, -1841, 3680, -1476, -2417, 4661, 1166, -5074, 554, 2544, -3649, 19, 5449, -950, -3882, 2467, 379, -4251, 2128, 4474, -3357, -2042, 3717, -1783, -3247, 4278, 1866, -4665, 316, 2524, -4290, -1062, 5477, -215]
7338b15l518O523k188n785O192L386p061O58N491n349k221P670r81o652M308K711
7354B969p119J621O867m288l394O031j681o358N896L962o440K17N427n536l145
7369d971P359M56n760M171K739p518L92P287m194l229O428j206o803M623M565
7384D339o264K86O206m979m597O914O18n770M146L713p584l95O642k772l928O484
7400C059j72p426L607M779n560j08O894m756m969N949J202o094M175M517p122
7415b025j599O923l015m068O914O37p708K612M775n406n09P280l164n898N345
7430A094J361o453L726N617o514k403O546k595m653O593K143p159J505M687n953
7445b458r63P433j945n796N051J127o488L107N882n305k716N962k505n547O502
$$ y = [-215, -3733, 2790, 602, -5183, 1009, 4395, -2666, -2008, 3483, -1866, -4087, 3583, 2602, -4050, 258, 2969, -4150, -2529, 4338, 50, -3344, 2687, 1006, -5352, 544, 4506, -1934, -1717, 3710, -1826, -4971, 2388, 2844, -2916, 1255, 3994, -3524, -3132, 4155, -39, -3268, 3160, 1954, -4849, -226, 4339, -1925, -1639, 4567, -412, -5009, 1905, 2523, -3247, 899, 4612, -2972, -3367, 3275, 503, -3425, 3059, 2887, -4539, -932, 3847, -1713, -1821, 5073, 317, -4652, 1297, 2499, -3595, 580, 5097, -2025, -3624, 3299, 284, -3784, 3130, 3767, -3941, -1329, 3446, -1960, -2469, 4811, 1647, -4251, 1094, 2455, -3998, -272, 5345, -1169, -3572, 2974, 379, -4274, 2319, 4462, -2697, -1192, 3495, -2458, -3421, 4012, 2067, -3729, 1322, 2449, -4039, -932, 4950, -355, -3071, 2891, 386, -5161, 1341]
7460A341L047o757J289N322o188k641P951j308n843N216J621p496K081O933m495
7475G3l461O838k351o451N615L693o306J111N402n707l268P464m73n512M574K437
7491C678p392O84O614l512k795O606j716o908M359L815n645N69O209n024m405
7506d863O658K22n531M547L781p663p92O772l392l046O913q20o605L314L732n777
7522b550N75O687m057m955N678P49o487M873M681p081j208N919l268l557O633
7537B632J193p042K366M358o117m31P823l082n424N187M94o325L642N459n369
7552f36k029O211l308m481O492J491o574J791M425n893o42P222k180n170M904
7567A623Q82p132L167N897m697k045N816k731n582N669K500o317K158M884n902
$$ y = [1341, 4388, -2369, -1080, 4242, -1946, -4587, 3364, 2056, -3787, 1429, 3050, -4446, -2365, 4568, 73, -3388, 3450, 1099, -5352, 263, 3956, -2350, -1239, 4163, -1544, -4812, 2652, 2179, -3333, 1241, 3678, -3714, -3030, 3584, 72, -2723, 3883, 2167, -4741, -382, 3433, -2212, -1643, 4566, -458, -4863, 1795, 2017, -3514, 1033, 4814, -2849, -3641, 3131, -261, -3307, 3606, 2786, -3819, -505, 3227, -2550, -1975, 4712, 655, -4300, 1378, 2127, -4360, 513, 5194, -1887, -3095, 2824, -444, -4001, 2632, 3825, -3217, -851, 3507, -2610, -3041, 4782, 1700, -3724, 1463, 1957, -4368, -726, 4733, -636, -2665, 3546, 238, -4243, 2249, 3740, -2834, -1043, 3382, -2511, -3153, 4069, 1889, -3281, 1623, 2505, -4627, -1460, 4437, -260, -2305, 3511, 780, -4802, 867, 3367, -2950, -792, 4092, -1810]
7582a810k220P099j256n047M872J419p285J951O435m499k635O539k240o364N021
7597b0L624o406J898N312n379l578O779j004m905N030K791p451M13O301m275k465
7613c335O711j388o597M509L301n713J438O061n388m187O063k09n099M733L637
7628D537o904PN686m023k914O836k66o868L331L539n612O85O646m007m240N451
7644A884n83n585M549M382o247q46N896l953l541O541J020o842K916L605o068
7659b872P8P184l097m188M912K24o532L496N565n842j074N515l537m315N990J951
7675C458n789K339L680o186j250P261k006m577N213O82o572K547N273m890j434
7690b251N790k646n748N771K355n488K114M282n809k419O544j119m526N096J425
$$ y = [-1810, -4030, 3069, 1813, -3234, 1638, 3057, -4228, -2277, 4158, -341, -2976, 3563, 1323, -5041, -20, 3604, -2802, -904, 4408, -971, -4549, 2230, 1226, -3679, 1351, 4142, -3309, -2896, 3405, -870, -3335, 3376, 1988, -4609, -100, 3201, -2512, -1074, 4987, -401, -4588, 1475, 1266, -3833, 900, 4537, -2367, -2360, 3326, -697, -3611, 3225, 2959, -3909, -578, 2961, -2651, -1966, 4680, 673, -3567, 1884, 1301, -4284, 265, 4647, -1600, -2446, 3450, -503, -4044, 2497, 3517, -3325, -409, 3196, -2872, -2794, 4390, 1293, -2895, 2017, 2241, -4291, -795, 4770, -1072, -2146, 3369, -168, -4483, 1507, 3458, -2331, 8, 3688, -2498, -3748, 3513, 1507, -3070, 2143, 2825, -3747, -1200, 4073, -817, -2251, 3539, 893, -4855, 916, 3271, -2217, -103, 4179, -1630, -4049, 2495, 1376, -3150, 1946, 3371]
7705C371p055J395N918m872j736O879k580n828M475K665n570K177N473n415k917
7720c620N934j052m891M810K656o686J21N268l976j750O606j018o151L325K870
7735B446n605J497O008m387l588N570r00n321M678L549o085k67N312m002k422
7750c517O429m6o245L323K754n821P58O645l697l916N441q05n650M483M173n645
7766a336o54N326m069l485O401Q44n905K946L277o210O0O371k864l559M928j26
7782A945o339L374N131m944j148N671l878m545N981J610n435K668L671n806j418
7797c462O543k121l669N189M60o707K408M810m587p43N872l033n278N166J951
7812B799n626K795M350n832k045O027j406m434N618J256o625J317M580m030j338
$$ y = [3371, -3684, -2289, 3629, -1243, -2979, 3900, 1320, -4508, -33, 2632, -2938, -761, 4712, -703, -3620, 2314, 1262, -3629, 1181, 3837, -2849, -2728, 2540, -1436, -3186, 3420, 2402, -3749, -424, 2446, -3159, -1662, 4346, -41, -3629, 1941, 1041, -4280, 398, 3947, -2138, -2405, 2907, -1095, -3517, 2912, 2866, -3379, -56, 2698, -3123, -2365, 4280, 583, -3333, 2108, 1303, -4347, 136, 4309, -1336, -1990, 3336, -733, -4218, 2183, 3027, -2878, 68, 3345, -2865, -2805, 3566, 702, -2857, 2071, 1945, -4394, -1020, 4111, -833, -1981, 3690, -188, -4733, 1248, 2858, -2577, 91, 3762, -2044, -3462, 3081, 960, -2709, 2480, 2940, -3767, -1359, 3451, -1136, -1879, 3993, 960, -4318, 848, 2799, -2827, -32, 4318, -1514, -3559, 2468, 1062, -3372, 2246, 3502, -3123, -1806, 2774, -1256, -2594]
7827b594O453k176n619M448K265n658K167M921m986k653N819j529m558N133K627
7842D060o579O53M246l903j876O659j193n521L718K012n448J906N274l980k773
7857b745M786j267n117N020L264n727J61M542l936k694O680n87n498L147K517
7872B546n723P62O095l238l328N388j335n418L802M300n262l96N421m143l850
7887d379N998Q82n311L186K790n932j57O144k501l430M996j22o000K943M307m596
7903a182k07N309l776m337N419J016m840L114L526o432q26N802k184l080N124
7918B446O22o343K142M375m531p04N862k924m462M197J255m647K815M364n665
7933a198j754N304j841m185N703J356o020J359M183m123j022N733j823n015L719
$$ y = [-2594, 3859, 1683, -3936, 512, 2777, -2881, -714, 4207, -779, -3432, 2387, 858, -3700, 1433, 4060, -2519, -1866, 2380, -1523, -3399, 3260, 2067, -3454, 264, 2276, -3172, -1266, 4008, 28, -2745, 2041, 774, -4343, 677, 3941, -1786, -1625, 2917, -1019, -3713, 2967, 2380, -3118, 29, 2546, -3177, -2415, 3680, 442, -2886, 2502, 1167, -4251, -449, 3851, -1411, -1807, 3614, -529, -4379, 1619, 2501, -2810, 376, 3166, -2766, -2923, 3221, 720, -2710, 2286, 2164, -3836, -893, 3414, -1182, -1389, 3920, 144, -4193, 1226, 2242, -2598, 516, 4042, -2390, -3216, 2586, 402, -2678, 2446, 3068, -3275, -1133, 3242, -1289, -1993, 3869, 945, -3517, 680, 1935, -2712, 103, 4467, -1198, -2952, 2352, 511, -3674, 2029, 3385, -2635, -1276, 2907, -1216, -2238, 3495, 1672, -3343, 376]
7948C76J893n415K298N074m557k249M647j800l791M954K098n640J079M056m466
7963a443j696O421j241n063L709J657n637J613N372l874k673N081j497m743M467
7978D53L168n548P75M232m232l015O569l35m909L478K134n759K18N816k909k869
7994b733M984j025n383L853L484m938K58M936m124l735N997R8m562L559K732o140
8010b739m15N707k692k623N586o03n704K662L363m268k08N769l638l642M362J022
8026A939m604K923L431n502j232N515k456k682N150L91o024J986L919m800k33
8041b279O001k437m604L979J107m976K889M371n044j368M634k054l692N424J162
8056C113n339J326L721m706n97N738j667m598M048P61n271K585M805m356j353
$$ y = [376, 2269, -3146, -848, 4226, -331, -2580, 2067, 267, -3524, 1430, 3528, -2112, -1033, 3023, -1443, -3139, 3282, 2041, -3022, 687, 2344, -3293, -1680, 3692, -182, -2855, 2226, 729, -4014, 453, 3621, -1927, -1152, 3080, -1152, -4167, 2402, 2067, -2842, 636, 2770, -2989, -2771, 3045, 136, -2733, 2251, 1226, -4157, -304, 3180, -1758, -1500, 3436, -688, -4423, 1574, 1672, -2890, 669, 3401, -2739, -3154, 2553, -139, -2762, 2824, 2221, -3483, -821, 2542, -1726, -1934, 3835, 197, -3445, 917, 1939, -2665, 258, 3689, -1813, -3045, 2470, 14, -2668, 2482, 2873, -3151, -1165, 2754, -2046, -2279, 3722, 1285, -3319, 660, 1767, -3209, -320, 4051, -993, -2361, 2273, 219, -3473, 1951, 3113, -2226, -900, 2821, -1885, -2482, 3256, 1589, -3009, 1039, 1800, -3471, -886, 3919, -437, -1790]
8071a790M795k524m092M628J991n112J339L812m665j353N836r54m677L917J066
8086B217n203J460N090l849j881M863j711n077M548K490m773R38M087m472k288
8101c561N660n07m326L537K095n439K2N319k859k239M981r42n766L609K903m573
8117b086R72M554l948k866M958o2m112L310K904n855j24M762k824k255N181q5
8133B424n579K303L298m708P35N338l493l859M500M62m434L244L450m987q25M282
8149B151k354l236N455O13n315K086K944m514k7N494k261l801M052K02m906L086
8165c31L605l857j246L959k249l522M938J747m950J581L049m571r54N788j808
8180A179l620L940P19n531K651M117l675j550M645k608m134
$$ y = [-1790, 3005, 481, -3611, 1017, 3008, -2104, -765, 3047, -1618, -2971, 2865, 1911, -2766, 1151, 2217, -2986, -1526, 3564, -285, -2166, 2697, 986, -4091, 457, 2947, -1826, -888, 3199, -1273, -3561, 2099, 1592, -2734, 803, 2898, -2541, -2519, 2800, -59, -2298, 2683, 1741, -4025, -416, 2487, -2086, -1114, 3440, -508, -3374, 1584, 1522, -2590, 720, 3624, -2231, -2355, 2407, -417, -2672, 2509, 2424, -3155, -852, 2446, -2262, -1527, 3811, 318, -3541, 959, 1421, -3013, 231, 3681, -1306, -2131, 2151, -203, -3439, 2016, 2629, -2686, -600, 2344, -2170, -2197, 3297, 1036, -2765, 1287, 1489, -3417, -331, 3274, -583, -1829, 2130, -119, -3641, 1297, 3044, -1906, -325, 2724, -1847, -2801, 2987, 1179, -2441, 1499, 2218, -3313, -662, 3455, -220, -1770, 2875, 267, -3867]
8191c867
$$ y = [-3867]
$$ Imaginary data points
##PAGE= N=2
##DATA TABLE= (X++(I..I)), XYDATA
0@%%%%%%%Qj6J6j6J8k6L2m0N0n8P0q3R8j13J31j53J78k03K29k62K99l40L84m30
31b27M82n42O07o78P55q38R30j031J144j267J401j550J717j902K110k347K614
48A378k924L285l708M219m848N644o688Q121j0215J3579j9833L5192j38216k05737
62c20751L03859N5989j04524J54180J04762k11134n3828J01508o3414m8502Q6255
73D400n2908j2954J87300j2475k01006Q2799R4001k22055k4422K87907l1108k11515
85a12036J36860J20969k10116o2986J41068m2346l6434J57748J8896j04719J8994
96B5898o8911j47903J43739J81223j38804m4280J82354r0784j93780J74190J21953
107A44895k39603o2720J98344r844o5149J33034J108j56802J5684L3961p9237
$$ y = [0, 0, 0, 0, 0, 0, 0, 0, 8, -8, 8, -8, 10, -16, 16, -24, 26, -32, 38, -45, 53, -60, 71, -82, 96, -107, 122, -140, 159, -181, 203, -227, 255, -287, 320, -358, 397, -441, 489, -542, 602, -665, 736, -814, 903, -999, 1111, -1236, 1378, -1546, 1739, -1969, 2250, -2598, 3046, -3642, 4479, -5736, 7843, -11990, 23202, -115014, -320751, -16892, 39097, -65427, 88753, 193515, -17619, -71447, 30061, -33353, -81855, 4400, -48508, -61462, 125838, 113363, -87643, -4844, 89157, -132898, -157320, 130587, 99479, -112036, 24824, 145793, -64323, -127309, 13759, -28587, -65021, 92727, 111623, 6904, 25898, -43013, -190916, -47177, 134046, -4758, -49038, 133316, 42532, -151248, 22942, 144895, -94708, -157428, 40916, 31072, -34077, 98957, 100065, -56737, -41053, -7092, -86329]
118h6329Q4355J09975j41061l5671J80637p2761j82923J56083J21354j98597j3062
129g8000J96650r6280j61977J38476Q2240j04806M2754N7861j24905q939J04469
140D7543o7137j8528J41954p9180j70810J49568J26508j72685p466J71576j19737
151A606j53164J77446R0917j57039P651Q8971j00531j7369J29535l4570n6764
162b3311R6882n0509j46832J03572R1272j44897L2331J99038j00436j67115J28145
173A8140M3632j68455M9969J54188r2385o4804J12533k2230p5341Q9388p393j33117
185i5875O3535Q8157j08921K8825J67657j06663j64522J22629N3567j43814P1951
196b3474J62124j18007j03654J08203j8267r6578R9566N6015j03125L6065P2940
$$ y = [-86329, -1974, 108001, -33060, -68731, 111906, 39145, -143778, 12305, 133659, -64938, -78000, 118650, 22370, -139607, -1131, 81109, -23697, 19057, 76918, -47987, -56926, 47543, -19594, -38122, 103832, 24652, -146158, 3410, 129918, -42767, -50233, 121343, 1606, -151558, 25888, 116805, -40234, -32583, 56388, -44143, -61512, 68023, 33453, -23311, 73571, 23062, -123770, -20198, 71074, -73823, -41492, 157546, 57110, -110005, 18140, 61772, -106683, -56714, 97474, 5089, -59715, 52818, 30588, -44753, 44635, 37242, -95875, -32340, 55817, -53104, -24279, 143378, 36715, -127807, -5178, 48389, -95425, -23474, 138650, 20643, -83011, 25192, 6925, -89653, 9913, 65928, -37197, -1132, 71808]
207G1808j17812j6328J40019o8680j20110J31939M9263j51819N9360J56130j22119
218A1651j08209J17058j4162j11198J09432R4337j05934k703O6740j08122l5844
229h6954J39390k5908r5592J13783L3580j64830L4466J48549r8220q0662J35750
240E3352j1710j36326Q8200R7356j09449j1526Q7278q8770n6341J31126N155q9669
252d1324Q6069K8839j59336J4385J41869p1708o0445J39562j3008j51668O5269
263b1496R3909j06283q176J13586o8675p7759J11041J3092r7085O9335M9504j34803
275f3810j165J27760o0694n7389J35971o069j58391M5678R0513r7486L203J37652
287I5773n7094j03464Q4559J0320j03439P0193Q3526j11719j6676J13525o0320
$$ y = [71808, -46004, -62332, 77687, 9007, -111103, 20836, 70099, -81720, -22360, 133770, 11651, -96558, 20500, 6338, -104860, 4572, 98909, -7025, -9728, 57012, -51110, -86954, 52436, 26528, -69064, 44719, 78299, -86531, -52065, 96484, -1736, -82398, 53352, 41642, -94684, -6484, 90872, -18577, -30103, 57175, -31595, -87936, 43190, 48345, -41324, 44745, 73584, -85752, -71367, 70502, -1206, -61651, 77911, 64903, -86765, -21496, 72413, -33870, -42046, 71540, 2865, -74894, 36147, 49239, -47846, 21489, 70993, -63810, -64975, 62785, 2091, -55298, 80673, 74604, -83787, -38109, 52404, -45082, -41879, 95773, 38679, -64785, 19774, 30094, -73345, -3152, 80374, -31345, -48021, 65504, 5184]
298E184p2781J22440R742j45679M4011R5649r3814n714J37539n2883j17011P5948
310B631J8193j05544P1142J10163r4683l8421R4927o6313r1466J16750M3866j13346
322e2101M3392Q7401j09213l3981J27605l5846j03994Q3217L2847j08868N3269
333a6272J11417q9628n3328Q8446n3227r2605J14065O6711j00042K6029P3489
344G5055j14638n1653J26093p888q4265Q7405L6004j24292J9233J02620p4930
355a1256m4099J05548l1158j02004Q9878O3196j01141J6250Q3642r8570n9239
366h8953J20015N250q1324Q0861L8690j31900j09J04731n9035l7806J15211j9502
378D6129j17428O4096O1410r6661J8698J03805q1747p3906J02259M170q6130P9819
$$ y = [5184, -67597, 54843, 64585, -81094, -37083, 58566, -35248, -40962, 96577, 43694, -73317, 2631, 20824, -84720, -13578, 96585, 1902, -36519, 58408, -7905, -99371, 17379, 61245, -52101, -8709, 78692, -30521, -64502, 63103, 27257, -76737, 6480, 39327, -69541, -16272, 95145, 5517, -47811, 40635, -12592, -105197, 8868, 75579, -24463, 1566, 75055, -39583, -91236, 34857, 26969, -57296, 30109, 66113, -58179, -38946, 63674, -11256, -55355, 50193, 19035, -82969, 6909, 70105, -31036, -14786, 68856, -29714, -88953, 31062, 36312, -45012, 35849, 74539, -57361, -57470, 47261, -11774, -49580, 65631, 46129, -71299, -7203, 54207, -42454, -23756, 80049, -1698, -75604, 26655, 30825, -55305, 24514]
390B4514N7940j21973j2451R9255n8765m7473J18238q32j17820M9933O1511r5794
402d3717J0797J12659o5935q1572R0529P088r1298P4203P4432j09210k5716Q9331
414D1591n6779n5279J19038K1887j10613L5214N6023j01914n764J20035l8544
425B4895p4884Q3971N913j05328N3336Q2528r0721k5541R2693m8208o8106J06191
437C6739L1737j06268K5480N9200r8050j7194J23218j7399p2943P3338M113j17742
449g5771L6050R2691o8164j8727R8265m6485r1043Q4546L7780r6380L0736P5530
461E9028q9772l4086J11975j3915p7512P2074J7385j16913K4290R7251n7617k1689
473b9501R9882m2175j06539O8353M6319q5022L5573R0803q4535n4791R4257j3554
$$ y = [24514, 82454, -39519, -51970, 47285, -11480, -58953, 59285, 58453, -59367, -9434, 52077, -43717, -32920, 79739, 13804, -67768, 22761, 29849, -61449, 12754, 87186, -22024, -47740, 41591, -15188, -70467, 48571, 70458, -40155, -4941, 51082, -50832, -56596, 63439, 24895, -49989, 33982, 39895, -65433, -12097, 70431, -20290, -45831, 46862, -1346, -69452, 36739, 68476, -37792, -12312, 46888, -51162, -68356, 54862, 37463, -35480, 37858, 41971, -75771, -39721, 52970, -15194, -33921, 64344, 17859, -73184, 11362, 49142, -47238, -16502, 59028, -30744, -64830, 47145, 33230, -44282, 27792, 45177, -71736, -47446, 49805, -7812, -29501, 70381, 28206, -78333, -9980, 36339, -48683, -13110, 77693, -6842, -61633, 32624, 19070]
485A9070p7778P7771L9939j08996Q740R0407n8291l1023J02085k5886j07069N7564
497a3467M9995q2326K9212R8926p2365o6827Q0102j0692p8516P7342N8919r7096
509b6793m262P9394o0990m2531J02557l648r8728M8484M9604q5990J5408J03045
521G5550n6073p0658P1456n438q2193O9556P1936q4497j3008P2716o3851n5675
533g0179J01744J7877q9116M3746N0428r3910n499J02782l8758o6241P4043K112
545B9029r1696N3288P6275p5324j6665P4720n9104o5632R6338K9690q3640L9524
557F803N3853r8686k2761J02409k3912o1206P7596J1236j01628L1585P5315o6851
569a6247j5328Q4664m4435p4279P9241K7892q2478L9143O6333r1319l6071R5905
$$ y = [19070, -58708, 19063, 59002, -49994, -41254, 49153, -9138, -40161, 61924, 36038, -71031, -13467, 36528, -45798, -16586, 82340, 9975, -56852, 23250, 12558, -65958, 11384, 70303, -26793, -31055, 48339, -12651, -55182, 47375, 43727, -55001, -6517, 43087, -42903, -27495, 75550, 19477, -51181, 20275, 14837, -67356, 2200, 74136, -10361, -23369, 49347, -14504, -70179, 31565, 49442, -39674, 4072, 54500, -39410, -44909, 57873, 19115, -47126, 26917, 29029, -62667, -9379, 66896, -8428, -25093, 49627, -9477, -75109, 21229, 50919, -32721, 6803, 60656, -38030, -60791, 41618, 17706, -43500, 34096, 45332, -56296, -24711, 50604, -16247, -31575, 53089, 8654, -65625, 13616, 41508, -40970, -1827, 64506, -26813, -62884, 33021]
581C3021j7967o1642P9158K4506j06053R942P3544n3865j3629R1370l1923q4959
593e8497N8101K8586p5834L9684P6696q0900m4324Q6903j6381o9745P5590L9280
605E9159r8286K030P5273n1818k8162Q8553j4661q1978M8983K9905p7249K9378
617a8873Q3690o3462m4165P6848k4221q1059P5828O0797q4634m341O8147o1865
629a7310m4109R4857J0318p7054L6787K8903q0003J9857Q8987n1087m8722P0000
641C1424j9876q0114P2737O4812q5455j0296P4750n6595n6251Q9965J9990p6454
653c1363L6056M2090p9894m356P9572l8522l9709P7336q979q9130M8694N8285
665E0080p4700J362Q6745n7430p6128P9224L1969o8652L6793M9255q6675k8075
$$ y = [33021, 15054, -46588, 32570, 57076, -48977, -39035, 34509, -19356, -32985, 58385, 26462, -58497, -396, 28190, -47644, -7960, 68736, -12164, -56488, 30415, 14034, -55711, 19879, 59159, -39127, -37097, 38176, -13642, -41804, 46749, 32088, -49890, -907, 28998, -48251, -18873, 64817, 1355, -42810, 34038, 9817, -71242, 4586, 65383, -19251, -23592, 44555, -17310, -61419, 33438, 43756, -33298, 3489, 32392, -47611, -27754, 61233, 10146, -38576, 31424, 11548, -68566, 4171, 68983, -16472, -26768, 47982, -8613, -64864, 25101, 45091, -31363, 4693, 46783, -33111, -37467, 42105, 3583, -36126, 41210, 32231, -56899, -8205, 50080, -24620, -23258, 63487, 6057, -70071, 9153, 41122, -27530, 9263, 58518, -28157, -56232]
677e6232Q0835j3649l4681O8090p658r2681L5634O1042o3928o77Q5801n0024p5841
690f3969P6487K9537q1791K7744O7403o8834l3699P5648j4655n1689O1221J5409
702C8812p7951K2036N0033o4586j777R5242l3915p9022N9025J7097q6562L9462
714b2106R4112o0470n3055O1696j6874n8789O6586L8165p3501N896M8696n6804
726b6448p909Q6919l0955p7449O0519K7667q3324L1423Q9282o3786n5648P1935
738B2226r031p3093N6619N4064o1979J703M8539n9795l1960P6765o531n4149O3241
751B6619K1782r7363J2170Q6455m9570m3458Q0119q037q7688M7105O4990n8719
763e595j0481N1337n1233l9087P5841J0406n1950M5498J7754r2594O579Q5442
$$ y = [-56232, 24603, 10954, -23727, 44363, 36705, -55976, -20342, 40700, -23228, -23905, 61896, 11872, -63969, 12518, 42055, -39736, -11992, 55411, -13423, -47122, 28526, 13871, -37818, 23403, 38812, -39139, -17103, 32930, -31656, -33433, 61809, 27894, -51128, 7897, 24994, -61568, -22106, 72006, 11536, -41519, 20177, 3303, -55486, 11100, 49265, -24236, -18340, 30356, -26448, -34357, 52562, 21607, -55842, 4677, 32344, -50980, -19557, 69725, 5939, -49709, 22226, 13195, -59898, -3279, 50785, -11194, -9491, 39048, -20747, -52707, 24058, 17527, -36622, 26619, 48401, -48962, -36792, 49663, 93, -43365, 36754, 28717, -58971, -11866, 53124, -5595, -16076, 35261, -15972, -55059, 20782, 31188, -20762, 24736, 42490, -50104, -43525, 41917]
775D1917m0610l7834Q4533l610r6940L2381N9976o1079o409P6286l2585n5765
787c9739N3449Q273n6653M2672L6490p4778k195P3891l9460l9270Q1960j188j00065
800e6613K9083O5920n6800n217Q6061l1976p7968M1698J7373n2685M3896N5554
812E8326o3584j8993N7027m2912m4891Q2470J6328q4177K9677O0756p0955k0956
824d1884Q7596k1295p3742M8021K8046o1346K8364O2292n6940l1902N1071l1322
836a3041m2026Q0470K8692p7145J6928M7967p6930k7038R4516k499o4331N1365
848A6928K6559q1021N634O6421m0160k7366O0849j7849n4816N7719K9718o9716
860b7100J3667N0755o7396k7516R2083K366o5627M4395K3210q8293N38Q0887k3462
$$ y = [41917, 1307, -36527, 48006, 44396, -52544, -20163, 39813, -21266, -27675, 48611, 16026, -39739, 13710, 21983, -34670, 8002, 44492, -30286, -32481, 41410, 1950, -37320, 44640, 43452, -56613, -27530, 38390, -18410, -23627, 62434, 30458, -47510, -5812, 11561, -41124, 2772, 58326, -5258, -24251, 32776, -10136, -55027, 27443, 43771, -40406, -10729, 50027, -20928, -41884, 45712, 24417, -49325, -1304, 26742, -34604, -6240, 56052, -888, -32790, 18281, -13041, -55067, 25403, 54095, -23050, -6122, 41845, -35085, -62123, 32393, 29894, -34437, 16928, 43487, -37534, -31900, 34521, -5639, -33005, 27844, 9995, -44821, 12898, 42616, -27100, -13433, 37322, -30074, -57590, 34493, 36859, -28768, 15627, 38837, -49456, -48918, 31969, 8507]
873H507k7172O1291j8417p5454L7382L7728n4695J9925O4528n5325m0243P1545
885B9600p465p0389M9476M1894p6574j130P8663l2750m1121O3511n498p8913L0147
898b0549M6904m8109J5410O7643n1453n6142N6649j784n7672O0424N3987p7702
910a2394j9188O3712l8504m4225P6814J7205p3405K3156M4933n7378m886O6691
922D2531l6352n1969N7806R492n7853M7349N1904p3758k5055O1369l4723m6480
934e5739P8354L0690o9958J3349M0036o5514j6225P7232j2265m7356M9469N145
946B7218p1740K9126N9672n3584j7585O5107l1373n7620O4435L0162p1086J1400
958a5868M9489n7266j9885Q0698m889n5641L9676O955p6265K0186O8143l8378
$$ y = [8507, -18665, 42626, 24209, -51245, -13863, 23865, -30830, -10905, 53623, -1702, -41945, 29600, 22135, -48254, 1222, 43116, -33458, -34588, 44075, 11325, -29796, 33715, 28217, -50696, -20549, 26355, -21754, -6344, 61299, 9846, -46296, 10353, 8569, -49103, 11321, 65308, -12394, -31582, 32130, -6374, -50599, 26215, 43420, -29985, -6829, 38104, -19274, -24160, 42531, 6179, -45790, 12016, 21508, -36345, 11004, 62908, -10850, -35905, 25464, -9259, -55739, 22615, 53305, -16653, -3304, 36732, -28782, -45007, 32225, 19960, -27396, 22073, 27218, -44522, -15396, 44276, -9308, -26893, 38214, 6841, -50779, 13656, 43818, -27268, -15868, 33621, -23645, -43530, 37168, 32279, -23362, 16314, 23269, -52996, -32810, 35333, -3045]
970c045j5322O6292k9820p1610N0587L2954o3586J9489O1645n6206l6696O9323
982B4005l631n4689M7502K4403p4891O614O3971l8901k2628O6733j9470p1649
994e2631M5240L9779n6889J6595O2744n7251m9861O0924J230n0656N3664L9943
1006E2831p0895o831N5439m0859l0162O9858l241o8047L7067L8242n8722R303
1018a6017O8302m5048n0833N4967J650n7241M8344M8144o4050j3070N4732l6791
1030f911l5006P0778R196o8205K4964L4374o2396K610P6655k7337m7905N1312
1042B2129n70o7890L7030N4205n5299j3279N7611l4905m4819O7780J9175o4339
1054b3171K1924L7012o6360j0816P6136j6651m5738N2815M726p2669K6711N7755
$$ y = [-3045, -18367, 47925, 18105, -53505, -2918, 30036, -33550, -14061, 47584, -8622, -45318, 24005, 20374, -34315, 13187, 37590, -37301, -30687, 33284, -5617, -28245, 38488, 19018, -52631, -7391, 32388, -24501, -7906, 54838, -2413, -52274, 8650, 9880, -40776, 12888, 52831, -18064, -24895, 30544, -10315, -40477, 29381, 26140, -41907, -4840, 33402, -25320, -16017, 52285, 7237, -43596, 11371, 13021, -44220, 4124, 52268, -11782, -24852, 29880, -6911, -41917, 28861, 38057, -30148, -5184, 29190, -33206, -30596, 46059, 18722, -29183, 22129, 21559, -46331, -9301, 44904, -10395, -23674, 33937, -968, -45787, 21993, 41168, -23171, -1247, 35765, -30595, -41411, 34725, 18074, -27664, 25151, 29877, -42792, -16081, 41674]
1066D1674m9081j5166O0109l3958n5576O0276K7724n7819K2974M4674o5578k5249
1078d4996O9892j1299m5652N3313J4067p4747J5853N9516m2284j5645O3537k7675
1090A3880o5185M7578K9887n4613K3799N5257n7543l4859O1324r093m7572N3302
1102A6162K4469p2779L845N6319l8787j8145O9048j4474o7161L6360K8655n7263
1114c3751J8518O3355m7139m0502N6335n815n1222N1529L4801o8278m928N2183
1126B5086l9822k4365P2605m68o4874L0783K7852o1710J0291O9058l6837m2176
1138c4577N3711n427n8645M6021M5371o0598p169N2551m1310l3979P0675P884
1150C4508o3173K8342L0348o3823K804P3972k6795m2010N0883o840o8919L6910
$$ y = [41674, -7407, -22573, 37536, 3578, -51998, 8278, 36002, -21817, 1157, 45831, -19747, -44996, 24896, 13597, -32055, 21258, 35325, -39422, -23569, 35947, -6337, -21982, 41555, 13880, -51305, -3727, 26160, -28453, -4654, 50603, -6940, -41799, 19525, 10432, -37140, 16162, 40631, -32148, -28303, 28016, -10771, -28916, 40132, 25658, -41503, -5143, 23512, -33751, -15233, 48122, 983, -39519, 16816, 11001, -40221, 11308, 46109, -22169, -27097, 25086, -14736, -39101, 33504, 33036, -31838, -1055, 26797, -34913, -24622, 44436, 7599, -34577, 19134, 13707, -44938, 1083, 46454, -14144, -21313, 31238, -10072, -44051, 26624, 34508, -28665, -323, 30025, -33798, -30994, 42978, 16183, -25827, 25056, 18216, -50703, -13793]
1162a3793N3127m9037l907N6573l9922m8119N9733J2901n8454L0142L9598o2151
1174b3309p984O9625k2376m4050N0151J461p0293K8721N7197m3361p990N7141
1186D4933l7554n8266N1486K2015m9848L2576M7263o2185k5529N8396j9534m2831
1198c9078N7377J7299o6823J7787N1929m6001j5797O0024k7061n9339M7178K8354
1210B5849m9460K7345N1273o0048l6493N3736j3816m0598O1359K9352o7185L792
1222a4894M4477m9065k0166P0079r528n6267M1843K4256o0449J5032N7303m7704
1234e083l4445N6846r709m7321N4864L3952o6855l692M4771m6929k2706P5702
1246B9395L715n6537L3072K0033o8452P337O6089l3025l1962N5549p964n8468
$$ y = [-13793, 39334, -9703, -13610, 42963, 3041, -45078, 14655, 27556, -30898, -756, 38842, -23309, -31293, 38332, 15956, -28094, 22057, 23518, -46775, -18054, 39143, -4218, -12208, 44933, 7379, -50887, 599, 22614, -27234, 5342, 52605, -9580, -35109, 23287, 3753, -39078, 18299, 35598, -31225, -13438, 38491, -7510, -23307, 36717, 9656, -49683, -2505, 25849, -23611, 3734, 55007, -5041, -41534, 12202, -1614, -42212, 19147, 48499, -18686, -14894, 29583, -19482, -39648, 30431, 20903, -35364, 6479, 30735, -29714, -14682, 42621, -5083, -39528, 17318, 7609, -39712, 15152, 49104, -17751, -21443, 23328, -23601, -46307, 29395, 33110, -23427, 9645, 29678, -38774, -31437, 34652, 1627, -30335, 25214, 17250, -41218]
1258d1218M3087L8662n8375l242M9855m2163l1152O8708Q543n5926K9945K5364
1270C2088o7303r23O8070k4548l2977N4962l977o7052L0085M3383m8266m79N6026
1283C9089l7705m3406N7169J1062n2803L1703L3629o5535j0775O5631j8800l4241
1295b4982N6317J355p1594J9515M6272m3523k091O1810k9658m9987M8111J1060
1307B2605n4415L0420M3115n9132j5929O1921j9183m0218N6529J2075p1338J3617
1319a9933M6182m4335o485O8209j9448n5168L7775R959n6398K9451N4895m8001
1331c297k2228N4815k3012m7602N5286K3607o5100R619M8098m4024j5733O7570
1343C7999j2054n8190L3052J6092n5887K2912O0618l9489k6696M9379k2935n4353
$$ y = [-41218, 1869, 40531, -17844, -21086, 28769, -13394, -44546, 24162, 32705, -23221, 6724, 32088, -35215, -36138, 31932, 7384, -25593, 29369, 25392, -41660, -11575, 31808, -16458, -16937, 39089, 1384, -42022, 15147, 26209, -26594, 5109, 38738, -26797, -37572, 28059, 9259, -24982, 31335, 32690, -38904, -19389, 26883, -16640, -18731, 43079, 13421, -36566, 11545, 22605, -31810, -1390, 41725, -17407, -33336, 28585, 9402, -30816, 25713, 37788, -33550, -19933, 26249, -18086, -24571, 43638, 24190, -30978, 6797, 16756, -39642, -10191, 44704, -3297, -25525, 29290, 6278, -41324, 13962, 37569, -27531, -17912, 30186, -13838, -29571, 37999, 25945, -32245, 807, 16899, -38988, -16076, 44542, 5053, -21643, 27736, 4801, -49552]
1355d9552M9978L3877n5078J0283M9213m7668l0256O1915k529n2865L5820K3533
1367B6671n8576R312O0064l1560k8018M7583j7833n8641M4266M0790m8318Q078
1379f182M8982n0022m0591N9757N821m8518L8449L1350o2440m285N7242k8144
1391A419l0211N2498n985n9346L4981L9526m8121M939N3232m5000m5490N5639
1403H081R989m8159L9375L8701o3570j5603N3493k5187l0723N8681O644o1232
1415b9510K2519L5733m8788J108N9155l2977m6252N0195R345n2620L5183M5213
1427D8304n8947k1314N2161k0604l5398N8572J7349o1334J2622L3917m9186n373
1439b9231O4912j8654m4286M2678O725n8136K7496N0522m8681k1164N3450j9879
$$ y = [-49552, 426, 34303, -20775, -10492, 38721, -8947, -39203, 22712, 20183, -32682, 3138, 26671, -31905, -22593, 37471, 5911, -22107, 25476, 7643, -50998, -6732, 34058, -14260, -6182, 42800, -7222, -47813, 11944, 17765, -30753, 7696, 39046, -23394, -27679, 29563, 1419, -28792, 23706, 17721, -41625, -6644, 32882, -15239, -10300, 42932, -2068, -47558, 8081, 18070, -30089, 9286, 47987, -15583, -31186, 22307, -2880, -33603, 25078, 31722, -29510, -6991, 28742, -20046, -18938, 40217, 7240, -39012, 11183, 20528, -32092, 3091, 48304, -10643, -31957, 20204, -400, -35798, 22774, 40123, -21211, -8589, 25328, -23858, -29231, 35681, 17027, -27259, 15419, 22144, -35992, -8496, 42026, -6655, -27819, 25631, 5752]
1451E752m3808N3026K4343n8136P118L8149m6289j3838O3639p885m4839L7663
1463A4895P683o1453J9588N5101l8225j9021N4479k1760n5521M5438L0966n2458
1475b0288J0097M5753m5846k6454N8641l309m4243L6424J5048o1584J1783N6762
1487C2784l2515j9647N3550k0434o2539L9801L5914m7462J0680N2794m3149l7835
1499c8058N1072l13m5394L8443K7521n6764J511N0919l1943k3978N5893r329o1565
1512d1985L2464L5706m7053Q149N7322l8157m5688M4926M109m3784L9542L7812
1524D3363n3913j1615M3807l0809k6288N9319M126n6730K5184L2494m9665K55
1536b0472N8887l0101m6125M5285Q660m7256L3503M3080n0556j7354M2551k8279
$$ y = [5752, -38056, 14970, 39313, -18823, -11705, 26444, -19845, -33683, 29956, 22071, -22768, 14895, 22578, -38875, -19287, 35814, -2411, -21432, 33047, 11287, -44234, 1204, 32170, -20288, -10191, 35562, -10284, -36738, 21903, 18594, -25649, 10775, 25823, -35761, -23978, 32784, 269, -19378, 34172, 13738, -48801, -9000, 26914, -20548, -9868, 42926, -223, -38058, 13014, 12701, -32693, 5750, 33271, -23493, -21982, 28937, -3006, -26984, 28909, 19580, -41985, -9521, 26185, -20868, -12719, 44603, 6446, -39242, 5684, 9793, -33991, 5551, 43363, -10550, -22165, 21642, -9167, -35455, 23864, 27990, -28740, -3556, 28938, -20727, -20472, 38415, 8314, -37811, 7474, 16134, -31122, 2381, 45461, -5095, -22449, 20102, -8177]
1548h177l2536N8372J6318n2441J9816L0639n4971q452O1700j8248m0935M4137
1560A5222Q149n6494K4391M8768m3167j7951M5773k5306m0038N2355K2611n0115
1572a5802J5440L2664n3516j5480O2447r859l9567M2432R755o1991J4952N0614
1584C2089l7486j6786N1716j8964m7865M2876K3737m8038J3672L9125m9022k3050
1596c7996N7393m875l8061M2838J5619o3897M312M7454l2366j5615N6846j1032
1608B0620n3666L2649K5005m6957J0786M6006m1598k9234N1201q63l9896M0114
1620A4167K2734o1259k952M6503k9380j7940N9421l486n6020K4445K3559m9135
1632b9343Q758N5690l0211l2279M5310m274m8030L5409L1782n2052l744M7238
$$ y = [-8177, -40713, 17659, 33977, -18464, 1352, 31991, -22980, -31432, 30268, 12020, -28915, 15222, 23371, -33123, -8732, 40036, -3131, -21082, 24691, -615, -40653, 11702, 34313, -15802, -362, 32302, -21214, -36694, 25753, 15894, -23673, 18759, 28514, -33477, -18525, 32089, -5397, -22183, 29533, 10569, -37296, 5580, 29317, -18721, -5049, 34076, -14946, -37996, 19397, 14522, -23539, 19299, 34918, -28979, -24667, 22787, -9579, -25194, 31652, 20620, -33046, -397, 24608, -22349, -11563, 34443, -7155, -36389, 14812, 13949, -25947, 14167, 36901, -24358, -27310, 19193, -10187, -28127, 31294, 27808, -28212, -3767, 19792, -29343, -20585, 35105, 4894, -27385, 17925, 13651, -34379, 1030, 32812, -19240, -22984, 24254]
1644B4254k8811k5185N6970J633n6621J9893K5769m8403P148O2221k2775l6662
1656b0569L8202n803n4347L1337M2646m1287l680M6582l1065l6778M9679Q973
1668B3890n1222K1714L2310m7742l017N9101j8448l9469L7894k39n5027K5783
1680a4472M8094l5221p909M4431l1146m5132M4650J7988m2603K3357L6557m9964
1692a1370j7755N1735j3978l6138M2469J0643n4738J5669M5015l4892j2550M6640
1704C0750k3237m6897L9356K2646m1335K0548M0068m7962k6905M7009q810l4613
1716b9382M4360J9361n5268N491M0629l4318j4954N2709j2364m8793L1932K1559
1728B0962m4143J6664M6217m0707k9311M3635p576l8547M2526K6511n2443K6L8648
$$ y = [24254, -4557, -29742, 27228, 28861, -27760, -7867, 17902, -30501, -23353, 38868, 16093, -20569, 17633, 11830, -42517, -11180, 31466, -9821, -13501, 33081, 2016, -34762, 14917, 23890, -27332, -5618, 26692, -21050, -24067, 35034, 16586, -22883, 15011, 14772, -40255, -14472, 33622, -1599, -9508, 34923, 3777, -41355, 3295, 21283, -21320, 2037, 38594, -11370, -29125, 22610, 8632, -27506, 14963, 25606, -29132, -13463, 31552, -3340, -15890, 30750, 7513, -39384, -28, 22618, -18717, 1831, 41899, -6063, -32968, 14041, 5231, -29382, 14978, 34339, -20929, -15438, 25191, -9127, -24081, 28628, 16264, -32529, -597, 20962, -23181, -6517, 39700, -1007, -30318, 13317, 5741, -32806, 9720, 36231, -16212, -16186, 22462]
1741B2462l3905j8575N5109l131m8892K7084K0454m7349J0460N1359l1339l0088
1753b6351M1682p636m3754L7737L3423m6680l309L8804l4170k5795N3588N804
1765B3343m4771K4655K1488n0465J352N2411k2578k9133M1341l546m8955K9613
1777e245L6520m1201m240M0895l1390l2711M8384J1997m1918K3042K5637n0758
1789b0988p845N0592j5720k7695M2218J237n3238J9745L7591l5913m116M5482
1801C1350k6664l9476M1213J3606m0708K2378L2183m7234j5145M7587j2769k9967
1813b3646M3742P892n4705J1886L7549l3538n498M9472j9576m4125L3983J3885
1825A7321m1556K1652L9455m1737k0703M3046j3029l2341M3345J6799n1980N973
$$ y = [22462, -11443, -30018, 25091, 21960, -26932, 152, 20606, -26743, -16283, 35076, 3737, -26351, 15331, 7695, -36059, 1678, 35101, -11579, -14888, 23916, -10254, -36049, 17539, 23343, -21428, 3227, 24715, -25750, -24398, 28013, 5435, -23698, 17643, 14097, -34858, -5245, 31275, -9926, -14166, 26729, -4661, -37372, 11012, 23009, -18909, 4133, 29770, -20988, -28833, 21759, 6039, -21656, 20562, 21799, -31439, -11694, 25897, -10016, -14132, 31350, 4686, -34790, 6423, 20029, -20679, 1699, 33882, -13352, -28497, 19090, 6321, -23646, 20096, 27988, -26717, -14831, 22718, -10820, -16318, 33154, 13578, -30547, 3436, 17321, -24235, -2583, 36872, -4865, -25568, 17478, 4449, -27892, 15453, 32252, -19728, -13755]
1837a3755L5574l3833j0849N2482j0826m4286K8516J3798m3584J7339M5264l4744
1849A096k3919L9621j2241l7217M0080K4802m5955J782L4959l4888j7684N1978
1861B2414j935m2015K5209J5403m6263R923M7897k6630k4187L8085j0457m2811
1873c5367L3758L0942m0256Q25L5766l4011k5393M8240M408l9154K4770J9374
1885B3902m8087J065M7638k0667k3590L9370o432m7901K6992L2740l5974O33L9926
1898B9615l1515l2972M2571Q402l6883K5749K4894m7929p445M4459j7000k3500
1910b1554M2077M44n0046J8315L2431l4854k80M5147k5599l7520L6504R522l7864
1923b3277K4923L1920m3333j4358M1055j5640k6636M3048R050m8502J1298L1160
$$ y = [-13755, 21819, -12014, -22863, 29619, 18793, -25493, 3023, 16821, -26763, -9424, 35840, 1096, -22823, 16798, 4557, -32660, 7420, 32222, -13733, -11951, 23008, -11880, -29564, 22414, 20479, -21536, 3673, 19076, -27187, -17264, 30633, 4003, -20184, 17901, 7444, -35367, -1609, 29333, -10923, -10098, 25668, -8343, -33736, 14504, 18912, -20242, 4528, 23902, -24185, -23120, 24518, 3851, -19739, 19631, 13199, -34702, -7710, 25030, -10944, -10311, 29615, -1900, -34872, 7699, 16101, -20782, 4967, 29861, -18068, -25513, 18946, 1946, -21554, 20523, 20967, -29079, -10764, 21667, -13187, -13467, 31680, 6081, -31439, 5065, 14587, -23277, 1646, 33566, -9767, -24125, 16930, 1290, -25346, 17702, 26752, -21750, -10452, 20708]
1935B0708l4297l959M7604j6877l9226L0167J0255l9831K1725L8952l7235j8690
1947b0704L7427j5208l1080M1202J8357m4650O435K9835l4439j0934M8550q613
1959A6178l7064K7477J0298m2945J6043M2129l0667j9628L6568j3945l6880L7162
1971D726K4610m0225M286L0694l5461j8113M7104j273l4404K6983J2382m6062
1983b4753P863M2868k5147j8873L8857j1082m2237L1375K6945l7161L702L4202
1995B6559l4056k4926M3552L664l2825K7012J6791m7396J41M1268k1269j7969
2007a9454M1460o179m5801K3811K7510l5305L289L8894k8687l0583L8097N625
2019A2677l3075K6147K2920m4121p227L7780j8385j8240M2896Q40m6826J6820
$$ y = [20708, -13589, -17548, 30056, 13179, -26047, 4120, 14375, -25456, -3731, 35221, -2014, -20704, 16723, 1515, -29565, 11637, 29994, -14656, -8221, 21614, -12825, -23759, 24791, 16178, -20886, 6591, 16889, -26056, -10013, 32116, 1449, -18179, 18389, 4444, -32436, 4726, 29336, -10889, -6603, 24091, -11370, -29483, 17621, 16348, -18056, 8927, 21309, -24753, -16890, 25978, 831, -18042, 20815, 9733, -32504, -1129, 25816, -11345, -7643, 26559, -7497, -32423, 11129, 14793, -18032, 8980, 25771, -21625, -21484, 19784, -1485, -19454, 22006, 15827, -29974, -6163, 21347, -13958, -10669, 28225, -462, -31045, 7052, 12677, -20398, 5749, 28669, -15452, -22679, 15101, -3284, -21524, 21372, 22212, -24614, -7794]
2031g794K5409l5054R27M5132k1025l2961L2709N404l6231K2754K9572l8365j1027
2044b0550L5733j6502k2257M1376P754m4631J1477K4589l5753k158M8658j2866
2056A4870l4544K8282N177m0549J7892L6392l0192j2644L4561j6857k9001L7411
2068A0798J3069m0097J0373K7120l6040p861M7742q443l4536K6385P543m4300
2080b8247J3652M1028k4000j3361L4292j6776l7291L1202J9007l4087J2071L0504
2092B7994l5392j7228M2553n325l2936K9087J2561m4890O875M0363k1222j5263
2104a2823L5306j2406m0852K5704K3275l0586R775L3233l3442k4213L7049j981
2116H039l0070L0242J8861m3297j306L6599k1596j6767L9050m219m1367J9737
$$ y = [-7794, 17615, -17439, -16512, 28620, 7595, -25366, 7343, 12747, -23484, -730, 28842, -9523, -20550, 15183, -1319, -23576, 17800, 25554, -19077, -7600, 16989, -18764, -20922, 27736, 14870, -19674, 8608, 13785, -26764, -8872, 27520, -2672, -15316, 19245, 2388, -26613, 10798, 23867, -16230, -5857, 21263, -14777, -22638, 25104, 16661, -17875, 8510, 16053, -28247, -14595, 26433, 2433, -10928, 23364, 6588, -30703, 499, 19506, -14581, -2510, 27994, -7398, -24626, 17927, 12602, -20334, 8753, 21314, -23576, -16701, 23662, 2440, -12823, 22483, 10077, -30775, -5071, 18204, -12382, -2607, 30626, -2816, -27029, 10020, 8039, -22031, 8211, 27072, -16225, -17531, 19068, -2528, -19295, 19755, 15536, -25831, -6094]
2128f094K2845l0896O421L6918k6662k8149L1709m59l0252L0092K4509m0013o801
2141a6832L2861k1271k0063M2312L505m1601J4749K2876l2153J615M0729j9959
2153F768k9069K8297N28l3002K6401K9427l5433q297L1439k2212k4380M1343J0738
2166B2548l8782J3252K2991l5619n403M2089j1572k7895K7505K365l6955J9290
2178f186L2724k9823r112L1554k0978k9767L8551J5931l4627J1422K4421l7571
2190a3461j2940M1819m768k6846K7892P069m0587J0811L2632k5063r507L4093
2202B1144j5944l3370L1737J7374l3456J0894K8519l5399j8438L9083k176k6007
2214a6039K8288J1957m2194K338L1751k0713r159L7403j0172l7394K3599J6407
$$ y = [-6094, 16751, -14145, -7724, 29194, 2532, -25617, 6092, 5633, -24619, 5473, 29982, -10031, -16832, 16029, -5242, -25305, 17007, 20512, -21089, -6340, 16536, -15617, -14002, 26727, 6768, -22301, 5996, 6524, -26478, -77, 29350, -6083, -14380, 17059, -5153, -29533, 11810, 22548, -16234, -2982, 20009, -15610, -21013, 21076, 9504, -18391, 9114, 11479, -25476, -6186, 26538, -3285, -12397, 19157, -1821, -31588, 6963, 22894, -11733, -311, 24110, -13461, -26401, 15418, 10650, -16196, 11696, 18765, -21822, -11011, 21621, -3442, -12949, 21144, 5200, -28170, 3567, 20941, -12515, -1621, 26898, -8501, -26939, 12144, 9968, -16039, 12249, 24206, -17988, -15650, 16101, -4612, -13771, 23632, 13460, -23934, -335, 16072]
2226A6072l2168J0921L3937l0258k2457L4838k119k9052K8906J8136m0990k383
2238a6617L1378k0388j2061L9390m390l7758J8293J5472l2751R069L8874k4519
2250C992k4443L1334m014l3054K7419K5674l5909m727L0268k1895j8165L8659
2262A5139L455l6014J5294J6830l4052M441M0054j8163k5034K8362l127l6289
2274b9104K4347L0654l0554o256K9648k2336k4884L5818J0192l2268J4888J9670
2286A9815l5547l738L8732j3134k3832K9140O96l8039J7630L1634k6981p585L1172
2299A9963k0039l0081L2973J4950k9301J3783K2283l6290j2766L6423p290k1786
2311a7178L1586O284m0758R193K9330k5229p823L5713j3764l2802K7831J4923
$$ y = [16072, -16096, -5175, 28762, -1496, -23953, 10885, 8766, -20286, 8620, 26756, -14234, -16617, 14761, -5627, -17688, 21702, 17312, -20446, -2153, 13319, -19432, -10363, 28511, 3992, -20451, 10883, 6869, -26185, 1234, 26908, -9001, -13728, 16540, -5355, -23520, 15139, 18594, -17420, -2126, 14704, -19348, -14907, 25147, 6984, -18050, 10312, 7185, -29104, -4757, 25897, -4657, -10913, 18735, -3601, -28485, 7333, 17525, -14743, 145, 19815, -15732, -19470, 19262, 6128, -17704, 11436, 12132, -25907, -8277, 23357, -3624, -11209, 19963, -76, -30157, 2816, 17766, -11535, 2248, 24531, -11759, -24525, 11898, 4608, -17178, 14408, 20692, -20066, -10873, 18457, -6772, -14595, 21118, 7354, -25448, 2383, 17306]
2323A7306l0393J2128K7114l3233j7199L4355m311k3120L1465J1294m1035K384
2335a3245K8164k3341q243L9782q111l4749K1047J3110l2634J0728L4165k6363
2347C10j9655L1273n153k7782K8310J7644l7330l04K7965k2245j1692L9469k142
2360A8668l5543J6709J3583l3681P333L8278j9705k1397K8874n764l2581K4986
2372b40K3837l1957k332K8275k3215j8194L7466M096l1744J6000J4716l6494Q76
2385a8910L8650j4595k0431K9727k940l6534J9661K6298k8283k744K9237k1753
2397b617k3651L4342P974k9940J5898J7985l6760n269L7776j0369k0041K9971
2409A5299l95l9977J3144K8409k4376j513L4043j9427l0214K7469Q232k9602J7254
$$ y = [17306, -13087, -959, 26155, -7078, -24277, 10078, 5767, -17353, 14112, 25406, -15629, -13245, 14919, -8422, -16665, 23117, 15006, -19743, 1304, 14414, -18220, -7492, 26673, 310, -19345, 11928, 6775, -21007, 7303, 24947, -12383, -12687, 15278, -6967, -18659, 20810, 18668, -16875, -166, 13417, -20264, -12931, 25347, 5642, -15755, 13119, 7355, -25226, -240, 23597, -8360, -10692, 17583, -5632, -23826, 13640, 17736, -14008, 1992, 16708, -19786, -18910, 19740, 5145, -15286, 14441, 11501, -25033, -5372, 20926, -7357, -10101, 19136, -2617, -26268, 8074, 16048, -13892, 2006, 19991, -16769, -22038, 15738, 5369, -14672, 15299, 14904, -25073, -11929, 16480, -7896, -9409, 24634, 5207, -25007, 2462, 10694, -18908, -1654]
2422a654K5189l2022j0160L4552j0664k3095K9528M627l9725J0093K9249k1884
2434e966l070L5675j5596l4949K2249R551k8624J7639L1736k8564j6206K9276
2446A3151j1173k5338L1177J3867l5447M817K7320k5339r414L6447p917l2388
2458b0237K0958J2533l0516J2733L2596k6066j9752K7170q134k6374L1636K0867
2470B7414l3247M78K3058k7940j4834L8178J111k8612K0657J2576l5003M453L3843
2483B2132k0489j8400K9152n965l1030K6081K2971l0594k8K5542k5690j9664L6547
2496A0565M502k8863J8896J3969l6504N1L5614j4536j6825K9877n549l6801J8772
2509f832K4197k6773J944L1281k3097k4926L0850N256k8663J8754J9681l5037
$$ y = [-1654, 23535, -8487, -18647, 15905, 5241, -17854, 11674, 16301, -23424, -13331, 15918, -5966, -9036, 26639, 11043, -23906, -1657, 7894, -20730, -3091, 28645, 81, -16125, 13151, 1978, -23360, 7817, 21684, -13763, -8946, 18374, -6965, -16379, 20068, 12151, -20237, 721, 13254, -17262, -4529, 28067, 2001, -17751, 9419, 1285, -25089, 6547, 27414, -5833, -5355, 17703, -10237, -25071, 13107, 14218, -14394, 6263, 18839, -16164, -11711, 22132, 1643, -16757, 12395, 6430, -24600, 1481, 24452, -6142, -6170, 19372, -6318, -25982, 10565, 15067, -13796, 5100, 19069, -17435, -17384, 18230, 3694, -13131, 16746, 11197, -25604, -6832, 17365, -9408, -7464, 23817, 720, -24206, 6644, 11900, -16763, 1991, 21672, -13365]
2521a3365n708L3625j2240j7850L1666P0l8476J3081K4371k5620j98L4235j8619
2534D972k8857K6822P431k7291J8012K4391l3302j1791K9696j1774j9082L4115
2546A3342Q264l6674P506K2358k7323m202L7270j1728k9635K4434P988l0201J5572
2559c029K8784k8702j4858K8437j1155k2536L2335J4241l4394M196K2515k7660
2571a1826p991L8357n578k8698K0842P708l3933J1629L3291k1977j4499K8092
2583A5417j1985k8572K7924J7983l0704M946K4684k7011j3823L6785j660k8402
2595a4418J9986R913l5773O314L4801j7712j4233K9291r823l3754K3054K0850
2607A8496k7740M403K7582k6282j9580L3446K688k7082K0649J4205l6598q32L2418
$$ y = [-13365, -19073, 14552, 2312, -15538, 16128, 16198, -22278, -9197, 15174, -10446, -10644, 23591, 4972, -23885, 2937, 10368, -16923, 1089, 25480, -7822, -19613, 10083, -1691, -20773, 13342, 21606, -15068, -7562, 14796, -12527, -16729, 20541, 8813, -20822, 3612, 11600, -18601, -3029, 25755, -2947, -17805, 10632, -523, -23059, 9276, 23517, -10877, -6681, 15834, -11826, -19817, 18540, 12962, -15736, 5106, 12814, -21119, -9490, 23801, 1824, -12675, 15417, 3432, -25140, 2784, 20767, -9937, -4991, 19693, -7318, -21141, 15644, 13984, -14418, 5568, 15481, -20292, -13978, 20823, 3111, -11122, 18169, 8346, -25408, -2354, 18496, -9244, -4841, 22741, -3541, -23121, 10325, 13013, -14069, 6580, 20785, -15813, -16645, 15773]
2620A5773j5087j4634L1848m151l5497J7505K0790k7153K449L0922k2110k4465
2632b3810L0006M118k6390K1284J9387l5460o839L0224j4724j6244L3851K066
2644A7469l5898J3090K0695k7316K74L3964j7086k7171K5626M499k8103K0330
2656C73K5057l1038r839K7901j5455j9440L3221P939l4075R416K1113k8632k390
2669a5849L6930j1613k7354K3448L972l2778J6056K9818k5582j0497K8810j3895
2681A466k5171L0919J2107l3163Q009K1531k8595p245L8504n433k6503K1941M848
2694A3215l6115J0000L1659k0235j0018L0009j2173l0013K5494J5955k9568P441
2706d349K4820k7978j4590L4841j750k5890K2794J0251l6095M673L1702j8467
$$ y = [15773, 686, -13948, 17900, 13749, -21748, -4243, 16547, -10606, -8157, 22765, 655, -23810, 6196, 10314, -16076, 5208, 24595, -10865, -17704, 12520, -2204, -18448, 15403, 17469, -18429, -5339, 15356, -11960, -11686, 22278, 5192, -21979, 3647, 8146, -19957, 373, 25430, -5608, -15447, 12454, -3001, -22441, 10780, 18719, -15356, -5940, 15173, -13459, -15849, 21081, 9468, -17886, 5562, 9534, -23244, -7188, 22630, -2952, -13449, 15361, 1466, -23705, 7214, 19321, -13842, -5833, 15698, -12897, -20142, 18362, 12929, -13574, 8367, 13215, -22900, -12900, 18759, -1476, -11494, 18515, 6342, -23671, 1823, 17778, -11790, -4349, 20471, -7507, -22097, 12744, 10994, -14896, 7898, 18149, -17946, -13273, 18429, -38]
2718c8j1872K9731r582l3703K2440J9450k5843Q098K8097k7542k2241K9646m45
2731F196k5468K4989J8340l4330j199K9141j8975j4918L1464l474l3758J8442
2743c550J9999k6820N446L0972k3579k4850K8076R46k6261K4171K1580l3801o378
2756a4049K7151j7355j5468L5143K987l3208J2585J6370l0279J690L5121j5471
2768E217k2780K7264R59l0663J9109K3799l0696p931K8548j5628j9135L4346Q123
2781B0532l2785J0066J6484l0597l364L7358r800k2703K4922J608l4110J4722
2793g667K8208k5100p503K8832j5982k5878K9495J2529k9726J0723K1471k9995
2805a0593r025L4379p238k3682K4139N635l4796J0569L0242k1493r085K9832j4182
$$ y = [-38, -11910, 17821, 8239, -25464, -3024, 16426, -9417, -1319, 26778, -764, -23005, 6641, 6196, -19272, 5717, 24057, -10273, -11472, 17669, -1306, -16224, 15240, 11766, -21992, -3550, 16449, -10371, -4925, 26047, 2468, -22382, 5694, 6640, -19621, 4550, 26130, -7671, -14049, 13102, -4253, -19721, 15422, 18409, -14799, -2214, 14156, -16123, -14433, 20688, 5217, -17563, 9701, 10660, -20003, -894, 22905, -7791, -15722, 12826, -2802, -21937, 12409, 20532, -12253, -2187, 14297, -16300, -19664, 17694, 7894, -14809, 10113, 11721, -22389, -7667, 20541, -4559, -12062, 16770, 788, -25090, 4405, 16934, -12792, -2069, 19402, -10593, -19618, 14761, 7523, -16159, 7980, 13615, -21181, -10612, 19630, -1863, -10948, 18884, 4702]
2818D702l0353K5485J4913k7080J0519K5101k9250j5366L1538l810k2785K6669
2830A0283R780l6112L652K7450k0187q920L3721q004l2133K1158J4176k8990P972
2843f154K9087k5459j7601L0252k051k4230K5199J4236l6333j053K6968j9199
2855f338r679L6244k927l3324J5201J3697l0002O709L4121j9100k0209K6816l601
2868G608k8837K2876K0353l0922j883K7190j8925j6006L3352J631l2906J3997
2880b472J5957k9281L470L6429j5622k2829K3391k569l1916K0686K6544k5613
2892c825l491K6238k0175k2541L0653O903k8485J4826J8362l0659l674L3923j2081
2905E974k2781K6197J149l3456J6057K7566k4118n817K7389j8136k6213K8740
$$ y = [4702, -25651, -166, 14747, -12333, -1814, 23287, -5963, -21329, 10209, 6399, -16386, 10283, 20063, -16049, -12397, 15053, -5134, -14054, 19667, 11663, -20470, 688, 14864, -14126, -6154, 22933, -2526, -20127, 10125, 8074, -16156, 9043, 23279, -13054, -14107, 12861, -6338, -16017, 20227, 17300, -16024, -823, 12874, -17128, -10419, 23702, 4602, -15607, 11209, 7608, -21229, 1647, 22000, -8922, -10805, 16385, -2540, -18546, 14806, 16437, -16469, -2472, 13485, -15796, -12326, 24103, 8481, -14348, 9043, 6474, -25442, -4756, 21788, -3825, -7316, 18922, -1253, -23794, 6859, 13762, -14723, 103, 18465, -12194, -15868, 18055, 5974, -16807, 9390, 10539, -22917, -6860, 20706, -3412, -9229, 18160, 24, -26189, 2551]
2917B551J1386k6213J4037K0280l2469j0340L2449q569j9987K8472N698l5689
2929a8394Q823K5836k2750o252L1235j3279k7808K4096J1912k6903J2236K4082
2941B2834k9557j3851L0403o440k1608K8586J0238l5624L493K5567k1132q241
2953a5332L4252p202l0758J9550J1583k8020J0049K9326k3827j6980K7858o438
2965D061k4525K6305J6321l2750R36K4887k1425j2389L4864j490l0364J6395J2818
2978A3644l0048O313L2665j8984j7991K5295m971k8338K3676K1058k8867j093
2990g641K4875k2368j6751L3465L727k8088J5615J3792l1965J062L3159j4607
3002D275j8087K6641l393l1249J9167K2532k6425j131K6633k1445k0733L1140
$$ y = [2551, 13937, -12276, 1761, 22041, -10428, -20768, 11681, 3112, -16875, 11597, 17295, -18394, -9571, 16265, -6485, -12737, 18498, 5219, -22589, 1507, 13419, -13484, -1248, 22834, -6723, -20574, 9829, 3389, -18219, 10367, 20605, -15019, -11526, 14041, -7091, -15332, 18920, 11718, -19040, 510, 12093, -15927, -5878, 23448, -379, -17359, 10499, 4061, -20464, 5841, 22162, -10588, -9652, 15235, -6190, -18579, 16285, 14795, -15569, 826, 13644, -16404, -10091, 22574, 3590, -14401, 10894, 5923, -22415, 1261, 22319, -6548, -7641, 17234, -5134, -21885, 11580, 15307, -12781, 2834, 16626, -15339, -14277, 18882, 4275, -13812, 12829, 9436, -21813, -2646, 19886, -6539, -7670, 18963, -2482, -23215, 7925]
3014G925O376k6983J5660J6372l2635m528L2350j1124j7156K7610l54l4212J3188
3027g511K3576k3584j421K9358j7594k5194K6756P191k6434J5382K0520l0378
3039i333r280L0496r353j8189K7763M555l4732Q438K3228k2387l216L2788j3196
3052G582k8185K2189Q109k7034J4312K6056k7012j2625K7360q874k1578K7925
3064H225J0526l2593N527K2478k2663p340L3762p242k8567J9492R092k8294J1113
3077f484K9085k2454j4905K5907q778k4461K6261J6232k9989L016K2731k3684
3089g523j1875L3196j930k6648J8596J0397l0840O098L0418j8266j4972K6207
3101A2858p078k7903K2872J9087k7014J594K3925k3310j6451L1820K231k5191
$$ y = [7925, 14301, -12682, 2978, 19350, -13285, -17813, 14537, 3413, -13743, 13867, 13513, -20699, -7511, 16065, -7519, -8940, 20418, 2824, -22370, 4386, 11577, -14857, 525, 21045, -9333, -18613, 11883, 2530, -15659, 12104, 16659, -18073, -9635, 13593, -8794, -12010, 20778, 7582, -20603, 1586, 9695, -17339, -3027, 23029, -3983, -16608, 10752, 1878, -19700, 8225, 18751, -13842, -8315, 14163, -8500, -15840, 17922, 10680, -17887, 1605, 10697, -17597, -6484, 22601, 147, -14758, 11149, 2371, -22090, 4171, 20403, -9586, -6570, 16161, -7523, -19398, 13798, 11868, -14780, 3816, 14213, -16627, -10529, 19889, 1623, -13349, 12858, 5780, -22123, 749, 19836, -7178, -5584, 18341, -4969, -21420, 10400, 12631, -12560]
3113a2560J7684J2563l2101K90L0156j4160j4184K7265m233l1063J6991K0248
3125A6896k5108J745K7096k0463k1512K7947M651k5328J7912J6522l0749n144
3137a5535K9098j2229j5225K8039J81l2677J2405K0501k3415n4L0047j6681k4524
3150b0069K3963N372k5396J6771K1654k8683r218K7098j2027j7474K9075O318
3162A7384l1978Q708J9664k4264k654L2065j1808k5294K1993N653k7037J4319
3174c249K5323k5615j1291K5423j1469j9830K9188J0121k9604N552J9065k5112
3186a1498o446L3757o032k4262K0150N946l0384J0042K7276k0456j0745K5830
3198A3178j0040k4202K4703J4005k7725M165K1462k4250j0374L2253j820k3953
$$ y = [-12560, 5124, 17687, -14414, -14124, 16032, 1872, -12312, 14953, 10720, -20343, -3352, 16896, -8212, -6467, 20629, 166, -21346, 6601, 11252, -14076, 3836, 20358, -10391, -15535, 13563, 1334, -13891, 14148, 14329, -18348, -5943, 14558, -8857, -8911, 21136, 4455, -20069, 3894, 9266, -16130, 641, 22295, -6388, -15606, 11492, -535, -18009, 11066, 17384, -14594, -5886, 13778, -10486, -13140, 18925, 7117, -18177, 3816, 9469, -17568, -3249, 22074, -3541, -14832, 10591, -878, -20708, 8480, 18601, -11003, -5451, 13614, -11498, -17944, 15813, 9781, -14481, 5669, 11615, -18769, -8727, 18549, -1907, -12652, 13178, 3138, -21064, 3639, 17644, -10081, -5916, 15546, -8704, -19078, 13175, 11355, -12598]
3210a2598J8313P879l1854N437K9523j5763j1471K6346q392k8490J9609J6095
3222A4634k4328M607K4737k2569j5980K8744k75k3571J9016J2125l0645M64K8057
3235A5016j3820j2905K6985m374l0394J5646J7709k3196L738K7259k0018k0407
3247a8761K5049J540k3294J9668J6850k9548m569K5721j3425j4476K9051J031
3259A4837l0012J1531J6597k3702J399K9738j5208k1832K2646K230k5136J6933
3271B1K0637k6410o752K4554j2953j6306K8401N336k9674Q356J7176k4539r92
3284a3145L2307j0463k2584J9548K111k7967J4308K5216k1398p682K3916j3215
3296I52k1280K5078R417k6033P939J9044k4106o152L0461o998k2567J8880M758
$$ y = [-12598, 5715, 13594, -18260, -12823, 16700, 937, -10534, 15812, 7420, -21070, -1461, 14634, -9694, -5087, 19650, -2919, -18899, 9845, 9570, -14001, 5015, 17140, -13505, -13041, 15016, 1196, -11709, 15276, 10902, -19492, -3846, 13863, -9333, -5595, 21664, 1646, -18761, 6288, 7828, -15466, 4202, 21052, -8496, -13065, 12656, -769, -15245, 13806, 14837, -15175, -3644, 12953, -10749, -9350, 20388, 5180, -16652, 5994, 8224, -16912, 21, 20658, -5752, -12504, 12050, -903, -17209, 11192, 16528, -13146, -4790, 12386, -12153, -13145, 19162, 8699, -13885, 5663, 7774, -20193, -5885, 19331, -2067, -9749, 14167, 952, -20328, 4750, 14167, -11866, -3927, 15117, -8989, -15141, 15320, 8322, -14245, 4635, 9393]
3309I393k9075J1293K6833j8147q956K3122j2462k5436K2836J3977k2710Q351
3321i81K0156k4960j3113K7714l781k0393K1104R562k9328M776K5190j7667j0294
3334a2015K5162q160k6017K0442J4816k2004N964K1863k3801j6741K6010n4j9727
3347a4262K1495J3086l0974p45K3498j5919j0479K8238k644k7129J5137J3894
3359A3196k3666M116K5309j8394j7652K4129k4k1769J9416J5817k8247m036K2973
3372A1168j4103j2595K9265J627k7406J0688J3248k4731K226K8717j2909j8615
3384a3420K1784m26k4821J6144J9606k4071m921K2786j4205j5897K6766N839k5519
3397a0355R011J4865k5422k180K9617r017j8773K0450J049k7059J2772K2313k0409
$$ y = [9393, -19682, -8389, 18444, 297, -8659, 14463, 2001, -23435, -599, 13378, -9332, -981, 19175, -5785, -18898, 8816, 5035, -15358, 5746, 15308, -14020, -9244, 15946, -1721, -12015, 13147, 4987, -21030, -588, 14228, -7776, -1812, 20051, -3750, -20491, 5519, 5465, -14262, 7233, 20319, -10655, -11400, 12098, -3821, -14300, 13938, 11294, -15835, -698, 13196, -10470, -6354, 18955, 561, -17091, 7038, 7014, -14755, 4661, 20478, -7769, -11805, 11168, -2935, -15530, 13735, 15362, -12044, -1356, 11892, -12839, -10613, 18104, 5195, -13420, 8364, 7938, -16883, -739, 18867, -5204, -10125, 12661, -1544, -17441, 9325, 15164, -10355, -1344, 13521, -11901, -14081, 15536, 6519, -12254, 8196, 9245, -17814, -5042, 17271, -3138]
3410c138n884K3118j3754k0165K4496R152k3720R048J6751k5295o966K8200o101
3423E742j8154K0977L019k8767Q768K2861j7744n624K4386j1819k3337K0308J0558
3436A1174k2040Q964J9735k3647j1108K5585m237j7993K1058P220k9164M034K2270
3449A1851j6337o117K6244q033k5363J6448J0955k1822Q353K3023k0665j4217
3461a5680K2877l101j9625K0893J1955k7203J28K0897j5950q434K7272k796k5525
3474a4292J3265J1379k2880N864K5663j6934j5495K0942l192k1263J9497J5964
3486A8518k4817j340J9790j6275j2455K7592J634k4255J2075J1506k4268K676
3498i619K6535j2502j6402K0497k220k3770J6584J9025k1753k820K0235j5843
$$ y = [-3138, -9022, 14096, 342, -19823, 4673, 13825, -9895, -847, 15904, -9391, -16357, 11843, 5742, -12412, 8565, 11584, -17183, -8415, 14446, -3298, -8922, 15464, 3645, -19692, 616, 11174, -10866, -1902, 17833, -5814, -16922, 8663, 4426, -13567, 7491, 14711, -14453, -10419, 11851, -4486, -10603, 15641, 7608, -17755, -1307, 9648, -12174, -3821, 19202, -1463, -15680, 7197, 4096, -15529, 5364, 17319, -9884, -9756, 11141, -4809, -13243, 14029, 11233, -14292, -1027, 10352, -12528, -6664, 18999, 2065, -13430, 7512, 4320, -16943, 2554, 18518, -6299, -7639, 12151, -4124, -16579, 11013, 12647, -11608, 467, 11973, -12295, -9619, 16916, 4414, -11988, 8509, 6289, -17481, -897, 18128, -3625, -6445, 13790, -2053]
3510b053j6848K5385O023k2127J1406J3574k4987l537K5893r421j5244K1022N74
3523I660k5661J2186J9883j9605l850K2018j4568j9743K3255Q318k0511J0480
3535A862J5163k5104q007K5112o550j3828K2081M088k8533O508J8783j8559l780
3548a0764K5318q951k1426J9084Q080k2615Q502J7936k1909r908K4802l916j5047
3561a0814K1181N998k8772J607J8359j6087l694K8595n411k2910J3781O043k3529
3574a5653P830K3474j6799j1069K2354n534j9579J9138J0282k5655K139J9719
3586A0647j5330p224K6794l423k4802J1842Q046k1963P645K6312j3660j3271J8318
3599I931p217k3518J8335J5915j9648K807J9535j7474j2972K3145n31k1798J3039
$$ y = [-2053, -18901, 6484, 12507, -9620, 1786, 15360, -9627, -13164, 12729, 3308, -11936, 9086, 9660, -16001, -3815, 16068, -3537, -7387, 14631, 63, -19680, 3575, 11893, -8618, 1862, 17025, -8079, -16086, 9026, 2476, -11352, 10729, 14817, -13716, -7208, 11575, -6984, -10764, 14554, 5603, -15823, 3261, 11341, -11274, -2772, 15164, -6745, -16653, 8149, 4233, -10814, 10367, 16365, -12407, -10800, 7559, -8528, -12222, 16373, 10962, -11948, 1833, 7876, -15653, -7823, 15651, -1148, -12217, 10137, 4603, -14976, 4162, 14444, -11211, -9072, 10647, -4683, -11907, 14887, 11464, -13338, -1496, 6550, -15413, -7768, 18544, 4884, -8387, 9931, 2714, -20804, -2469, 13446, -6202, -3395, 16140, -1334, -14306, 8839, 8308, -13490, -451]
3612d51J1468k2387L187K5839j2342j4380J8365m883k3877J5427J8803j8065j47
3625c443J9651j6650j6887K2372M237j9521J2931J3180k4747l341K3573q730j3593
3638a0968K1154N06k5633J0534J7560j8088j526K1909j3882j8923K0289O509j9148
3651i707J2403J5114k3299p828K2041p756j3846K1702M010k5317P049J7555j7065
3664d944k632K3041j0619k1592J6625O688j9412J2534J9967k0606r903J9091q717
3677d79j6495K1687Q245k2785N482J7564j8287o036K4219o881k1238J5245P394
3690G635k0558R395K1276j7481j1986J8541o772j7733K1416J2438k1779J986J5312
3703A1690j9854r119K5685o11j7868J5253P719k4218K696K0988j4747j0549K1137
$$ y = [-451, 11017, -11370, -8183, 17656, 5314, -9066, 9299, 4416, -19461, -4034, 14769, -3296, -3443, 16208, -442, -17329, 5043, 9280, -10241, 2690, 15870, -8877, -12218, 11355, 2625, -10968, 10186, 10692, -14941, -4407, 13153, -4935, -6461, 15448, 1566, -17357, 2932, 9441, -9707, 2696, 17810, -5489, -13317, 8724, 968, -12878, 8824, 12834, -12483, -5434, 12121, -4944, -7576, 15465, 4846, -16746, -121, 6567, -12845, -311, 19656, -950, -10853, 8238, -479, -16974, 4713, 12958, -9827, -4345, 13219, -5068, -11104, 13115, 6234, -15004, 241, 7635, -12923, -3528, 17748, 267, -11719, 6822, 50, -17683, 3733, 16171, -5608, -3622, 11690, -8164, -17283, 8402, 7791, -10077, 5176, 12895, -11323, -8627, 12361, -2386, -12935, 8202]
3716H202l894j9018J7660J3621k1522l07J6135j8484j1499K5874L168j7154J3685
3729F467Q192k6052j473K2098j0142r192K1849k882k2948J2242J3882j9417J471
3742e905J9905j5026j4243K1908K644j9381J2562J1277k3833k820K2936q072j0209
$$ y = [8202, 4308, -14710, 2950, 16571, -4951, -5258, 10877, -7607, -19106, 6768, 9936, -7218, 6467, 14659, -11393, -12866, 9232, -910, -10102, 11747, 8865, -14083, -1841, 12041, -7376, -5905, 14000, -1026, -15269, 6639, 9283, -10098, 2464, 13741, -10092, -12912, 10024, 1952, -8257]
$$ [...]
8191C73
##END NTUPLES=NMR FID
##END=
