##TITLE=1H_Ser DNG-CO-EA
 CDCl3, 8 sc, 
 15.2.2019
##JCAMPDX= 6.0         $$ Bruker NMR JCAMP-DX V2.0
##DATA TYPE= NMR FID
##DATA CLASS= NTUPLES
##ORIGIN= UXNMR, Bruker Analytische Messtechnik GmbH
##OWNER= root
$$ XWIN-NMR		Version 3.5
$$ Fri Feb 15 14:00:17 2019 Russian Standard Time (UT+4h)  she@DPX200
##.OBSERVE FREQUENCY= 200.1313
##.OBSERVE NUCLEUS= ^1H
##.DELAY= (6, 6)
##.ACQUISITION MODE= SIMULTANEOUS
##.ACQUISITION SCHEME= undefined
##.AVERAGES= 8
##.DIGITISER RES= 18
##SPECTROMETER/DATA SYSTEM= spect
##.PULSE SEQUENCE= zg30
##.SOLVENT NAME= CDCl3
##.SHIFT REFERENCE= (INTERNAL, CDCl3, 0, 15.7039)
##AUDIT TRAIL= $$ (NUMBER, WHEN, WHO, WHERE, WHAT)
$$ ##TITLE= Audit trail, XWIN-NMR		Version 3.5
$$ ##JCAMPDX= 5.01
$$ ##ORIGIN= Bruker BioSpin GmbH
$$ ##OWNER= she
$$ F:/spectra/data/she/nmr/H-F/1/audita.txt
$$ ##AUDIT TRAIL=  $$ (NUMBER, WHEN, WHO, WHERE, WHAT)
(   1,<2019-02-15 13:57:52.59 +0400>,<she>,<DPX200>,
      <created by zg, POWCHK disabled, PULCHK disabled
       configuration hash MD5:
       00 E9 B6 7A A2 85 ED C7 34 08 36 98 17 FE 4E 26
       data hash MD5: 16K
       AC AF 98 E7 D1 D5 AA B2 66 FE F1 2C 1E 91 BB 77>)
$$ ##END=
$$ 
$$ hash MD5
$$ 89 15 ED A2 85 C9 D1 E6 37 16 9A CF BA 79 49 79
##$RELAX= 
##$RELAX= 
##$RELAX= 
##$RELAX= 
##$RELAX= 
##$RELAX= 
$$ Bruker specific parameters
$$ --------------------------
##$DU= <F:/spectra>
##$EXPNO= 1
##$NAME= <H-F>
##$PROCNO= 1
##$TYPE= <nmr>
##$USER= <she>
##$AMP= (0..31)
100 100 100 100 100 100 100 100 100 100 100 100 100 100 100 100 100 100 
100 100 100 100 100 100 100 100 100 100 100 100 100 100 
##$AQSEQ= 0
##$AQ_mod= 1
##$AUNM= <au_zg>
##$AUTOPOS= <>
##$BF1= 200.13
##$BF2= 200.13
##$BF3= 200.13
##$BF4= 200.13
##$BF5= 200.13
##$BF6= 200.13
##$BF7= 200.13
##$BF8= 200.13
##$BYTORDA= 1
##$CFDGTYP= 0
##$CFRGTYP= 5
##$CHEMSTR= <none>
##$CNST= (0..31)
1 1 145 1 1 1 1 1 1 1 1 1 1 1 1 1 1 1 1 1 1 1 1 1 1 1 1 1 1 1 1 1 
##$CPDPRG= <>
##$CPDPRG1= <>
##$CPDPRG2= <>
##$CPDPRG3= <>
##$CPDPRG4= <mlev>
##$CPDPRG5= <mlev>
##$CPDPRG6= <mlev>
##$CPDPRG7= <mlev>
##$CPDPRG8= <mlev>
##$CPDPRGB= <>
##$CPDPRGT= <>
##$D= (0..31)
0 1.2 0 0 0 0 0 0 0 0 0 0.03 0 0 0 0 0 0 0 0 0 0 0 0 0 0 0 0 0 0 0 0 
##$DATE= 1550224671
##$DBL= (0..7)
120 120 120 120 120 120 120 120 
##$DBP= (0..7)
150 150 150 150 150 150 150 150 
##$DBP07= 0
##$DBPNAM0= <>
##$DBPNAM1= <>
##$DBPNAM2= <>
##$DBPNAM3= <>
##$DBPNAM4= <>
##$DBPNAM5= <>
##$DBPNAM6= <>
##$DBPNAM7= <>
##$DBPOAL= (0..7)
0.5 0.5 0.5 0.5 0.5 0.5 0.5 0.5 
##$DBPOFFS= (0..7)
0 0 0 0 0 0 0 0 
##$DE= 6
##$DECBNUC= <off>
##$DECIM= 32
##$DECNUC= <off>
##$DECSTAT= 4
##$DIGMOD= 1
##$DIGTYP= 9
##$DL= (0..7)
0 120 120 120 120 120 120 120 
##$DP= (0..7)
150 150 150 150 150 150 150 150 
##$DP07= 0
##$DPNAME0= <>
##$DPNAME1= <>
##$DPNAME2= <>
##$DPNAME3= <>
##$DPNAME4= <>
##$DPNAME5= <>
##$DPNAME6= <>
##$DPNAME7= <>
##$DPOAL= (0..7)
0.5 0.5 0.5 0.5 0.5 0.5 0.5 0.5 
##$DPOFFS= (0..7)
0 0 0 0 0 0 0 0 
##$DQDMODE= 0
##$DR= 18
##$DS= 0
##$DSLIST= <SSSSSSSSSSSSSSS>
##$DSPFIRM= 0
$$ [...]
##$SUBNAM2= <"">
##$SUBNAM3= <"">
##$SUBNAM4= <"">
##$SUBNAM5= <"">
##$SUBNAM6= <"">
##$SUBNAM7= <"">
##$SUBNAM8= <"">
##$SUBNAM9= <"">
##$SW= 20.0189088683792
##$SWIBOX= (0..15)
0 0 2 0 0 0 0 0 0 0 0 0 0 0 0 0 
##$SW_h= 4006.41025641026
##$TD= 16384
##$TD0= 1
##$TE= 0
##$TE2= 300
##$TE3= 300
##$TEG= 300
##$TL= (0..7)
0 120 120 120 120 120 120 120 
##$TP= (0..7)
150 150 150 150 150 150 150 150 
##$TP07= 0
##$TPNAME0= <>
##$TPNAME1= <>
##$TPNAME2= <>
##$TPNAME3= <>
##$TPNAME4= <>
##$TPNAME5= <>
##$TPNAME6= <>
##$TPNAME7= <>
##$TPOAL= (0..7)
0.5 0.5 0.5 0.5 0.5 0.5 0.5 0.5 
##$TPOFFS= (0..7)
0 0 0 0 0 0 0 0 
##$TUNHIN= 0
##$TUNHOUT= 0
##$TUNXOUT= 0
##$USERA1= <user>
##$USERA2= <user>
##$USERA3= <user>
##$USERA4= <user>
##$USERA5= <user>
##$V9= 5
##$VALIST= <valist>
##$VCLIST= <CCCCCCCCCCCCCCC>
##$VD= 0
##$VDLIST= <DDDDDDDDDDDDDDD>
##$VPLIST= <PPPPPPPPPPPPPPP>
##$VTLIST= <TTTTTTTTTTTTTTT>
##$WBST= 1024
##$WBSW= 4
##$XGAIN= (0..3)
0 0 0 0 
##$XL= 0
##$YL= 0
##$YMAX_a= 238564
##$YMIN_a= -313622
##$ZGOPTNS= <>
##$ZL1= 120
##$ZL2= 120
##$ZL3= 120
##$ZL4= 120
##$ABSF1= 10
##$ABSF2= 0
##$ABSG= 5
##$ABSL= 3
##$ALPHA= 0
##$AQORDER= 0
##$ASSFAC= 0
##$ASSFACI= 0
##$ASSFACX= 0
##$ASSWID= 0
##$AUNMP= <proc_1d>
##$AZFE= 0.1
##$AZFW= 0.1
##$BCFW= 1
##$BC_mod= 2
##$BYTORDP= 1
##$COROFFS= 0
##$CY= 11.3945322036743
##$DATMOD= 1
##$DC= 2
##$DFILT= <>
##$DTYPP= 0
##$F1P= 18.9103706918063
##$F2P= -1.10871071338519
##$FCOR= 0.5
##$FTSIZE= 0
##$FT_mod= 4
##$GAMMA= 1
##$GB= 0.15
##$INTBC= 1
##$INTSCL= 1
##$ISEN= 128
##$LB= 0.24
##$LEV0= 0
##$LPBIN= 0
##$MAXI= 10000
##$MC2= 0
##$MEAN= 0
##$ME_mod= 0
##$MI= 1.114404
##$NCOEF= 0
##$NC_proc= 0
##$NLEV= 6
##$NOISF1= 3.799351
##$NOISF2= 2.8
##$NSP= 1
##$NTH_PI= 0
##$NZP= 0
##$OFFSET= 15.70392
##$PC= 1
##$PHC0= -9055.319
##$PHC1= 15.60014
##$PH_mod= 1
##$PKNL= yes
##$PPARMOD= 0
##$PSCAL= 0
##$PSIGN= 0
##$REVERSE= no
##$SF= 200.130013532006
##$SI= 16384
##$SIGF1= 3
##$SIGF2= 2
##$SINO= 400
##$SIOLD= 16384
##$SREGLST= <1H.CDCl3>
##$SSB= 0
##$STSI= 0
##$STSR= 0
##$SW_p= 3612.71676300578
##$SYMM= 0
##$S_DEV= 0
##$TDeff= 0
##$TDoff= 0
##$TI= <>
##$TILT= no
##$TM1= 0
##$TM2= 0
##$TOPLEV= 0
##$USERP1= <user>
##$USERP2= <user>
##$USERP3= <user>
##$USERP4= <user>
##$USERP5= <user>
##$WDW= 1
##$XDIM= 8192
##$YMAX_p= 0
##$YMIN_p= 0
$$ End of Bruker specific parameters
$$ ---------------------------------
##NTUPLES= NMR FID
##VAR_NAME=  TIME,          FID/REAL,        FID/IMAG
##SYMBOL=    X,             R,               I
##VAR_TYPE=  INDEPENDENT,   DEPENDENT,       DEPENDENT
##VAR_FORM=  AFFN,          ASDF,            ASDF
##VAR_DIM=   8192,          8192,            8192
##UNITS=     SECONDS,       ARBITRARY UNITS, ARBITRARY UNITS
##FACTOR=    0.0002496,     1,               1
##FIRST=     0,             0,               0
##LAST=      2.0444736,     0,               0
##MIN=       0,             -313622,         0
##MAX=       2.0444736,     238564,          0
$$ Real data points
##PAGE= N=1
##DATA TABLE= (X++(R..R)), XYDATA
$$ [...]
$$ plain form
3607 -8196 -1469 8881 -3870 -3441 3563 -6631 -1980 9550 -4066 -6317 8311 1175 -4263 4601
3621 4601 -3358 -5880 8851 876 -9792 5373 5743 -4775 3072 1017 -8052 4545 4757 -10227
3635 -10227 -603 7451 -3878 605 4463 -7219 209 8861 -6700 -5784 7720 -487 -2030 6389
3649 6389 -3912 -3400 9807 -1775 -9302 4963 1789 -5237 4998 81 -7048 7695 4413 -9839
3663 -9839 588 4628 -5270 1861 2993 -7932 3536 9378 -6686 -3082 7011 -3257 -1396
3676 -1396 5213 -6498 -2367 10558 -2158 -6856 5884 -476 -4215 5059 -3679 -7585 8605 3187
3690 3187 -8688 3257 4050 -4773 3881 1351 -8841 4308 7447 -7628 -526 6320 -3588 1617
3704 1617 4803 -8584 -1845 9215 -4585 -5663 5877 -1523 -1584 6617 -4735 -5956 8825 291
$$ packed form
3607h196O727J0350j2751M29P004j0194M651J1530j3616k251J4628p136n438Q864
3621D601p959k522J4731p975j0668J5165L70j0518P847k055r069J2597K12j4984
3635a0227R624Q054j1329M483L858j1682P428Q652j5561R16J3504q207j543Q419
3649F389j0301N12J3207j1582p527J4265l174p026J0235m917p129J4743l282j4252
3663i839J0427M040r898P131J132j0925J1468N842j6064L604J0093j0268J861
3676a396O609j1711M131J2925j2716m698J2740o360l739R274q738l906J6190n418
3690C187j1875J1945P93q823Q654k530j0192J3149L139j5075P102O846r908N205
3704A617L186j3387O739J1060j3800j078J1540p400o1Q201j1352j221J4781q534
$$ plain form
3718 291 -8064 4105 1771 -3802 6509 800 -8160 5722 5538 -8271 -82 3521 -4786 3586
3732 3586 4187 -8929 889 9161 -5864 -4145 4519 -4002 -516 6930 -5733 -3783 10093 -572
3746 -572 -5924 4517 -1207 -3361 7111 -1966 -7962 7536 4551 -7129 1847 1658 -5494 4286
3760 4286 1863 -9746 2104 7605 -5359 -964 4653 -4799 1553 6272 -7789 -3059 9271 -1581
3774 -1581 -3921 5374 -2273 -1498 7269 -4592 -8028 7314 1516 -6725 3568 449 -4370 6705
3788 6705 1070 -9545 3121 5511 -6057 606 3032 -4720 4719 6352 -8505 -999 7989 -3742
3802 -3742 -3073 4194 -4268 -305 8116 -4839 -5680 7483 -406 -5260 3655 -2680 -4048 8059 25
3817 25 -8363 5261 4310 -5699 1929 647 -5827 5566 4677 -8423 1417 7317 -4461 -583 3244
$$ packed form
3718B91q355J2169k334n573J0311n709q960J3882j84j3809Q189L603q307Q372
3732C586O01j3116R818Q272j5025J719Q664q521L486P446j2663J950J3876j0665
3746e72n352J0441n724k154J0472r077n996J5498k985j1680Q976j89p152R780
3760D286k423j1609J1850N501j2964M395N617r452O352M719j4061M730J2330j0852
3774a581k340R295p647P75Q767j1861l436J5342n798q241J0293l119m819J1075
3788F705n635j0615J2666K390j1568O663K426p752R439J633j4857P506Q988j1731
3802c742O69P267q462L963Q421j2955q41J3163p889m854Q915o335j368J2107q034
3817B5q388J3624r51j0009P628j282o474J1393q89j3100R840N900j1778L878L827
$$ plain form
3832 3244 -6537 728 7224 -6732 -4498 7551 -1089 -2831 4347 -4150 -2872 8300 -2453 -7720
3846 -7720 6403 2648 -4451 3939 -151 -5590 6482 2633 -8947 1731 5026 -4628 1860 2321
3860 2321 -6890 3024 6546 -7907 -2816 6682 -2629 -1188 4658 -4554 -898 9028 -3550 -6104
3874 -6104 5982 87 -3472 4611 -2527 -4867 8144 1381 -8444 2659 3038 -4512 2696 532
3888 532 -6783 4724 5920 -7393 -541 5428 -3499 578 3822 -6502 463 8706 -4198 -4321
3902 -4321 5933 -1265 -2193 4869 -4699 -4580 8224 -375 -7292 4098 1540 -3781 4506 -968 -7022
3917 -7022 5971 4478 -7308 882 4183 -3638 3038 2778 -7470 1839 7498 -5559 -3063 5107
3931 5107 -2722 -540 4787 -5655 -3132 8384 -1779 -5839 4420 -169 -2503 5375 -2368 -6269
$$ packed form
3832C244r781P265O496j3956K234J2049q640j742P178q497J278J1172j0753n267
3846g720J4123l755p099Q390m090n439J2072l849j1580J0678L295r654O488M61
3860B321r211R914L522j4453N091R498r311J441N846r212L656R926j2578k554
3874f104J2086n895l559Q083p138k340J3011o763r825J1103L79p550P208k164
3888E32p315J1507J196j3313O852N969q927M077L244j0324O965Q243j2904j23
3902d321J0254p198r28P062r568J19J2804q599o917J1390k558n321Q287n474o054
3917g022J2993j493j1786Q190L301p821O676k60j0248R309N659j3057K496Q170
3931E107p829K182N327j0442K523J1516j0163m060J0259m589k334P878p743l901
$$ plain form
3945 -6269 7183 3127 -7059 2009 2627 -3901 3962 1536 -7963 3152 6354 -5866 -1392 3799
3959 3799 -4181 1219 4462 -7161 -1676 8171 -2733 -3986 4449 -1600 -907 6017 -3808 -5055 7717
3974 7717 1146 -5962 3008 609 -3590 5331 -6 -7912 4101 4677 -5843 523 2386 -4261 3366
3989 3366 3716 -7626 -178 7426 -3668 -2518 3962 -3114 281 6275 -4878 -4092 7658 -422
4003 -422 -4779 3500 -1405 -3093 6496 -1670 -7526 5167 3405 -5621 1409 962 -4280 4752 2777
4018 2777 -8075 1691 6594 -4103 -623 3214 -4457 1485 5944 -6335 -2983 7074 -1714 -3349
4032 -3349 3389 -3349 -1685 6839 -2800 -6728 5819 1916 -4546 2772 -84 -3967 6237 2004
4046 2004 -7734 2727 4847 -4034 822 1801 -5293 3108 5221 -7301 -1824 6014 -2654 -1830 3021
$$ packed form
3945f269J3452m056j0186R068O18o528P863k426r499J1115L202j2220M474N191
3959C799p980N400L243j1623N485R847j0904j253Q435o049O93O924r825j247J2772
3974G717o571p108Q970k399m199Q921n337p906J2013N76j0520O366J863o647P627
3989C366L50j1342P448P604j1094J150O480p076L395N994j1153P86J1750q080
4003d22m357Q279m905j688R589q166n856J2693j762r026P030m47n242R032j975
4018B777j0852R766M903j0697L480L837p671N942M459j2279L352J0057q788j635
4032c349O738o738J664Q524r639l928J2547l903o462P318k856l883J0204m233
4046B004r738J0461K120q881M856R79p094Q401K113j2522N477P838q668Q24M851
$$ plain form
4061 3021 -4404 -408 6942 -3951 -5178 5963 549 -3001 3595 -1874 -3366 6888 589 -7222
4075 -7222 3605 3312 -4053 2131 409 -5560 4317 3939 -7340 -321 5217 -3387 -136 2988 -5050
4090 -5050 799 6916 -4799 -3929 5796 -662 -1769 4025 -3497 -2780 7484 -1031 -6539 3899 1840
4105 1840 -3709 3003 -827 -5501 5158 3021 -7075 805 3941 -3320 1852 2116 -5957 2603 6434
4120 6434 -5298 -2700 5007 -1526 -445 3623 -4577 -1587 7028 -2378 -5236 3874 -457 -2714 4130
4135 4130 -2331 -5003 6463 1781 -6357 2011 2723 -3028 3031 759 -6270 4091 5439 -5594
4149 -5594 -666 4040 -2908 611 2999 -6074 -835 6874 -3032 -3944 3942 -1192 -1146 4416 -3972 -4116
4165 -4116 7026 599 -5372 3253 1484 -2582 4242 -229 -6364 4668 3557 -5735 396 2543
$$ packed form
4061C021p425L996P350j0893j227J1141n414l550O596n469j492J0254o299p811
4075g222J0827k93p365O184j722n969R877l78j1279P019N538q604L251L124q038
4090e050N849O117j1715Q70R725o458j107N794p522P17J0264q515n508J0438k059
4105A840n549O712l830m674J0659k137j0096P880L136p261N172K64q073Q560L831
4120F434j1732K598P707o533J081M068q200K990Q615r406k858R110m331k257O844
4135D130o461k672J1466m682q138Q368P12n751O059k272p029J0361J348j1033
4149e594M928M706o948L519K388r073N239P709r906r12P886n134M6N562q388j44
4165d116J1142o427n971Q625j769m066O824m471o135J1032j111r292O131K147
$$ plain form
4179 2543 -3152 2645 2424 -6807 449 6055 -4478 -2893 3588 -1975 750 5171 -4453 -2413 6928
4194 6928 -1224 -4692 3280 -566 -1796 5642 -1401 -5760 5230 2569 -5660 706 520 -3408 3981
4209 3981 1525 -6455 2415 5545 -4384 -1139 2577 -3629 1336 4352 -5323 -1359 6829 -973 -2853
4224 -2853 3229 -2286 -1492 5083 -3548 -5336 5735 1703 -4136 2278 183 -3285 4691 186 -7220
4239 -7220 2921 4456 -3733 1185 2483 -3214 3017 3567 -6728 -1132 5362 -2458 -2039 3201 -2702
4254 -2702 419 5594 -4500 -4476 4930 -731 -3722 2732 -1276 -2345 6404 -38 -6342 3565 2832
4269 2832 -4018 1204 416 -3729 4671 3394 -6158 765 4924 -3729 -1179 1422 -4599 876 5336
4284 5336 -4326 -2551 5610 -950 -2090 2672 -3466 -1976 6507 -1594 -5234 4857 2476 -3078 2362
$$ packed form
4179B543n695N797k21r231P256N606j0533J585O481n563K725M421r624K040R341
4194F928q152l468P972l846j230P438p043m359J0990k661q229O366j86l928P389
4209C981k456p980Q870L130r929L245L716o206M965L016r675L964Q188p802j880
4224b853O082n515P94O575q631j788J1071m032n839O414k095l468P976m505p406
4239g220J0141J535q189M918J298n697O231N50j0295N596O494p820M19N240n903
4254b702L121N175j0094K4R406n661k991O454m008j069Q749o442o304R907p33
4269B832o850N222p88m145Q400j277r552O923M159q653K550K601o021N475M460
4284E336r662J775Q161o560j140M762o138J490Q483q101l640J0091k381n554N440
$$ plain form
4299 2362 -1026 -4417 4604 1383 -6450 1356 4093 -3084 1264 1450 -5096 2272 4508 -5843 -2037
4314 -2037 5130 -1141 -205 3403 -3718 -407 6000 -3069 -4872 4095 130 -2370 3435 -1922 -3475
4329 -3475 5620 339 -6476 1651 2213 -3438 2292 365 -4547 4335 4370 -5557 -585 3776 -2873 250
4345 250 2561 -4689 908 6253 -3275 -3148 3841 -1308 -1433 2941 -3573 -3111 6278 41 -5307 2910
4361 2910 1261 -2662 2924 -1070 -5031 4524 3058 -5092 1016 3455 -2355 2100 1619 -6101 1103
4376 1103 5277 -4257 -2106 3697 -1764 103 3596 -4573 -2435 6035 -1569 -4441 3283 149 -1618
4391 -1618 4386 -1596 -4502 5185 1795 -5200 1294 1507 -2439 3303 955 -5709 2437 4324 -4879
4406 -4879 -1415 2606 -2773 1382 3448 -5168 -484 6282 -2136 -3334 2794 -1431 -746 4535 -2983
$$ packed form
4299B362l388l391R021l221p833P806K737p177M348J86o546P368K236j0351L806
4314b037P167o271R36L608p121L311O407r069j803Q967l965k500N805n357j553
4329c475R095n281o815Q127N62n651N730j927m912Q882L5r927M972M361o649L123
4345B50K311p250N597N345r528J27O989n149j25M374o514M62R389o237n348Q217
4361B910j649l923N586l994l961R555j466q150O108K439n810M455m81p720P204
4376A103M174r534K151N803n461J867L493q169K138Q470p604k872P724l134j767
4391a618O004n982k906R687l390o995O494K13l946N742k348o664Q146J887r203
4406d879L464M021n379M155K066q616M684O766q418j198O128m225O85N281p518
$$ plain form
4421 -2983 -3673 6028 1166 -4367 1749 -75 -2669 3607 -466 -5863 3315 3765 -4296 207 1893
4436 1893 -3291 2402 2981 -5870 21 5881 -2200 -1403 3191 -2106 223 4601 -4197 -3229 5381 -370
4452 -370 -3476 2699 -1129 -2060 4727 -1377 -5929 3520 2280 -3725 1105 571 -2602 4235 2070 -5994
4468 -5994 1378 4518 -3622 -447 2420 -3212 1572 4439 -4471 -2205 5017 -1580 -2683 2238 -2638
4483 -2638 -1210 5625 -1709 -4658 4599 1416 -3604 1828 -410 -3195 4712 1095 -5329 2453 3893
4498 3893 -3104 526 845 -4564 1695 3533 -5575 -1185 5042 -1749 -720 2408 -3414 -814 5060
4513 5060 -3192 -3830 4978 709 -2081 3258 -1520 -2498 4970 -315 -5844 2435 2514 -3034 2045 451
4529 451 -4092 3525 2529 -5944 -459 3915 -2416 238 2440 -3955 1158 5576 -3884 -2850 4449
$$ packed form
4421b983o90R701m862n533O116j824k594O276m073n397R178M50q061M503J686
4436A893n184N693N79q851N891N860q081P97M594n297K329M378q798R68Q610n751
4452c70l106O175l828r31O787o104m552R449j240o005M830n34l173O837k165q064
4468e994P372L140q140L175K867n632M784K867q910K266P222o597j103M921m876
4483b638J428O835p334k949R257l183n020N432k238k785P907l617o424P782J440
4498C893o997L630L19n409O259J838r108M390O227o791J029L128n822K600N874
4513E060q252o38Q808m269k790N339m778r78P468n285n529Q279P9n548N079j594
4529D51m543P617r96q473N485M374o331K654K202o395N113M418r460J034P299
$$ plain form
4544 4449 -1060 -1610 3137 -2742 -1903 5916 -1126 -4875 2792 1001 -2935 2305 -876 -4166 4787
4559 4787 2370 -5195 1198 3051 -2727 1410 1582 -4634 2016 4882 -3948 -1296 3938 -1499 -526
4574 -526 2707 -4312 -1456 5692 -1852 -4388 3542 57 -1904 3215 -2098 -3918 4760 1218 -4859
4589 -4859 2075 2184 -2154 2944 446 -4972 2771 3778 -4827 -952 3209 -2073 940 2455 -4731
4604 -4731 -368 5274 -2948 -3213 3150 -988 -780 3956 -2505 -3070 5517 357 -4580 2203 1072 -2134
4620 -2134 3522 -208 -4590 3721 3306 -4606 116 1750 -2969 1812 2071 -5455 441 5181 -3228
4635 -3228 -1731 3016 -2024 165 3722 -3868 -2132 5871 -467 -3498 2683 -454 -1656 3884 -1478
4650 -1478 -4645 4150 2048 -4109 1176 920 -3043 3070 1173 -5860 1559 4454 -3384 -727 2522
$$ packed form
4544D449n509n50M747n879Q39P819p042l749P667j791l936N240l181l290Q953
4559D787k417p565O393J853n778M137J72o216O650K866q830K652N234n437R73
4574e26L233p019K856P148p544k536P930l485j961N119n313j820Q678l542o077
4589d859O934J09m338N098k498n418P743J007q605L875M161n282L013J515p186
4604d731M363N642q222k65O363m138K08M736o461n65Q587n160m937O783j131l206
4620b134N656l730m382Q311m15p912M722J634m719M781K59p526N896M740q409
4635c228J497M747n040K189L557p590J736Q003o338l031O181l137j202N540n362
4650a478l167Q795k102o157N285k56l963O113j897p033P419K895p838K657L249
$$ plain form
4665 2522 -2411 1327 3486 -4346 -1514 5339 -1439 -2333 3009 -1647 -800 4542 -2616 -4227 4285
4680 4285 840 -3737 1712 36 -2378 4113 821 -4857 2639 3367 -3463 705 1872 -3040 2217
4695 2217 3196 -5162 -658 4699 -2197 -1592 2189 -2715 -152 4609 -3611 -3437 4574 -23 -2834 2500
4711 2500 -1298 -2212 4934 -373 -4981 3423 2660 -3351 1676 299 -3619 3254 2354 -5542 402 4221
4727 4221 -2741 -517 1752 -3456 960 4249 -4225 -2339 4520 -652 -1337 2668 -2354 -1304 5314
4742 5314 -1426 -4587 3779 1309 -2695 2357 -388 -3418 4031 1267 -5621 1104 2801 -2671 1033
4757 1033 1509 -3981 1891 3892 -4418 -1336 4194 -1578 -435 2728 -3391 -499 5473 -2222 -3594
4772 -3594 3643 -10 -2241 2607 -1656 -3148 4695 759 -4894 1995 2096 -2690 2066 169 -4434
$$ packed form
4665B522m933L738K159p832K832O853o778q94N342m656Q47N342p158j611Q512
4680D285l445m577N449j676k414O491l292n678P496P28o830M168J167m912N257
4695B217R79q358M504N357o896O05L781m904K563M761q220J74Q011m597k811N334
4711B500l798r14P146n307m608Q404p63o011N027j377l918O873r00p896N944L819
4727D221o962K224K269n208M416L289q474J886O859n172o85M005n022J050O618
4742E314o740l161Q366k470m004N052k745l030P449k764o888O725J697n472L704
4757A033M76n490N872K001q310L082N530n772J143L163o119K892N972p695j372
4772c594P237l653k231M848m263j492P843l936n653O889J01m786M756j897m603
$$ plain form
4787 -4434 3148 3564 -4428 -120 3569 -2064 640 2241 -4183 200 4930 -3217 -2565 3144 -823
4802 -823 -1117 2799 -2833 -2805 4989 -393 -4300 2605 873 -2020 3126 -298 -4096 3754 2444 -4590
4818 -4590 601 2602 -2502 1724 1930 -4510 745 4360 -3703 -2065 2740 -1666 -90 3112 -3833
4833 -3833 -1530 5312 -1301 -3672 2665 -169 -1693 3786 -982 -3563 4406 1742 -4265 1287 1332
4848 1332 -2509 2665 1005 -4858 1984 3701 -3863 -1006 2058 -2504 1008 2762 -4221 -689 5673
4863 5673 -1733 -2131 2780 -1153 -982 3763 -2556 -3394 4363 595 -3605 2073 130 -2368 3191 -271
4879 -271 -5192 2699 2740 -3572 538 1924 -2459 2094 2280 -4822 26 4639 -2168 -1405 2447 -2311
4895 -2311 270 3878 -3475 -2994 4651 -553 -3269 2118 -890 -2026 3896 -809 -4489 3156 2058
$$ packed form
4787d434P582M16p992M308L689n633K704J601o424M383M730q147O52N709l967
4802h23k94L916n632K8P794n382l907O905j732k893N146l424l798P850j310p034
4818d590N191K001n104M226K06o440N255L615q063J638M805m406J576L202o945
4833c833K303O842o613k371O337k834j524N479m768k581P969k664o007N552M5
4848A332l841N174j660n863O842J717p564K857L064m562L512J754o983L532O362
4863E673p406l98M911l933J71M745o319q38P757l768m200N678j943k498N559l462
4879b71m921P891M1o312M110J386m383M553J86p102M848M613o807P63L852m758
4895b311K581L608p353M81P645n204k716N387l008j136N922m705l680P645j098
$$ plain form
4910 2058 -3410 1329 869 -2807 3192 1946 -4854 1092 3976 -2764 -284 1838 -3119 941 3496
4925 3496 -4133 -1884 4237 -1140 -2153 2334 -1845 -1196 4521 -1523 -3761 4105 1399 -2928 2176
4940 2176 -297 -2534 3843 850 -4706 1775 3082 -3135 517 1064 -3448 1804 3227 -4438 -826
4955 -826 3879 -1933 -1041 2096 -2844 -195 4346 -2477 -3048 3883 267 -1956 2278 -1369 -2418 4239
4971 4239 -165 -4800 2466 1972 -2742 1253 144 -3956 2643 2567 -4584 137 3409 -1997 496 1726
4987 1726 -3137 678 4232 -2879 -2288 3358 -618 -1339 2694 -2155 -1679 4486 -1104 -4377 2890 675
5003 675 -2285 2227 -594 -3131 3804 1770 -4449 842 2328 -2429 1342 1409 -3762 1663 4076 -3434
5019 -3434 -1251 3026 -1730 -425 2259 -3467 -1059 4715 -1537 -3254 2730 -193 -1691 2671 -1455
$$ packed form
4910B058n468M739m60l676N999j246o800N946K884o740K480K122m957M060K555
4925C496p629K249O121n377j013M487m179O49N717o044k238P866k706m327N104
4940B176k473k237O377k993n556O481J307o217L652N47m512N252J423p665L612
4955h26M705n812Q92L137m940K649M541o823n71O931l616k223M234l647j049O657
4971D239m404m635P266m94m714L995j109m100O599p6p151M721L272n406K493J230
4987A726m863L815L554p111N91N646l976p21M033m849M76O165n590l273P267k215
5003F75k960M512k821k537O935k034o219N291J486m757L771O7n171N425K413p510
5019c434K183M277m756J305K684n726K408N774o252j717N984k923j498M362m126
$$ plain form
5034 -1455 -2975 4142 1186 -3994 1948 1364 -2168 2146 528 -4197 2201 3270 -3709 -408 2503
5049 2503 -1911 766 2043 -3962 -397 4431 -2500 -2454 2886 -954 -476 3326 -2156 -2403 4553 399
5065 399 -3520 2085 661 -1687 2877 -355 -4132 2696 2431 -3903 253 1538 -2277 1481 1601 -4265
5081 -4265 636 4152 -2486 -1508 2471 -1691 249 3421 -3100 -1737 4457 -363 -2835 2342 -624
5096 -624 -1492 3289 -1107 -3818 3321 1445 -3499 1026 822 -2454 2735 1300 -4509 1589 3711 -2512
5112 -2512 -343 1995 -1945 1021 2942 -3816 -1065 4274 -1375 -2019 2328 -1758 -944 3658 -2142
5127 -2142 -3335 3432 696 -2970 1545 66 -1856 3303 290 -4177 2134 2922 -2669 389 1217
5142 1217 -2518 1943 2239 -4080 -368 3582 -1864 -953 1741 -2340 -33 3781 -2664 -2737 3902 -98
$$ packed form
5034a455j520P117k956n180N942n84l532M314j618m725O398J069o979L301K911
5049B503m414K677J277o005L565M828o931M6N340l840M78L802n482k47O956m154
5065C99l919N605j424k348M564l232l777O828k65o334M156J285l815L758J20n866
5081d265M901L516o638R78L979m162J940L172o521J363O194m820k472N177k966
5096f24q68M781m396k711P139j876m944M525k04l276N189j435n809O098K122o223
5112b512K169K338l940K966J921o758K751N339n649o44M347m086Q14M602n800
5127b142j193O767k736l666M515j479j922N159l013m467O311P88n591L058Q28
5142A217l735M461K96o319L712L950n446R11K694m081K307L814o445p3O639m000
$$ plain form
5158 -98 -2298 1928 -1075 -1458 3995 -225 -4107 2854 1709 -2688 1462 35 -2758 2532 1764 -4214
5174 -4214 419 3309 -2034 -393 1226 -2955 651 3285 -3144 -1664 3716 -503 -1098 2238 -1935
5189 -1935 -1196 3961 -1200 -3505 2973 958 -1997 1944 -662 -2795 3109 814 -4344 986 2351
5204 2351 -2178 831 1277 -2906 1933 3090 -3451 -911 3323 -1163 -316 2225 -2470 -120 4247
5219 4247 -1883 -2856 2597 8 -1855 1968 -1491 -2256 3834 659 -3916 1592 1483 -2253 1352 378
5235 378 -3198 2430 2948 -3499 -5 2461 -1573 274 1657 -3350 227 3871 -2493 -1720 2727 -528
5251 -528 -1125 2255 -2461 -2070 3875 -232 -3124 2398 642 -1195 2422 -588 -3005 3160 1724 -3623
5267 -3623 620 2118 -1691 1363 1311 -3556 767 3117 -2800 -1408 2196 -1447 -10 2574 -2708
$$ packed form
5158i8k200M226l003l83N453m220l882O961j145m397M150j427k793N290p68n978
5174d214M633K890n343J641J619m181L606K634o429J480N380m219n95L336m173
5189a935P39N157n161k305O478k015k955L941k606k133N904k295n158N330J365
5204B351m529L009M46m183M839J157o541K540M234m486Q47K541m695K350M367
5219D247o130r73N453k589j863L823l459p65O090l175m575N508j09l736L605r74
5235C78l576N628N18o447L494K466m034J847J383n007L577L644o364P73M447l255
5251e28n97L380m716L91N945m107k892N522j756j837L617l010k417O165j436n347
5267c623M243J498l809L054n2m867M323K350n917J392L604l643J437K584n282
$$ plain form
5282 -2708 -1134 4048 -1014 -2711 2190 -173 -890 2810 -1108 -2859 3536 1155 -3685 806 586
5297 586 -2114 1908 439 -3470 1697 3057 -2799 -536 1735 -1563 785 2093 -3236 -373 3934
5312 3934 -1216 -1668 2059 -1016 -794 2823 -2246 -2591 3706 581 -3005 1589 120 -1618 2605 -344
5328 -344 -3706 1953 2409 -2821 447 1547 -1869 1552 1974 -3314 290 3278 -1840 -878 2045 -1506
5344 -1506 59 2962 -2772 -2041 3391 -489 -2340 1558 -799 -1122 2932 -814 -3262 2588 1628 -2391
5360 -2391 1088 685 -1941 2599 1512 -3445 826 2936 -1848 -638 1113 -2308 1094 2493 -3222
5375 -3222 -1290 3341 -850 -1674 1618 -1295 -741 3269 -1306 -2738 2706 785 -2045 1660 -525
5390 -525 -2026 2733 511 -3766 1187 2309 -2061 221 471 -2639 984 2406 -3311 -586 3085
$$ packed form
5282b708J574N182n062j697M901k363p17L700l918j751O395k381m840M491k20
5297E86k700M022j469l909N167J360n856K263K271l298K348J308n329K863M307
5312C934n150m52L727l075K22L617n069l45O297l125l586M594j469j738M223k949
5328c44l362N659M56n230L268J100l416L421M22n288L604K988n118R62K923l551
5344a506J565K903n734P31N432l880j851L898k357l23M054l746k448N850r60m019
5360b391L479m03k626M540j087m957M271K110m784J210J751l421L402J399n715
5375c222J932M631m191q24L292k913N54M010m575j432N444j921k830L705k185
5390e25j501M759k222m277M953J122m370K282K50l110L623J422n717K725L671
$$ plain form
5405 3085 -1195 -495 1590 -2130 -22 3601 -2115 -2251 2878 425 -1597 1739 -1051 -1607 3345 -237
5421 -237 -3691 1471 1614 -2029 1031 182 -2799 2237 1911 -3660 5 2409 -1592 473 1241 -2287
5437 -2287 758 3524 -2374 -1657 2656 -603 -941 1515 -2013 -1366 3612 -729 -2943 2124 721 -1567
5453 -1567 1577 -624 -2415 2564 1669 -3179 543 1935 -1199 894 932 -2809 919 2917 -2882 -892
5469 -892 2341 -818 -341 1662 -2453 -1137 3310 -1310 -2342 1970 102 -814 2379 -1069 -2077 2992
5485 2992 915 -3153 1062 1350 -1435 1785 394 -3130 1485 2169 -3057 -816 1745 -1700 419
5500 419 1645 -2849 -136 3364 -1730 -1920 1968 -513 -517 2148 -1556 -1802 3602 201 -2572 1323
5516 1323 262 -1352 2022 -354 -2974 2282 1793 -2774 -157 1104 -1620 1209 1109 -3234 598
$$ packed form
5405C085m280P00K085l720K108L623n716j36N129k453k022L336k790n56M952l582
5421b37l454N162J43l643L060q49k981N036l26n571L665K404m001K065P68l528
5437b287L045K766n898P17M313l259l38K456l528O47M978m341k214N067j403k288
5453a567L144k201j791M979q95m848L722J392l134K093L8l741L728J998n799J990
5469h92L233l159M77K003m115J316M447m620j032M312j868r16L193l448j008N069
5485B992k077m068M215K88k785L220j391l524M615O84n226K241K561l445K119
5500D19J226m494K713L500n094j90L888k481mK665l704k46N404l401k773L895
5516A323j061j614L374k376k620N256m89m567K617J261k724K829j00m343L832
$$ plain form
5531 598 3243 -1967 -983 2021 -1051 382 2212 -2567 -1396 3498 -188 -2245 1653 -616 -1192 2235
5547 2235 -1393 -2915 2556 977 -2723 855 694 -1342 2231 830 -3108 1094 2751 -2133 -376
5562 -376 1424 -1391 1219 2249 -2995 -944 3297 -1212 -1839 1567 -1087 -721 2521 -1726 -2332 2744
5578 2744 422 -2219 1189 -401 -1649 2493 354 -3038 1837 2082 -1877 398 754 -2095 1324
5593 1324 1586 -3245 -89 2880 -1434 -1020 1174 -1829 -30 2618 -1983 -1878 3049 340 -1639 1523
5609 1523 -588 -1194 2786 -502 -3080 1826 1725 -1873 1044 134 -2255 1910 1320 -3239 271 2033
5625 2033 -1421 163 911 -2163 818 2839 -2433 -1622 2791 -399 -982 1590 -1411 -439 3280 -1141
5641 -1141 -3164 2096 580 -1745 1142 -743 -1951 2575 829 -3200 709 1771 -1631 638 736
$$ packed form
5531E98K645n210R84L004l072J433J830m779J171M894l686k057L898k269n76L427
5547B235l628j522N471j579l700L578j61k036L573j401l938M202J657m884J757
5562c76J800k815K610J030n244K051M241m509o27L406k654L66L242m247o06N076
5578B744k322k641L408j590j248M142k139l392M875K45l959K275L56k849L419
5593A324K62m831L156K969m314M14K194l003J799K648m601J05M927k709j979L162
5609A523k111o06L980l288k578M906j01l598K917r10k389M165n90m559L510J762
5625B033l454J584P48l074K981K021n272Q11M413l190n83K572l001R72L719m421
5641a141k023N260j516k325K887j885j208M526j746m029L909J062l402K269R8
$$ plain form
5656 736 -2457 1343 2563 -2343 -596 2644 -862 -351 1597 -2276 -460 3160 -1592 -2242 2019 6
5672 6 -1379 1648 -1370 -1917 2979 317 -3011 1236 1506 -1583 973 429 -2584 1899 2165 -2781 -222
5689 -222 2073 -1130 337 1142 -2664 -25 3037 -2098 -1907 2049 -581 -932 1650 -1911 -1144 3504
5705 3504 -281 -2633 1804 629 -1337 1814 -294 -2508 2175 1602 -2886 476 1321 -1541 835
5720 835 687 -2780 678 2747 -2457 -974 2051 -1169 -1 1955 -2435 -899 3284 -550 -2134
5735 -2134 1591 -150 -762 2125 -1072 -2654 2801 1039 -2817 707 834 -1629 1526 524 -3079
5750 -3079 1300 2510 -2225 -345 1353 -1421 1051 1878 -2527 -450 3301 -1309 -1429 1823 -905
5765 -905 -597 2243 -1575 -2233 2836 342 -2503 1180 189 -1368 2136 118 -3061 1725 2205 -2043
$$ packed form
5656G36l193L800J220m906J747L240l506N11J948l873J816L620m752o50M261k013
5672Fj385L027l018n47M896k662l328M247K70l089K556n44l013M483K66m946K559
5689b22K295l203J467Q05l806K639L062n135J91L956k630l51K582l561P67M648
5705C504l785k352M437j175j966L151k108k214M683n73m488L362Q45k862K376
5720H35j48l467L458K069n204J483L025l220J168J956m390J536M183l834j584
5735b134L725j741o12K887l197j582N455j762l856L524J27k463L155j002l603
5750c079M379J210m735J880J698k774K472Q27m405K077L751m610j20L252k728
5765i05L08K840l818o58N069k494k845L683r91j557L504k018l179M786M80m248
$$ plain form
5781 -2043 310 1057 -1904 1348 1728 -3089 147 2965 -1556 -711 1555 -1206 -82 2294 -2228 -1329
5797 -1329 2927 -372 -1734 1314 -736 -978 2587 -517 -2809 2608 1565 -2105 818 498 -1779
5812 -1779 2012 1232 -3252 630 2320 -1803 -167 890 -2085 615 2374 -2570 -1161 2753 -660
5827 -660 -1219 1429 -1123 -614 2737 -1152 -2251 2474 741 -1748 1227 -347 -1641 2493 672 -3209
5843 -3209 1020 1756 -2066 577 649 -1986 1333 2065 -2801 -512 2606 -1087 -412 1223 -1676 -69
5859 -69 2823 -1744 -2139 2800 156 -1169 1391 -1183 -1546 2848 -46 -3022 1386 1390 -1808 973 421
5876 421 -2340 1905 1539 -2890 41 2282 -984 332 1316 -1965 541 2750 -2394 -1588 2323 -749
5892 -749 -1108 1573 -1504 -1277 2901 -729 -2855 1792 494 -1511 1311 -170 -2210 2400 1477 -2828
$$ packed form
5781b043K353P47k961L252L80m817L236K818m521Q45K266k761J124K376m522Q99
5797a329M256l299j362L048k050k42L565l104k292N417j043l670K923l20k277
5812a779L791p80m484L882J690m123J636J057k975K700J759m944J409L914l413
5827f60n59K648k552N09L351l889j099M725j733k489K975j574j294M134j821l881
5843c209M229P36l822K643P2k635L319P32m866K289L118l693O75J635k899J607
5859f9K892m567l95M939k644j325K560k574l63M394k894k976M408Ml198K781n52
5876D21k761M245l66m429K931K241l266J316R84l281K506K209n144Q06L911l072
5892g49l59K681l077K27M178l630k126M647j298k005K822j481k040M610r23m305
$$ plain form
5908 -2828 547 1638 -1421 871 1087 -2441 1067 2672 -2610 -883 2270 -1103 -455 1570 -2350
5923 -2350 -568 3080 -955 -2133 1684 167 -1006 1952 -821 -2057 2904 658 -2744 1020 1054
5938 1054 -1393 1261 213 -2807 1269 1716 -2905 -183 1824 -1274 384 1629 -2391 -206 3213
5953 3213 -1531 -1426 2066 -445 -581 2152 -1654 -1618 3159 16 -2533 1177 268 -1413 1831 -178
5969 -178 -2827 1797 1679 -2534 284 1051 -1420 1282 1213 -2700 608 2733 -1670 -926 1798 -1200
5985 -1200 53 2023 -2251 -1187 2993 -431 -1703 1460 -257 -1127 2383 -874 -2510 2195 1274
6000 1274 -2204 891 524 -1520 2129 933 -2983 944 2291 -1730 -314 1137 -1331 338 2073
6015 2073 -2723 -968 2752 -930 -1393 1750 -1109 -583 2577 -1273 -2173 2347 673 -1919 1347 272
$$ packed form
5908b828L375J091l059K292K16l528L508J605n282J727L153l373O48K025l920
5923b350J782L648m035j178L817j517j173K958k773j236M961k246l402L764L4
5938A054k447K654j048l020M076M47m621K722K007l098J658J245m020K185L419
5953C213m744J05L492k511j36K733l806L6M777l143k549L710r09j681L244k009
5969a78k649M624j18m213K818P67k471K702o9l913L308K125m403P44K724k998
5985a200J253J970m274J064M180l424j272L163j717q70L510l257j636M705r21
6000A274l478L095l67k044L649j196l916L927J347m021J416J451k468J669J735
6015B073m796J755L720l682m63L143k859N26L160l850r00M520j674k592L266j075
$$ plain form
6031 272 -1273 2427 432 -2853 1427 2074 -2148 -8 868 -1992 1200 1601 -2810 -50 2793 -1353
6047 -1353 -864 1340 -1616 18 2744 -1798 -1654 2530 93 -1396 1380 -729 -1303 2675 -449 -2619
6063 -2619 1864 1119 -1791 811 149 -2210 1696 916 -3056 366 2338 -1632 145 1009 -2127 700
6079 700 2635 -2195 -990 2786 -517 -705 1641 -1229 -956 2841 -621 -2597 1837 292 -1799 1323
6095 1323 -285 -1879 2275 948 -2896 676 1657 -1415 550 848 -2108 1183 2129 -2671 -699 2075
6111 2075 -1026 -602 1486 -1781 -257 2696 -1513 -2104 1801 -167 -1169 1456 -833 -1532 2729 507
6127 507 -2785 1239 1416 -1285 1420 290 -2388 1895 1750 -2423 -220 1916 -1453 113 1168 -2684
6143 -2684 47 2802 -1761 -1415 2092 -585 -688 1722 -1384 -1431 2820 -314 -2420 1497 408 -1246
$$ packed form
6031B72j545L700j995l285M280O47m222K140Q76k860L192M01m411K760K843m146
6047a353M89K204k956J634K726m542J44M184k437j489K776k109n74L978l124k170
6063b619M483p45k910K602o62k359L906p80l972L422J972l970J777Q64l136K827
6079G00J935m830J205L776l303j88K346k870K73L797l462j976M434j545k091L122
6095A323j608j594M154j327l844L572R81l072J965K98k956L291R46m800J972K774
6111B075l101M24K088l267J524K953m209n91L905j968j002K625k289o99M261k222
6127E07l292M024J77k701K705j130k678M283j45m173K203K136l369J566J055l852
6143b684K731K755m563L46L507k677j03K410l106m7M251l134k106L917j089j654
$$ plain form
6159 -1246 1738 -410 -2328 1887 1200 -2676 245 1303 -1363 960 1015 -2618 569 2547 -1929 -929
6175 -929 1735 -1165 -196 1717 -1819 -731 2901 -549 -1878 1409 -362 -894 1941 -972 -2228 2486
6191 2486 952 -2492 732 897 -1656 1398 591 -2660 1237 2188 -1846 -197 1647 -1212 487 1663
6207 1663 -2417 -446 2897 -1182 -1308 1574 -704 -305 2204 -1618 -1920 2347 40 -1898 1082 144
6223 144 -1228 1841 15 -2659 1545 1595 -2202 512 980 -1449 1229 1438 -2630 238 2229 -1638
6239 -1638 -1223 1330 -1199 69 2342 -1889 -1207 2499 -295 -1763 1441 -406 -886 2408 -365 -2479
6255 -2479 2120 1086 -1916 550 401 -1417 1576 882 -2793 597 2139 -1567 -199 879 -1572
6270 -1572 380 1974 -2304 -800 2409 -501 -995 1461 -1070 -558 2615 -1068 -2126 2198 723
$$ packed form
6159a246K984k148j918M215o87l876K921J058k666K323N5l633L187J978m476J000
6175i29K664k900R69J913l536J088L632l450j329L287j771n32K835k913j256M714
6191B486j534l444L224J65k553L054q07l251L897R51m034J649J844k859J699J176
6207A663m080J971L343m079j26K882k278L99K509l822l02M267k307j938K980r38
6223A44j372L069j826k674M204N0l797K714M68k429K678K09m068K868J991l867
6239a638M15K553k529J268K273m231O82L706k794j468L204j847m80L294k773k114
6255b479M599j034l002K466j49j818K993o94l675L390J542l706J368J078k451
6270a572J952J594m278J504L209k910m94K456k531N12L173l683j058M324j475
$$ plain form
6285 723 -1617 1350 -192 -1387 2063 267 -2926 894 1732 -1578 304 519 -1722 1244 1842 -2339
6301 -2339 -690 2263 -905 -467 1459 -1447 72 2490 -1379 -1783 2064 -99 -1347 1370 -747
6316 -747 -1339 2473 -111 -2514 1327 1237 -1478 983 334 -1821 1676 1562 -2505 -29 2061 -1272
6332 -1272 108 980 -1788 201 2392 -1795 -1259 2016 -446 -601 1113 -1277 -1020 2648 -409 -2113
6348 -2113 1572 539 -1171 1263 -663 -1748 1978 1188 -2537 446 1345 -1411 766 845 -2124 567
6364 567 1996 -2045 -951 1647 -748 -259 1228 -1911 -354 2739 -941 -1688 1692 135 -849 1637
6380 1637 -725 -1692 2255 601 -2306 668 641 -1226 1217 155 -2239 1274 1747 -2103 -313 1565
6396 1565 -1142 189 1394 -2147 179 2622 -846 -1359 1607 -98 -502 1714 -1320 -1465 2341 37
$$ packed form
6285G23k340K967j542j195L450j796l193L820Q38l310J882K15k241K966N98m181
6301b339J649K953l168M38J926k906J519K418l869m04L847k163j248K717k117
6316g47n92L812k584k403L841r0k715K461o49k155L497j14m067K476K090l333
6332a272J380Q72k768J989K191m187N36L275k462j55J714k390K57L668l057j704
6348b113L685j033j710K434j926j085L726p90l725K983Q99k756K177P9k969K691
6364E67J429m041J094K598k395M89J487l139J557L093l680p47L380j557r84K486
6380A637k362r67L947j654k907K974k7j867K443j062k394L513M73l850J790J878
6396A565k707J331J205l541K326K443l468n13K966j705m04K216l034j45L806k304
$$ plain form
6412 37 -2086 1078 238 -1087 1588 -361 -2067 1391 1113 -2056 128 1098 -1283 1063 1363 -2310
6428 -2310 362 2299 -1366 -668 1229 -667 256 1739 -1799 -1069 2398 -587 -1894 1179 -479 -993
6444 -993 1821 -723 -2219 1778 972 -2106 506 568 -1342 1452 744 -2401 634 2097 -1756 -505
6460 -505 1045 -1400 393 1284 -2097 -863 2300 -777 -1163 956 -758 -380 2087 -1081 -1940 2061
6476 2061 512 -1588 987 -14 -897 1872 -16 -2652 1022 1510 -1613 -131 415 -1538 1086 1379
6492 1379 -2531 -376 2162 -934 -676 1135 -1184 173 2005 -1169 -1353 2234 365 -1197 1258
6507 1258 -283 -1049 2307 -330 -2443 1308 877 -1455 587 -78 -1413 1392 1019 -2236 -45 1783
6523 1783 -691 -18 1132 -1274 739 2015 -1452 -916 2150 -227 -953 910 -1126 -351 2275 -482
$$ packed form
6412C7k123L164q40j325K675j949j706L458k78l169K184R70k381K346L00l673
6428b310K672J937l665O98J897j896R23J483l538P30L467k985j307L073j658n14
6444i93K814k544j496L997q06l078K612O2j910K794p08l145L035J463l853J251
6460e05J550k445J793Q91l381J234L163l077l86K119j714L78K467l168q59M001
6476B061j549k100K575j001q83K769j888k636L674M88l123J482N46j953K624K93
6492A379l910K155K538l096K58J811k319J357J832l174j84L587j869j562K455
6507A258j541p66L356k637k113L751m31k332K042o65j335K805l73l255K191J828
6523A783k474O73J150k406K013J276l467N36L066k377p26J863k036P75K626k757
$$ plain form
6539 -482 -2208 1328 452 -1436 1024 -342 -1432 1768 856 -2236 480 1546 -1321 450 508 -1707
6555 -1707 999 1852 -1993 -446 1951 -853 -382 1029 -1439 -317 2240 -817 -1720 1639 105 -997
6571 -997 1437 -628 -1188 2391 399 -2011 1029 1010 -1195 634 87 -1848 1349 1326 -2256 -382 1346
6588 1346 -1003 149 856 -1811 170 2017 -1301 -1477 1643 -481 -590 1420 -1007 -1072 2344 75
6604 75 -1859 1123 286 -1028 1270 -441 -2005 1628 1064 -1916 179 1158 -1018 783 710 -2135 215
6621 215 2197 -1497 -851 1575 -655 79 1347 -1548 -728 2307 -319 -1572 1080 18 -635 1366
6637 1366 -547 -2002 1831 750 -1903 279 728 -1037 1124 365 -2111 992 1669 -1703 -67 1238
6653 1238 -800 350 1274 -2017 -309 2320 -983 -1001 1143 -616 -643 1451 -1237 -1499 2176 325
$$ packed form
6539d82j726L536q76j888K460j366j090L200r12l092K716J066k867J771N8k215
6555a707K706Q53l845J547K397k804M71J411k468J122K557l057r03L359j534j102
6571i97K434k065n60L579j992k410L040j9k205J829n47j935L197k3l582J874J728
6588A346k349J152P07k667J981J847l318j76L120k124j09K010k427o5L416k269
6604G5j934K982q37j314K298j711j564L633n64k980K095R79k176J801p3k845K350
6621B15J982l694O46K426k230P34J268k895Q20L035k626j253K652j062o53K001
6637A366j913j455L833j081k653K182M49j765K161p59k476L103O77l372J636J305
6653A238k038J150R24l291J708K629l303j8K144j759k7K094k688k62L675j851
$$ plain form
6669 325 -1616 838 82 -812 1507 101 -1973 1332 1246 -1318 135 1023 -1189 922 1039 -2242 256
6686 256 1931 -1129 -860 1024 -864 -138 1579 -1536 -1167 2056 -184 -1465 968 -150 -849 1853
6702 1853 -338 -2116 1658 990 -1696 405 291 -1199 1266 619 -2176 213 1609 -1199 -395 950
6718 950 -1291 304 1837 -1444 -573 2207 -370 -938 1227 -714 -371 1692 -525 -1734 1848 592
6734 592 -1276 906 -186 -1342 1554 312 -2562 595 1387 -1368 304 669 -1284 884 1618 -1972
6750 -1972 -346 1930 -639 -369 782 -1266 -437 1977 -1359 -1818 1532 16 -1208 1054 -812 -1039
6766 -1039 1946 -35 -2136 1106 943 -1120 627 182 -1289 1370 1051 -1901 -123 1618 -864 -253
6782 -253 828 -1556 256 1960 -1336 -1220 1653 -333 -834 776 -1225 -781 1946 -371 -1757 890
$$ packed form
6669C25j941K454p56q94K319j406k074L305q6k564J453Q88k212K111J17l281K498
6686B56J675l060K69J884j888P26J717l115L69L223k240j281K433j118o99K702
6702A853k191j778L774o68k686K101j14j490K465o47k795K389J396k808Q04J345
6718I50k241J595J533l281Q71K780k577n68K165j941L43K063k217j209L582j256
6734E92j868K182j092j156K896j242k874L157P92k755J672L65j953K168P34l590
6750a972J626K276k569K70J151k048Q29K414l336m59L350j516j224K262j866k27
6766a039K985j981k101L242j63k063J747m45j471K659l19k952J778J741k482O11
6782b53J081k384J812J704l296J16K873j986n01J610k001M44K727k317j386K647
$$ plain form
6798 890 514 -966 1312 -18 -1410 1731 816 -2219 388 1299 -895 506 588 -1655 548 1684
6814 1684 -1719 -808 1458 -815 -102 1038 -1271 -261 2205 -436 -1370 1162 -115 -914 1411 -615
6830 -615 -1321 1653 702 -2060 405 628 -841 548 -47 -1987 1098 1431 -1428 -307 1259 -787
6846 -787 328 1085 -1556 -70 1948 -1003 -1005 1267 -343 -241 1334 -1187 -1521 1866 -45 -1685 713
6863 713 81 -755 1008 -143 -1924 1159 1107 -1312 70 782 -811 911 742 -1885 406 2043 -1115
6880 -1115 -744 1063 -768 -34 1557 -1406 -889 2059 -238 -1501 915 -204 -511 1448 -437 -1757
6896 -1757 1513 753 -1342 535 570 -856 1153 399 -2202 665 1764 -1078 -525 809 -1055 395
6912 395 1067 -1481 -622 2135 -398 -978 1021 -624 -366 1702 -1005 -1410 1533 310 -1132 1015
$$ packed form
6798H90l76j480K278j330j392L141r15l035K607R11k194J401Q2k243K203J136
6814A684l403R11K266k273P13J140k309J010K466k641r34K532j277p99K325k026
6830f15p06K974r51k762K465K23j469J389n95j940L085L33k859J121J566k046
6846g87J115P57k641J486K018k951kK272j610J02J575k521l34L387j911j640K398
6863G13o32q36J763j151j781L083n2k419J382P12j593J722j69k627K291J637l158
6880a115L71J807j831P34J591k963N17K948k297j263K416j119l07J959j885j320
6896a757L270p60k095J877L5j426K009p54k601K867J099k842N53J334j864J450
6912C95O72k548Q59K757k533n80J999j645K58K068k707m05K943j223j442K147
$$ plain form
6928 1015 -177 -856 1392 151 -2170 655 1442 -1320 61 455 -1328 564 1339 -1912 -414 1734
6944 1734 -879 -711 1034 -1049 -22 1850 -1172 -1298 1669 68 -1105 909 -542 -742 1641 -276
6960 -276 -2117 1077 741 -1255 381 109 -1224 1097 951 -1844 149 1655 -836 205 820 -1300
6976 -1300 391 1722 -1169 -692 1700 -277 -746 983 -1087 -630 2160 -325 -1887 1182 170 -1202
6992 -1202 905 -185 -1349 1594 775 -1877 173 1185 -1011 282 474 -1471 550 1566 -1621
7007 -1621 -451 1531 -518 -320 659 -1166 -478 1940 -990 -1660 1364 90 -626 951 -411 -996
7023 -996 1722 275 -1665 688 883 -767 770 336 -1706 911 1112 -1787 67 1286 -727 58
7039 58 765 -1482 -189 2066 -1144 -989 1264 -242 -327 1291 -976 -955 1948 -107 -1456 1038 -47
$$ packed form
6928A015j192o79K248j241k321K825P87k762J381L94j783J892P75l251J498K148
6944A734k613J68J745k083J027J872l022j26K967j601j173K014j451k00K383j917
6960b76j841L194l36j996J636k72j333K321j46k795J993J506k491J041O15k120
6976a300J691J331k891M77K392j977m69J729k070M57K790k485j562L069j012j372
6992a202K107j090j164K943q19k652K050J012k196J293J92j945K021J016l187
7007a621J170J982k049J98R79j825O88K418k930o70L024j274p16J577j362n85
7023i96K718j447j940K353J95j650J537m34k042K617K01k899J854J219k013P85
7039E8P07k247J293K255l210J55K253j506q5J618k267K1K903k055j349K494j085
$$ plain form
7056 -47 -743 1200 -20 -1876 1284 1278 -1738 -19 681 -979 636 546 -1791 442 1965 -1230 -832
7073 -832 1041 -549 169 1333 -1450 -632 2168 -355 -1381 1069 -132 -597 1185 -444 -1558 1628
7089 1628 791 -1540 393 649 -799 858 391 -2033 582 1656 -1518 -387 1226 -854 381 1107
7105 1107 -1397 -525 1935 -585 -1281 1096 -568 -824 1366 -888 -1344 1786 556 -1430 886 136
7121 136 -784 1362 79 -1765 1099 1346 -1296 194 591 -1090 687 1157 -2048 -152 1696 -696
7137 -696 -645 938 -887 -146 1467 -1462 -1035 2011 23 -986 914 -489 -654 1666 -265 -1813
7153 -1813 1347 811 -1334 686 297 -1340 965 650 -1932 22 1672 -1138 -199 888 -883 315
7169 315 1479 -1251 -850 1817 -439 -746 1011 -538 -521 1624 -761 -1555 1237 401 -1187 723 -19
$$ packed form
7056d7o96J943j220j856L160ol016J719P00j660J615r0k337K233J523l195L98
7073h32J873j590P18J164k783Q18K800k523j026K450j201m65J782j629j114L186
7089A628q37k331J933K56j448J657m67k424K615J074l174J131J613k080J235P26
7105A107k504Q72K460k520o96K377j664k56K190k254m56L130j230j986K316p50
7121A36r20K146j283j844K864K47k642J490L97j681J777M70l205J896J848k392
7137f96N1J583j825P41J613k929M27L046j988j009J900j403j65K320j931j548
7153a813L160n36k145K020l89j637K305l15k582J954J650k810R39J087j771J198
7169C15J164k730M01K667k256l07J757j549J7K145k385p94K792q36j588J910p42
$$ plain form
7186 -19 -1211 1428 495 -1973 463 1230 -1239 238 528 -1339 719 1306 -1568 -705 1564 -555 -262
7203 -262 894 -994 -290 1732 -718 -1477 1430 88 -967 795 -600 -1103 1770 319 -1931 958
7219 958 682 -830 781 380 -1218 1000 1211 -1579 62 1345 -850 123 590 -1610 99 1864
7235 1864 -1345 -1099 1574 -401 -553 992 -776 -751 1814 -106 -1710 1045 460 -786 1161 -214
7251 -214 -1571 1521 1012 -1790 353 929 -1055 225 554 -1654 86 1558 -1476 -349 1322 -554
7267 -554 -193 1062 -1264 -432 2093 -537 -1284 1273 164 -875 1074 -598 -1221 1610 561 -1701
7283 -1701 455 196 -1114 871 447 -1711 558 1338 -1435 -223 1147 -814 476 1152 -1214 -89
7299 -89 1917 -489 -865 1241 -249 -273 1266 -732 -1046 1456 90 -1450 539 268 -735 1206 -22
$$ packed form
7186a9j192K639r33k468K436P67k469J477K90j867K058N87k874Q63K269k119K93
7203b62J156j888P04K022k450p59K907j342j055J762j395n03K873j451k250K889
7219I58k76j512J611m01j598K218K11k790J641J283k195R73M67k200J709J765
7235A864l209K46K673j975j52J545j768K5K565j920j604K755n85j246J947j375
7251b14j357L092n09k802K143N76j984J280L29k208J740J472l034J127J671j876
7267e54L61J255k326Q32K525k630p47K557j109j039J949j672o23K831j049k262
7283a701K156k59j310J985m24k158K269P80k773J212J370j961J290O76k366J125
7299h9K006k406l76K106j490k4J539j998l14K502j366j540J989k71j003J941j228
$$ plain form
7316 -22 -1733 1048 1230 -1451 38 722 -778 895 833 -1716 124 1622 -962 -423 992 -764 -153
7333 -153 1288 -1271 -830 1826 -219 -1383 923 -181 -796 1443 -234 -1559 1133 929 -992 584
7349 584 517 -783 1182 831 -1830 324 1637 -1019 -520 657 -973 185 1342 -1482 -820 1850
7365 1850 -309 -497 842 -422 -505 1591 -628 -1481 1466 255 -1257 802 14 -806 1318 259
7381 259 -1913 740 1029 -1170 156 417 -911 780 1201 -1659 -274 1798 -415 -493 794 -768
7397 -768 298 1654 -682 -1172 1514 10 -1111 1152 -434 -1051 1700 -141 -1703 778 956 -1124
7413 -1124 748 166 -1263 921 1125 -1856 116 1300 -700 -58 747 -1439 130 1670 -1210 -1020
7429 -1020 1154 -349 -678 905 -753 -809 1683 -384 -1558 1047 212 -1020 663 -316 -1393 1219
$$ packed form
7316b2j711K781J82k681J489O84j500J673o2k549J840J498k584N39J415j756O11
7333a53J441k559M41K656k045j164K306j104o15K239j677j325K692k04j921J576
7349E84o7j300J965l51k661K154J313k656M99J177j630J158J157k824O62K670
7365A850k159j88J339j264q3K096k219q53K947j211j512K059p88q20K124j059
7381B59k172K653K89k199J326K61j328J691M21k860J385K072k213p8J287j562
7397g68J066J356k336m90K686j504j121K263j586o17K751j841j562K481J78k080
7413a124J872n82j429K184K04k981J972J184k000O42Q05k186J569J540k880J90
7429a020K174j503l29J583j658n6K492k067j174K605q35j232J683r79j077K612
$$ plain form
7445 1219 576 -1683 374 1177 -1231 448 444 -1219 507 1653 -1368 -638 1421 -680 -343 1041 -1143
7462 -1143 -390 1816 -668 -1310 957 134 -699 989 -542 -1188 1548 556 -1620 615 650 -721 633
7479 633 138 -1630 699 1284 -1627 -359 1169 -831 -93 823 -1340 -219 1685 -1048 -936 1226
7495 1226 -394 -465 1486 -804 -966 1685 118 -1424 586 282 -786 1060 -145 -1532 1007 870
7511 870 -1459 79 928 -772 418 664 -1362 335 1619 -745 -642 962 -638 -146 1144 -1147
7527 -1147 -858 1665 -269 -1233 804 -162 -683 1235 -541 -1533 1214 703 -1522 522 363 -690 1215
7544 1215 444 -1743 573 1381 -1098 -183 873 -661 353 1171 -1654 -295 1270 -505 -993 742
7560 742 -788 -403 1279 -780 -1114 1281 280 -1189 562 158 -872 1271 96 -1687 906 968
$$ packed form
7445A219o43k259K057Q03k408J679mj663J726J146l021P30K059k101L37J384k184
7462a143P53K206k484o42K267q23q33J688j531o46K736r92k176K235L5j371J354
7479F33m95j768K329N85k911J268J528k000P38R16k163J121J904k733J12K162
7495A226j620p1J951k290j62K651j567j542K010l04j068J846j205j387K539j37
7511H70k329J538Q49j700J190K46k026J697J284k364J03J604j600M92J290k291
7527a147K89K523j934r64K037r66n21J918j776r92K747n11k225K044j59j053J905
7544A215p71k187K316Q08k479R15J056j534J014Q18k825J359J565j775m88J735
7560G42j530L85J682k059l34K395j001j469J751m04j030K143j175j783K593O2
$$ plain form
7576 968 -957 256 494 -1064 499 747 -1311 161 1532 -549 -563 763 -846 -38 1276 -908
7592 -908 -958 1585 71 -1120 683 -20 -649 1139 -62 -1699 922 468 -1106 191 380 -905 1140
7609 1140 648 -1631 -162 1465 -832 -25 704 -1045 269 1488 -1380 -678 1654 -555 -569 989
7625 989 -432 -579 1523 -266 -1324 895 597 -1240 568 -68 -1157 1228 489 -1704 407 1004
7641 1004 -631 384 553 -1145 555 1282 -1427 -340 1331 -428 -47 812 -1037 -173 1595 -773
7657 -773 -1205 1202 63 -568 832 -383 -943 1403 419 -1503 644 807 -1011 577 319 -1386 738
7674 738 1027 -1331 -114 967 -741 -52 557 -1354 -4 1643 -771 -818 968 -202 -536 1050 -697
7691 -697 -884 1561 15 -1188 650 436 -864 765 -334 -1165 1084 749 -1382 -124 562 -720
$$ packed form
7576I68j925J213K38j558J563K48k058J472J371k081j4J326j609Q08J314k184
7592i08n0K543j514j191J803p03o29J788j201j637K621m54j574J297J89j285K045
7609A140m92k279J469J627k297Q07P29j749J314J219k868P02K332k209j4J558
7625I89j421j47K102j789j058K219k98j837J808o36j089K385p39k193K111N97
7641A004j635J015J69j698J700P27k709J087J671j759L81Q59j849Q64J768k368
7657g73m32K407j139o31J400j215n60K346r84j922K147J63j818J588k58j705K124
7674G38K89k358J217J081j708O89O09j911J350J647k414m7J786j170l34J586j747
7691f97j87K445j546j203J838k14j300J629j099q31K249l35k131J258O86j282
$$ plain form
7707 -720 340 380 -1390 325 1604 -966 -628 878 -668 -17 1254 -1159 -612 1379 -261 -975 956
7724 956 -136 -491 926 -419 -1185 1153 437 -1511 218 412 -640 589 308 -1301 601 1045 -1124
7741 -1124 -279 859 -504 289 1077 -1113 -308 1530 -560 -761 945 -400 -429 963 -843 -886 1340
7758 1340 10 -1210 454 146 -692 1036 186 -1302 866 1086 -1082 48 569 -716 629 715 -1212
7775 -1212 -77 1372 -695 -534 641 -610 -108 1124 -843 -491 1494 -142 -825 720 -33 -360
7791 -360 1379 -255 -1439 845 732 -784 287 263 -809 877 439 -1415 281 1218 -767 -335 610
7808 610 -689 281 1340 -972 -441 1270 -434 -529 788 -302 -184 1263 -574 -1212 1134 574 -761
7825 -761 467 58 -794 888 409 -1488 490 1031 -1014 130 405 -932 241 1096 -1272 -314 1208
$$ packed form
7707g20J060M0j770J715J279k570L38J506j546O51J271k413N47J991j640p14J931
7724I56j092l55J417j345p66K338p16j948J729J94j052J229k81j609J902M44k169
7741a124Q45J138j363P93P88k190Q05J838k090k01J706j345k9J392j806m3K226
7758A340j330j220J664l08q38J728q50j488K168K20k168J130N21j285J345Q6j927
7775a212J135J449k067J61J175j251N02J232j967L52J985j636o83J545p53l27
7791c60J739j634j184K284j13j516J071k4j072J686m38j854J696R37j985M32R45
7808F10j299R70J059k312N31J711j704r5J317j090J18J447j837o38K346n60j335
7825g61J228m09q52J682m79j897J978N41k045J144K75j337J173Q55k368R58J522
$$ plain form
7842 1208 -513 -9 932 -614 -264 1385 -675 -843 1260 44 -645 644 -185 -723 1237 -6 -1281
7859 -1281 728 708 -918 553 270 -844 899 787 -1323 -64 1376 -609 -396 638 -979 83
7875 83 1406 -1001 -784 895 -166 -410 605 -749 -460 1377 -85 -1344 733 448 -623 693
7891 693 75 -1009 1068 682 -1293 322 963 -632 101 415 -1095 463 1414 -1038 -663 859 -547
7908 -547 -190 530 -1083 -159 1595 -576 -881 1013 171 -563 840 -262 -799 1520 290 -1108 225
7925 225 489 -553 596 165 -1218 642 914 -1226 -249 737 -677 101 916 -946 -143 1354 -610
7942 -610 -767 938 -183 -534 943 -742 -927 1480 -15 -1147 449 298 -775 854 -203 -1381
7958 -1381 939 807 -1032 118 715 -651 188 852 -1078 20 1354 -764 -313 1033 -435 -228
$$ packed form
7842A208j721N04R41j546L50J649k060j68K103j216o89J289q29n38J960j243j275
7859a281K009k0j626J471k83j114J743j12k110J259J440j985K13J034j617J062
7875H3J323k407K17J679j061k44J015j354K89J837j462j259K077k85j071J316
7891F93o18j084K077l86j975J615O41j595P33L14j510J558R51k452L75J522j406
7908e47L57P20j613R24J754k171l05J894q42p34J403j102n37K319j230j398J333
7925B25K64j042J149m31j383J860K72k140R77R86j414P78Q15j862Q03J497j964
7942f10j57J705j121l51J477j685j85K407j495j132J596j51j073J629j057j178
7958a381K320j32j839J150N97j366Q39O64j930J098J334k118M51J346j468K07
$$ plain form
7974 -228 903 -975 -809 1319 147 -965 745 53 -567 1210 -534 -1317 1004 576 -1007 449
7990 449 490 -673 908 519 -1091 342 1171 -812 -186 588 -793 185 1110 -945 -574 1454 -581
8007 -581 -1016 662 -251 1 1058 -316 -988 1177 201 -1005 553 93 -344 998 164 -1454 374
8024 374 869 -753 232 414 -851 482 752 -1314 -118 1271 -654 -138 638 -587 -19 963 -491
8041 -491 -658 1087 367 -721 744 -199 -482 1108 -53 -1512 837 770 -806 395 121 -1220 819
8058 819 790 -1327 124 1044 -747 -88 735 -812 473 1091 -771 -749 1226 -287 -732 716 -604
8075 -604 -551 1256 -238 -1370 768 539 -693 495 84 -710 1100 601 -1283 337 835 -550 184
8092 184 293 -943 602 1026 -1339 -498 932 -370 -188 848 -658 -92 1442 -625 -1040 752 149
$$ packed form
7974b28J131j878J66K128j172j112J710o92o20J777j744p83K321m28j583J456
7990D49M1j163J581l89j610J433Q29j983O26P74j381R78R25k055L71K028k035
8007e81m35J678r13K52J057j374o72K165r76j206J558m60m37J342q34j618J828
8024C74M95j622R85J82j265J333K70k066J196J389j925N16P76j225N68R82j454
8041d91j67J745p20j088J465r43k83J590j161j459K349o7j576J201k74j341K039
8058H19k9k117J451R20j791O59Q23j547J285O18j862K2J975j513m45J448j320
8075f04N3J807j494j132K138k29j232J188m11p94J810m99j884J620M98j385P34
8092A84J09j236J545M24k365Q41J430j302J82J036j506N66J534k067m15J792o03
$$ plain form
8109 149 -822 544 -467 -823 1224 214 -1392 615 677 -797 606 83 -1054 811 1000 -1140 -207
8126 -207 902 -813 7 585 -1156 140 1435 -631 -674 1084 -89 -264 931 -485 -776 1306 -155
8143 -155 -1002 741 397 -546 803 -246 -1030 708 575 -1254 -82 871 -726 338 463 -1317 302
8160 302 1157 -667 -522 803 -285 -85 853 -810 -561 1458 -253 -686 817 -58 -393 883 -417
8177 -417 -942 1183 492 -1318 413 543 -757 674 423 -1063 588 1394 -1144 18
$$ packed form
8109A49r71J366j011l56K047j010j606K007O2j474J403n23j137J865J89k140R33
8126b07J109j715Q20N78j741J296J295k066m3J758j173j75J195j416k91K082j461
8143a55q47J743l44r43J349j049p84J738j33j829J172R53j597J064J25j780J619
8160C02Q55j824J45J325j088K00R38j663K49K019j711m33J503q75l35J276j300
8177d17n25K125o91j810J731J30j300J431k51j486J651Q06k538J162
8191A8
$$ Imaginary data points
##PAGE= N=2
##DATA TABLE= (X++(I..I)), XYDATA
$$ plain form
0 0 0 0 0 0 0 0 0 0 0 0 0 -8 8 -8 8 -8 16 -16 23 -24 31 -33 40 -48 56 -65 76 -88 100 -115 132 -149 170 -191
34 -191 217 -245 274 -306 343 -382 425 -472 522 -579 639 -706 779 -859 946 -1042 1147 -1264
52 -1264 1395 -1540 1704 -1886 2097 -2339 2623 -2959 3364 -3868 4509 -5354 6528 -8270 11130
67 11130 -16615 30941 -148695 -313622 -21249 -58337 -19553 140272 72609 58584 207454
78 207454 13934 -140913 -15697 -88854 -181959 26452 48184 5178 202207 143188 -115006
89 -115006 -20194 28508 -139096 -89178 -41233 -111657 90882 203572 -4381 16317 116411
100 116411 -65578 -81949 18451 -117727 -82453 109337 384 -34230 145375 68911 -31391
111 -31391 39695 -88211 -148453 53998 -3196 -136034 66872 139011 27164 97435 29094
$$ packed form
0@%%%%%%%%%%%qJ6j6J6j6K4l2L9m7N5o4P3q8J04j21J41j64J88k15K47k81L19l61
34a91M08m62N19n80O49p25Q07q97R94j101J218j345J485j638J805j988K189k411
52a264K659k935L244l590L983m436M962n582O323p232Q377r863J1882j4798J9400
67A1130k7745M7556j79636j64927K92373l7088L8784J59825o7663j4025J48870
78B07454j93520j54847J25216p3157r3105K08411K1732m3006J97029n9019k58194
89a15006R4812M8702j67604M9918M7945p0424K02539J12690k07953K0698J00094
100A16411j81989j6371J00400j36178L5274J91790j08953l4614J79605p6464j00302
111c1391P1086j27906o0242K02451n7194j32838K02906P2139j11847P0271o8341
$$ plain form
122 29094 -156449 -36272 17056 -140522 -33229 94694 359 81125 143963 -40489 -12818
133 -12818 71069 -145964 -173221 28809 6155 26539 152157 24922 -24278 110403 -37788
144 -37788 -184698 -38564 -33632 -66629 107925 85091 -19646 127958 91713 -130180 -66175
155 -66175 -7799 -101757 2287 54589 -54863 78096 172424 -30967 -55403 26384 -97246
166 -97246 -74349 38559 -71932 -29340 159950 52034 -42791 58276 -15724 -71240 34973
177 34973 -56674 -114552 81515 65373 -59943 67056 83277 -35957 35004 -1839 -150468
188 -150468 -20266 64449 -67377 -2298 85923 -8195 50127 82844 -106237 -70929 71719
199 71719 -59435 -85279 62098 18639 22753 122200 -12522 -76944 61460 -21062 -123351
$$ packed form
122B9094j85543J20177N3328j57578J07293J27923r4335Q0766O2838j84452K7671
133a2818Q3887k17033k7257K02030k2654K0384J25618j27235m9200J34681j48191
144c7788j46910J46134M932l2997J74554k2834j04737J47604l6245k21893O4005
155f6175N8376r3958J04044N2302j09452J32959R4328k03391k4436Q1787j23630
166i7246K2897J12908j10491M2592J89290j07916r4825J01067p4000n5516J06213
177C4973r1647n7878J96067j6142j25316J26999J6221j19234P0961l6843j48629
188a50468J30202Q4715j31826O5079Q8221r4118N8322L2717j89081L5308J42648
199G1719j31154k5844J47377m3459M114R9447j34722o4422J38404q2522j02289
$$ plain form
210 -123351 3770 -1823 -35990 116124 69119 -73059 45851 55120 -108258 -52779 -145
221 -145 -62515 50152 87362 -54082 27095 114602 -47204 -58961 22296 -73407 -35728 80061
233 80061 -30017 -27916 123128 33969 -55054 16452 -50849 -71447 58541 -19694 -93783 79302
245 79302 83070 -41848 29765 22011 -70207 26686 21722 -107905 2142 86466 -23061 18315
257 18315 61703 -49931 7406 63167 -99619 -77327 70569 -9555 -30715 66505 -4414
268 -4414 -9095 85522 -37993 -101191 42123 5250 -65619 43772 20279 -32371 94816 47937
280 47937 -96430 2924 38405 -72117 -12803 20085 -46272 61761 93763 -66570 -25332
291 -25332 63194 -52009 -49372 24498 -57401 -9883 107031 -6229 -41559 74118 7194
$$ packed form
210a23351J27121n593l4167J52114m7005j42178J18910R269j63378N5479N2634
221a45o2370J12667L7210j41444Q1177Q7507j61806j1757Q1257r5703L7679J15789
233H0061j10078K101J51044q9159q9023P1506o7301k0598J29988p8235p4089J73085
245G9302L768j24918P1613p754r2218R6893m964j29627J10047Q4324j09527M1376
257A8315M3388j11634N7337N5761j62786K2292J47896q0124k1160R7220p0919
268d414m681R4617j23515o3198J43314l6873p0869J09391k3493n2650J27187m6879
280D7937j44367R9354L5481j10522N9314L2888o6357J08033L2002j60333M1238
291b5332Q8526j15203K637P3870q1899M7518J16914j13260l5330J15677o6924
$$ plain form
302 7194 -50991 19831 -47255 -61470 81311 24105 -67704 59651 61890 -45436 9033 -9446
314 -9446 -88995 23247 43705 -74189 9388 81432 -15098 14699 36454 -77433 -14623 68482
326 68482 -65157 -58143 73521 16711 -1745 60981 -31060 -39280 68696 -28991 -95839 31685
338 31685 17459 -32351 60011 12748 -59324 60073 39092 -91858 -13250 30428 -41984 23921
350 23921 36465 -52334 40026 84808 -60795 -37175 47561 -37998 -22383 42758 -46455 -16174
362 -16174 93014 -8385 -56524 39062 -7298 -36897 37955 -34634 -60679 79236 36892
373 36892 -66031 26744 36614 -36646 26314 4926 -77174 29881 61636 -53940 -4393 47539
385 47539 -31188 13142 39605 -76058 -21696 76376 -32065 -47779 46820 -5260 -9641 53616
$$ packed form
302G194n8185P0822o7086j4215J42781n7206r1809J27355K239j07326N4469j8479
314i446p9549J12242K0458j17894Q3577P2044r6530K9797K1755j13887O2810Q3105
326F8482j33639P014J31664n6810j8456O2726r2041q220J07976r7687o6848J27524
338C1685j4226m9810R2362m7263p2072J19397k0981j30950P8608M3678p2412O5905
350B3921J2544q8799R2360M4782j45603K3620Q4736q5559J5615O5141q9213L0281
362a6174J09188j01399m8139R5586m6360k9599P4852p2589k6045J39915m2344
373C6892j02923R2775R870p3260O2960k1388q2100J07055L1755j15576M9547N1932
385D7539p8727M4330K6463j15663N4362R8072j08441j5714R4599n2080m381O3257
$$ plain form
397 53616 -37362 -46796 71051 1572 -65827 34493 14091 -32023 53907 5751 -71787 43153
409 43153 48430 -64182 -7308 23315 -36671 29935 30970 -73457 9762 77188 -41682 -32533
421 -32533 38620 -29919 -4919 54776 -44991 -33962 76111 3358 -41325 33554 -12558 -27582
433 -27582 54620 -21810 -72463 54243 38259 -53359 15349 19992 -36628 33835 13785 -77395
445 -77395 13118 56574 -40942 -3635 38928 -30498 20780 54520 -64209 -33304 65841 -16403
457 -16403 -38926 32058 -15304 -3749 66307 -28522 -59897 52086 7547 -56370 20174 -2142
469 -2142 -35438 60864 23469 -65966 27201 45899 -45526 -2685 11672 -45368 32969 49422
481 49422 -58806 -630 69336 -28053 -26844 24827 -42960 -12945 56886 -35040 -38987 63894
$$ packed form
397E3616r0978r434J17847o9479o7399J00320k0402m6114Q5930m8156p7538J14940
409D3153N277j12612N6874L0623n9986O6606J035j04427Q3219O7426j18870R149
421c2533P1153o8539K5000N9695r9767J1029J10073p2753m4683P4879m6112j5024
433b7582Q2202p6430n0653J26706j5984r1618O8708M643n6620P0463k0050r1180
445g7395R0513M3456r7516L7307M2563o9426N1278L3740j18729L0905R9145q2244
457a6403k2523P0984m7362J1555P0056r4829l1375J11983m4539o3917P6544k2316
469b142l3296R6302l7395q9435R3167J8698r1425M2841J4357n7040P8337J6453
481D9422j08228N8176O9966r7389J209N1671o7787L0015O9831r1926l947J02881
$$ plain form
493 63894 10481 -30293 26902 -24339 -34579 58003 -6861 -69438 43304 46202 -31167 19209
505 19209 9020 -45127 32499 23993 -72543 -1375 49865 -24393 6806 29640 -46933 7216
517 7216 56579 -55182 -44084 51022 -3360 -17446 36525 -19583 -10397 65469 -19616 -61369
529 -61369 38526 10479 -38509 31449 997 -39757 53895 27398 -68516 2692 30610 -34944
541 -34944 6992 9604 -48665 35131 61515 -52682 -19150 51279 -21877 -16260 28164 -39930
553 -39930 -9574 68728 -14962 -38913 41164 -1283 -25077 29985 -31092 -47377 58934 16585
565 16585 -59316 23861 31995 -27831 17532 56 -53060 31217 38924 -52590 1809 46686
577 46686 -20427 9849 29322 -53594 -6887 58634 -33504 -39366 38043 -2583 -5637 36194
$$ packed form
493F3894n3413m0774N7195n1241j0240R2582o4864o2577J12742K898p7369N0376
505A9209j0189n4147P7626q506r6536P1168N1240p4258L1199K2834p6573N4149
517G216M9363j11761J1098R5106n4382j4086N3971n6108R186P5866q5085m1753
529f1369R9895k8047m8988O9958l0452m0754R3652k6497r5914P1208K7918o5554
541c4944M1936K612n8269Q3796K6384j14197L3532P0429p3156N617M4424o8094
553c9930L0356P8302q3690k3951Q0077m2447k3794N5062o1077j6285J06311m2349
565A6585p5901Q3177Q134n9826M5363j7476n3116Q4277P707r1514N4399M4877
577D6686o7113L0276J9473q2916M6707O5521r2138n862P7409m0626l054M1831
$$ plain form
589 36194 -35928 -31927 59481 -6926 -58886 26495 13354 -23107 39869 2349 -48368 40939
601 40939 32027 -54173 277 23104 -26969 25218 23274 -55276 14061 57015 -42977 -27324
613 -27324 32586 -22505 -5579 35354 -38854 -16663 64541 -9444 -41270 28195 -6067 -18637
625 -18637 42140 -18020 -46343 55435 27869 -48298 11572 15114 -29040 25168 4596 -59729
637 -59729 22299 48369 -37392 -5817 27240 -28839 10227 31608 -55933 -16323 61181 -11291
649 -11291 -24455 34305 -8861 -6866 39440 -34542 -43256 50453 7710 -40620 27049 7560
661 7560 -24350 40346 7 -63633 20579 31360 -42329 1635 20667 -20641 35319 31288
673 31288 -59521 -3741 50607 -32188 -22980 28961 -19715 6041 52745 -29523 -30817 46508
$$ packed form
589C6194p2122M001R1408o6407n1960Q5381j3141l6461O2976l7520n0717Q9307
601D0939q912q6200N4450K2827n0073N2187j944p8550O9337M2954r9992J5653
613b7324N9910n5091J6926M0933p4208K2191Q1204p3985l1826O9465l4262j2570
625a8637O0777o0160k8323J01778k7566p6167N9870L542m4154N4208k0572o4325
637e9729Q2028K6070q5761L1575L3057n6079L9066K1381q7541L9610P7504p2472
649a1291j3164N8760m3166J995M6306p3982q714R3709m2743m8330O7669j9489
661G560l1910O4696m0339o3640Q4212J0781p3689M3964J9032m1308N5960m031
673C1288r0809N5780N4348q2795R208N1941m8676K5756M6704q2268j294P7325
$$ plain form
685 46508 -8326 -39018 14930 -19708 -19593 57117 54 -48321 41392 29457 -42229 1008
697 1008 -936 -35670 32257 24535 -43981 23383 51540 -28832 -8696 12454 -45332 1715 40610
710 40610 -42679 -19728 59304 4751 -15148 20908 -29999 -21545 37109 -30470 -47177 51188
722 51188 29119 -17913 31131 430 -37098 30379 2242 -65053 8915 34879 -16942 23094
734 23094 23573 -32729 22114 27918 -68956 -30111 36383 -18000 -3872 40310 -11275 10772 54872
747 54872 -32312 -49579 22981 -14345 -29057 31947 -2849 -8210 69776 13104 -57380 9731
759 9731 7778 -45225 -996 -4021 -31289 50000 50538 -33407 7970 31610 -40128 -19547 1567
772 1567 -50328 7970 67332 -8667 -7591 50371 -2576 -20333 7821 -50370 -37434 44075
$$ packed form
685D6508n4834l0692N3948l4638J15P6710n7063m8375Q9713j1935p1686M3237
697A008j944l4734O7927p722o8516O7364K8157q0372K0136K1150n7786M7047L8895
710D0610q3289K2951P9032n4553j9899L6056n0907Q454N8654o7579j6707R8365
722E1188k2069m7032M9044l0701l7528O7477k8137o7295P3968K5964n1821M0036
734B3094M79n6302N4843N804r6874L8845O6494n4383J4128M4182n1585K2047M4100
747E4872q7184j7267P2560l7326j4712O1004l4796n361P7986n6672p0484O7111
759I731j953n3003M4229l025k7268Q1289N38q3945M1377K3640p1738K0581K1114
772A567n1895N8298N9362p5999J076N7962n2947j7757K8154n8191J2936Q1509
$$ plain form
784 44075 -3856 -29658 52339 31843 -15656 20214 -21264 -61881 15710 9661 -48105 19649
796 19649 48523 2111 33960 17884 -54800 -2023 23781 -59573 -27404 41545 3020 17989
808 17989 45887 -24610 -13672 38463 -37158 -58974 11901 -6911 -5528 55724 7071 -19543
820 -19543 53020 8144 -65337 -9414 -242 -29326 27248 19944 -23563 46278 49326 -40238 -15979
833 -15979 7842 -46769 -11074 19456 -35381 12336 73045 -2144 -20517 21168 -24397 -26361
845 -26361 14290 -38804 -26241 65238 25764 -19546 34794 9095 -31221 11767 -22677 -61857
857 -61857 21993 33931 -22365 22385 33524 -15516 18734 6453 -71148 -16017 35117 -27713
869 -27713 -6003 47072 3904 14249 36938 -40940 -35443 30722 -21161 -37515 27418 5209
$$ packed form
784D4075m7931k5802Q1997k0496m7499L5870m1478m0617P7591o049n7766O7754
796A9649K8874m6412L1849j6076p2684N2777K5804q3354L2169O8949l8525J4969
808A7989K7898p0497J0938N2135p5621k1816P0875j8812J383O1252m8653k6614
820a9543P2563m4876p3481N5923R172k9084N6574p304m3507O9841L048q9564K4259
833a5979K3821n4611L5695L0530n4837M7717O0709p5189j8373M1685m5565j964
845b6361M0651n3094J2563R1479l9474m5310N4340k5699m0316M2988l4444l9180
857f1857Q3850J1938n6296M4750J1139m9040L4250j2281p7601N5131N1134o2830
869b7713K1710N3075m3168J0345K2689p7878N497O6165n1883j6354O4933k2209
$$ plain form
881 5209 1966 57136 -1611 -45555 25673 3057 -57662 -6389 5307 -14637 45570 29027
893 29027 -35380 21676 35328 -43443 -21295 6320 -34176 12750 46706 -22508 555 56132
905 56132 -8808 -29640 4976 -35531 -21216 35298 -18241 -24522 58310 25414 -25457 15022
917 15022 -11839 -40851 18674 -2552 -45009 30351 45084 -12884 16769 14875 -34962 10593
929 10593 13706 -61168 -13474 46236 -6823 1719 34532 -15821 -1421 29754 -44997 -44149 29811
942 29811 -2518 -15207 36790 1630 -8660 50142 -3864 -56286 11882 9526 -33653 12977
954 12977 11499 -16283 43084 28036 -47726 -2263 21111 -39843 -12847 15062 -26562 18979
966 18979 54549 -21188 -16147 34908 -15867 -26088 9852 -28964 -9684 55626 -669 -27895
$$ packed form
881E209l243N5170n8747m3944P1228k2616o0719N1273J1696j9944O0207j6543
893B9027o4407N7056J3652p8771K2148K7615m0496M6926L3956o9214K3063N5577
905E6132o4940k0832L4616m0507J4315N6514n3539o281Q2832l2896n0871M0479
917A5022k6861k9012N9525k1226m2457P5360J4733n7968K9653j894m9837M5555
929A0593L113p4874M7694N9710n3059Q542L2813n0353J4400L1175p4751Q48P3960
942B9811l2329j2689N1997l5160j0290N8802n4006n2422O8168k356m3179M6630
954A2977j478k7782N9367j5048p5762M5463K3374o0954K6996K7909m1624M5541
966A8979L5570p5737N041N1055n0775j0221L5940l8816J9280O5310n6295k7226
$$ plain form
978 -27895 40995 14177 -30594 6485 -19519 -41673 29962 18072 -33586 23643 35460 -17351
990 -17351 7976 -208 -51681 5883 30735 -37927 -4662 49488 1766 4745 24753 -33514
1002 -33514 -16512 29656 -32452 -35784 35077 8951 -3586 38744 -9392 -30808 32383 -7523
1014 -7523 -59386 5931 17226 -11838 31702 16404 -25074 32718 24863 -53345 -16289 16895
1026 16895 -26789 7105 30792 -21816 13871 52842 -22671 -32045 12715 -25030 -18976 23325
1038 23325 -21355 -9512 60942 10080 -32230 20635 -573 -32677 11361 -10874 -34779 38369
1050 38369 33583 -24009 16739 22054 -26322 5094 -185 -54548 3484 42647 -21679 -4685
1062 -4685 37267 -6509 226 18320 -43044 -24226 37116 -12306 -23285 35532 7989 -3872
$$ packed form
978b7895O8890k6818m4771L7079k6004k2154P1635j1890n1658N7229J1817n2811
990a7351K5327q184n1473N7564K4852o8662L3265N4150m7722K979K0008n8267
1002c3514J7002M6168o2108l332P0861k6126j2537M2330m8136k1416O3191l9906
1014g523n1863O5317J1295k9064M3540j5298m1478N7792p855p8208L7056L3184
1026A6895m3684L3894K3687n2608L5687L8971p5513r374M4760l7745O054M2301
1038B3325m4680J1843P0454n0862m2310N2865k1208l2104M4038k2235k3905P3148
1050C8369m786n7592M0748N315m8376L1416n279n4363N8032L9163o4326J6994
1062d685M1952m3776O735J8094o1364J8818O1342m9422j0979N8817k7543j1861
$$ plain form
1074 -3872 37161 -15111 -43094 25912 5126 -41865 10659 15586 -11074 33221 11518 -42725
1086 -42725 13622 22990 -43981 -11341 19904 -18465 16036 35516 -27951 -1996 42060 -20358
1098 -20358 -28419 14211 -16992 -4797 38146 -16803 -20850 47176 6363 -36555 8965 -7305
1110 -7305 -26553 25399 949 -35470 30233 31804 -25063 5424 8069 -30542 14182 17105 -43568
1123 -43568 3674 46150 -12328 -6715 23126 -19123 -3239 24719 -35559 -25077 38047 -3113
1135 -3113 -18925 26587 -5449 -14318 34931 -11484 -44706 23919 16290 -27115 12929 8967 -16746
1148 -16746 32737 14412 -44979 7825 28434 -29393 -4946 16929 -24291 11514 35264 -30584
1160 -30584 -14861 34095 -12426 -17302 16119 -21604 -7580 42303 -13019 -30161 36367 11216
$$ packed form
1074c872M1033n2272k7983O9006k0786m6991N2524M927k6660M4295k1703n4243
1086d2725N6347R368o6971L2640L1245l8369L4501J9480o3467K5955M4056o2418
1098b0358q061M2630l1203J2195M2943n4949m047O8026m0813m2918M5520j6270
1110g305j9248N1952k4450l6419O5703J571n6867L0487K645l8611M4724K923o0673
1123d3568M7242M2476n8478N613K9841m2249J5884K7958o0278J0482O3124m1160
1135c113j5812M5512l2036q869M9249m6415l3222O8625p629m3405M0044l962k5713
1148a6746M9483j8325n9391N2804K0609n7827K4447K1875m1220L5805K3750o5848
1160c0584J5723M8956m6521m876L3421l7723J4024M9883n5322j7142O6528k5151
$$ plain form
1172 11216 -24947 14756 -4539 -24901 28726 6117 -38450 18253 25643 -21930 8420 8293
1184 8293 -33029 14410 24793 -41693 -9438 35600 -9707 -3592 20214 -21064 528 35827
1196 35827 -25977 -27965 31182 -1021 -15700 24951 -9482 -18573 38282 140 -42131 13755
1208 13755 11429 -23278 13276 1705 -26677 29967 23357 -39219 1781 26315 -22745 -506
1220 -506 15682 -28572 7596 39347 -22546 -14874 30165 -9187 -11349 17614 -26471 -15874 41347
1233 41347 -6808 -32782 26158 10079 -18576 16898 -8221 -30691 28047 13351 -35295 11960
1245 11960 22534 -15657 15416 10822 -36427 10177 30710 -32768 -13188 26635 -9733 1263
1257 1263 21877 -26362 -7431 35845 -19532 -29469 22919 -2758 -11823 28190 -9131 -22607
$$ packed form
1172A1216l6163L9703j9295k0362N3627k2609m4567N6703P390m7573L0350j27
1184H293m1322M7439J0383o6486L2255M5038m5307O115K3806m1278K1592L5299
1196C5827o1804j988N9147l2203j4679M0651l4433r091N6855l8142m2271N5886
1208A3755k326l4707L6554j1571k8382N6644o610o2576M1000K4534m9060K2239
1220e06J6188m4254L6168L1751o1893P672M5039l9352k162K8963m4085J0597N7221
1233D1347m8155k5974N8940j6079k8655L5474k5119k2470N8738j4696m8646M7255
1245A1960J0574l8191L1073m594m7249M6604K0533o3478J9580L9823l6368J0996
1257A263K0614m8239J8931M3276n5377r937N2388k5677r065M0013l7321j3476
$$ plain form
1269 -22607 36405 8180 -35821 9756 8677 -17827 19924 3700 -31742 25388 28232 -34544
1281 -34544 -5186 18138 -21931 3114 17368 -31826 972 39884 -15232 -15434 22211 -12199
1293 -12199 -6520 24896 -24260 -20917 41180 4031 -26598 20123 4997 -16856 19939 -7798
1305 -7798 -35722 22675 16990 -29353 9126 16459 -18487 15815 12521 -40287 1561 31615 -22414
1318 -22414 -10289 22927 -8489 7916 27134 -27649 -15094 34002 -11728 -26590 18379 -4145
1330 -4145 -8839 32879 -6914 -30502 25983 8643 -32302 4598 1857 -18147 27186 12392
1342 12392 -32106 18200 30012 -26589 -6391 11641 -23034 6740 24149 -27145 -2279 38520
1354 38520 -9701 -14751 14207 -20203 -10612 27083 -20350 -25148 37051 11589 -19909 15723
$$ packed form
1269b2607N9012k8225m4001M5577j079k6504L7751j6224l5442N7130K844o2776
1281c4544K9358K3324m0069K5045J4254m9194L2798L8912n5116k02L7645l4410
1293a2199N679L1416m9156L343O2097l7149l0629M6721j5126k1853L6795k7737
1305g798k7924N8397n685m6343L8479P333l4946L4302l294n2808M1848L0054n4029
1318b2414J2125L3216l1416J6405J9218n4783J2555M9096m5730j4862M4969k2524
1330d145m694M1718l9793k3588N6485j7340m0945L6900k741k0004M5333j4794
1342A2392m4498N0306J1812n6601K0198J8032l4675K9774J7409n1294K4866M0799
1354C8520m8221n050K8958l4410R591L7695m7433m798O2199k5462l1498L5632
$$ plain form
1366 15723 -2237 -19166 22469 -3644 -37075 19900 23965 -17777 11878 12287 -22969 14361
1378 14361 15289 -41116 -7404 28849 -13063 -3956 19552 -14618 4039 27968 -28171 -24126 27309
1391 27309 -5375 -16952 21870 -3054 -8016 35096 -2824 -34351 16332 8468 -24166 8988
1403 8988 2101 -18246 29412 16907 -35439 3934 21890 -24601 -5932 9757 -22489 11336
1415 11336 33334 -20939 -8700 29252 -9864 -12200 13502 -21838 -9516 36942 -6862 -24159
1427 -24159 27915 8238 -19274 9936 -10703 -25099 24370 6666 -30828 16193 22150 -16097
1439 -16097 9136 5849 -30775 10275 22844 -30020 -5145 29854 -4801 1557 15721 -24218
1451 -24218 -4155 28636 -22026 -24734 24620 939 -9524 21950 -9674 -18584 27878 -958
$$ packed form
1366A5723j7960j6929M1635k6113l3431N6975M065m1742K9655M09l5256L7330
1378A4361R28n6405L3712L6253m1912R107K3508l4170J8657K3929n6139M045N1435
1391B7309l2684j1577L8822k4924m962M3112l7920l1527N0683p864l2634L3154
1403H988o887k0347M7658j2505n2346L9373J7956m6491J8669J5689l2246L3825
1415A1336K1998n4273J2239L7952l9116k336K5702l5340J2322M6458m3804j7297
1427b4159N2074j9677k7512K9210k0639j4396M9469j7704l7494M7021N957l8247
1439a6097K5233l287l6624M1050J2569n2864K4875L4999l4655O358J4164l9939
1451b4218K0063L2791n0662k708M9354k3681j0463L1474l1624q910M6462k8836
$$ plain form
1463 -958 -34249 10559 10368 -12635 19088 4377 -23929 23310 19071 -33959 -3029 18749 -15659
1476 -15659 4124 15199 -22610 6028 30528 -21715 -17289 17955 -11811 -6466 20488 -18132
1488 -18132 -10707 37369 -1665 -26992 15477 2910 -14329 16678 -5921 -22365 28485 15362
1500 15362 -27561 6785 11631 -19744 9277 6871 -31559 8540 29393 -19828 -7513 18635
1512 18635 -11604 501 15294 -26671 -7352 34353 -7617 -17519 21510 -1062 -9669 19974
1524 19974 -12678 -24496 25356 7371 -24378 10936 7291 -13203 18014 178 -33704 12989
1536 12989 21344 -25176 -1892 17521 -10786 9948 16534 -27196 -2973 28377 -14592 -13111
1548 -13111 17530 -8556 -744 25862 -17639 -20495 27351 -509 -25234 10086 -591 -10798
$$ packed form
1463i58l3291M4808j91k3003L1723j4711k8306M7239m239n3030L0930K1778l4408
1476a5659J9783J1075l7809K8638K4500n2243M426L5244k9766N345K6954l8620
1488a8132P425M8076l9034k5327M2469j2567j7239L1007k2599j6444N0850j3123
1500A5362m2923L4346M846l1375K9021k406l8430M0099K0853m9221J2315K6148
1512A8635l0239J2105J4793m1965J9319M1705m1970r902L9029k2572q607K9643
1524A9974l2652j1818M9852j7985l1749L5314l645k0494L1217j7836l3882M6693
1536A2989Q355m6520K3284J9413k8307K0734O586m3730K4223L1350m2969J481
1548a3111L0641k6086P812K6606m3501k856M7846k7860k4725L5320j0677j0207
$$ plain form
1560 -10798 23252 -1139 -26233 20635 14802 -25215 3023 8112 -16847 16529 15910 -27419 4519
1573 4519 27664 -15989 -9452 10611 -15533 2891 21337 -22937 -11204 31516 -3856 -17794
1585 -17794 12779 -8611 -11125 23759 -6952 -24092 23152 13056 -16715 9195 882 -16970
1597 -16970 19793 6339 -32129 9113 24103 -16201 -555 11060 -17536 6054 17088 -26732
1609 -26732 -8663 25469 -8004 -7100 16298 -12487 -3476 27320 -14581 -24668 22518 6080
1621 6080 -15130 12761 -1716 -11742 24168 138 -30879 11410 13485 -19724 5405 6444
1633 6444 -19432 15464 19815 -26971 -4869 20787 -11572 -3968 11328 -16360 4978 29081
1645 29081 -16997 -16082 24015 -2517 -14825 11745 -10155 -11842 26286 -755 -23990 15137
$$ packed form
1560a0798L4050k4391k5094M6868n833m0017K8238N089k4959L3376o19m3329L1938
1573D519K3145m3653O537K0063k6144J8424J8446m4274J1733M2720l5372j3938
1585a7794L0573k1390k514L4884l0711j7140M7244j0096k9771K5910q313j7852
1597a6970L6763j3454l8468M1242J4990m0304J5646J1615k8596K3590J1034m3820
1609b6732J8069L4132l3473R04K3398k8785R011L0796m1901j0087M7186j6438
1621F080k1210K7891j4477j0026L5910k4030l1017M2289K075l3209K5129J039
1633F444k5876L4896M351m6786K2102K5656l2359P604J5296k7688K1338K4103
1645B9081m6078R15M0097k6532j2308K6570k1900j687L8128k7041k3235L9127
$$ plain form
1657 15137 8635 -15990 8408 -3176 -21814 20025 14988 -26428 4499 22114 -11139 956
1669 956 6792 -22044 5554 22949 -20039 -8824 23592 -4819 -4628 14157 -18395 -11569 25135
1682 25135 -9151 -23733 17411 6660 -7933 15581 -5524 -17982 21737 4403 -29214 7351
1694 7351 14614 -10718 12354 8731 -21122 11100 19180 -26078 -10158 14424 -10370 1974 14761
1707 14761 -17636 857 29032 -13730 -20908 14027 -4683 -9734 16613 -7528 -10886 30168
1719 30168 6795 -22281 8043 2592 -16066 10483 -2273 -23236 19565 21714 -19741 616
1731 616 13663 -14617 -129 4664 -26155 1646 27160 -9838 -5121 20663 -5102 -3302 14113
1744 14113 -21644 -17384 24808 -155 -17007 16570 7283 -5421 16161 -9418 -27438 13733
$$ packed form
1657A5137o502k4625K4398j1584j8638M1839n037m1416L0927J7615l3253J2095
1669I56N836k8836K7598J7395m2988J1215L2416k8411J91J8785l2552O826L6704
1682B5135l4286j4582M1144j0751j4593K3514k1105j2458L9719j7334l3617L6565
1694G351P263k5332K3072l623k9853L2222Q080m5258J5920K4582k4794J2344J2787
1707A4761l2397J8493K8175m2762p178L4935j8710n051K6347k4141l358M1054
1719C0168k3373k9076L0324n451j8658K6549j2756k0963M2801K149m1455K0357
1731F16J3047k8280J4488M793l0819K7801K5514l6998M717K5784k5765J800J7415
1744A4113l5757M260M2192k4963j6852L3577r287j2704K1582k5579j8020M1171
$$ plain form
1756 13733 6268 -24550 6261 13598 -7482 16897 11112 -26068 1721 17639 -20145 -9432
1768 -9432 12718 -6426 10247 22133 -17241 -6553 24747 -11723 -22934 8108 -6138 -6142 22315
1781 22315 -3291 -14199 23334 6416 -22089 2013 -3495 -15685 17015 6833 -20738 17374
1793 17374 24998 -15036 -4261 5297 -17139 2678 10344 -22527 834 29018 -4685 -6520 12360
1806 12360 -13732 -8105 15128 -18067 -18780 24447 8446 -9065 14216 43 -9704 16721 -7381
1819 -7381 -28939 12434 13915 -14451 9185 11138 -11254 13069 8758 -29813 -5673 15615 -13297
1832 -13297 -2906 13038 -8511 8757 22978 -19175 -15292 18715 -6441 -14833 10900 -4166
1844 -4166 -1875 26939 -1836 -20182 14205 3962 -18965 3455 -3213 -14832 20404 12150 -21875
$$ packed form
1756A3733p465l0818L0811P337k1080K4379n785l7180K7789J5918l7784J0713
1768i432K2150j9144J6673J1886l9374J0688L1300l6470j1211L1042j4246mK8457
1781B2315k5606j0908L7533j6918k8505K4102n508j2190L2700j0182k7571L8112
1793A7374P624m0034J0775R558k2436J9817P666l2871K3361K8184l3703j835J8880
1806A2360k6092N627K3233l3195p13M3227j6001j7511K3281j4173r747K6425k4102
1819g381k1558M1373J481k8366K3636J953k2392K4323m311l8571K4140K1288k8912
1832a3297J0391J5944k1549J7268J4221m2153L883L4007k5156q392K5733j5066
1844d166K291K8814k8775j8346L4387j0243k2927K2420o668j1619L5236q254l4025
$$ plain form
1857 -21875 6647 17331 -14623 -3981 2793 -18086 7077 19872 -16002 -2189 24039 -4304
1869 -4304 -6493 8990 -16120 -7824 21503 -9291 -17532 19851 7428 -9335 9157 -7916 -16055
1882 -16055 17046 83 -25405 10086 15494 -9559 8994 6194 -17823 9895 13991 -23393
1894 -23393 -5382 16962 -6579 2231 11952 -15650 1367 22124 -16425 -18245 15479 -1940
1906 -1940 -8568 13210 -6701 -8779 23049 -408 -21659 9258 4745 -11467 10959 569 -16505
1919 -16505 18525 15246 -22341 -1109 12654 -11156 1421 5816 -18240 5737 21884 -15203
1931 -15203 -9358 15432 -7083 -5006 11936 -14740 -8254 25235 -1128 -16407 12755 2814 -8157
1944 -8157 11576 -7534 -17577 19510 8468 -20861 6404 10885 -11357 7247 3083 -22460
$$ packed form
1857b1875K8522J0684l1954J0642O774k0879K5163J2795l5874J3813K6228k8343
1869d304k189J5483k5110Q296K9327l0794q241L7383j2423j6763J8492j7073q139
1882a6055L3101j6963k5488L5491N408k5053J8553k800k4017K7718M096l7384
1894b3393J8011K2344k3541Q810R721k7602J7017K0757l8549j820L3724j7419
1906a940o628K1778j9911k078L1828k3457k1251L0917m513j6212K2426j0390j7074
1919a6505L5030l279l7587K1232J3763k3810J2577M395k4056K3977J6147l7087
1931a5203N845K4790k2515K077J6942k6676O486L3489k6363j5279K9162r941j0971
1944h157J9733j9110j0043L7087j1042k9329K7265M481k2242J8604m164k5543
$$ plain form
1956 -22460 5991 17428 -16396 -4054 14339 -6788 4132 12543 -19370 -4612 23368 -9008
1968 -9008 -14746 14313 133 -3290 15761 -9723 -15319 18623 1438 -20346 6360 3304 -9373
1981 -9373 15246 2210 -21225 11770 15350 -18907 -3259 9058 -9090 8181 11859 -18287
1993 -18287 2332 22276 -11831 -10881 10612 -8858 -3017 16389 -12606 -11640 22304 1192 -16075
2006 -16075 7283 -2849 -8755 15082 -3998 -19060 17818 13680 -15915 4022 6429 -12571
2018 -12571 9256 6930 -22143 4323 20219 -10266 -3241 9201 -11892 1848 13895 -20348
2030 -20348 -10456 22021 -2376 -10726 12124 -3746 -5011 17028 -8729 -18921 16576 6587 -12953
2043 -12953 9363 3094 -10106 16080 3721 -25408 4243 14404 -13802 -652 7786 -10168
$$ packed form
1956b2460K8451J1437l3824J2342J8393k1127J0920Q411l1913J4758K7980l2376
1968i008n738K9059j4180l423J9051k5484n596L3942j7185k1784K6706l056j2677
1981i373K4619j3036k3435L2995L580l4257J5648J2317j8148J7271L678l0146
1993a8287K0619J9944l4107R50K1493j9470N841J9406k8995R66L3944k1112j7267
2006a6075K3358j0132n906K3837j9080j5062L6878m138k9595J9937K407j9000
2018a2571K1827k326k9073K6466J5896l0485P025J2442k1093J3740J2047l4243
2030b0348R892L2477k4397q350K2850j5870j265K2039k5757j0192L5497r989j9540
2043a2953K2316o269j3200K6186j2359k9129K9651J0161k8206J3150Q438j7954
$$ plain form
2055 -10168 9514 14045 -20608 -5861 17933 -9099 -8169 10755 -8110 52 22332 -8370 -15417
2068 -15417 16516 1308 -13766 6501 -4726 -8489 20544 2099 -20687 10848 10882 -15714 936
2081 936 1637 -15318 11216 13424 -17870 2093 18770 -8229 -2495 6464 -15932 1475 20065
2094 20065 -13376 -10159 20959 696 -8686 8339 -10325 -10370 17077 -5291 -18797 14451 8514
2107 8514 -9325 9882 -1340 -16863 13685 7600 -22647 2918 16286 -6627 5042 7581
2119 7581 -15031 5588 15228 -19941 -9728 16328 -4887 -2660 13159 -10412 -5147 19681 -8489
2132 -8489 -19494 10363 1310 -7274 12742 -2723 -10200 21341 5721 -22523 4072 7904 -11951
2145 -11951 5886 4801 -14507 11961 16785 -17425 -5138 10506 -11542 -1537 8490 -16149
$$ packed form
2055a0168J9682M531l4653J4747K3794k7032R30J8924j8865Q162K2280l0702p047
2068a5417L1933j5208j5074K0267j1227l763K9033j8445k2786L1535L4k6596J6650
2081I36P01j6955K6534K208l1294J9963J6677k6999N734Q959k2396J7407J8590
2094B0065l3441L217L1118k0263r382J7025j8664m5K7447k2368j3506L3248n937
2107H514j7839J9207j1222j5523L0548o085l0247K5565J3368k2913J1669K539
2119G581k2612K0619R640l5169J0213K6056k1215K227J5819k3571N265K4828k8170
2132h489j1005K9857r053q584K0016j5465p477L1541j5620k8244K6595L832j9855
2145a1951J7837j085j9308K6468M824l4210J2287J5644k2048J0005J0027k4639
$$ plain form
2157 -16149 797 24671 -6648 -11785 13962 -2461 -7850 9128 -10753 -10916 21904 3436 -15161
2170 -15161 11437 5318 -11008 8425 -3583 -21047 11672 12952 -16803 2086 12889 -7605
2182 -7605 5002 5377 -21109 657 18307 -13089 -7172 16216 -2210 861 14461 -13509 -11303
2195 -11303 18080 -4171 -16987 9601 1604 -4663 15638 -4026 -17352 14690 5898 -20761
2207 -20761 1626 6887 -8887 11749 8759 -16685 7460 17015 -15153 -6480 8116 -10092 3407
2220 3407 14350 -14992 -3470 22774 -5759 -14091 8189 -6079 -6781 13808 -8254 -13038 20004
2233 20004 6047 -14323 7154 804 -11798 12344 1445 -20439 10857 16919 -11760 1048
2245 1048 7575 -11070 5666 7777 -21462 -2253 19377 -8470 -6350 12167 -7124 -1833 15526
$$ packed form
2157a6149J6946K3874l1319n137K5747j6423n389J6978j9881j63L2820j8468j8597
2170a5161K6598o119j6326J9433j2008j7464L2719J280k9755J8889J0803k0494
2182g605J2607L75k6486K1766J7650l1396N917K3388j8426L071J3600k7970K206
2195a1303K9383k2251j2816K6588p997o267K0301j9664j3326L2042q792k6659
2207b0761K2387N261j5774K0636k990k5444K4145R555l2168Q673J4596j8208J3499
2220C407J0943k9342J1522K6244k8533q332K2280j4268p02K0589k2062m784L3042
2233B0004j3957k0370K1477o350j2602K4142j0899k1884L1296O062k8679J2808
2245A048O527j8645J6736K111k9239J9209K1630k7847K120J8517j9291N291J7359
$$ plain form
2258 15526 -13165 -14327 16963 1350 -10632 10173 -689 -5643 17662 -2629 -21202 11251
2270 11251 9217 -15702 2496 5050 -10071 11423 8942 -19918 1138 14501 -12304 -3961 7630
2283 7630 -11398 4529 18639 -13448 -8575 19466 -2276 -10427 7555 -7289 -5086 18338 -4849
2296 -4849 -15735 15880 5966 -13375 5950 -2221 -14453 12866 5780 -19713 6261 15470 -8590
2309 -8590 2006 5102 -14486 6310 13714 -18817 -5134 18994 -4002 -3626 10861 -10315 -3898
2322 -3898 16766 -10713 -16364 13348 1749 -8249 10560 -3875 -10054 17449 1283 -21785 6271
2335 6271 9519 -10526 5724 4906 -11873 12073 13264 -18450 -2531 12744 -9769 -1599 8027
2348 8027 -13548 1732 20222 -10806 -12298 13729 -2788 -8035 8529 -9218 -7733 20329 434
$$ packed form
2258A5526k8691j162L1290j5613j1982K0805j0862m954K3305k0291j8573L2453
2270A1251k034k4919J8198K554j5121K1494k481k8860K1056J3363k6805Q343J1591
2283G630j9028J5927J4110l2087M873K8041k1742q151J7982j4844K203K3424k3187
2296d849j0886L1615r914j9341J9325q171j2232K7319p086k5493K5974R209k4060
2309h590J0596L096j9588K0796P404l2531J3683K4128k2996L76J4487k1176O417
2322c898K0664k7479n651K9712j1599r998J8809j4435o179K7503j6166k3068K8056
2335F271L248k0045J6250q18j6779K3946J191l1714J5919J5275k2513Q170R626
2348H027k1575J5280J8490l1028j492K6027j6517n247J6564j7747J485K8062j9895
$$ plain form
2361 434 -15939 11857 5975 -9988 7931 -2197 -16459 13091 10205 -17570 2831 12370 -8165
2374 -8165 3500 4239 -18199 3436 15989 -15049 -6876 15285 -3747 -1365 12018 -11692 -6961
2387 -6961 18504 -5247 -14826 11441 2056 -5187 12908 -4459 -13986 16256 4940 -20321 2985
2400 2985 7238 -9281 7509 4293 -15804 8441 14779 -15682 -4250 10046 -8726 2192 11354
2413 11354 -14024 -1212 21722 -6247 -12122 10447 -3526 -5374 10987 -9745 -11412 19017
2425 19017 2882 -15124 8087 2592 -10129 10049 -651 -18688 10544 13007 -13373 1922
2437 1922 9358 -7638 7047 7352 -19042 78 17704 -10611 -7360 11477 -5062 -222 13331
2450 13331 -12412 -10608 16487 -2842 -13629 8274 -1192 -5050 16292 -2013 -16172 14081
$$ packed form
2361D34j6373K7796n882j5963J7919j0128j4262K9550k886k7775K0401R539k0535
2374h165J1665P39k2438K1635J2553l1038Q173K2161j9032K382J3383k3710M731
2387f961K5465k3751r579K6267r385p243J8095j7367r527L0242j1316k5261K3306
2400B985M253j6519J6790l216k0097K4245O338l0461J1432J4296j8772J0918R162
2413A1354k5378J2812K2934k7969n875K2569j3973j848J6361k0732j667L0429
2425A9017j6135j8006K3211n495j2721K0178j0700j8037K9232K463k6380J5295
2437A922P436j6996J4685L05k6394J9120J7626k8315L251J8837j6539M840J3553
2450A3331k5743J804K7095j9329j0787K1903r466l858K1342j8305j4159L0253
$$ plain form
2462 14081 8681 -15960 1641 4253 -9379 10125 6955 -16534 5580 15850 -12198 -4726 5995
2475 5995 -11875 1402 13000 -14189 -5266 20451 -2056 -8917 8174 -6065 -5352 13843 -7722
2488 -7722 -13861 17401 7101 -10651 7999 950 -11017 10730 732 -20980 5643 12910 -9738
2501 -9738 2708 6839 -9989 7156 9646 -20089 -4806 15729 -6927 -4277 11446 -5474 1082
2514 1082 16939 -10504 -14080 12730 -1351 -11004 8196 -2457 -5827 18394 1010 -18742 7773
2527 7773 6716 -14408 1115 1939 -10042 12400 11740 -14837 2116 14134 -9808 -3302 5134
2540 5134 -13158 2223 17911 -9700 -7315 17024 -1222 -8119 5628 -10610 -8109 15511 -3930
2553 -3930 -14187 14384 7889 -8492 7119 -2300 -14286 10648 5170 -17596 4782 13645 -4994
$$ packed form
2462A4081n400k4641J7601K612j3632J9504l170k3489K2114J0270k8048P472J0721
2475E995j7870J3277J1598k7189Q923K5717k2507o861J7091j4239P13J9195k1565
2488g722o139L1262j0300j7752J8650p049j1967K1747r998k1712K6623P267k2648
2501i738J2446M131j6828J7145K490k9735J5283K0535k2656K650J5723j6920O556
2514A082J5857k7443l576K6810j4081r653J9200j0653l370K4221j7384j9752K6515
2527G773j057k1124J5523Q24j1981K2442o60k6577J6953J2018k3942O506Q436
2540E134j8292J5381J5688k7611K385K4339j8246o897J3747j6238K501K3620j9441
2553c930j0257K8571o495j6381J5611r419j1986K4934n478k2766K2378Q863j8639
$$ plain form
2566 -4994 4991 5478 -14216 4128 11631 -17946 -7585 14068 -3382 -1305 11185 -8902 -3435
2579 -3435 15721 -8910 -15821 9500 547 -5586 12121 -1907 -8379 17595 3722 -19341 2863
2592 2863 5757 -10060 5297 3324 -11897 10955 13298 -15503 -3445 8956 -9848 -1138 7352
2605 7352 -12887 1063 20254 -6248 -9045 11588 -2428 -5878 7606 -9671 -8446 18482 2202
2618 2202 -13003 9515 4177 -9277 6292 -3333 -16663 10124 9662 -13312 2879 9941 -6491
2631 -6491 5096 4650 -17492 1167 14957 -11024 -5591 13276 -2035 952 10886 -11789 -7997
2644 -7997 14324 -5254 -13366 8291 624 -3812 13328 -3607 -13785 12517 4330 -17060 1615
2657 1615 5054 -6162 10239 5820 -13484 7704 13273 -13483 -4877 6567 -8614 2628 11505
$$ packed form
2566d994R985M87j9694J8344P503k9577J0361K1653j7450K077J2490k0087N467
2579c435J9156k4631o911K5321q953o133J7707j4028o472K5974j3873k3063K2204
2592B863K894j5817J5357j973j5221K2852K343k8801J2058J2401j8804Q710Q490
2605G352k0239J3950J9191k6502k797K0633j4016l450J3484j7277J225K6928j6280
2618B202j5205K2518n338j3454J5569r625j3330K6787m62k2974J6191P062j6432
2631f491J1587m46k2142J8659J3790k5981N433J8867j5311K987R934k2675L792
2644g997K2321j9578q112K1657p667m436J7140j6935j0178K6302q187k1390J8675
2657A615L439j1216J6401m419j9304K1188N569k6756Q606J1444j5181J1242Q877
$$ plain form
2670 11505 -11994 -1935 17888 -5013 -10626 5519 -6326 -4911 11442 -7137 -9468 17939
2682 17939 5136 -11276 6082 436 -9403 8436 -352 -15614 9771 13030 -8953 1884 5592
2695 5592 -9585 4380 5116 -18753 -1711 16057 -6031 -3755 10321 -4641 -135 11010 -12562
2708 -12562 -11562 13597 -269 -8210 9685 107 -3675 14647 -2857 -17535 7712 5834 -12713
2721 -12713 2323 4090 -6496 11729 7119 -16485 1005 10502 -11398 -3732 6036 -7969 5414
2734 5414 15745 -9634 -5513 14424 -3422 -9292 4506 -7217 -3340 15839 -3186 -11256 13329
2747 13329 4520 -11788 2350 -3546 -11473 10393 4498 -13747 7399 12833 -6314 1388 2155
2760 2155 -12968 4144 9698 -14388 -2394 16311 -1752 -2049 7316 -9468 -3864 11272 -10220
$$ packed form
2670A1505k3499J0059J9823k2901n613J6145j1845J415J6353j8579k331K7407
2682A7939j2803j6412J7358n646r839J7839q788j5262K5385L259k1983J0837L708
2695E592j5177J3965P36k3869J7042J7768k2088K276J4076j4962M506J1145k3572
2708a2562J000K5159j3866p941J7895r578l782J8322j7504j4678K5247j878j8547
2721a2713J5036J767j0586J8225m610k3604J7490R497k1900P666R768j4005J3383
2734E414J0331k5379M121J9937j7846n870J3798j1723L877J9179j9025q070K4585
2747A3329q809j6308J4138n896p927K1866n895j8245K1146N434j9147P702P67
2760B155j5123J7112N554k4086J1994J8705j8063k97R365j6784N604J5136k1492
$$ plain form
2773 -10220 -12220 11928 2784 -4614 9578 -2934 -7866 12617 -1118 -18366 4937 7713 -6495
2786 -6495 6929 4198 -8473 10087 8089 -17175 -3637 8635 -7872 -62 7564 -8742 3518
2799 3518 15835 -9439 -10375 8556 -3913 -5917 7179 -6010 -3146 18321 744 -12645 8115
2812 8115 2566 -9464 4239 -2520 -10658 12114 8912 -12235 2639 7913 -8080 1046 983 -14648
2826 -14648 3522 13896 -9104 -3542 12200 -2471 -1551 6047 -11331 -4956 14429 -3730 -9336
2839 -9336 10939 2918 -3743 8871 -5834 -12492 10675 2460 -14755 3703 6389 -4891 7266
2852 7266 2053 -13234 6165 9250 -13280 -2778 8939 -4150 3825 9134 -10562 -1433 14032
2865 14032 -7163 -9984 6749 -2638 -1795 10261 -6750 -7918 14218 608 -13332 4012 1247
$$ packed form
2773a0220k000K4148r144p398J4192j2512m932K0483j3735j7248K3303K776j4208
2786f495J3424k731j2671J8560j998k5264J3538J2272j6507P810P626j6306J2260
2799C518J2317k5274r36J8931j2469k004J3096j3189K864K1467j7577j3389K0760
2812H115n549j2030J3703o759q138K2772l202k1147J4874N274j5993R126o3j5631
2826a4648J8170J0374k3000N562J5742j4671R20P598j7378O375J9385j8159n606
2839i336K0275q021o661J2614j4705o658K3167q215j7215J8458K686j1280J2157
2852G266n213j5287J9399L085k2530J0502J1717j3089P975N309j9696R129J5465
2865A4032k1195k821J6733r387Q43J2056j7011j168K2136j3610j3940J7344k765
$$ plain form
2878 1247 -6512 8549 641 -11258 9873 9660 -11156 -168 4601 -7443 4645 5473 -13137
2891 -13137 2130 15210 -6923 -5890 6823 -5739 -1468 8321 -10159 -6149 14500 -37 -8060
2904 -8060 7352 -1396 -4733 10089 -3970 -12783 10652 7456 -9587 3298 3835 -6131 7088
2917 7088 2386 -15370 2889 11017 -8747 -1878 6810 -5991 2886 8923 -12372 -5638 12422
2930 12422 -2910 -6411 6629 -3121 -486 12496 -5690 -10942 10830 2820 -10108 3849 512
2943 512 -6097 10289 1834 -13801 5028 8077 -9440 -335 3002 -8094 6349 9315 -12018
2956 -12018 -1180 13302 -4570 -4404 5141 -6421 176 11793 -7366 -7772 12093 902 -7189
2969 -7189 4936 -3978 -6650 10960 -932 -13189 7427 7543 -7132 2890 954 -8586 8040
$$ packed form
2878A247p759J5061p908j1899K1131k13k0816J0988M769j2044J2088Q28j8610
2891a3137J5267J3080k2133J033J2713j2562M271R789j8480M010K0649j4537q023
2904h060J5412q748l337J4822j4059q813K3435l196j7043J2885N37r966J3219
2917G088m702j7756J8259Q128j9764O869Q688j2801Q877O037k1295O734J8060
2930A2422j5332l501J3040r750K635J2982j8186n252K1772q010j2928J3957l337
2943E12o609J6386q455j5635J8829L049j7517R105L337j1096J4443K966k1333
2956a2018J0838J4482j7872J66R545j1562O597J1617j9159m06J9865j1191q091
2969g189J2125q914k672J7610j1892j2257K0616J16j4675J0022j936r540J6626
$$ plain form
2982 8040 6020 -13637 1243 11343 -5095 -55 5537 -8250 1644 10578 -10386 -7236 10708
2995 10708 -1241 -4070 6205 -5784 -3767 12531 -3827 -12773 7737 3708 -6716 5548 -1
3008 -1 -7030 10892 4877 -13040 2026 7167 -6661 1548 3006 -9814 5109 11306 -10868 -5111
3022 -5111 9258 -4143 -3239 5062 -7808 -1248 13735 -4107 -8772 9243 980 -5281 6106
3035 6106 -4324 -8122 11939 3240 -11583 4606 5956 -5893 3600 -330 -11654 6321 8425
3048 8425 -11367 -986 9426 -4169 1095 5184 -10226 -608 11851 -6666 -6748 8866 -268
3061 -268 -1240 7963 -6754 -6699 12076 -1036 -12257 5115 3089 -4545 6826 -873 -10158 8393
3075 8393 5921 -12037 -36 5541 -5386 4681 5118 -10157 3369 12173 -7975 -6047 6491
$$ packed form
2982H040k020j9657J4880J0100j6438N040N592j3787R894Q934k0964L150J7944
2995A0708j1949k829J0275j1989K017J6298j6358q946K0510m029j0424J2264n549
3008ap029J7922o015j7917J5066N141j3828Q209J458j2820J4923O197k2174N757
3022e111J4369j3401R04Q301j2870O560J4983j7842m665J8015q263o261J1387
3035F106j0430l798K0061q699j4823J6189J350j1849R493l930j1324J7975K104
3048H425j9792J0381J0412j3595N264M089j5410R618J2459j8517q2J5614r134
3061b68r72R203j4717N5J8775j3112j1221J7372k026p634J1371p699r285J8551
3075H393k472j7958J2001N577j0927J0067M37j5275J3526Q804k0148J928J2538
$$ plain form
3088 6491 -3796 -368 7264 -8072 -3349 13383 -2311 -9563 5443 -1338 -5213 7568 -3721
3101 -3721 -9418 11247 5894 -9625 2523 3052 -5778 5617 1500 -11975 5426 10820 -7894
3114 -7894 -1461 6487 -5377 1553 5557 -11583 -3327 11902 -3641 -6021 6624 -2292 -1333 9050
3128 9050 -6791 -9200 10830 2347 -9116 4836 2256 -3905 8610 269 -12070 5467 7061
3141 7061 -9318 21 3931 -5891 5488 6468 -11892 -464 10824 -5793 -5226 5066 -4112 812
3155 812 9987 -7040 -5627 11961 -198 -7560 4781 -2429 -4448 9983 -1421 -10822 7739
3168 7739 5579 -8202 1631 749 -7255 6537 3515 -12457 2477 10630 -5500 -909 5077 -6549
3182 -6549 2115 8871 -9577 -4730 10935 -1500 -4322 5624 -4477 -2444 10574 -4885 -11309
$$ packed form
3088F491j0287L428P632j5336M723J6732j5694p252J5006o781l875J2781j1289
3101c721n697K0665n353j5519J2148N29q830J1395m117j3475J7401N394j8714
3114g894O433P948j1864O930M004j7140Q256J5229j5543k380J2645q916R59J0383
3128I050j5841k409K0030q483j1463J3952k580o161J2515q341j2339J7537J594
3141G061j6379R339L910r822J1379R80j8360J1428J1288j6617N67J0292r178M924
3155H12R175j7027J413J7588j2159p362J2341p210k019J4431j1404r401J8561
3168G739k160j3781R833q82q004J3792l022j5972J4934Q153j6130M591N986j1626
3182f549Q664O756j8448M847J5665j2435k822R946j0101K033J3018j5459o424
$$ plain form
3195 -11309 8255 3058 -7302 3885 -175 -5699 9365 2624 -12016 3742 7101 -6423 1345
3208 1345 3142 -7458 5847 9403 -10551 -3122 9517 -3740 -3350 3962 -6928 -525 11081
3221 11081 -5703 -7667 9434 700 -5780 5012 -3327 -5961 10323 1147 -10649 5848 6116
3234 6116 -5142 3656 224 -8681 6534 6021 -12006 -429 8892 -4370 217 4357 -8685 593
3248 593 9610 -8258 -6525 8657 -864 -1841 6906 -5161 -3653 11582 -1611 -10837 6039 2740
3262 2740 -4840 5749 -520 -7476 8878 4214 -11718 581 4782 -6075 2612 3163 -9189 4174
3276 4174 10719 -8246 -4123 7033 -3472 -1254 5498 -7276 -1465 12763 -2581 -7872 7010
3289 7010 -151 -4743 5628 -4393 -8339 10103 3536 -9633 3574 4273 -4833 4380 81 -11021
$$ packed form
3195a1309J9564n197j0360J1187m060n524J5064o741j4640J5758L359j3524P768
3208A345J797j0600J3305L556j9954P429J2639j3257L90P312j0890O403J1606
3221A1081j6784j964J7101q734o480J0792q339k634J6284r176j1796J6497K68
3234F116j1258Q798l432q905J5215n13j8027J1577R321j3262M587M140j3042R278
3248E93R017j7868J733J5182r521r77Q747j2067J508J5235j3193r226J6876l299
3262B740p580J0589o269o956J6354m664j5932J2299M201j0857Q687N51j2352J3363
3276D174O545j8965M123J1156j0505K218O752j2774N811J4228j5344n291J4882
3289G010p161m592J0371j0021l946J8442o567j3169J3207O99r106R213m299j1102
$$ plain form
3303 -11021 5632 8654 -8666 -476 7860 -3446 1999 5349 -9658 -1507 10570 -5598 -6101
3316 -6101 7093 -1559 -1102 7873 -6397 -7438 10183 -202 -10050 4232 2091 -3504 7717 -7
3330 -7 -9253 7342 5764 -9882 215 4290 -5575 4544 5298 -10092 1562 10599 -6451 -5188
3344 -5188 4578 -4659 -172 7653 -7659 -3964 12106 -932 -7459 4979 -1327 -4248 8201 -2209
3358 -2209 -8745 9213 5505 -7602 2309 1503 -6511 5583 1810 -12020 3293 9444 -6564 -964
3372 -964 5129 -5657 1792 6161 -9912 -3399 10829 -2347 -3700 6637 -2665 -1348 9576 -5389
3386 -5389 -9351 8342 1957 -7566 3831 320 -4431 8286 350 -11658 4188 5941 -8085
3399 -8085 641 3352 -5902 6009 7772 -9993 -1075 9409 -4817 -3536 4318 -5354 806 10381
$$ packed form
3303a1021J6653L022j7320Q190Q336j1306N445L350j5007Q151J2077j6168n03
3316f101J3194q652M57Q975j4270j041J7621j0385r848J4282k141n595J1221p724
3330gr246J6595j578j5646J0097M075r865J0119P54j5390J1654R037j7050J263
3344e188R766r237M487P825j5312L695J6070j3038o527J2438o306k921J2449j0410
3358b209o536J7958l708j3107R911q06q014J2094l773j3830J5313O151j6008N600
3372i64O093j0786P449M369j6073O513J4228j3176j353J0337r302J317J0924j4965
3386e389l962J7693o385r523J1397l511m751J2717p936j2008J5846J753j4026
3399h085Q726K711r254J1911J763j7765Q918J0484j4226J281P854r672O160R575
$$ plain form
3413 10381 -6064 -5826 9635 -515 -6984 3695 -3693 -5253 9548 -190 -9364 7074 5625
3426 5625 -6300 2403 -331 -8024 6530 5028 -10648 2243 9831 -4348 -89 3529 -7709
3439 -7709 650 7604 -8997 -4802 9636 -696 -2329 5736 -5415 -3711 9330 -4302 -10570
3452 -10570 7170 3461 -4198 5992 177 -5557 8430 1963 -12097 1764 5265 -5796 2811
3465 2811 3767 -7139 4904 8315 -9979 -4199 6191 -4254 -1952 5171 -5874 431 12267
3478 12267 -3844 -7340 7111 -931 -5330 4894 -3197 -5379 10662 2928 -8822 4306 3303
3491 3303 -6762 2405 -1061 -9856 6160 7923 -8373 806 7851 -4215 294 2975 -9787 -323
3505 -323 9790 -5354 -3769 9170 -432 -1407 6113 -6952 -6827 9012 -1557 -9248 5629 3106
$$ packed form
3413A0381j6445K38J5461j0150o469J0679p388j560J4801r738r174J6438j449
3426E625j1925Q703k734p693J4554j502j5676J2891P588j4179M259L618j1238
3439g709Q359O954j6601M195J4438j0332j633Q065j1151J704J3041j3632o268
3452a0570J7740l709p659J0190n815n734J3987o467j4060J3861L501j1061Q607
3465B811R56j0906J2043L411j8294N780J0390j0445K302P123j1045O305J1836
3478A2267j6111l496J4451q042m399J0224q091k182J6041p734j1750J3128j003
3491C303j0065R167l466q795J6016J763j6296R179P045j2066M509K681j2762R464
3505c23J0113j5144J585J2939r602r75P520j3065J25J5839j0569p691J4877k523
$$ plain form
3519 3106 -2927 6382 -1220 -9040 6253 3345 -11064 1034 5412 -3781 5496 5124 -8327 2394
3533 2394 8631 -8360 -5187 5042 -3748 1068 7408 -6335 -2343 11054 -3261 -9081 3785
3546 3785 -2171 -4170 7395 -2130 -6207 10279 4226 -8316 2147 1576 -6101 4640 1436 -9398
3560 -9398 5839 9528 -6733 -1149 4615 -5970 278 4097 -9740 -1340 11107 -2829 -3734 6463
3574 6463 -2587 -2217 6964 -6334 -7959 9426 2272 -6564 5281 1770 -3781 6947 -1041 -10965
3588 -10965 4644 4942 -8066 1273 4280 -4829 4704 4857 -10474 -880 7987 -5809 -3225 5296
3602 5296 -3573 1852 9030 -6302 -4896 9364 -1475 -6891 4260 -2096 -3249 9021 -1118
3615 -1118 -8562 6993 3510 -7928 1253 285 -6531 6600 4158 -9568 2858 8595 -5485 -1206
$$ packed form
3519C106o033R309p602p820J5293k908j4409J2098M378r193R277l72j3451J0721
3533B394O237j6991L173J0229q790M816O340j3743L992J3397j4315n820J2866
3546C785n956j999J1565r525m077J6486o053j2542J0463n71p677J0741l204j0834
3560i398J5237L689j6261N584N764j0585O248L819j3837Q400J2447j3936r05J0197
3574F463r050L70R181j3298j625J7385p154q836J1845l511n551J0728p988r924
3588a0965J5609K98j3008R339L007r109R533J53j5331R594Q867j3796K584Q521
3602E296q869N425P178j5332J406J4260j0839n416J1151o356j153J2270j0139
3615a118p444J5555l483j1438R181r68o816J3131k442j3726J2426N737j4080M279
$$ plain form
3629 -1206 3280 -6231 2007 7551 -7675 -2681 10064 -2078 -3673 4476 -4979 -3155 8330 -4316
3643 -4316 -8240 7763 3006 -5540 4460 -914 -5490 7419 1110 -10398 3902 6590 -5131
3656 -5131 2341 3481 -6722 4106 6139 -9773 -2253 7395 -3826 -1604 4611 -5772 -83 9098
3670 9098 -5923 -7260 7240 -343 -4396 5291 -2240 -3603 9790 588 -9191 4604 3548 -5707
3684 -5707 3074 697 -6914 6570 5903 -9566 -39 6556 -5123 -646 3106 -7477 1674 9177
3698 9177 -6045 -3833 8016 -1588 -2527 4989 -5114 -3944 9881 -1260 -7597 6164 2474 -4487
3712 -4487 4043 -2175 -7606 6871 2890 -9659 2358 5497 -4467 2832 2692 -8457 2733 7685
3726 7685 -7689 -2467 6779 -2483 436 5568 -6447 -2257 9466 -3906 -7638 5548 -233 -3051
$$ packed form
3629a206M486r511Q238N544j5226M994J2745j2142j595Q149r455J824J1485j2646
3643d316l924J6003m757q546J0000n374m576J2909o309j1508J4300K688j1721
3656e131P472J140j0203J0828K033j5912P520R648j1221K222O215j0383N689R181
3670I098j5021j337J4500p583m053R687p531j363J3393r202r779J3795j056r255
3684e707Q781k377p611J3484o67j5469R527O595j1679M477L752j0583R151P503
3698I177j5222K212J1849r604r39P516j0103J170J3825j1141o337J3761l690o961
3712d487Q530o218n431J4477l981j2549J2017L139r964P299j40j1149J1190M952
3726G685j5374N222R246r262K919N132j2015M190J1723j3372l732J3186n781k818
$$ plain form
3740 -3051 5965 -2838 -6099 8265 1194 -9040 2692 2489 -4558 4929 1608 -8174 5415 7077
3754 7077 -7739 -984 5186 -4203 1238 4354 -7443 334 9707 -4716 -4963 5324 -2960 -2396
3768 -2396 5696 -5446 -5115 9710 781 -7152 4006 839 -3837 5444 -1239 -8198 6625 5138
3782 5138 -7362 1681 4201 -4493 3204 2875 -9493 865 7946 -5228 -2735 5129 -3458 639
3796 639 6002 -7416 -3973 9173 -1370 -5712 4976 -184 -2146 7453 -2347 -7499 6840 2649
3810 2649 -7337 2219 1756 -4535 5587 2494 -9233 2458 6746 -6555 -1426 3616 -4500 2788
3824 2788 6229 -7085 -1397 8952 -2935 -4068 4556 -3330 -1373 7667 -3942 -6294 7818 1633
3838 1633 -6071 2589 -1147 -4454 6326 -218 -8928 4876 5808 -5899 853 2312 -5107 3922
$$ packed form
3740c051R016q803l261J4364p071j0234J1732k03p047R487l321r782J3589J662
3754G077j4816O755O170r389N441L116j1797P777R373j4423k47J0287q284N64
3768b396Q092j1142L31J4825q929p933J1158l167m676R281o683o959J4823j487
3782E138j2500R043K520q694P697l29j2368J0358P081j3174K493P864q587M097
3796F39N363j3418L443J3146j0543m342J0688n160j962R599r800n152J4339m191
3810B649r986R556m63o291J0122l093j1727J1691M288j3301N129N042q116P288
3824B788L441j3314N688J0349j1887j133Q624p886J957R040j1609k352J4112o185
3838A633p704Q660l736l307J0780o544q710J3804R32j1707O752J459p419R029
$$ plain form
3852 3922 4791 -8278 -71 8266 -3054 -1399 3981 -4886 -30 7021 -6337 -5287 7813 -113
3866 -113 -4337 3890 -2214 -3355 7528 -1378 -8281 5083 3336 -5035 2984 1013 -5322 5820
3880 5820 3719 -8772 827 6319 -4503 -176 2922 -5694 2011 6794 -7134 -3725 6959 -2240
$$ packed form
3852C922Q69j3069Q207Q337j1320J655N380q867M856P051j3358J050J3100p926
3866a13m224Q227o104j141J0883q906o903J3364j747q371Q019j971o335J1142
3880E820k101j2491R599N492j0822M327L098q616P705M783j3928L409J0684r199
$$ [...]
##END NTUPLES=NMR FID
##END=
