##TITLE=1H_Ser DNG-6
 CDCl3
 8 sc, 
 17.2.2023
##JCAMPDX= 6.0         $$ Bruker NMR JCAMP-DX V2.0
##DATA TYPE= NMR FID
##DATA CLASS= NTUPLES
##ORIGIN= UXNMR, Bruker Analytische Messtechnik GmbH
##OWNER= root
$$ XWIN-NMR		Version 3.5
$$ Fri Feb 17 14:17:24 2023 Russian Standard Time (UT+4h)  she@DPX200
##.OBSERVE FREQUENCY= 200.13135
##.OBSERVE NUCLEUS= ^1H
##.DELAY= (6, 6)
##.ACQUISITION MODE= SIMULTANEOUS
##.ACQUISITION SCHEME= undefined
##.AVERAGES= 8
##.DIGITISER RES= 18
##SPECTROMETER/DATA SYSTEM= spect
##.PULSE SEQUENCE= zg30
##.SOLVENT NAME= DMSO
##.SHIFT REFERENCE= (INTERNAL, DMSO, 0, 15.7039)
##AUDIT TRAIL= $$ (NUMBER, WHEN, WHO, WHERE, WHAT)
$$ ##TITLE= Audit trail, XWIN-NMR		Version 3.5
$$ ##JCAMPDX= 5.01
$$ ##ORIGIN= Bruker BioSpin GmbH
$$ ##OWNER= she
$$ F:/spectra/data/she/nmr/H-F/1/audita.txt
$$ ##AUDIT TRAIL=  $$ (NUMBER, WHEN, WHO, WHERE, WHAT)
(   1,<2023-02-17 14:16:18.20 +0400>,<she>,<DPX200>,
      <created by zg, POWCHK disabled, PULCHK disabled
       configuration hash MD5:
       00 E9 B6 7A A2 85 ED C7 34 08 36 98 17 FE 4E 26
       data hash MD5: 16K
       F0 34 3F 00 44 75 2E 6A A8 0F E4 98 21 E5 C6 49>)
$$ ##END=
$$ 
$$ hash MD5
$$ F7 C2 D6 15 46 B0 E1 2F 9C BB DC FF 84 75 FA D6
##$RELAX= 
##$RELAX= 
##$RELAX= 
##$RELAX= 
##$RELAX= 
##$RELAX= 
$$ Bruker specific parameters
$$ --------------------------
##$DU= <F:/spectra>
##$EXPNO= 1
##$NAME= <H-F>
##$PROCNO= 1
##$TYPE= <nmr>
##$USER= <she>
##$AMP= (0..31)
100 100 100 100 100 100 100 100 100 100 100 100 100 100 100 100 100 100 
100 100 100 100 100 100 100 100 100 100 100 100 100 100 
##$AQSEQ= 0
##$AQ_mod= 1
##$AUNM= <au_zg>
##$AUTOPOS= <>
##$BF1= 200.13
##$BF2= 200.13
##$BF3= 200.13
##$BF4= 200.13
##$BF5= 200.13
##$BF6= 200.13
##$BF7= 200.13
##$BF8= 200.13
##$BYTORDA= 1
##$CFDGTYP= 0
##$CFRGTYP= 5
##$CHEMSTR= <none>
##$CNST= (0..31)
1 1 145 1 1 1 1 1 1 1 1 1 1 1 1 1 1 1 1 1 1 1 1 1 1 1 1 1 1 1 1 1 
##$CPDPRG= <>
##$CPDPRG1= <>
##$CPDPRG2= <>
##$CPDPRG3= <>
##$CPDPRG4= <mlev>
##$CPDPRG5= <mlev>
##$CPDPRG6= <mlev>
##$CPDPRG7= <mlev>
##$CPDPRG8= <mlev>
##$CPDPRGB= <>
##$CPDPRGT= <>
##$D= (0..31)
0 1.2 0 0 0 0 0 0 0 0.06 0 0.03 0 0 0 0 0.0002 0 0 0 0 0 0 0 0 0 0 0 0 
0 0 0 
##$DATE= 1676628977
##$DBL= (0..7)
120 120 120 120 120 120 120 120 
##$DBP= (0..7)
150 150 150 150 150 150 150 150 
##$DBP07= 0
##$DBPNAM0= <>
##$DBPNAM1= <>
##$DBPNAM2= <>
##$DBPNAM3= <>
##$DBPNAM4= <>
##$DBPNAM5= <>
##$DBPNAM6= <>
##$DBPNAM7= <>
##$DBPOAL= (0..7)
0.5 0.5 0.5 0.5 0.5 0.5 0.5 0.5 
##$DBPOFFS= (0..7)
0 0 0 0 0 0 0 0 
##$DE= 6
##$DECBNUC= <off>
##$DECIM= 32
##$DECNUC= <off>
##$DECSTAT= 4
##$DIGMOD= 1
##$DIGTYP= 9
##$DL= (0..7)
0 120 120 120 120 120 120 120 
##$DP= (0..7)
150 150 150 150 150 150 150 150 
##$DP07= 0
##$DPNAME0= <>
##$DPNAME1= <>
##$DPNAME2= <>
##$DPNAME3= <>
##$DPNAME4= <>
##$DPNAME5= <>
##$DPNAME6= <>
##$DPNAME7= <>
##$DPOAL= (0..7)
0.5 0.5 0.5 0.5 0.5 0.5 0.5 0.5 
##$DPOFFS= (0..7)
0 0 0 0 0 0 0 0 
##$DQDMODE= 0
##$DR= 18
##$DS= 0
##$DSLIST= <SSSSSSSSSSSSSSS>
$$ [...]
##$SUBNAM2= <"">
##$SUBNAM3= <"">
##$SUBNAM4= <"">
##$SUBNAM5= <"">
##$SUBNAM6= <"">
##$SUBNAM7= <"">
##$SUBNAM8= <"">
##$SUBNAM9= <"">
##$SW= 18.05172834244
##$SWIBOX= (0..15)
0 0 2 0 0 0 0 0 0 0 0 0 0 0 0 0 
##$SW_h= 3612.71676300578
##$TD= 16384
##$TD0= 1
##$TE= 0
##$TE2= 300
##$TE3= 300
##$TEG= 300
##$TL= (0..7)
0 120 120 120 120 120 120 120 
##$TP= (0..7)
150 150 150 150 150 150 150 150 
##$TP07= 0
##$TPNAME0= <>
##$TPNAME1= <>
##$TPNAME2= <>
##$TPNAME3= <>
##$TPNAME4= <>
##$TPNAME5= <>
##$TPNAME6= <>
##$TPNAME7= <>
##$TPOAL= (0..7)
0.5 0.5 0.5 0.5 0.5 0.5 0.5 0.5 
##$TPOFFS= (0..7)
0 0 0 0 0 0 0 0 
##$TUNHIN= 0
##$TUNHOUT= 0
##$TUNXOUT= 0
##$USERA1= <user>
##$USERA2= <user>
##$USERA3= <user>
##$USERA4= <user>
##$USERA5= <user>
##$V9= 5
##$VALIST= <valist>
##$VCLIST= <CCCCCCCCCCCCCCC>
##$VD= 0
##$VDLIST= <DDDDDDDDDDDDDDD>
##$VPLIST= <PPPPPPPPPPPPPPP>
##$VTLIST= <TTTTTTTTTTTTTTT>
##$WBST= 1024
##$WBSW= 4
##$XGAIN= (0..3)
0 0 0 0 
##$XL= 0
##$YL= 0
##$YMAX_a= 200638
##$YMIN_a= -314116
##$ZGOPTNS= <>
##$ZL1= 120
##$ZL2= 120
##$ZL3= 120
##$ZL4= 120
##$ABSF1= 10
##$ABSF2= 0
##$ABSG= 5
##$ABSL= 3
##$ALPHA= 0
##$AQORDER= 0
##$ASSFAC= 0
##$ASSFACI= 0
##$ASSFACX= 0
##$ASSWID= 0
##$AUNMP= <proc_1d>
##$AZFE= 0.1
##$AZFW= 0.1
##$BCFW= 1
##$BC_mod= 2
##$BYTORDP= 1
##$COROFFS= 0
##$CY= 11.3945322036743
##$DATMOD= 1
##$DC= 2
##$DFILT= <>
##$DTYPP= 0
##$F1P= 2.36226072786647
##$F2P= -0.459571619588291
##$FCOR= 0.5
##$FTSIZE= 0
##$FT_mod= 4
##$GAMMA= 1
##$GB= 0.15
##$INTBC= 1
##$INTSCL= 1
##$ISEN= 128
##$LB= 0.24
##$LEV0= 0
##$LPBIN= 0
##$MAXI= 10000
##$MC2= 0
##$MEAN= 0
##$ME_mod= 0
##$MI= 1.114404
##$NCOEF= 0
##$NC_proc= 0
##$NLEV= 6
##$NOISF1= 3.799351
##$NOISF2= 2.8
##$NSP= 1
##$NTH_PI= 0
##$NZP= 0
##$OFFSET= 15.70392
##$PC= 1
##$PHC0= -19111.7
##$PHC1= 21.20078
##$PH_mod= 1
##$PKNL= yes
##$PPARMOD= 0
##$PSCAL= 0
##$PSIGN= 0
##$REVERSE= no
##$SF= 200.130013532006
##$SI= 16384
##$SIGF1= 3
##$SIGF2= 2
##$SINO= 400
##$SIOLD= 16384
##$SREGLST= <1H.CDCl3>
##$SSB= 0
##$STSI= 0
##$STSR= 0
##$SW_p= 3612.71676300578
##$SYMM= 0
##$S_DEV= 0
##$TDeff= 0
##$TDoff= 0
##$TI= <>
##$TILT= no
##$TM1= 0
##$TM2= 0
##$TOPLEV= 0
##$USERP1= <user>
##$USERP2= <user>
##$USERP3= <user>
##$USERP4= <user>
##$USERP5= <user>
##$WDW= 1
##$XDIM= 8192
##$YMAX_p= 0
##$YMIN_p= 0
$$ End of Bruker specific parameters
$$ ---------------------------------
##NTUPLES= NMR FID
##VAR_NAME=  TIME,          FID/REAL,        FID/IMAG
##SYMBOL=    X,             R,               I
##VAR_TYPE=  INDEPENDENT,   DEPENDENT,       DEPENDENT
##VAR_FORM=  AFFN,          ASDF,            ASDF
##VAR_DIM=   8192,          8192,            8192
##UNITS=     SECONDS,       ARBITRARY UNITS, ARBITRARY UNITS
##FACTOR=    0.0002768,     1,               1
##FIRST=     0,             0,               0
##LAST=      2.2672688,     0,               0
##MIN=       0,             -314116,         0
##MAX=       2.2672688,     200638,          0
$$ Real data points
##PAGE= N=1
##DATA TABLE= (X++(R..R)), XYDATA
$$ [...]
2093A890j821j641J323J456j566q51J177J124j127r00Q30J291r18j540P60K124
2109A611j489j551J810J137k063j204J492J659j350j230J006J326j482j154J270
2124b12J272j106j330J173J632j284j576J554J115j612q87K098O43j622j373J262
2140b53J369q71j078J024J221j956j327J832J413j708j136J629P60j283q30J174
2156b0R35j296j038J576J735j607j520J071J544j694p78J750Q87k020q99J558
2172A84Q02j052j017J684P36j336j196J278J176j481j312J853J345j827j086J559
2188C10O26j925l78K127R78k128n67J135P43r71q36J493Q93j631j048J501J255
2205A577j758j293J933P80j727k47J572P6j749n25J869N82j195q28J077R05j743
$$ plain form
2093 1890 69 -1572 -249 1207 -359 -1210 -33 1091 -36 -936 -106 1185 267 -1273 -513 1611
2109 1611 122 -1429 381 1518 -545 -1749 -257 1402 52 -1178 -172 1154 -328 -1482 -212
2124 -212 1060 -46 -1376 -203 1429 145 -1431 123 1238 -374 -1261 837 1480 -142 -1515 -253
2140 -253 1116 245 -833 191 1412 -544 -1871 -39 1374 -334 -1470 159 919 -364 -1194 -20
2156 -20 915 -381 -1419 157 1892 285 -1235 -164 1380 -314 -1092 658 1545 -475 -1374 184
2172 184 986 -66 -1083 601 1337 1 -1195 83 1259 -222 -1534 319 1664 -163 -1249 310
2188 310 936 -989 -1367 760 1738 -390 -957 178 921 -50 -886 607 1500 -131 -1179 322 1577
2205 1577 -181 -1474 459 1239 -488 -735 837 913 -836 -1361 508 1090 -105 -933 144 1049 -694
2222f94o61J830R20j801r75J975N12j703n41J803J36j408q9J445Q7j211q46J749
2240E28Q45j738n48J384M46j777l20J801L33j740n23J882J67j540Q3J045M85j632
2258h19p8J710N90k111m91J375R18j861j21K038J66k082j69J513K16j300k12J249
2276E31K33j444l22J427M54j547m53J477P03j818m2J325N31j756j69J766j61j141
2294d06l35J181M21j338n12J802K68j695l23J608L67j799k07J919l65j192j37
2311g43J340j66j079o1J544Mj548j99J360N34j855L6J983n03j529J70J695l21
2329F62j394N5J633k57j420K07J117L06j625o4J622j58j855M65J609m23j416M06
2347e30J415n37j354M73J163j16j285L38J405k2j767MJ712J35j910J71J855n50
$$ plain form
2222 -694 -1355 475 1395 -406 -1381 594 1106 -597 -1138 665 801 -607 -696 749 836 -375 -1221 528
2240 528 1373 -365 -913 471 917 -860 -1180 621 954 -786 -1309 573 740 -800 -717 328 813 -819
2258 -819 -897 813 1403 -708 -1199 176 1094 -767 -888 1150 1316 -766 -935 578 794 -506 -718 531
2276 531 764 -680 -1002 425 879 -668 -1121 356 1059 -759 -801 524 1055 -701 -870 896 735 -406
2294 -406 -741 440 861 -477 -989 813 1081 -614 -937 671 1038 -761 -968 951 586 -606 -743
2311 -743 597 431 -648 -709 835 839 -709 -908 452 986 -869 -833 1150 647 -882 -712 983 662
2329 662 -732 -677 956 699 -721 -514 603 909 -716 -780 842 684 -1171 -706 903 480 -936 -530
2347 -530 885 348 -1006 -533 630 514 -771 -433 972 950 -817 -813 899 1034 -876 -705 1150 600
2365F00j656O17J283l94j372N52J261l68j273J17J258k64j474M91J657m57j880
2382a302P18J621n67j693P41J691p12j427O16J050m46j085N07J454l45j754L12
2399f21J401k72j379P19J242p33j279N58J128n14j133Q41Q27l92j148L87J271
2416I03m72j204M21J345n03j540R16J279r55j220Q46J035o70r57M72J027m58j094
2434h29N08J309o89j342P46R48n86j293P13J256k70j497Q30R02r24o32N94J144
2452H88n55j289Q04R26o80q21P15J029r32j156Q72J046o56o91M11P87o08r30N65
2471b75J152o30j148N19J479j007j374J350P27p22r32P10Q84m51q90N76Q56p48
2489G6p94L29J258n38j064N22J006q31p55Q73R08q98r99Q16O44m19r58P05J311
$$ plain form
2365 600 -1056 -439 844 450 -922 -370 891 523 -750 -633 625 361 -1113 -622 1035 578 -1302
2382 -1302 -584 1037 470 -1223 -482 1209 497 -930 -314 736 290 -795 -288 1166 821 -933 -621
2399 -621 780 508 -871 -152 1090 357 -922 -364 764 250 -883 -42 785 393 -755 -368 903
2416 903 431 -773 -352 993 490 -1050 -134 1145 190 -1030 -184 851 181 -776 -304 723 265 -829
2434 -829 -321 988 299 -1043 -297 651 65 -1228 -515 741 471 -1026 -196 706 -218 -850 -256 888
2452 888 333 -956 -152 774 94 -727 -12 1017 85 -1071 -199 847 191 -500 -89 698 90 -840 -275
2471 -275 877 247 -901 -382 1097 90 -1284 66 793 71 -861 -151 733 282 -608 -32 824 76
2489 76 -718 -389 869 331 -733 -211 795 -36 -791 82 990 92 -907 -91 553 134 -824 -119 1192
2508A192j112p98N81R07j036r51J230R48j025q59P53J108j270l70P23J156r07
2525B70q68P66O95r05r20J025N67o69j078J027J307j489r24J482M35j023k90O90
2543I8M87p56n60R25O52r24o75O33Q31p79q45J326M70r52o51R63O24q91p30P08
2563d6P65p48p46R06Q54j092r07Q90R16j113m86J011O66j174l42Q36L17q00l33
2582f26J003M90j043o61N59J096r16o87J094M42j304k32J040O48j317l22R80M56
2600G00j014o48J184L53p20m93R42M02r25o49J145K69j138k16J550J00j283j99
2618f40Q03K55q01l05J466j35o51o34O30N83r31l73J097N04j239l68P43M44q00
2637c52l81R79M59p80l25N72L65j111k46J241M43j131k67R45J32r49j16R02J07
$$ plain form
2508 1192 80 -718 -137 770 -266 -1217 13 961 -64 -923 -170 938 -332 -702 21 1177 270
2525 270 -598 168 863 -42 -962 63 630 -39 -1117 -90 1217 -272 -1196 286 721 -302 -592 98
2543 98 585 -171 -731 194 846 -78 -753 -120 711 -68 -913 413 883 -69 -720 243 867 -24 -754 -46
2563 -46 719 -29 -775 131 985 -107 -1014 -124 792 -321 -807 204 870 -304 -646 190 507 -293 -626
2582 -626 377 867 -176 -837 -278 818 -98 -785 309 751 -553 -785 255 903 -414 -736 244 700
2600 700 -314 -962 222 575 -145 -638 304 706 -219 -868 277 546 -592 -808 742 842 -441 -640
2618 -640 163 418 -383 -688 778 643 -8 -642 -12 571 -360 -733 364 868 -371 -739 4 448 -352
2637 -352 -733 246 705 -75 -400 172 537 -574 -820 421 864 -267 -534 411 543 -406 -522 380 487
2656D87o35l56Q58J58j079J3Q06M19r59j11Q20j24q34JR23N23j219k39Q57Qn02
2677a85m68O70L71r57J43Q28L49j151j46Q46M06r64j40J130j69j029M6Q77M3r06
2697d06N7P83J45j088r2R94Q9r51j44Q31K56j003j42R72M03j198J65R74j32q72
2717c59O5R31j53r10j38J198k23q28k65J297j19j013K0J162k71j129N52O54r2
2736C79j036O2J117j69q03j38J391j04j426L25Q44m6p24o4Q51o4j020M11O58j97
2756B47o91k6P84O7q22K36N44j0j047K43J164l38j004K05R81k77q76M43N48Q2
2776D53j000K59N88M6r75N19Q62l61o88K02O65j64p52K04O18k58q12N49M20l26
2796D9p27O16L94r7p23J44Q65j63q62L64Q00o80m69J48J127n41o56L89P51n41
$$ plain form
2656 487 -148 -504 354 512 -567 -554 252 671 -288 -399 421 297 -537 -536 387 910 -309 -548 309 317 -185
2677 -185 -653 17 388 -569 -426 402 751 -400 -546 300 706 -258 -398 732 563 -466 -420 457 500 -406
2697 -406 -349 434 579 -509 -601 393 482 -469 -613 218 474 -529 -671 301 704 -494 -329 645 513 -359
2717 -359 -294 637 484 -426 -564 634 411 -417 -682 615 496 -517 -497 665 394 -735 -183 471 379
2736 379 -657 -595 522 353 -450 -588 803 699 -727 -402 442 396 -328 -392 459 395 -625 -214 444 247
2756 247 -444 -470 314 381 -441 -205 339 329 -718 -475 689 351 -653 -448 533 256 -620 -177 371 453
2776 453 -547 -288 300 346 -629 -110 752 391 -297 -95 570 406 -346 -142 476 218 -594 -45 375 49
2796 49 -678 -62 332 235 -488 -344 521 358 -504 -140 660 -20 -489 -341 786 245 -411 -22 729 188
2816A88n89J42R01l65p16M29K40j06n26L10O50l70p10K03Q99n72o96M32P09k18
2836B35p20K13Q09n74l29M60L91j09q92M50N29j52r64L76R13m30o41L41O45l76
2856A75o51M14N42m28n72M36N88l92p79N64P57m84o19M91N56o94m05L30P60m26
2876A63o65J29R78n80n62M59O42k91r46N80Q61o15p95N02M30m19l80M70L28l33
2896d4m77L90N55k52o48K75R27r58j20N50J58l26o33Q17L09m76n96L56N32j57
2916A82p70L85P88m80r60J035M26n37n49N31M27o16m16P46J78p30k75N70N57k84
2936B08m21K36L53k42m56N57K75o29j54P30q6k97m68O19M7l26l43N51M56o45m00
2957d35O55O07j105k36O64J9k50m74Q91K82o07m66K94O66l96n55Q66q5k43n42
$$ plain form
2816 188 -401 -259 642 277 -439 -10 230 124 -402 -92 558 188 -522 -319 580 8 -688 -256 453 235
2836 235 -485 -272 537 -37 -366 94 485 376 -516 -66 463 311 -653 -277 636 206 -435 -94 551 175
2856 175 -476 -62 480 52 -520 -84 504 112 -667 -103 654 170 -449 42 598 -96 -501 -171 589 163
2876 163 -502 -373 605 25 -537 -78 564 273 -673 -93 768 153 -642 -140 290 -129 -509 -39 289 -44
2896 -44 -521 -131 424 172 -476 -201 726 -232 -352 198 356 30 -603 214 523 47 -549 -193 339 182
2916 182 -588 -203 585 105 -855 180 606 69 -480 51 478 -138 -554 192 370 -360 -635 -65 492 208
2936 208 -213 23 376 134 -322 235 510 -119 -273 457 371 74 -394 225 272 -54 -397 154 610 -35 -435
2957 -435 220 827 -278 -514 150 169 -81 -555 336 618 11 -455 -161 505 109 -446 420 335 92 -450
2977d50P01N39o82l21K42O05o14n57P47M35q62j90J55R10n24o18N42N06r46j03
2997d85M88L86p64j75O73N9l74k99O26M67r12lM86L29p51n5L75K69l30n36O06
3018H0L14n52l92P10Q4k60m32N71J71n08O5L64K14q34P5L54M72p08j32N73J91
3039D20r72K03M97K76p69q0N72K92o01o8M58j4k97k15O25N5q08j87P67J37q05
3060e14L42K81Rm41p1N49J98n33J07K52K88n08n19Q70j52l94K25N12j52l85j90
3081b26N61L7n99k42N92K37m97J4M52o5k67k53L82j8l43RO65j03o91J5Q52n2p11
3104b51j8N13p0o48M98M45l76k68P8N33l7o97O7M43J9n82K56K77j0m17m0N43J33
3127C91o99R8M41J90p06K47N44m39p34M42M43k45j94K80L96l14p17N38K78P8o00
$$ plain form
2977 -450 251 790 108 -213 29 634 20 -537 210 645 -217 -407 -252 658 134 -484 58 564 -382 -485
2997 -485 3 389 -375 -550 123 182 -192 -491 135 602 -310 -313 173 502 -249 -304 71 340 10 -526 80
3018 80 394 -158 -550 160 244 -16 -448 123 294 -214 -149 215 429 -405 -330 24 496 -212 -344 229 420
3039 420 -552 -349 148 424 -345 -425 147 439 -162 -230 228 214 -83 -298 327 382 -426 -613 154 291 -514
3060 -514 -172 109 118 -323 -394 155 353 -180 -73 179 467 -41 -560 310 158 -236 -11 501 349 -36 -226
3081 -226 335 372 -227 -469 123 360 -137 -123 329 264 -3 -256 126 108 -235 -226 439 336 -355 -340 512 460 -251
3104 -251 -269 244 174 -474 24 469 93 -175 -97 436 399 -298 -231 212 231 -351 -95 182 172 -245 -285 258 391
3127 391 -308 -210 231 421 -285 -38 506 67 -667 -225 218 -27 -221 59 455 141 -576 -38 240 318 -282
3148b82p7M93O0o12L54N11k81o62J44R47m04n96Q3N85o8p45M32L47k64k73L61
3169E3J46J7m89J11N38j83l63J53J09rj40m2L15j9n88L97j11M94r24K69M00K28
3191C62o57J59K87j97k56K64L04k27j82r3N46l06l02L00N12j68k06l27N47l10
3211E0m52J81N84j62m10o1Q21k54q62O60P1j70l57K9N19nj99j49L36M9n14P7P35
3234E17j81m70R9J48J25n20L9L60J74m65K66M99l37n47L90K11j36p12L72N36l41
3255B7l67J77M46j73m74L47M15m66k30K08M36k12n95L85O12o94nJ93M66m69l76
3276c49L39K67q8o99M79M27k51n00J26N20j74n14L38N74m87n73L83N16m25l32
3296d23M25K01l44k42L57L47k50j94p5N58l67QJ50L09l06p22N77K11l55j23N36
$$ plain form
3148 -282 -359 134 194 -418 -64 447 166 -496 -352 595 191 -405 -322 263 195 -550 -118 229 -35 -308 53
3169 53 199 216 -273 -162 376 193 -170 -17 92 83 -57 -99 216 197 -391 6 -105 389 -535 -266 134 362
3191 362 -295 -136 151 -46 -302 -38 266 39 -143 -236 310 4 -298 2 514 346 140 -187 360 50
3211 50 -402 -221 363 201 -209 -270 551 297 -565 95 166 -4 -361 -332 187 182 -17 -166 170 219 -295 -218 517
3234 517 336 -134 -35 113 238 -282 -243 117 291 -174 92 591 254 -293 97 308 172 -540 -168 368 27
3255 27 -340 -163 283 110 -364 -17 398 -68 -298 -90 346 134 -461 -76 536 -158 -163 30 496 27 -349
3276 -349 -10 257 169 -530 -51 376 125 -375 -249 271 97 -417 -79 495 8 -565 -182 334 -91 -423
3296 -423 2 203 -141 -383 -26 321 71 -123 -198 360 -7 1 151 460 154 -568 9 220 -135 -258 278
3317B78q1k87m72P64J85m98k59J71O53m87k03M91r8j18m68M81L55n07j59L06K24
3338B71k99l86M04O63q10l31N91P02j036l73O82J30k66k28L69J70k96j28J91K89
3358C09j40m97L07K30j74k83L05J67k60j08N9J37m7J7K1K62n02k00N28kk84k48
3380d03N97J3k39p7q5M93n53R1K21L70o11k1M11J86l77mK25L9m98k33L89M71m03
3403Bk53M64M5o52J66K90J83m90M9K45K36m12m1M36k08j86k46K94L88l0p56M91
3425A5J2k93n6N13n3j60j41M12j1k41k16N32K7o66j77Q94k47m17R4N64p2l97k10
3448b94O24l10l88J98L60J3n36J59L09N8m35M6K07M11q56L18L43r5l94Q7K91J
3470A17k17O5N35m01n97L03N39l4m52k67N74j01j51j67O32r1n44J3M20J24p04
$$ plain form
3317 278 197 -90 -562 202 387 -111 -370 -199 454 -33 -236 255 157 39 -429 52 407 -100 -259 47 271
3338 271 -28 -414 -10 653 -157 -488 103 805 -231 -604 78 208 -58 -286 83 253 -43 -171 20 309
3358 309 169 -328 -21 209 35 -248 57 224 -36 -144 -85 52 5 22 43 305 -197 -397 131 129 -155 -403
3380 -403 194 207 -32 -109 -194 299 -254 -163 58 428 -183 -204 207 393 16 12 237 276 -222 -455 -66 405 2
3403 2 -251 213 258 -394 -228 62 245 -245 -196 49 285 -127 -168 268 60 -126 -372 -78 310 280 -476 15
3425 15 27 -266 -322 191 138 -22 -163 249 238 -3 -219 313 340 -326 -503 391 144 -273 -179 385 313 -84 -294
3448 -294 330 20 -368 -170 190 203 -333 -174 135 193 -242 -196 11 422 -434 -116 227 132 -262 -175 116 117
3470 117 -100 -35 500 99 -498 -195 344 310 -142 -409 165 64 -87 -254 378 287 -257 -244 176 300 -404
3491d04K90K20o1o2l3K93J97p78k7Q40j59l95nK46K96q54J50L78N9l91M8M95j54
3514A89k30n7m0M41l68j44N04k95k29J26M05J1m19k67O74j09l08l7M96k55l09
3535b21k7L27p3n09M32J69K05l75j86N90j94m42J86K21L60p62J47N51r9m35O8
3556f7M12l01k28J13M81l86m27K97N50l11l90j34N42J39l34j89M50Jn31J67M88
3577C42j92o87N41J8m4l67L94K45k41k31J0K26K89o66L38J07O7n04K13M22j77
3598A03k54J62M67m25l95J67J87J0j66L8L65L1n84K95L73l67k02M12J96l33k90
3619b10K05L41j37p6m47P91n75k89M67J49Q9n25P2L84l11l48K87L01j06m86L30
3640i4K91k44L4q0N4n3Q8K25l9K1n70L01L03J6n83L11R6k96P5J39K64k33k60J46
$$ plain form
3491 -404 -114 106 45 -17 -50 243 440 -338 -365 475 316 -79 -84 162 458 -396 -246 132 191 -200 -152 343 189
3514 189 -41 -98 -138 303 -65 -209 295 0 -229 -103 302 313 -106 -373 301 192 -116 -153 343 88 -221
3535 -221 -248 79 6 -503 -71 98 303 -72 -258 332 138 -304 -118 103 463 -299 -152 399 300 -135 -67
3556 -67 345 44 -184 -71 410 24 -403 -106 444 133 -257 -391 151 290 -44 -233 217 218 -313 -146 342
3577 342 150 -537 4 22 -22 -389 5 250 9 -222 -212 14 303 -363 -25 82 149 -355 -142 280 103
3598 103 -151 11 478 53 -342 -175 12 22 -144 -106 259 290 -294 1 374 7 -195 217 413 80 -210
3619 -210 -5 336 199 123 -324 467 -108 -397 70 219 308 -217 -145 239 -72 -420 -133 168 62 -424 -94
3640 -94 197 -47 -13 -93 -39 -92 -4 221 182 203 -367 -66 237 253 -330 -19 77 -219 -144 -5 259 26 -234 -88
3664h8K47j13k84k3L01j67L1K44O7k27m19N22K84k21n10M66J8r2j77O9M76l45
3686E9p4J24J19N8o82L21O59m90m45K53N38m48j66J32K94l24k80M76K86m58j43
3707a91Q5J72j3l40L75K31m45j60L11L50m98KJ25L08n30J01%K13j77k89J53M18
3729B01J9m70J29L59l24j31K63K79m42KK25K34m28k77N34J11k91k66M56N8l46
3750a05j91L20J98j82n25M86M6j55k2K87j35K6r8M3L36l36J7L68j39l05j37K09
3772FM6k90P5K40J23m60k95P24O0l94j80P70j32n44Q7L58n2k18k10K62J52k29
3794a01j69M95L5m60J32J30K74l35j35M32k31k06j50M29K21m76J1L18J02p33K95
3815a22M81l68r0j42K42L21l43J89k89K56k29m7J35J84m24K29J89J71k26l22L11
$$ plain form
3664 -88 159 46 -238 -261 40 -127 -96 148 215 -12 -431 91 375 154 -356 110 128 36 -141 -72 404 59
3686 59 -15 109 228 286 -396 -75 584 94 -351 -98 440 -8 -174 -42 252 -72 -352 124 410 -48 -191
3707 -191 -106 66 53 -287 88 319 -126 -286 25 375 -123 -121 4 312 -218 -117 -117 96 -81 -370 -217 201
3729 201 220 -250 -121 238 -86 -217 46 325 -117 -115 110 344 -84 -361 173 284 -7 -273 183 241 -105
3750 -105 -296 24 222 40 -485 1 47 -108 -130 157 22 48 -50 -7 329 -7 10 378 239 -66 -203 6
3772 6 52 -238 -163 77 200 -260 -555 169 229 -165 -345 425 293 -251 -164 194 142 -76 -286 -24 128 -101
3794 -101 -270 225 260 -200 -68 62 336 1 -134 298 67 -139 -289 140 361 -115 -104 214 316 -417 -122
3815 -122 359 -9 -99 -241 1 322 -21 168 -121 135 -94 -141 -6 178 -246 -17 172 343 117 -205 106
3836A06J5p90M27N67k47k70J89O7o9m72Q2N23Mj75k02K96l1k39J1N15r8k51r2
3859a34q8K62r5n4L38K14o15J68K11n7l95j3M48j63j70k26L44J1j10J9M12k81
3881B6j89k51P08k49L6m53Q61k75l51j01M04r6j55J27j9j01k43K36J59J65m97
3902b58J37K42K12n80J34K90j89j25o4J78Pj06K51J18l19o8k41N11p5j38j6K34
3924A35J38l51L9M63j44o20K80J99K3o66K29L61J43m61K14K91j35l03J67L15l54
3945c7O9k05L74L2k47l20L37M9j71P9K46j41k49m6N61l03j17o5M72j18n53L00
3967e3K56j63k89K75M0J27m45M18k76L4R5q4J64J2k45P6N17k90n96L53K90m26
3989b10J15J37K21l03r8j18M71k20k37Q4K70Jk05j10K13J04l12J84o4Q2j61j1
$$ plain form
3836 106 121 -669 -242 325 78 -192 -3 64 -5 -477 -395 128 132 -43 -245 51 20 -219 -208 307 209 -42 -134
3859 -134 -222 40 -55 -109 229 443 -172 -4 207 150 -245 -258 190 27 -143 -369 -25 -14 -124 -105 307 26
3881 26 -163 -414 294 45 81 -372 489 214 -137 -238 166 70 -85 42 23 -78 -321 -85 74 239 -258
3902 -258 -121 121 333 -247 -113 177 -12 -137 -201 -23 -16 -122 129 247 -72 -140 -381 130 55 -83 -99 135
3924 135 273 -78 -39 424 280 -340 -60 139 162 -504 -275 86 229 -232 -18 273 138 -165 2 317 -37
3945 -37 32 -173 201 233 -14 -334 3 52 -119 -40 206 65 -184 -230 331 28 -89 -154 318 200 -353 -53
3967 -53 203 40 -249 26 66 193 -252 166 -110 -76 19 -65 99 111 -134 -58 459 169 -427 -74 216 -210
3989 -210 -95 42 263 -40 -138 -256 215 -5 -242 -158 112 113 -92 -202 11 115 -197 -13 -77 5 -156 -167
4011a67L33j68j3J6Q1pk86K78J45k92j85L14K15j95l89M06O0J1l90n7K01O0m79
4034e08L42N50n78O5L20k22j42j30L47J0j50k74K72L70k88l3k4P8j8r1M7K27k11
4057d1r2K23J28r8m73P5M65l00J17K50j19N5m81K09J48l43L15%J44k39J00Q9l3
4080I9rj96L59q8m06J76l5O20p10pJ94R5k83J98lJ40L3m02L74R5p05J26L33J2
4104A0M4j98O1L19n3m32L08K26n18J30J95Q9k72o2L61Lj15l66J64K24k76K0R1
4127d7K74l94lJ41J26k50J38M0j11o8j76N01Q7l27lJ55Q9m07J7M73j3l85r5L26
4151H8l4k95J97NL84l41j34J76J40n22L22N0k5m3n2L36k00k20J23K09J81l76l5
4174f6K40k02k49M58Q9L1p07K52M33P2n23K58p4J75m51K63j8J09q3j64L56J8o5
$$ plain form
4011 -167 166 -2 -15 1 82 75 -211 67 212 -80 -265 49 264 69 -320 86 146 157 -233 -290 -89 -29 -508
4034 -508 -166 384 -194 -129 191 -31 -173 -303 44 54 -96 -370 -98 272 -16 -49 -73 5 -13 -104 -57 170 -41
4057 -41 -133 90 218 120 -353 -278 187 -113 4 254 135 190 -291 -82 66 -277 38 38 182 -57 43 132 99
4080 99 90 -106 253 165 -241 -65 -100 520 -190 -197 -3 92 -191 7 4 144 177 -225 149 244 -461 -335 -2 10
4104 10 54 -144 -83 236 183 -249 59 285 -233 -103 92 181 -91 -153 208 211 96 -270 -106 118 -158 -138 -47
4127 -47 227 -167 -170 -29 97 -153 -15 25 -86 -154 -330 171 258 -69 -72 83 172 -235 -218 255 242 -143 -238 88
4151 88 54 -241 -44 -39 345 4 -130 46 186 -336 -14 36 11 -32 -84 252 52 -168 -45 164 345 -31 -66
4174 -66 174 -28 -277 181 270 301 -406 -154 279 351 -172 86 12 187 -264 -1 -19 90 7 -157 199 217 152
4197A52k94L29p7j35k51K31M08p18M18K12k29l05J79J26j01K04l18L14R9m84Q6
4218a54J62L04n05o2L12K19n59K55J65l2m12J19L86Mj96m33M61J98J7m16L02j3
4240A22l71J18L68j06k47R0J39l3j88K9J81O4j45k49K68J66k21m3r6N44n29j48
4262b87K58L31k72K2L6J1k90l9M92k07k43j31P60j09l84m3J54j93R5O3K01q5l20
4285a80j62M83j22l18J84L02j30k52N3K07J58m64K27K28k96j56J15J13K69m70
4305b11Q6M96n49N0J54J85k00l12K43K84j74r6k3K21P0l81K05K75l84n00N71L93
4327D03l55k73K85n2J7r5m6L25Rn92L09K37l54lK76o7k5k09J64R0N1k92L59j70
4351hj8j49K61J35l51o3K49K33l11j9j19L02k3j61q6M86m96j62N9N20m28l9J1
$$ plain form
4197 152 -142 187 110 -25 -276 -45 363 -355 63 275 46 -259 -80 46 -55 149 -169 145 244 -240 -154
4218 -154 8 312 -193 -255 57 276 -283 -28 137 105 -307 -188 198 202 6 -427 34 232 249 -167 135 122
4240 122 -249 -131 237 131 -116 -26 113 80 -108 -79 102 166 21 -228 40 206 -15 -58 -154 390 -139 -287
4262 -287 -29 302 30 52 88 99 -191 -230 262 55 -188 -319 441 332 -52 -95 59 -134 -39 24 225 140 -180
4285 -180 -342 141 19 -299 -115 187 57 -195 -142 65 223 -241 -14 214 -82 -238 -123 -10 259 -211
4305 -211 -125 371 -178 -128 26 211 11 -301 -58 226 52 -44 -67 154 224 -157 48 323 -61 -561 10 403
4327 403 48 -225 60 8 25 -70 -116 209 218 -374 -65 172 -182 -185 91 24 -1 -210 -46 44 95 -197 162 -8
4351 -8 -26 -175 86 221 -130 -193 56 289 -22 -41 -160 142 119 -42 -128 358 -138 -300 -241 279 -149 -188 -177
4374a77L00l62k57M70J15k38Q5R2J80l14j31M2M68l65j62L13K08m5n12M67R8r4
4396A81l72M18k72J23j21J03j07K48Qn3k72J26j13k35N95k58r7J30R9k64j82M79
4418A64j09o7l9j0j01k6P2Q7N04n12k62K81K12j86Oj77L01j86j73K59J63l14O5
4441d8p3K60k51k17M78R9l01j01L31J0n7k67L2L53k97q7j52L88P6m59N07j11k14
4464a01j06K11J69l74L01n0j74K08k87N9L62k58l16L16J61j78L6N3J08m47k9L69
4486C3J89l59j10O11j90k2m27N49K1n34J8L88K2l58P8J66O6j30j58J92J80l42
4508a17P0O2J61k90j14J60J99r3K1n0K70k56q5K14j5k96Q7J53J79l28j1K25Q7
4531B33l53J45J58j02j44l9M44m16M8m07O04k42l1j29N24j61j92K56j39jk20p0
$$ plain form
4374 -177 123 -239 -496 -26 89 -149 -64 28 208 -106 -237 -195 273 -92 -254 59 267 222 -290 177 275 181
4396 181 -191 227 -45 78 -43 60 -47 201 209 156 -116 10 -103 -338 257 -1 -98 32 131 -133 -315 164
4418 164 55 -12 -51 -61 -162 -188 -116 -29 475 -37 -299 -18 194 8 14 -163 138 -48 -221 38 201 -113 -48
4441 -48 -121 139 -112 -329 149 248 -53 -154 177 187 130 -137 -105 248 -49 -136 -288 100 176 -283 224 113 -101
4464 -101 -207 4 173 -201 100 50 -124 84 -203 -144 218 -40 -356 -40 121 -57 -21 32 140 -307 -336 33
4486 33 222 -137 -247 364 174 152 -275 274 295 -239 -221 167 189 -169 -91 75 141 11 -147 45 225 -117
4508 -117 -47 15 176 -114 -228 -68 131 38 59 9 279 23 -62 152 137 -159 -72 81 260 -68 -79 146 233
4531 233 -120 25 183 81 -63 -102 342 -74 -26 -433 171 -71 -102 -231 293 132 -60 196 57 56 -164 -234
4553b34K94K10k38k41K40J07k09n9K71N0k71J59J40O5l83J67J02q1l54J44K49
4574A28j44q6Q6J47j2m8k36M38K8l78n8K45J44m59o3N06j76n04K95K94m2l14J23
4597h6J22o9P2j14J71J39j37j67J71R4m00O8R5J46m42K65L14k88p5J67Q7k65j89
4620c21K29L44P7m41J11o2L53n21rK12p3j63j36N45L43m54j41L26n8m90K61K79
4642B11k44J62k49K38j2q5l21N30j75j7k69N79k33k14P9m0J40m23M69R2k49k17
4664b48M7K65m9o0j4j26L87n80J23N82j74j21k47L09qk76K32R6q1k38j1N59l86
4687a9k07J84L03m14k27M28K22m25N1N1J70K2m70L20K06j50m81M68J49l13O6j58
4709b24M88n42M6L27Nr9n09M41K89K1k93l9K39k71l40N39J96j12m65M0N94k04
$$ plain form
4553 -234 60 270 32 -209 31 138 -71 -130 141 191 -80 79 219 284 -99 68 170 89 -265 -121 128
4574 128 -16 -102 -16 131 119 71 -165 273 301 -77 -135 110 254 -205 -268 238 62 -442 -147 147 105 -209 -86
4597 -86 36 -33 39 -75 96 235 98 -69 102 196 -204 -136 -41 105 -337 -72 242 -46 -121 46 133 -132 -321
4620 -321 -92 252 329 -112 -1 -63 290 -231 -240 -28 -101 -264 -400 145 488 34 -107 219 161 -329 -68 211
4642 211 -33 129 -120 118 106 21 -300 230 55 38 -231 348 115 -99 -20 -60 80 -343 126 218 -31 -248
4664 -248 -201 64 15 -45 -59 -185 202 -378 -255 327 153 32 -215 94 86 -190 42 138 57 -181 -192 367 -19
4687 -19 -226 -42 261 -153 -380 48 270 -155 -104 -53 117 139 -331 -11 195 45 -436 32 181 -132 -66 -224
4709 -224 264 -278 -232 95 100 1 -508 -67 222 243 -50 -89 150 -121 -461 78 274 162 -303 -263 331 127
4731A27l92J46K27j21j28nN06l56j6pM98o79K33m6L47m24k8j8K60j35n5J91p9
4754D6J94p4k95K58L2k89M7J59j49nP8j16K11l79K16j74L85k74K29J04k42j79
4776b17J88K31l38JJ96p7J81k96m6L93j57k93L30M4m83L62j4n7J89k18J54J51
4798B24l18N4P2J58l16J55q0K75j45l17L80j81r0L5K76J35k96j08J80n8j37P8
4820b4J96J2k21k87J78M94k09k09K36K4k26l54O23j26j43j68J3L39k85k9J61K06
4842B01m53J32K21j02K52p12N06M01m36O9L49m00l82q7N10J55j89q9L7K05n25
4863c37M6L23j78J25P5L9J87j47j49k0J0l02L54j38M30n21oL78k22k39J27n9K88
4886F4k26J29J19K10l48k49L59K6n9p4K02J38m47l5O33m32o8k84M24j6k52K46
$$ plain form
4731 127 -265 -119 108 -13 -141 -146 360 4 -12 -19 479 -200 33 -13 334 -90 -118 -136 124 -11 -66 125 46
4754 46 240 166 -129 129 161 -128 -81 78 -71 -76 2 -114 97 -282 -66 -240 145 -129 100 204 -38 -217
4776 -217 -29 202 -136 -135 61 -16 165 -131 -177 216 59 -234 96 140 -343 19 5 -52 137 -81 73 224
4798 224 -94 -40 32 190 -126 29 -51 224 79 -238 142 -39 -129 -94 182 317 21 -87 93 35 -102 -24
4820 -24 172 184 -37 -324 -146 348 139 -70 166 190 -36 -390 233 107 -36 -204 -191 148 -137 -166 -5 201
4842 201 -252 -120 101 -1 251 -461 45 446 10 79 428 28 -354 -441 69 224 35 -54 -17 188 -337
4863 -337 -291 32 -146 -21 54 93 280 133 -16 -36 -26 -328 26 -112 318 -203 -209 169 -53 -292 -165 -224 64
4886 64 -162 -33 86 296 -52 -301 58 84 25 -49 153 291 -156 -191 442 10 -58 -342 82 66 -186 60
4908F0K05m08P9r4L50j5j59j26M57Ln20J64k7K33m99J41J78O1j30p5K13K73m06
4931d2R8o4k7q6k38M39J44n16k0M12l3k06k9K65K57n45j03K96N3j03jK45p9m38
4955c21K59J41Q3n7l15N18l47m1RQK53k89j5K85L7l63M5K62k78j26K19J86K33
4978C86n13k9K16n7k25j26N84k4m26L8L49L6l82N3J14P9j44L7K59K2n16L2M79
5001B42l7n36m2K73J68k90R0N79l95m06J97L94j06l54K04M06j99j58j25K51n0
5022A06l06KL31j85K2r1L90j20m78J71L31k26j03J1L78j43k10N0L56l47k61K83
5044c9P7jl78O1L27J73m34L13N6k2l35L92q7m2k42K77j59K44l63J53J27p0l43
5067c15L62J90k83j27K37o8R9l37L73o9K12k62o9K7J06k32J82J3J39n80K71O05
$$ plain form
4908 60 265 -143 -64 -158 192 177 18 -108 349 352 -168 -4 -31 202 -297 -156 22 83 -47 -122 91 364 -42
4931 -42 56 -8 -35 -121 -359 80 224 -292 -312 100 67 -139 -168 97 354 -191 -294 2 55 -48 -49 196 117 -321
4955 -321 -62 79 162 105 -210 308 -39 -80 -71 -63 190 -99 -114 171 208 -155 -110 152 -126 -252 -33 153 386
4978 386 -127 -156 60 3 -222 -348 236 212 -214 -176 173 209 -173 -120 -6 73 -71 -34 225 247 -269 -237 242
5001 242 205 -331 -373 -100 68 -222 -132 447 52 -354 -157 237 131 -223 -19 387 188 30 -95 156 106
5022 106 -200 -198 133 -52 -30 -121 269 149 -329 -158 173 -53 -156 -145 233 90 -120 -70 286 -61 -322 -39
5044 -39 38 37 -341 -280 47 220 -214 99 155 133 -202 190 103 61 -181 96 -63 181 -182 -29 98 28 -315
5067 -315 47 237 -46 -173 64 -4 95 -242 131 62 274 12 -57 -30 76 -156 26 39 178 -402 -131 474
5089D74n54j34J16N63n59o7J72J11j00l03J48L05M6l38j75M27j45j05J15J89l48
5110a62j20K56N76o33l45N32J18j83j47O2M32o31Q8J38K59k53o9q3L10r6l17J67
5132a01K27j28j98J43M45l10l85K97m9j07P5K52n9M6k82N7R7J31k51J57K84j52
5154A89k17j93M69j56k94K16N21l82m89O17j32l04o4L17K54l32k10M10l05L4K6
5175b5K68j00q4j40j2L03l02k44M61K54n39j7M22Mo49M39j65M26k63k75M23j85
5197@J86m43J67J61j14m4K85j00j29k11K36K68l02KK51j99k33j70M71M21o47n7
5219b01J85l7N3N1k6J65l58o1J31R1o0j35J69K68l28q1J42M39m98p2J38K90l33
5242f8j33L47J1k14J3N3K47J1l24j14L83m11q0P6J73j87j30L95L57o00J19K42
$$ plain form
5089 474 -80 -214 -98 465 -94 -161 11 122 22 -281 -133 172 218 -120 -295 132 -13 -118 -3 186 -162
5110 -162 -282 -26 550 -83 -428 104 222 39 -108 -46 386 -245 -157 -19 240 -13 -82 -165 145 49 -268 -101
5132 -101 126 -2 -200 -57 388 78 -307 -10 -59 -166 -91 161 102 148 -134 -77 20 151 -100 57 341 189
5154 189 -28 -221 248 92 -202 14 535 153 -336 281 149 -155 -219 98 352 20 -190 220 -85 -51 -25
5175 -25 243 143 59 -81 -93 210 -92 -336 125 379 -160 -177 245 249 -400 39 -126 300 37 -238 185 0
5197 0 186 -257 -90 71 -43 -87 198 98 -31 -242 -6 262 -40 -38 213 14 -219 -389 82 503 -144 -201
5219 -201 -16 -53 0 51 25 190 -168 -229 -98 -7 -67 -202 -33 235 -93 -174 -32 407 -91 -163 -25 265 -68
5242 -68 -201 146 157 -57 -44 9 256 267 -57 -171 212 -199 -279 -203 -30 -217 -347 48 405 -195 -76 166
5264A66l5K5m51K85lj41L1K23p3J29l29M44k0k89n6J80J79l25k37K08J30j99j12
5287b70J73L05k11J33K6j03k62K4L47j40o0k62L73Q8k09M2k4K21l88K7L1L53j42
5310G2l04K60kj25Q2K16k50j16n1M73j16j11j15J59N8q4j94lK59k03k94M03K81
5333B95m43P8J43K23m92J18L86n04K06R1K4j37q1L3L0K84n17J13L62m9k56k75
5355c68M88n9j06k33K58J9j57K8J96q0j61j35M94J72m91N7J09J9l02L70n0J17
5377A85m68K22L53k38p6l10O05j60k19j3L67m45j9P1L48j04m50J87K52K04o28
5398c36l7M10K12n08O8K98j28m60L81PJ84l70J89J95k24Q6K90j48q7l2K3K71M0
5421C24o75J22K47O8l22K42L27j86k78j7K22L05n83J76L54k47N1k69K83j00l13
$$ plain form
5264 166 131 156 -295 -10 -13 -154 -123 100 27 156 -173 271 251 -38 -94 86 265 -60 -297 -89 41 -158 -270
5287 -270 -97 208 -3 130 156 53 -209 -185 162 22 -38 -300 73 161 -48 -6 -30 191 -197 -170 -139 214 72
5310 72 -232 28 26 -99 -17 199 -51 -167 -218 255 139 28 -87 72 130 46 -148 -151 108 -95 -389 14 295
5333 295 -148 -70 73 296 -196 -78 308 -196 10 101 125 -12 -93 -60 -30 254 -263 -150 212 163 -93 -368
5355 -368 120 61 -45 -278 -20 -1 -158 -130 66 -14 -175 -310 184 356 -135 -78 31 50 -252 118 68 185
5377 185 -283 -61 292 54 -22 -332 273 113 -106 -119 248 -197 -216 -145 203 99 -351 -164 88 292 -336
5398 -336 -373 37 249 -259 -191 107 -21 -481 -100 -93 91 -279 -90 105 -119 -33 257 109 22 -10 13 284 324
5421 324 -351 -229 18 86 -236 6 333 147 -131 -148 74 379 -204 -28 326 79 130 -139 144 44 -269
5442b69L48L57p04P2K53q9K01j84j98M70n0j31j92L02J0l34O2M02l50l18J99L43
5464B00j59k56K18K01m52m3J36J55j52o5J42J25n9l54L87J96m57q4L19J28k7j27
5486b8j54K54k4l10K80Rn6j7k86L24p1J59l62K69M7k79M08M4K2n25K78L5K40l01
5510d4J59J58k44p1j09Q7k35K21J01J42l30j03L01L14l79j06L45j14r2m42N35
5531I4K82j94j65K54M7l17l07N24K04m37k81L4M18k53n1J03K51k83k38K19N26
5552D30n02j46J77n0J54j98mL30l00k03J39L73l51O9K7L26k42k37K64P5j54K0
5574cO0P1k35j69L32m1P0j32J02J78k34k86J30J32j70LN23j02l76l7N03j60k77
5597a18j49J82K21j58k24K00J6q5p2J4K93k24J70j95L95m84N2J49k2p5O1P8K63
$$ plain form
5442 -269 79 436 -268 -196 57 -32 169 -15 -213 257 207 76 -116 186 196 -138 -76 326 -24 -342 -143 200
5464 200 41 -215 3 204 -248 -291 -155 0 -152 -217 -75 50 -9 -363 24 220 -237 -321 -2 126 99 -28
5486 -28 -182 72 48 -262 18 27 -29 -46 -332 -8 -79 80 -282 -13 34 -245 163 207 229 -296 -18 17 257 -44
5510 -44 115 273 29 -42 -151 -64 -299 -78 23 165 -165 -268 33 347 -32 -138 207 93 1 -441 94
5531 94 376 182 17 271 318 1 -306 218 422 -15 -296 -262 156 -97 -148 -45 206 -77 -315 -96 430
5552 430 -72 -218 -41 -91 63 -135 -139 191 -109 -312 -173 200 -151 -82 -55 271 29 -208 56 131 -23 -3
5574 -3 57 128 -107 -276 56 15 85 -47 55 233 -1 -287 -157 -25 -195 -192 331 229 -147 -184 319 159 -118
5597 -118 -267 -85 136 -22 -246 -46 -30 -115 -187 -173 120 -104 66 -129 266 -218 -166 -17 -39 -114 -53 25 288
5620B88k70k17L83j05o8k95M49j16j29qJ51J0k53k9K34L25o09K17qK2j20j38N41
5643B55j16m95L32L4N4p1j71J64J13r0k09M4L51k93L2M13l04l09J37L89J82m79
5665c7j98N53m3m70J93J72k59Q4l04K49L39m70L1M15k01l72J62J98K62m84j3M
5687a89L18j56j54J81n6m8K55k31O7m4mJ82oJ32o34M08m4J07j32K4J28m93L58
5710c1nM32l41J6j85K43l43j65P93k07l32L1J06o4j32J50O4J28j73K04rk05N2
5733B7L9MK09m41QK64L56n40j41L04K08l32k11M00o7k62M0K56J71l45k37N00k0
5756A90j56k75M53n2n4L7j12R1j53p9M38j04n85Q2L50P7k67q5J74K15k90J21J40
5779A56k22j56L4K64p1l69K10L93j46k14q0K16R9l55K79K52k69j07K05r8K9k35
$$ plain form
5620 288 18 -199 184 79 11 -284 165 49 -80 -88 63 73 -180 -209 25 350 -259 -42 -50 -28 -148 -286 255
5643 255 139 -356 -24 10 64 -7 -178 -14 99 9 -200 -156 195 -98 -66 347 43 -266 -129 260 442 -37
5665 -37 -235 318 275 -195 -2 170 -89 -5 -309 -60 279 -191 -160 255 54 -318 -156 42 304 -180 -193 -189
5687 -189 129 -27 -181 0 -56 -104 151 -80 -13 -57 -61 121 115 247 -387 21 -23 84 -48 -24 104 -389 -31
5710 -31 -36 396 55 71 -114 129 -214 -379 414 207 -125 -94 12 -52 -184 -34 30 158 -15 189 180 -25 27
5733 27 66 70 279 -162 -154 110 466 -74 -215 89 297 -35 -246 154 87 -175 -135 121 292 -53 -290 210 190
5756 190 34 -241 212 160 106 143 31 122 -31 -110 328 224 -361 -279 71 148 -119 -204 -30 185 -105 16 156
5779 156 -66 -222 -188 76 5 -364 -154 239 93 -121 -201 15 114 -241 38 290 21 -86 119 21 50 -185
5801a85R6K45q7k8l99M85J53k42j25K28K00m38N3R1l5J11k19p1J96m6j1J20K5
5824A17l18J0K47J66l84R3J93k9l04n8N78l02l84L65J10n3j77r7J99k15L75l4
5846I8K01k54j03J21J12J61m98Q1J99j19l51Q0L10r6J37k06L10Nl91L02l5J13
5868A77n74L95K23k00p8j20O05l49j67K17L4l31m07O18P2p2P0j1Q0l59K7P0M15
5891C35m67j82K91j7mO0j69L5K81m11J33J36j21k05M92J65m78k76L71K18q0j88
5913h1rK74Q1m66J76K89L8m85QL29j47j94M50k61K3k21K73J06K8l69J23J15Q0
5936A60l3j42J73k23J51j18K11O4m95J75K34o5l56N95m94J00N5QR5k48R5J55p0
5959B7j75l00N50J87k61l26M19J91k80m14K41L74l90J9K44N6P2n33K41J69k62
$$ plain form
5801 -185 -89 156 69 41 -358 127 280 38 -87 141 341 -97 -44 47 12 123 -96 -167 29 -17 -28 92 117
5824 117 -201 -191 56 222 -162 -69 124 95 -209 -267 311 9 -375 -10 100 47 -130 -227 -28 -243 132 98
5846 98 299 45 -58 63 175 336 -162 -81 118 -1 -352 -272 38 -58 79 -127 183 188 -203 99 64 177
5868 177 -397 -2 221 21 -57 -177 428 79 -88 129 163 -168 -575 43 115 43 113 102 182 -177 -150 -80 335
5891 335 -132 -314 -23 -40 -44 16 -153 -118 163 -248 -115 21 -100 -305 187 352 -126 -402 -31 187 107 -81
5913 -81 -90 184 265 -201 -25 264 302 -183 -175 154 7 -187 263 2 25 -196 77 183 211 -158 -35 80 160
5936 160 127 -15 158 -65 86 -32 179 243 -252 -77 157 92 -264 331 -163 -63 -8 0 95 -153 -58 97 27
5959 27 -148 -448 102 289 28 -298 121 312 32 -382 -141 233 -157 -138 106 162 234 -299 -58 111 -151
5980a51N0R9R6k68l36M42L08l79n1N46k04k43nJ05j20L2J59o6K24k28L4J11J36
6003B91k16k27J39J05j91M1J82O5n27J11K07R4J17n8J55q5m36K35o0L32j05l26
6025a57L90j39k04j88K11M08l39RJ28J74l97j41K16j88J03J08q8J80j86k73K51
6046a22K64k3l17K57J16l80J55J04K18k76k18L52m2p4k45L90j07j23o7J47N4j01
6068c8j72M34j98j32K09m4r7Mp1K04m2j24J74J13m3m39K41n4J89lm10K74K89k98
6092c4j64K40J13k21rJ03J33l83K89k5k8j36J34J4q2R5R5l9O6%l09K89K44k49
6116A36l41M17k36j82mO57j73k29p3J1K42l57l7K86J1m68N0L18J48j98P6M8j7
6139H5k73r3N34Q7l86K22l3l4m43M87o0n8j93m8L99l01J99r6J60j1k31L2J88J19
$$ plain form
5980 -151 -101 -2 94 -174 -510 -68 240 -139 -190 356 152 -91 -96 9 -111 -79 80 14 238 10 44 155 291
6003 291 75 -152 -13 92 -99 -58 124 189 -338 -227 -20 74 191 133 288 203 -233 2 -58 274 169 -157
6025 -157 233 94 -110 -298 -87 321 -18 -9 119 293 -104 -245 -29 -217 -114 -6 -94 86 -100 -373 -122
6046 -122 142 119 -198 59 175 -205 -50 54 272 -4 -222 130 88 14 -231 159 52 -71 -138 9 63 -38
6068 -38 -210 224 26 -106 103 59 -38 -34 -105 99 57 -67 107 220 177 -262 -21 -75 114 111 -299 -25 264 -34
6092 -34 -198 42 155 -66 -75 28 161 -222 67 42 14 -122 12 26 -56 39 134 95 161 161 -148 141 385 136
6116 136 -205 212 -24 -206 -210 447 274 45 -28 -17 225 -132 -169 117 128 -340 -290 28 176 -22 54 102 85
6139 85 -188 -281 253 340 -46 176 143 109 -334 153 93 35 -158 -206 193 -108 91 -5 155 144 -87 -55 133 252
6163B52k56qJ41pj37J28K0J68k36j76R7J08j53p0K47j85M3j94L31J00m85J21L08
6186A57k56J76j56J24l2p7J64n8k41J96k26N12j15m04j9M28q5l51J84J54M2k41
6208a24K04jJ14m59J44J77L04n15n8M02l00k12J54K06j87J53j8R2k9l42K18K97
6230B20l57j07M18k62K2N3r6L56k66L3p8R4K19l78k39N61k25M8K69j71p1j66L17
6253A94J1k10J6k16K59k05o4M14Kj41R5k81K96J08l78N2K71k26Q1k21J39q1m0
6276a25K68r7J71m76K79P9j6k00P4J31J03j46j96j3O4j98L86J97k11j73J51k0
6298C2J80m59N42M9l21m10K75J34o0k24M9O19m27j58J46J09p0j73K85j2j74j22
6320a90K18L9n9m21K80L20k96m5J42J17k77K05Q7QO1k79l5O12m56j98J46L59m64
$$ plain form
6163 252 -4 -12 129 122 -15 113 133 301 65 -111 -14 94 -59 -129 118 -67 -24 -218 113 213 -272 -151 157
6186 157 -99 77 -79 45 13 -64 100 42 -199 -3 -229 283 168 -236 -255 173 88 -263 -79 75 117 -124
6208 -124 80 79 193 -266 -122 55 359 -156 -214 188 -112 -324 -170 36 -151 2 -16 76 47 -295 -77 220
6230 220 -137 -244 174 -88 -66 -13 -109 247 -19 14 -64 30 249 -129 -368 193 -32 16 285 114 43 -123 194
6253 194 205 -5 11 -205 54 -151 -215 199 201 60 155 -126 170 278 -100 -48 223 -3 78 -143 -4 -85 -125
6276 -125 143 46 217 -259 20 99 83 -117 -43 88 191 45 -151 -164 -100 -298 88 285 74 -99 52 32
6298 32 212 -247 295 344 23 -387 -112 22 -38 -262 -213 406 -21 -179 -33 76 6 -167 118 106 -68 -190
6320 -190 28 67 8 -413 -133 187 -109 -154 -12 105 -172 33 120 128 189 -90 -125 487 31 -167 -21 338 -126
6343a26KL87k55j87K11j06L28j07k18J75J36j55k73L45Q6j25l96M37N2l24J94
6364H1K32j75L1k42N0M6P5k57K53K07l20k58L33K90n67M39k84K27j55%P7o9j22
6387a08K01K59j33n09K39J25m7o0p5K60k2P9m47P9J18J15K06j09k43k46K51K26
6409A59k35k55Q8K93j74K21l44M22r6n4k49K32J05r3j44K69j02j83K12r1M06n33
6431a46L1Q7Q6j02k46L89n5p8N4j30O45n80k79M11K09l21j65J49K73l67n8J87
6453fn1j03K60r8L90p30K49RL20k71k31N37m10L0PN6N2j43J78p7K72k73O6m0P8
6478G1q9Q3j49L3P8k43O52k75l55J76K8R9l04J87O7j01O7j37L23k67J83L8j03
6501F2o9J07k91L91k24l2P5K85l00m6nJ09J64j37j12pQ5j5j27K50K0k86J29J86
$$ plain form
6343 -126 -124 263 8 -179 32 -74 254 147 -71 104 240 85 -188 157 243 118 -278 159 211 -113 81
6364 81 313 138 169 -73 -23 23 98 -159 94 301 -19 -277 56 346 -221 218 -66 161 6 6 83 14 -108
6387 -108 93 352 219 -290 -51 74 27 -33 -108 152 130 209 -238 -159 -41 74 280 171 -72 -318 -67 159
6409 159 -76 -331 -243 50 -124 97 -247 175 79 25 -224 8 113 20 -124 145 43 -140 72 -19 387 -146
6431 -146 -115 -28 58 -44 -290 99 44 -34 20 -110 535 -45 -324 87 296 -25 -190 -41 232 -135 -193 -6
6453 -6 -57 -160 100 2 392 -338 -89 -80 240 -31 -262 275 -135 -105 -98 -42 10 -133 45 -32 240 -33 33 -7 71
6478 71 -18 65 -84 -51 27 -216 436 161 -194 -18 10 109 -195 -8 59 -42 25 -112 211 -56 127 165 62
6501 62 -7 100 -191 200 -24 -56 19 304 4 -42 -47 62 226 89 -23 -30 55 40 -87 163 183 -103 26 212
6525B12l79J49k05Q8J62j67k03M66Nj35K6J91j44j45J13NJ44j46k08L00J8m03
6547b56L8K72P6m80J68M47m4j99J95j97j22k37K74J47j34p4R9m6L17l44o3L05
6569A42k1j69KK82j75l54K35j10L5M85n30M75m13L7P3O9k75J61j53M23J6l86K19
6592F8m1l5M1j57L6J64j58k15L63J0k48K41J32J51q11K20L40nm23M26j39J9j74
6615a95L35L6k31j82J40K38K10o91K39L87j53j80l9J55j4k34n8M69m62m6L9M61
6637B24j62q7j19J71J4k32L04Q5j40j19Q2J03k0k45r1L87m00J51j66L87j86k11
6659b70K65J47n6k20K30J0p8j13j1L34k30l00K87k2o8R4j36K60J13n00O14k12
6681A38m9k10l8M66l44m0J12Qk17l6J55L7j26Q6j5K59j89j42l8K96q0k8m0J75
$$ plain form
6525 212 -167 -18 -223 -135 27 -140 -343 123 128 -7 19 210 66 -79 34 39 183 37 -171 129 147 -256
6547 -256 -218 54 130 -350 -182 265 221 22 217 20 -102 -339 -65 82 -52 -126 -27 -73 244 -100 -163 142
6569 142 121 -48 -46 236 61 -293 -58 -168 -133 352 -178 297 -116 -79 -6 63 -212 -51 -204 219 235 -151 68
6592 68 27 -8 33 -124 -88 76 -82 -297 66 76 -172 69 201 352 -459 -239 101 96 -327 99 -40 -21 -195
6615 -195 140 176 -55 -237 -97 141 351 -340 -101 286 133 -47 -86 69 55 -179 -237 232 -230 -276 -237 224
6637 224 62 -25 -144 27 41 -191 113 198 58 -61 21 124 104 -141 -232 155 -245 -94 -260 127 -59 -270
6659 -270 -5 142 86 -134 96 106 28 -85 -96 238 8 -292 -5 -27 -95 -1 -137 123 236 -264 350 138
6681 138 89 -121 -159 307 -37 -77 35 43 -174 -210 -55 -18 -144 -58 -73 186 -3 -145 -183 113 33 5 -35 140
6705A40j93l4mK19j74l82N69q7O9k99N5K14j30k71L94J59l74M5Q6J74l34K8J70
6728D0Rq4K6K60k24k6k93K35Q3j8k30J54Q9K08l84L90K31n78r0kP8M3K6j65K47
6753B5k39M05jp7o7k83L83r5L0k58K53J82l94J84k6j6l00J34J97J3Qj07K4p4j29
6778b28k0K40L29m18J86l7j14j10j13M30j05Mj61m7J95j48J30j50K06k41L7J22
6800a3o6n9J34L0K05l31m9K08j72k16J59K16Rm4j92L38j49j44J9L93O0m94K04
6823D6j06L06k21l76L20P4k89L68j63J92L9m39K62pk73K22L1M1k70j5L42j07n5
6846g8N7N8rQ5K5j23N5p4l79M48p8q1J08j34K47l0k26J34m2m1j80N09Rl73n6K69
6872A00k07o6N8L70m4j63k84M62j0m15lK78M4k44Jj5K75j94k57J91m5J02l8N4
$$ plain form
6705 140 -53 -87 -91 128 -46 -428 141 54 123 -176 -121 93 -37 -308 86 245 -129 -84 2 176 -158 -130 40
6728 40 49 -35 -9 251 27 1 -292 -57 26 8 -222 -68 21 229 -155 235 466 -112 -202 -204 -126 -83 -57 -222 25
6753 25 -214 191 190 113 46 -237 146 51 81 -177 76 258 -136 48 22 6 -294 -160 37 50 58 -49 -25 -99 -228
6778 -228 -248 -8 321 -97 89 52 -62 -172 -285 145 40 44 -117 -164 31 -117 13 -137 69 -172 -135 -13
6800 -13 -79 -138 -4 26 231 -100 -149 59 -113 -329 -170 46 55 11 -181 157 8 -136 -117 276 336 -158 46
6823 46 -60 246 25 -351 -31 43 -246 122 -41 151 190 -249 13 6 -267 -45 -14 27 -243 -258 84 -23 -78
6846 -78 -21 37 28 113 138 15 70 -4 -383 65 -13 -94 14 -120 127 97 -129 5 -37 -78 -258 251 260 -113 -169 100
6872 100 -107 -173 -115 255 211 48 -236 226 216 -199 -202 76 120 -124 -123 -138 137 -57 -314 -123 -168 -66 -104 -50
6896e0J28j45P7O7Q1k36p2kR8j24J44K56l95K4J8M40j57l86Q2j68M42j20k5J73
6920A50J53p04L29J79j14Ql1J22j02R6j37M1N9k3J57m12O43n40M1J76J42j22j17
6943fN7r4J32r7J66p1j27kQ5m4KK6J93k70J16j77j12P9J31j18K09J76m77K66Q6
6968A29j87L0J71N8j83j44J59q0J85l57N54j92Q4o5k74K20O5k18l1L08k92L4J06
6991H0j42J14k68J75K03j29j89N2j16O26m25J78j27p1p9mlM1q7J50L32j30j68
7014A3n1J79j05j35J91K44m98j55K1L25o1n6K66l17K43j62K21J27p6k04j45K34
7036I9j45J7j7o4K07l09J71L1k2m4M0n4J84j02j41oR2n8k0J78J11n3r1J14j04
7061A4o1J71M5n1j2r2J30p9l15K35J22j45q9L21K71l74j71J45Q7J70m64K39k1
$$ plain form
6896 -50 78 -67 10 77 158 -78 -150 -152 -54 -178 -34 222 -173 -149 -131 309 152 -234 -152 -320 122 2 -23 150
6920 150 303 -401 -72 107 -7 1 -30 92 -10 86 -51 -10 49 26 183 -229 414 -126 -85 91 233 111 -6
6943 -6 51 -43 89 -8 158 87 -40 -42 43 -1 1 27 220 -50 66 -111 -223 -144 -13 -131 78 254 -223 43 129
6968 129 -58 -28 143 201 18 -126 33 -47 138 -219 335 143 227 162 -112 108 173 -45 -76 232 -60 -26 80
6991 80 -62 52 -216 -41 162 33 -156 -104 -220 406 -19 159 32 -39 -118 -122 -125 -84 -171 -21 311 181 13
7014 13 -38 141 36 -99 92 336 -162 -317 -296 29 -32 -88 178 -139 104 -58 163 290 214 10 -135 99
7036 99 -46 -29 -46 -110 97 -212 -41 -10 -32 -76 -36 -90 94 -8 -149 -155 -63 -121 -141 37 148 95 4 118 14
7061 14 -47 124 169 118 106 14 144 65 -250 -15 107 -38 -127 194 465 91 -80 65 152 322 -142 97 76
7084G6o1R9k38k6j2N3J9J66M7j76J37R1P0m75N07k83j49J20K5P3k78K56k12M05
7108B34n2l74Q0J98p6%P0m0j39r9J1K54j03K7K21j77j23j19M26k51L8J2O4O5k23
7133g6k91L90K67m24j31K61l5q9j03K23K0q%j27L33k59K45k13Q5P5q2j78K06J46
7157B35k83J07R0j33j88K10N9K0k94J88j30J10J72l47L82j49Jk59J49P6l02J23
7179a63K93k40J71K37k88m2j70L63M5o35L73M4r2K0p0K73P3j14m03K94k1Q7r5
7202f0r0L67j55r9j11K35J21k49J14M5j17k28L10M0j70P9j5j99J69n2N2J38r7
7225B8k64K32R0p9k61k1L00R0l50J66J28k10j6J90q9l8N1K72j59j07p8M96j54
7248B17j13k58K54j1k08m4J80M8k60J0J53L07q9m08J07R3N5J05q4J62m18nK24
$$ plain form
7084 76 15 114 -124 -150 -162 -109 -90 76 123 -53 84 175 245 -230 277 -6 -155 -35 -10 63 -215 41 -171 234
7108 234 182 -192 -112 86 10 10 80 40 -99 -198 -187 67 -36 -9 212 35 -88 -207 219 -32 6 18 82 147 -76
7133 -76 -367 23 290 -134 -265 -4 -39 -128 -231 -8 12 4 4 -123 210 -49 196 -17 68 143 61 -117 89 235
7157 235 -48 59 149 16 -172 38 97 117 -177 11 -119 -9 163 -184 198 49 50 -209 -60 16 -286 -163
7179 -163 130 -110 61 298 10 -32 -202 161 206 -429 -56 -12 -104 -84 -154 119 192 78 -325 -31 -52 35 -60
7202 -60 -150 217 62 -37 -148 87 208 -41 73 118 1 -227 83 123 -47 32 17 -182 -13 -65 -13 125 28
7225 28 -236 -4 86 7 -254 -275 25 115 -235 -69 59 -151 -167 23 -66 -104 -53 219 60 -47 -125 371 217
7248 217 104 -154 100 89 -119 -163 17 65 -195 -185 -32 275 186 -222 -115 -22 33 138 54 216 -202 -207 17
7271A7K89m15N9kP8j88J71l2J51p5K8l31J07K97k44O1J6J23j93QK24n7k86J94
7295@p2j86P3J50K69p8j82J0J66o6k17l4J67j36J57j25K43k76k9K92Qj9k54J98
7319E9k05L23j92J82Q7l23k50M04r8k11J57K18k29J03j82K11k32K78k27K74JM6
7341A94k81L16j22m3k48L04k3J96q4j50Jk58K9K58J31l38Q2m6J21q9P0R6j2k37
7365a33K11j9J59l40J38j46K56m4j13J60j51M3J15r5kj39K83l5k28J43j44M13
7387C32k60J09r6l5j06q6K63J3l09LK27o0k84K17k5P1j8l3J7J5J52p7L9pk41K05
7413B6J48j33jl69J70M92l58K4j4J73Kj41J0k6r6J34J58j7r9j11M2K13l53K67
7437A41j35R4J3r9j71K34j80m5J73Q0kp5r5L44l25K23q8N6j18l30J75J44r6m3
$$ plain form
7271 17 306 -109 -50 -52 26 -162 9 -23 128 53 81 -250 -143 154 -90 -29 -13 110 -83 -75 149 92 -194 0
7295 0 -72 -258 -185 -35 234 156 -26 -16 150 84 -133 -167 0 -136 21 -104 139 -137 -166 126 134 115 -139 59
7319 59 -146 177 -15 167 254 -69 -319 85 -13 -224 -67 151 -78 25 -157 54 -178 100 -127 147 148 194
7341 194 -87 229 107 64 -184 120 97 293 209 59 60 -198 -169 89 220 -118 -36 -82 39 -50 20 116 104 -133
7365 -133 78 59 218 -122 16 -130 126 82 -31 129 -22 21 136 41 39 -100 183 148 -80 63 -81 332
7387 332 72 181 85 50 -56 -142 121 134 -175 -172 55 -5 -289 -72 -97 -26 -44 -77 -60 -45 107 30 69 62 -179 26
7413 26 174 41 40 -329 -159 333 -25 -1 -15 158 160 19 29 3 -93 41 199 182 83 -28 14 227 -126 141
7437 141 6 100 113 14 -157 77 -103 -148 25 105 103 28 -67 277 -48 175 87 143 25 -305 -130 14 -82 -125
7461a25J42J04o1r0P5R8q7m6j80K75k90M03j19j9M9j67M0O6M8n50M39j40J48j73
7485a60K77J0j10k20P6K40j16j29J31j8n3J6j57K63k01K94k31Q5L0j83K21K02
7507B67o5m47K39j8r0J47j81KK43k93r4M34jj73J05k0j55L3r4K04J44k42j06K54
7531I3j51m0K61m7K1j03k2JJ65j93O8N2l6o5L4r2M7r7J67M7l00J98j32PJ32P6
7557I1j47pN7o7K75j71L4J39k04K29j37M5n8o5j39o8J3J90J30k57O3M6M1o2q1
7582a10J30j20N5J99j23k04J74P3J79j56j35j9K54%j63L8j59P5L1M0k32J56n9
7605g6J24P4j94oK7J12k20j63J84K20l26K23L0r7j31R6J49j61J43R8j14j28O8
7628f8J3J19PJ49k57K3J52J11k58J3R9Mk50j00J93j40O3J50l7L57n23l7J79r1
$$ plain form
7461 -125 17 121 60 -30 45 143 56 10 -170 105 -185 218 99 80 129 -38 2 68 116 -434 5 -135 13 -160
7485 -160 117 127 17 -203 -127 113 -3 -132 -1 -19 -72 -56 -213 50 -151 143 -88 -3 27 -156 65 267
7507 267 202 -245 -6 -24 -114 33 -148 -146 97 -196 -290 144 143 -30 75 55 -100 -67 -161 43 187 -55 -161 93
7531 93 -58 -98 163 116 137 34 12 13 178 -15 53 105 69 4 38 -54 -7 -104 63 110 -190 8 -124 -117 15 91
7557 91 -56 -63 -6 -73 202 31 65 204 0 229 92 137 79 14 -125 -193 -180 10 140 -117 -54 -8 33 -29 -110
7582 -110 20 -100 -45 154 31 -173 1 74 253 97 -38 -57 197 197 34 72 -87 -12 19 59 -173 -17 -76
7605 -76 48 122 -72 -78 -51 61 -159 -322 -138 82 -244 -21 9 -88 -219 -123 26 -135 8 106 -8 -136 -68
7628 -68 -55 64 71 220 -37 -14 138 249 -9 4 103 107 -143 -243 -50 -190 -127 23 -14 343 -180 -217 -38 -129
7652a29J46n6M58l60j70K25J03k15j03Q4M8k62J50J71j3k0l0K06j37j82j40K05
7674b1R2K0q1j79J96q7M3J64r4j63J72J07mk42M7j12J15J45k59P0j08K0J70o3
7698e2J47p2o8J4J46j19j5J72m0m28O9M9L08j27n2J3J44J30k80L81l94K16j47
7721eR2L2k34L3j0O3J52Q8k91J17j06R8P1k30K26l56L46j80n6K65q0j18R3k66
7745b56K69p7j14J44m0o2R2J72q8j56K46j3n0j27K41n9j23j50L3K59l06J74k11
7768b02J71M16j67K1k59R7J30k17K5Q3j4l22K82N1r9J03N0K76k45l52J32J27j96
7791a09Q3K87l09J93J18k02j29P6ko4K48j74k26J50l1NQ1j01l14M70r6j56L96
7814A94pl68J94J29j53k85J47J79J89l1j71J26n0l03j80N22k29j04J75J3l04K24
$$ plain form
7652 -129 17 -39 419 59 -111 114 217 2 -101 -17 31 -231 -81 90 77 57 27 233 96 -86 -226 -21
7674 -21 71 91 10 -169 27 -60 -17 147 53 -110 62 169 165 -77 -30 -142 -27 118 -141 -71 -179 -159 11 -52
7698 -52 95 23 -45 -31 115 -4 -19 153 113 -315 -246 -197 111 -16 -68 -55 89 219 -61 320 -74 142 -5
7721 -5 87 119 -115 -82 -92 -29 123 211 -80 37 -69 29 100 -130 96 -260 86 -94 -150 115 35 -83 10 -256
7745 -256 13 -64 -178 -34 -74 -136 -44 128 40 -116 130 117 67 -60 181 122 -1 -151 -118 141 -165 9 -202
7768 -202 -31 385 218 239 -20 77 207 -10 15 98 84 -238 44 95 -4 99 149 425 180 -172 -40 87 -109
7791 -109 -26 261 -48 145 263 61 -68 8 6 -58 190 16 -210 -60 -91 -86 -5 -106 -420 50 -46 -202 194
7814 194 187 -181 13 142 -11 -296 -149 30 219 188 17 143 93 -210 -390 132 -97 -201 -26 -13 -317 -93
7836i3K22p5o6p8q9J55J46j55k09K80k4k18R6J90N6k87K67m56N10l03J6p3n0J56
7860h2J36J29Ql66K35n8o9m3J50l7k0K70j14l3qk33J69j11K73k59q8K07k14J28
7884c0M5L0j1j28K42p8J2j33K72J44m35o2J71J60j27J42j31J77k00o2q0K89n3
7907A54k01j42Q9J58mj35J71j17k9j04jJ22r1p9J91R5j59K2JJ7j16M4J44J06j60
7932b4R9R9l53J94pK38j83j48L21k47L0m31N59j95L36l44q0q7M54j98Q7L8r6J
7956F3r3J20l3j96j41M02j97l0L41j68K71k39j54K01O7l77K28K72k10j44Q2K98
7978C63k48k51O1N1J31r8l8k4K39l6j12Q2p3%j52J28K87l06lq4j74J4K20l7K21
8003A61k61N0k2kk01L59r2O8l11L17R1l30k6P2L00k65J73p1k11L3J38j04RpJ75
$$ plain form
7836 -93 129 54 -12 -90 -179 -24 122 -33 -242 38 14 -204 -108 82 138 -149 118 -338 172 -131 -115 -188 -238 -82
7860 -82 54 183 191 -175 60 2 -67 -110 40 3 -17 253 139 106 98 -135 34 -77 196 -63 -151 56 -158 -30
7884 -30 15 45 34 -94 148 70 82 -51 221 365 -70 -132 39 199 72 214 83 260 60 -2 -82 207 154
7907 154 -47 -189 -100 58 54 -81 90 -27 -56 -160 -161 -39 -130 -209 -18 77 -82 -60 -59 -42 -158 -114 30 136 -24
7932 -24 75 174 -179 15 8 246 63 -85 236 -11 19 -412 147 -48 288 -56 -136 -223 231 33 120 158 62 63
7956 63 -30 90 57 -139 -280 122 -75 -105 236 68 339 100 -54 147 214 -163 65 337 127 -17 65 363
7978 363 115 -136 -75 -24 107 9 -29 -53 186 150 38 120 47 47 -105 23 310 4 1 -83 -257 -243 -23 -60 161
8003 161 -100 -50 -72 -74 -275 84 -8 60 -251 66 157 -173 -199 -127 173 -92 81 10 -201 -168 -30 -134 -125 -132 43
8028D3o1J08m57K12L04L5k32K4j90J98K65l64j0K57k62j26J21K81j3j16P4p3N5
8051G3j37N4M9O6m6k48K04j2j57J00J14q6K7O3J90j58l8o1J43J19j64l5o9K40
8075B31j86j29R9P5p8K86l65M8J59k23M58l94k09J29K55k90n7J03K28j29j51p9
8097b19L3K11n1J82j15kP8k11n3P8K7K26j49J05n5j44K6J4j49N4K57k48O8K56
8121B19k92Kj27K17K42k87p6J31L10pl02j68K22j39j17K94J13k76O9k77j5M33
8143A69l91K23j25J28P5j23J59k18m1j48r0L50L2M3J22l65M49m25K72k01j11K65
8165D9r4l4MM00l36j25J76P8n5J76l42J81mj58J51k03J90j24j5j4O0K92k35M7
8189F5MP6
$$ plain form
8028 43 -18 90 -367 -155 149 184 -48 -24 -214 -16 249 -115 -125 132 -130 -256 -135 146 133 17 91 18 73
8051 73 -64 -10 39 105 59 -189 15 3 -154 -54 60 -26 1 64 254 96 58 -3 140 259 95 60 -9 231
8075 231 45 -84 15 90 12 298 -67 -19 140 -83 375 -19 -228 -99 156 -134 -191 -88 140 11 -140 -219
8097 -219 -186 25 -26 156 41 39 117 -94 -147 -69 -42 184 35 140 85 -59 -33 -19 -168 -114 143 -105 -37 219
8121 219 -73 -71 -198 19 261 -26 -102 29 339 332 30 -138 84 -55 -172 122 235 -41 28 -249 -264 169
8143 169 -222 1 -124 4 79 -44 115 -103 -144 -292 -382 -32 0 43 165 -200 249 -176 96 -105 -216 49
8165 49 -45 -79 -75 325 -11 -136 40 118 63 239 -103 78 74 -84 67 -136 54 -70 -85 -99 -39 253 18 65
8189 65 69 145
8191A45
$$ Imaginary data points
##PAGE= N=2
##DATA TABLE= (X++(I..I)), XYDATA
0@%%%%%%%%%%%%%%%jRj6J6j6J6k3L1l2L7m5N1n9O7p6Q8j01J14j28J44j63J83k03
38a07K27k53K80l11L46l83M22m65N14n66O24o88P58q36R21j015J124j248J387
57G31j547J737j965K237k576L012l588M393n598P585j1416K1343r2842k35622
71c14116J63527J48050J4451J08517Q0209j42348j24116q705l6968M702J30402
82B3605O5287n396L2956p3204j75490J4688J25354l5116k7310J56757N7093j50229
94H995p5107K8515m7000p217J24098P1090m2194m0045l1525l0815R548l354k7467
107f2478O6773J07909l6152r5661J0782L458p8218M995J12011M4681l9899j1197
119B7004K519n5419o1626J7081P6007N5479r613l2967n815j3436m7254k1019M3519
$$ plain form
0 0 0 0 0 0 0 0 0 0 0 0 0 0 0 0 0 -1 8 -8 8 -8 8 -15 16 -16 21 -24 27 -32 35 -41 47 -54 60 -68 76 -87 96 -107
38 -107 120 -133 147 -164 182 -201 221 -244 270 -296 328 -360 398 -438 483 -532 592 -656 731
57 731 -816 921 -1044 1193 -1383 1629 -1959 2434 -3164 4421 -6995 14348 -78494 -314116
71 -314116 -150589 -2539 11912 120429 200638 58290 -65826 -74531 -111499 -106797 23605
82 23605 88892 83496 116452 43248 -132242 -117554 7800 -27316 -54626 102131 159224 8995
94 8995 -66112 -37597 -84597 -91814 32284 103374 61180 21135 -10390 -41205 -31657 -35011 -62478
107 -62478 4295 112204 76052 -19609 -8827 -5369 -83587 -78592 33419 78100 38201 27004
119 27004 29523 -25896 -87522 -70441 5566 61045 51432 18465 12650 -786 -48040 -69059 -25540
132b5540N1896R533j200J4623k6855q2000l1948O8468O3746j1672n101L5516l0276
145B9190r1616j4714O3829L3586j1J6201N983l4595m4193j4969K6193M0648J755
158A7287j8258K8439J9751o5521m8719M9062L6360k8954R739M9429j9586n6467
170b7438K778K4544o782n000J3902J9932Q449k4441k9225J6911J9101l4163j4761
183c6193N8469K7038m7985j7081K7732j7096m0755J9947N3096J0769l0247j8588
195a0894J0215N42k7607n386M7546K6539l4730j6404K5149r367l8641P469L8266
208A2697Q570j4815j77R549q148l0803j3898L6500L1361k7233j3207L7394q545
221A9245n9374N003N1684p047k7501K7923K2758k8432k3150J67P111J6961J425
$$ plain form
132 -25540 26356 35889 34689 49312 22457 -59543 -91491 -23023 40723 29051 23950 59466 29190
145 29190 -62426 -77140 -13311 20275 20264 36465 42448 7853 -36340 -51309 -25116 15532 17287
158 17287 -971 27468 47219 -18302 -67021 -17959 18401 -10553 -814 48615 29029 -27438
170 -27438 -24660 -116 -6898 -11898 2004 21936 30385 5944 -23281 -6370 12731 -21432 -36193
183 -36193 22276 49314 1329 -15752 11980 -5116 -45871 -25924 27172 37941 7694 -10894
195 -10894 -679 -137 -27744 -33130 14416 40955 6225 -10179 14970 5603 -33038 -25569 12697
208 12697 21267 6452 6275 15824 7676 -23127 -37025 -525 30836 3603 -9604 27790 19245
221 19245 -40129 -35126 16558 9511 -17990 9933 32691 4259 -18891 -18724 -11613 5348 6773
234F773j3908K3302K3791m7978l8185M7865K1292m9244J3898O3455k5817n6599
246c1355K1583K0989l1495l12L4516M740n982j429k5658q012K5200j2708j7582
259b7505N2734K5646o3904j8458N1025j7472n3240M2648N8514l3128l0974K4058
271I944m463k8463O754J4782Q230J9180p464l3082Q528K0035l7609j3830O1573
284B4115J4674n4434M651M0036l3376m1617L7180L4234k3393o212K2255r239k1797
297a2923k202J643J2577K1024j0526j7622K0764N807m4710o920N3506L931m3490
310a9141J5827L8085l0856l9025K5310K5173j8458o378K1159K113j3960q295o589
323a5035Q725J6760r597j0923K4292P515l9402p613M1657k792l8446K2331L6998
$$ plain form
234 6773 -7135 16167 39958 -8020 -46205 1660 22952 -26292 -12394 51061 25244 -31355
246 -31355 -9772 11217 -20278 -20590 13926 18666 12684 11255 -14403 -22415 2785 -9923 -27505
259 -27505 25229 50875 -13029 -31487 19538 2066 -51174 -8526 49988 16860 -14114 9944
271 9944 5481 -22982 -16228 -1446 6784 25964 18500 -14582 -6054 13981 -23628 -37458 24115
284 24115 38789 -15645 -10994 29042 -4334 -45951 -8771 25463 2070 -4142 18113 8874 -12923
297 -12923 -15125 -13482 -905 20119 9593 -8029 12735 18542 -26168 -33088 20418 24349 -19141
310 -19141 -3314 34771 3915 -35110 -9800 15373 -3085 -9463 11696 13809 -151 -8446 -15035
323 -15035 -6310 10450 853 -10070 14222 21737 -17665 -25278 16379 13587 -24859 -2528 34470
336C4470l0605k9653K7911J4239k6206l051K2520J083r047l978o854Q178J2811
349A1818j9670j0543L4592M495m3412L489M4459j5390l9490K6780K9399l1112
361d585j5760K7921M953j6982J39N841L29K784o701q288J8751R251k9656l046
375a5049L4835j0751l5570K0757L2184k4932k2762K5821J1381k4856p186J7570
387A442P834m462j0295r41J5152j548k4151M446L0969n587k8818J2513K4508k0807
401B55k1585J9489J6306j2330r252J0096Q825j0013j6597N965K0197l809j9419
414a1872J0738K0748k0678k2755K0665J7637j6897p540J6624N910j5456j0990
426a3866O978J5792j53j7281L582K3668j1385l0483J6393K8184j9982j9550K5129
$$ plain form
336 34470 3865 -25788 2123 16362 -9844 -12895 9625 10708 1661 -2317 -9171 -993 11818
349 11818 -7852 -18395 16197 20692 -22720 -19231 25228 9838 -29652 -2872 26527 -4585
361 -4585 -20345 7576 12529 -4453 -4314 1527 1856 4640 -2061 -10349 8402 17653 -12003 -15049
375 -15049 19786 9035 -26535 -5778 26406 1474 -21288 4533 15914 -8942 -16128 1442
387 1442 9276 4814 -5481 -6422 8730 7182 -16969 -12523 18446 12859 -15959 -3446 21062 255
401 255 -21330 -1841 14465 2135 -7117 2979 11804 1791 -14806 -8841 11356 7547 -11872
414 -11872 -1134 19614 -1064 -23819 -3154 14483 -2414 -9954 6670 12580 -2876 -13866
426 -13866 -6888 8904 8751 -8530 -4948 18720 7335 -23148 -6755 21429 1447 -18103 7026
439G026J2560k5375q151J7378J274q742L24L988O868m35j7166k537K2156k774
453F394k3918J4882K8037k3917k5706K6685J5157k8679l715K8861J163k1151j901
466g808J0094P59m015m017L920J4744m778k4340N622K4158j1203k1749J9987K0159
480B1533k4392j7659K3854J0360k1626l953J9065J255j4073m25J0864R70q400
493b627n027N397J0505j778j3211M977J4372j2199j9787J8227K3035k0134j9413
506a7663K3245J0689k8431m305K7466N99k0466L254J1042m589l661Jk410R835
520D606M973j9163k46K6406r668k8724K1030K4838k9875j5057L4405L046l1885
533a5314Q973K2188j6246j1459J4166Q41l133P592r816j0227J8992R35k7122J5707
$$ plain form
439 7026 19586 -5789 -13940 3438 4712 -4030 -3706 282 7150 6715 -10451 -12988 9168 6394
453 6394 -17524 -2642 25395 1478 -24228 2457 17614 -11065 -14780 14081 15244 -5907 -7808
466 -7808 2286 3045 -970 -4987 -1067 13677 8899 -15441 -9819 14339 3136 -18613 1374 21533
480 21533 -2859 -20518 3336 13696 -7930 -11883 7182 8437 -5636 -6061 4803 5773 -2627
493 -2627 -7654 -2257 8248 6470 -6741 -1764 12608 409 -19378 -1151 21884 1750 -17663
506 -17663 5582 16271 -12160 -16465 11001 11600 -8866 -5612 5430 841 -2820 -2819 -5229 4606
520 4606 9579 -9584 -9830 16576 6908 -21816 -786 24052 -5823 -20880 13525 16571 -15314
533 -15314 -6341 15847 -399 -11858 2308 3149 16 7608 -2208 -12435 6557 7492 -19630 -3923
547c923L1898k8631k7273L4485J2529l5176K377L2510j1153k1753J3854P846r780
560b190L227p92q374J4172N746k0924L809K3938j8839k5748K8899K0176l0577
573g477n415K9032q839k6919J0523J8715n780n952L498O69J43n301j0863R733
587d233K0440j0898j7028J8117Q818k7375q050K7610Q302j9039n06J4280n109
600E329j6571J10J3897O779q969n734J0426K736j5312o145J4746O253j1812q98
614e165J5049N95j8010o261J2999P150r321j182J7566J353k4403p378J9386M805
628G183j3455M448J7790n371j9602j994J0051K536m714L25J1845N376j6522j2904
642a5008J1057Q095j2777N41K3284J845k3575l963J2009m236r518J0697J6014
$$ plain form
547 -3923 27975 -656 -27929 6556 19085 -16091 -13714 18796 7643 -14110 -256 7590 -2190
560 -2190 1037 245 -8129 6043 11789 -9135 -5326 18612 -227 -25975 2924 23100 -7477
573 -7477 -12892 16140 7301 -19618 -9095 9620 3840 -2112 1386 2055 2198 -3103 -13966 -4233
587 -4233 16207 5309 -11719 6398 15216 -12159 -20209 7401 15703 -3336 -3842 10438 5329
600 5329 -11242 -11132 2765 9544 575 -5159 5267 8003 -7309 -13454 1292 7545 -4267 -5165
614 -5165 9884 10479 -7531 -13792 -793 6357 -2964 -4146 13420 14773 -9630 -17008 2378 7183
628 7183 -6272 -1824 15966 10595 -9007 -11001 -950 1586 -3128 -2803 9042 14418 -2104 -15008
642 -15008 -3951 4144 -8633 -8092 15192 17037 -6538 -10501 1508 -2728 -12246 -1549 14465
655A4465j716j3306n065L986k87q259K663J9566O133j7780q217J0026l402j4454
669a5647N958K2324L880j5602n652O386l947j3331L772K1444O379j4432m087Q058
683E503p881j4076O267J7626L687o536j200J332m875j1432l707J6787J3638j0535
697D598o085J3668o227k7083K670K6763K35j2475J1610P093j8026j2881N801P338
711c001O943L117m675K966M102j7424j4141K1416J4585j8950J193K5132j0542
724A0721k9241Q148J6907j0843k229J7854J842j2199m160m533j744J1438M29p650
738e260J4217Q063k5994r144K4994l00k3895J3081K5381j6142j7397J4411M962
751F977j4603o24J0144K495K384j575r521K910P920j4076o989K3007O935k1964
$$ plain form
655 14465 12749 -557 -5622 -1636 -1923 -10182 -7519 12047 18180 400 -7817 2209 -1193 -15647
669 -15647 -9689 12635 16515 913 -4739 1647 -2300 -15631 -11859 9585 15964 1532 -2555 5503
683 5503 -2378 -16454 -10187 7439 11126 4590 3390 4722 -153 -11585 -15292 1495 15133 4598
697 4598 -1487 12181 5954 -21129 -18459 8304 8539 -3936 7674 14767 -3259 -16140 -10339 -3001
711 -3001 3942 7059 2384 5350 9452 -7972 -22113 -697 13888 -5062 -3869 21263 10721
724 10721 -18520 -10372 6535 -4308 -6537 11317 13159 960 -3200 -7733 -9477 1961 2390 -5260
738 -5260 8957 17020 -8974 -18118 6876 6576 -17319 -4238 21143 5001 -12396 2015 6977
751 6977 -7626 -8250 1894 4389 6773 5198 -4323 -1413 6507 -7569 -14558 8449 15384 -6580
765f580J780J9492j3168k1850J3708J7100j0048l478J2583j368j3501n770K928
778h172P830P334k275l933O356k708j8611L95K2814M92j6172P615J4843j4289
792A519j6452J0201J1552p958m587J1538N086q767q825q48N777K516l430K965
806B87J0006l040j6409j146J4090j228j1734R776J4017j0706j3657Q063P821j0205
820d065n225J2789P618o871o671N15K151k114n135L963J3003o74j4328j352J2290
835E894n375j4108R864J5712q734r117R203M306j2888o543R195P430k68j724M07
850C254P72n860j0137M539J6005M71j1139L564P125j2094j1375J2674J1518p935
864A382m715Q121K174r688p573M980Q838o63n095M726P164r172j3640O692J2446
$$ plain form
765 -6580 -4800 14692 1524 -20326 -6618 10482 434 -3044 9539 8171 -5330 -11100 -8172
778 -8172 -342 6992 4717 784 7140 4432 -14179 -13784 9030 9522 -6650 965 15808 1519
792 1519 -14933 -4732 6820 -1138 -5725 5813 10899 2132 -6693 -7541 -1764 752 -2678 287
806 287 10293 7253 -9156 -10302 3788 2560 -9174 602 14619 3913 -9744 -1681 6140 -4065
820 -4065 -9290 3499 11117 4246 -2425 -1910 241 -1873 -7008 -3045 9958 9284 -5044 -6396 5894
835 5894 519 -13589 -3725 11987 3253 -5864 3339 7645 -5243 -11786 -2591 4839 4571 2847 3254
850 3254 4026 -1834 -11971 -7432 8573 9044 -2095 1469 8594 -3500 -14875 -2201 9317 1382
864 1382 -3333 4788 6962 -2726 -10299 -5319 3519 2856 -2239 2487 9651 479 -13161 -6469 5977
879E977l841n204Q728L668j0508p855N042P332k408l762N290P255o363j2273L713
894e209R493o918n725J3784P366j2758q745O157K901n152J312Q077L989n268r966
909f662L52J0190k451j0438R064J3482j0379j2887J0637O675j4127k929J4891
922E418L169q252j452J739j381k379j905L228R170j189j2445K172J1128q717j1138
937a2834J4051J0399j4033n005J3689J29j3683K08R600J135l334l77J852J997
951C794l233q618M756J1795m884j0865P698Q964j1726q185J3043N041j2185j658
965f263J1120R53r379j099O377M42m981q93N179M340n202o206N100O732p144o823
981g747R368P346r867p109J1851M204j3572l015J3285J635r878N1Q139j894p571
$$ plain form
879 5977 2136 -3068 5660 9328 -1180 -9035 -3993 3339 931 -2831 2459 9714 3351 -8922 -5209
894 -5209 4284 -2634 -8359 5425 12791 33 -8712 -2555 346 -4806 -3494 4583 8572 3304 -6662
909 -6662 -6310 3880 1429 -9009 55 13537 3158 -9729 908 7583 -6544 -9473 5418
922 5418 8587 335 -1117 622 -759 -3138 -5043 -1815 7355 6166 -6279 -4107 7021 -1696 -12834
937 -12834 1217 11616 -2417 -7422 6267 6396 -7287 -7079 2521 3656 322 -55 1797 3794
951 3794 561 -8057 -3301 8494 3610 -7255 443 9407 -2319 -10504 2539 7580 -4605 -6263
965 -6263 4857 5810 -3569 -4668 1709 2151 -2830 -3723 1456 5796 594 -5612 -512 6220 -924 -7747
981 -7747 1621 8967 -900 -8009 3842 8046 -5526 -8541 4744 6379 -3499 -3448 4691 2797 -4774
996d774M92M459L047j926n214L044O600n576r149Q291R255j0629o241J4259L533
1011I471j5557m16J2359l917q306O563O063l815l647j043m37M589n79o911O077
1026D94J0071j1147j0380J2769O048j4774p40J5907j519j3381M017O679n134k936
1040d026L360K127K275j166o400J822P665o516q014J1884O983j3323k826J2601
1054F446k438j2121L805R652k881m953K337K411j061l739l078N637O236o159n626
1069e532Q456L112j1511j718J1488J197r481J588P596k174o468l70N367K456m985
1084i79k686O985K745r572k873R228J417q701R42R042j961q283J125N777k54m895
1100b943n63P046K098q104l483Q492K775j0156k48J1864j150j0883K173Q030l144
$$ plain form
996 -4774 -4282 177 3224 1298 -3916 -872 5728 152 -8997 -706 8549 -2080 -8321 5938 9471
1011 9471 -6086 -6502 5857 1940 -6366 197 6260 2445 -1202 -2245 -2682 1907 1328 -5583 494
1026 494 10565 -582 -10962 1807 7855 -6919 -7659 8248 6729 -6652 -2635 4044 -1090 -4026
1040 -4026 -666 1461 3736 2570 -3830 -2008 5657 -859 -8873 3011 9994 -3329 -6155 6446
1054 6446 4008 -8113 -4308 5344 2463 -2490 -153 2258 1197 -2542 -5620 17 6253 94 -5532
1069 -5532 2924 6036 -5475 -7193 4295 5492 -3989 -2401 5195 3021 -3447 -3817 1550 4006 -979
1084 -979 -3665 3320 6065 -3507 -6380 2848 4265 -4436 -3494 5548 3587 -4696 -3571 2206 1952 -2943
1100 -2943 -3506 3540 5638 -2466 -5949 2543 5318 -4838 -5086 6778 5628 -5255 -3082 4948 1804
1115A804o755K581O186k26m901j601M306K172p202k860J0072K283r413p29R565
1130E282k213j0009K756R564k502p171L770N199l012n567P51O331N12o076n61
1145b946P857n15r151k33R330j071q053K568Q202k548q608P04P409j135o263L014
1161a439P346k934p798J146O540j900m766L179N437k008o093O4N273M89o133J087
1177b510Q583j255r717J211Q924l559q625O295P905o129n935M690K867l901k247
1192c403J615L680J843m677k814O119R81r808P83J2814j760j0415M194P160q158
1207a846o125R185M998n550j574J908q32k51k024q46N920K302q113j738R616j575
1223C455j1475M184J1228o260p790Q194M779q146l655N011K455j450o61k02K547
$$ plain form
1115 1804 -4951 -2370 3816 3590 -1311 -2912 1394 3566 -3636 -6496 3576 5859 -3554 -4283 5282
1130 5282 3069 -6940 -4184 5380 2878 -4293 -523 4676 1664 -3903 -3152 3179 3691 -2385 -2946
1145 -2946 4911 4396 -4755 -4988 4342 3271 -4782 -2214 5988 3440 -5168 -4464 2945 1810 -4453 -1439
1161 -1439 5907 2973 -4825 -3679 2861 961 -3805 -626 4811 2803 -3290 -3226 2047 2536 -3597 -2510
1177 -2510 6073 4818 -4899 -3688 5236 1677 -6948 -653 7252 1123 -4812 -122 2745 -1156 -3403
1192 -3403 -1788 1892 3735 -942 -3756 2363 3344 -6464 -5681 7133 5373 -5042 -848 6312 -1846
1207 -1846 -7971 1214 6212 662 -912 996 164 -87 -2111 -2957 2963 5265 -2848 -4586 5030 3455
1223 3455 -8020 -3836 7392 1132 -6658 1536 6315 -1831 -5486 -475 1980 530 -131 -333 2214
1238B214R02o505k026Q927J111q901K550R106m930j0095N694P301o267k892O748
1253B937J986o113l138K227L469J75k880O13M484k063p536K609Q899l197p879
1268e407M598O816n572n516N627M358n955m200N361M909l044m447J294L361l066
1283h83m089M535O010l258o737K183M854l187m452N130N572m622n557L826M552
1298C877n078m058O133N082m836m836L877L178m982k678N253M380l793n282K455
1313a308M511l067n002M482N252m714n175N135N122o342m728N476L778l816j580
1328a976L722J651n216l525M504N357k451m076K368L112n048m012O599M972n757
1343B24m207M837K844n084k577M770K566m548k667M384L484l732m943M253L690
$$ plain form
1238 2214 3116 -3389 -5415 3512 4623 -4278 -1728 7378 2448 -7647 -1953 5348 -919 -3811 2937
1253 2937 4923 -1190 -4328 -2101 1368 1543 -1337 -724 3760 1697 -5839 -3230 5669 2472 -5407
1268 -5407 -809 6007 435 -5081 546 4904 -1051 -5251 110 5019 1975 -2472 -1178 2183 -883
1283 -883 -4972 -437 5573 2315 -4422 -2239 2615 -572 -5024 106 5678 1056 -4501 -675 3877
1298 3877 -1201 -5259 874 5956 1120 -3716 161 3339 -1643 -4321 932 5312 1519 -3763 -1308
1313 -1308 3203 136 -4866 -384 4868 154 -5021 114 5236 -1106 -5834 -358 3420 -396 -1976
1328 -1976 1746 3397 -1819 -5344 -840 4517 2066 -2010 358 3470 -1578 -5590 1009 5981 224
1343 224 -3983 854 3698 -1386 -3963 807 3373 -1175 -3842 542 4026 294 -4649 -396 3294
1358C294m312k780N457K725n215l269M609K379l918k101M140L193l560l781L259
1373A20L359n628k724O993L765o314l365M830Q46n251K60N789J172m566k196K061
1389h49L176k809l521M101M397m137m996O232L320p722k695P973J498n007K12
1404h27L581j247m584N1L198K964j373l680J244L900m747m334O672M461o651k698
1420d070P252N51p699j59O359k00l365J106K165K7l277k302L153M411k882m224
1436c154M204L749o587l305P002K117o697k17O104l96n296j62L741J42k946k01
1452a902L845J167m239k623L961K354l954j310N060J776o146j774N507J203n470
1467b545l3N523P86n567o82M552j88m677R7M869J022m134j562L421O11l909q19
$$ plain form
1358 3294 -1018 -3798 1659 4384 -831 -4100 509 2888 -1030 -3131 1009 4202 642 -3139 120
1373 120 3479 -2149 -4873 2120 5885 -429 -3794 1036 1882 -3369 -3109 2680 3852 -714 -2910 -849
1389 -849 2327 -482 -4003 98 4495 358 -4638 1594 4914 -2808 -5503 2470 3968 -1039 -827
1404 -827 2754 1507 -3077 -3026 172 3136 1763 -1917 -673 3227 -1520 -5854 818 5279 -1372 -4070
1420 -4070 3182 3733 -3966 -4125 2234 2034 -1331 -225 1940 1967 -1310 -3612 -459 3952 1070 -3154
1436 -3154 1050 4799 -1788 -5093 1909 4026 -2671 -2888 3216 2820 -2476 -2638 1103 1245 -1701 -1902
1452 -1902 1943 3110 -1129 -3752 209 2563 -1391 -2701 2359 4135 -2011 -3785 1722 2925 -2545
1467 -2545 -2578 2945 3731 -1836 -2518 2034 1846 -2831 -2734 2135 3157 -977 -2539 882 1493 -2416 -3235
1484c235M810K373n010k209N106Q55o225M2O901o12n375J348M467k221m113J210
1500a888L896K64k687j208K969J255m723j861O036K015o274q66O756j410o720
1515d446J774N563j830l483J781K900r35l381j70L152J233l337j198M953P36o018
1531b706m34N942m67n567K452M467j997m761J396L610j298k324K64L466M02m530
1547b085n82M534n6n107Q96N660j157n068J478M009k247l089J702L504r8l240
1563i46o82L284k09l976N80M939l87n193J293M377k710l675K256L132j137k489
1579a543Q47K344q34l630J92M530O78m391J35M974k017n203K339M904j928l808
1595b411K536K950k214k664Q39K179J3k781K39M174n11n037j38M640q49l875K545
$$ plain form
1484 -3235 1575 3948 -1062 -3271 1835 2690 -3535 -3493 3408 2796 -2579 -1231 3236 1015 -3098 -1888
1500 -1888 2008 2272 -415 -1623 1346 2601 -2122 -3983 2053 4068 -2206 -3072 3684 2274 -4446
1515 -4446 -2672 2891 1061 -2422 -641 2259 1324 -2057 -2227 925 2158 -1179 -2377 2576 3312 -2706
1531 -2706 -3140 2802 2335 -3232 -780 3687 1690 -3071 -1675 1935 637 -1687 -1423 2043 2445 -2085
1547 -2085 -2667 1867 1811 -3296 -2400 3260 2103 -2965 -1487 2522 275 -2814 -1112 2392 2294 -946
1563 -946 -1628 1656 1447 -2529 -1949 2990 2603 -2590 -1297 3080 370 -3305 -1049 2083 946 -1543
1579 -1543 -696 1648 814 -2816 -2624 1906 2584 -1807 -1672 3302 1285 -3918 -1579 3325 1397 -2411
1595 -2411 125 3075 861 -1803 -964 1215 1228 -1553 -1314 2860 2349 -2688 -2826 1814 965 -2910 -365
1612c65M241k956m403K181L120j643k290J944K896j546l222M58L298o06l580J223
1628a250M677j456m268J243L392j770l294K014L684j658l452J190L133j795l345
1643b955J972L883j795l657K124L097k819k863J976L526j043l213J645K383k076
1658A85l655K244M828j713m596K579L225l543l044L818K733k805k677K232J918
1673A729j436k101J258K174o68l519J373M376k055m626K505M242l576l039L934
1688E71K873m120j568K903J042k058j279J829J809j278k624O64L626j471l890
1703b971K563L712l662l611M262K501l638j658L395P75k870p14K226J659j309
1718F60k598J054K591j366k946K715L578l305l500L478K438l498j220L267P37
$$ plain form
1612 -365 3876 920 -3483 -1302 1818 175 -2115 -171 2725 1179 -2043 -1585 1713 1107 -2473 -1250
1628 -1250 3427 1971 -2297 -1054 2338 568 -2726 -712 2972 1314 -2138 -948 2185 390 -2955
1643 -2955 -983 2900 1105 -2552 -428 2669 -150 -3013 -1037 2489 1446 -1767 -122 2261 185
1658 185 -3470 -1226 3602 1889 -2707 -128 3097 -446 -3490 328 3061 256 -2421 -189 1729
1673 1729 293 -1808 -550 1624 956 -2563 -1190 3186 1131 -3495 -990 3252 -324 -3363 571
1688 571 3444 -676 -2244 659 1701 -357 -1636 193 2002 724 -1900 -1236 2390 919 -2971
1703 -2971 -408 3304 -358 -3969 293 2794 -844 -2502 893 1668 -1202 -1916 310 1969 660
1718 660 -1938 -884 1707 341 -2605 110 3688 383 -3117 361 2799 -699 -1919 1348 2085
1733B085k861j185J891J539j604j721J810K512k385k618K296K881l140k609L473
1748C64J985k845j656K966J021k482j671K564K083j813j821J712J619k587k323
1763b884L038K673k470k089K193J299l096j061L030J393k069j699J646J691k230
1778f35j879K807K442k805k197L267J421l083j757L130J288k501j028K224J480
1793B174k658j561J948J909k059j374K598J782l304k624L060J905k664p19L203
1808A616L74l210j344K816J217j799q29K389Q76k807j761K731J967k741j162K852
1824A185J319l590q34K885R81l243m13L036Q33k396j521K447P04k609j046L206
1840I44J302l088j194K844P04l286J06K809R48k346j195K109O05k587n11L084
$$ plain form
1733 2085 -776 -1961 -70 1469 -135 -1856 -46 2466 81 -2537 -241 2640 -500 -3109 364
1748 364 2349 -496 -2152 814 1835 -647 -2318 246 2329 516 -1305 407 2026 -561 -2884
1763 -2884 154 2827 357 -1732 461 1760 -1336 -2397 633 2026 -43 -1742 -96 1595 -635
1778 -635 -2514 293 2735 -70 -2267 1000 2421 -662 -2419 711 1999 -502 -1530 694 2174
1793 2174 -484 -2045 -97 1812 -247 -1621 977 2759 -545 -3169 -109 1796 -868 -1587 1616
1808 1616 1990 -1220 -2564 252 1469 -330 -1159 1230 2106 -701 -2462 269 2236 -505 -1667 1185
1824 1185 2504 -1086 -1920 965 1946 -1297 -1710 1326 2159 -237 -1758 689 1393 -1216 -2262 944
1840 944 2246 -842 -2036 808 1512 -1774 -1668 1141 2089 -257 -1452 657 1262 -1325 -1836 1248
1856A248J019k549j493K885M16l523M56L135J31k802l07K547ok213o38K236J320
1873A862k524j139K951J145l680p69L106R52l174L27K977p97k957K34K733l62
1889H85j394j91J706L73k092j270K799J013k800m78L224n0l738K29L183n42k485
1906a628Q55K446n42j952o44J753R46k035n24K327J107l189p06L164J55k983N31
1923i19K806o83k528K93K084m83j797K49J876N95k562m19K571j92k671M57K729
1940A406j8k549J70K284n29k306O17K381k17k132K65K107j40k860L69K488l33
1957A003k372L54K679q43k329J07K789n27k103N16J903j48k679M32K416l08k459
1974a569M58K766n33k693R37K162j066k181J150K220o39k309K63J913J42k419
$$ plain form
1856 1248 2267 -282 -1775 1110 1526 -1997 -1541 1594 1725 -1077 -1384 1163 1157 -1056 -1694 542 1862
1873 1862 -662 -1801 1150 2295 -1385 -2154 952 1904 -1270 -943 2034 1237 -1720 -1486 1247 885
1889 885 -509 -700 1006 1379 -713 -1983 816 1829 -971 -1449 1775 1725 -2013 -1784 1399 857 -1628
1906 -1628 -773 1673 1131 -821 -1465 288 1234 -801 -1325 1002 2109 -1080 -1786 1378 1533 -1450 -919
1923 -919 1887 1204 -1324 -1031 1053 570 -1227 -978 898 1493 -1069 -1488 1083 891 -1780 -1323 1406
1940 1406 1388 -1161 -991 1293 764 -1542 -925 1456 1239 -893 -628 1479 1339 -1521 -1152 1336 1003
1957 1003 -1369 -1015 1664 821 -1508 -1401 1388 861 -1242 -726 1177 1029 -1650 -1218 1198 890 -1569
1974 -1569 -1111 1655 1122 -1571 -634 1528 462 -1719 -569 1651 1012 -1297 -1034 879 1021 -1398
1990a398K66K977p19k834N58K633r60j957R68K239j352j891Q14J723k72j854M
2007a055K504q4k860N27K204n02k531J113K668j298k360J313J639j138j627J090
2023c97J942q57j937N29K049o87k395P78K790j051k394J128K233j683k331J653
2039f30J971o46j866J073J384j180j361P75K364j082k276O70K305j186k059J780
2055C6J411j484j588J394K043j370j673N59J525o50j715J080K074j156k450J529
2071d35J846j090j837J376J636j437j357J454R67j039j435J227J766p24k061N55
2087e88J881j223j787K029J631j964j811J606J374j196j245J370J097j396j246
2102a468J193J418q84j779J017K009j191j675J536J109j668j044J664J500j615
$$ plain form
1990 -1398 -1132 1845 1126 -1708 -1150 1483 523 -1434 -466 1773 421 -1470 -656 1067 795 -1059 -1055
2007 -1055 1449 1365 -1495 -968 1236 734 -1797 -684 1984 686 -1674 -361 1278 140 -1487 -397
2023 -397 1545 688 -1249 -720 1329 642 -1753 -975 1815 764 -1630 -502 1731 48 -2283 -630
2039 -630 1341 695 -1171 -98 1286 106 -1255 -480 1884 802 -1474 -804 1501 315 -1744 36
2055 36 1447 -37 -1625 -231 1812 442 -1231 -672 853 203 -1512 -432 1642 486 -1964 -435
2071 -435 1411 321 -1516 -140 1496 59 -1298 156 1123 84 -1351 -124 1642 918 -1143 -588
2087 -588 1293 70 -1717 312 1943 -21 -1832 -226 1148 -48 -1293 77 1174 -222 -1468
2102 -1468 -275 1143 259 -1520 -503 1506 315 -1360 176 1285 -383 -1427 237 1737 122
2117A22j280J023Q35o98j130J217J425j556j531J507J473j367j725J767J292j542
2133a68j177J625J028k001q31J418J845j688j273J423R53j262j353J831J125j799
2149c04j039J598J173j485j033J121J218j434j038J280J311j545j547J252J876
2164A404j470j380J774J327k474r48K071R88j581r12J492P56j236j064J434J236
2180A417j385j459K041R24j440j688J927R72j915m47K094L28j872q72J448O54
2196G27j158o12J543O40j604j084J864J115j847p47J444J080j756m83J677m1j625
2213h67LJ601N17j587p59J171Q01j446n60J621R40j931j080K175O23k134k98J886
2231F76O54k238kJ748J48j704l44J617P43j656o30J702L10j807k60K013K22j843
$$ plain form
2117 122 -1158 -135 700 2 -1128 89 1514 -42 -1573 -66 1407 40 -1685 82 1374 -168
2133 -168 -1345 280 1308 -693 -1524 -106 1739 51 -1222 201 1154 -108 -1461 370 1495 -304
2149 -304 -1343 255 1428 -57 -1090 31 1249 -185 -1223 57 1368 -177 -1724 -472 1404
2164 1404 -66 -1446 328 1655 -819 -1767 304 1292 -289 -1201 291 1047 -189 -1253 181 1417
2180 1417 32 -1427 614 1538 98 -1590 337 1309 -606 -1053 1041 1369 -503 -1375 73 727
2196 727 -431 -1043 500 1140 -464 -1548 316 1431 -416 -1163 281 1361 -395 -878 799 758 -867
2213 -867 -864 737 1254 -333 -1092 79 880 -566 -1126 495 1435 -496 -1576 599 1222 -912 -1210 676
2231 676 1330 -908 -910 838 986 -718 -1062 555 1298 -358 -988 714 1024 -783 -1043 970 1192 -651
2249f51l37J753K66j649k20J073L92j190l12J391K36j238r25J845P35j936O6J710
2267A009j66j701K7J584J38j507k40J572M44j629k07J194N94j575o25J628N51
2284A091j933m69K035J9j730O2J686q8j493M7J229L31j533j21J477K55j497j45
2302g77J380M18j697j16J919m29j436O0J400J02j547o8J722o4j467l26J482L74
2320I30j446l50J788j09j860L19J856l92j528L93J126k95j468J38J700r6j224
2337e18m23J977l5j749r2J586J30j835N04J587q14j368O70J127l17j095k9J463
2355G69j21j850K23J816j56j645M06J749p16j681O23J550l33j323M37J256o23
2372C81j131K02J290p7j524L27J302P7k028N04J551n32j510O13J407o13j235M43
$$ plain form
2249 -651 -988 765 1031 -618 -838 235 627 -563 -875 516 752 -486 -1411 434 1169 -767 -701 1009
2267 1009 843 -858 -831 753 891 -616 -856 716 1160 -469 -676 518 1112 -463 -1088 540 1091
2284 1091 -842 -1311 724 743 -987 -925 761 673 -820 -773 456 787 -746 -867 610 865 -632 -777
2302 -777 603 1021 -676 -792 1127 698 -738 -678 722 824 -723 -791 931 867 -600 -926 556 930
2320 930 -516 -866 922 813 -1047 -728 1128 736 -792 -399 727 432 -1036 -898 802 706 -518
2337 -518 -941 1036 1001 -748 -840 746 876 -959 -455 1132 318 -1050 -380 747 430 -665 -694 769
2355 769 648 -1202 -979 837 681 -964 -558 1191 475 -1206 -583 967 634 -689 -252 1004 381
2372 381 -750 -548 742 665 -859 -532 770 847 -1181 -677 874 342 -1168 -555 852 239 -996 -553
2390e53J143k18r63P9J347k76j443j93K183m54j779P80J440p43j236P27J154n65
2408D30j391P08Q91l65j118L78J171l83j043K08J362o75j241O33J337o81j404
2425a183P86J262n70j293P67J210p89j164P13J248l58j459N54J500j087r75P05
2442a33J331j063j249O97J193m70r41L63R32n86j261Q45J278o40j116Q04J010
2459I94j239j056J168J147r15j074Q51Q21m87j155Q76J088r62j277Q79J087p20
2476B6q80O18J251j124q54R36Q40p15q71N54O92k70j138P60J030o43j214R24J067
2495I89q21j000P99J012j012r78P72R82p06q57Q57P75o68r62O81Q67o28r49J170
2514C23N50p68j052Q07J100j071m89O78N89q01p75R18R23o62j075Q31J032j181
$$ plain form
2390 -553 590 372 -591 -512 835 559 -884 -1077 1106 652 -1127 -347 1093 350 -886 -159 995 430
2408 430 -961 -253 638 273 -845 -467 704 321 -722 -514 848 173 -1068 -435 902 221 -1183
2425 -1183 -397 865 295 -998 -231 979 190 -974 -261 987 629 -830 -276 1224 137 -838 -133
2442 -133 1198 135 -1114 -417 776 306 -635 -272 660 74 -1187 -342 936 296 -820 -16 994
2459 994 -245 -1301 -133 1014 99 -975 -124 697 210 -945 -69 1019 57 -1220 -341 746 26
2476 26 -854 -236 1015 -109 -963 -27 813 98 -773 -219 473 203 -935 -175 855 212 -1002 -78 989
2495 989 168 -832 -33 979 -33 -1011 -239 743 37 -820 37 812 144 -818 -137 730 102 -847 323
2514 323 873 105 -947 -140 960 -111 -600 78 667 -134 -909 9 932 270 -805 26 1058 -123
2532a23n62P20J021j221p76J109P56q20o35O18M35q77n14J017P49p08j208J059
2550D0N54o69p53J085N18j095m89J247L27r74p49J026O95q97j09L58O47p77q00
2569h15J165L14o61q72J142M41j355k88J242M91p73q02J368K18j104o59R04O01
2587E57p26m25P32Q87j355o37R84P35r31k97P20N11j044m91R10O71r61l51Q53
2606C42M46q44q57J094L07p18o43J359N99j452l85R23L94q79%Q52K02j058m11
2625g29J091N48j199l37J233L7p20o33J168L4r99o4R48L29r29m61R03K86p56n59
2645h09J314K52j398j08J099L42j046j28Q30K21j060M8P51L09j086j7R30K01n74
2664G1o16R75P4r81j52J167J96j284Q8Q26p2o92j69Q84J42j031l0R01K20p78l27
$$ plain form
2532 -123 -685 35 1056 -165 -941 168 924 104 -531 87 522 -355 -869 148 897 189 -1019 40
2550 40 594 -75 -828 257 775 -320 -809 438 765 -209 -958 68 763 -134 -243 115 762 -15 -815
2569 -815 350 664 3 -869 273 714 -641 -929 313 804 31 -771 597 815 -289 -948 -44 557
2587 557 -169 -594 138 1025 -330 -967 17 752 -179 -476 244 755 -289 -780 130 801 -160 -511 342
2606 342 788 -56 -913 181 488 -230 -873 486 1085 -367 -752 171 565 -314 -314 538 740 -318 -729
2625 -729 362 910 -289 -626 607 644 -76 -709 459 493 -506 -570 378 707 -222 -683 220 506 -250 -809
2645 -809 505 757 -641 -749 350 692 -354 -482 348 569 -491 -443 308 617 -469 -486 444 645 71
2664 71 -545 430 504 -477 -629 538 734 -550 -462 364 292 -400 -569 315 457 -574 -604 297 517 -261 -588
2685e88J031K09j029l0J103j61j149Q8R92J4p89k27R44k27o41j54J077J67j150
2704e20k0Q46K23j050j48J046n1r31K67P96J5j099m3J176M4j093rJ349k12r36
2724c50j89J070Q9j062m6J114M5j361K30R23o5q96P5Q63K0q79j35R58j86o54J31
2745c05J033m85r36M76P28k8j090J83J003k56q27L30O38j48p05j1J150m10q33
2764d93L00N25j65q89M99Q77n36q74O16O03l77m76L7R78l08p04j02Q60K6q61M6
2785d18J125l70j058O67Q12j83j100L88P57o70m88M39N36k17o66J15P99p8q76
2804d86K73O53l80o55M50J016n45o68L26L31k75l22K28N28l6r30L98N14k29p30
2824e39K98O33j92n06r7Q15k38p05K24Q77k12p19J64P55l61p80M14N07l52p28
$$ plain form
2685 -588 443 652 -377 -407 696 535 -614 -526 466 480 -309 -536 408 181 -460 -614 463 630 -520
2704 -520 -540 306 529 -521 -669 377 326 -605 -338 458 473 -626 -669 507 551 -542 -551 798 586 -350
2724 -350 -539 531 620 -442 -488 626 671 -690 -460 463 398 -498 -423 440 460 -419 -554 404 218 -436 -305
2745 -305 728 243 -693 -217 511 483 -607 -424 579 323 -504 -174 464 316 -389 -400 750 340 -493
2764 -493 -193 332 167 -722 -223 654 118 -756 -140 463 86 -390 -353 625 317 -387 -489 371 397 -464 -418
2785 -418 707 337 -721 -54 758 575 -525 -137 620 -50 -538 -99 437 220 -446 -331 468 390 -486
2804 -486 -213 440 60 -595 -145 871 326 -342 -16 315 40 -282 -54 474 438 -492 -94 420 191 -539
2824 -539 -241 392 200 -306 -403 412 174 -531 -307 570 358 -361 -197 558 197 -583 -169 338 -14 -742
2844g42M05Q10m16n37P3P13m03k90L72L01r5r51N07R70m59p79M45N91n35o52P15
2865D3P56l94r51M29O39l22o17L85N88n95p68P25M47n1p17K44P26n51m86N29O49
2886G08n20r85N26N80m83J6J48L64l84k69K39L62q7q52N57O69o42m63N15N00o35
2907a36k21M79J42l20o98P51M76l92p31N36P01n98n88N62N57n46l44N47N14r23
2927b32rN01K28o35m58N37N35m23o08M22O44n07p15Q42M76q78m79R39O6j64m24
2948c42M45K15m41k73N14L16m66m44M93M03m40m70O61K42p49l09P34J97m94l93
2968f01O85L53l42k59K08O23q55n62R66M09o93n07N35O36o00o52Q90R7n49l54
2988e72O35K85l57l45N92P2l17m60N61M95q62n4L17N14p07j0M60J14n10k10M14
$$ plain form
2844 -742 -337 473 57 -480 -407 306 -97 -387 -15 286 191 -760 -253 717 258 -521 -76 515 -20 -672 43
2865 43 799 405 -546 -117 522 200 -417 -32 556 -39 -807 -82 365 314 -403 -159 567 16 -470 59 708
2886 708 188 -797 -271 309 -174 -158 -10 354 -30 -299 -60 302 215 -637 -80 589 -53 -516 -1 499 -136
2907 -136 -357 122 264 -56 -754 -3 473 81 -650 -114 587 -11 -599 -37 520 -26 -370 177 691 -232
2927 -232 -241 260 488 -147 -605 -68 467 44 -564 -142 502 -5 -720 122 598 -280 -759 180 246 82 -342
2948 -342 103 318 -123 -396 118 434 -32 -476 17 420 -20 -490 171 413 -336 -645 89 286 -208 -601
2968 -601 84 437 95 -164 44 667 -188 -750 216 625 -68 -575 -40 596 -4 -656 234 331 -218 -572
2988 -572 63 348 -9 -354 238 310 -7 -467 94 589 -273 -327 -10 504 -203 -213 247 361 -149 -359 55
3009E5M15p13l12N15N90n57n58O08M29o79k40P62K66p64l67O47M10o71j83N80
3029B33K7l22l48M28M27n43l75P90j34k49j02L63M9o52J66N26J17o53j35N68L97
3050E78p04k45K89M47m59n05Q12L39p93o5O37k4n32l16O84J9l89l1O95p8l87l05
3072c33P02J2o44k07P80j46n82j00P61m9n86k08J025j55n67O3O25N7o02N0J73
3093F9M68o50j82K98k1P9n44R09l09k83k43P65j04m58L0N00J98p19k32O60k43
3114a2n33M21Q9L01l65l21O50Mm68l0N49n1n44M6N76k46k98pN73lo60J97K54J76
3138B98m51j15N92k21k49k61Q26k19n65J99N27k0p53K76K99P2m83M43l2J2l09
3159a34OM10k16n78M08L91n9m64O0K78J31l97j54N79m6n20J85L98J45m75j38L74
$$ plain form
3009 55 470 -243 -555 -40 550 -7 -565 43 472 -207 -447 315 581 -183 -550 97 507 -164 -347 233
3029 233 260 -62 -410 18 445 -98 -473 317 183 -66 -168 195 244 -408 -242 284 401 -252 -387 181 578
3050 578 -126 -371 -82 365 -94 -599 213 552 -241 -306 331 307 -225 -541 143 162 -227 -258 437 359 -28 -333
3072 -333 369 381 -263 -470 310 164 -418 -518 243 194 -392 -600 425 270 -297 -234 391 448 -154 -104 69
3093 69 537 -113 -295 3 -18 61 -483 426 117 -166 -409 356 252 -206 -176 324 522 -197 -429 231 -12
3114 -12 -545 -124 -35 266 -99 -420 230 234 -234 -264 285 234 -310 -264 312 66 -232 -239 334 331 -329 -132 122 298
3138 298 -153 -268 324 103 -146 -407 419 200 -365 -166 361 341 -412 -136 163 235 -248 195 163 175 -134
3159 -134 -128 282 66 -512 -104 287 228 -236 -176 102 233 -164 -318 261 215 -305 -120 278 423 -52 -190 184
3181A84mn91N81M90o14k04n9L28O9l81J80M20j94p01K99J57J03o73O30K60j72
3202A08m30O3M43Q9n68J99L60jo33K9M27rn14M37J96k45p2O6L08k58m88L37O17
3225D61l55m97K30L30K12q17J18Q68m06m12j6M24J68m95J50K90j79j52j56Q17
3245E83m53o22O36M13n08l01L67J79j32m47NN54j34n82M63L35j86m78K58O84n58
3266G6l88L80K52l13m03K43M23l38k86K82K56j97k27J54N05k67m63L98K41m51
3286a23n12P10N7n0m73L44K90k51l11N57J90l77l86L66Nn8k89L20J06j26j84J42
3308e3L31k10m37M87M00m32j49L65k85j71k37K32N98l52k55K85r3j10q8K43R0
3329A59k13k12L21K32l87m55O19P9k59p3M18K06n79k18M03K94o2m38K04N00n61
$$ plain form
3181 184 180 -411 170 660 46 -158 -217 111 180 -201 -21 399 205 -496 -197 -40 63 -610 20 280 108
3202 108 -322 -259 184 273 -295 -96 264 263 -370 -341 86 77 -437 0 196 -49 -121 -55 253 -5 -493 -156 461
3225 461 106 -391 -161 169 381 -436 -318 550 144 -268 -284 140 308 -187 -37 253 74 -78 -234 583
3245 583 130 -492 144 557 49 -252 115 294 162 -285 -280 274 140 -442 21 356 170 -308 -50 634 76
3266 76 -312 68 320 7 -396 -153 270 -68 -354 -72 184 -13 -240 -86 419 152 -311 87 328 -123
3286 -123 -635 75 132 82 -391 -47 243 -8 -319 238 428 51 -335 31 36 -22 -311 9 115 -11 -195 -53
3308 -53 278 68 -369 118 518 86 -63 302 17 -154 -391 -159 439 87 -168 117 24 -86 -174 69 159
3329 159 -54 -266 55 287 -100 -555 64 143 -116 -189 229 435 -144 -362 41 335 273 -165 39 539 -22
3350b2l46L63J30m37j39M95K33k76j69o0N73m43k14J60O04l43l69K94K43j73J1
3371A15K59k4m17k52N10K35n67j91L97K20k96k48M04K77m08m37N44L48m10k96
3391b37N45K5r1k65p4K85k85r2O8N07k58k62q0N31p64J10M24Q5k61k49M29L74
3413D65l95k58L21k9j76J4J54K09k00m41M03N9k57j05N73m6l48j94K89J61n07
3434c08K95J87J50n33k33P94kn84k42L71M72m13l12M95L6k64p1M07J7q41M34M38
3456B93j90k99j69N39o6m60K47J37K06o41K69L36j04j26l69O87Rk54m4K54j09
3477A46k57j50L45K11p58L9Q49l52n51K83K95k25j85K21N6K83n14OM60k32l51
3498c81K30K41j19m8r7K97lk72O2J81J67l95l45O26m2m37j13M74J29l88J60K55
$$ plain form
3350 -22 -368 -5 125 -312 -451 44 277 1 -168 -228 345 -98 -312 -152 452 109 -260 34 277 104 115
3371 115 374 350 -67 -319 191 426 -141 -332 65 285 -11 -259 145 422 14 -423 121 469 59 -237
3391 -237 308 333 242 -23 -97 188 -97 -189 -121 386 128 -134 -214 317 -447 -337 87 172 -89 -338 91 465
3413 465 70 -188 133 104 -72 -58 96 305 105 -336 67 126 -131 -236 337 291 -57 -251 38 199 -308
3434 -308 -13 174 324 -209 -442 352 350 -234 -476 -105 367 -46 -358 137 173 -91 -162 245 262 -579 -145 293
3456 293 103 -196 -365 174 108 -352 -105 32 238 -403 -134 202 98 -28 -397 290 299 45 1 255 146
3477 146 -111 -261 84 295 -463 -424 425 73 -478 -195 100 -125 -310 -89 -33 250 -264 -258 202 -30 -381
3498 -381 -151 90 -29 -77 -174 123 120 -152 -90 91 258 -137 -482 144 102 -335 -448 26 155 -233 -73 182
3520A82J24n15JM62J21m73O0K54K38o37K5J42L23m71J2L00j84l81J54M32J5o24
3542d40K17K61K8m09J96N51j25l04l12O18k55l38k5M27J22o55L56L05j08l41K07
3563b4L39O7m57l7K70L0l62J9L74j01l19k03L65O5k96K41K51qn69K04L82k72m07
3586d48K41O04k21m84K3L16L1j09j66K29K62m42Q6M17p7m59K1L05J53n71K71J82
3608A64P0n12L30J94j95j71K77L77m36k22J92J54k48l10J57R1J3q2J78K23j74
3629G0k44J47K79j31l45L3N30k23k53J9M45l63k13R7L12n7o17M80L75o26N6k17
3651d46J000l61n69M81o7j68n9K79On6l18K91J86j10m24K58K71k08n31L54M58
3672B67j46l77K61K22m52j70M13L2k03j55M11J52j66n33M50K34k15k48K15J69
$$ plain form
3520 182 306 -209 -208 254 375 -98 -38 216 454 -183 -158 -16 307 -164 -152 148 -36 -417 -263 169 184 -440
3542 -440 -223 38 66 -343 -147 404 279 -25 -337 281 26 -312 -337 90 212 -443 -87 218 110 -231 -24
3563 -24 315 382 -75 -112 158 188 -174 -155 219 118 -201 -404 -39 26 -270 -29 222 214 -355 -151 231 -41 -448
3586 -448 -207 397 176 -308 -285 31 62 -47 -213 16 278 -164 -78 339 262 -197 -176 129 282 -289 -18 164
3608 164 234 -278 52 246 51 -120 157 534 98 -124 68 222 -26 -336 -179 -88 -75 -157 21 244 70
3629 70 -174 -27 252 121 -224 -191 339 116 -137 -118 327 -36 -249 -152 160 103 -514 -34 341 -285 -229 -446
3651 -446 554 193 -376 105 38 -130 -189 90 96 40 -278 13 199 89 -335 -77 194 -14 -545 -191 267
3672 267 121 -256 5 227 -225 -395 18 50 -153 -308 103 255 89 -444 6 240 25 -223 -8 161
3692A61q4l27M97J38l51j11J92K9j84j13L18L6j96l78L20K51j30k52L35M2k04
3713a1m10K06N83n65n2L22O1k05j20O8J51j4m58M48K74k85o2J14L16m88J09L21
3735C03k1k47k80L61J53l84j23J83L11j44l37J53J30m0l39J92L44k44k13J38L36
3756B32k04l92N36J07k64m22N73K4k26j64M73M7l77r8K44J00j49j34L8J12l04
3777b48J41J54nj60J08R5k4l24J51J4L26k36n2M15K31p60j17N20j73l05K16K08
3799A75J02m08P0J98L3l18p5K92R0k28j03K99J83l15k52M21J13l27k05L33L17
3820C95m92J09q9K26l25K96O1k4l29j76L96K74o36R2M10m8l20j40M88M0j61k38
3842a91N81k43m37m2K74K74k39kN7j10j64K2L34j04j79L5K39j34J14j44J01J80
$$ plain form
3692 161 77 -250 247 385 34 -77 115 144 -40 -153 165 201 5 -373 -53 198 68 -184 151 193 -11
3713 -11 -421 -215 368 -197 -249 73 134 -71 -191 -123 28 14 -444 4 278 -7 -69 45 361 -127 -18 303
3735 303 282 35 -245 116 269 -115 -238 -55 256 112 -225 -72 58 18 -321 -129 215 -29 -242 -104 232
3756 232 28 -364 172 279 15 -407 166 190 -36 -200 273 320 -57 -155 89 189 40 -94 -56 56 -248
3777 -248 -107 47 42 -118 -10 85 61 -263 -112 -98 228 -8 -60 355 586 -174 -291 229 56 -249 -33 175
3799 175 277 -131 -61 137 170 -148 -223 69 159 -69 -172 127 310 -5 -257 164 277 -50 -255 78 395
3820 395 -97 12 -77 149 -176 120 181 157 -172 -348 48 322 -314 -222 188 140 -180 -320 168 208 47 -191
3842 -191 390 147 -290 -332 -58 216 -23 -25 32 -78 -242 -220 114 10 -169 -134 105 -29 85 -59 42 222
3864B22m16j13N15l14M4k44N56j38n18Q0O01J53n39L24j55J85l57j47K13Mk97
3885c41J92M67k67l79J73N6L80m99K05K18Ml59k9M11O9n27kL78K3j82j40L22n2
3908A21l88j48O08j33j45j86L06M6k99L34Q1k42k26L01K85mm37j22M94j80kk57
3930a93K12J85l96L4L97k69N8l76M26o8l55K06M11nl82N4J44J45o34L68M97l06
3952A53k11J76K54l91m1j97M53q4o05K76N15m01p0J44j10L18l79l6N88o0o56J26
3974b38M08J12m72j25M48j77j06j22O27l12l13M46K55k98K3j91L13k90K1n0K74
3995B33kl15k37O32L3l24m3KJ67m18K91L72l83k84K18R5k28J19P3k7k2j38J69
4018a7K24j99l08J06L41m4j44P4L27l08j26P4Q4O5l16K64J37j47n72N42Jn2k36
$$ plain form
3864 222 -194 -307 208 -106 -62 -306 250 112 -406 -326 275 428 -111 213 58 243 -114 -261 -48 -44 -341
3885 -341 -149 318 51 -328 -155 -99 281 -218 -13 205 209 -150 -179 232 301 -226 -228 150 173 -9 -149 173 121
3908 121 -267 -415 193 60 -85 -271 35 81 -218 116 197 -45 -271 30 315 311 -126 -248 246 66 64 -193
3930 -193 19 204 -192 -158 239 -30 28 -348 78 10 -345 -139 272 267 -115 -61 83 228 -406 -38 459 153
3952 153 -58 118 372 -19 -60 -257 196 112 -493 -217 298 -103 -173 -29 -139 179 -200 -236 352 292 -364 -238
3974 -238 170 282 -190 -315 133 -44 -150 -272 355 43 -270 176 431 133 156 -35 278 -12 9 -41 233
3995 233 231 -84 -321 311 344 20 -23 -21 146 -272 19 391 8 -276 -58 37 -191 -72 1 -26 -48 -186 -17
4018 -17 207 8 -300 -194 147 103 -41 33 360 52 -74 0 84 149 -167 97 234 87 -485 57 58 6 -230
4041b30K16J72m66O4L19J21p0l89L75Q9k81k4J8M42l38k06J94K37l39k11M40O0
4063A93k19j49K47j32k63J31J15J57k3l04J81M65n25r8R4M53n42K1N1M11l55J29
4085C8k19N14k62m13O53qk37l50K99n3Km67P00l4j04l52L34J29k70n4J59J61k23
4108e7j44L74P9j80l05K91K42k99j90K31L07m81j23o1P53n64K18j99L59m37n8
4129b44M74M0m09J3K69R7k38k1j44L09j00r6J64J01j34k15P0L37k95j99M40M9
4151B68r0l83M24P5o12J66L74l21L8k21K20L31k67j22J11J28Nk61Q4J1l3k47N30
4174B08k24j31JK66J1k60k9L03j81j58K18O0K28m47j56M18j50O8j82L40j69j28
4196i4J4J69K65m71K80m8L4j47m9J13M8j34k76L52m6m8j93J34K29l73j08P18k92
$$ plain form
4041 -230 -14 158 -308 -244 75 196 126 -263 112 201 -80 -104 -86 356 18 -188 6 243 -96 -307 133 193
4063 193 -26 -175 72 -60 -323 -192 -77 80 57 -247 -66 399 -126 -224 -130 323 -219 -198 -147 264 -91 38
4085 38 -181 333 71 -342 311 303 66 -284 15 -38 -36 -503 197 163 59 -293 41 170 -100 -154 5 166 -57
4108 -57 -201 173 252 72 -233 58 300 1 -189 42 349 -132 -255 -316 437 -127 91 -108 251 -186 -244
4129 -244 230 270 -139 -126 143 240 2 -19 -163 146 46 -50 114 215 81 -134 -64 273 -22 -221 219 268
4151 268 178 -205 219 294 -318 -152 222 -99 -61 -282 -62 269 2 -120 -9 119 124 -137 -53 -42 -75 -322 208
4174 208 -16 -147 -146 120 131 -129 -158 145 -36 -194 24 84 312 -135 -291 127 -23 45 -137 203 34 -94
4196 -94 -80 89 354 -117 163 115 149 2 -47 66 114 -20 -296 56 10 -38 -231 -97 132 -241 -349 369 77
4219G7k55Q5K80J24l06j71K71J40n01J68J06J78l05J50L4j10J05n7L52l68p9J40
4241E8q2M28k43k84L65k20q3J00J27J61m11j63L21O6j45L3Q8m6q7j25j0M28m43
4264a67k20N82L3n81K98M64l27j22J6j74N04m06n2K46k00k02K61nJ21j68J23J37
4286A61K27l72k28K87R3Q2l36L50j13j68j48M87q8m53Q9N53m49j81J86R2K82o27
4308b74J8L14O8k50j82M99N5n26K14J09l0k02J08L78j46m09J04M54J8n98L08m0
4330a0K68l58N9K80l31N6K20J72l24o7J36J33l20J4k6M80k67l78K13K51n64L9
4352c24L66K52k98RM7Pj04j54K60L1J25m84J79J76Q8l54J93M16m56k13K33J78
4374A73L1l37J3P1k9J87pM2J3k60j19L22k90K37k02L93Q2n58L37O8k37L0n9L1
$$ plain form
4219 77 -178 -93 187 311 5 -166 105 245 -256 -88 18 196 -109 41 75 -35 70 13 365 -3 -82 58
4241 58 -24 404 161 -123 242 22 -61 39 166 327 -84 -247 74 140 -5 28 116 70 -17 -142 -152 276 -167
4264 -167 -387 195 228 -353 -55 409 82 -40 -24 -198 306 -100 -152 94 -106 -308 -47 -52 69 -99 24 161
4286 161 388 16 -212 75 168 250 -86 264 151 -17 -165 322 234 -219 -130 423 -26 -207 -21 71 353 -274
4308 -274 -256 58 126 -124 -306 193 248 -278 -64 45 15 -187 -79 299 153 -256 -152 302 320 -278 30 -10
4330 -10 258 -100 -41 239 -92 -36 184 356 32 -35 101 234 -86 -72 -98 382 115 -263 -50 201 -363 -324
4352 -324 42 294 -4 5 52 59 -45 -199 61 92 217 -267 -88 88 176 -178 15 431 -25 -238 -5 173
4374 173 204 -133 -120 -49 -78 109 102 144 157 -103 -222 100 -190 47 -155 238 320 -238 99 167 -70 -40 -99 -68
4398f8j7L4Q0J78k41R4n8J2J95n51L77n4K21l13O8J07r9n8K00J51m42j48K78J37
4422H3l22K12k9J73M0l88K67J34l20j90L47K99j46m15J36L23k30j36M81j23o3
4443A33l76K70J40k82J01j55K81j85k7O2P9J73n73K20J03Ol4J96j7j07k95M14
4465A27J19k61k64K7K80j39J17o1L98j03k73R5P2k44l37L23K41k46j91L40K05
4486B25l37j50J64K46l77P5L04L8k71j84L81K18m60L9K28J97m66p9K38L34o89
4507c26J35K73l5j30L3J09K49l97K3Q5j32J91k92M34l16J52k51M12J60m69j30
4528b22K2J54l92J80M75j91k38J32Q5M76n42m2L32k89J27m88L60Q5l4LJ64J48
4550C05m03J06k00L42j54p2Q2Q3k34MK95O3k61j04J36N4q5qL18Rm49J93K31j46
$$ plain form
4398 -68 -85 -51 29 207 -34 60 2 14 209 -342 35 -19 202 -111 -43 64 -35 -93 107 258 -184 -332 -54 83
4422 83 -239 -27 -56 117 157 -231 36 170 -150 -340 7 306 160 -255 -119 204 -26 -162 319 196 133
4443 133 -243 27 167 -115 -14 -169 112 -73 -100 -38 41 214 -359 -139 -36 -30 -64 132 115 8 -287 127
4465 127 246 -15 -279 -252 28 -111 6 -55 343 240 -33 62 134 -110 -447 -124 117 -129 -320 20 225
4486 225 -112 -262 -98 148 -229 -154 150 188 -83 -267 114 332 -128 -89 139 336 -130 -209 29 363 -326
4507 -326 -191 82 47 -83 -50 59 308 -89 -66 19 -113 78 -214 220 -96 56 -195 217 377 -92 -222
4528 -222 -200 -46 -438 -258 217 26 -212 -80 5 481 -61 -103 229 -60 67 -421 -61 24 -10 -7 157 305
4550 305 -98 8 -192 150 -4 -76 6 89 -145 -141 154 217 -44 -148 -12 42 -43 -51 267 276 -173 20 251 105
4574A05k06m9J73L63n50j19N35j89L8k00J36K53m64l4K61K36o29J24L43O7k16
4595b2k27N45m42J76p3L4L14l64n4J91n8j99kJ18P3k54O8J79M7k18KL23j70p7
4619i0J6L23j88k94J75J08j37n7q9J94J97j58j46M01m5l61r7M60P8m76J39L62
4641C15l56j29J26L61k03m21K33J05J19k94o8M34j43l26J47J93k13j84N9Q13o86
4662a18p6K31J98l20K06q8L45m47j18L16N7j17k21K50J63l04J60j44J06j2j80
4683a13K56j74m1j85K07L7K03l65m3L05L06l46Q2k8j67j55l9Q14o86p0K64K47
4705C09l23k47L63P7j02j30o9K01l33O5l6K36J55m09J58R7J89l84K83jL27n45
4727a19j44M74j57k17j0M09l22k07J70L37j16j87J39O7j22m5J70K22l20k27L99
$$ plain form
4574 105 -101 -150 23 386 -164 -283 252 63 101 -99 37 290 -174 -208 53 289 -340 -216 127 194 -22
4595 -22 -249 296 -146 30 -43 -9 305 -59 -113 78 20 -179 -181 -63 10 -244 -176 3 50 -168 -166 157 -13 -90
4619 -90 -74 249 61 -233 -58 50 -87 -144 -233 -39 158 0 -146 255 210 -151 -248 212 290 -186 -47 315
4641 315 -41 -170 -44 317 114 -307 -74 31 150 -144 -212 222 79 -247 -100 93 -120 -304 -245 568 -118
4662 -118 -194 37 235 -85 121 33 378 -69 -187 129 186 69 -152 98 261 -43 117 -27 79 67 -113
4683 -113 143 -31 -72 -257 -50 -13 190 -175 -218 87 393 47 129 101 -66 -221 -260 554 -132 -202 62 309
4705 309 -14 -261 102 179 77 -53 -122 79 -254 -189 -225 11 166 -243 -85 12 201 -183 100 99 426 -119
4727 -119 -263 211 54 -163 -173 236 -86 -293 -123 214 98 -89 50 117 -5 -50 120 342 22 -205 194
4748A94L4j06n56M05J34k39l2J38K45l06j3j0J89j52J16l3J92l65q5J22K37j58
4770d9J98p1J40k24j69K23J65J6o77M95J78j8p3j52L38n20N1K32j31N0k38K94
4792E8J45l54J76k7R7l7j98P7L24k6n14M09q9j08n8J85n6k27J88K03k44mk2L14
4816B12l8o9j68q6J48n3j68L35J64l55K57j76K89m67j55M20Q1k23k41M51J73l86
4838e5Q7n7J21P3k67jL04k79k3n5K97l03j48K23R1l14J99N1K42m97K72J72J31
4861B64k95j25K25QJ35m97N37l05k74j4K79M90m13j31K29O2m48J40J49K25m67
4882b26j55N50k16R2l42M15Op8j99N22j95j12K8j8q9o5J34J37j14k29r7K30K05
4905A84l04J01N0K21l71k99N40Q9m23N6J09J08q5k07N85n50j15J82L65J87m63
$$ plain form
4748 194 228 122 -434 -29 105 -134 -166 -28 217 -89 -102 -112 77 -75 41 8 200 -165 -250 -128 109 -49
4770 -49 149 78 218 -6 -175 48 213 229 -448 47 225 207 134 -18 320 -200 -149 83 -48 2 -236 58
4792 58 203 -151 25 -2 95 58 -140 -63 261 235 -279 130 41 -67 -125 60 4 -223 -35 168 -76 -80 -102 212
4816 212 174 105 -63 -149 -1 -54 -222 113 277 -78 179 3 292 -175 -330 90 171 -52 -293 158 331 -55
4838 -55 32 -25 96 169 -98 -99 205 -74 -97 -152 145 -158 -306 -83 8 -306 -107 -56 186 -311 -39 133 264
4861 264 -31 -156 69 77 212 -285 252 -53 -327 -341 -62 428 15 -116 113 175 -273 -133 16 241 -226
4882 -226 -381 169 -47 45 -297 118 124 46 -153 369 174 62 90 72 -17 -82 52 189 75 -154 -251 -21 184
4905 184 -120 -19 31 252 -119 -418 122 211 -212 -156 -47 61 -24 -231 354 -196 -311 -129 236 423 -40
4926d0k66O98j10l29j09L82j8n34J14K67J2Q8j97K1J74k67j07L01J42m68K48J76
4948A78k29m3j27K05K53K3m07O68m05l31K06j10M49l53J7N8N1L8k82J74J83k49
4970c3P4p8j1K5j52K49l1j13K60j63Lj14p0pK41p2k70O38n32K42j99K17R7j31
4994G0k61O16k73k97j01K51N0k84K31O9J06m65M16j82J0l32L72J30j0k56M8L05
5016B13Lm97J32L78k2l9k20J18J67n62L53J36j25m40M01K49m91N0J17J80N5l58
5038b02J28J60M5m26J72M86q4o74L09L17k29q2L31j24j0l36L77k00O8k01J72J97
5060A94o9j45N8J54j07l44M42j7l3k57o7K15L9k99K51L85o93rL93j32k2k33L64
5083F8J18k07l63K14O14n27r9l6M30m88j82N44K18l41O2k23L07k62JJ87q1J26
$$ plain form
4926 -40 -306 392 282 -47 -156 226 208 -326 -212 55 67 155 -42 -21 153 -114 -221 80 222 -246 2 178
4948 178 -51 -94 -221 -16 237 260 -147 521 116 -215 -9 -119 330 -23 -6 52 103 141 -141 33 216 -33
4970 -33 41 -37 -48 -23 -175 74 43 -70 190 27 30 -84 -154 -161 80 8 -262 376 -156 86 -113 104 201 70
4994 70 -191 425 152 -145 -246 5 55 -229 2 71 177 -288 128 -54 -44 -376 -4 126 116 -140 -92 213
5016 213 216 -281 -149 229 207 168 -52 66 233 -329 24 160 35 -405 -4 245 -246 -196 -79 101 156 -202
5038 -202 -74 86 131 -295 -123 363 279 -395 -86 231 2 -80 251 127 117 -219 158 -42 26 -175 -3 194
5060 194 125 -20 38 192 85 -259 183 166 133 -124 -191 24 63 -236 15 400 -293 -302 91 -41 -63 -296 68
5083 68 186 -21 -384 -170 444 -83 -182 -218 212 -276 -458 86 304 -37 25 -198 109 -153 -152 35 -46 80
5105H0k77J47M0N4j51mM1K06m22J50N52l75j23j00L57Qm60K07Q1Q9j68K04j56
5128b0J79l93N18L8k96l10QM37k60j34J90j11L95k89L23j49k22j04K57k1k3j50
5150a37K31K24j95m02K59K61j45l66L01Rj58J78k07N51l52j92L1J23m6j68J17
5171h3K11k29j25L31m3O9k00J85O0k34n09M02L07j53o6K08J91l05J2K7J76k27
$$ plain form
5105 80 -197 -50 -10 44 -107 -111 -70 136 -286 -136 416 41 -82 -182 175 183 -277 -70 11 100 -68 136 -20
5128 -20 159 -234 284 322 26 -284 -276 161 -99 -233 -43 -154 241 -48 275 126 -96 -200 57 36 13 -137
5150 -137 94 318 123 -279 -20 241 96 -270 31 40 -118 60 -147 404 52 -140 -109 14 -32 -200 -83
5171 -83 128 -101 -226 105 62 131 -69 116 176 -58 -567 -165 142 -11 -77 131 322 17 29 56 232 5
$$ [...]
8191i
##END NTUPLES=NMR FID
##END=
