##TITLE=1H_Ser DHN-N-OK
 DMSO-d6+CDCl3
 8 sc, 
 12.2.2024
##JCAMPDX= 6.0         $$ Bruker NMR JCAMP-DX V2.0
##DATA TYPE= NMR FID
##DATA CLASS= NTUPLES
##ORIGIN= UXNMR, Bruker Analytische Messtechnik GmbH
##OWNER= root
$$ XWIN-NMR		Version 3.5
$$ Mon Feb 12 14:13:49 2024 Russian Standard Time (UT+4h)  she@DPX200
##.OBSERVE FREQUENCY= 200.1313
##.OBSERVE NUCLEUS= ^1H
##.DELAY= (6, 6)
##.ACQUISITION MODE= SIMULTANEOUS
##.ACQUISITION SCHEME= undefined
##.AVERAGES= 8
##.DIGITISER RES= 18
##SPECTROMETER/DATA SYSTEM= spect
##.PULSE SEQUENCE= zg30
##.SOLVENT NAME= DMSO
##.SHIFT REFERENCE= (INTERNAL, DMSO, 0, 15.7039)
##AUDIT TRAIL= $$ (NUMBER, WHEN, WHO, WHERE, WHAT)
$$ ##TITLE= Audit trail, XWIN-NMR		Version 3.5
$$ ##JCAMPDX= 5.01
$$ ##ORIGIN= Bruker BioSpin GmbH
$$ ##OWNER= she
$$ F:/spectra/data/she/nmr/H-F/1/audita.txt
$$ ##AUDIT TRAIL=  $$ (NUMBER, WHEN, WHO, WHERE, WHAT)
(   1,<2024-02-12 14:12:36.03 +0400>,<she>,<DPX200>,
      <created by zg, POWCHK disabled, PULCHK disabled
       configuration hash MD5:
       00 E9 B6 7A A2 85 ED C7 34 08 36 98 17 FE 4E 26
       data hash MD5: 16K
       A6 7D 09 83 54 74 B1 38 98 57 68 D6 36 8E 90 B6>)
$$ ##END=
$$ 
$$ hash MD5
$$ 4F B6 F0 A5 94 F6 7F BF B5 BC F8 A6 05 20 E9 CA
##$RELAX= 
##$RELAX= 
##$RELAX= 
##$RELAX= 
##$RELAX= 
##$RELAX= 
$$ Bruker specific parameters
$$ --------------------------
##$DU= <F:/spectra>
##$EXPNO= 1
##$NAME= <H-F>
##$PROCNO= 1
##$TYPE= <nmr>
##$USER= <she>
##$AMP= (0..31)
100 100 100 100 100 100 100 100 100 100 100 100 100 100 100 100 100 100 
100 100 100 100 100 100 100 100 100 100 100 100 100 100 
##$AQSEQ= 0
##$AQ_mod= 1
##$AUNM= <au_zg>
##$AUTOPOS= <>
##$BF1= 200.13
##$BF2= 200.13
##$BF3= 200.13
##$BF4= 200.13
##$BF5= 200.13
##$BF6= 200.13
##$BF7= 200.13
##$BF8= 200.13
##$BYTORDA= 1
##$CFDGTYP= 0
##$CFRGTYP= 5
##$CHEMSTR= <none>
##$CNST= (0..31)
1 1 145 1 1 1 1 1 1 1 1 1 1 1 1 1 1 1 1 1 1 1 1 1 1 1 1 1 1 1 1 1 
##$CPDPRG= <>
##$CPDPRG1= <>
##$CPDPRG2= <>
##$CPDPRG3= <>
##$CPDPRG4= <mlev>
##$CPDPRG5= <mlev>
##$CPDPRG6= <mlev>
##$CPDPRG7= <mlev>
##$CPDPRG8= <mlev>
##$CPDPRGB= <>
##$CPDPRGT= <>
##$D= (0..31)
0 1.2 0 0 0 0 0 0 0 0.06 0 0.03 0 0 0 0 0.0002 0 0 0 0 0 0 0 0 0 0 0 0 
0 0 0 
##$DATE= 1707732755
##$DBL= (0..7)
120 120 120 120 120 120 120 120 
##$DBP= (0..7)
150 150 150 150 150 150 150 150 
##$DBP07= 0
##$DBPNAM0= <>
##$DBPNAM1= <>
##$DBPNAM2= <>
##$DBPNAM3= <>
##$DBPNAM4= <>
##$DBPNAM5= <>
##$DBPNAM6= <>
##$DBPNAM7= <>
##$DBPOAL= (0..7)
0.5 0.5 0.5 0.5 0.5 0.5 0.5 0.5 
##$DBPOFFS= (0..7)
0 0 0 0 0 0 0 0 
##$DE= 6
##$DECBNUC= <off>
##$DECIM= 32
##$DECNUC= <off>
##$DECSTAT= 4
##$DIGMOD= 1
##$DIGTYP= 9
##$DL= (0..7)
0 120 120 120 120 120 120 120 
##$DP= (0..7)
150 150 150 150 150 150 150 150 
##$DP07= 0
##$DPNAME0= <>
##$DPNAME1= <>
##$DPNAME2= <>
##$DPNAME3= <>
##$DPNAME4= <>
##$DPNAME5= <>
##$DPNAME6= <>
##$DPNAME7= <>
##$DPOAL= (0..7)
0.5 0.5 0.5 0.5 0.5 0.5 0.5 0.5 
##$DPOFFS= (0..7)
0 0 0 0 0 0 0 0 
##$DQDMODE= 0
##$DR= 18
##$DS= 0
##$DSLIST= <SSSSSSSSSSSSSSS>
$$ [...]
##$SUBNAM2= <"">
##$SUBNAM3= <"">
##$SUBNAM4= <"">
##$SUBNAM5= <"">
##$SUBNAM6= <"">
##$SUBNAM7= <"">
##$SUBNAM8= <"">
##$SUBNAM9= <"">
##$SW= 18.0517328524113
##$SWIBOX= (0..15)
0 0 2 0 0 0 0 0 0 0 0 0 0 0 0 0 
##$SW_h= 3612.71676300578
##$TD= 16384
##$TD0= 1
##$TE= 0
##$TE2= 300
##$TE3= 300
##$TEG= 300
##$TL= (0..7)
0 120 120 120 120 120 120 120 
##$TP= (0..7)
150 150 150 150 150 150 150 150 
##$TP07= 0
##$TPNAME0= <>
##$TPNAME1= <>
##$TPNAME2= <>
##$TPNAME3= <>
##$TPNAME4= <>
##$TPNAME5= <>
##$TPNAME6= <>
##$TPNAME7= <>
##$TPOAL= (0..7)
0.5 0.5 0.5 0.5 0.5 0.5 0.5 0.5 
##$TPOFFS= (0..7)
0 0 0 0 0 0 0 0 
##$TUNHIN= 0
##$TUNHOUT= 0
##$TUNXOUT= 0
##$USERA1= <user>
##$USERA2= <user>
##$USERA3= <user>
##$USERA4= <user>
##$USERA5= <user>
##$V9= 5
##$VALIST= <valist>
##$VCLIST= <CCCCCCCCCCCCCCC>
##$VD= 0
##$VDLIST= <DDDDDDDDDDDDDDD>
##$VPLIST= <PPPPPPPPPPPPPPP>
##$VTLIST= <TTTTTTTTTTTTTTT>
##$WBST= 1024
##$WBSW= 4
##$XGAIN= (0..3)
0 0 0 0 
##$XL= 0
##$YL= 0
##$YMAX_a= 60686
##$YMIN_a= -70991
##$ZGOPTNS= <>
##$ZL1= 120
##$ZL2= 120
##$ZL3= 120
##$ZL4= 120
##$ABSF1= 10
##$ABSF2= 0
##$ABSG= 5
##$ABSL= 3
##$ALPHA= 0
##$AQORDER= 0
##$ASSFAC= 0
##$ASSFACI= 0
##$ASSFACX= 0
##$ASSWID= 0
##$AUNMP= <proc_1d>
##$AZFE= 0.1
##$AZFW= 0.1
##$BCFW= 1
##$BC_mod= 2
##$BYTORDP= 1
##$COROFFS= 0
##$CY= 11.3945322036743
##$DATMOD= 1
##$DC= 2
##$DFILT= <>
##$DTYPP= 0
##$F1P= 15.7292609196834
##$F2P= 12.9074282941183
##$FCOR= 0.5
##$FTSIZE= 0
##$FT_mod= 4
##$GAMMA= 1
##$GB= 0.15
##$INTBC= 1
##$INTSCL= 1
##$ISEN= 128
##$LB= 0.24
##$LEV0= 0
##$LPBIN= 0
##$MAXI= 10000
##$MC2= 0
##$MEAN= 0
##$ME_mod= 0
##$MI= 1.114404
##$NCOEF= 0
##$NC_proc= 0
##$NLEV= 6
##$NOISF1= 3.799351
##$NOISF2= 2.8
##$NSP= 1
##$NTH_PI= 0
##$NZP= 0
##$OFFSET= 15.70392
##$PC= 1
##$PHC0= -24946.62
##$PHC1= 6.45268
##$PH_mod= 1
##$PKNL= yes
##$PPARMOD= 0
##$PSCAL= 0
##$PSIGN= 0
##$REVERSE= no
##$SF= 200.130013532006
##$SI= 16384
##$SIGF1= 3
##$SIGF2= 2
##$SINO= 400
##$SIOLD= 16384
##$SREGLST= <1H.CDCl3>
##$SSB= 0
##$STSI= 0
##$STSR= 0
##$SW_p= 3612.71676300578
##$SYMM= 0
##$S_DEV= 0
##$TDeff= 0
##$TDoff= 0
##$TI= <>
##$TILT= no
##$TM1= 0
##$TM2= 0
##$TOPLEV= 0
##$USERP1= <user>
##$USERP2= <user>
##$USERP3= <user>
##$USERP4= <user>
##$USERP5= <user>
##$WDW= 1
##$XDIM= 8192
##$YMAX_p= 0
##$YMIN_p= 0
$$ End of Bruker specific parameters
$$ ---------------------------------
##NTUPLES= NMR FID
##VAR_NAME=  TIME,          FID/REAL,        FID/IMAG
##SYMBOL=    X,             R,               I
##VAR_TYPE=  INDEPENDENT,   DEPENDENT,       DEPENDENT
##VAR_FORM=  AFFN,          ASDF,            ASDF
##VAR_DIM=   8192,          8192,            8192
##UNITS=     SECONDS,       ARBITRARY UNITS, ARBITRARY UNITS
##FACTOR=    0.0002768,     1,               1
##FIRST=     0,             0,               0
##LAST=      2.2672688,     0,               0
##MIN=       0,             -70991,          0
##MAX=       2.2672688,     60686,           0
$$ Real data points
##PAGE= N=1
##DATA TABLE= (X++(R..R)), XYDATA
$$ [...]
$$ plain form
1798 -370 -872 -758 -838 -717 193 336 194 1003 551 419 609 35 -205 -403 -638 -52 -287 -431 -100 -142 125
1819 125 193 264 678 863 297 576 431 -522 -290 -980 -754 -355 -488 97 523 978 1324 1072 512 277 -354
1840 -354 -932 -845 -1479 -799 -352 -451 328 194 456 931 547 655 786 455 340 158 -799 -584 -1007 -1147 -774
1861 -774 -822 -311 657 284 976 1141 969 816 41 -512 -448 -877 -691 -205 -530 302 359 92 181 -35 79
1882 79 229 -506 48 420 -18 337 262 -88 72 -235 -213 33 -234 52 171 -155 323 181 -474 -52 -471
1903 -471 -33 490 -136 346 734 307 482 -120 -373 82 -500 -376 -65 6 332 771 153 -49 -261 -440
1923 -440 81 -481 -212 383 198 254 314 47 374 104 -458 -51 -226 -47 183 -484 47 -36 -411 -176 -152
1944 -152 -50 438 31 337 883 414 454 -156 -605 -248 -663 -933 -89 -47 90 401 87 498 367 73 112
$$ packed form
1798c70n02J14q0J21R10J43j42Q09m52j32J90n74k40j98k35N86k35j44L31m2K67
1819A25O8P1M14J85n66K79j45r53K32o90K26L99j33N85M26M55L46k52n60k35o31
1840c54n78Q7o34O80M47r9P79j34K62M75l84J08J31l31j15j82r57K15m23j40L73
1861g74m8N11R68l73O92J65j72j53p75n53O4m29J86M86l25Q32N7k67Q9k16J14
1882G9J50p35N54L72m38L55p5l50J60l07K2K46k67K86J19l26M78j42o55M22m19
1903d71M38N23o26M82L88m27J75o02k53M55n82J24L11P1L26M39o18k02k12j79
1923d40N21n62K69N95j85N6O0k67L27k70n62M07j75J79K30o67N31q3l75K35K4
1944a52J02M88m07L06N46m69M0o10m49L57m15k70Q44M2J37L11l14M11j31k94L9
$$ plain form
1965 112 21 -129 189 196 -24 79 -289 -186 -269 -689 -203 22 -16 350 224 470 617 339 243 26 -115 -103
1987 -103 -219 108 96 -305 -409 -162 -656 -241 -38 -635 338 385 502 988 415 254 201 -560 -586 -653 -895 -488
2009 -488 -219 -215 300 234 329 484 -4 357 -44 -36 160 -312 -297 185 -619 -567 -265 -473 -53 512 234 777 596
2032 596 199 -27 -823 -671 -502 -1016 -344 91 389 669 805 514 818 37 56 73 -500 -226 -503 -543 -83
2053 -83 -353 -311 56 -165 173 599 170 587 714 352 175 -727 -769 -622 -766 -640 -76 -263 251 650 601
2074 601 614 225 198 137 -241 -197 -39 -31 -56 179 -221 34 -199 -367 -58 -6 210 721 -13 401 458 -69 45
2097 45 43 -253 133 -121 -93 387 111 199 -194 -151 4 -241 -359 304 137 116 762 518 223 -140 -280 -109
2119 -109 -332 -444 21 -398 130 331 -221 464 135 -502 50 -79 120 399 44 308 60 -141 -80 -215
$$ packed form
1965A12r1j50L18Pk20J03l68J03q3m20M86K25l8L66j26K46J47k78r6k17j41J2
1987a03j16L27j2m01j04K47m94M15K03n97R73M7J17M86n73j61n3p61k6o7k42M07
2009d88K69MN15o6R5J55m88L61m01QJ96m72J5M82q04N2L02k08M20N65k78N43j81
2032E96l97k26p96J52J69n14O72M35K98K80J36k91L04p81J9J7n73K74k77m0M60
2053h3k70M2L67k21L38M26m29M17J27l62j77r02m2J47j44J26N64j87N14L99m9
2074F01J3l89k7o1l78M4J58Qk5K35m00K55k33j68L09N2K16N11p34M14N7n27J14
2097D5kk96L86k54K8M80k76Q8l93M3J55k45j18O63j67k1O46k44k95l63j40J71
2119a09k23j12M65m19N28K01n52O85l29o37N52j29J99K79l55K64k48k01O1j35
$$ plain form
2139 -215 -316 -83 26 -232 304 87 195 231 -374 134 -25 -419 -55 129 60 695 51 86 338 -120 -74
2160 -74 -259 -232 206 -16 -71 354 -228 -14 185 -237 -37 108 -216 473 267 318 269 213 -34 -20 -439 -324
2182 -324 -335 -471 84 119 153 -132 -109 50 317 34 207 405 -58 202 -202 -213 -72 -726 -507 -609 -303 -91
2204 -91 294 431 828 604 302 568 -200 -15 -299 -222 -346 -426 -260 -146 -217 -159 310 16 9 636 173 498
2226 498 564 -47 143 -125 -646 -284 -528 -267 142 141 652 400 175 442 91 -368 -44 -561 -294 27 -556
2247 -556 307 373 432 227 197 265 233 -26 -150 5 -264 -328 9 -421 -157 -156 -197 448 494 511 593 499 321 148
2271 148 -320 -166 -667 -490 -109 -459 -244 188 -152 457 130 29 390 57 -49 281 16 146 14 -363
2291 -363 -265 -261 -288 -38 18 -252 254 -154 74 168 -85 -72 38 -171 194 -116 -166 455 -36 7 105 -465 -164
$$ packed form
2139b15j01K33J09k58N36k17J08L6o05N08j59l94L64J84o9O35o44L5K52m58M6
2160g4j85K7M38k22n5M25n82K14J99m22K00J45l24O89k06N1m9n6k47J4m19J15
2182c24j1j36N55L5L4k85K3J59K67k83J73J98m63K60m04j1J41o54K19j02L06K12
2204i1L85J37L97k24l02K66p68J85k84P7j24q0J66J14p1N8M69k94pO27m63L25
2226D98O6o11J90k68n21L62k44K61M09jN11k52k25K67l51m59L24n17K67L21n83
2247e56Q63O6N9k05l0O8l2k59j24J55k69o4L37m30K64Jm1O45M6J7Q2r4j78j73
2271A48m68J54n01J77L81l50K15M32l40O09l27j01L61l33j06L30k65J30j32l77
2291c63R8Mk7K50N6k70N06m08K28R4k53J3J10k09L65l10n0O21m91M3R8n70L01
$$ plain form
2314 -164 -477 -394 10 -79 7 115 122 569 305 181 276 -246 -58 277 -217 -336 -256 -257 -61 -150 -70 102 92 87 427
2339 427 222 232 427 -252 -222 -157 -432 -252 -276 94 306 -71 225 282 29 50 42 -268 137 -125 -111 201 150
2362 150 63 196 -34 -106 -130 36 141 150 -184 275 10 -125 334 -447 -14 -168 -23 272 101 280 293 -38
2384 -38 81 127 -51 -283 -281 -247 0 88 -286 222 20 249 80 77 238 243 199 217 -135 -11 25 -524 -460 -288 -726
2409 -726 -492 -68 -105 322 66 471 481 66 342 304 61 192 -133 -475 -160 -266 -371 -151 94 140 197 278
2431 278 289 335 190 189 129 -180 -123 -446 -236 -235 -58 -125 -55 59 243 369 -50 182 -158 -135 -8 -404 -40 9
2455 9 -246 54 96 -111 251 34 51 -105 36 46 -91 -216 45 -233 -90 60 -135 -143 213 152 150 161 55 26
2479 26 -135 -332 -17 -194 -201 -86 109 185 198 68 432 36 33 24 -194 -162 516 42 -21 -90 -198 108 109 -206 108
$$ packed form
2314a64l13Q3M04q9Q6J08PM47k64j24R5n22J88L35m94j19Q0jJ96q9Q0J72j0nL40
2339D27k05J0J95o79L0O5k75J80k4L70K12l77K96N7k53K1ql10M05k62J4L12n1
2362A50q7J33k30p2k4J66J05Rl34M59k65j35M59p81M33j54J45K95j71J79J3l31
2384c8J19M6j78k32KL4K47Q8l74N08k02K29j69lJ61Nm4J8l52J24L6n49O4J72m38
2409g26K34M24l7M27k56M05J0m15K76l8k43J31l25l42L15j06j05K20K45M6N7Q1
2431B78J1M6j45jo0l09N7l23K10JJ77o7P0J14J84J26m19K32l40K3J27l96L64M9
2455Ik55L00M2k07L62k17J7j56J41J0j37j25K61k78J43J50j95qL56o1kJ1j06k9
2479B6j61j97L15j77pJ15J95P6J3j30L64l96lrk18L2O78m74o3o9j08L06Jl15L14
$$ plain form
2504 108 28 23 58 -122 27 -48 -115 78 -57 173 419 -66 16 303 10 23 -272 -124 -167 -332 -392 16 15 -48
2528 -48 483 -3 351 221 -60 200 1 -79 183 -187 -240 -162 -216 -12 120 172 410 223 351 378 78 50 -147
2551 -147 95 -183 -470 -201 43 -230 -6 294 363 57 133 196 24 110 -201 94 -55 2 89 -260 -217 53
2573 53 -109 41 171 -217 367 -108 -87 -73 -197 -414 70 -16 155 -183 159 207 143 49 153 -95 99 25 -321
2596 -321 30 -4 -226 -23 -103 51 10 -198 219 -104 -63 227 330 106 76 -168 -347 -55 -663 -223 -56 -172
2618 -172 -123 -36 59 314 -43 -16 -121 44 82 147 -11 71 -178 -245 117 -234 -245 -69 -204 184 195 104 192 406
2642 406 269 -33 111 -313 -115 -352 -48 241 -26 -73 39 51 -30 -130 -100 67 125 -76 106 -201 46 -216
2664 -216 82 151 -211 -204 35 -11 -62 308 -193 129 -174 -187 -108 -226 54 218 131 270 177 -276 22 -134 -260
$$ packed form
2504A08q0nL5j80J49p5o7J93j35K30K46m85Q2K87k93J3k95J48m3j65o0M08jo3
2528d8N31m86L54j30k81K60j99q0K62l70n3P8n4K04J32N2K38j87J28K7l00k8j97
2551a47K42k78k87K69K44k73K24L00O9l06P6O3j72Q6l11K95j49N7Q7l49M3K70
2573E3j62J50J30l88N84m75K1J4j24k17M84q6J71l38L42M8o4r4J04k48J94p4l46
2596c21L51l4k22K03q0J54m1k08M17l23M1K90J03k24l0k44j79K92o08M40J67j16
2618a72M9Q7R5K55l57K7j05J65L8O5j58Q2k49o7L62l51j1J76j35L88J1r1Q8K14
2642D06j37l02J44m24J98k37L04K89k67m7J12J2q1j00L0J67N8k01J82l07K47k62
2664b16K98O9l62PK39m6n1L70n01L22l03j3P9j18K80J64q7J39r3m53K98j56j26
$$ plain form
2687 -260 -131 -6 -125 -239 -86 -79 -143 183 106 -120 203 213 74 325 159 31 194 2 -36 -150 -141 -120 -26
2710 -26 -80 117 263 148 112 -47 -107 88 61 -148 393 172 36 357 -22 132 115 -306 -167 -253 -159 -1 -27
2733 -27 -62 173 -118 161 315 46 387 36 132 24 -295 91 99 -464 -405 -323 -267 113 -246 80 215 17 97
2756 97 154 103 50 42 -240 6 -226 -1 42 -276 -51 83 -162 218 179 113 455 66 63 279 -41 -142 43 -194
2780 -194 -134 -74 -23 384 89 -151 181 71 108 -32 -75 -9 -202 -45 188 106 -215 -66 -139 189 -254 42 -73
2803 -73 -69 -22 21 -130 -95 -158 -44 -178 14 97 162 220 352 279 235 175 143 -157 -210 -44 -344 -133 -254 -120 -280
2828 -280 12 13 51 -76 211 354 -7 -89 -125 4 -145 -275 -477 -109 -147 -48 9 -148 283 191 -97 -25 -68 -216
2852 -216 251 -255 107 -149 -56 -66 43 -42 -421 -309 121 194 -248 -30 81 -53 20 -249 -207 166 -15 -62
$$ packed form
2687b60J29J25j19j14J53Po4L26p7k26L23J0j39K51j66j28J63j92l8j14RK1R4
2710b6n4J97J46j15l6j59o0J95k7k09N41k21j36L21l79J54j7m21J39q6R4J58k6
2733b7l5K35k91K79J54k69L41l51R6j08l19L86Qn63N9Q2N6L80l59L26J35j98Q0
2756I7N7n1n3qk82K46k32K25M3l18K25J34k45L80l9o6L42l89lK16l20j01J85k37
2780a94O0O0N1M07k95k40L32j10L7j40m3O6j93J57K33q2l21J49p3L28m43K96j15
2803g3MM7M3j51L5o3J14j34J92Q3O5N8J32p3m4o0l2l00n3J66l00K11j21J34j60
2828b80K92JL8j27K87J43l61q2l6J29j49j30k02L68l8R9N7j57M31r2k88P2m3j48
2852b16M67n06L62k56R3j0J09q5l79J12M30P3m42K18J11j34P3k69M2L73j81m7
$$ plain form
2874 -62 194 -14 -71 -46 -49 18 -91 -255 2 25 150 175 39 173 137 153 84 -57 -119 41 -40 -122 -104 -152 -251 12
2900 12 -246 -145 -35 -105 -97 78 144 -74 108 204 -184 -55 152 -37 -229 -315 52 95 -8 -387 31 -160 -83
2923 -83 -44 -67 -8 147 -162 -126 -107 -124 -51 406 16 88 24 5 163 9 -70 -99 63 -147 45 -81 26 139
2947 139 111 80 -117 -148 14 -381 -234 -306 -325 -51 -311 -232 271 43 171 145 -8 392 222 -152 -116 -70 -27
2970 -27 -56 -207 -61 -123 -120 -3 -75 220 387 124 61 68 145 66 173 -200 -55 74 -77 55 -19 -145 178 187 -181
2995 -181 124 -90 107 -44 -206 -14 30 186 224 -32 142 -18 -101 160 41 -228 -163 -124 -106 -91 190 21
3017 21 -196 -174 176 -87 276 251 126 98 34 94 -157 124 47 -462 -46 -52 87 -171 -195 171 139 -16 150 -152
3041 -152 74 97 -117 -165 -293 -69 -111 -142 -220 -6 -185 35 -57 43 139 112 86 54 -71 27 -6 -32 0 188 -279
$$ packed form
2874f2K56k08n7K5lO7j09j64K57K3J25K5j36J34l6J6o9j41o2J60q1q2J8m8r9K63
2900A2k58J01J10p0QJ75O6k18J82R6l88J29K07j89j92q6L67M3j03l79M18j91P7
2923h3L9k3N9J55l09L6J9j7P3M57l90P2o4j9J58j54p9k9J62k10J92j26J07J13
2947A39k8l1j97l1J62l95J47p2j9K74k60P9N03k28J28k6j53M00j70l74L6M6M3
2970b7k9j51J46o2LJ17p2K95J67k63o3PP7p9J07l73J45J29j51J32p4j26L23Rl68
2995a81L05k14J97j51j62J92M4J56L8k56J74j60q3K61j19k69O5L9J8J5K81j69
3017B1k17K2L50k63L63k5j25k8o4O0k51K81p7n09M16oJ39k58k4L66l2j55J66l02
3041a52K26K3k14m8j28K24m2l1p8K14j79K20r2J00R6k7k6l2j25R8l3k6L2J88m67
$$ plain form
3066 -279 156 -118 -29 137 61 165 -175 271 -52 103 80 170 -107 -37 82 -155 -104 22 -183 76 -114 -427
3088 -427 75 -26 -16 -89 -85 -114 194 189 160 -52 -102 -41 -199 102 178 -77 211 30 -175 79 -42 -126 30 -95
3112 -95 129 -36 -60 -193 7 -192 -75 -44 130 225 -115 39 98 -320 -81 -57 -181 87 -21 -33 41 -187 44
3135 44 98 255 238 189 -109 121 -213 -184 -87 -119 -245 103 -271 -131 -2 -124 134 165 -42 266 228 -127 -109
3158 -109 -51 55 -129 -258 -153 63 -314 127 34 93 88 20 -15 154 77 32 107 174 -130 9 21 -46 -276 139
3182 139 45 -18 -2 78 -84 65 94 -43 76 67 -102 17 10 255 -8 -93 266 81 -66 53 30 4 222 -23
3206 -23 31 -9 -255 15 133 -146 -293 -63 -38 -4 -49 -147 -98 -175 133 -188 72 -217 217 54 99 -255 111
3229 111 -62 -38 169 52 45 -21 -35 -161 326 -68 -213 17 103 -9 -152 60 -62 25 4 236 99 17 -231
$$ packed form
3066b79M35k74Q9J66p6J04l40M46l23J55k3R0k77P0J19k37N1J26k05K59j90l13
3088d27N02j01J0p3Mk9L08nk9k12n0O1j58L01P6k55K88j81k05K54j21q4J56j25
3112i5K24j65k4j33K00j99J17L1J74R5l40J54N9m18K39K4j24K68j08j2P4k28K31
3135D4N4J57j7m9k98K30l34K9R7l2j26L48l74J40J29j22K58L1k07L08l8l55J8
3158a09N8J06j84j29J05K16l77M41r3N9no8l5J69p7m5P5O7l04J39J2o7k30M15
3182A39r4o3J6Q0j62J49K9j37J19rj69J19pK45k63q5L59j85j47J19k3k6K18k45
3206b3N4m0k46K70J18k79j47K30K5L4m5r8M9p7L08l21K60k89M34j63M5l54L66
3229A11j73K4K07j17po6j4j26M87l94j45K30Q6j12j43K12j22Q7k1K32j37q2k48
$$ plain form
3252 -231 -33 112 -187 103 -204 -170 153 -192 -21 43 68 -40 316 -201 -94 -60 255 132 -266 -117 216
3273 216 102 -39 -44 -18 29 148 58 -190 111 -79 -125 61 28 155 9 -159 309 11 8 -215 -154 -160 -35 11
3297 11 283 167 4 49 42 -83 73 159 302 219 94 74 205 22 22 89 11 -135 -52 16 28 -29 -12 46 246 40
3323 40 -233 104 4 -180 23 -21 -198 55 205 118 34 285 -25 -209 46 74 -1 -139 -136 208 330 131 -177
3346 -177 381 187 115 69 -123 28 -32 -14 -93 144 -93 76 78 -175 201 91 0 187 -87 95 -178 -56 33
3369 33 -239 -276 -109 79 51 42 58 154 112 -93 154 19 132 40 12 10 132 -3 -140 -214 45 -117 -49 67 67
3394 67 -158 1 -80 54 204 -144 -173 -45 -96 -108 -154 -108 -159 -71 -34 -108 -82 119 91 53 -67 -25 187 24 169
3419 169 167 -99 78 29 87 157 61 -22 -102 94 54 -197 -75 269 -32 100 -54 171 -58 136 -208 98 26
$$ packed form
3252b31J98J45k99K90l07L4L23l45J71O4K5j08L56n17J07L4L15j23l98J49L33
3273B16j14j41nK6M7J19r0k48L01j90m6J86l3J27j46j68M68k98lk23O1oJ25M6
3297A1K72j16j63M5pj25J56Q6J43q3j25k0J31j83%O7p8j46Q3O8J2n7J7N8K00k06
3323D0k73L37j00j84K03m4j77K53J50q7q4K51l10j84K55K8p5j38LL44J22j99l08
3346a77N58j94p2m6j92J51o0J8p9K37k37J69Kk53L76j10r1J87k74J82k73J22Q9
3369C3k72l7J67J88k8rJ6R6m2k05K47j35J13r2k8kJ22j35j37p4K59j62O8J16%
3394F7k25J59q1J34J50l48k9J28n1j2m6M6n1Q8L7p4K6K01k8l8j20M2K12j63J45
3419A69kk66J77m9N8P0r6q3q0J96m0k51J22L44l01J32j54K25k29J94l44L06p2
$$ plain form
3442 26 -263 117 203 -196 129 76 -64 40 44 75 103 -61 17 -6 200 45 240 17 -85 70 -171 -188 62
3465 62 9 -13 -175 108 -19 118 -145 109 115 -189 252 -42 -70 72 120 -149 136 235 147 48 61 -33 -11 -112
3489 -112 -5 -52 -148 173 120 -21 159 34 -48 2 -127 -189 75 -191 -142 -86 47 181 -223 93 146 84 37 -39
3513 -39 23 198 12 -286 -56 -325 -42 -85 -93 -21 136 136 337 242 259 135 -61 -38 -102 -66 32 -127 -96 -103 -67 -15
3539 -15 270 -60 -55 124 -102 146 126 53 -75 57 -66 160 318 -119 -51 -261 241 79 70 205 113 -102 -84
3562 -84 13 12 277 196 12 406 36 98 -6 -63 201 -57 116 119 -83 -223 118 -170 -68 64 104 -214 -188 46
3586 46 -98 -34 364 -92 -95 165 70 -108 107 -84 107 76 -6 127 214 -87 83 -37 -94 -119 -185 39 11 -39
3610 -39 12 50 201 168 -162 48 162 -44 100 -53 -93 96 -28 247 -133 223 109 -215 -109 -81 -30 -266
$$ packed form
3442B6k89L80Q6l99L25n3j40J04ML1K8j64P8k3K06j55J95k23j02J55k41j7K50
3465F2n3k2j62K83j27J37k63K54Ol04M41k94k8J42M8k69K85R9q8r9J3r4K2j01
3489a12J07m7r6L21n3j41J80j25q2N0j29o2K64k66M9N6J33J34m04L16N3o2m7p6
3513c9O2J75j86k98K30k69K83m3qP2J57%K01r5J7j24j96K3o4L6R8j59L1pL6N2
3539a5K85l30NJ79k26K48k0p3j28J32j23K26J58m37O8k10N02j62rJ35r2k15J8
3562h4R7jK65q1j84L94l70O2j04n7K64k58J73Lk02j40L41k88J02J32M0l18K6K34
3586D6j44O4L98m56lK60r5j78K15j91J91l1q2J33Q7l01J70j20n7k5o6K24k8n0
3610c9N1L8J51l3l30K10J14k06J44j53m0J89j24K75l80L56j14l24J06K8N1k36
$$ plain form
3632 -266 39 47 -171 11 57 29 112 82 -246 -261 87 155 156 69 187 191 -50 -37 -88 54 72 15 -24 -194 -6 94
3658 94 13 79 -107 42 -157 40 -83 -246 278 154 -63 72 -49 133 -61 -110 318 66 59 -35 -172 -186 206
3681 206 142 0 -112 221 136 -96 -90 46 96 221 -39 42 38 78 -122 -280 -60 -61 -221 -126 33 -213 62 202
3705 202 71 118 -18 -43 87 -168 -34 -138 -115 10 26 9 1 57 -170 42 -71 108 -8 -195 -24 -22 139
3728 139 -98 -60 -1 156 106 291 11 -109 -16 -13 -4 -132 -109 190 -44 -5 37 -30 177 -92 -73 -206 -14 58 -171
3753 -171 -46 -101 85 66 -144 46 85 213 232 -84 -93 12 325 13 -177 -62 36 41 231 68 150 100 84 14
3777 14 18 -131 76 193 211 1 108 -100 -159 -103 195 -44 -54 -42 -110 153 91 11 -65 -53 -283 96 -52 23 -111
3802 -111 -9 -83 -42 16 52 83 6 -51 50 -39 -115 115 18 202 115 -135 -100 199 -93 -23 101 -4 149 -137
$$ packed form
3632b66L05Qk18J82M6k8Q3l0l28j5L48O8Jq7J18Mk41J3n1J42J8n7l9j70J88J00
3658I4q1O6j86J49j99J97j23j63N24j24k17J35j21J82j94m9M28k52pr4j37j4L92
3681B06o4j42j12L33q5k32OJ36N0J25k60Q1mM0k00j58K20jj60R5J59k46K75J40
3705B02j31M7j36k5J30k55J34j04K3J25J6j7qN6k27K12j13J79j16j87J71KJ61
3728A39k37L8N9J57n0J85k80j20R3LRj28K3K99k34L9M2o7K07k69J9j33J92P2k29
3753a71J25n5J86j9k10J90L9J28J9l16rJ05L13l12j90J15R8NJ90j63Q2n0j6p0
3777A4Mj49K07J17J8k10J07k08n9N6K98k39j0J2o8K63o2q0p6J2k30L79j48P5j34
3802a11J02p4M1N8L6L1p7n7J01q9p6K30r7J84q7k50L5K99k92P0J24j05J53k86
$$ plain form
3826 -137 43 59 -128 113 358 -77 288 178 42 -19 -276 155 59 200 47 -115 -213 -90 -116 -50 -53 85 -91
3849 -91 -50 136 282 70 190 -79 191 -47 44 130 -77 112 -13 -9 -122 -61 -124 138 -63 72 160 204 247 -46
3873 -46 -64 28 -180 -110 86 -114 -45 48 -195 161 68 3 -63 -19 -186 -139 -9 112 -20 67 147 1 -53 14 -124
3898 -124 14 -281 19 84 -162 123 -106 -183 -37 -44 -29 199 97 -42 204 -90 -3 -24 -152 -155 53 -167 -134
3921 -134 73 158 -64 92 32 391 205 117 17 -21 145 -51 92 -80 -135 -54 -13 118 -81 231 41 -33 -100
3944 -100 -293 124 -92 -80 -60 98 96 91 -60 22 76 -210 28 169 -68 42 -168 -5 122 -40 117 -58 55
3967 55 98 -50 -13 -265 22 -222 -156 -153 -51 237 212 166 295 140 4 129 28 305 -48 -88 -114 130 -32
3990 -32 -30 -208 39 -27 224 -1 3 147 106 40 20 -199 -168 25 121 18 111 80 153 -63 -377 -164 69 -32 -41
$$ packed form
3826a37J80J6j87K41K45m35L65j10j36o1k57M31r6J41j53j62r8J23k6O6lJ38j76
3849i1M1J86J46k12J20k69K70k38R1Q6k07J89j25Mj13O1o3K62k01J35Q8M4M3k93
3873d6j8R2k08P0J96k00O9R3k43L56r3o5o6M4j67M7J30J21j32Q7Q0j46n4O7j38
3898a24J38k95L00O5k46K85k29p7J46pJ5K28j02j39K46k94Q7k1j28lK08k20L3
3921a34K07Q5k22J56o0L59j86q8j00l8J66j96J43j72n5Q1M1J31j99L12j90p4o7
3944a00j93M17k16J2K0J58knj51Q2N4k86K38J41k37J10k10J63J27j62J57j75J13
3967E5M3j48L7k52K87k44O6LJ02K88k5m6J29j55j36J25j01K77l53m0k6K44j62
3990c2Kj78K47o6K51k25MJ44m1o6k0k19L1J93R6j03R3l1P3k16l14K13K33j01r
$$ plain form
4015 -41 -164 30 75 -96 19 -73 -81 83 -14 50 42 72 -141 78 -112 -87 -43 -324 87 102 81 13 103 143 156 16
4041 16 90 32 55 140 157 -39 -123 185 44 -123 -180 -97 -181 -144 -60 -86 -165 75 -355 42 -30 95 79 -9 50 -73
4067 -73 -9 -102 -299 55 79 -58 -172 73 -1 14 29 181 -112 -270 -53 -205 -65 -142 -14 -18 36 52 -89 -89 89
4092 89 115 -79 -239 -41 -10 216 -4 -89 -101 16 157 117 -55 6 34 253 -23 -134 -65 -216 -160 201 25
4115 25 73 5 233 76 -181 -198 -67 -172 61 -69 -122 68 4 -151 48 -81 -19 154 16 58 80 66 131 180
4139 180 12 4 -249 -122 -130 -91 -49 276 -2 45 8 -222 -165 87 -67 137 104 -88 -44 -65 -33 5 37 186 -8
4164 -8 110 -95 141 22 -46 130 35 -35 -430 37 -131 128 70 119 6 64 80 -12 95 -147 132 -155 55
4187 55 110 -175 149 110 139 -67 53 -21 -15 -12 -123 -27 -160 7 1 -209 44 89 -166 -191 -155 -81 4 -132 244 -132
$$ packed form
4015d1j23J94M5j71J15r2qJ64r7O4qL0k13K19j90K5M4k81M11J5k1o8R0M0J3j40
4041A6P4n8K3Q5J7j96q4L08j41j67n7Q3q4L7Q4k6p9K40m30L97p2J25j6q8N9j23
4067g3O4r3j97L54K4j37j14K45p4J5J5J52k93j58K17j52J40p7J28mN4J6j41%J78
4092H9K6j94j60J98L1K26k20q5j2J17J41m0j72O1K8K19k76j11O9j51N6L61j76
4115B5M8o8K28j57k57j7J31j05K33j30n3J90o4j55J99j29O2J73j38M2K2j4O5M9
4139A80j68qk53J27qL9M2L25k78M7l7k30N7K52j54K04l3j92M4k1L2L8L2J49j94
4164hJ18k05K36j19o8J76r5p0l95M67j68K59n8M9j13N8J6r2J07k42K79k87K10
4187E5N5k85L24l9K9k06J20p4OLj11R6j33J67ok10K53M5k55k5L6P4Q5j36L76l76
$$ plain form
4213 -132 -168 -77 163 -28 -61 240 109 -324 4 -181 -24 142 -74 52 213 145 104 -51 34 90 -99 80
4235 80 69 -206 -197 -30 -7 15 98 -32 -325 48 172 -193 215 -95 37 -81 105 77 -28 -8 -11 147 75 -35
4259 -35 -133 -346 59 1 -124 -23 -280 92 20 -66 30 104 6 -131 -72 -167 196 60 -115 -113 -185 171 -28 -56 264
4284 264 132 50 -239 4 76 105 -248 85 -100 -347 52 -11 11 -86 -179 -155 -78 -51 45 -11 84 -126 29 -275
4308 -275 -21 -40 -5 86 -12 98 -28 88 154 39 -173 -6 150 -59 104 -92 -90 92 91 24 -172 66 -63
4331 -63 -54 -17 28 -110 90 -105 -203 -12 -7 89 49 -241 -221 218 -71 3 39 76 163 -188 -61 99 -23 270 143
4356 143 -344 171 -36 -68 271 49 432 -46 -112 65 -10 76 112 -92 62 124 3 -41 -69 42 21 167 52
4379 52 -201 -205 -181 115 147 -31 6 -105 389 -22 -198 -177 -163 -27 -338 -66 -5 170 122 -57 -82 20 173 -116
$$ packed form
4213a32l6R1K40j91l3L01j31m33L28j85J57J66k16J26J61o8m1j55Q5N6j89J79
4235H0j1k75RJ67K3K2Q3j30k93L73J24l65M08l10J32j18J86k8j05K0lJ58p2j10
4259c5r8k13M05n8j25J01k57L72p2q6R6P4r8j37N9r5L63j36j75Kp2L56j99k8L20
4284B64j32q2k89K43P2K9l53L33j85k47L99o3K2r7r3K4P7K7R6n6R5k10J55l04
4308b75K54j9L5R1r8J10j26J16O6j15k12J67J56k09J63j96KJ82jo7j96K38j29
4331f3RL7M5j38K00j95r8J91NR6m0k90K0M39k89P4L6L7Q7l51J27J60j22K93j27
4356A43m87N15k07l2L39k22L83m78o6J77p5Q6L6k04J54O2j21m4k8J11k1J46j15
4379E2k53mK4K96L2j78L7j11M94m11j76K1J4J36l11K72O1J75m8j79k5J02J53k89
$$ plain form
4403 -116 -208 -125 104 25 93 -2 16 7 -85 -8 32 109 -109 -63 -128 31 -88 -35 -238 -74 -56 184 27 209 109
4428 109 13 86 -75 -86 175 -26 88 193 -45 -108 187 -153 -89 119 106 31 -199 103 -145 -57 -19 -34 56 -84
4452 -84 -264 -36 258 49 -156 -131 -9 -31 -1 -182 47 -94 87 -112 -184 50 -143 -38 -51 159 -13 118
4474 118 -58 -58 341 -200 -124 37 -109 121 47 72 -115 102 -160 -140 71 257 -63 131 -22 163 95 -73
4496 -73 144 -107 94 -333 -176 251 -62 -131 -150 -136 118 173 -347 -67 -234 145 -38 -88 -72 -47 123 -110 -95
4519 -95 5 -18 -82 -173 44 -64 -100 -72 31 -257 194 125 -137 65 55 -43 139 257 -28 4 -14 -181 -65 2
4543 2 -118 149 -143 23 54 -131 49 134 83 16 63 -143 47 -203 149 18 -3 -10 7 -12 -167 128 41 228
4567 228 -76 -131 134 100 110 115 -45 -36 10 -86 -42 -11 -201 -90 -183 29 121 115 -71 27 -115 32 119 -115 -204 -91
$$ packed form
4403a16r2Q3K29p9O8r5J8rr2P7M0P7k18M6o5J59j19N3k03J64J8K40j57J82j00
4428A09r6P3j61j1K61k01J14J05k38o3K95l40O4K08j3p5k30L02k48Q8L8j5R0j40
4452h4j80K28K94k09k05K5J22k2L0j81K29j41J81j99p2K34j93J05j3K10j72J31
4474A18j76%L99n41P6J61j46K30p4K5j87K17k62K0K11J86l20J94j53J85o8j68
4496g3K17k51K01m27J57M27l13o9j9J4K54N5n20K80j67L79j83n0J6K5J70k33J5
4519i5J00k3o4r1K17j08l6K8J03k88M51o9k62K02j0r8J82J18k85L2j8j67J16O7
4543Bj20K67k92J66L1j85J80Q5n1o7M7k06J90k50L52j31k1pJ7j9j55K95q7J87
4567B28l04n5K65l4J0Nj60RM6r6M4L1j90J11r3K12R2oj86R8j42J47Q7k34q9J13
$$ plain form
4593 -91 38 117 -2 170 -94 -109 -178 129 -109 -111 242 159 -112 3 110 98 -14 -161 -48 22 155 -58 25
4616 25 -114 120 -214 -97 29 -189 97 -239 -107 -158 -151 15 24 18 -111 -2 -122 -28 104 143 153 -64 142 -75
4640 -75 122 -55 162 181 -89 172 -28 -4 94 -206 -10 113 -55 -30 118 -201 295 -90 -43 -69 257 69
4662 69 -70 -8 -43 59 -132 -191 -219 208 -332 -89 -95 163 -302 15 -121 -90 151 201 -133 45 -216 103 164
4685 164 -20 97 89 -12 -188 -37 31 45 71 -188 -52 43 -144 -69 178 150 128 105 65 33 -154 32 -17 95
4709 95 -35 39 138 52 50 -247 22 -17 -265 45 2 -181 -59 -52 -100 167 -52 -117 -261 -1 -86 -33 -20 -240 -134
4734 -134 149 224 -117 246 44 29 85 -75 -12 -136 148 17 -12 -130 -23 -248 321 -107 -457 -17 -76 -80 -35
4757 -35 199 -219 26 -69 -31 209 209 159 -130 -30 122 -320 -132 -58 -36 -26 102 -20 -22 -35 -26 132 74 55 90 14
$$ packed form
4593i1J29P9j19J72k64j5o9L07k38kL53q3k71J15J07j2j12j47J13P0J33k13Q3
4616B5j39K34l34J17J26k18K86l36J32n1PJ66Roj29J09j20R4J32L9J0k17K06k17
4640g5J97j77K17J9k70K61k00K4R8l00J96J23j68K5J48l19M96l85M7k6L26j88
4662F9j39O2l5J02j91n9k8M27n40K43oK58m65L17j36L1K41N0l34J78k61L19O1
4685A64j84J17qj01j76J51O8J4K6k59J36R5j87P5K47k8k2k3m0l2j87J86m9J12
4709I5j30P4R9q6kk97K69l9k48L10m3j83J22Pm8K67k19o5j44K60q5N3J3k20J06
4734a34K83P5l41L63k02j5N6j60O3j24K84j31k9j18J07k25N69m28l50M40n9mM5
4757c5K34m18K45r5L8K40%n0k89J00J52m42J88P4K2J0J28j22kj3RJ58n8j9L5p6
$$ plain form
4783 14 -94 -275 -4 -16 226 56 -15 -204 61 39 -335 -30 -68 -103 92 54 168 89 39 95 137 -36 -149 105
4807 105 99 217 85 139 157 -174 -35 209 -62 -22 -19 190 98 -266 -40 -80 108 -50 -216 78 175 45 -31 -248
4831 -248 -211 15 65 168 60 -233 -135 60 -85 196 -98 50 -351 140 -155 -68 -145 34 -15 -6 92 -44 4
4854 4 -24 26 129 77 41 123 135 -177 -178 35 51 -37 -28 66 77 1 -117 270 110 -36 173 55 89 -193 -261 -287 53
4881 53 76 -119 36 101 143 201 104 -41 -127 -21 122 -89 -88 198 -111 -110 -42 -258 -218 -22 9 23 0 157 -210
4906 -210 61 -205 -3 150 22 9 -22 202 -21 198 80 -246 -166 -63 -131 -66 119 118 166 115 181 -37 -155
4929 -155 -78 -90 -269 108 38 -23 174 129 112 26 -50 144 -171 150 -7 -37 234 300 -28 98 -44 31 79 3
4953 3 90 -172 197 -31 -88 -88 -277 33 -254 -69 -72 145 -88 36 117 -54 -44 102 -151 -33 106 32 200 131
$$ packed form
4783A4j08j81K71j2K42j70p1j89K65k2l74L05l8l5J95l8J14p9n0N6M2j73j13K54
4807A05oJ18j32N4J8l31J39K44k71M0LK09r2l64K26m0J88j58j66K94R7j30p6k17
4831b48L7K26N0J03j08k93R8J95j45K81k94J48m01M91k95Q7p7J79m9RR8j36M8
4854Dk8N0J03n2l6Q2J2l12jK13J6q8RR4J1p6j18L87j60j46K09j18L4k82o8k6L40
4881E3K3j95J55O5M2N8r7j45q6J06J43k11JK86l09JO8k16M0J96L1J4k3J57l67
4906b10K71k66K02J53j28j3l1K24k23K19j18l26Q0J03o8O5J85jM8n1O6k18j18
4929a55P7j2j79L77p0o1J97m5j7q6p6J94l15L21j57l0K71O6l28J26j42P5M8p6
4953CQ7k62L69k28n7%j89L10k87J85lK17k33J24Q1j71J0J46k53J18J39p4J68o9
$$ plain form
4977 131 -376 -8 -23 -89 3 -54 -51 67 119 -49 58 129 -50 62 -53 -90 128 -6 -68 69 121 -94 29 127
5001 127 -83 -209 -42 -57 223 -247 106 151 -25 -138 37 -37 -160 179 26 25 -110 -55 116 -139 19 204
5023 204 176 -226 -197 38 -179 36 205 68 -31 -48 -64 14 -7 -71 -274 -123 -21 76 -22 -73 -28 202 64 -158
5047 -158 -43 16 -42 -29 -92 9 -120 -291 -85 49 -110 134 17 -48 -227 39 -42 318 178 -1 73 94 185
5070 185 -154 181 73 -98 -48 144 -168 -235 25 159 126 39 -18 32 -443 112 -63 -107 -14 6 54 131 -39 96
5094 96 47 196 268 117 -3 93 -26 14 -89 22 57 -78 31 16 234 -209 257 142 -25 -192 119 163 85
5117 85 -16 90 -67 223 96 75 -316 48 278 7 68 -99 76 244 88 67 150 -96 145 -110 -132 -126 154
5140 154 -22 157 75 129 -65 17 -22 -94 100 -69 -103 -36 -52 -106 -64 -149 7 -3 -274 -202 -50 18 -122 180 -47
$$ packed form
4977A31n07L68j5o6R2n7LJ18N2j68J07P1j79J12j15l7K18j34o2J37N2k15J23R8
5001A27k10j26J67j5K80m70L53M5j76j13J75p4j23L39j53jj35N5J71k55J58J85
5023B04k8m02K9K35k17K15J69j37r9j7j6P8k1o4k03J51J02R7r8n1M5K30j38k22
5047a58J15N9n8J3o3J01j29j71K06J34j59K44j17o5j79K66q1L60j40j79P4K1R1
5070A85l39L35j08j71N0J92l12o7K60J34l3q7n7N0m75N55j75m4R3K0M8P7j70J35
5094I6m9J49P2j51j20R6j19M0j03J11L5j35J09j5K18m43M66j15j67j67L11M4p8
5117H5j01J06j57K90j27k1l91L64K30k71O1j67J75J68j56k1Q3k46K41k55k2OK80
5140A54j76J79q2N4j94Q2l9p2J94j69l4O7j6n4M2q5J56j0k71P2J52O8j40L02k27
$$ plain form
5165 -47 -25 133 -135 -97 -132 -198 -113 158 126 115 -36 254 200 75 -249 -53 -48 175 -96 122 31 23 -201 -273 8
5190 8 239 -40 96 -128 -265 -95 33 98 135 -8 -71 -26 -34 126 -87 23 172 -257 10 26 -24 -127 228
5213 228 130 -32 176 -140 42 -73 67 -82 74 -3 -68 -88 -187 -113 41 -91 29 184 101 129 -31 59 -161
5236 -161 -116 -178 -136 3 -46 -119 112 -177 158 -17 -159 3 33 -37 -88 -126 -227 30 -155 64 77 37 166 101
5260 101 -18 163 -29 -167 -73 245 41 -70 158 133 -37 5 -31 -69 -73 -361 112 124 -164 30 96 -47 -154
5283 -154 211 -32 128 -168 114 33 -42 -67 64 177 -92 -105 84 -72 -36 -172 -130 297 223 91 -1 145 198
5306 198 308 -145 -160 -114 -272 13 -209 -173 207 190 -59 -382 -10 164 112 -4 28 -162 190 6 149 123
5328 123 29 -90 45 -318 -63 31 -170 59 -64 -68 5 -20 -165 -47 -161 67 184 -174 274 -135 -152 95
$$ packed form
5165d7K2J58k68L8l5o6Q5K71l2j1j51K90n4j25l24J96NK23k71K18r1qk24p2K81
5190HK31k79J36k24j37J70J28O5L7j43o3M5qJ60k13J10J49m29K67J6n0j03L55
5213B28r8j62K08l16J82j15J40j49J56p7o5k0r9P4J54j32J20J55q3K8j60R0k20
5236a61M5o2M2J39m9p3K31k89L35j75j42J62L0p0n1l8j01K57j85K19J3m0J29o5
5260A01j19J81j92j38R4L18k04j11K28k5j70M2l6l8mk88M73J2k88J94O6j43j07
5283a54L65k43J60k96K82q1p5k5J31J13k69j3J89j56L6j36M2M27p4j32r2J46N3
5306A98J10m53j5M6j58K85k22L6L80j7k49l23L72J74n2j16L2j90L52j84J43k6
5328A23r4j19J35l63K55R4k01K29j23mP3k5j45J18j14K28J17l58M48m09j7K47
$$ plain form
5350 95 -229 -173 81 -131 -266 75 -122 195 -132 -151 162 -116 138 -178 60 -36 108 69 -188 157 215 125
5372 125 -23 -5 -52 -155 137 -48 -295 83 143 -48 67 -95 -181 95 102 -211 263 41 65 80 -63 -99 -5
5395 -5 35 -44 193 2 -176 106 -122 -40 -220 251 -16 -69 -116 -48 213 107 -96 48 -56 -37 167 6 48
5418 48 108 160 -85 169 18 287 113 64 45 -10 28 11 -101 170 -78 120 171 -181 73 -79 -126 207 93
5441 93 -169 5 83 76 202 -123 -69 202 -59 97 -139 18 47 57 283 -216 294 203 -62 154 112 -219 117
5464 117 -60 -50 98 -8 -117 6 -120 -102 169 39 61 -132 55 -102 -146 10 246 177 21 -284 50 27
5486 27 54 -136 213 -55 7 39 282 106 22 1 -139 -151 189 -66 17 -120 -208 125 41 -22 -36 -12 225 -14
5510 -14 -216 60 -25 -3 88 239 -42 60 65 64 7 107 -45 137 56 150 26 -98 128 35 -140 94 39 220
$$ packed form
5350I5l24N6K54k12j35L41j97L17l27j9L13k78K54l16K38r6J44l9k57L45N8r0
5372A25j48J8m7j03K92j85k47L78O0j91J15j62q6K76Pl13M74k22K4J5j43l6R4
5395eM0p9K37j91j78K82k28Q2j80M71k67n3m7O8K61j06k03J44j04J9K04j61M2
5418D8O0N2k45K54j51K69j74m9j9n5L8j7j12K71k48J98N1l52K54j52m7L33j14
5441I3k62J74P8pJ26l25N4K71k61J56k36J57K9J0K26m99N10r1k65K16m2l31L36
5464A17j77J0J48j06j09J23j26J8K71j30K2j93J87j57m4J56K36o9j56l05L34k3
5486B7K7j90L49k68O2L2K43j76q4k1j40j2L40k55Q3j37q8L33q4o3j4K4K37k39
5510a4k02K76q5K2R1J51k81J02Njn7J00j52J82q1R4j24j24K26r3j75K34n5J81
$$ plain form
5534 220 -110 -134 -36 71 289 -34 118 116 -70 318 75 -175 78 -38 52 171 -9 -50 141 163 112 -37 80
5557 80 144 -67 -127 167 29 -1 123 134 128 97 99 -48 84 42 35 44 -32 75 -16 11 149 -124 122 108 -128 -208 78
5584 78 20 68 77 167 179 63 73 111 45 -18 -61 -202 170 90 -227 -19 148 45 12 -58 -160 62 -48 402 -3
5609 -3 -67 -270 5 -72 -165 393 -71 -9 -196 -3 -78 -227 19 -127 116 -15 -49 267 -48 181 -128 -100 161
5632 161 -61 127 45 4 26 193 129 -197 -19 -126 -36 -35 133 78 251 -125 88 88 -5 199 234 -94 -108 49
5656 49 -108 79 -124 -64 -38 -18 -149 -156 -25 -48 -218 72 373 -354 17 81 -89 149 63 -213 -4 25 182
5679 182 72 227 -73 151 66 -65 34 91 165 152 20 112 79 -57 88 -88 -15 -17 -145 170 -346 14 -243
5702 -243 -179 -83 158 -134 -5 71 -214 -117 61 -141 -15 117 -62 61 106 44 -276 -191 -98 51 56 223 192 126
$$ packed form
5534B20l30k4R8J07K18l23J52kj86L88k43k50K53j16R0J19j80m1J91K2n1j49J17
5557H0O4k11o0K94j38l0J24J1ol1Kj47J32m2pRp6J07r1K7J38k73K46j4k36q0K86
5584G8n8M8RR0J2j16J0L8o6o3m3j41L72q0l17K08J67j03l3p0j02K22j10M50m05
5609co4k03K75p7r3N58m64O2j87J93p5j49K46j46K43j31l4L16l15K29l09K8K61
5632A61k22J88q2m1K2J67o4l26J78j07R0JJ68n5J73l76K13%r3K04L5l28j4J57
5656D9j57J87k03O0K6K0j31pJ31k3j70K90L01p27L71O4j70K38q6k76K09K9J57
5679A82j10J55l00K24q5j31R9N7P4j3j32R2l3j36J45j76P3kj28L15n16L60k57
5702b43O4R6K41k92J29P6k85R7J78k02J26J32j79J23M5o2l20Q5R3J49NJ67l1o6
$$ plain form
5726 126 52 166 68 37 -191 -294 -48 -185 17 192 -5 -187 124 80 107 49 193 153 -50 129 -29 104
5748 104 255 5 222 197 83 -34 -36 134 -45 -17 83 235 44 56 -34 -127 -43 148 1 71 117 211 216 71
5772 71 -153 53 -179 144 51 -179 -131 -98 5 111 66 -46 68 189 -5 322 43 -69 169 -40 85 -334
5794 -334 2 -7 -143 24 -223 -74 0 -82 -43 115 89 15 -36 -112 228 44 -38 45 -10 -136 -10 -119 119 -70
5818 -70 65 201 38 127 6 -55 217 61 207 31 12 -88 -121 122 69 -206 -173 176 16 -16 -159 134 -6
5841 -6 48 219 41 -18 80 -2 -188 -166 99 161 -28 -4 159 -137 -38 128 121 -241 88 -34 -5 60 -31 11 29 -23
5867 -23 77 170 45 24 50 -109 -31 56 30 -98 -62 45 143 167 -103 -123 80 -55 96 18 -85 -57 -50 65 -51
5892 -51 -93 -80 109 13 64 -2 35 91 92 -174 51 -189 -243 -46 -103 -250 138 53 -223 -12 75 126 193 -56 -138 -146
$$ packed form
5726A26p4J14r8l1k28j03K46j37K02J75j97j82L11m4K7n8J44m0k03J79j58J33
5748A04J51k50K17k5j14j17kJ70j79K8J00J52j91J2r0r3Q4J91j47P0M6R4Nj45
5772G1k24K06k32L23r3k30M8L3J03J06m5j12J14J21j94L27k79j12K38k09J25m19
5794c34L36rj36J67k47J49P4q2L9J58k6p4n1p6L40j84q2Q3n5j26J26j09K38j89
5818g0J35J36j63Q9j21o1K72j56J46j76j9j00l3K43n3k75L3L49j60l2j43K93j40
5841fN4J71j78n9R8q2j86K2K65O2j89K4J63k96R9J66pl62L29j22K9O5r1M2J8n2
5867b3J00R3j25k1K6j59P8Q7k6j28L6J07R8K4k70k0K03j35J51p8j03K8PJ15j16
5892e1m2J3J89r6N1o6L7N6Jk66K25k40n4J97n7j47L88q5k76K11Q7N1O7k49q2q
$$ plain form
5918 -146 -141 -91 230 -52 -97 -132 -153 -89 -112 56 12 147 -41 -135 -92 -243 -86 225 137 -65 -152 -22 57 -27 -68
5943 -68 -14 327 -186 146 -216 15 220 84 -152 -151 -23 -107 216 95 -240 -20 61 92 -117 40 -80 5 178
5966 178 -155 205 99 -87 48 -200 286 -57 -141 210 -104 142 -278 23 -186 -221 19 -119 -104 238 -68
5987 -68 -33 -105 -83 -14 -73 -38 -92 -136 100 -7 -75 36 -24 637 67 -138 -104 -215 342 100 93 -74 -210 728 1150
6012 1150 378 -309 65 -148 -136 156 12 -187 39 116 -251 76 114 -47 13 207 -160 60 110 181 -31 6
6034 6 10 48 -147 -101 -104 -79 -40 -86 4 -16 199 -127 150 313 -45 -72 41 4 5 -122 -52 -52 -57 -213 4 209 -18
6061 -18 45 292 76 -17 39 26 -73 -98 226 -194 -244 70 109 -32 201 5 -161 114 130 -299 -79 25 -146
6084 -146 -52 -229 -123 83 -82 -127 12 -75 -26 -79 129 -237 -26 112 -89 25 14 156 -60 21 59 69 109
$$ packed form
5918a46NN0L21k82m5l5k1O4k3J68m4J35j88r4M3j51J57L11q8k02q7J30P9q4m1
5943f8N4L41n13L32l62K31K05j36k36JJ28q4L23j21l35K20Q1L1k09J57j20Q5J73
5966A78l33L60j06j86J35k48M86l43q4L51l14K46m20L01k09l5K40j38J5L42l06
5987f8L5p2K2O9n9L5n4m4K36j07o8J11o0O61n70k05L4j11N57k42pj67j36R38M22
6012A150p72o87L74k13J2K92j44j99K26P7l67L27L8j61O0J94l67K20N0P1k12L7
6034FML8j95M6lK5L9m6R0k0K15l26K77J63l58k7J13l7Jj27P0%nj56K17K05k27
6061a8O3K47k16r3N6j3r9k5L24m20n0L14L9j41K33j96j66K75J6m29K20J04j71
6084a46R4j77J06K06j65m5J39q7M9n3K08l66K11J38k01J14j1J42k16Q1L8J0M0
$$ plain form
6107 109 39 58 -76 36 -130 148 214 -36 -121 49 170 -8 -61 -38 142 -237 46 34 -163 -18 -284 158
6129 158 78 -24 -121 141 -210 -327 -99 20 179 -285 -68 -57 111 -47 105 243 114 -3 -70 -120 -68 72
6151 72 -27 -51 167 15 40 -106 0 139 43 -35 178 181 77 -285 22 -10 -114 -40 28 65 -73 -99 94 40 -222
6176 -222 -70 24 125 -147 231 56 189 -181 -98 -192 -185 -195 98 -53 31 109 -206 1 -196 -14 -186 5 -174
6199 -174 -65 0 -49 -143 52 180 69 -286 -101 -32 45 -45 -160 -28 114 165 -6 -7 -125 133 81 148 56 14
6223 14 -75 135 -37 -128 -64 102 63 -93 -327 178 52 21 146 -101 186 -129 8 123 -27 91 -81 35
6245 35 58 -41 164 -213 -230 -76 -16 -34 179 -61 21 -87 29 -112 9 -20 -212 -71 95 126 40 45 -13 -89 -79
6270 -79 -90 -64 48 78 7 -93 -173 63 195 -111 -50 250 -211 16 195 -78 -19 196 24 10 -179 -128 30
$$ packed form
6107A09p0J9j34J12j66K78O6k50q5J70J21j78n3K3J80l79K83j2j97J45k66M42
6129A58q0j02r7K62l51j17K28J19J59m64K17J1J68j58J52J38j29j17o7n0N2J40
6151G2r9k4K18j52K5j46J06J39r6p8K13Lj04l62L07l2j04P4O8L7j38k6J93n4k62
6176b22J52R4J01k72L78j75J33l70Q3r4Pj0K93j51Q4P8l15K07j97J82j72J91j79
6199a74J09O5m9r4J95J28j11l55J85O9P7r0j15J32J42N1j71jj18K58n2O7r2m2
6223A4q9K10j72r1O4J66l9j56k34N05j26l1J25k47K87l15J37J15j50J18j72J16
6245C5K3r9K05l77j7J54O0j8K13k40Q2j08J16j41J21k9j92J41J66L1q6Nn8p6J0
6270g9j1K6J12L0p1j00q0K36J32l06O1L00m61K27J79k73N9K15j72j4j89N1J58
$$ plain form
6293 30 56 3 255 8 358 -56 65 -17 88 -34 -40 72 -81 -26 -98 46 33 1 -210 -110 -170 92 -63 -3
6317 -3 257 84 173 148 171 65 157 -18 89 -76 -57 -134 -210 183 39 99 171 -187 -63 221 -123 4 216 308
6341 308 -63 100 -11 -142 -114 172 73 -149 124 74 -74 168 4 253 81 -188 -102 35 108 191 -104 -24
6363 -24 88 173 93 46 78 -75 67 19 -228 45 177 -52 132 76 89 -27 43 21 31 21 16 -276 -14 2 -12
6388 -12 -90 1 -129 105 21 -121 45 -237 -36 -95 -47 -9 116 158 -143 -72 -48 -191 110 -201 21 135 -11
6411 -11 93 131 -169 -71 -156 48 130 -140 12 78 207 50 -10 -65 82 102 -44 -61 19 -317 -47 208 -39 18
6435 18 40 -127 305 118 144 203 -144 91 46 14 -72 -27 -72 91 167 -44 -34 151 289 -82 -113 63 116 -174
6459 -174 -159 -104 105 87 -68 -185 182 -113 359 71 -128 -17 15 -233 78 -24 -71 -85 -132 -5 137 -86
$$ packed form
6293C0K6n3K52k47L50m14J21q2J05j22oJ12j53N5p2J44j3l2k11J00o0K62j55O0
6317cK60j73Q9k5K3j06R2j75J07j65J9p7p6L93j44O0P2l58J24K84l44J27K12R2
6341C08l71J63j11j31K8K86r9k22K73n0j48K42j64K49j72k69Q6J37P3Q3k95Q0
6363b4J12Q5q0m7L2j53J42m8k47K73J32k29J84n6J3j16P0k2J0j0nk92K62J6j4
6388a2p8R1j30K34q4j42J66k82K01n9M8L8J25M2l01P1K4j43L01l11K22J14j46
6411a1J04L8l00R8q5K04Q2k70J52O6J29j57o0n5J47K0j46j7Q0l36K70K55k47N7
6435A8K2j67M32j87K6N9l47K35m5l2q6M5m5J63P6k11J0J85J38l71l1J76N3k90
6459a74J5N5K09j8j55j17L67k95M72k88j99J11L2k48L11j02m7j4m7J27J42k23
$$ plain form
6481 -86 -70 256 -33 277 -124 -240 -107 -38 -94 -130 -103 -180 -251 -124 -55 111 -203 -44 154 -151 116 100 47 -75
6505 -75 -60 83 18 79 -131 -127 -140 119 194 227 -55 -86 66 34 -195 -186 -147 25 214 -192 -97 227 -31 36 140
6530 140 171 -238 300 52 -28 -4 41 140 57 -53 315 267 21 -157 -573 -136 172 -179 149 -252 28 -91
6552 -91 -30 65 0 -134 -83 37 30 -229 20 -23 -35 74 -186 -109 93 186 66 -41 -74 25 -144 -128 -61 112 94
6577 94 57 38 85 -191 148 -68 -219 -41 -84 107 -95 -93 260 -188 -15 -87 -9 -145 88 105 52 -51 -5 -92
6601 -92 -90 -217 53 320 87 -29 177 214 97 105 7 314 -120 7 -32 -134 187 -132 1 52 25 -46 -17 -48
6625 -48 -43 -95 -266 123 151 158 139 -77 -170 -89 -214 138 218 259 -28 62 -151 -76 134 -31 38 -59 51 -97 -174 -150
6651 -150 165 10 -195 64 -14 -122 76 134 130 45 203 -39 -84 -169 -134 66 -165 139 -144 -118 11 57 36 119
$$ packed form
6481h6J6L26k89L10m01j16J33O9n6l6K7p7p1J27O9J66l14J59J98l05K67j6n3j22
6505g5J5J43o5O1k10Mj3K59P5L3k82l1J52l2k29RL9J72J89m06R5L24k58O7J04
6530A40L1m09N38k48q0K4M5R9q3j10L68m8k46j78m16M37L08l51L28m01K80j19
6552i1O1R5o5j34N1J20pk59K49m3j2J09k60P7K02R3j20j07l3R9j69J6O7J73j8
6577I4l7j9M7k76L39k16j51J78m3J91k02KL53m48J73p2P8j36K33J7n3j03M6q7
6601i2Kj27K70K67k33j16K06L7j17Qr8L07m34J27l9j02L21l19J33N1k7p1K9l1
6625d8Nn2j71L89K8Pj9k16r3Q1j25L52Q0M1k87R0k13P5K10j65O9r7J10j48p7K4
6651a50L15j55k05K59p8j08J98N8mq5J58k42m5q5L5K00k31L04k83K6J29M6k1Q3
$$ plain form
6675 119 -119 -17 -42 -83 131 195 150 13 149 -183 27 151 2 32 62 -57 113 70 -17 25 -208 113 71
6698 71 -183 -65 27 120 -104 125 77 -56 34 112 -26 -91 143 -42 -124 91 1 93 21 38 -129 54 71 -259
6722 -259 84 82 -232 -43 219 114 324 -127 335 -117 -250 56 11 47 -186 56 28 -4 -11 -27 268 219 -236
6745 -236 -10 93 205 23 43 204 11 45 78 -67 -58 -36 -209 -26 256 -96 -131 165 -69 -74 286 -111 -26
6768 -26 74 129 -169 94 268 -66 -10 -126 -9 -77 -112 -198 -28 6 34 121 -30 -41 235 223 40 -162 51 -276
6792 -276 -158 52 -5 -10 -31 -24 -93 300 95 43 -131 -41 260 55 25 219 118 33 -325 28 106 -48 61 -11
6816 -11 -59 -313 100 265 66 171 94 -210 -12 103 130 261 70 77 -80 41 -42 1 -36 159 -21 -140 -163
6839 -163 -106 48 -59 145 76 -32 -47 -183 117 -95 59 61 -122 272 91 -44 34 -206 10 -192 -81 41
$$ packed form
6675A19k38J02k5m1K14O4m5j37J36l32K10J24j49L0L0j19J70m3q7M2k33L21m2
6698G1k54J18R2R3k24K29m8j33R0P8j38o5K34j85q2K15r0R2p2J7j67J83J7l30
6722b59L43kl14J89K62j05K10m51M62m52j33L06m5L6k33K42k8l2pj6K95m9m55
6745b36K26J03J12j82K0J61j93L4L3j45RK2j73J83K82l52l5K96k34nL60l97Q5
6768b6J00N5k98K63J74l34N6j16J17o8l5q6J70L4K8Q7j51j1K76j2j83k02K13l27
6792b76J18K10n7nk1Po9L93k05n2j74R0L01k05l0J94j01q5l58L53P8j54J09p2
6816a1m8k54M13J65j99J05p7l04J98J15K7J31j91Pj57J21q3M3l7J95j80j19k3
6839a63N7J54j07K04o9j08j5j36L00k12J54Kj83L94j81j35P8k40K16k02J11J22
$$ plain form
6861 41 -88 -50 50 244 -152 194 -17 -154 100 16 -155 -106 70 -237 67 190 146 117 -21 22 26 134 50
6884 50 39 18 80 11 194 -61 17 90 -318 -1 -121 117 6 -15 -16 -65 45 -194 -153 138 -16 -100 116 10
6908 10 -67 137 88 28 83 -10 38 10 -37 180 219 129 358 -125 71 -73 186 -48 -214 161 -255 11 -24 -125
6932 -125 168 211 7 103 156 -109 -64 135 -191 -95 150 213 -45 -127 -80 192 63 -66 -95 -23 -10 255 117 -149
6956 -149 -151 -41 22 97 -14 5 -42 72 14 83 40 -161 -204 37 -28 61 -17 43 -6 -159 -150 0 47 182 285 -72
6982 -72 -170 42 297 21 138 305 72 125 137 120 -2 173 -4 113 -28 -337 -159 239 50 140 50 -47 -249
7005 -249 25 167 182 8 -27 -124 -186 -44 47 85 28 -6 85 188 152 124 182 -186 -109 -108 120 -54 -67 -8 -161 -393
7031 -393 121 26 -40 19 -279 -26 -195 36 25 35 201 57 -338 -59 142 -71 265 -28 123 18 163 41
$$ packed form
6861D1j29L8J00J94l96L46k11j37K54q4j71M9J76l07L04J23m4k9j38M3MJ08q4
6884E0j1k1O2o9J83k55P8P3m08L17j20K38j11k1jm9J10k39M1K91j54q4K16j06
6908A0p7K04m9o0N5r3M8k8m7K17L9r0K29m83J96j44K59k34j66L75m16K66l5j01
6932a25K93M3k04R6N3k65M5J99l26R6K45O3k58q2M7K72j29j29k9P2J3K65j38k66
6956a49kJ10O3P5j11J9m7J14n8O9m3k01m3K41o5Q9p8O0m9j53RJ50M7J35J03l57
6982g2r8K12K55k76J17J67k33N3J2j7j22J75j77J17j41l09J78L98j89R0r0r7k02
7005b49K74J42J5j74l5r7o2J42R1L8n7l4R1J03l6k8N8l68P7JK28j74j3N9j53k32
7031c93N14r5o6N9k98K53j69K31j1J0J66j44l95K79K01k13L36k93J51j05J45j22
$$ plain form
7053 41 20 -19 -65 67 -78 37 -15 -80 79 -138 -111 21 70 119 -75 -142 222 -168 65 -175 -340 219 130 -89
7077 -89 -177 102 93 -147 -155 193 90 -204 -18 7 192 -1 -16 6 25 -36 -87 26 -263 95 2 -144 -53 -156 -13
7102 -13 -26 -106 56 140 -139 -140 219 -16 77 195 21 -11 39 -242 -3 95 86 230 185 161 179 68 106 -44 -126 198
7128 198 -112 48 -38 -109 122 -203 -195 -103 37 119 177 158 21 -55 177 -110 -154 75 173 80 -246 32 166 45
7152 45 161 5 258 171 62 -100 -34 -56 64 -34 101 -269 -66 -116 49 57 173 25 -109 -256 -133 -67 71
7175 71 24 147 18 -17 136 114 244 28 -148 -34 -4 -37 -220 310 -40 120 -46 18 132 49 36 -215 -91
7198 -91 -26 134 -217 -55 -37 46 -10 28 -120 -105 84 -46 99 -97 113 23 -210 -91 -197 -323 265 -20 90
7221 90 43 70 17 -123 136 139 -31 154 -8 11 -46 66 69 37 -112 161 1 305 -159 -454 -97 18 9 88 164
$$ packed form
7053D1k1l9m6J32j45J15n2o5J59k17K7J32M9M9j94o7L64l90K33k40j65N59q9k19
7077h9q8K79rk40qL48j03k94J86K5J85j93j5K2J9o1n1J13k89L58r3j46R1j03J43
7102a3j3q0J62Q4k79jL59k35R3J18j74l2N0k81K39R8rJ44m5k4J8j11L8j50q2L24
7128A98l10J60q6p1K31l25QR2J40Q2N8j9j37p6K32k87m4K29R8r3l26K78J34j21
7152D5J16j56K53q7j09j62O6k2J20r8J35l70K03n0J65QJ16j48j34j47J23O6J38
7175G1m7J23j29l5J53k2J30k16j76J14L0l3j83N30l50J60j66O4J14q3j3k51J24
7198i1O5J60l51J62J8Q3n6L8j48J5J89j30J45j96K10r0k33J19j06j26N88k85J10
7221I0m7K7n3j40K59Lj70J85j62J9n7J12Ll2j49K73j60L04m64k95L57J15rP9P6
$$ plain form
7246 164 -121 -250 -180 -44 84 -240 24 1 67 -84 -28 107 21 -61 76 161 -224 10 -27 -74 -265 -32 -202
7269 -202 -205 -32 -248 96 -113 237 -159 119 83 -115 72 159 167 -30 85 60 -57 -96 -20 -131 134 76 143 -62
7293 -62 14 -20 112 -5 2 48 -226 -179 -77 -133 -45 122 -175 162 -65 32 -134 20 63 126 18 -59 48 -63
7317 -63 0 129 -94 2 -198 70 -65 144 21 251 112 42 94 -39 299 4 -220 42 264 81 6 -84
7339 -84 33 -127 445 -136 37 -210 62 -278 -155 121 159 86 -168 25 82 38 -104 -112 155 -55 273 -183
7361 -183 -69 -93 371 13 5 24 118 67 74 0 226 148 231 160 92 156 56 -43 -75 -126 -24 -94 25 144 -118 13
7387 13 -17 48 -50 -191 -183 -21 -159 17 50 -213 59 -165 8 -147 33 -260 10 219 117 -67 -60 -12 -37 63
7411 63 -63 212 8 169 57 139 175 250 87 40 53 361 -85 82 128 114 125 -286 -201 129 -418 92 97 -171
$$ packed form
7246A64k85j29P0J36J28l24K64k3O6j51N6J35q6q2J37Q5l85K34l7m7j91K33j70
7269b02lJ73k16L44k09L50l96K78l6j98J87Q7Qj97J15k5j17l9P6j11K65n8O7k05
7293f2P6l4J32j17PM6k74M7J02n6Q8J67k97L37k27R7j66J54M3O3j08p7J07j11
7317f3O3J29k23R6k00K68j35K09j23K30j39p0N2j33L38k95k24K62K22j83p5r0
7339h4J17j60N72n81J73k47K72l40J23K76L8p3k54J93N7m4j42qK67k10L28m56
7361a83J14k4M64l58qJ9R4n1Pp4K26p8Q3p1o8O4j00r9l2n1J02p0J19J19k62J31
7387A3l0O5r8j41QJ62j38J76L3k63K72k24J73j55J80k93K70K09j02j84PM8k5J00
7411F3j26K75k04J61j12Q2L6P5j63m7J3L08m46J67M6j4J1m11Q5L30n47N10Nk68
$$ plain form
7435 -171 -121 116 -365 79 70 -194 292 -236 77 53 1 114 80 -38 -196 -117 227 -197 -119 -28 -113 -76 8 -133
7459 -133 -99 -153 -31 -159 -170 -9 17 66 -56 152 -25 -130 -152 48 -190 -55 -221 -98 44 98 -21 -212
7481 -212 -154 265 -112 -187 67 199 151 -40 -117 74 315 150 -99 81 31 4 -153 -63 -136 -31 46 -110 54
7504 54 5 219 -118 113 -31 41 -106 96 65 -156 -202 -62 13 49 104 136 22 -113 -77 81 -40 -208 141
7527 141 -14 -223 -100 118 97 17 -1 -212 65 59 6 -12 -118 90 139 101 -84 15 108 -218 99 230 -73 320
7551 320 1 -9 53 177 -92 -31 32 23 163 115 45 135 20 97 -55 -195 180 118 -63 -47 -50 184 -37 -26 114
7576 114 80 -33 61 -7 -90 247 -95 42 104 -24 -169 22 32 79 89 -109 109 -58 270 -147 286 66 -88
7599 -88 92 -125 -32 -21 -147 95 -143 25 -63 237 3 58 -8 -109 -13 85 181 40 76 -98 -27 44 116 53 36
$$ packed form
7435a71N0K37m81M44rk64M86n28L13k4n2J13l4j18j58P9L44m24P8R1q5L7Q4j41
7459a33L4n4J22j28j1J61K6M9j22K08j77j05k2K00k38J35j66J23J42N4j19j91
7481b12N8M19l77p5K54J32m8j91p7J91K41j65k49J80n0k7j57R0p3J05P7j56J64
7504E4m9K14l37K31j44P2j47K02l1k21m6J40P5L6N5L2j14j35L6J58j21j68L49
7527A41j55k09J23K18k1q0j8k11K77on3j8j06K08M9l8j85R9R3l26L17J31l03L93
7551C20l19j0O2J24k69O1O3rJ40m8p0R0j15P7j52j40L75o2j81J6lK34k21J1J40
7576A14l4j13R4o8q3L37l42J37O2j28j45J91J0M7J0j98K18j67L28m17M33k20j54
7599h8J80k17R3J1j26K42k38J68q8L00k34N5o6j01R6R8R6j41L6j74P1P1P2o3j7
$$ plain form
7624 36 -6 80 -155 -184 24 -120 54 -175 -191 20 57 -9 55 190 120 49 -353 167 -29 -28 13 107 48 -19 149
7649 149 53 -157 76 184 -249 -120 -111 -119 15 -107 -12 -214 300 -50 -330 -56 -94 24 182 16 -64 17 144
7672 144 -122 -41 250 60 -195 6 64 69 -188 -146 39 129 -9 51 106 -166 -2 119 -148 107 -50 -203 -113
7695 -113 50 104 -117 47 53 10 -204 52 12 64 -105 -89 106 150 3 -107 137 -124 58 -92 -264 99 -41
7718 -41 -125 -55 77 -74 261 234 100 16 88 86 172 -110 19 -262 -44 322 -56 -189 -136 32 6 -85 -95 -139 85
7743 85 55 -121 55 171 11 85 -56 8 -92 -25 -192 1 86 -76 95 13 28 -105 89 -91 -79 261 -51
7766 -51 -12 82 -51 -55 90 -33 140 -36 -183 -39 -99 92 320 -36 31 62 486 3 -147 119 67 43 111 183
7790 183 -155 -135 100 76 7 105 -28 -36 167 -201 -58 29 140 22 93 29 -170 34 65 285 192 -157 -236 -44
$$ packed form
7624C6m2Q6k35k9K08j44J74k29j6K11L7o6O4J35p0p1m02N20j96JM1R4n9o7J68
7649A49r6k10K33J08m33J29RqJ34j22R5k02N14l50k80K74l8J18J58j66q0Q1J27
7672A44k66Q1K91j90k55K01N8Nk57M2J85R0j38O0N5k72J64J21k67K55j57j53R0
7695a13J63N4k21J64Om3k14K56m0N2j69J6J95M4j47j10K44k61J82j50j72L63j40
7718d1q4P0J32j51L35k7j34q4P2kQ6k82J29k81K18L66l78j33N3J68k6r1j0m4K24
7743H5l0j76J76J16j60P4j41O4j00O7j67J93Q5j62J71q2J5j33J94j80J2L40l12
7766e1L9R4j33mJ45j23J73j76j47J44o0J91K28l56O7L1M24m83j50K66n2k4O8P2
7790A83l38K0K35k4o9R8j33qK03l68J43Q7J11j18P1o4j99K04L1K20r3l49p9J92
$$ plain form
7814 -44 -166 -155 -42 -11 -232 -59 151 -16 26 77 -158 -104 62 18 150 154 -180 -70 -17 -136 69 -24 39 18
7838 18 4 132 21 118 89 -37 66 -76 -194 -48 -108 -61 47 -43 -143 44 -57 212 38 -7 53 -137 75
7861 75 138 18 -65 -166 -21 -94 81 124 -314 -243 -66 138 301 245 -509 -152 122 22 -35 114 71 387 -118
7884 -118 -89 259 43 28 80 -144 -61 -36 87 400 -16 -15 54 56 15 -156 9 -38 -132 72 -219 -288 164 -60 -198
7909 -198 -241 -146 -207 218 170 36 -160 -5 -12 116 -30 136 53 205 -4 58 42 -103 -257 -12 134 -3 -170
7932 -170 187 -51 -137 56 -117 -23 11 75 -177 -92 -8 -90 58 -230 6 51 -153 -154 3 -112 -138 55 -68 -240
7956 -240 -140 -54 -88 -3 169 223 90 6 -18 144 -90 -25 -198 157 -179 129 -172 -4 -147 64 -153 -112 -301
7979 -301 -7 -60 52 -19 140 -187 -159 -16 8 -7 -36 206 194 -91 74 1 111 -111 198 -61 -102 -345 -104
$$ packed form
7814d4j22J1J13L1k21J73K10j67M2N1k35N4J66m4J32Ml34J10N3j19K05r3O3k1
7838A8j4J28j11R7k9j26J03j42j18J46o0M7J08r0j00J87j01K69j74m5O0j90K12
7861G5O3j20q3j01J45p3J75M3m38P1J77K04J63n6p54L57K74j00n7J49m3L16n05
7884a18K9L48k16j5N2k24Q3K5J23L13m16JO9Km1j71J65m7r4K04k91o9M52k24j38
7909a98m3R5o1M25m8j34j96J55pJ28j46J66q3J52k09O2j6j45j54K45J46j37j67
7932a70L57k38q6J93j73R4L4O4k52Q5Q4q2J48k88K36M5k04jJ57j15k6J93j23j72
7956b40J00Q6l4Q5J72N4j33q4k4J62k34O5j73L55l36L08l01J68j43K11k17M1j89
7979c01K94n3J12p1J59l27K8J43K4j5k9K42j2k85J65p3J10k22L09k59m1k43K41
$$ plain form
8002 -104 67 -99 59 253 89 -206 -225 283 -133 196 165 -43 328 80 -77 -472 244 69 65 -1 35 -40
8024 -40 -72 -178 117 25 -13 38 87 -31 -221 -226 -130 11 -106 -90 127 17 -7 138 288 70 40 -158 80 -37
8048 -37 114 -234 265 -39 -59 125 54 -128 -162 -65 -86 17 -81 -109 16 139 75 32 185 123 224 -54 63 22
8072 22 -49 -183 -151 -56 144 22 -124 92 44 180 33 63 -124 46 71 241 -122 126 209 34 98 -27 26
8095 26 42 120 -123 -193 73 108 -238 -41 -76 -79 100 0 78 -157 109 255 177 -92 -341 18 -56 -164 -183 -363
8119 -363 121 -113 -49 -33 -130 -91 -131 -258 -1 -120 -70 160 -32 -22 -16 123 177 16 -190 -170 -80 -18 -70 -42 -195
8144 -195 159 54 77 -27 -73 43 -70 -49 21 15 256 90 -76 -23 102 -64 -203 135 191 102 -3 179 114
8167 114 102 -7 79 162 -52 99 -35 -96 78 38 -268 -43 182 -5 160 54 -1 32 14 314 -98 55 39
$$ packed form
8002a04J71j66J58J94j64k95j9N08m16L29l1k08L71k48j57l95P16j75mo6L6p5
8024d0l2j06K95r2l8N1M9j18j90nR6J41j17J6K17j10k4J45J50k18l0j98K38j17
8048c7J51l48M99l04k0J84p1j82l4R7k1J03r8k8J25J23o4m3J53o2J01k78J17m1
8072B2p1j34L2R5K00j22j46K16m8J36j47L0j87J70K5J70l63K48Q3j75O4j25N3
8095B6J6P8k43p0K66L5l46J97l5lJ79j00P8k35K66J46p8k69k49L59p4j08j9j80
8119c63M84k34O4J6r7L9m0j27K57j19N0K30j92J0OJ39N4j61k06K0R0O2n2K8j53
8144a95L54j05K3j04m6J16j13K1P0oK41j66j66N3J25j66j39L38N6q9j05J82o5
8167A14j2j09Q6Q3k14J51j34o1J74m0l06K25K25j87J65j06n5L3j8L00m12J53j6
$$ plain form
8190 39 193
$$ packed form
8190C9J54
8191A93
$$ Imaginary data points
##PAGE= N=2
##DATA TABLE= (X++(I..I)), XYDATA
$$ plain form
0 0 0 0 0 0 0 0 0 0 0 0 0 0 0 0 8 -8 8 -8 8 -16 16 -16 24 -24 32 -36 40 -48 56 -64 72 -83 95 -107 120 -136
36 -136 152 -171 192 -212 236 -263 292 -324 358 -395 437 -481 531 -585 644 -708 782 -863 954
55 954 -1056 1172 -1306 1460 -1644 1865 -2135 2475 -2921 3529 -4415 5831 -8454 14993 -70991
70 -70991 -65627 40438 -32208 -23490 49994 60686 11076 28110 40808 4598 -19902 -2236
82 -2236 -18186 -22321 -11679 -23635 -18543 4947 -10551 -6612 21199 20168 6336 18715 30552
95 30552 14616 -8990 -5968 -11612 -29952 -23754 -17595 -15877 10498 20529 12324 19936 22494 9596
109 9596 -6249 -16695 -11236 -10620 -12935 -1553 4154 5199 8080 1173 739 1101 -6258 239 5089
124 5089 -755 4445 5989 1549 -1414 -11622 -7971 2029 -4908 -7542 3510 14333 10511 -4896
$$ packed form
0@%%%%%%%%%%%%%%Qj6J6j6J6k4L2l2M0m8N6o8P6q8J04j20J36j55J78k02K27k56
36a36K88l23L63m04M48m99N55o16O82p53Q32r18J012j116J229j352J490j645J817
55I54k010K228k478K766l104L509m000M610n396O450p944J0246j4285K3447q5984
70g0991N364J06065p2646Q718P3484J0692m9610J7034J2698l6210k4500J7666
82b236j5950m135J0642j1956N092K3490j5498L939K7811j031j3832J2379J1837
95C0552j5936k3606L022n644j8340O198O159J718K6375J0031q205P612K558j2898
109I596j5845j0446N459O16k315J1382N707J045K881o907m34L62p359O497M850
124E089n844N200J544m440k963j0208L651J0000o937k634J1052J0823l822j5407
$$ plain form
138 -4896 690 10216 -10394 -15937 1165 1197 562 8683 11377 8833 1487 -3938 -7386 -16550 -16491 -9515
154 -9515 -1523 9598 7452 10010 25481 12723 -7068 1279 866 -13010 -13337 -6190 -3184 -5941
168 -5941 -4080 -67 -4856 5 8054 3299 8045 15183 8988 10010 4988 -9252 -8543 -9411 -19132
183 -19132 -17043 -6831 1526 3538 8197 17593 12917 6508 8479 -3674 -10796 -2868 -5094 -5871 -221
198 -221 184 4237 2204 -7258 -4743 519 -1116 -3155 1969 12287 7614 -1033 6394 1132 -10880
213 -10880 -3210 -1208 -8045 -1871 4602 3793 884 -707 1688 -1063 -4278 -3298 -3380 4865 8503 -409
229 -409 4713 11319 -2099 -7931 -5392 -8492 -9745 -4464 3109 6590 6460 13615 11228 -1061 -1965
244 -1965 -3355 -8564 -7956 -8913 -3647 4083 -833 -1023 5942 4188 2606 4144 5764 6208 2482 3108
$$ packed form
138d896N586R526k0610n543J7102L2o35Q121K694k544p346n425l448r164N9O976
154i515P992J1121k146K558J5471j2758j9791Q347m13j3876l27P147L006k757
168e941J861M013m789M861Q049m755M746P138o195J022n022j4240P09q68r721
183a9132K089J0212Q357K012M659R396m676o409J971j2153p122P928k226p77N650
198b21M05M053k033r462K515N262j635k039N124J0318m673q647P427n262j2012
213a0880P670K002o837O174O473q09k909j591K395k751l215R80q2Q245L638q912
229d09N122O606j3418n832K539l100j253N281P573L481j30P155k387j2289r04
244a965j390n209O08r57N266P730m916j90O965j754j582J538J620M44l726O26
$$ plain form
260 3108 80 -10950 -9084 -7504 -15160 -10639 -2247 3097 11255 13175 14323 18180 10742 644 -5428
275 -5428 -10455 -13312 -17194 -12098 -3693 -4132 2875 11787 5236 4462 10872 6207 2258 2343 1946 1728 -4060
292 -4060 -8061 -7662 -8814 -7387 -7297 -3934 7294 7682 6423 14126 8625 -221 1234 -3764 -10867 -9688
308 -9688 -4561 -731 -2177 2083 9019 4871 1794 1599 -2859 -1796 -2396 -6075 664 3404 -20 3077
324 3077 2686 -1113 -1501 -703 -164 -2449 -667 6430 2372 -2602 1380 -1112 -4707 -3407 -3787 1118
340 1118 4622 2685 4760 4860 98 -1943 -4472 -5301 -5241 -4217 3296 3984 1799 8700 7639 -25
356 -25 -1164 -3958 -6620 -6252 -7687 -3713 1592 2849 4540 4888 5311 4596 -610 1345 2464 -3935 -384
373 -384 2604 -5827 -6578 -3007 -5282 -6550 -3572 4415 7686 6540 11196 10227 4011 1863 -4020 -9213
$$ packed form
260C108l028j1030J866J580p656M521Q392N344Q158J920J148L857p438j0098o072
275e428n027k857l882N096Q405m39P007Q912o551p74O410m665l949Q5l97k18n788
292d060m001L99j152J427R0L363J1228L88j259P703n501q846J455m998p103J179
308i688N127L830j446M260O936m148l077j95m458J063o00l679O739K740l424L097
324C077l91l799l88P98N39k285J782P097m058m974L982k492l595J300l80M905
340A118L504j937K075J00m762k041k529q29O0J024P513O88k185O901j061p664
356b5j139k794k662L68j435L974N305J257J691L48M23p15n206J955J119o399L551
373c84K988q431p51L571k275j268K978P987L271j146M656r69o216k148n883n193
$$ plain form
389 -9213 -7903 -9883 -7821 -1461 -1135 2155 7263 5810 3528 2353 2856 2002 -2669 -244 3101 -1281
405 -1281 -878 -990 -4056 -3191 -5144 -5512 203 692 1854 6452 5503 3181 1559 612 -413 -6080 -3389
422 -3389 2870 -1110 -1077 3650 520 -1885 -2484 -4554 -1945 -1637 -690 4413 5523 5502 5515 2577 847
439 847 -5042 -7584 -3598 -7009 -7139 2080 3401 2262 5868 5873 3821 1168 -320 226 -2568 -2672 -744
456 -744 -3410 -3297 -1913 -4193 -1322 329 314 6761 8650 6013 6804 4689 -664 -6634 -10533 -8501
472 -8501 -9668 -9226 -330 3838 5609 10534 10317 8233 5332 -150 -711 -3587 -8608 -6020 -3986 -5279
488 -5279 -4512 -2379 981 1431 667 6268 8287 5169 7064 4909 557 -1801 -6612 -8381 -7693 -9019
504 -9019 -4553 1081 3353 5572 7116 7478 4570 -1914 -691 -1023 -6456 -2709 1388 -756 1392 2538
$$ packed form
389i213J310j980K062O360L26L290N108j453k282j175N03q54m671K425L345m382
405a281M03j12l066Q65j953l68N715M89J162M598r49k322j622r47j025n667K691
422c389O259l980L3M727l130k405n99k070K609L08R47N103J110k1J3k938j730
439H47n889k542L986l411j30R219J321j139L606Nk052k653j488N46k794j04J928
456g44k666J13J384k280K871J651j5O447J889k637P91k115n353n970l899K032
472h501j167M42Q896M168J771M925k17k084k901n482n61k876n021K588K034j293
488e279P67K133L360M50p64N601K019l118J895k155m352k358m811j769O88j326
504i019M466N634K272K219J544L62k908o484J223l32n433L747M097k144K148J146
$$ plain form
520 2538 202 -688 -1563 -1052 -1865 -2439 1010 1434 680 3160 582 -495 1304 -2023 -1969 1671 825 677
538 677 1807 1194 -1034 -4518 -3969 -2747 -5055 -989 4624 3686 5678 6690 3945 1900 -3347 -5611
554 -5611 -4094 -6583 -5384 -152 1809 3443 3940 4191 4407 -74 -1467 689 -2554 -2643 13 -1248
570 -1248 -1178 -1019 -2263 181 -438 -702 3307 4143 4580 4107 2159 1589 -3337 -7481 -5371 -6866 -6332 -481
588 -481 2120 4637 7759 6743 5454 2717 -636 -1535 -4113 -4493 -2643 -3115 -948 170 -1889 588
604 588 624 -1869 1143 2727 2339 4029 4268 3594 630 -2529 -2132 -4958 -6875 -2544 -1337 -860 2768
621 2768 2734 3135 2372 -786 720 477 -1586 712 2332 2160 1589 -191 -82 -2768 -6657 -4264 -3252
638 -3252 -3187 1054 3703 5507 6690 3378 2451 1860 -3092 -4101 -3304 -3244 -2623 -1754 722 1485 -1107 860
$$ packed form
520B538k336q90q75N11q13n74L449M24p54K480k578j077J799l327N4L640q46j48
538F77J130o13k228l484N49J222k308M066N613r38J992J012k745k045n247k264
554e611J517k489J199N232J961J634M97K51K16m481j393K156l243q9K656j261
570a248P0J59j244K444o19k64M009Q36M37m73j948n70m926m144K110j495N34N851
588d81K601K517L122j016j289k737l353q99k578l80J850m72K167J118k059K477
604E88L6k493L012J584l88J690K39o74k964l159L97k826j917M331J207M77L628
621B768l4M01p63l158J506k43k063K298J620j72n71j780J09k686l889K393J012
638c252O5M241K649J804J183l312r27n91m952j009P97O0O21Q69K476P63k592J967
$$ plain form
656 860 2296 -312 1831 3315 1972 2459 944 -1298 -2043 -4922 -5505 -4028 -2822 1053 3074 5325
672 5325 8033 4778 2996 2226 -3621 -6072 -5292 -6152 -4699 -1589 1416 3772 2706 4447 5005 797
688 797 1032 1752 -986 -782 -1080 -2284 -2396 -4266 -4290 -1679 -2041 331 3442 4875 6453 4867 3504
705 3504 2780 -2617 -5170 -4548 -5982 -4696 -1496 540 3764 3458 2419 3585 908 -2169 -1471 -1687
721 -1687 -1010 -339 326 3238 1608 -387 1514 -838 -2215 -553 -1210 -300 153 -466 294 -200 -2029
738 -2029 -702 -415 668 2279 2687 4769 3606 585 718 -2783 -6682 -5394 -5104 -4129 -586 2419
754 2419 5084 6138 5220 5397 1946 -1175 -1823 -3970 -4445 -2954 -3062 -900 331 -601 1323 1932 1324
771 1324 2298 2432 2737 2643 -133 85 -1687 -5420 -4697 -3728 -3629 -267 2039 4868 6815 4443 3801 2471
$$ packed form
656H60J436k608K143J484j343M87j515k242p45k879n83J477J206L875K021K251
672E325K708l255j782p70n847k451P80q60J453L110L005K356j066J741N58m208
688G97K35P20k738K04k98j204j12j870k4K611l62K372L111J433J578j586j363
705C504p24n397k553O22j434J286L200K036L224l06j039J166k677l077O98k16
721a687O77O71O65K912j630j995J901k352j377J662o57R10M53o19P60m94j829
738b029J327K87J083J611M08K082j163l021J33l501l899J288K90R75L543L005
754B419K665J054r18J77l451l121o48k147m75J491j08K162J231r32J924O09o08
771A324R74J34L05r4k776K18j772l733P23R69R9L362K306K829J947k372o42j330
$$ plain form
789 2471 -2357 -4011 -5050 -5240 -3470 -3062 374 2981 1766 3142 3769 1397 1343 890 305 975 -958
806 -958 -1033 -517 -3136 -3156 -2831 -2834 -826 302 2084 5486 3788 3673 3963 -248 -1754 -2249 -3752 -3096 -2430
825 -2430 -938 1004 -205 733 1227 -968 -312 -31 -501 2165 2444 2127 3852 1813 -389 -1075 -3186
842 -3186 -4025 -3947 -3126 -471 -144 1184 3983 2418 1507 2043 220 322 -217 -900 880 -326 -1625 -694
860 -694 -1993 -3252 -2072 -1508 747 1438 2746 5183 3747 1301 1486 -1323 -3356 -3473 -4104 -2161 -498
877 -498 167 2699 3052 2042 2264 434 -153 -1026 -2355 -798 -748 -1687 729 580 -1171 17 -93 53
895 53 980 985 2346 1943 537 740 -1244 -2911 -2747 -3519 -1912 126 255 2946 4051 1901 2100 682
913 682 -991 -1742 -2646 -1567 -495 -794 1477 2103 185 523 -486 -1686 -1037 -1520 -607 608 235 1511
$$ packed form
789B471m828j654j039j90J770M08L436K607j215J376O27k372n4m53n85O70j933
806i58p5N16k619k0L25lK008J128J782L402j698j15K90m211j506m95j503O56O66
825b430J492J942j209R38M94k195O56K81m70K666K79l17J725k039k202o86k111
842c186q39P8Q21K655L27J328K799j565r11N36j823J02n39o83J780j206j299R31
860f94j299j259J180N64K255O91J308K437j436k446J85k809k033j17o31J943J663
877d98O65K532L53j010K22j830n87q73j329J557N0r39K416j49j751J188j10J46
895E3R27NJ361m03j406K03j984j667J64p72J607K038J29K691J105k150J99j418
913F82j673p51r04J079J072k99K271O26j918L38j009j200O49m83R13J215l73J276
$$ plain form
931 1511 2055 839 753 108 -639 97 -696 -22 807 -1201 -851 -1034 -2915 -1773 -1462 -282 2026 2398
949 2398 4055 5064 2936 1685 -656 -2840 -3966 -5404 -4467 -2071 -1717 618 3080 2643 3353 3193
965 3193 1938 1517 -39 -469 -352 -2156 -2144 -2026 -2766 -1541 -1814 -1156 1613 1700 2229 4615 3227 1730
983 1730 1035 -1441 -2607 -4287 -4096 -1820 -1488 254 3349 2875 2950 2413 464 124 -1330 -2471 -1163
1000 -1163 -1769 -1618 207 -338 199 701 -74 1092 718 793 2018 1192 355 514 -1573 -1697 -2028 -2870 -1656
1019 -1656 -855 -559 1886 2471 2743 2577 1233 579 -922 -2253 -984 -930 -1272 1113 906 -281 106 -1127
1037 -1127 -903 -1055 -1497 838 1442 1113 2404 1716 886 863 -864 -994 -1210 -2273 -955 -557 -827 47
1055 47 -3 7 296 -533 1011 1674 515 1762 2152 1195 339 -1369 -2168 -1936 -3538 -2109 -759 -3 1917
$$ packed form
931A511N44j216q6o45p47P36p93O74Q29k008L50j83j881J142L11J180K308L72
949B398J657J009k128j251k341k184j126j438R37K396L54K335K462m37P10j60
965C193j255m21j556m30J17j804J2J18p40J225k73O58K769Q7N29K386j388j497
983A730o95k476j166j680J91K276L32J742L095m74P5n37j949l40j454j141J308
1000a163o06J51J825n45N37N02p75J166l74P5J225q26q37J59k087j24l31q42J214
1019a656Q01K96K445N85K72j66j344o54j501j331J269N4l42K385k07j187L87j233
1037a127K24j52m42K335O04l29J291o88q30k3j727j30k16j063J318L98k70Q74
1055D7n0J0K89q29J544O63j159J247L90r57q56j708p99K32j602J429J350P56J920
$$ plain form
1074 1917 2667 2426 2552 1194 -63 19 -2199 -1736 -642 -1103 368 367 59 1124 -259 -390 545 -101
1092 -101 136 1089 -20 597 -312 -847 -334 -1627 -894 214 -341 1235 2445 1277 1143 471 -1019 -1227
1110 -1227 -2452 -2156 -437 -1139 542 1873 1784 2093 812 -422 480 -1439 -1815 -410 -285 95 679
1127 679 540 956 -525 -960 98 -794 -537 819 133 366 729 -409 429 -330 -692 638 148 556
1145 556 1167 422 652 -155 -2065 -1846 -2057 -2663 -1200 -190 1616 3073 2615 3463 2651 19 -572 -1953
1163 -1953 -3305 -2443 -2515 -2005 -463 -317 597 1056 784 2310 1815 1638 2443 1032 262 -351 -2194 -2439
1181 -2439 -2955 -3568 -1792 -940 236 2499 3057 3417 2971 1069 579 -521 -2993 -2415 -1883 -1857 -513 -8
1199 -8 1309 1530 489 1172 830 -140 338 198 60 453 -1122 -1042 -596 -2040 -1125 154 53 1449 1563
$$ packed form
1074A917P50k41J26j358j257Q2k218M63J094m61J471jl08J065j383j31R35o46
1092a01K37R53j109O17r09n35N13j293P33J108n55J576J210j168j34o72j490k08
1110a227j225K96J719p02J681J331q9L09j281j234R02j919l76J405J25L80N84
1127F79j39M16j481m35J058q92K57J356o86K33L63j138Q38p59l62J330m90M08
1145E56O11p45K30q07j910K19k11o06J463J010J806J457m58Q48q12k632n91j381
1163a953j352Q62p2N10J542J46R14M59k72J526m95j77Q05j411p70o13j843k45
1181b439n16o13J776Q52J176K263N58L60m46j902m90j100k472N78N32K6J344N05
1199hJ317K21j041O83l42r70M78j40j38L93j575Q0M46j444R15J279j01J396J14
$$ plain form
1218 1563 1791 2391 248 -367 -475 -2307 -2021 -1803 -1566 32 333 1020 2007 1205 857 705 -514 -225
1236 -225 -219 -353 689 58 40 409 -974 -1094 -875 -1777 -756 143 295 1479 1351 1179 1470 -2 -295
1255 -295 -70 -1019 -229 -27 -444 133 -657 -617 -187 -1208 -976 273 235 1575 1853 1844 1961 465 -218 -326
1275 -326 -2202 -2378 -1825 -1386 -28 433 537 2049 1429 316 748 -42 -188 82 -294 767 442 -497
1293 -497 293 -742 -1288 -530 -871 -121 902 576 1376 1201 -130 207 -794 -1084 -560 -579 98 937 414
1312 414 1099 462 -592 -381 -1311 -1333 -449 -761 166 1309 903 1385 1082 -23 -146 -1045 -1421 -391 -715
1331 -715 292 858 416 1005 403 -663 -122 -472 -229 354 -94 472 558 -773 -408 -374 -949 -102 -176 796
1351 796 1970 1252 1631 1324 -711 -1334 -2012 -2698 -1918 -1896 -338 1547 1110 2416 2577 1473 1025 292
$$ packed form
1218A563K28O00k143o15j08j832K86K18K37J598L01O87R87q02l48j52j219K89
1236b25Oj34J042o31j8L69j383j20K19r02J021Q99J52J184j28j72K91j472k93
1255b95K25r49P90K02m17N77p90M0M30j021K32J249l8J340K78rJ17j496o83j08
1275c26j876j76N53M39J358M61J04J512o20j113M32p90j46K70l76J061l25r39
1293d97P90j035n46P58l41P50J023l26Q00j75j331L37j001k90N24j9O77Q39n23
1312D14O85o37j054K11r30k2Q84l12R27J143m06M82l03j105j23q99l76J030l24
1331g15J007N66m42N89o02j066N41l50K43N83m48N66Q6j331L65L4n75Q47p4R72
1351G96J174p18L79l07k035o23o78o86P80K2J558J885m37J306J61j104m48p33
$$ plain form
1369 292 -554 -766 -1691 -1383 -890 -1652 -982 -599 -982 375 820 1006 2734 2351 1992 1767 -188 -964 -1607
1388 -1607 -3084 -2715 -2354 -1402 736 1059 1819 2647 1584 1359 801 -638 -354 -1231 -1350 -511 -766 -414
1406 -414 672 -322 19 575 -166 783 672 415 1195 13 -539 -332 -1560 -1192 -1058 -923 681 843 1567
1425 1567 2129 1112 98 -168 -1191 -1344 -1574 -1257 -89 -137 89 1272 1024 647 668 -161 -23 31 -570
1444 -570 297 176 -58 238 -691 -379 -344 -696 -130 238 194 936 943 240 492 -455 -580 -149 -653 345 762
1465 762 375 1129 684 -333 -641 -1478 -1396 -1139 -1138 284 1025 869 1659 1650 426 538 -497 -524 -823 -1106 -483
1486 -483 -364 -341 -66 -156 -654 387 -145 224 1044 805 1258 1174 224 217 -758 -1590 -1219 -1473 -885 164 292
1507 292 809 1136 412 508 3 -503 -423 -247 118 481 25 571 489 -537 -204 -960 -838 162 -237 9
$$ packed form
1369B92q46k12r25L08M93p62O70L83l83J357M45J86J728l83l59k25j955p76o43
1388a607j477L69L61R52K138L23P60Q28j063k25n58j439K84q77j19Q39k55L52
1406d14J086r94L41N56p41R49j11k57P80j182n52K07j228L68J34J35J604J62P24
1425A567N62j017j014k66j023j53k30L17J168m8K26J183k48l77K1q29J38N4o01
1444e70Q67j21k34K96r29L12L5l52N66L68m4P42Pp03K52r47j25M31n04R98M17
1465G62l87P54m45j017l08q37Q2K57JJ422P41j56P90rj224J12j035k7k99k83O23
1486d83J19K3K75r0m98J041n32L69Q20k39M53q4r50pr75q32L71k54N88J049J28
1507B92N17L27p24R6n05n06Q0J76L65L63m56N46q2j026L33p56J22J000l99K46
$$ plain form
1527 9 910 496 713 980 -150 65 -562 -593 -132 -390 259 440 420 60 -40 -359 -108 -645 -278 865 91
1548 91 580 725 75 -374 -707 -1405 -649 -446 18 947 829 1260 1406 456 379 -650 -1456 -1071 -1220 -1167 -86
1569 -86 -159 530 696 722 1071 925 342 736 123 -54 91 -908 -1341 -1299 -1886 -1180 -541 -35 1408 1262 1707
1590 1707 2254 1379 576 -183 -1590 -1691 -1375 -1989 -978 -430 -148 713 616 1034 529 276 349 447 65 264
1610 264 -23 -313 -152 -760 -450 -310 -646 279 724 378 847 633 191 39 -796 -631 -468 -824 -205 389
1630 389 364 889 721 507 668 -928 -694 -357 -692 -82 63 16 657 288 328 457 -193 -151 243 19 336
1651 336 31 -234 45 -454 -521 128 -522 67 522 -1 654 262 43 187 -429 -693 -352 -643 -90 580
1671 580 584 1246 956 625 294 -793 -731 -652 -944 -619 -139 78 542 706 330 911 482 260 519 -64 23
$$ packed form
1527IR01m14K17K67j130K15o27l1M61k58O49J81k0l60j00l19K51n37L67J143p74
1548I1M89J45o50m49l33o98P56K03M64R29j18M31J46r50p7j029q06L85j49N3J081
1569h6p3O89J66K6L49j46n83L94o13j77J45r99m33M2n87P06O39N06J443j46M45
1590A707N47q75q03p59j407j01L16o14J011N48K82Q61r7M18n05k53P3R8l82J99
1610B64k87k90J61o08L10J40l36R25M45l46M69k14m42j52q35J65J63l56O19N94
1630C89k5N25j68k14J61j596K34L37l35O10J45m7O41l69M0J29o50M2L94k24L17
1651C36l05k65K79m99o7O49o50N89M55n23O55l92k19J44o16k64L41k91N53O70
1671E80MO62k90l31l31j087O2P9k92L25M80K17M64J64l76N81m29k22K59n83Q7
$$ plain form
1692 23 285 -482 -318 -802 -1033 -481 -720 -573 277 785 1087 1094 660 997 79 -477 -648 -1128 -955 -420 -590
1713 -590 -148 186 34 388 190 -99 438 208 152 481 241 492 541 -503 -212 -534 -709 -474 -532 -429 451
1734 451 170 360 767 152 412 -167 -194 296 -44 -12 455 -425 -140 6 -745 -335 -334 -403 588 690 692 707 259
1757 259 280 -276 -1088 -608 -464 -637 -150 310 514 1080 379 723 359 -466 -327 -475 -695 -239 -665 -545
1777 -545 126 -341 -47 531 181 415 786 605 892 -389 -234 -353 -1220 -1237 -1222 -1068 -21 177 280 1382
1797 1382 1137 779 884 358 292 -572 -1103 -517 -651 -699 199 -243 -164 374 221 606 471 373 848 542 90
1818 90 245 -371 -421 -302 -868 -418 99 153 533 442 176 615 -276 -444 -295 -630 -253 -82 -126 1004 428
1839 428 231 539 -494 -393 -420 -613 -527 -288 -105 442 85 -62 350 127 133 174 114 615 419 180 31 -409
$$ packed form
1692B3K62p67J64m84k31N52k39J47Q50N08L02Pm34L37r18n56j71m80J73N35j70
1713e90M42L34j52L54j98k89N37k30n6L29k40K51M9j044K91l22j75K35n8J03Q80
1734D51k81J90M07o15K60n79k7M90l40L2M67q80K85J46p51M10Jo9R91J02KJ5m48
1757B59K1n56q12M80J44j73M87M60K04N66p01L44l64q25J39j48k20M56m26J20
1777e45O71m67K94N78l50K34L71j81K87j281J55j19q67j7J5J54J047J98J03J102
1797A382k45l58J05n26o6q64n31N86j34m8Q98m42P9N38j53L85j35r8M75l06m52
1818I0J55o16n0J19n66M50N17N4L80r1k66M39q91j68J49l35L77J71m4J130n76
1839D28j97L08j033J01k7j93Q6K39J83N47l57j47M12k23OM1o0N01j96k39j49m40
$$ plain form
1861 -409 -380 -224 -957 -487 145 -107 552 704 531 623 111 -504 -428 -760 -408 -318 -96 401 613 308 329 -236
1883 -236 -354 44 -360 -440 -217 -79 211 -172 -317 152 149 -231 266 282 323 620 -91 301 -48 -322 -655 -849
1905 -849 -914 -584 0 470 638 589 1044 740 163 175 54 -320 97 -833 -621 -94 -372 -278 -250 -169 50 -26
1927 -26 50 475 605 678 623 116 20 -620 -849 -604 -741 -512 233 -25 252 341 381 342 164 -89 326 130 84
1950 84 260 -171 17 -203 -683 -653 -472 -280 -94 116 269 736 200 195 -4 -222 -356 -555 -1003 -49 -76 268
1972 268 421 240 587 322 -11 -39 -47 -145 108 -399 -366 -32 -280 -212 -93 -260 244 506 389 796 641 374
1994 374 220 -760 -601 -757 -761 -608 -559 -165 619 471 663 565 320 369 289 -426 -136 137 -325 -174 -432 -569
2016 -569 39 -612 18 14 150 639 561 156 583 -23 -13 -243 -387 -214 56 -108 271 196 331 382 -89 -274
$$ packed form
1861d09K9J56p33M70O32k52O59J52j73R2n12o15P6l32L52R0K22M97K12l05K1n65
1883b36j18L98m04q0K23J38K90l83j45M69ll80M97J6M1K97p11L92l49k74l33j94
1905h49o5L30N84M70J68m9M55l04n77J2j21l74M17r30K12N27k78R4K8Q1K19p6
1927b6P6M25J30P3n5n07r6o40k29K45j37K29P45k58K77Q9M0l9j78k53M15j96m6
1950H4J76m31J88k20m80L0J81J92J86K10J53M67n36nj99k18j34j99m48R54k7L44
1972B68J53j81L47k65l33k8qr8K53n07L3L34k48O8J19j67N04K62j17M07j55k67
1994C74j54r80J59j56mJ53M9L94P84j48J92r8k45M9q0p15K90K73m62J51k58j37
2016e69O08o51O30mJ36M89p8m05M27o06J0k30j44J73K70j64L79p5J35N1m71j85
$$ plain form
2038 -274 -343 -572 -253 -4 325 622 672 242 351 147 -230 9 -645 -247 91 -317 47 -239 -154 141 178
2059 178 235 309 444 571 638 120 179 -270 -374 -619 -973 -667 -377 -201 195 538 541 953 486 22 41 -528
2081 -528 -687 -383 -473 -26 70 -256 228 -156 23 278 -103 -6 414 -308 19 70 -529 -257 -244 -330 1 180
2103 180 664 584 617 593 614 -205 -13 -619 -916 -421 -442 -216 108 204 329 543 132 570 187 -32 275 -276
2125 -276 -22 135 -569 -252 -334 -640 -198 -291 36 624 309 639 629 138 177 -86 -248 -444 -399 -576 190 -323
2147 -323 91 189 -214 -245 135 -128 228 44 29 362 196 39 229 -372 -20 -405 -588 -99 -94 -128 307 151
2169 151 129 16 -92 207 -188 -333 15 120 -28 247 -266 -9 17 -120 -171 4 -152 91 150 100 126 -145
2191 -145 -351 -94 -613 -40 176 -48 358 516 129 461 -84 -44 -361 -756 -409 -464 -383 237 -132 -148 483
$$ packed form
2038b74o9k29L19K49L29K97N0m30J09k04l77K39o54L98L38m08L64k86Q5K95L7
2059A78N7P4J35J27O7n18N9m49j04k45l54L06K90J76L96L43LM12m67m64J9n69
2081e28j59L04r0M47R6l26M84l84J79K55l81R7M20p22L27N1n99K72J3q6L31J79
2103A80M84q0L3k4K1q19J92o06k97M95k1K26L24R6J25K14m11M38l83k19L07n51
2125b76K54J57p04L17q2l06M42r3L27N88l15L30j0m91L9k63j62j96M5j77P66n13
2147c23M14R8m03l1L80k63L56j84j5L33j66j57J90o01L52l85j83M89Nl4M35j56
2169A51k2j13j08K99l95j45L48J05j48K75n13K57K6j37n1J75j56K43N9n0K6k71
2191a45k06K57n19N73K16k24M06J58l87L32n45M0l17l95L47n5Q1O20l69j6O31
$$ plain form
2212 483 46 -54 -2 -11 80 195 -307 159 -168 -370 -164 -545 -187 59 -118 413 234 63 460 159 -46
2233 -46 336 -211 -39 7 -120 30 349 80 128 -39 -254 136 -605 -327 36 3 258 209 101 413 246 359
2255 359 205 -180 -298 22 -231 -162 -286 -363 -267 -229 -85 160 255 467 699 505 586 154 -558 -171 -482 -520
2277 -520 -244 -490 -45 317 167 151 290 294 373 -181 -317 131 -107 -42 -144 -388 -143 -88 -35 -44 178 214 548
2300 548 31 109 99 -162 -44 -355 -650 -210 -56 64 88 207 200 400 -289 82 -155 -202 -58 -266 -146 89
2322 89 -333 47 -92 127 157 243 162 425 170 97 230 -305 -91 -76 -497 -419 -196 -332 142 -64 43 597
2344 597 245 197 158 -37 -107 79 -368 -18 -110 -280 -296 -498 -332 -66 -199 181 64 286 517 214 309 118
2366 118 -160 -68 90 -289 -154 -169 -269 -54 -54 45 132 -144 36 5 -65 15 142 -146 138 -347 125 -3 -411
$$ packed form
2212D83m37j00N2rR1J15n02M66l27k02K06l81L58K46j77N31j79j71L97l01k05
2233d6L82n47J72M6j27J50L19k69M8j67k15L90p41K78L63l3K55m9j08L12j67J13
2255C59j54l85j18L20k53O9j24p7R6L8J44K45R5K12K32j94Q1m32p12L87l11l8
2277e20K76k46M45L62j50j6J39MP9n54j36M48k38O5j02k44K45N5N3rK22L6L34
2300E48n17P8j0k61J18l11k95M40J54J20K4J19pK00o89L71k37m7J44k08J20K35
2322H9m22L80j39K19L0Q6q1K63k55p3J33n35K14J5m21P8K23j36M74k06J07N54
2344E97l52m8l9j95p0J86m47L50r2j70j6k02J66K66j33L80j17K22K31l03R5j91
2366A18k78R2J58l79J35j5j00K15%R9Q7k76J80l1p0Q0J27k88K84m85M72j28m08
$$ plain form
2389 -411 -117 14 -203 -192 -77 31 477 -80 -446 -36 19 -121 97 24 163 18 114 193 156 -107 -82 -334
2411 -334 -153 -100 -232 74 142 -152 164 -62 -20 70 13 -59 -115 -229 175 22 10 55 -218 -128 -26 -342 -62
2434 -62 69 -80 31 173 -63 -165 66 -50 90 -154 -15 65 53 204 26 -79 73 -345 -65 -46 -451
2455 -451 -90 193 126 259 12 23 25 299 -28 317 -268 -295 -135 -210 -19 -726 -295 -128 -102 92 373 223
2477 223 391 894 66 318 32 -236 -200 -337 -318 -100 -131 -32 348 266 391 59 -38 120 203 -157 176 -190
2499 -190 -186 -144 -75 -309 -320 -324 98 187 122 281 152 -139 -143 -209 -142 -424 -262 -125 -35 287 343 272 346 172 -112 -27
2525 -27 -252 -303 -321 -79 -191 11 -78 155 -129 -8 416 -112 190 459 123 305 35 -124 -115 -356 -303 -150
2547 -150 -39 -56 224 140 117 77 -30 -14 201 -191 -60 -203 -85 77 -156 -20 -202 -284 10 163 58 246
$$ packed form
2389d11K94J31k17J1J15J08M46n57l66M10N5j40K18p3J39j45R6P9l7k63K5k52
2411c34J81N3j32L06O8k94L16k26M2R0n7p2n6j14M04j53j2M5k73R0J02l16K80
2434f2J31j49J11J42k36j02K31j16J40k44J39Q0j2J51j78j05J52m18K80J9m05
2455d51L61K83o7J33k47J1KK74l27L45n85k7J60p5J91p07M31J67K6J94K81j50
2477B23J68N03q28K52k86k68L6j37J9K18l1R9L80q2J25l32r7J58Q3l60L33l66
2499a90MM2O9k34j1mM22Q9o5J59j29k91mo6O7k82J62J37R0L22N6p1P4j74k84Q5
2525b7k25n1j8K42j12K02q9K33k84J21M24n28L02K69l36J82k70j59Rk41N3J53
2547a50J11j7K80q4k3m0j07J6K15l92J31j43J18J62k33J36j82q2K94J53j05J88
$$ plain form
2569 246 36 314 205 -133 -34 132 -430 -9 -92 -161 -88 -184 -368 -141 -89 -165 53 -379 161 216 36 326 -92
2592 -92 107 96 -115 11 -78 -31 -264 -101 -32 107 -56 -235 -156 -118 93 204 -55 151 58 200 312 -32 -127
2615 -127 -35 -173 -150 34 8 234 213 105 -131 -58 78 221 70 162 154 188 224 25 -252 -58 -328 -271 22 -222
2639 -222 4 -69 170 446 -40 86 -52 -73 -380 -32 -311 131 242 71 296 229 20 129 -34 -199 -132
2660 -132 -270 18 86 -109 -15 208 85 -103 206 124 242 -163 77 -149 -105 -109 -242 -408 -272 -187 -273 201 154
2683 154 343 339 48 166 148 -12 -176 -27 -74 -122 -112 -242 -154 -262 -190 61 -8 326 111 110 323 58 -158 -93
2707 -93 -172 -181 -263 -107 -59 76 -52 360 -52 24 77 -76 -48 226 -195 75 -26 -256 30 -37 68 -290 -164
2730 -164 331 -324 -220 153 80 -58 6 -226 -16 -242 -107 -53 236 -70 256 345 136 24 65 -181 -136 -373
$$ packed form
2569B46k10K78j09l38R9J66n62M21q3o9P3r6j84K27N2p6K18m32N40N5j80K90m18
2592i2J99j1k11J26q9M7k33J63O9J39j63j79P9L8K11J11k59K06r3J42J12l44r5
2615a27R2j38K3J84k6K26k1j08k36P3J36J43j51R2qL4L6j99k77J94k70N7K93k44
2639b22K26p3K39K76m86J26j38k1l07L48k79M42J11j71K25o7k09J09j63j65O7
2660a32j38K88O8j95R4K23j23j88L09q2J18m05K40k26M4mj33j66J36Q5q6M74m7
2683A54J89mk91J18j8j60j64J49m7m8J0j30Q8j08P2K51o9L34k15jK13k65k16O5
2707i3p9rq2J56M8J35j28M12m12P6N3j53K8K74m21K70j01k30K86o7J05l58J26
2730a64M95o55J04L73p3j38O4k32K10k26J35N4K89l06L26Q9k09j12M1k46M5k37
$$ plain form
2752 -373 -426 -47 37 35 -202 130 296 -231 61 126 379 165 2 13 113 -130 -96 -461 -297 1 291 -82
2774 -82 70 358 -260 333 358 53 79 -78 112 141 158 177 19 -111 -49 -211 -36 -91 -328 -177 120 -127 140
2797 140 -13 80 346 180 -23 163 165 172 -5 -141 -290 57 -130 20 -259 -39 185 105 249 182 77 248
2819 248 178 81 148 -259 -203 165 -56 214 85 -255 78 20 93 179 163 3 111 12 -27 13 -77 -221 -204 -320
2843 -320 255 -250 -105 199 169 72 -75 -59 -51 23 159 -40 49 -14 107 -85 89 74 -36 -29 108 259 181 -309
2867 -309 -58 -264 25 23 -141 -75 120 6 60 147 101 93 263 134 60 -214 -221 -240 -63 -270 122 -157 176 60
2891 60 37 40 18 109 117 -55 -155 -21 -131 -189 -231 -273 -74 -18 -7 168 68 -34 55 114 173 47 71 0 -238 95
2917 95 -156 -222 25 162 -398 173 55 20 -149 4 -161 91 275 48 134 78 46 7 106 -4 140 -26 89
$$ packed form
2752c73n3L79Q4kk37L32J66n27K92O5K53k14j63J1J00k43L4l65J64K98K90l73
2774h2J52K88o18N93K5l05K6j57J90K9J7J9j58j30O2j62J75n5k37J51K97k47K67
2797A40j53R3K66j66k03J86KPj77j36j49L47j87J50k79K20K24q0J44o7j05J71
2819B48p0r7O7m07N6L68k21K70j29l40L33n8P3Q6j6j60J08r9l9M0r0j44J7j16
2843c20N75n05J45L04l0r7j47J6QP4J36j99Q9o3J21j92J74j5j10PJ37J51p8m90
2867c09K51k06K89kj64O6J95j14N4Q7m6qJ70j29p4k74pj9J77k07L92k79L33j16
2891F0k3Lk2R1Qj72j00J34j10n8m2m2J99N6J1J75j00j02Q9N9N9j26K4p1k38L33
2917I5k51o6K47J37n60N71j18l5j69J53j65K52J84k27Q6n6l2l9R9j10J44j66J15
$$ plain form
2940 89 -166 196 102 -139 18 192 -42 49 103 21 35 -20 51 94 -321 26 167 -120 -50 -99 68 -128 -84 -87 92
2965 92 168 92 -97 -155 -318 4 -124 211 -39 -7 37 -52 -117 -154 -28 80 -6 -117 64 1 -38 -72 35 127 224
2990 224 -88 -6 49 99 94 -167 129 -112 -230 101 -80 -109 81 -13 222 219 133 66 186 -370 -10 -11 -150 1
3014 1 47 140 19 -147 -253 72 -104 -52 -77 -55 138 94 126 -18 -88 158 -4 -122 -99 128 -176 -3 84 -135
3038 -135 67 39 181 101 148 -162 190 71 177 -113 -233 161 -166 69 -9 -15 -89 25 -103 -22 1 18 -89
3061 -89 -159 110 183 -67 31 -28 -154 212 71 -22 199 -38 -40 -130 91 -278 -28 -185 -68 210 150 226 247 222
3085 222 220 153 186 -121 -154 21 -245 -57 -94 -220 2 -200 -19 372 41 202 298 286 122 212 43 24 -125
3108 -125 -388 51 -30 -81 151 7 152 96 34 317 306 -88 108 22 -59 204 -247 -227 -182 -89 -3 -10 -116 150
$$ packed form
2940H9k55L62r4k41J57J74k34R1N4q2J4n5P1M3m15L47J41k87P0m9J67j96M4lJ79
2965I2P6p6j89n8j63L22j28L35k50L2M4q9o5l7J26J08q6j11J81o3l9l4J07R2R7
2990B24l12Q2N5N0nk61K96k41j18L31j81k9J90r4K35lq6o7J20n56L60jj39J51
3014AM6R3j21j66j06L25j76N2k5K2J93m4L2j44p0K46j62j18K3K27l04J73Q7k19
3038a35K02k8J42q0M7l10L52j19J06k90j20L94l27K35p8op4J14j28Q1K3J7j07
3061h9p0K69P3k50R8n9j26L66j41r3K21k37kr0K21l69K50j57J17K78o0P6K1k5
3085B22ko7L3l07l3J75k66J88l7j26K22k02J81L91l31J61R6j2j64R0j69j9j49
3108a25k63M39q1n1K32j44J45n6o2K83j1l94J96q6q1K63m51K0M5R3Q6pj06K66
$$ plain form
3132 150 67 -131 -23 7 -319 32 87 -46 -10 -215 68 -66 57 195 30 -108 24 38 -37 149 85 201
3154 201 73 95 128 69 54 274 -87 -48 193 44 -121 -125 -444 70 26 -113 216 35 -40 213 -8 -88 50
3177 50 -158 -116 113 -202 107 20 131 -102 -109 -64 -36 136 -131 30 65 136 -82 3 -49 56 207 -288 -90 17
3201 17 -116 85 465 16 -101 141 -254 -132 -146 -123 2 -130 -228 109 -50 164 -180 152 109 68 -182 3
3223 3 -167 -182 -26 -91 -229 242 21 -160 77 -135 9 55 54 124 -72 -154 -204 54 43 -29 -119 2 48 96 276
3248 276 -35 357 13 13 84 -88 -7 186 17 -144 135 -166 -46 161 -46 77 -29 61 -19 -130 -122 -43 30
3271 30 -125 -30 -34 -215 -224 209 -118 -88 -57 117 -198 -51 58 -171 -94 -199 -29 -1 160 146 -26 105 234 65
3295 65 58 -62 51 -160 -88 -59 -270 29 -46 59 223 -185 -49 216 84 114 76 24 88 -16 81 -36 -250 -69
$$ packed form
3132A50q3j98J08L0l26L51N5j33L6k05K83j34J23J38j65j38J32J4p5J86o4J16
3154B01j28K2L3n9j5K20l61L9K41j49j65ml19N14m4j39L29j81p5K53k21q0J38
3177E0k08M2K29l15L09q7J11k33pM5K8J72k67J61L5P1k18Q5n2J05J51m95J98J07
3201A7j33K01L80m49j17K42l95J22j4K3J25j32r8L37j59K14l44L32m3m1k50J85
3223Cj70j5J56o5j38M71k21j81K37k12J44M6jP0j96q2n0K58j1p2r0J21M6M8J80
3248B76l11L92l44%P1j72Q1J93j69j61K79l01J20K07k07J23j06R0q0j11QP9P3
3271C0j55R5mj81rM33l27L0L1J74l15J47J09k29P7j05J70K8J61j4j72J31J29j69
3295F5pj20J13k11P2K9k11K99p5J05J64m08J36K65j32L0l8n2O4j04R7j17k14J81
$$ plain form
3319 -69 -137 -255 197 61 -135 319 -20 -42 69 -287 84 28 51 -5 -310 93 16 175 143 -129 -192 -88 178
3342 178 34 -77 -10 52 161 77 147 12 13 42 -250 46 -217 68 -226 -53 117 -101 82 -6 54 79 -339
3365 -339 -18 66 219 19 -24 162 55 -84 5 -178 -86 -23 -207 -90 133 -6 -174 20 100 297 -345 57
3387 57 405 -32 -96 112 69 -4 337 112 -35 -145 62 -76 112 -333 46 -17 146 250 -173 -124 -254 54
3409 54 -89 258 117 97 67 -304 -86 -72 186 -58 -45 2 -90 65 12 49 16 28 146 -7 15 29 59 -90 -243
3434 -243 23 -49 -184 177 60 -42 -89 -120 298 -57 78 -24 1 -251 -288 -9 -120 -148 38 -34 -6 118 119
3457 119 102 282 255 -21 73 50 52 -379 173 -106 -30 -39 494 250 56 -86 5 -96 149 177 -114 -153 57 72
3481 72 -49 22 191 22 -43 73 -75 145 -113 -4 -29 51 135 -23 106 -37 -237 163 203 126 194 192 121 -194
$$ packed form
3319f9o8j18M52j36j96M54l39k2J11l56L71n6K3n6l05M03p7J59l2k72o3J04K66
3342A78j44j11O7O2J09q4P0j35JK9k92K96k63K85k94J73J70k18J83q8O0K5m18
3365c39L21Q4J53k00m3J86j07j39Q9j83R2O3j84J17K23j39j68J94Q0J97o42M02
3387E7L48m37o4K08m3p3L41k25j47j10K07j38J88m45L79o3J63J04m23M9j30L08
3409E4j43L47j41k0l0l71K18J4K58k44J3M7r2J55n3L7l3J2J18j53K2J4L0j49j53
3434b43K66p2j35L61j17j02m7l1M18l55J35j02K5k52l7K79j11k8J86p2K8J24J
3457A19j7J80k7k76R4k3Km31N52k79P6rN33k44j94j42R1j01K45K8k91l9K10J5
3481G2j21P1J69j69o5J16j48K20k58J09k5Q0Q4j58J29j43k00M00M0p7O8kp1l15
$$ plain form
3505 -194 -113 55 -95 -311 -85 -50 -121 145 353 -39 -14 108 -9 -39 -57 -13 127 -66 -11 -187 -192 -127 38 26
3529 26 32 -31 -99 -22 -32 106 -6 87 -89 -61 -69 194 12 -254 -205 -112 -221 93 -135 -40 -55 -178 18 -299 332
3554 332 52 2 112 39 -72 137 148 -192 -249 -86 -125 -16 314 -18 96 141 -36 16 -123 -29 139 183 167
3577 167 -7 129 -18 -213 -24 -143 56 -9 100 -32 -152 94 -252 -198 -155 -178 282 -1 -198 -176 -201 275
3599 275 -150 -99 -53 -130 -32 -20 9 12 43 -66 -62 -94 -142 -17 -207 -69 131 -129 113 -138 125 -67 80 -72
3623 -72 -113 -123 -256 -68 -129 -154 -109 111 294 -59 -103 -146 -86 155 -12 148 -17 104 -87 -69 -218 -74 58
3646 58 129 55 30 103 50 26 -2 4 42 -53 -86 73 -180 -179 -274 195 104 -156 -49 -2 -77 -290 -40 -102 -31 62 -41
3673 -41 -39 89 -245 162 -199 139 -100 323 -4 45 46 -29 65 -103 98 -65 -20 -12 -81 -138 -179 -15 -44 -133 56
$$ packed form
3505a94Q1J68j50k16K26L5p1K66K08l92K5J22j17l0j8M4J40j93N5j76nO5J65j2
3529B6Oo3o8P7j0J38j12R3j76K8qK63j82k66M9R3j09L14k28R5j5j23J96l17O31
3554C32k80n0J10p3j11K09J1l40n7J63l9J09L30l32J14M5j77N2j39R4J68M4j6
3577A67j74J36j47j95J89j19J99o5J09j32j20K46l46N4M3k3M60k83j97K2k5M76
3599B75m25N1M6p7R8J2K9LL1j09Ml2m8J25j90J38K00k60K42k51K63j92J47j52
3623g2m1j0j33J88o1k5M5K20J83l53m4m3O0K41j67J60j65J21j91J8j49J44J32
3646E8P1p4k5P3n3k4k8OL8r5l3J59k53Jr5M69r1k60J07M7p5k13K50o2P1R3j03
3673d1KJ28l34M07l61L38k39M23l27M9Jp5R4j68K01j63M5Qo9n7m1J64k9q9J89
$$ plain form
3698 56 -292 -174 -1 11 -263 -221 -70 99 18 7 104 -88 22 83 -52 -115 -244 -151 -113 83 -102 -71 94 -260
3722 -260 -98 211 -84 -120 330 -95 -20 68 97 -82 -177 -254 92 84 -212 -113 -12 123 -111 80 155 78 86 -4 -5
3747 -5 -266 11 7 46 196 -151 58 -6 94 -297 40 86 15 14 -28 174 45 57 140 94 151 258 -28 11 117
3772 117 -167 -329 -262 -90 33 -142 142 -51 67 111 37 -51 198 -85 11 8 -67 -153 -74 210 146 86 118 36 158
3797 158 72 -58 -58 47 -203 -87 -308 -52 -68 258 17 -47 -29 -60 92 45 121 -33 -52 47 -295 -160 46 -197
3821 -197 83 -24 262 304 -33 -104 -35 -2 106 108 -102 -16 -331 -27 -8 -150 134 14 -112 240 80 3 130
3844 130 67 17 5 -32 -131 -154 -145 -99 -178 173 142 -1 121 78 -132 -37 -84 206 78 39 -87 -27 -207 -39 -1 -5
3870 -5 71 -187 -132 -21 60 94 -206 -240 60 -108 279 200 -138 143 10 217 -92 -54 74 -154 28 -71 42
$$ packed form
3698E6l48J18J73J2k74M2J51J69q1j1R7j92J10O1j35o3j29R3L8J96j85L1J65l54
3722b60J62L09k95l6M50m25P5Q8K9j79r5p7L46qk96R9J01J35k34J91P5p7Qr0j
3747ek61K77mL9J50l47K09o4J00l91L37M6p1jm2K02j29J2Q3m6N7J07k86L9J06
3772A17k84j62O7J72J23j75K84j93J18M4p4q8K49k83R6lp5q6P9K84o4o0L2q2J22
3797A58q6j30%J05k50J16k21K56j6L26k41o4J8l1J52m7P6j54j9R9l42J35K06k43
3821a97K80j07K86M2l37p1O9L3J08Kk10Q6l15L04J9j42K84j20j26L52j60p7J27
3844A30o3n0j2l7r9k3RM6p9L51l1j43J22m3k10R5m7K90j28l9j26O0j80J68L8m
3870eP6k58N5J11Q1L4l00l4L00j68L87p9l38K81j33K07l09L8J28k28J82r9J13
$$ plain form
3893 42 50 -79 -52 -67 253 -114 134 15 31 -120 -71 249 -51 137 8 182 -191 96 74 267 139 291 149
3916 149 136 -67 -114 8 -67 -104 122 -15 -2 9 250 -78 118 143 11 -179 -82 11 142 -185 -154 69 -31
3939 -31 225 -252 55 -55 -113 -230 -160 47 -252 -69 75 238 -100 -97 128 -104 211 -205 -7 -115 64 94
3961 94 129 151 -23 79 276 9 -68 -15 -45 -70 185 -30 111 -149 37 34 -126 89 -128 102 -34 20 234
3984 234 -93 -367 -52 -216 -17 -15 6 -107 15 -55 -47 -91 122 26 -161 239 -86 -218 52 96 -107 35 -71
4007 -71 -18 -35 194 111 2 -299 67 -43 235 -71 -209 -159 -193 -330 51 207 -159 7 -114 -136 115 194 73
4030 73 96 -92 -193 -220 -303 26 13 -75 151 -47 -58 174 59 -189 11 -122 -168 -52 6 -41 26 -13 -82 164
4054 164 -86 -62 -44 180 97 48 86 -5 -181 -77 -79 -46 167 308 88 199 -25 218 89 213 -117 -87 -191
$$ packed form
3893D2Qj29K7j5L20l67K48j19J6j51M9L20l00J88j29J74l73K87k2J93j28J52j42
3916A49j3k03m7J22p5l7K26j37J3J1K41l28J96K5j32j90R7R3J31l27L1K23j00
3939c1K56m77L07j10n8j17P0K07k99J83J44J63l38LK25k32L15m16J98j08J79L0
3961I4L5K2j74J02J97k67p7N3l0k5K55k15J41k60J86lj60K15k17K30j36N4K14
3984B34l27k74L15j64J99KK1j13J22p0Qm4K13r6j87M00l25j32K70M4k03J42j06
4007g1N3j7K29q3j09l01L66j10K78l06j38N0l4j37L81J56l66J66j21k2K51P9j21
4030G3K3j88j01k7q3L29j3q8K26j98j1K32j15k48K00j33m6J16N8m7O7l9o9K46
4054A64k50K4J8K24q3m9L8r1j76J04kL3K13J41k20J11k24K43j29J24l30L0j04
$$ plain form
4077 -191 240 -15 133 -133 116 -77 -84 138 32 -157 -101 -124 -180 -46 123 68 189 50 166 98 14 17 125
4100 125 59 -25 -250 59 166 8 -139 -28 119 -40 193 201 -88 43 40 350 -216 -153 87 -161 -250 7 131
4123 131 118 140 -214 -254 -20 173 -128 97 45 -45 134 -73 -34 208 259 73 80 40 -73 186 185 -6 1 -68 -13
4148 -13 -56 -119 -87 -270 232 -3 -77 75 -29 42 -2 8 -137 42 -138 -278 35 147 102 8 108 33 -115 -230
4172 -230 70 9 -148 -29 -45 65 59 -34 78 49 55 17 6 -157 2 224 74 -3 51 -145 -101 24 19 54 133 66
4198 66 -172 -119 -195 -229 -144 -116 -140 10 -62 -104 13 24 88 -5 66 -21 214 -205 122 -347 -32 30 -51 20 -230 4
4224 4 -53 -68 -137 -5 47 -73 32 -119 183 28 -32 -162 160 -110 128 224 -202 44 53 -230 -286 113 143 72
4248 72 -35 -61 303 17 19 -3 29 -44 -60 108 28 -5 84 -36 -26 -55 72 20 90 -143 -148 -32 -42 -106 -108 -361 -112
$$ packed form
4077a91M31k55J48k66K49j93pK22j06j89N6k3n6J34J69n5J21j39J16o8q4LJ08
4100A25o6q4k25L09J07j58j47J11J47j59K33Qk89J31lL10n66O3K40k48q9K57J24
4123A31j3K2l54m0K34J93l01K25n2r0J79k07L9K42N1j86Pm0j13K59jj91Po9N5
4148a3m3o3L2j83N02k35p4J52j04P1m4J0j45J79j80j40L13J12m5r4J00p5j48j15
4172b30L00o1j57J19j6J10or3J12k9Ol8j1j63J59K22j50p7N4j96M4J25nL5P9o7
4198F6k38N3p6l4Q5K8k4J50p2m2J17J1O4r3P1q7K35m19L27m69L15O2q1P1k50K34
4224Dn7j5o9J32N2j20J05j51L02j55o0j30L22k70K38R6m26K46Rk83n6L99L0p1
4248G2j07k6L64k86Kk2L2p3j6J68q0l3Q9j20J0k9J27n2P0k33nJ16j0o4kk53K49
$$ plain form
4275 -112 109 -117 36 19 275 117 -62 -230 -83 91 176 -50 -188 -68 -69 28 -27 -17 32 -3 -20 208 -30
4298 -30 219 121 -181 -27 54 -160 -59 75 -334 131 13 -59 -27 286 -176 -149 -258 177 -190 35 54 247
4320 247 20 45 -120 15 -15 75 189 -22 151 -174 -116 19 175 -207 185 -98 -78 -144 -2 60 138 -140 -132
4343 -132 -48 -42 -27 -60 96 129 38 112 -62 -113 245 -143 -18 159 -115 -36 153 7 -133 137 -3 -234 -2
4366 -2 104 97 -3 -83 40 -101 -47 1 10 -120 54 138 -10 48 -258 42 -26 115 116 -93 220 -16 28 57 253
4391 253 -67 11 58 -41 -242 200 -200 157 -113 139 88 28 -16 -13 -100 -54 241 168 41 165 -316 -70 -24 91
4415 91 9 58 44 -28 -217 -339 117 -35 -205 60 -29 -206 -152 -87 -117 -40 -208 114 -43 113 43 -53 -19 -335
4439 -335 22 -201 176 43 -37 99 91 151 142 51 40 364 197 194 -76 176 69 -18 -153 75 13 95 -120 59
$$ packed form
4275a12K21k26J53j7K56j58j79j68J47J74Q5k26j38J20jR7n5J0M9l5j7K28k38
4298c0K49r8l02J54Q1k14J01J34m09M65j18p2L2L13m62K7j09M35l67K25J9J93
4320B47k27K5j65J35l0R0J14k11J73l25N8J35J56l82L92k83K0o6J42O2P8k78Q
4343a32Q4OJ5l3J56L3r1P4j74n1L58l88J25J77k74P9J89j46j40K70j40k31K32
4366bJ06pj00q0J23j41N4M8Rj30J74Q4j48N8l06L00o8J41Jk09L13k36M4K9J96
4391B53l20P8M7r9k01M42m00L57k70K52n1o0m4Lq7M6K95p3j27J24m81K46M6J15
4415I1q2M9j4p2j89j22M56j52j70K65q9j77N4O5l0P7j68L22j57J56p0r6L4l16
4439c35L57k23L77j33q0J36qO0rr1j1L24j67lk70K52j07q7j35K28o2Q2k15J79
$$ plain form
4463 59 18 142 132 -150 28 -99 -4 -52 264 3 -149 -185 -84 -176 -235 -24 188 -26 -128 -197 110 96 172 -45
4487 -45 26 139 331 8 -30 94 36 93 223 89 116 44 85 -332 -38 194 60 0 36 -103 -188 -111 -96 45
4511 45 274 190 -44 159 179 -135 -60 237 62 70 76 314 248 -58 -10 196 86 83 -28 14 -51 -177 173 160 148
4536 148 -37 108 -36 -210 -1 120 -148 -205 -173 -237 -55 164 33 56 -48 1 47 116 2 183 -203 62
4558 62 -160 -93 -27 -267 -68 146 135 60 49 -260 97 146 -137 -212 18 114 256 67 -270 57 181 36 33 -240
4582 -240 147 -71 -77 207 -49 -86 215 0 319 -17 -116 -258 -55 22 -101 -47 -189 -78 -6 35 -147 60 -229
4605 -229 -156 136 141 79 -33 -206 109 -149 229 -86 80 20 37 139 46 -302 -214 91 -24 -177 -96 -116 238
4628 238 -2 23 -50 -23 27 144 -167 -131 36 -22 24 300 -174 114 -190 -58 34 -151 118 0 190 -68 -111
$$ packed form
4463E9m1J24j0k82J78j27R5m8L16k61j52l6J01r2n9K11K12k14j02o9L07j4P6k17
4487d5P1J13J92l23l8J24n8N7J30j34K7p2M1m17K94K32j34o0L6j39q5P7J5J41
4511D5K29q4k34K03K0l14P5K97j75QOK38o6l06M8K06j10lj11M2o5j26L50j3j2
4536A48j85J45j44j74K09J21k68n7L2o4J82K19j31K3j04M9M6O9j14J81l86K65
4558F2k22O7O6k40J99K14j1p5j1l09L57M9k83p5K30R6J42j89l37L27J24j45lk73
4582b40L87k18oK84k56l7L01k15L19l36r9j42K03P7j23N4j42J11P2M1j82K07k89
4605b29P3K92No2j12j73L15k58L78l15J66o0J7J02r3l48Q8L05j15j53Q1k0L54
4628B38k40K5p3K7N0J17l11L6J67n8M6K76m74K88l04J32R2j85K69j18J90k58m3
$$ plain form
4651 -111 138 -136 -17 8 -178 -92 -52 -151 167 200 248 125 230 144 67 -289 58 -159 -53 209 65 -97 109
4674 109 -7 -80 55 -70 150 -214 102 -121 99 -233 -93 -67 -76 -133 -247 121 84 173 79 20 -116 138 -156
4697 -156 103 140 119 68 -46 17 -148 123 22 -42 40 3 135 -101 73 86 -170 157 -69 3 131 276 -12
4720 -12 74 197 139 164 -66 127 35 141 51 3 39 -203 -60 281 228 -26 -149 212 -75 -274 -56 -16 -8 39
4744 39 -119 416 91 15 -5 28 -146 192 -194 35 250 -109 84 -8 55 243 -51 -154 60 -60 21 -30 31
4767 31 -24 -241 62 -53 43 95 -81 -52 -66 -229 -68 -67 -30 150 46 45 2 75 317 112 -72 -15 0 -6 86 -93
4793 -93 -114 164 -299 -51 7 -241 -361 0 5 -14 -46 67 -233 19 70 -79 40 72 -116 -27 -24 -167 240 213
4817 213 237 228 -53 -13 -65 78 142 285 -23 98 -191 31 -44 -241 108 89 202 70 -5 -59 82 17 -43 -36 53
$$ packed form
4651a11K49k74J19K5j86Q6M0r9L18L3M8j23J05q6p7l56L47k17J06K62j44j62K06
4674A09j16p3J35j25K20l64L16k23K20l32J40K6rn7j14L68l7Q9r4n9j36K54k94
4697a56K59L7k1n1j14O3j65K71j01o4Q2l7J32k36J74J3k56L27k26P2J28J45k88
4720a2Q6J23n8K5k30J93r2J06r0m8L6k42J43L41n3k54j23L61k87j99K18M0QM7
4744C9j58N35l25p6k0L3j74L38l86K29K15l59J93r2O3J88k94j03K14j20Q1n1O1
4767C1n5k17L03j15R6N2j76K9j4j63J61JL7J80j04jm3P3K42k05j84N7J5oR2j79
4793i3k1K78m63K48N8k48j20L61Nj9l2J13l00K52N1j49J19L2j88Q9Lj43M07k7
4817B13K4rk81M0n2J43O4J43l08J21k89K22p5j97L49j9J13j32p5n4J41o5o0PQ9
$$ plain form
4842 53 -21 -161 96 15 -184 -20 -216 66 27 -2 -105 36 -201 177 -25 -116 98 7 52 -118 27 253 -78
4865 -78 -22 -2 -110 34 -188 -4 -310 -9 -246 127 33 186 57 26 145 166 -104 -24 41 -149 -42 -47 62
4888 62 16 39 -104 101 -80 86 -141 -54 -183 121 -128 51 -9 246 135 -216 -77 15 380 -130 -231 -64
4910 -64 169 25 -167 162 358 -38 24 -61 -60 -235 74 79 91 56 41 24 -34 -14 -257 -63 -2 -34 -166 -225 -37
4935 -37 -8 4 -64 -75 -82 -106 -67 239 104 -172 87 212 127 -157 -9 -106 -35 -34 123 51 -190 -48 33 -224 107
4960 107 -24 24 -41 19 -33 -92 343 103 59 -76 21 38 -151 -211 -47 -32 -36 48 -58 -142 -115 -142 -74 39 -212 25
4986 25 -134 -135 -69 46 -256 -166 56 -82 216 123 59 55 -190 12 -120 141 151 -188 -291 191 181 2 -156 17
5010 17 172 -109 48 7 -110 -185 162 -35 -307 -19 -61 20 53 -73 -175 88 13 -81 150 -80 19 183 -254
$$ packed form
4842E3p4j40K57q1j99J64j96K82l9k9j03J41k37L78k02r1K14r1M5j70J45K26l31
4865g8N6K0j08J44k22J84l06L01k37L73r4J53j29l1J19K1k70Q0O5j90J07nJ09
4888F2m6K3j43K05j81J66k27Q7j29L04k49J79o0K55j11l51J39R2L65n10j01J67
4910f4K33j44j92L29J96l96O2q5Jj75L09NJ2l5j5j7n8K0k43J94O1l2j32n9J88
4935c7K9J2o8j1pk4L9L06j35k76K59J25q5k84J48r7P1JJ57p2k41J42Q1k57L31
4960A07j31M8o5O0n2n9M35k40m4j35R7J7j89o0J64J5mQ4j06q4K7k7O8J13k51K37
4986B5j59jO6J15l02R0K22j38K98r3o4mk45K02j32K61J0l39j03M82j0j79j58J73
5010A7J55k81J57m1j17p5L47j97k72K88m2Q1L3j26j02K63p5r4K31k30R9J64m37
$$ plain form
5033 -254 134 148 -7 -92 16 -27 103 -41 34 -66 -185 173 -2 13 -16 94 4 98 144 59 -174 295 180
5056 180 -98 -99 -23 146 98 9 92 103 147 -29 -9 78 -197 -108 -193 192 -93 134 -225 78 107 -203 -48 -257
5080 -257 38 192 98 -127 -30 -55 -108 -189 -10 -3 -35 99 -15 71 9 -70 -145 18 55 -77 -76 -111 -128 -232 -67 274
5106 274 159 -36 102 177 72 101 50 106 -154 -228 132 25 -66 160 -88 12 -46 73 -76 -33 167 -131 -133
5129 -133 -159 -53 -80 -213 -121 -84 100 184 235 -230 -114 -71 77 86 70 30 216 -136 -198 31 9 30 -37 -237 132
5154 132 -78 -70 -23 -103 -98 -247 294 -58 -6 57 13 116 -45 -41 -72 167 -221 -115 49 287 -8 95 246 -53
5178 -53 37 -276 87 -85 59 36 -2 305 199 -218 -58 73 -93 4 29 170 106 -20 -52 -91 -75 14 66 -19
5202 -19 -15 267 -79 71 -39 140 66 146 -122 98 -38 -140 9 20 -126 -105 -13 5 -410 55 163 73 9 -40
$$ packed form
5033b54L88J4j55q5J08m3J30j44P5j00j19L58j75J5k9J10r0R4M6q5k33M69j15
5056A80k78jP6J69m8q9Q3J1M4j76K0Q7k75Q9q5L85k85K27l59L03K9l10J55k09
5080b57K95J54r4k25R7k5n3q1J79Pl2J34j14Q6o2p9p5J63L7j32Jl5j7j04J65L41
5106B74j15j95J38P5j05K9n1N6k60p4L60j07r1K26k48J00n8J19j49M3K00k98k
5129a33k6J06k7j33R2L7J84Q4N1m65J16M3J48Rj6m0J86l52o2K29k2K1o7k00L69
5154A32k10QM7q0Nj49N41l52N2O3m4J03j61Ml1K39l88J06J64K38k95J03J51k99
5178e3R0l13L63j72J44k3l8L07j06m17J60J31j66R7K5J41o4j26l2l9J6Q9N2q5
5202a9MK82l46J50j10J79p4Q0k68K20j36j02J49J1j46K1R2J8m15M65J08r0o4m9
$$ plain form
5226 -40 83 45 58 -107 102 -204 50 -51 145 8 -10 125 -75 117 127 -103 43 -104 -11 117 -72 24
5248 24 -31 -69 300 294 52 -53 140 -6 95 -55 99 -95 -203 -136 -203 37 1 -66 99 -2 94 92 155 78 -138
5273 -138 21 120 70 138 21 -96 -35 68 135 122 -93 -210 190 -47 65 -49 -137 214 -72 70 93 285 226
5296 226 9 149 -136 -98 -68 -255 -213 47 166 67 94 27 100 -165 183 -83 -85 16 18 111 -114 -80 -67 -148 -14
5321 -14 150 34 97 110 54 42 33 105 246 86 17 85 89 75 47 -272 -1 -125 -322 198 133 -154 -69 -147 103 -236
5347 -236 -58 6 -121 221 -189 7 -323 120 154 -10 -29 230 108 104 60 -7 26 162 5 83 106 -4 273
5370 273 -59 119 39 5 -49 251 2 53 178 167 -97 200 -22 114 6 -106 -20 138 25 -85 84 290
5392 290 -295 88 -261 -174 1 182 -219 -75 40 195 48 -72 -33 81 125 136 11 -18 -22 118 169 239 61
$$ packed form
5226d0J23l8J3j65K09l06K54j01J96j37j8J35k00J92J0k30J46j47R3J28j89R6
5248B4n5l8L69ok42j05J93j46J01j50J54j94j08O7o7K40l6o7J65j01R6kO3p7k16
5273a38J59R9n0O8j17j17O1J03O7j3k15j17M00k37J12j14q8L51k86J42K3J92n9
5296B26k17J40k85L8L0j87M2K60J19r9K7o7P3k65L48k66kJ01KR3k25L4J3q1J34
5321a4J64j16O3J3n6j2rP2J41j60o9O8Mj4k8l19K71j24j97N20o5k87Q5p8K50l39
5347b36J78O4j27L42m10J96l30M43L4j64j9K59j22mm4o7L3J36j57P8K3j10K77
5370B73l32J78q0l4n4L00k49N1J25j1k64K97k22J36j08j12Q6J58j13j10J69K06
5392B90n85L83l49Q7J75J81m01J44J15J55j47j20L9J14M4J1j25k9mJ40N1P0j78
$$ plain form
5415 61 39 -18 -15 154 199 12 -41 29 216 8 6 123 240 -16 -181 270 174 -141 -104 35 19 -45 -114 141 -132
5440 -132 -81 5 -44 67 -13 329 -37 72 0 -257 -50 -7 88 119 -45 -15 -160 -21 135 -89 42 51 324 -184
5464 -184 329 -112 115 -217 -85 -33 -129 136 -109 120 59 253 -268 -108 67 10 134 -60 71 -74 159
5485 159 323 -52 36 37 61 107 -84 145 -199 20 45 -216 56 17 -154 -59 -235 58 -31 -57 -183 -133 -62 60
5509 60 -33 -6 118 -258 -47 -59 16 -165 -81 -11 13 -252 -100 -319 97 -130 -155 -163 100 -252 -21 137 -33 140
5533 140 157 -111 83 172 -117 -6 -180 -45 70 124 39 133 -42 283 166 57 -59 134 -55 158 7 -107
5555 -107 90 150 -203 -48 15 96 145 -8 -105 -189 -124 170 -55 36 -82 109 22 120 119 242 -14 -27 -17 -72 66
5580 66 -92 -181 13 146 -223 68 -147 6 95 -129 171 -284 -57 -72 -205 130 -55 70 199 107 63 -14
$$ packed form
5415F1k2n7LJ69M5j87n3P0J87k08kJ17J17k56j65M51r6l15L7J39j6o4o9K55k73
5440a32N1Q6m9J11q0L42l66J09p2k57K07M3R5L1j64L0j45J39J56k24J31RK73n08
5464a84N13m41K27l32J32N2r6K65k45K29o1J94n21J60J75n7J24j94J31j45K33
5485A59J64l75Q8JK4M6j91K29l44K19K5k61K72l9j71R5j76K93q9k6j26N0P1J22
5509F0r3K7J24l76K11j2P5j81Q4P0K4k65J52k19M16k27k5qK63l52K31J58j70J73
5533A40J7k68J94Q9k89J11j74J35J15N4q5R4j75L25j17j09j16J93j89K13j51j14
5555a07J97O0l53J55O3Q1M9j53r7q4O5K94k25R1j18J91q7R8jJ23k56j3J0n5J38
5580F6j58q9J94J33l69K91k15J53Q9k24L00m55K27j5j33L35j85J25J29r2m4p7
$$ plain form
5602 -14 -134 -62 -29 167 -89 137 98 -17 56 198 -114 -260 173 -237 71 -4 26 5 -154 84 -44 -137 96
5625 96 -178 52 57 64 16 -104 -178 155 -162 181 -220 -143 18 -28 -187 13 213 19 67 -162 -224 -42 21 48
5649 48 -125 55 -81 -79 -32 -117 76 262 -159 13 -271 216 47 138 2 39 87 62 -82 63 82 20 200 203
5673 203 184 47 54 -51 35 56 102 -5 75 65 59 2 139 -260 2 -61 -54 6 35 102 154 -176 -1 44 166 138 63
5700 63 -306 149 266 -66 23 20 -125 180 -2 -147 177 252 -50 -10 14 94 -62 109 190 92 -78 -68 48 98
5724 98 17 -230 -139 -165 -108 30 -132 -4 78 -74 -178 -106 174 87 -89 -17 -1 -83 -111 -166 49 33 -196 -97 122
5749 122 -69 -48 5 63 31 25 -88 -88 -103 -77 -57 -19 30 11 -36 3 -114 -98 79 -44 -14 18 -142 -53 -184 -85 209
5776 209 -86 -168 -1 131 -41 181 -67 -38 20 -103 184 98 -70 77 -225 200 -106 19 -113 -174 54 -90
$$ packed form
5602a4j20P2L3J96k56K26l9j15P3J42l12j46M33m10L08p5L0k1j59K38j28r3K33
5625I6k74K30NPm8j20p4L33l17L43m01P7J61m6j59K00K00j94M8k29o2J82O3K7
5649D8j73J80j36KM7q5J93J86m21J72k84M87j69R1j36L7M8k5j44J45J9o2J80L
5673B03j9j37Pj05Q6K1M6j07Q0j0on7J37l99K62o3PO0K9O7N2l30J75M5J22k8p5
5700F3l69M55J17l32Q9lj45L05j82j45L24P5l02M0K4Q0j56J71Q1r8j70J0J16N0
5724I8q1k47R1k6N7J38j62J28Q2j52j04P2K80q7j76P2J6q2k8n5K15j6k29R9K19
5749A22j91K1N3N8l2oj13%j5K6K0L8M9j9m7L9j17J6J77j23L0L2j60Q9j31R9K94
5776B09k95q2J67J32j72K22k48K9N8j23K87q6j68J47l02M25l06J25j32o1K28j44
$$ plain form
5798 -90 -9 -67 -24 98 231 -3 120 -66 173 205 -97 74 88 -199 120 209 -83 -104 15 -147 -182 -37 129
5821 129 -78 -43 22 127 -221 -100 -40 37 103 75 88 -205 -131 -188 -127 -68 6 17 62 324 333 -334 78 139 -65 101
5847 101 317 205 -162 22 -85 -208 4 -158 -29 147 -206 153 -44 -213 229 -135 76 -47 -69 -3 -196
5868 -196 11 0 90 98 -243 -290 -33 -61 126 -146 8 -63 -118 97 114 -126 -51 76 122 140 95 -116 52 25 46
5893 46 -84 16 -214 181 -7 -247 -195 -273 105 41 -178 177 138 141 -65 -262 -216 -40 -172 -123 63 -130 199
5916 199 183 -124 137 78 -239 -125 7 -11 -87 49 -11 12 147 -127 -154 -181 -17 204 92 -99 -57 -56 48 30
5940 30 130 87 86 74 -14 -21 -30 -35 0 -179 -113 -210 -9 41 -38 -44 -141 150 196 111 98 13 -51 -6 -88 131 438 182 -201
5969 -201 -75 43 -34 -149 52 277 256 91 -114 -21 -4 45 148 96 185 8 -189 76 -57 85 17 -22 -126
$$ packed form
5798i0Q1n8M3J22J33k34J23j86K39L2l02J71J4k87L19Q9k92k1J19j62l5J45J66
5821A29k07L5O5J05l48J21O0P7O6k8J3k93P4n7O1N9P4J1M5K62Ro67M12O1k04J66
5847A01K16j12l67J84j07j23K12j62J29J76l53L59j97j69M42l64K11j23k2O6j93
5868a96K07j1R0Ql41m7K57k8J87k72J54p1n5K15J7k40P5J27M6J8m5k11J68k7K1
5893D6j30J00k30L95j88k40N2p8L78o4k19L55l9Lk06j97M6J76j32M9J86j93L29
5916A99j6l07K61n9l17J14J32j8p6J36o0K3J35k74k7k7J64K21j12j91M2JJ04j8
5940C0J00m3jj2q8prnL5j79O6r7K01N0p9or7K91M6q5j3q5o4M5q2K19L07k56l83
5969b01J26J18p7j15K01K25k1j65k05R3J7M9J03n2Q9j77j97K65j33J42o8l9j04
$$ plain form
5992 -126 -18 -35 -29 -37 111 -261 -190 -506 319 -28 -109 34 -292 174 -336 -700 539 16 -167 178 -104 71
6014 71 -394 385 -60 79 -105 329 -24 -80 -16 -190 -85 -116 90 -188 19 141 46 -169 -38 86 -91 -37
6036 -37 -87 250 15 -115 -14 -24 35 -47 -237 120 -16 52 -154 -225 -152 -27 -229 -107 31 -46 -5 -62 -143 -7
6060 -7 -29 36 86 126 -139 166 -229 114 49 -75 18 -148 81 -63 150 -13 128 -22 -15 66 -81 49 149 -5
$$ packed form
5992a26J08j7OqJ48l72P1l16Q25l47q1J43l26M66n10l64J239n23j83L45k82J75
6014G1m65P79m45J39j84M34l53n6O4j74J05l1K06k78K07J22r5k15J31J24j77N4
6036c7n0L37k35j30J01j0N9q2j90L57j36O8k06p1P3J25k02J22J38p7M1n7q1J36
6060gk2O5N0M0k65L05l95L43o5j24R3j66K29j44K13j63J41j50PQ1j47J30J00j54
$$ [...]
8191C3
##END NTUPLES=NMR FID
##END=
