##TITLE=1H_Ser DHN-N-OK-2
 DMSO-d6
 8 sc, 
 12.2.2024
##JCAMPDX= 6.0         $$ Bruker NMR JCAMP-DX V2.0
##DATA TYPE= NMR FID
##DATA CLASS= NTUPLES
##ORIGIN= UXNMR, Bruker Analytische Messtechnik GmbH
##OWNER= root
$$ XWIN-NMR		Version 3.5
$$ Mon Feb 12 14:38:03 2024 Russian Standard Time (UT+4h)  she@DPX200
##.OBSERVE FREQUENCY= 200.1313
##.OBSERVE NUCLEUS= ^1H
##.DELAY= (6, 6)
##.ACQUISITION MODE= SIMULTANEOUS
##.ACQUISITION SCHEME= undefined
##.AVERAGES= 8
##.DIGITISER RES= 18
##SPECTROMETER/DATA SYSTEM= spect
##.PULSE SEQUENCE= zg30
##.SOLVENT NAME= DMSO
##.SHIFT REFERENCE= (INTERNAL, DMSO, 0, 15.7039)
##AUDIT TRAIL= $$ (NUMBER, WHEN, WHO, WHERE, WHAT)
$$ ##TITLE= Audit trail, XWIN-NMR		Version 3.5
$$ ##JCAMPDX= 5.01
$$ ##ORIGIN= Bruker BioSpin GmbH
$$ ##OWNER= she
$$ F:/spectra/data/she/nmr/H-F/1/audita.txt
$$ ##AUDIT TRAIL=  $$ (NUMBER, WHEN, WHO, WHERE, WHAT)
(   1,<2024-02-12 14:36:27.45 +0400>,<she>,<DPX200>,
      <created by zg, POWCHK disabled, PULCHK disabled
       configuration hash MD5:
       00 E9 B6 7A A2 85 ED C7 34 08 36 98 17 FE 4E 26
       data hash MD5: 16K
       F7 91 11 C5 8A 1B 19 42 ED 35 61 1E CE 5D 61 F0>)
$$ ##END=
$$ 
$$ hash MD5
$$ A2 3E C2 87 66 CD E0 F3 84 1D 4D 75 12 52 00 BC
##$RELAX= 
##$RELAX= 
##$RELAX= 
##$RELAX= 
##$RELAX= 
##$RELAX= 
$$ Bruker specific parameters
$$ --------------------------
##$DU= <F:/spectra>
##$EXPNO= 1
##$NAME= <H-F>
##$PROCNO= 1
##$TYPE= <nmr>
##$USER= <she>
##$AMP= (0..31)
100 100 100 100 100 100 100 100 100 100 100 100 100 100 100 100 100 100 
100 100 100 100 100 100 100 100 100 100 100 100 100 100 
##$AQSEQ= 0
##$AQ_mod= 1
##$AUNM= <au_zg>
##$AUTOPOS= <>
##$BF1= 200.13
##$BF2= 200.13
##$BF3= 200.13
##$BF4= 200.13
##$BF5= 200.13
##$BF6= 200.13
##$BF7= 200.13
##$BF8= 200.13
##$BYTORDA= 1
##$CFDGTYP= 0
##$CFRGTYP= 5
##$CHEMSTR= <none>
##$CNST= (0..31)
1 1 145 1 1 1 1 1 1 1 1 1 1 1 1 1 1 1 1 1 1 1 1 1 1 1 1 1 1 1 1 1 
##$CPDPRG= <>
##$CPDPRG1= <>
##$CPDPRG2= <>
##$CPDPRG3= <>
##$CPDPRG4= <mlev>
##$CPDPRG5= <mlev>
##$CPDPRG6= <mlev>
##$CPDPRG7= <mlev>
##$CPDPRG8= <mlev>
##$CPDPRGB= <>
##$CPDPRGT= <>
##$D= (0..31)
0 1.2 0 0 0 0 0 0 0 0.06 0 0.03 0 0 0 0 0.0002 0 0 0 0 0 0 0 0 0 0 0 0 
0 0 0 
##$DATE= 1707734186
##$DBL= (0..7)
120 120 120 120 120 120 120 120 
##$DBP= (0..7)
150 150 150 150 150 150 150 150 
##$DBP07= 0
##$DBPNAM0= <>
##$DBPNAM1= <>
##$DBPNAM2= <>
##$DBPNAM3= <>
##$DBPNAM4= <>
##$DBPNAM5= <>
##$DBPNAM6= <>
##$DBPNAM7= <>
##$DBPOAL= (0..7)
0.5 0.5 0.5 0.5 0.5 0.5 0.5 0.5 
##$DBPOFFS= (0..7)
0 0 0 0 0 0 0 0 
##$DE= 6
##$DECBNUC= <off>
##$DECIM= 32
##$DECNUC= <off>
##$DECSTAT= 4
##$DIGMOD= 1
##$DIGTYP= 9
##$DL= (0..7)
0 120 120 120 120 120 120 120 
##$DP= (0..7)
150 150 150 150 150 150 150 150 
##$DP07= 0
##$DPNAME0= <>
##$DPNAME1= <>
##$DPNAME2= <>
##$DPNAME3= <>
##$DPNAME4= <>
##$DPNAME5= <>
##$DPNAME6= <>
##$DPNAME7= <>
##$DPOAL= (0..7)
0.5 0.5 0.5 0.5 0.5 0.5 0.5 0.5 
##$DPOFFS= (0..7)
0 0 0 0 0 0 0 0 
##$DQDMODE= 0
##$DR= 18
##$DS= 0
##$DSLIST= <SSSSSSSSSSSSSSS>
$$ [...]
##$SUBNAM2= <"">
##$SUBNAM3= <"">
##$SUBNAM4= <"">
##$SUBNAM5= <"">
##$SUBNAM6= <"">
##$SUBNAM7= <"">
##$SUBNAM8= <"">
##$SUBNAM9= <"">
##$SW= 18.0517328524113
##$SWIBOX= (0..15)
0 0 2 0 0 0 0 0 0 0 0 0 0 0 0 0 
##$SW_h= 3612.71676300578
##$TD= 16384
##$TD0= 1
##$TE= 0
##$TE2= 300
##$TE3= 300
##$TEG= 300
##$TL= (0..7)
0 120 120 120 120 120 120 120 
##$TP= (0..7)
150 150 150 150 150 150 150 150 
##$TP07= 0
##$TPNAME0= <>
##$TPNAME1= <>
##$TPNAME2= <>
##$TPNAME3= <>
##$TPNAME4= <>
##$TPNAME5= <>
##$TPNAME6= <>
##$TPNAME7= <>
##$TPOAL= (0..7)
0.5 0.5 0.5 0.5 0.5 0.5 0.5 0.5 
##$TPOFFS= (0..7)
0 0 0 0 0 0 0 0 
##$TUNHIN= 0
##$TUNHOUT= 0
##$TUNXOUT= 0
##$USERA1= <user>
##$USERA2= <user>
##$USERA3= <user>
##$USERA4= <user>
##$USERA5= <user>
##$V9= 5
##$VALIST= <valist>
##$VCLIST= <CCCCCCCCCCCCCCC>
##$VD= 0
##$VDLIST= <DDDDDDDDDDDDDDD>
##$VPLIST= <PPPPPPPPPPPPPPP>
##$VTLIST= <TTTTTTTTTTTTTTT>
##$WBST= 1024
##$WBSW= 4
##$XGAIN= (0..3)
0 0 0 0 
##$XL= 0
##$YL= 0
##$YMAX_a= 160680
##$YMIN_a= -218357
##$ZGOPTNS= <>
##$ZL1= 120
##$ZL2= 120
##$ZL3= 120
##$ZL4= 120
##$ABSF1= 10
##$ABSF2= 0
##$ABSG= 5
##$ABSL= 3
##$ALPHA= 0
##$AQORDER= 0
##$ASSFAC= 0
##$ASSFACI= 0
##$ASSFACX= 0
##$ASSWID= 0
##$AUNMP= <proc_1d>
##$AZFE= 0.1
##$AZFW= 0.1
##$BCFW= 1
##$BC_mod= 2
##$BYTORDP= 1
##$COROFFS= 0
##$CY= 11.3945322036743
##$DATMOD= 1
##$DC= 2
##$DFILT= <>
##$DTYPP= 0
##$F1P= 15.7292609196834
##$F2P= 12.9074282941183
##$FCOR= 0.5
##$FTSIZE= 0
##$FT_mod= 4
##$GAMMA= 1
##$GB= 0.15
##$INTBC= 1
##$INTSCL= 1
##$ISEN= 128
##$LB= 0.24
##$LEV0= 0
##$LPBIN= 0
##$MAXI= 10000
##$MC2= 0
##$MEAN= 0
##$ME_mod= 0
##$MI= 1.114404
##$NCOEF= 0
##$NC_proc= 0
##$NLEV= 6
##$NOISF1= 3.799351
##$NOISF2= 2.8
##$NSP= 1
##$NTH_PI= 0
##$NZP= 0
##$OFFSET= 15.70392
##$PC= 1
##$PHC0= -24941.12
##$PHC1= -1.347304
##$PH_mod= 1
##$PKNL= yes
##$PPARMOD= 0
##$PSCAL= 0
##$PSIGN= 0
##$REVERSE= no
##$SF= 200.130013532006
##$SI= 16384
##$SIGF1= 3
##$SIGF2= 2
##$SINO= 400
##$SIOLD= 16384
##$SREGLST= <1H.CDCl3>
##$SSB= 0
##$STSI= 0
##$STSR= 0
##$SW_p= 3612.71676300578
##$SYMM= 0
##$S_DEV= 0
##$TDeff= 0
##$TDoff= 0
##$TI= <>
##$TILT= no
##$TM1= 0
##$TM2= 0
##$TOPLEV= 0
##$USERP1= <user>
##$USERP2= <user>
##$USERP3= <user>
##$USERP4= <user>
##$USERP5= <user>
##$WDW= 1
##$XDIM= 8192
##$YMAX_p= 0
##$YMIN_p= 0
$$ End of Bruker specific parameters
$$ ---------------------------------
##NTUPLES= NMR FID
##VAR_NAME=  TIME,          FID/REAL,        FID/IMAG
##SYMBOL=    X,             R,               I
##VAR_TYPE=  INDEPENDENT,   DEPENDENT,       DEPENDENT
##VAR_FORM=  AFFN,          ASDF,            ASDF
##VAR_DIM=   8192,          8192,            8192
##UNITS=     SECONDS,       ARBITRARY UNITS, ARBITRARY UNITS
##FACTOR=    0.0002768,     1,               1
##FIRST=     0,             0,               0
##LAST=      2.2672688,     0,               0
##MIN=       0,             -218357,         0
##MAX=       2.2672688,     160680,          0
$$ Real data points
##PAGE= N=1
##DATA TABLE= (X++(R..R)), XYDATA
$$ [...]
1861D76L48jl17J67p95r4j08o37J72J7J57K20N07K28L34M06n08L7n37m54J23r32
$$ 476 824 823 506 673 -122 -216 -324 -961 -789 -772 -615 -395 112 340 674 1080 572 609 72 -382 -259 -1191
1883a191L43J48M6N51L97K06L17O6p2k25n30l58j46j65p1j32J08O11J08J23N78
$$ -1191 -848 -700 -654 -103 294 500 817 883 811 586 56 -302 -448 -613 -684 -816 -708 -97 11 134 712
1904G12L15o3k08p06J16k86m91l19J45K41J13K58L19L14K76j08j65o7r5l74l49
$$ 712 1027 964 756 50 166 -120 -611 -930 -785 -544 -431 -173 146 460 736 628 463 396 301 -73 -422
1925d22k9l49N38L1lK27L58J57p2j84j59K16o32J5j3K4L5K12j80N44J98j76K45
$$ -422 -451 -800 -262 -231 -234 -7 351 508 436 252 93 309 -323 -308 -321 -297 -262 -50 -230 314 512 336 581
1948E81j66n4l26l37k99j20r9K17J06M94N14O7J47j44j07J12j99n51k35k56k00
$$ 581 415 361 35 -302 -601 -721 -820 -603 -497 -3 511 578 725 581 474 586 387 -164 -399 -655 -855
1969h55K97J7J84N20k12P97ok3R9m44j36n31k99N4J7j86N05j62N28N64l15L8j8
$$ -855 -558 -541 -357 163 -49 748 742 719 818 374 238 -293 -592 -538 -521 -707 -202 -364 164 728 413 451 433
1992D33l62J26k79n35K57j37j69L17N75KL04j74K59l24J20k84o15M1m7K8j58L16
$$ 433 71 197 -82 -617 -360 -497 -666 -349 226 228 532 358 617 293 413 129 -486 -445 -492 -464 -622 -306
2014c06M2M69k6J53m0M99k68k9o70r9r8j27j07K04J42L44k4K60K39l59Q5L1m24
$$ -306 -264 205 179 332 292 791 523 494 -176 -275 -373 -500 -607 -403 -261 83 59 319 558 199 284 315 -109
2037a09K75l49k81L48j48j95M98J20j31O44r26K20j8K6p1k28j08M02o8L08Q4j31
$$ -109 166 -183 -464 -116 -264 -459 39 159 28 672 -254 -34 -52 -26 -97 -325 -433 -31 -99 209 293 162
2059A62L60j78j36J71j24l24k93l95Q1L5J42M56J07J18L90L86j80l55k24l32J53
$$ 162 522 344 208 379 255 -69 -362 -757 -676 -641 -499 -43 64 182 572 958 778 423 199 -133 20
2080B0p35J10J2k7K43K99K36M84J0j17r6k72J7l44j14j92m2k36N94J61j50L28
$$ 20 -715 -605 -593 -620 -377 -78 158 642 652 535 439 167 184 -160 -274 -466 -508 -744 -150 11 -139 189
2102A89K10o6j1MJ53o62p2J3l32M5K66j03L44N81ok85K45l03p2j50l21J32n81
$$ 189 399 333 322 326 479 -183 -255 -242 -574 -529 -263 -366 -22 559 553 268 513 210 138 -12 -333 -201 -782
2125g82L55Q7j01J83M45J45K84j23j9k5j12k94k99k58J97p9L9L90P5K41K33K9
$$ -782 -427 -340 -441 -258 187 332 616 493 474 449 337 43 -256 -514 -317 -396 -357 33 108 349 582 611
2147F11r0j65j93Q1k95k66j33J51oQ1K01K17K07J35k20J34K2l62k77j5k15j78
$$ 611 521 356 163 244 -51 -317 -450 -299 -305 -224 -23 194 401 536 316 450 472 110 -167 -182 -397 -575
2169e75N21j48J55K30P5K10o7m86J76N3k03o51K13lj65L96J22L80L96m3l3j81
$$ -575 -54 -202 -47 183 258 468 401 -85 91 144 -59 -710 -497 -500 -665 -269 -147 233 629 586 553 372
2191C72J10l60m33j96J50j72k1M60N3J37J9J07J66J4j54q8k30j10j28JL6j94K68
$$ 372 482 122 -311 -507 -357 -529 -550 -90 -37 100 119 226 392 406 252 164 -66 -176 -304 -303 -267 -461 -193
2214a93J72L05J66Kj66J80m30j54P7j46k76j57rK70N14J46N2k3M7J11j86K0n57
$$ -193 -21 284 450 452 286 466 36 -118 -41 -187 -463 -620 -629 -359 155 301 353 330 377 488 302 322 -235
2237b35j61M6o7k03J86K22K61M15l18L54K45k51r7l97L6l71k43p3L16k83N42r0
$$ -235 -396 -350 -417 -620 -434 -212 49 464 146 500 745 494 397 0 36 -335 -578 -651 -335 -618 -76 -166
2259a66M15J21J76m77M63l03l95qj9j67R5k38L41K41J40K88l79j06N2j47K0Q7
$$ -166 249 370 546 69 532 229 -166 -174 -193 -360 -265 -503 -162 79 219 507 128 22 74 -73 -53 34
2281C4q7J24j40j70k6L44j12M06k13j27J13k49J29m36J50M0r4O0L37j41J93L86
$$ 34 -53 71 -69 -239 -265 79 -33 373 160 33 146 -103 26 -410 -260 -220 -314 -254 83 -58 135 521
2303E21k21N8J09n91K55l93j46K68j88M6PJ21K55J01j96J13L9n0j19n8J40j76
$$ 521 300 358 467 -124 131 -262 -408 -140 -328 -282 -275 -154 101 202 6 119 158 108 -11 -69 71 -105
2325a05j48R4j85L61K05J93m32L57n14N33k35j01j10k47O6J53Q5j24K39K34Mk87
$$ -105 -253 -159 -344 17 222 415 -17 340 -174 359 124 23 -87 -334 -268 -115 -30 -154 85 319 323 36
2347C6K31j13Rj47k85k81L7J47L2J79J28J37J65O1j07n6k8j55J28k84k34k4J01
$$ 36 267 154 163 16 -269 -550 -513 -366 -334 -155 -27 110 275 336 229 173 145 -10 118 -166 -400 -424 -323
2370c23K42k1J03L50j64R5l19J79j89K1k49P7M8j82L21P2k06j77M17j28K43l82
$$ -323 -81 -102 1 351 187 282 -37 142 -47 -26 -275 -198 -150 -332 -11 61 -145 -322 95 -33 210 -172
2392a72M68k47j50J97l01r4L89K9j84Q2J84p0j53K24r8j55J7n4j38ML9R0K09M2
$$ -172 296 49 -101 96 -205 -299 90 119 -65 17 201 131 -22 202 104 -51 -34 -88 -226 -222 -183 -93 116 158
2416A58m7oJ1J05L0n56J03K73m28L96k57oJ22K34J32j59j92K12j87R5L4j2j57
$$ 158 111 105 116 221 251 -305 -202 71 -357 39 -218 -224 -102 132 264 105 -87 125 -62 33 67 55 -102
2439a02k04J87r6K78R5M2j99N2j87k3L58m43LN8j59L80J31j51J01K10j39j04J92
$$ -102 -306 -119 -215 63 158 200 1 53 -134 -157 201 -242 -239 -181 -340 40 171 20 121 331 192 88 280
2462B80n00J50K8j55LN7o8R0l1L20N3p7j5j00P8j63J19j63j04o0N3K0J24R3K50
$$ 280 -220 -70 -42 -197 -194 -137 -205 -115 -146 174 227 150 135 35 113 -50 69 -94 -198 -258 -205 -185 -61 32 282
2487B82k88K43r4j11j70J95l47K63j77M9R4m4J38N0j13K30j54n5L4J71k10k14
$$ 282 -6 237 143 32 -138 57 -290 -27 -204 -155 -61 -105 33 83 -30 200 46 -9 25 196 -14 -228
2509b28N8J14R0K5j60M1J47L51k02rj71j0r0m7l32Q2K68j09K17p5L05o3p3J69
$$ -228 -170 -56 34 59 -101 -60 87 438 236 227 56 46 -44 -91 -423 -341 -73 -182 35 -40 265 202 129 298
2533B98k40j42J27l47K4L40n59L03L86k27N3K48k33J24N4j06R2k41o4o1q6r9M54
$$ 298 58 -84 43 -304 -280 60 -499 -196 190 -37 16 264 31 155 209 103 195 -46 -110 -171 -257 -356 98
2556I8k31K76K91m58l2P4j46J01l66K87q5O0K00j27P7J06K23j40J48l57m6J02
$$ 98 -133 143 434 -24 -56 18 -128 -27 -393 -106 -191 -131 69 -58 19 125 348 208 356 -1 -47 55
2578E5j83M7j11KJ04P8q6L85j64K26j18j2p6J77l21j41j60J63j27J3K30J35k76
$$ 55 -128 -81 -192 -190 -86 -8 -94 291 127 353 235 223 147 324 3 -138 -298 -135 -262 -249 -19 116 -160
2601a60K90K98j21k33K9K8m23K62j04n3j5J4N9K07K8l3p7J53k83J60o6o3J70l12
$$ -160 130 428 307 74 103 131 -292 -30 -134 -187 -202 -188 -129 78 106 73 -4 149 -134 26 -40 -103 67 -245
2625b45J68N4p5L12k2k40kN1j55P8Q7J15o2j46j96J80j01K31J67l4J86q9o7k2
$$ -245 -77 -23 -98 214 192 -48 -50 1 -154 -76 11 126 64 -82 -278 -98 -199 32 199 165 351 262 195 173
2649A73k93Q3n7K38l31Q8j85J85M2j56J26J94j81kO8j53K44k06K98n31K51J80
$$ 173 -120 -37 -94 144 -187 -99 -284 -99 -57 -213 -87 107 -74 -76 -8 -161 83 -123 175 -356 -105 75
2671G5j05M9Kk48J96m7m1J36l87M20pr8j05J87qPP9J53j51j54j41L69l37M2k2
$$ 75 -30 19 21 -227 -31 -78 -119 17 -370 50 43 -55 -160 27 19 26 105 258 107 -47 -188 181 -156 -114 -136
2696a36k83K79P1J24RM39m61o2O2R5l50M43l38L60m60K10j76Q3J56l1J34j7k40
$$ -136 -419 -140 -69 55 64 503 42 -20 42 137 -213 230 -108 252 -208 2 -174 -91 65 34 168 151 -89
2719h9L35k04k08K02O6k00N7J3m3P0k60K32M17k76m4m5l86K79J68K5j77j90K00
$$ -89 246 42 -166 36 102 -98 -41 -28 -71 -1 -261 -29 388 112 68 23 -363 -84 84 109 -68 -258 -58
2742e8J40k8j31J73J07k22Rk16L26k98j48K27q7K84O2K0l0J74k72q7J34QPk95
$$ -58 82 54 -77 96 203 -19 -10 -226 100 -198 -346 -119 -206 78 140 160 130 304 32 -55 79 87 94 -201
2766b01J35J36O0n4j71L8m0J76k58R2O8M9J8j49J61j89K27m1l29M60n6k39K61
$$ -201 -66 70 130 76 -95 -57 -97 79 -179 -87 -19 30 48 -101 60 -129 98 57 -272 188 132 -107 154
2789A54k91K2k12M11j92O4K0K04n2j76J43J1j49K95m61L05N1k77J03n7k27K53
$$ 154 -137 -115 -327 84 -108 -44 -24 180 128 -48 95 106 -43 252 -209 96 147 -130 -27 -84 -311 -58
2811e8k14J88N2j0O5LK37lk70j06K07k5l9N0P3r8K04l19J59j80J94p6O4o9p6j33
$$ -58 -272 -84 -32 -42 23 26 263 260 -10 -116 91 66 27 77 150 52 256 -63 96 -84 110 34 98 29 -47 -180
2837a80Q6J99p0k14L41j94J43k06N0L7j9l1O7q6K50k07j91L30L4j52R7J91l07
$$ -180 -94 105 35 -179 162 -32 111 -95 -45 -8 -27 -58 9 -77 173 -34 -225 105 139 -13 84 275 -32
2860c2N1o2j54o7J26OK46l32R8L86m01R8J29Mj59Q7N6n6k15L24j54J5n6r2J15
$$ -32 19 -43 -197 -264 -138 -132 114 -218 -120 266 -135 -37 92 96 -63 24 80 24 -191 133 -21 -6 -62 -154 -39
2885c9J47j39K94j34r2J16j62L1M7o7K93j81j84L00o1j49l3Q0r2J82j83m4mJ1
$$ -39 108 -31 263 129 37 153 -9 22 69 2 295 114 -70 230 169 20 -13 67 -25 157 -26 -70 -74 -63
2909f3P5Q6j57P8j5O2Q8%k6j80j68J52M0l5q6J87p7J70j19p2P1N0q5K4l64K81
$$ -63 12 98 -59 19 4 66 154 154 128 -52 -220 -68 -28 -63 -149 38 -39 131 12 -60 11 61 -24 0 -364 -83
2935h3J92k15j73J80o2K13l8K65l23K33j17r4K71k76j3N9j57M4J7k45M21j40J67
$$ -83 109 -106 -279 -99 -161 52 14 279 -44 189 72 -22 249 -27 -40 19 -138 -94 -77 -322 99 -41 126
2958A26l87M56qo8k26R3K65o90L07J65jj38K11R5l03K09m3m4L2k21q9J22j1J31
$$ 126 -261 195 187 119 -107 -14 251 -439 -132 33 32 -106 105 200 -103 106 63 19 51 -170 -259 -137 -148 -17
2982a7J85j77M8k27M13p4r8k6l7N1k27O3j41K34j96K89p2J29j31P8j67J70p7p1
$$ -17 168 -9 39 -188 225 151 53 27 -10 41 -186 -123 -264 -30 -226 63 -9 120 -11 67 -100 70 -7 -78
3006g8MN3K90l94O8J23M7j05P8l4k2pj35J28M1j52J32k11J85J00k59L63j56J53
$$ -78 -74 -21 269 -125 -57 66 113 8 86 52 30 23 -112 16 57 -95 37 -174 11 111 -148 215 59 212
3030B12j10k41P8O7m6o0K18l91J47j96M51j66K47k35mL79j80M4l15J16k9J32P9
$$ 212 102 -139 -61 6 -40 -100 118 -273 -126 -322 129 -37 210 -25 -29 350 170 214 -101 15 -14 118 197
3053A97p6l05K81r4P4j37J07j81M25j96J36k85j23K87r1l8n3M21n3j34o5Q6rk21
$$ 197 121 -184 97 3 77 -60 47 -134 291 95 231 -54 -177 110 19 -19 -72 349 296 162 97 183 174 -47
3077d7J02j38J26k93K92Q7k08nK03K8P7l53P7P4J29p9oN8k24k31L46P7j56l1P5
$$ -47 55 -83 43 -250 42 129 -79 -84 119 147 224 -129 -52 22 151 72 66 124 -100 -331 15 92 -64 -95 -20
3102b0Q5o9O3j09K38n0j19O1j64J25j51o8K30k4k5%K75l54k2l0M4r9J69j66K3
$$ -20 65 -4 59 -50 188 138 19 80 -84 41 -110 -178 52 28 3 3 278 -76 -98 -128 -84 -183 -14 -180 -157
3127a57K94k32K1K54j75M4j3k84L76l49K40J32qk81K07P4N1K8m9J12m42p9L26
$$ -157 137 -95 -74 180 5 49 36 -248 128 -221 19 151 143 -138 69 143 194 222 173 285 -157 -236 90
3150I0O3k57K08k70K30o8k8o9J14pM15k62m39L21k03J18j25J97j34K54M0l67J38
$$ 90 153 -104 104 -166 64 -4 -32 -101 13 6 421 159 -280 41 -162 -44 -169 28 -106 148 188 -179 -41
3173d1J02O5l04L71k73K58j48j7P4L0Mj25R8J2P0P6Q8j74k77O4j94O8p0M4J53
$$ -41 61 126 -178 193 -80 178 30 13 87 117 121 -4 94 106 176 252 340 166 -111 -47 -241 -173 -243 -199 -46
3198d6N0pP5l5j03J99p7J59j86j99J91N8L3r0j77J51o8J45n5n7K7J54j54j80J94
$$ -46 4 -3 72 37 -66 133 56 215 29 -170 21 79 112 22 -155 -4 -72 73 18 -39 -12 142 -12 -192 2
3223BP0K55l97J5q5J05L5K60m61L2K41k34K69L2k98R8K02m4q1J60o3j44P0j21
$$ 2 72 327 -70 -55 -140 -35 0 260 -201 -169 72 -162 107 139 -159 -61 141 97 16 176 113 -31 39 -82
3247h2J48k17M5J77k26P6l21N04k65K94%R5k54l07K59J16%j42n6j41J38K65j0
$$ -82 66 -151 -106 71 -155 -79 -400 104 -161 133 133 228 -26 -333 -74 42 42 -100 -156 -297 -159 106 96
3270I6n1K8Jj63k2q4mL32l67J21L02l07J62jl0l22L66j1p4N2j13J18J11j03%K0
$$ 96 45 73 74 -89 -111 -195 -199 133 -234 -113 189 -118 44 43 13 -309 57 46 -28 24 -89 29 140 37 37 57
3296E7k34K69K52j01j94J4j55q2R8p1k10L11rM8P0j32L32k09J07L4r8o0Rj15n9
$$ 57 -177 92 344 243 49 63 -92 -174 -76 -147 -357 -46 -55 -7 63 -69 263 54 161 195 97 37 46 -69 -128
3321a28J95j23O5j19J92k63K5p8K05J79j58OJ06k2L9L6k34J20j61Q7k3K10j62
$$ -128 67 -56 9 -110 82 -181 -156 -234 -29 150 -8 -2 104 82 121 157 -77 43 -118 -31 -54 156 -6
3344fk3P3k25M36m23R6J8J05j54KL27j57l9P8j13n3N3p9M1K2R7k6q6j01M76j73
$$ -6 -29 44 -181 255 -168 -72 -54 51 -103 -101 226 69 30 108 -5 -58 -5 -84 -43 -21 76 50 -36 -137 339 166
3370A66qj18j41K43j53J63J4l11L05l74L77l32J56J6m4L16l70o6K44k27J73n7
$$ 166 158 40 -101 142 -11 152 166 -145 160 -214 163 -169 -13 3 -41 275 -95 -161 83 -144 29 -28
3392b8K3J28j13N8k41J68o0n3k4N2j3M6O0k5k65L29lR3K49k75N0p2j14o2L81j77
$$ -28 -5 123 10 68 -173 -5 -65 -118 -142 -90 -103 -57 3 -22 -287 42 39 132 381 106 156 84 -30 -92 289 112
3418A12q6p1n6K27k95j94L40P3J59ql22J43j25K5J0j05J81J88j74r5j77L11j59
$$ 112 26 -45 -101 126 -169 -363 -23 50 209 201 -121 22 -103 -78 -68 -173 8 196 22 -73 -250 61 -98
3441i8J10J76k87n9K46L4l03L77k97J07R8k57J92J47k88O3P4q3J70l03l5mL54
$$ -98 12 188 -99 -158 88 122 -181 196 -101 6 104 -153 39 186 -102 -39 35 -48 122 -181 -216 -220 134
3464A34k86K23j25q3J92q6J92r0o1mj64L6J37j2k69M85k45Qp9R8k12L71l17K77
$$ 134 -152 71 -54 -137 55 -31 161 71 10 6 -158 -122 15 3 -266 219 -26 -18 -97 1 -211 160 -157 120
3488A20K01m57N6J07K21q5Mk80k09R9N8K88p6O1r9k17Q5RL0K65j49J64l07J65
$$ 120 321 -136 -80 27 248 163 167 -113 -322 -223 -165 123 47 108 9 -208 -123 -114 -84 181 32 196 -111 54
3512E4k04K0J29j56Q3K25l88K09j6P9r0o7K14J4j1j00K22K7l84j39L63j52J52
$$ 54 -150 -130 -1 -157 -74 151 -237 -28 -44 35 -55 -122 92 106 95 -5 217 244 -140 -279 84 -68 84
3535H4J05j06q2J64j31p6R1L3l07R3J1J95k77L59k14m7P8M52m65oo4J97k64K45
$$ 84 189 83 1 165 34 -42 49 82 -225 -132 -121 74 -203 156 -58 -105 -27 425 -40 -46 -110 87 -177 68
3559F8k67K01jJ20J53j63l7K0j39m1R5J5M3r8J72j49q7K01L1k21J04J52k92K86
$$ 68 -199 2 1 121 274 111 74 94 -45 -86 9 24 67 -31 141 -8 -95 106 137 -84 20 172 -120 166
3583A66j70k3P6J52k87N7j7o1K71l19P3qRJ73l94P5K27o5L02o4l98J85J38j25
$$ 166 -4 -27 49 201 -86 -29 -46 -107 164 -155 -82 -90 -81 92 -302 -227 0 -65 237 173 -225 -40 98 -27
3607b7N1k05L23Q6k84q8J56j25L3L77k27j8k40J72J4K25R8j98j34j30M4J60mJ18
$$ -27 24 -181 142 228 -56 -144 12 -113 -80 297 70 52 -188 -16 -2 223 321 123 -11 -141 -97 63 59 177
3631A77k99j34K02K44l63R2K34l04L26k51K01j94n1j14J90j66k6J75N8j66O3K37
$$ 177 -122 -256 -54 190 -173 -81 153 -151 175 -76 125 -69 -120 -234 -44 -210 -236 -61 -3 -169 -106 131
3653A31k21L1J87j68r6J94J55l29L05n1k44L3O0N7l7n8R8j49o0K29k8J53k81j69
$$ 131 -90 -59 128 -40 -136 58 213 -116 189 138 -106 -73 -13 44 7 -51 47 -102 -162 67 39 192 -89 -258
3677b58K77R5k5j63j19J06n4J2j21J91J54j17l9R3J00k99L17J2k97K30j88L2P1
$$ -258 19 114 89 -74 -193 -87 -141 -129 -250 -59 95 -22 -61 32 132 -167 150 162 -135 95 -93 -61 10
3700A0q3J45J40j45j45L4l0N9n6M7j44J88K2k52K3l8K59J34j82o7M60l02j36R4
$$ 10 -73 72 212 67 -78 -44 -74 -15 -71 -24 -168 20 42 -210 -187 -225 34 168 -14 -81 379 77 -59 35
3724C5MJ53k52J76l7p1n9LM5j06R6nk8K49j54R1n5k45J09k86M13k36j8j16L33
$$ 35 39 192 -60 116 79 8 -51 -48 -3 -109 -13 -18 -46 203 49 140 85 -160 -51 -337 76 -160 -178 -294 39
3749C9q5M6k11J66Q6K4k8j3J79j65p5K03k34k0J67j86O5l34M46J96l19J29pj15
$$ 39 -46 0 -211 -45 41 65 37 24 203 38 -37 166 -68 -88 79 -107 -42 -376 70 266 -53 76 69 -46
3773d6K40k73j92J36m4J44o6R4Q5j37m6J8Q8m5J6m5L5j97K47l7J09J34k39K5K1
$$ -46 194 -79 -271 -135 -179 -35 -101 -7 78 -59 -105 -87 1 -44 -28 -73 -38 -235 12 -25 84 218 -21 4 25
3798B5j41R1K64k37J15k70N8m7J35r5K75p6j22j32L01k77K19L8m05K87J3J13k05
$$ 25 -116 -25 239 2 117 -153 -95 -142 -7 -102 173 97 -25 -157 144 -133 86 124 -281 6 19 132 -73
3821g3j62K76l9j59J81J18j68j5j97k9L57j68N0Q3r1L3j19J90l49R4J87K26m36
$$ -73 -235 41 2 -157 24 142 -26 -41 -238 -267 90 -78 -28 55 -36 -3 -122 68 -281 -187 0 226 -210
3844b10L62j82p9J84M4j6j65j35K32k74J84J43k71Q9O5L9r8J99j75Q3j72J03Q7
$$ -210 152 -30 -109 75 119 103 -62 -197 35 -239 -55 88 -183 -94 -29 10 -88 111 -64 19 -153 -50 37
3867C7R3k27K59r4k24J89Kj0j00K4Jo1O9J39k45L98l00K43k17Q2j61J4K25l34
$$ 37 130 -97 162 68 -156 33 35 25 -75 -51 -50 -111 -42 97 -148 250 -50 193 -24 58 -103 -89 136 -198
3891a98K92q8K35l08J31l53K16o0N8j9n5%J45Q0MP8j54Q6l1j21j1l0L03m38J81
$$ -198 94 6 241 -67 64 -289 -73 -133 -75 -94 -149 -149 -4 76 80 158 4 90 59 -62 -73 -103 200 -238 -57
3916e7J08j40O8M9j7J32Lk77L37o2n0k78P8J47J34j20j84J23l8N2p5J06r4N2j48
$$ -57 51 -89 -21 28 11 143 146 -131 206 144 94 -184 -106 41 175 55 -129 -6 -44 8 -67 39 -55 -3 -151
3941a51J11n5L5r8J5L41j0k79j7O7J09k22Q2K31J87m86L00k00K9k8K9J14k7m5
$$ -151 -40 -95 -60 -158 -143 198 188 -91 -108 -41 68 -154 -72 159 346 -140 160 -40 -11 -39 -10 104 77 32
3965C2p6J13J57j8l08M3J64j16l4j19L43k88q7O4M09l58j65N17l15K5o9o1J72
$$ 32 -44 69 226 208 -100 -57 107 -9 -43 -162 181 -107 -194 -130 279 -79 -244 273 -42 -17 -86 -147 25
3988B5K56k58q7j8q8J18l8rk16N27k75R3j8J85k07K39j34k17J10J07j68M5O0J9
$$ 25 281 23 -64 -82 -170 -52 -90 -99 -315 212 -63 30 12 197 -10 229 95 -122 -12 95 -73 -28 32 51
4012E1M2o1N0l15K17Pq6M3j3N0k17K78r8J54o9m4K33k76j39K24R3j73j73J47K81
$$ 51 93 32 82 -233 -16 -9 -95 -52 -65 -15 -232 46 -52 102 33 -11 222 -54 -193 31 124 -49 -222 -75 206
4037B06l05j00L32r4j04L23k90M4Q6j1k70K74o5M5o3K76oj78l87oL23p5n7K7R6
$$ 206 -99 -199 133 39 -65 258 -32 12 98 87 -183 91 26 71 8 284 278 100 -287 -293 30 -45 -102 -75 21
4062B1k87J92o7J74L6j60L74j84j16K7r9J84k9P0j34p2Q2j60J81n7j00J37k46
$$ 21 -266 -74 -141 33 69 -91 283 99 -17 10 -89 95 66 136 2 -70 12 -148 33 -24 -124 13 -233
4085b33K75K34k91M6K4j62L28m43O4M68l00N8J1p2l0p6J45l5K51m06K60k05j63
$$ -233 42 276 -15 31 55 -107 221 -222 -158 310 10 68 79 7 -23 -99 46 11 262 -144 116 -89 -252
4108b52M04r2p3m7J40k50L63l07j25J30K49P6j97J35k43J1K68k29K01K5k71K12
$$ -252 152 60 -13 -60 80 -170 193 -114 -239 -109 140 216 19 154 -89 -78 190 -39 162 187 -84 128
4130A28k75K49J51l63K55J45j59j21rQ6N4l65J28L62m1j28j82K86m57L31K24l77
$$ 128 -147 102 253 -110 145 290 131 10 1 87 141 -224 -96 266 225 97 -85 201 -256 75 299 -78
4152g8M86m28M5k61J86J8j51K10L5j41K34k52K37k46K56j99J28j79P4N7k2kK08
$$ -78 408 -20 25 -236 -50 -32 -183 27 62 -79 155 -97 140 -106 150 -49 79 -100 -26 31 9 7 215
4175B15n14L21J28k11p8J18l0q8J01l2o2k4J69K2k43L10r8r9J63m25O41j36k75
$$ 215 -299 22 150 -61 -139 -21 -51 -139 -38 -70 -132 -156 13 35 -208 102 4 -95 68 -357 284 148 -127
4198a27O4q7L19J27k85j13J18l3Q0M8j09m3K00j27J31j50K33p8k19J17j17K87
$$ -127 -63 -150 169 296 11 -102 16 -17 63 111 2 -41 159 32 163 13 246 168 -51 66 -51 236
4220B36l6n0k06P2J02n8j74J22J62l49N7N9m3j6J76j13r1j7q1L18j89J8J3q2J25
$$ 236 200 150 -56 16 118 60 -114 8 170 -179 -122 -63 -106 -122 54 -59 -150 -167 -248 70 -119 -101 -88 -170 -45
4245d5Q3k98K52Lo8J9oP1J52k17J4j12K7J06J39j23J35j08J05M5j03j26O6O1j13
$$ -45 38 -260 -8 -5 -73 -54 -60 11 163 -54 -40 -152 -125 -19 120 -3 132 24 129 174 71 -55 11 72 -41
4270d1j97r6L01N6L1L2k4J05k5J7k08q5o3N1J11k10J44L20k11j30J26Ok23K60
$$ -41 -238 -334 -33 23 54 86 62 167 142 159 -49 -134 -197 -146 -35 -245 -101 219 8 -122 4 10 -213 47
4294D7J9j42K20j8j43K37k20j9k3J68r2R7j66n6K9J9p0j40K26L7Qj15K05l43L7
$$ 47 66 -76 144 126 -17 220 0 -19 -42 126 34 131 -35 -91 -62 -43 -113 -253 -27 10 18 -97 108 -235 -198
4319a98J21n1J29j77L72m38L81k50P6J5r8K12j10J92N5m55L44K2n3l11J13q2K90
$$ -198 -77 -128 1 -176 196 -242 139 -111 -35 -20 -118 94 -16 176 231 -224 120 142 89 -222 -109 -191 99
4342I9O4j77r5J07N8J99r0k10J2n5N9K4l6LO2j10J46q6P7k96K45J11l91K29p6
$$ 99 163 -14 -109 -2 56 255 165 -45 -33 -88 -29 -5 -41 -38 24 -86 60 -26 51 -245 0 111 -280 -51 -127
4367a27M6p0L85j58j13K32l54J85J12j46j09L2J53K62k58n3L7n4J77j31k89K07
$$ -127 -81 -151 234 76 -37 195 -159 26 138 -8 -117 -85 68 330 72 19 56 2 179 48 -241 -34
4389c4J27l23K71Q3q0K70l64R5q5K3P5j14J01o6K0j1K9n0r2K22k33K56oj07L7
$$ -34 93 -230 41 124 44 314 -50 45 -40 -17 58 -56 45 -21 -1 -12 17 -33 -125 97 -136 120 114 7 44
4414D4l62O0L7L87j22O2j13J61k77K92rl53K67J12k23pJ13j17J7J75k36J30j10
$$ 44 -318 -258 -221 166 44 106 -7 154 -123 169 160 -193 74 186 -37 -44 69 -48 -31 144 -92 38 -72
4437g2J75L9j28m3q5J12r4J75k37J93k77L23p3jJ30j18K24l27J62j19m5O5N4R3
$$ -72 103 142 14 -29 -114 -2 -96 79 -158 35 -242 81 8 7 137 19 243 -84 78 -41 -86 -21 33 126
4461A26m1k07M7J6KOn8l3K43j52q7Q2N4O5j75o9L42n4r8J04k49q2L75k29R3J05
$$ 126 85 -122 -75 -59 -57 -51 -109 -142 101 -51 -138 -56 -2 63 -112 -181 161 107 9 113 -136 -218 157 -72 21 126
4487A26j22J44r3n2l6P4j27K46N1j38q4P5k10L4O7k7L82n36L10o4M7L2l2j28J28
$$ 126 4 148 55 3 -33 41 -86 160 211 73 -11 64 -146 -112 -45 -72 310 -226 84 20 67 99 67 -61 67
4512F7k47K63K01m94N28k54N3j94J58J06j83M3j23K28J1k21O9J26j88m3j18J28
$$ 67 -180 83 284 -210 318 64 117 -77 81 187 4 47 -76 152 163 -58 11 137 -51 -94 -212 -84
4534h4J57L7k26k27K04P8J80k08j8J68m9l53N36k90K33r4j80J1L13l67K48Jm6
$$ -84 73 110 -116 -343 -139 -61 119 -89 -107 61 12 -341 195 -95 138 44 -136 -125 188 -179 69 70 24
4557B4k1J00j22l35K86K39j98J99k97Q6j20l77N17k05M94l44J23Jj25K87k47O2
$$ 24 3 103 -19 -354 -68 171 -27 172 -125 -39 -159 -536 -19 -224 270 -74 49 50 -75 212 -35 27
4579B7j53r4K67j92l2K45J16m12O5J55P9m59M87K43o10L04Q3k94J84j49J7J59
$$ 27 -126 -220 47 -145 -177 68 184 -228 -163 -8 71 -388 99 342 -268 36 119 -175 9 -140 -123 36
4601C6P2r3J4J45k57j19K46Lj53J71j83N9Q8m7k27K65k0P2l9J8k00J37j29J10
$$ 36 108 15 29 174 -83 -202 44 47 -106 65 -118 -59 29 -18 -245 20 0 72 33 51 -149 -12 -141 -31
4625c1k5J66j00P8k42J97J7j92Mj21L07J20q8l11K41j40J99N3j04M1n0R5q7j80
$$ -31 -56 110 10 88 -154 43 60 -132 -128 -249 58 178 90 -221 20 -120 79 132 28 69 19 114 27 -153
4649a53M10k34r3O2r7K6J66K15m96J47J26R6k6o5j36J2o3P7L6Q9r5j07K10j77
$$ -153 257 23 -70 -8 -105 -79 87 302 -194 -47 79 175 149 84 -52 -40 -103 -26 10 99 4 -103 107 -70
4673g0J65m6j29J63kJ30m88K24J84k55J83J22j95K47k03J38l99K41k28L30k43
$$ -70 95 49 -80 83 81 211 -277 -53 131 -124 59 181 -14 233 30 168 -231 10 -218 112 -131
4694a31K20P7j78j28L2Kj12J41j7%J34o1o0L84l77J58m18L24L06k22n6R6p0k43
$$ -131 89 166 -12 -140 -108 -106 -218 -77 -94 -94 40 -21 -81 303 -74 84 -334 -10 296 74 18 114 44 -199
4718a99K38p3P9J26j84Q2kk31K95j17j58L28k22J4L41l22J9L5j75j18J96p2K59
$$ -199 39 -34 45 171 -13 69 67 -164 131 14 -144 184 -38 -24 317 -5 14 49 -126 -244 -48 -120 139
4741A39l29J29R8r9K22j06K07l7q5k84J58M23n70K36j75J16M2m9j66L62l93nO9
$$ 139 -190 -61 37 -62 160 54 261 224 139 -145 13 436 -134 102 -73 43 85 36 -130 232 -161 -166 -97
4764i7J24J90l9k25j71L02l50M20j62q0J73k47j11N77m70K87p0J70P3n15L98k86
$$ -97 27 217 178 -47 -218 84 -266 154 -8 -88 85 -162 -273 304 -166 121 51 221 294 -221 177 -109
4786a09J23m4q8J58l7K33q6j68M03k72j23M3K74k14n5l2J58j07p2J49k9k51M1
$$ -109 14 -30 -118 40 3 236 150 -18 385 113 -10 33 307 93 38 6 164 57 -15 134 105 -146 -105
4809a05rJ79J0J13j82J27j31oK1J56k80r4O0L9j53K32j83N2K18r2l76M23Rk3K9
$$ -105 -114 65 75 188 6 133 2 -4 17 173 -107 -201 -141 -102 -255 -23 -206 -154 64 -28 -404 19 28 5 34
4834C4j41J24K68l40MK28k89K19n2Q9j92N9J75j47k1k45K98P6k20p6J88L6q2O9
$$ 34 -107 17 285 -55 -51 177 -112 107 55 144 -48 11 186 39 18 -227 71 147 -73 -149 39 75 -7 62
4858F2J79r4k32O5j53K57j16l26L52R2J8q4l34M98j91k32N35k72oj04m1P9j59
$$ 62 241 147 -85 -20 -173 84 -32 -358 -6 86 104 20 -314 184 -7 -239 296 24 18 -86 -127 -48 -207
4881b07O2J92k31R4m3L89j63m09M97j74R6j88l1J93m9j63Q4L7J01k66L13p5m3
$$ -207 -145 47 -184 -90 -133 256 93 -316 181 7 103 -85 -116 77 28 -135 -51 -14 87 -179 134 59 16
4904A6r7N7N0q4J23j43%J64k48M40j96J21l51J45NNj03N7K17M0m03L91k57m9r5
$$ 16 -81 -24 26 -58 65 -78 -78 86 -162 278 82 203 -148 -3 2 7 -96 -39 178 218 -185 206 -51 -100 -195
4929a95MK20l72K91J05J13N1l27nN8L2K3nJ04k61J1jO8L70m32r4J67N6K67l41
$$ -195 -191 29 -343 -52 53 166 217 -110 -115 -57 -25 -2 -7 97 -164 -153 -154 -86 284 -148 -242 -75 -19 248 -93
4954i3J37j20l3M3L75m19J32N3j59J54j98nK01j78J06j23N0M1QK88n9k04qok45
$$ -93 44 -76 -109 -66 309 -110 22 75 -84 70 -128 -133 68 -110 -4 -127 -77 -36 -28 260 201 -3 -11 -17 -262
4979b62L61j62K71j2j69q9mO5o1j14K09p0l4PJ92l3j98K27j25N9q4J1j04L1K50
$$ -262 99 -63 208 196 27 -62 -66 -1 -62 -176 33 -37 -71 -64 128 95 -103 124 -1 58 -26 -15 -119 -88 162
5004A62m35J86J85j90j23L2K4R9J10j87J75o6K51k63j19pL49q0k66K24k8n9K00
$$ 162 -273 -87 98 -92 -215 -183 -159 -60 50 -137 38 -28 223 -40 -159 -166 183 103 -163 61 33 -26 174
5027A74k38m8J16j63M84n57P9J04P0j69J84k51K44k74P4l0K88k21K22Mn9q9J18
$$ 174 -64 -112 4 -159 325 -232 -153 -49 21 -148 36 -215 29 -245 -171 -201 87 -134 88 92 33 -56 62
5050F2r2J40k62Q6L87q7j05K0l3j33J15j21j96JJ36N7K14k32K16J3k09M4M0j49
$$ 62 -30 110 -152 -66 321 234 129 149 116 -17 98 -23 -219 -218 -82 -25 189 -43 173 186 -23 21 61 -88
5074h8J64K6P0j32p6n9J47R7j58k45L44j49N5J52p2J46n29K34n8P8j46L47j44
$$ -88 76 102 172 40 -36 -95 52 149 -9 -254 90 -59 -4 148 76 222 -307 -73 -131 -53 -199 148 4
5097Dj22K13m34K77N5jP0l28L9L56l75L62k14L97l79m2k2R0j05MK77j92K34M8
$$ 4 -118 95 -339 -62 -7 -8 62 -266 -227 129 -246 116 -98 299 -80 -122 -144 -54 -159 -155 122 -70 164 212
5121B12m52J85j0j21J44R3j80J2J22J19k90M14l49n3R5J1J36j5j3j23L95p1j84
$$ 212 -240 -55 -65 -186 -42 51 -129 -117 5 124 -166 248 -101 -154 -59 -48 88 73 60 -63 332 261 77
5144G7JK4N3J0k96J35J07j89J86j34J72q2k02L02k62K42k30J26k50k5J11L7R4
$$ 77 78 102 155 165 -131 4 111 -78 108 -26 146 64 -138 164 -98 144 -86 40 -210 -235 -124 -87 7
5167Gj90J87j7O4j16J36m21J60J41j08J12K0j97J63j75Q4L7l5J74j52J86j43n5
$$ 7 -183 4 -13 51 -65 71 -350 -190 -49 -157 -45 -25 -222 -59 -234 -150 -113 -148 26 -126 60 -83 -138
5190a38J23l3K0j9j53K92p0m2J19o7m0J0M4N3j36O2N1l1k07l8J62n0m7j36J97
$$ -138 -15 -48 -28 -47 -200 92 22 -20 99 32 -8 2 46 99 -37 25 76 45 -162 -200 -38 -88 -135 -271 -74
5215g4K2J88L8j71K08j61J39j44M7L4j44J15k13K56j92J05m4j00K27K5l16k3K37
$$ -74 -52 136 174 3 211 50 189 45 92 126 -18 97 -116 140 -52 53 9 -91 136 161 -155 -178 59
5238E9l33Q8K02J3P8k88J16J33p8Q9l0l7J04o1K2m1j23L3J85j91P0j11J4J93K2
$$ 59 -274 -186 16 29 107 -181 -65 68 -10 79 49 12 116 55 77 36 -87 -54 131 -60 10 -101 -87 106 128
5263A28j94J16j43Q8KK1k6n8l0K04P0k06r7K31j46K64j51j17P2J82k75K3J10k7
$$ 128 -66 50 -93 -5 -3 18 -8 -66 -96 108 178 -28 -125 106 -40 224 73 -44 28 210 -65 -42 68 41
5287D1J2l2J30j68J7N9j95K19j37Q5m9J46o9P8j29J78k2j49j3J7Q3j9j19Mj59
$$ 41 53 21 151 -17 0 59 -136 83 -54 31 -18 128 59 137 8 186 164 15 2 19 102 83 -36 -32 -191
5312a91L60J8n7K0j94r6J12R3j33J7n2R1P5k63K89j32j49%K13j75j05J42K8k07
$$ -191 169 187 130 150 -44 -140 -28 65 -68 -51 -103 -12 63 -200 89 -43 -192 -192 21 -154 -259 -117 -89 -296
5336b96K48K2K18k37j42J30j60K5K6J48KJ37l05M13m14J40J76o2J48k35j5J45
$$ -296 -48 -26 192 -45 -187 -57 -217 -192 -166 -18 -16 121 -184 229 -185 -45 131 69 217 -18 -33 112
5358A12p6j31R3P0m3L7l59K23j16J44m0L45j90K2k8j66j71R6K33N1k60j0L84m15
$$ 112 36 -95 -2 68 25 62 -297 -74 -190 -46 -86 259 69 91 63 -103 -274 -178 55 106 -154 -164 220 -195
5382a95K81k04M8K6K30j08NM1J58l38o0m8L52j77j38R6J48l11J8K68j83K28jk62
$$ -195 86 -118 -70 -44 186 78 83 124 282 -56 -116 -164 188 11 -127 -31 117 -194 -176 92 -91 137 136 -126
5406a26j13L36j04l6l6K34j48L9j17j0Q4L4m7m1k08L13Q8j94Q3R9j89J4O0m8k9
$$ -126 -239 97 -7 -43 -79 155 7 46 -71 -81 3 37 -10 -51 -259 54 142 -52 31 130 -59 -45 15 -33 -62
5431f2J02k13K52k46J81j23K88k73P5M7P3j63j69L99n8r7k5M0o7j2J33r7J01k40
$$ -62 40 -173 79 -167 14 -109 179 -94 -19 28 101 -62 -231 168 110 13 -12 28 -39 -51 82 -15 86 -154
5455a54j1L43l9j03k4r9J42k08J97M5j82K54k17J18j86J51K57k56j67J92L7j51
$$ -154 -165 178 139 36 12 -87 55 -153 44 89 -93 161 -56 62 -124 27 284 28 -139 53 90 -61
5477f1m4J69j97j05L65j16J28k52L5J64J4k94K00J70N0k22K52l12L3L22j39l07
$$ -61 -105 64 -133 -238 127 11 139 -113 -78 86 100 -194 6 176 226 4 256 -56 -23 299 160 -147
5499a47M3n5J77K2j22OK3Q5l04L68p9l97L15J2O0p0j82L93j89Q1m6P9l15K52J52
$$ -147 -104 -159 18 40 -82 -76 -53 32 -272 96 17 -380 -65 -53 7 -63 -245 148 -41 40 -6 73 -242 10 162
5524A62r5j10J57N4l97P7n1J47n0o2J89l01K95R7j97J36j03j47L91l00L89k14
$$ 162 67 -43 114 168 -229 -152 -203 -56 -106 -168 21 -280 15 112 -85 51 -52 -199 192 -108 281 67
5546F7p9J6q5M07l67J62P4j05P6l33M43l64J22j72j43N8K92p6m2j37j9M18j13
$$ 67 -12 4 -81 326 -41 121 195 90 166 -167 276 -88 34 -138 -281 -223 69 -7 -49 -186 -205 213 100
5569A00P7k08K24n7j16j57J28m8j43O2J52n3k40L04j36p4K00j26J91j48k4K54
$$ 100 177 -31 193 136 20 -137 -9 -57 -200 -138 14 -39 -279 25 -111 -185 15 -111 80 -68 -92 162
5591A62l16N3L23m19K56k39L6J3j00K23n1q1J92r4q2K05l52j27O13j57r9k3R6
$$ 162 -154 -101 222 -197 59 -180 -144 -131 -231 -8 -59 -140 52 -42 -124 81 -271 -398 215 58 -41 -64 32
5614C2%K67j83J07j98m34N46j36j92l8K89j34o5J59j15j88L38k39M73j10j50%
$$ 32 32 299 116 223 25 -409 137 1 -191 -229 60 -74 -139 20 -95 -283 55 -184 289 179 29 29
5636B9l9k0J25l49J26M73k35l57K72R8L9k67J2j6K88o4j1rk80L34j21L8r6L9j30
$$ 29 -10 -30 95 -254 -128 345 110 -247 25 123 162 -105 -93 -109 179 115 104 95 -185 149 28 66 -30 9 -121
5661a21K6k2L6Q4R3J54m46j5J23l3L08m12M25q4j5k15J73p5M3J41j64l5o7J68
$$ -121 -95 -117 -81 3 96 250 -196 -211 -88 -121 187 -225 200 116 101 -114 59 -16 27 168 4 -31 -98 70
5685G0o3o7J44j00K86k49j67J66j97K69j92K03j04rL2m1K18m70L02j81J67l8N0
$$ 70 7 -60 84 -16 270 21 -146 20 -177 92 -100 103 -1 -10 22 -19 199 -271 31 -150 17 -21 29
5708B9j4r2Lj21K28j5j09L21j58n2J9Rj57K61K0j64k03L19k71K38j42r0J45j66
$$ 29 15 -77 -74 -195 33 18 -91 230 72 20 39 48 -109 152 172 8 -195 124 -147 91 -51 -141 4 -162
5732a62L50l49K87k69K25J52k32Q3o9j6j69k6Q8K52j90n3L10k50j78J30J21l0
$$ -162 188 -161 126 -143 82 234 2 85 16 0 -169 -195 -107 145 -45 -98 212 -38 -216 -86 35 5
5754Ek17L39j44J7k14J14J33k04K62Rj83M2L9j1J97j69J57j60J25P4k08P8j03
$$ 5 -212 127 -17 0 -214 -100 33 -171 91 100 -83 -41 -2 -13 184 15 172 12 137 211 3 81 -22
5777b2j06J93j36K53k49k7J31K39k63K8n4K11k33L5j31J57l3j13J11n8l9k20L91
$$ -22 -128 65 -71 182 -67 -94 37 276 13 41 -13 198 -35 0 -131 26 -7 -120 -9 -67 -106 -326 65
5800F5j68k7M8J83q1K8O1k92L61J3l21MM5L5K55j98P4j12q2P8K24k92J02K10j33
$$ 65 -103 -130 -82 101 20 48 109 -183 178 191 -130 -126 -81 -46 209 11 85 -27 -109 -31 193 -99 3 213 80
5825H0j80M6pK1k4j76J50L53k21j62K15J4k77LK03j92L46k30j07K07J00j28M8
$$ 80 -100 -54 -61 -40 -64 -240 -90 263 42 -120 95 109 -168 -165 38 -154 192 -38 -145 62 162 34 82
5848H2Q2j87k07K26N5J39Rj83J63k59K16k53J36j45K90k01j14J78n6N0o4J42q6
$$ 82 164 -23 -230 -4 51 190 199 16 179 -80 136 -117 19 -126 164 -37 -151 27 -29 21 -43 99 13
5871A3j7k66J27L6P2J94n6L1r8q5k4J52j38Q9j76P8J58l41L00j83l6p2K41R8j55
$$ 13 -4 -270 -143 -107 -35 159 103 134 36 -49 -73 79 -59 30 -146 -68 90 -251 49 -134 -170 -242 -1 97 -58
5896e8J75j15J28m6k23J78J96j39O5o4j96K27k15J4K58j20K8j71J13JK38k52K79
$$ -58 117 2 130 84 -139 39 235 96 161 97 -99 128 -87 -73 185 65 93 -78 35 36 274 22 301
5919C01k90jM3Jo7j08J45N6N6o4k79J20j36L85k69J4J50o3j25m1J04J75q9n0J23
$$ 301 11 10 53 54 -13 -121 24 80 136 72 -207 -87 -223 162 -107 -93 57 -6 -131 -172 -68 107 18 -32 91
5944I1n4k30M9Rp0j04K30K18m3j47O2J21k56J67J59k19R3J4L0k22m4K8qL88j85
$$ 91 37 -193 -144 -135 -205 -309 -79 139 96 -51 11 132 -124 43 202 -17 76 90 120 -102 -146 -118 -126 262 77
5969G7k38J50Jr8L1j58K82j72J60j4l2M4k09J17R8K38k65k9l3m9j5K07M4l49K57
$$ 77 -161 -11 -10 -108 -77 -235 47 -125 35 21 -11 33 -176 -59 39 277 12 -17 -50 -99 -114 93 137 -212 45
5994D5j00J11P4l30L29p8j34j40l6L64r9%R1L8j49J21k48M4K28k31M20l66Q3j94
$$ 45 -55 56 130 -200 129 51 -83 -223 -259 105 6 6 97 135 -14 107 -141 -97 131 -100 320 -46 37 -157
6018a57K18l02M24j59k6p4J57l0j20Q4J66j69M7j25K8n0Q7J03r5rO0n0j03J54
$$ -157 61 -241 183 24 -2 -76 81 51 -69 15 181 12 59 -66 -38 -88 -1 102 7 -2 58 8 -95 59
6042E9l3J75l85J87j28J74m02K14K41O7j38j60K93j69l0J22L6k69J79j08J89M2
$$ 59 26 201 -184 3 -125 49 -353 -139 102 169 31 -129 164 -5 -35 87 123 -146 33 -75 114 156
6064A56j80j26K5L30q8j85lK85j86k6L6N4Q3j85K68m95L78qj21J39j84j56J67
$$ 156 -24 -150 -125 205 117 -68 -71 214 28 2 38 92 175 -10 258 -237 141 133 12 151 -33 -189 -22
6087b2n3p5N2L58m6j85p1j9n2L7J53j85K22l79J42K00n8l1J28j28j81L9L75l21
$$ -22 -75 -150 -98 260 214 29 -42 -61 -113 -76 77 -108 114 -265 -123 77 19 -12 116 -12 -193 -154 221 -100
6111a00J32M2m2J97p6j32O1K3K1j35MK02m18K14L0j60K8J52j0k5q4p1P9Nl3J82
$$ -100 32 74 32 229 153 21 82 105 126 -9 -5 197 -221 -7 23 -137 -109 43 33 8 -76 -147 -68 -63 -96 86
6137H6j82m1L23j28Q6j26O1j25J59m67M64k47J90P8j75J36j99J50j30J99o1r9
$$ 86 -96 -137 186 58 144 18 79 -46 113 -354 110 -137 53 131 -44 92 -107 43 -87 112 51 -48
6159d8J21p4R5L8j45p2J85r6J52k53P1JR6j83K98l38P2n1NM0k6P6J2Q8j38k79
$$ -48 73 -1 94 132 -13 -85 100 4 156 -97 -26 -25 71 -112 186 -152 -80 -131 -126 -86 -112 -36 -24 64 -74 -353
6185c53M25k26L33O4p7j97M9p3n3K56j27k87K19J83l12K52n9j14J57j57R4J88
$$ -353 72 -154 179 243 166 -31 18 -55 -108 148 21 -266 -47 136 -176 76 17 -97 60 -97 -3 185
6207A85m1j30j13J29j96O3J63j58M6j23K54k8k14K54J22j40k30K14L5M7m3l75
$$ 185 144 14 -99 30 -166 -103 60 -98 -52 -175 79 51 -163 91 213 73 -157 57 92 139 96 -279
6229b79K92J62m57K29K03j53po3Q1R5o4R8k05j5O4k21M2L44n8j70R2p8J34J5M2
$$ -279 13 175 -282 -53 150 -3 -10 -73 8 103 39 137 -68 -83 -19 -240 -198 146 88 -82 10 -68 66 81 123
6254A23k48J03L3r3j17J86k14J95J45k6k96J49J57j44K47p8n09N00m36N12j02
$$ 123 -125 -22 11 -82 -199 -13 -227 -32 113 87 -209 -60 97 -47 200 122 -387 113 -323 189 87
6275H7j69R5k15K73j7j39j46L31j90K14m97L66P0Q8j92j00N5O4k18K69j04J9K6
$$ 87 -82 13 -202 71 54 -85 -231 100 -90 124 -373 -7 63 151 -41 -141 -86 -22 -240 29 -75 -56 -30
6298c0N7j5K56m01pL73k53N4J2k5J10Q7j86M6O4l05M19j31j83O1j78O5J12k4J09
$$ -30 27 12 268 -133 -140 233 -20 34 46 21 131 218 32 78 142 -163 256 125 -58 3 -175 -110 2 -22 87
6323H7j25J42O2k27q2N3M35l89Q7J12n7j38O5r7J90k83O5K33J11k56j32M6J05
$$ 87 -38 104 166 -61 -143 -90 345 -44 43 155 98 -40 25 -72 118 -165 -100 133 244 -12 -144 -98 7
6346GRL0J9J7q3J10j24j68J36K36j22k20J96j68K34o2nn0Q9o4j33K72k05L13R3
$$ 7 16 46 65 82 -1 109 -15 -183 -47 189 67 -153 43 -125 109 47 42 -8 81 17 -116 156 -49 264 357
6371C57o92K93k27J47o7J85m2J63j89J29N2r3o3J55J31k68k4N2J50k46j4j33L19
$$ 357 -335 -42 -269 -122 -189 -4 -46 117 -72 57 109 16 -47 108 239 -29 -53 -1 149 -97 -111 -244 75
6394G5j15l3J43k31j86M70J47k29o7j77L64k32J39j25j11K62p4J14l13L77j19
$$ 75 -40 -73 70 -161 -347 123 270 41 -26 -203 161 -71 68 -57 -168 94 20 134 -179 198 79
6415G9k65l4K07j17j41J06J44J38j48R4l6j6R3j65J03j65L7J07j7k3j34R0K6k19
$$ 79 -186 -220 -13 -130 -271 -165 -21 117 -31 63 27 11 104 -61 42 -123 -86 21 4 -19 -153 -63 -37 -256
6439b56M93l84J74Q7j34O9P4k23K29j41k6O8ON6K1M0k91J85j60K6J51Pl7j05J
$$ -256 237 -147 27 114 -20 49 123 -100 129 -12 -38 30 36 92 113 153 -138 47 -113 -87 64 71 34 -71 -70
6464g0Q9K02k25m6J55J6n64L41J44j56L36j19j63rL4j05p4M13j08k45R8o4j2J57
$$ -70 19 221 -4 -50 105 121 -443 -102 42 -114 222 103 -60 -69 -35 -140 -214 199 91 -154 -56 -120 -132 25
6488B5j26J54J8J49L9j53Kj87Q4p7J48O5o6R2r5J3mj07K97n33K93J26p2k75M03
$$ 25 -101 53 71 220 259 106 108 -79 5 -72 76 141 75 167 72 85 81 -26 271 -262 31 157 85 -190 213
6513B13j78k28K86K6Q7j42n3l5J13R4k43j38L40n8k68J25J64o3j81K17M3j00n4
$$ 213 35 -193 93 119 206 64 11 -24 89 183 -60 -198 142 84 -184 -59 105 42 -139 78 121 21 -33
6536c3N0K2J91m28J82K65j36K12j77l24K31q2q1J82j00K40m42j3J57O9m6J91k98
$$ -33 17 39 230 -198 -16 249 113 325 148 -176 55 -27 -108 74 -26 214 -228 -241 -84 -15 -61 130 -168
6559a68K51j39N7j28K19r2l22R0M23j46l53J83N2n4Q7J83J42l22J05J42rQj42
$$ -168 83 -56 1 -127 92 0 -322 -232 191 45 -308 -125 -73 -127 -40 143 285 -37 68 210 201 209 67
6582F7k96PO6J38q6L10l29j5n9K84j07M3K8R0j50j1J9K6J17m9k98K43j82J13p7
$$ 67 -229 -222 -156 -18 -104 206 -123 -138 -197 87 -20 23 51 141 -9 -20 -1 25 142 93 -205 38 -144 -31 -108
6607a08K7oJ92j32j37M16j65o7j49L1J90q5j5k4J07k53jq9k4M85J4k11r9L27k47
$$ -108 -81 -87 105 -27 -164 252 87 20 -129 -98 92 7 -8 -32 75 -178 -179 -268 -292 193 207 -4 -103 224 -23
6632b3J7j03N5q8J96k8N8p0k51J93l5L8J53K1j54J52J32k60j13j65J85K55j50
$$ -23 -6 -109 -54 -142 54 26 84 14 -237 -44 -79 -41 112 133 -21 131 263 3 -110 -275 -90 165 15
6655A5q4P0J50k44L14j10q0j91J25o1L40k51j6L6Q4K0j02j64J27k6o0oK67k21
$$ 15 -69 1 151 -93 221 111 31 -160 -35 -96 244 -7 -23 13 97 117 15 -149 -22 -48 -108 -114 153 -68
6679f8J24k4j44mK01j14n8n6K96l53J89r6J88o4J56q4rkO2j40k3O5j1R9Q6m47
$$ -68 56 32 -112 -116 85 -29 -87 -143 153 -200 -11 -107 81 17 173 89 80 78 140 0 -23 42 31 130 216 -231
6705b31M12k35J9K00j28j57L05n12L04K46k37m6K69j08k39M7J81l5J21o2k02Q8
$$ -231 181 -54 -35 165 37 -120 185 -327 -23 223 -14 -60 209 101 -138 -91 90 55 176 114 -88 0
6727@j02o9j23K41Q4j07J30j56j03P4J45k0Nj95j5M72j94J81l05Q6o3J04J4k03
$$ 0 -102 -171 -294 -53 31 -76 54 -102 -205 -131 14 -6 -1 -196 -211 261 67 248 -57 29 -34 70 84 -119
6751a19J60k06K32l17M11j99J19k0K5j64K02k21J0n3j2L3J43N5J45j10lj00P3
$$ -119 41 -165 67 -250 161 -38 81 61 86 -78 124 -97 -87 -140 -152 -119 24 79 224 114 111 11 84
6774H4P5k97K35k1r4J58k01k19Q1K07m4Q6L0J31pl20K49k48O6K8Q3N3j35k5pK24
$$ 84 159 -138 97 76 -18 140 -61 -280 -199 8 -36 50 80 211 204 -116 133 -115 -49 -21 62 115 -20 -45 -52 172
6800A72l35J52j35N8J46j70J54j3l8o6%L43j59j7l12L76l08R4M9J6q2K07j15j39
$$ 172 -163 -11 -146 -88 58 -112 42 29 -9 -75 -75 268 109 92 -220 156 -152 -58 -9 7 -75 132 17 -122
6824a22J16Q5PJ0j12N1K69k63k72K65j02K49m4l12M47l10QQ6J23k69Jl9j3O8j91
$$ -122 -6 79 86 96 -16 35 304 41 -231 34 -68 181 137 -175 272 -38 -30 56 179 -90 -89 -128 -141 -73 -264
6849b64K19j25N4M9K07k55k2K96k10J46j87Q2P2j54J39k32K6J52M5q4J03j31J73
$$ -264 -45 -170 -116 -67 140 -115 -137 159 -51 95 -92 -10 62 -92 47 -185 -159 -7 38 -46 57 -74 99
6872I9Jq2J91k18j00J4N4J53k54J32m9L20q2j60J14l38K99J7Q1o6j41oj22P6J26
$$ 99 100 18 209 -9 -109 -95 -41 112 -142 -10 -59 261 179 19 133 -205 94 111 192 126 -15 -21 -143 -67 59
6897E9n3nr4K14k00Rr8o5KN11l07p7K9P9k16K17M0R8r3J22j48k03K10J3q0M6j29
$$ 59 6 1 -93 121 -79 -70 -168 -233 -231 280 -27 -104 -75 4 -212 5 45 143 50 172 24 -179 31 44 -36 10 -119
6924a19N6K9J36j17K60M7m62L76O0l20P7j49k4J34O6N8n1r0J39r4Q4k26k03M99
$$ -119 -63 -34 102 -15 245 292 -170 206 266 -54 23 -126 -150 -16 50 108 57 -33 106 12 96 -130 -333 166
6948A66lj81K5o9J26m1O5Mk2n2L3k46J20j96L25k83L27k56K20op0J85r8n3j54
$$ 166 163 -18 7 -62 64 23 88 92 70 18 51 -195 -75 -271 54 -229 98 -158 62 56 -14 171 73 20 -134
6973a34K52l75J35m2n7l6M0K65j09J02j42P7L4k37L33j90J22p2J99k0j59j61R5
$$ -134 118 -257 -122 -164 -221 -257 -217 48 -61 41 -101 -24 10 -227 106 -84 38 -34 165 145 -14 -175 -80
6996h0m9J85p0O3k5R7j63J07j21R9j33K95r4q2K21j03j66j19K26j82J99k76K12
$$ -80 -129 56 -14 49 24 121 -42 65 -56 43 -90 205 111 29 250 147 -19 -138 88 -94 105 -171 41
7019D1j21L2J71j50j19L61j19r4qo1L8K83l37J25L4j33K25k57J21j43P2J82k61
$$ 41 -80 -48 123 -27 -146 215 96 2 -6 -67 -29 254 -83 42 76 -57 168 -89 32 -111 -39 143 -118
7042a18K31p0J47k04l8J63p1k43K52J9k3k67J56J29l23J86QJ99j22j15J85j85
$$ -118 113 43 190 -14 -52 111 40 -203 49 68 45 -222 -66 63 -260 -74 -66 133 11 -104 81 -104
7064a04K87k68J91K53k52j28N9P1N2k58J70lj11q7K96K2k78L2J27o6n0n6J39l0
$$ -104 183 -85 106 359 107 -21 38 109 161 -97 73 70 -41 -128 168 190 -88 -56 71 5 -45 -101 38 8
7088HK56k00m46P47k94Nj17n5J42J17K8l26K10J25k86j58L89o5r6n9N9J63j80
$$ 8 264 64 -382 365 71 76 -41 -96 46 163 191 -135 75 200 -86 -244 145 80 -16 -75 -16 147 -33
7111c3j60M03j84J24L7k37R7K9QP7l07m2N66l12j69m4L17q7j88K56l57J44K33
$$ -33 -193 210 26 150 187 -50 47 76 84 161 -146 -188 378 66 -103 -147 170 83 -105 151 -206 -62 171
7134A71l28K23o5Q%N1O2m28N60j62j22L0J06j61J76n7j48L1M4j37L8R6J02L12
$$ 171 -157 66 1 9 9 60 122 -306 254 92 -30 0 106 -55 121 64 -84 -53 -9 -146 -108 -12 90 402
7158D02k90k65K3k33K74N7k4K9k7%N1N3n9N5j81L7O2J21p4R6R1m70M88J3k95p
$$ 402 112 -153 -130 -363 -89 -32 -56 -27 -54 -54 -3 50 -9 46 -135 -98 -36 85 11 107 198 -272 216 229 -66 -73
7184g3j3J41J38j02k02J98o4k52K42j60N0o9J53J58p2k04O6K21k82M4J67k7Q3
$$ -73 -86 55 193 91 -111 87 23 -229 13 -147 -97 -166 -13 145 73 -131 -65 156 -126 -82 85 58 141
7207A41j95J02J20j75o1N4J66l3r9Q4k69N0J35j53K41r0o1L21j41k04J5m0J33
$$ 141 -54 48 168 -7 -68 -14 152 119 20 104 -165 -115 20 -133 108 18 -43 278 137 -67 -52 -92 41
7230D1Q5m3j54l4J7J41k89K04k60L9J87K89j51m45L59j73K36k4J6P2j3j43n1J23
$$ 41 126 83 -71 -105 -88 53 -236 -32 -292 -253 -66 223 72 -373 -14 -187 49 25 41 113 100 -43 -94 29
7254B9P8J39j22p2J49l02p4j25K43m0J62r5J63l57K96k3P7Oj78j12J19r7k10K30
$$ 29 107 246 124 52 201 -101 -175 -300 -57 -97 65 -30 133 -224 72 49 126 132 -46 -158 -39 -136 -346 -116
7278a16K10k57J90PK21l44o9K60j25M0o0p7K65k09J10k14K67L1j24j18R1O8R0
$$ -116 94 -163 27 34 255 -89 -158 102 -23 17 -43 -120 145 -64 46 -168 99 130 6 -112 -21 47 137
7301A37k0j70J3n9J42L4j19J38n4P4k08J47m4j14J10j14p9J91J20j72m8n9K43
$$ 137 117 -53 -40 -99 43 77 -42 96 42 116 -92 55 11 -103 7 -107 -186 5 125 -47 -95 -154 89
7324H9N8l1Qj70k1oJ50Lj85J9K37j13r2j65J77R2J70k33j29K20j78K51l39R7J27
$$ 89 147 116 124 -46 -67 -73 77 80 -105 -86 151 38 -54 -219 -42 50 220 -13 -142 78 -100 151 -188 -91 36
7349C6J7l0J22nQl31Q0M9M7N3j06j64J25O6J52k90K42j19J40k60N8P9N0pj8L9
$$ 36 53 23 145 140 148 -183 -103 -54 -7 46 -60 -224 -99 -33 119 -171 71 -48 92 -168 -110 -31 19 12 -6 33
7375C3o9j40O6L7J49j70J54l3j4k8j21K11N9j00n0K2j2j34J58J44l4N5j54J28
$$ 33 -36 -176 -110 -73 76 -94 60 27 13 -15 -136 75 134 34 -16 6 -6 -140 18 162 128 183 29 157
7399A57q0j09N9K10j26j62r4k3L01j15n4j0m0PJ26j61K32q6o9R7o0J27k46L81
$$ 157 77 -32 27 237 111 -51 -145 -168 133 18 -36 -46 -86 -79 47 -114 118 32 -37 60 0 127 -119 262
7423B62q9j18j06K46j68O6l8j67K35j96nJ41lL4j47J51l09N34j75j65M6k8M0r6
$$ 262 173 55 -51 195 27 93 55 -112 123 -73 -78 63 60 94 -53 98 -211 323 148 -17 29 1 41 -55
7447e5K0r1R9k72K68J69k5M2j60j74J43k33L90l29P4j21K08K30k47J20j4k96K07
$$ -55 -35 -126 -27 -299 -31 138 113 155 -5 -179 -36 -269 121 -208 -134 -255 -47 183 -64 56 42 -254 -47
7470d7j6k21J55J92m9j08K03k63J29k58L16J47l72K05m1Q1K2k14R4L9J51j90Q
$$ -47 -63 -284 -129 63 14 -94 109 -154 -25 -283 33 180 -192 13 -28 53 75 -139 -45 -6 145 -45 -37
7493c7J02j4j1r4Q3q3l9l1K10J13l16J2r3j04L38M5q0O8M2k6l6j38J04J62k53
$$ -37 65 51 40 -54 29 -54 -93 -124 86 199 -117 -105 -198 -302 36 81 1 69 111 85 49 -89 15 177 -76
7518g6J19j03J95j12j79L12J21j72j33N4r3R8k6j97K95k12J90K2N2j35j42K73
$$ -76 43 -60 135 23 -156 156 277 105 -28 26 -67 31 5 -192 103 -109 81 103 155 20 -122 151
7540A51k77JKK10j6j33n3J75P1j7j48K65k78K29l78K39l1j11q3Q7L7L1N2p6K25
$$ 151 -126 -125 -123 87 71 -62 -115 60 131 114 -34 231 -47 182 -196 43 12 -99 -182 -95 -58 -27 25 -51 174
7565A74k64J3j9L52l15Q5J32j65qP9k52l0K98K3k62M17k46%p0j64K28l2L58k86
$$ 174 -90 -77 -96 256 -59 26 158 -7 -15 64 -188 -218 80 103 -159 258 12 12 -58 -222 6 -26 332 46
7589D6J03k61J40K4n40M95m3j54K48j86K28k93J47m2J18j23K36O7l5l61K88K06
$$ 46 149 -112 28 52 -488 7 -36 -190 58 -128 100 -193 -46 -88 30 -93 143 210 175 -186 102 308
7611C08j75l0j54J38k53J06J80j39l8J94j35Mk51K69k38o2K06J71j93kK28l61
$$ 308 133 103 -51 87 -166 -60 120 -19 -57 137 2 6 -245 24 -214 -276 -70 101 -92 -94 134 -227
7633b27K31N0M13l56j56NO2pM6j22l13J95J82J10l0j80J5K44k38K44j34j81R7
$$ -227 4 54 467 111 -45 -40 22 15 61 -61 -374 -179 3 113 83 -97 -82 162 -76 168 34 -147 -50
7656e0j08J94k8M7j20L8J04j19q8o8J33M47o62K22L88n26J53J67k8M9J52m19l31
$$ -50 -158 36 8 55 -65 -27 77 -42 -130 -198 -65 382 -280 -58 330 -196 -43 124 96 145 297 -122 -453
7679d53P09l73q8R1K22l35J94oJ08m6R2j12j14J26j05n2K18j01n2j98M02j34Q5
$$ -453 256 -117 -205 -114 108 -227 -33 -39 69 23 115 3 -111 15 -90 -142 76 -25 -77 -275 127 -7 78
7702G8p6K23l5l10J76RJ23k28P3m4p7N3L5j54Q4No9K78q6Lq7k51K72K32k60J60
$$ 78 2 225 190 -120 56 65 188 -40 33 -11 -88 -35 0 -154 -70 -65 -134 144 58 61 -26 -277 -5 227 -33 127
7728A27J6n6k0N9j64M5o9J64P5k94KJ77J6j01K50l27K42j74J19j15r4J20J2NM1
$$ 127 143 87 67 126 -38 7 -62 102 177 -117 -115 62 78 -23 227 -100 142 -32 87 -28 -122 -2 10 15 56
7753E6j40J52M0k00o1J2p4M72j61q8k4m9J70J55j24o3o4p7M2k6N6R6j41m2P6j18
$$ 56 -84 68 108 -92 -153 -141 -215 257 96 8 -16 -65 105 260 136 73 9 -68 -26 -52 4 100 -41 -83 -7 -125
7779a25L10o9j63l4J79k39%J87K4J17l18K1N1R6j51k3M60k85q1L39k91J39k27
$$ -125 185 116 -47 -81 98 -141 -141 46 70 187 -131 -110 -59 37 -114 -137 323 38 -43 296 5 144 -83
7802h3J69J17k81J65L4J66k41J01j59R1l4o3J91Lj70l76J70K78p1J16n4p7k06
$$ -83 86 203 -78 87 121 287 46 147 -12 79 45 -18 173 176 6 -370 -200 78 7 123 69 -8 -214
7825b14K46o7k6o4L26k75K98k82L6M3Ko4p5M5m3l5J81J1L7k69jL10q8J4J09K9
$$ -214 32 -35 -61 -125 201 -74 224 -58 -22 21 23 -41 -116 -71 -114 -149 32 43 80 -189 -190 120 32 46 155 184
7851A84k40O4j84J11J1%K55q4j37J4J9P8j19N7P2j99K1O8m2J12l6J5k17K70q1
$$ 184 -56 8 -176 -65 -54 -54 201 117 -20 -6 13 91 -28 29 101 -98 -77 -9 -51 61 25 40 -177 93 12
7876A2J91k49j21L05p1J44j59Q8N2j49l55M98j60%j14M8J12O3p9l21J13M18j13
$$ 12 203 -46 -167 138 67 211 52 140 192 43 -312 186 26 26 -88 -40 72 135 56 -265 -152 266 153
7899A53%j4j03J3j58R7RpK27l71J96P7J8l87M08P8k81K8l7Q2q2j22J09J41K03
$$ 153 153 139 36 49 -109 -12 -3 -10 217 -154 42 119 137 -250 158 236 -45 -17 -54 28 -54 -176 -67 74 277
7924B77j18k38P2o8R6rM2k47L39k48O1K62j91l5j36j6J05L20l40K61j68K6j10
$$ 277 159 -79 -7 -75 21 12 54 -193 146 -102 -41 221 30 -5 -141 -157 -52 268 -72 189 21 47 -63
7947f3J4q5J61K9j02J6R3P6j32Pr0r5K36j00j18J55n9k4j7K17j28K54k25j28K45
$$ -63 -49 -134 27 56 -46 -30 63 139 7 14 -76 -171 65 -35 -153 2 -57 -81 -98 119 -9 245 20 -108 137
7972A37j59L06n2j43n6k0q9M6k04Q1j3J37r3L24l25J09k6L1j62L58l22J5J64L4
$$ 137 -22 284 232 89 33 13 -76 -30 -234 -153 -166 -29 -122 202 -123 -14 -40 -9 -171 187 -135 -120 44 78
7996G8j3k19K01k28K43k6nq3J99j04J45k30J94r8J52k68J98r7P4k52r8K58P5K15
$$ 78 65 -154 47 -181 62 36 31 -52 147 43 188 -42 152 54 206 -62 136 39 113 -139 -237 21 96 311
8020C11j93J19l08M06k39l7j81J10O8K21l45j2J70M3J25l01J86j25q2NK43l56
$$ 311 118 237 -71 335 96 59 -122 -12 56 277 -68 -80 90 133 258 -43 143 18 -64 -59 184 -172
8042a72K21O3n7j40J29Q8J32k70L7P9l54L23j41K34l19P6l58O51j82r4J71j88
$$ -172 49 112 55 -85 44 132 264 -6 31 110 -244 79 -62 172 -147 -71 -429 222 40 -54 117 -71
8064g1o8l5P1o4L77k06J66j77j2K8k66M80j40j36J32K2k54J21K3L8q8K64l63N0
$$ -71 -139 -174 -103 -167 210 4 170 -7 -19 9 -257 223 83 -53 79 101 -153 -32 -9 29 -59 205 -158 -108
8088a08J92k18M4n2j66J84J15J20kj38J85k04K1L58l99LK01j04j23L4K34p2j07
$$ -108 84 -134 -90 -142 -308 -124 -9 111 109 -29 156 -48 -27 331 -68 -65 136 32 -91 -57 177 105 -2
8111bj13L46k37j41K96k03K62k14J57k98j2j3J92K0PJ3k79L05k17J37L1l28L02
$$ -2 -115 231 -6 -147 149 -54 208 -6 151 -147 -159 -172 20 40 47 60 -219 86 -131 6 37 -291 11
8134A1J97n91N52l02L48k39J23K4j95m0M26l68R8n3m8K43N7K3m17J15j06K92P7
$$ 11 208 -383 169 -133 215 -24 99 123 -72 -112 314 -54 44 -9 -57 186 243 266 -151 -36 -142 150 227
8157B27j54k29K02J08l68O8K91k39J18K27j90j2l9L2P7j78j38L3K4J06J3L7k69
$$ 227 73 -156 46 154 -214 -146 145 -94 24 251 61 49 10 42 119 -59 -197 -164 -140 -34 -21 16 -253
8180b53L25j95N1k51N14j98J36k67P1j44K74
$$ -253 72 -123 -72 -323 191 -7 129 -138 -67 -211 63
8191F3
$$ Imaginary data points
##PAGE= N=2
##DATA TABLE= (X++(I..I)), XYDATA
0@%%%%%%%%%%%qJ6j6J6j6K4l2L9m7N6o4P2q8J04j21J44j68J93k24K56k89L30l76
$$ 0 0 0 0 0 0 0 0 0 0 0 0 -8 8 -8 8 -8 16 -16 23 -24 32 -32 40 -48 56 -65 79 -89 104 -120 136 -153 177 -199
34a99M23m77N38o03O74p53Q37r30J033j146J269j401J547j706J881k072K282k516
$$ -199 224 -253 285 -318 356 -397 440 -490 543 -603 666 -735 812 -894 987 -1085 1197 -1319
52a319K772l058L376l734M142m607N143n773O529p443Q583j0055J2030j4840J9199
$$ -1319 1453 -1605 1771 -1963 2179 -2428 2715 -3058 3471 -3972 4611 -5444 6586 -8254 10945
67A0945k6939M4877j68947p8293J68478l387R6590Q9050K8306k2905P810m6298
$$ 10945 -15994 28883 -140064 -218357 -49879 -53266 43324 132374 160680 137775 145585 99287
79I9287p0012o2462l4371m9740o812J4079J3327L5965N7812L1862M7912L8089
$$ 99287 29275 -33187 -67558 -117298 -124110 -110031 -96704 -60739 -2927 28935 76847 114936
91A14936k791k4726k4247l8700n2139n4839j8415k115N445L5747N0569M4013M4633
$$ 114936 112145 87419 63172 24472 -27667 -82506 -100921 -103036 -97591 -61844 -11275 32738 77371
104G7371J8437o12j1125l5859l8668l6996m7446j7037J0629Q958K3049L9612L8045
$$ 77371 95808 95196 84071 48212 9544 -27452 -74898 -91935 -81306 -72348 -49299 -9687 28358
117B8358K7730J2260P566p230k4523k3095l1709l2462j1416j0520k411J8133J9290
$$ 28358 56088 68348 75914 68684 44161 21066 -10643 -43105 -54521 -65041 -67452 -49319 -30029
130c0029L0058L6543J6050O130K352q316k3761m0786k3727o428k1352j282L1065
$$ -30029 29 36572 52622 58752 61104 52788 29027 -11759 -35486 -41914 -63266 -64548 -33483
143c3483K2191K2651K8873J3238P22n955j5322k4263k8940j8437j1187o255R375
$$ -33483 -11292 11359 40232 53470 54192 48237 32915 8652 -20288 -38725 -49912 -56167 -46792
156d6792J0502K0890L6936J8484P771J6064k946k3451k5441k5454k1303k0040
$$ -46792 -36290 -15400 21536 40020 47791 63855 60909 37458 12017 -13437 -34740 -54780
168e4780j1515O457J2484K4815L3527K1157J9732J4121m905r896k1677l3646k0372
$$ -54780 -66295 -59838 -47354 -22539 10988 32145 51877 65998 61093 51197 29520 -4126 -24498
181b4498j9243k1455k22J5267K0384K3272K5519K5740J3230J068n813k3266k5183
$$ -24498 -43741 -65196 -65418 -50151 -29767 -6495 19024 44764 57994 59062 53249 29983 4800
194D800j7705k3469j4215j285J697J8034K0940J4308K4224K2189L431o573r886
$$ 4800 -12905 -36374 -50589 -51874 -50177 -32143 -11203 3105 27329 49518 52949 46376 36490
207C6490j3299k5715k7866j1402r285m084J8424J9298J4992K5571J8279O205K22
$$ 36490 23191 -2524 -30390 -41792 -51077 -55161 -36737 -17439 -2447 23124 41403 47608 47830
220D7830r634j3681j9081k3393j8380j1885J975Q599O382K2968K9163J1431R042
$$ 47830 38196 24515 5434 -17959 -36339 -48224 -46249 -37650 -31268 -8300 20863 32294 41336
233D1336N513r120j4059j7716j7394j3101j2993j022O377L964J5141K0064J3975
$$ 41336 46849 37729 23670 5954 -11440 -24541 -37534 -38556 -32179 -28215 -13074 6990 20965
246B0965J0728M036J116m196k0489j9432j1283j5098o485M506R622J6596J7558
$$ 20965 31693 35729 36845 32649 12160 -7272 -18555 -33653 -40138 -35632 -26010 -9414 8144
259H144J6009J0837R0j754r581k0107j4674j1933r505Q26N70O632K0226J3817
$$ 8144 24153 34990 35080 33326 23745 3638 -11036 -22969 -32474 -31648 -31078 -24446 -4220 9597
273I597R405J1693M868l208j0524j2844j2940j7948r965q85l373Q835J8763J2485
$$ 9597 19002 30695 35563 32355 21831 8987 -3953 -21901 -31866 -32751 -36124 -27289 -8526 3959
287C959J3469J2176N369K155q334j6248j3831j4814j2560q737r34J2196J0839
$$ 3959 17428 29604 34973 37128 28794 12546 -1285 -16099 -28659 -37396 -38330 -26134 -15295
300a5295J2200K1288J1108L163L802q475j4951j2433j2978r491q765l359Q982
$$ -15295 -3095 18193 29301 32464 36266 27791 12840 407 -12571 -22062 -30827 -34186 -25204
313b5204R290R382J4896J1391R933L254n931n279j1706j7628j1594j0437n830
$$ -25204 -15914 -6532 8364 19755 29688 32942 27011 21732 10026 -7602 -19196 -29633 -35463
326c5463N364Q325J2372J4988J2758J2654L827o079o510j2446j4665j2389j2101
$$ -35463 -30099 -21774 -9402 5586 18344 30998 34825 28746 22236 9790 -4875 -17264 -29365
339b9365j285L419K145J2623J6580J0199J0398O490j480n944j1036j1413j3942
$$ -29365 -30650 -27231 -25086 -12463 4117 14316 24714 31204 29724 23780 12744 1331 -12611
352a2611j3641k073J655J774J1392J1802J0834J1610L587J685j61r389j2538j2181
$$ -12611 -26252 -28325 -26670 -24896 -13504 -1702 9132 20742 24329 26014 25853 16464 3926 -8255
366h255j0128o397m485M917J0542Q277J4492J4203J776O35k028j0851j1983j1602
$$ -8255 -18383 -24780 -29265 -24348 -13806 -5529 8963 23166 24942 25577 23549 12698 715 -10887
380a0887p958l246l651L824J0225Q870J1407Q854M942L958m237p275q170j4182
$$ -10887 -18845 -22091 -25742 -21918 -11693 -2823 8584 17438 22380 26338 22101 14826 6656 -7526
394g526j0297n084m836K423Q168R716J3297R402P619O633k262p376j0259j2429
$$ -7526 -17823 -22907 -27743 -25320 -17152 -7436 5861 15263 22882 29515 27253 19877 9618 -2811
408b811r738j1073p308M134M824P539J6294J2388P615O596Q6n712j1974j1597
$$ -2811 -12549 -23622 -30930 -26796 -21972 -14433 1861 14249 21864 28460 28546 22834 10860 -737
422g37q394j1380o614K499L902Q075J0180Q301J1044O937n91M6n735j1274j0980
$$ -737 -9131 -20511 -27125 -24626 -20724 -12649 -2469 5832 16876 23813 23222 23268 17533 6259 -4721
437d721j1495p227l922J56R836J0177R644J5329Q220N94j017p141j0671j0512
$$ -4721 -16216 -23443 -27365 -27209 -17373 -7196 2448 17777 25997 26591 25574 18433 7762 -2750
451b750j2645o804l693l01P688Q808J0352J2316P105M467P17o410o394j0020j2930
$$ -2750 -15395 -22199 -25892 -26193 -18505 -9697 655 12971 20076 24543 25260 18850 12456 2436 -10494
466a0494o881m727j136L682N462J0119J1297N722O963L331m061n431q708r058
$$ -10494 -17375 -22102 -23238 -19556 -14094 -3975 7322 13044 20007 23338 19277 13846 5138 -3920
480c920q377q407n78L368K115J0715J2901N524N332K202k746o212j0477p645p038
$$ -3920 -12297 -20704 -21282 -17914 -15799 -5084 7817 13341 18673 20875 18129 11917 1440 -6205 -13243
495a3243o292J11K985N130R759O247O203Q111K11k409k485q776r574p932n986
$$ -13243 -19535 -19424 -16439 -11309 -1550 4697 10900 19011 19222 16813 14328 5552 -4022 -11954 -17940
510a7940k333r56N535J0044P034R715Q662J403n65m157r115p557q683q344l447
$$ -17940 -20273 -21229 -15694 -5650 1384 11099 19761 21164 20599 16442 7327 -230 -8913 -17257 -20704
525b0704j047L871P857Q038J0637P861L630K436m666q172p539r907p736l413j073
$$ -20704 -21751 -17880 -10023 -1985 8652 16513 20143 22579 17913 9741 2202 -7705 -15441 -18854 -19927
540a9927M226N493O248J0140O012L533M129k448n709o412q340p054o962m038L666
$$ -19927 -15701 -10208 -3960 6180 12192 15725 19854 17406 11697 5285 -3055 -10109 -17071 -21109 -17443
555a7443L390O209J1785Q043M981L561k134m427p642j0101o429n827k867K455
$$ -17443 -14053 -7844 3941 11984 16965 20526 18392 13965 6323 -3778 -10207 -16034 -18901 -16446
569a6446L107P109P902N088P255L951k810k104n000p838o667n699k162M2L65N839
$$ -16446 -13339 -6230 1672 6760 14015 17966 15156 13052 8052 214 -6453 -12152 -14314 -14272 -13907 -8068
585h068O864M854O257L385J60n87m620n438m980p292l402j335Q69N568N629O423
$$ -8068 -1204 3650 9907 13292 13452 12865 8245 2807 -2173 -9465 -12867 -14202 -13333 -7765 -2136 4287
601D287P026K063O82j293o717o001n652n801j165K42J913N575L843M994N864J225
$$ 4287 11313 13376 14058 12765 6048 47 -5605 -11406 -12571 -12329 -10416 -4841 -998 3996 9860 11085
617A1085J323j95m645m629n810n045m534l451J432N039L592Q258P954L805K257
$$ 11085 12408 12213 7568 2939 -2871 -7916 -12450 -15901 -14469 -9430 -5838 2420 10374 14179 16436
632A6436q93m834n612q295p010l899k281J954L788N299Q159M557M177M750j725
$$ 16436 15543 10709 5097 -3198 -10208 -14107 -16388 -14434 -10646 -5347 2812 7369 11546 16296 14571
647A4571m322l298o693o386n035k936J001J109L670Q113N145M477M360L1r35l823
$$ 14571 10249 6951 258 -6128 -11163 -14099 -13098 -11989 -8319 -206 4939 9416 13776 13807 12872 9049
663I049o516n331o485n656m13R28M564P033N986P094M612O1m03m592p174n380
$$ 9049 2533 -2798 -9283 -14939 -15352 -14424 -9860 -2827 3159 10253 14865 14926 14523 9931 2757 -2623
679b623o219l835j70k75L551M712L944O834L948J551K209k316m165l905o112n020
$$ -2623 -8842 -12677 -12847 -13122 -9571 -4859 -915 5919 9867 11418 13627 11311 7146 3241 -2871 -7891
695g891m208k335K762L455M283P408M255K919J933k061l024m516o174l475k436
$$ -7891 -12099 -14434 -11672 -8217 -3934 3474 7729 10648 12581 10520 7496 2980 -3194 -6669 -9105
710i105j509J640K333M622M694K303M221J754l409k262l316m971l287k902jJ968
$$ -9105 -10614 -8974 -6641 -2019 2675 4978 9199 10953 7544 5282 1966 -3005 -6292 -9194 -9195 -7227
726g227J289N041M288K250L014P15j552j334m289m037l451m363j497J169K201
$$ -7227 -5938 -897 3391 5641 8655 9370 7818 6484 2195 -1842 -5293 -9656 -11153 -9984 -7783
741g783N230M292M922M610J76r94k159o288m606m460l573m27R39K391N412L903
$$ -7783 -2553 1739 6661 11271 11447 10453 8294 2006 -2600 -7060 -10633 -11060 -10121 -7730 -2318 1585
757A585M169M211K87n00j985m568l533m661l734r80q19J897N054L347M455M299
$$ 1585 5754 9965 10252 9752 7767 3199 -334 -4995 -8729 -9709 -10528 -8631 -3577 -230 4225 8524
773H524J320J166j370m221l376o066m652j766j637J575L391M048O566M259L180
$$ 8524 9844 11010 9640 5419 2043 -4023 -8675 -10441 -12078 -10503 -7112 -3064 3502 7761 10941
788A0941L089k035m654m296n347n086l248j896J836K116L446N629M317L330K646
$$ 10941 14030 11995 7341 3045 -2302 -7388 -10636 -12532 -10696 -8580 -5134 495 4812 8142 10788
803A0788j35j74k893n469l987m613m243o41K62K706M996M096N526L766N64O9k680
$$ 10788 10653 10479 7586 2117 -1870 -6483 -10726 -11367 -11105 -8399 -3403 693 6219 9985 10549 10618 7938
820G938m969l616m591k805m83j097K816L781K972M433K845O28M25k345k701l141
$$ 7938 2969 -647 -5238 -8043 -8526 -9623 -6807 -3026 -54 4379 7224 7852 8277 5932 3231 90
836I0m313k227j019o62K603K898K636M055J825J628Q49k817k150k449m739k273
$$ 90 -4223 -6450 -7469 -8131 -5528 -2630 6 4061 5886 7514 8363 5546 3396 947 -3792 -6065
852f065j471m97J535J815L757M598J999K578P57k883k403l146l866k123k078j29
$$ -6065 -7536 -8033 -6498 -4683 -926 3672 5671 8249 9006 6123 3720 574 -3292 -5415 -7493 -7622
868g622K136J314L328L142J869K331K35o07q12l738l300k147k945r72J230J537
$$ -7622 -5486 -4172 -844 2298 4167 6498 6733 6126 5314 1576 -1724 -3871 -6816 -7788 -6558 -5021
884e021L585K884L306K997L0j010j575l612l550k613k610n45n8J612L844L143
$$ -5021 -1436 1448 4754 7751 7781 6771 5196 1584 -1966 -4579 -7189 -7734 -7792 -6180 -2336 807
900H07L543L564N89k78j378l903k883m322l262j011l27J656L340L078L863K988
$$ 807 4350 7914 8503 8225 6847 2944 61 -4261 -7523 -8534 -8861 -7205 -3865 -787 3076 6064
916F064J053J277o45l272j988m094l552j607j534P93J690K377M816K971J635K189
$$ 6064 7117 8394 7749 4477 2489 -1605 -5157 -6764 -8298 -7505 -5815 -3438 1378 4349 5984 8173
932H173p42k318k083m137k461j763j868R63J527K090L388K068K161J336q87p56
$$ 8173 7431 5113 3030 -1107 -3568 -5331 -7199 -6236 -4709 -2619 769 2837 4998 6334 5447 4691
948D691j780l743j966j864j522Q85J043J796K602J727K654J273q70l90j488k696
$$ 4691 2911 -832 -2798 -4662 -6184 -5299 -4256 -2460 142 1869 4523 5796 4926 4536 3048 352
964C52j934k421j088l50j32K255K554J824L114J344q1j70k078k649j978k894p29
$$ 352 -1582 -4003 -5091 -5441 -5573 -3318 -764 1060 4174 5518 5437 5267 3189 540 -1438 -4332 -5061
981e061J85L22K205J767J779K119N84L08O98k432j758j038k623j105o51J80J770
$$ -5061 -4876 -4554 -2349 -582 1197 3316 3900 4208 4906 2474 716 -322 -2945 -4050 -4701 -4521 -2751
998b751J415K225K891Q62O24n90k338j631k510k517n40q17P52K215J868K768K056
$$ -2751 -1336 889 3780 4642 5266 4676 2338 707 -1803 -4320 -4860 -5677 -4925 -2710 -842 1926 3982
1015C982P15J357o59k276j458l006k942p90j065P54J778J590K926K106J246J312
$$ 3982 4697 6054 5395 3119 1661 -1345 -4287 -5077 -6142 -5388 -3610 -2020 906 3012 4258 5570
1031E570o87r50r34l085j966j262k007J25J60J647L162J602K148J924l29j179
$$ 5570 4883 3933 2999 -86 -2052 -3314 -5321 -5196 -5036 -3389 -227 1375 3523 5447 5118 3939
1047C939j028k567j961j905j442M71Q41J464K102J445J806P78l93P06j503k612
$$ 3939 2911 344 -1617 -3522 -4964 -4493 -3652 -2188 -86 1359 3165 3943 3550 4256 2753 141
1063A41j111j651j337k80r2J649J707J268K482J460j62O18j723j816j064k465
$$ 141 -970 -2621 -3958 -4238 -4330 -2681 -974 294 2776 4236 4074 4692 2969 1153 89 -2376
1079b376j592n25n68J448J361K155K593N97J274N05j429j502j779k419j215l97
$$ -2376 -3968 -4493 -5061 -3613 -2252 -97 2496 3093 4367 4872 3443 1941 162 -2257 -3472 -3869
1095c869m72J491J043J724J808M11J298o8j167l49j130j748r09r25r69R05K07
$$ -3869 -4341 -2850 -1807 -83 1725 2136 3434 3366 2199 1850 720 -1028 -1937 -2862 -3831 -2926 -2719
1112b719J983K298P21J662J02r62q47k124k022j208j621J57J601J130J965J453
$$ -2719 -736 1562 2283 3945 4047 3085 2238 114 -1908 -3116 -4737 -4580 -2979 -1849 116 1569
1128A569J642J148j79o02p57k511j999n66j815n9N64L76K002J685J627J637pR5
$$ 1569 3211 4359 4180 3578 2821 310 -1689 -2255 -4070 -4129 -3565 -3189 -1187 498 2125 3762 3755 3850
1146C850p47j516p88j628k008m69q53P6J734R92K398J517R72Q81l57j622j457
$$ 3850 3103 1587 799 -829 -2837 -3306 -4159 -4083 -2349 -1357 1041 2558 3530 4411 4054 2432 975
1163I75k333j478m68o79O65J553Q09J996J272L32Q84p80r59o58k001q40o96j334
$$ 975 -1358 -2836 -3304 -3983 -3318 -1765 -956 1040 2312 2644 3528 2748 1789 1131 -870 -1710 -2406 -3740
1181c740J45P35J420K243R10J435J130l22p84j154k498r23j518j439P14K63J095
$$ -3740 -3595 -2860 -1440 803 1713 3148 4278 3956 3172 2018 -480 -1403 -2921 -4360 -3646 -3383 -2288
1198b288K200J291J980O19O1j92j684j904j159j457o50J18J28J133J611O15J735
$$ -2288 -88 1203 3183 3802 3863 3671 1987 83 -1076 -2533 -3183 -3065 -2937 -1804 -193 422 2157
1215B157P33l12P8r72r16p52j837j126j91m36J417J091J171K227O97N00K44j677
$$ 2157 2890 2578 2656 1684 768 16 -1821 -2947 -3138 -3574 -2157 -1066 105 2332 3029 3529 3773 2096
1233B096j632j149k076n99r4J40J445P54J498K033L54Q74P0j630n45j101j898
$$ 2096 464 -685 -2761 -3360 -3454 -3314 -1869 -1115 383 2416 2770 3644 3714 2084 1539 438 -1460
1250a460q39j406j21J027M97J685J740J007J208M70n44m95j674j836r76j466n70
$$ -1460 -2299 -3705 -3826 -2799 -2302 -617 1123 2130 3338 3808 3264 2769 1095 -741 -1717 -3183 -3753
1267c753P39K76J317J399J417K040j0k15k73j581j536j091j170n40J40L36J751
$$ -3753 -3014 -2738 -1421 -22 1395 3435 3425 3210 2937 1356 -180 -1271 -2441 -2981 -2841 -2505 -754
1284g54R01P60J234K23j05j03r83n27j359j708r0q2k3R37J034J431J518K03P21
$$ -754 147 907 2141 2364 2259 2156 1173 646 -713 -2421 -2511 -2593 -2616 -1679 -645 786 2304 2507 3228
1303C228l09j640j209j387r44m2l87N63J062M30J586Q91K15P31r14m63n98j378
$$ 3228 2919 1279 70 -1317 -2261 -2303 -2690 -2127 -1065 -635 951 1842 2057 2788 1874 1411 813 -565
1321e65r67l21o52O48N38O13J102N62L86P19n75Pq95j076o56m34o13M25R9N13
$$ -565 -1532 -1853 -2505 -1857 -1319 -706 396 958 1344 2063 1488 1495 600 -476 -1132 -1566 -2179 -1754 -1655 -1142
1341a142J616N98J320Mk57n86j102j223p21o96m77O20L84J502J176M13P02M35
$$ -1142 474 1072 2392 2396 2139 1553 451 -772 -1493 -2189 -2666 -2046 -1662 -160 1016 1429 2131 2566
1359B566m77m5r90j017r16j396m50J28J32Q76J183J020J637O69j3j69q83j481
$$ 2566 2089 2044 1054 37 -879 -2275 -2725 -2597 -2465 -1589 -406 614 2251 2920 2907 2738 1855 374
1377C74q84j318p20j08J21J081Q20R43J566J29N46l12p02m80r95j461l06o16q9
$$ 374 -510 -1828 -2548 -2656 -2535 -1454 -634 309 1875 2004 2550 2238 1536 1056 61 -1400 -1706 -2322 -2411
1396b411J182M44O93J353K01O98j91p27l0j202j052o3j070K8N92L3J282J025P24
$$ -2411 -1229 -785 -92 1261 1462 2160 1969 1242 1212 10 -1042 -1105 -2175 -2147 -1555 -1522 -240 785 1509
1415A509O32j07k80n28j394o96j72j240M05M75K96J004N64M20O85q4j07j80r02
$$ 1509 2141 2034 1754 1226 -168 -864 -1036 -2276 -1871 -1396 -1100 -96 468 888 1573 1489 1382 1202 300
1434C00q8r63r91K49R8J31O43N15Q94M87J0K34n17p32l18q08m69J84K7M68P33
$$ 300 212 -751 -1742 -1493 -1395 -1264 -621 -106 788 1275 1285 1519 1002 270 -48 -856 -1325 -1141 -1114 -646 87
1455H7K0J109m1J32R1n25p38n78q32m91K18j33R09O36P26P83M46M6j00q90o41
$$ 87 107 1216 1175 1307 1398 873 135 -443 -1275 -1766 -1548 -1681 -772 -136 590 1373 1819 1865 1765 875 234
1476B34o41j089j43n14J77M92N12R45J009O08L38N56p82n85q56j003n09q20l07
$$ 234 -407 -1496 -1639 -2153 -1976 -1484 -972 -27 982 1590 1928 2484 1702 1117 261 -742 -1251 -2071 -2378
1495b378N32Q29P55J020L74O31M89p13j44j151q30o41r17K70N22K15P89Q68M68
$$ -2378 -1846 -1017 -262 758 1132 1763 2252 1539 1395 244 -586 -1227 -2144 -1874 -1352 -1137 -348 520 988
1514I88Q84r1k56j51j002q67k76o94k0j33LO60P88P84R03K37K56j78o06p34j132
$$ 988 1872 1781 1525 1374 372 -495 -771 -1465 -1485 -1618 -1615 -955 -167 617 1520 1757 2013 1835 1229 495 -637
1535f37p27k79m29M46O70O52P83N67K73O42j18r72J23j125o77j3p50n4K41L58
$$ -637 -1364 -1643 -2072 -1626 -956 -304 479 1046 1319 1961 1843 871 994 -131 -808 -821 -1571 -1625 -1384 -1026
1555a026R65M68L42N33K75o33k33q85n34j24m93k2N02K78P78M80K06N65j96k98
$$ -1026 -61 407 749 1282 1557 924 691 -194 -728 -852 -1345 -1367 -865 -587 191 671 877 1442 1246 948
1575I48l51j054l99l42n10N42J80M76R37L50L66N26m77k98k14p91l89o48l05J63
$$ 948 597 -457 -856 -1198 -1708 -1166 -986 -510 427 777 1143 1669 1192 894 680 -111 -500 -1148 -1453 -1290
1595a290K43j8R46N03N60O81l2m8j64j007n96q64n57K74j84N59P69K97M69O68
$$ -1290 -1047 -1065 -119 384 944 1625 1593 1545 1381 374 -222 -1086 -1643 -1369 -1553 -994 -225 72 541 1209
1615A209j19L95p41l64j26j120k02k81m93P52M87J82R54L64M16J99l89m42n17
$$ 1209 1090 1485 744 380 254 -866 -1068 -1349 -1842 -1090 -603 -421 533 897 1313 1512 1123 681 164
1634A64p37j53q29q3L70L81M40O04O89P64P1r8j66q38p33n75n03n14N01J28O44
$$ 164 -573 -726 -1555 -1638 -1268 -887 -447 157 846 1610 1681 1583 1417 579 -154 -729 -1232 -1746 -1245 -1117 -473
1655d73M17M84O71L44j52O0n01l56o84r20l8k11j57O65L30P24N17Q3L13J86l85
$$ -473 -56 428 1099 1443 1291 1351 850 494 -190 -1110 -1148 -1359 -1516 -851 -521 203 720 803 1116 1302 917
1676I17o22l62r35J43k63J35N76J5O07N28K65k39J70n70j49p25l40L09n14o6N66
$$ 917 295 -67 -1002 -859 -1122 -987 -411 -396 211 739 1004 765 935 365 216 -509 -849 -540 -1054 -1120 -554
1697e54L27Q04j2K80L76k8p29m3n89m21l45k13j07K81J45Q65L03O63M06k06k83
$$ -554 -227 577 565 845 1221 1193 464 421 -168 -589 -934 -1147 -1254 -973 -828 37 340 1003 1409 1203 920
1718I20k84n91m80n10j12r7K27K62O80J76N68K09j5j47k95o21J78m76o66K75j10
$$ 920 636 45 -435 -945 -1057 -1154 -927 -665 15 191 759 968 953 806 511 -110 68 -408 -1074 -799 -909
1739i09L86L67M4Q20J98J13L0m53n00k29o73j77%l71M80R96R8N41K47J89ro84
$$ -909 -523 -156 -112 708 906 1019 1049 596 96 -133 -806 -983 -983 -1354 -874 122 220 761 1008 1197 1188 504
1761E04m27k21p65k47j6P3L45K89L68P84J52p6L04n88K79o95m96K6o5l60oK86
$$ 504 77 -144 -909 -1156 -1172 -1099 -754 -465 -97 687 839 763 1067 479 758 63 -433 -407 -472 -832 -838 -552
1783e52J27K04O96K70n2L6J0r14k69L7n49J94K12PO56M77j56K31j39k87O0n37
$$ -552 -425 -221 475 745 693 729 739 -175 -444 -407 -956 -762 -550 -543 113 590 434 665 526 239 299 -238
1805b38k77M23o08Q2J66J94M82L83q7k1J27k24L48p72k66l30J69l17Q2k56P63
$$ -238 -515 -92 -700 -618 -452 -258 224 607 520 499 626 402 750 -22 -288 -618 -449 -766 -684 -940 -177
1826a77K10K24Q78k47J47l93o34K0m39l90J92j52K87K92K5M70L64q3R4m40l73
$$ -177 33 257 1135 888 1035 642 8 28 -411 -801 -609 -761 -474 -182 -157 313 677 594 688 248 -125
1847a25k9l35%jl15K88L44P0O75L2L14K33l40n70o5o73q6l70Q3O38K4K89M39L00
$$ -125 -154 -489 -489 -490 -805 -517 -173 -103 572 604 918 1151 811 241 176 -497 -583 -953 -870 -232 -208 81 520 820
1871H20o9J97o47N6l70o28L44n41j65O64j59K07N87n6N70J0m10n4k1m56j57n56
$$ 820 751 948 301 357 -13 -641 -297 -838 -1003 -339 -498 -291 296 240 810 820 410 356 335 -121 -278 -834
1893h34M34j46j24M24P9L93J02J51n8O4k34n03J18l06j93PL82L03K33K74R6j96
$$ -834 -400 -546 -670 -246 -167 226 328 479 421 485 251 -252 -134 -440 -633 -626 -244 59 292 566 662 466
1915D66l4j81k73j54m20r1L74l12J34L02J09L95K55M2K74k46k03l15n94l15L25
$$ 466 432 251 -22 -176 -596 -687 -313 -625 -491 -189 -80 315 570 612 886 640 437 122 -472 -787 -462
1936d62k93j64N29M54K91K90K25j94j09l23K6o17j51O7k35J02p9L16N68J90R5
$$ -462 -755 -919 -390 64 355 645 870 676 567 244 270 -347 -498 -431 -666 -564 -643 -327 241 431 526
1957E26R0r1m3k67m91j35k44r2J66J70L9N20K37K8M44Q2j14o35j23l31o43j28
$$ 526 616 525 482 215 -276 -411 -655 -747 -581 -411 -372 148 385 413 857 939 825 190 67 -264 -907 -1035
1979a035R1M29L78L75k23O47K65k48J02m47r6m76l27k29J5L4J26L04P3L07M33
$$ -1035 -944 -515 -137 238 15 662 927 679 781 334 238 -238 -565 -794 -779 -745 -619 -315 -242 65 498
2000D98J55P9l29k28R4n76l2q9n1j58P3O19P3K94m7J84j65J82l27l92q1k56p8
$$ 498 653 732 403 175 269 -307 -339 -428 -479 -637 -564 55 128 422 375 559 394 576 249 -143 -224 -480 -558
2023e58L58K66l6M37l03L46M2K3M3p44j34m5p3p2J13J13J61M84k7P4J52p0R0o23
$$ -558 -200 66 30 467 164 510 552 575 618 -126 -260 -305 -378 -450 -337 -224 -63 421 394 468 620 550 640 17
2047A7j42j24k91O8k7j8M65L11R9K26k17L0J24m43Q3k24k52j83j52J37M60l2K44
$$ 17 -125 -249 -540 -472 -499 -517 -52 259 358 584 367 397 521 78 161 -63 -315 -498 -650 -513 -53 -85 159
2070A59K86J21m5n3j83k86O7o90M52m49J40L87L15n9K09j65K94l1k82J13p80K2
$$ 159 445 566 521 468 285 -1 66 -624 -172 -621 -481 -94 221 162 371 206 500 469 187 300 -480 -458
2092d58j45o6r6M57J50K76J68K61J9J58j96j95n56j30j91l48K25N1n0L50N46o7
$$ -458 -603 -669 -765 -308 -158 118 286 547 566 724 528 333 -223 -353 -544 -892 -667 -616 -666 -316 230 163
2114A63L08L9K12k69j94O4m96l32M50m91l2P22l52M63R9PJ80j58l97J04l27r5
$$ 163 471 510 722 453 259 323 -173 -505 -55 -546 -578 144 -208 255 354 361 541 383 -14 90 -237 -332
2136c32o8J77l85Q82j77K29L05j27k59j5k67Q4l64K47m25K12L41k15K55J21K7
$$ -332 -400 -223 -608 274 97 326 631 504 245 230 -37 47 -317 -70 -495 -283 58 -157 98 219 246
2157B46J55K4P2n43N4j15k20J01%J06n0K22K73j64L88k80j27n6k86j41M03l62
$$ 246 401 425 497 -46 8 -107 -327 -226 -226 -120 -170 52 325 161 549 269 142 86 -200 -341 62 -300
2179c00L4Q9j44N85Kk83R2K05k10J06m54J17j98Q7R0Q9o7K84M6r2M60j20R5l61
$$ -300 -266 -177 -321 264 266 -17 75 280 70 176 -278 -161 -359 -272 -182 -93 -160 124 170 78 538 418 513 152
2203A52n79L26k96j60L01m40N17K57J95K09k8k33K34j60m21O7k36j47o9M1N32
$$ 152 -427 -101 -397 -557 -256 -696 -179 78 273 482 454 221 455 295 -126 -59 -295 -442 -511 -470 62
2224F2l5j75L39J77qJ61p7l08o2q1j40R7l15M8K65k84N56O2l45L02M2k82kk84
$$ 62 27 -148 191 368 360 521 444 136 74 -7 -147 -50 -365 -317 -52 -336 220 282 -63 239 281 -1 -3 -287
2248b87J08j06l02L86k4L56K52J00l80J0J16k58o1j22n3J12j37K36k28K71M8q2
$$ -287 -179 -285 -587 -201 -225 131 383 483 103 113 229 -29 -90 -212 -265 -153 -290 -54 -282 -11 37 -45
2270d5J79L0Q5M5j54l47J28l14J6O5QJ11M14Q3Qm3j77J88m10p7j2J5LJ60KL7J16
$$ -45 134 164 249 294 140 -207 -79 -393 -377 -312 -304 -193 221 304 312 269 92 280 -130 -207 -219 -204 -201 -41 -39 -2 114
2297A14o5J22j51J28J99m68j12k1k7M67l18q5K53KJ03L17j16mJ0k04K00o12J1
$$ 114 49 171 20 148 347 -121 -233 -254 -281 186 -132 -217 36 38 141 458 342 338 348 144 344 -268 -257
2320b57M7k80J21J09K48L06m5O0J05j4j27k17l13j74K97j63J31P0M9J9L35J43
$$ -257 -210 -490 -369 -260 -12 294 249 309 414 400 273 56 -257 -431 -134 -297 -166 -96 -47 -28 307 450
2342D50k1O7l4m4o76O3J43l04R6J05m8L47k9J31J81p0l20J82j21l62N3k1l5J51
$$ 450 429 496 462 418 -258 -195 -52 -356 -260 -155 -203 144 115 246 427 357 37 219 98 -264 -211 -232 -267 -116
2366a16K0R5N2M65j83M6%m75l7K28l6n21J96J06k09K06J48L8J30J6J70P9k90j21
$$ -116 -96 -1 51 516 333 379 379 -96 -133 95 59 -462 -266 -160 -369 -163 -15 23 153 169 339 418 128 7
2390Gj30M4m66K01J29L0K02L9J61%Q1j74J34l32kk53K27k60K95j11J89LO1j16
$$ 7 -123 -79 -545 -344 -215 -185 17 56 217 217 298 124 258 -74 -76 -329 -102 -362 -67 -178 11 14 75 -41
2414d1J49J30l85J36j92K78j97k08J73J5O7K43l19J72J57m8l7k8l05J32R4Jj56
$$ -41 108 238 -147 -11 -203 75 -122 -330 -157 -142 -75 168 -151 21 178 130 93 65 -240 -108 -14 -13 -169
2437a69j7R3J05J01M66k59k03J89n99L20m2l32J58N5j74K89P2q7L64O3o5k37O0
$$ -169 -186 -93 12 113 579 320 117 306 -293 27 -15 -347 -189 -134 -308 -19 53 -34 330 393 328 91 151
2460A51j0p2k50Q9mq4J59k37K58J39n5J91Q1l32J51k44qk5q1o1N72l08j0L22l40
$$ 151 141 69 -181 -92 -96 -180 -21 -258 0 139 84 275 356 24 175 -69 -77 -102 -183 -244 328 20 10 332 -8
2485hK10K18n25L8l8kq5mN3J21p4K39O7Q4L66m32mj61j93R6j38k13J65j56K94
$$ -8 202 420 -105 -67 -105 -107 -192 -196 -143 -22 -96 143 210 294 660 228 224 63 -130 -34 -172 -385 -220 -376 -82
2510h2K24k72j7K43j1R6Mj46k75J10P0J73l74L26k82J02J36K57k97N8o4j90J27
$$ -82 142 -130 -147 96 85 181 185 39 -236 -126 -56 117 -257 69 -213 -111 25 282 -15 43 -21 -211 -84
2533h4r0q8j6j47O85q7j24K24o1p4j11l8j48K13q3j91O6j63K0M26k22L61L1k9
$$ -84 -174 -262 -278 -425 260 173 49 273 212 138 27 -11 -159 54 -29 -220 -154 -317 -297 129 -93 268 299 270
2557B70n3k29oN9j30k6m1J55j90L07j71P0j74L66j6K8k45J80k18n2L2l5P3L5j30
$$ 270 217 -12 -18 41 -89 -115 -156 -1 -191 116 -55 15 -159 207 191 219 -26 154 -64 -116 -84 -119 -46 -11 -141
2582a41J89K28o9j2k31n1r3J72j43o4r9J73J61j82L45L1L4j19NJ02l37j61K43
$$ -141 48 276 207 195 -36 -87 -180 -8 -151 -215 -314 -141 20 -162 183 214 248 129 134 236 -101 -262 -19
2605a9k81j92K56K12J27k75L70P7j30J03L21o48P7o6O5j28o3L6K44j64K66M5J50
$$ -19 -300 -492 -236 -24 103 -172 198 275 145 248 569 -79 -2 -68 -3 -131 -194 -158 86 -78 188 233 383
2628C83l24n8n2j99J9K72l5j17j15L26R6j24q6l6J70M9Rj25k77M5L36k12J19q2
$$ 383 59 1 -51 -250 -231 41 6 -111 -226 100 196 72 -14 -50 120 169 178 53 -224 -179 157 -55 64 -18
2652a8K42J14r9j63o9J30J1r2j92K7Q8k06K87J17k58K50k39L72P0l37J65l63p
$$ -18 224 338 239 76 7 137 148 56 -136 -109 -21 -227 60 177 -81 169 -70 302 372 35 200 -163 -170
2675a70j25J60q1J70m5j4J61Nk64K55M2J87L9m73m0R7j23Q8m1J66M4J21J4J22
$$ -170 -295 -135 -216 -46 -91 -105 56 61 -203 52 94 281 320 -153 -193 -96 -219 -131 -172 -6 38 159 173 295
2699B95k26n8n0J91k91j80K23J4r6K65q4J92K37l79J14j84J85j98N8j36K88l84
$$ 295 69 11 -39 152 -139 -319 -96 -82 -178 87 3 195 432 53 167 -17 168 -30 28 -108 180 -204
2721b04n2jJ42L97k49rJ90j75qj10K8k29L34j30k75J97L03m16M06l1k01K28K6
$$ -204 -256 -257 -115 282 33 24 214 39 31 -79 -51 -280 54 -76 -351 -154 149 -267 139 108 -93 135 161
2744A61p6l2j84L19l84K48k61M6J36K05m64M24l13J42J03j52J07j56K15j18K0
$$ 161 85 53 -131 188 -196 52 -209 -163 -27 178 -286 138 -175 -33 70 -82 25 -131 84 -34 -14
2765a4o1J66l04L77J40k74J82l81L29q8l33J23r1J0K98k7J38m8L2j61L9o5K80
$$ -14 -75 91 -213 164 304 30 212 -169 160 72 -261 -138 -229 -219 79 52 190 142 174 13 52 -13 267
2788B67m8l71K5J24J68j13q9m16M85p3J69l2k6O5l35J41K1j99LL59m93K64K80
$$ 267 219 -152 -127 -3 165 52 -37 -453 32 -41 128 96 70 135 -200 -59 -38 -237 -234 125 -368 -104 176
2811A76kj38O1o2R9k19o9j13Q7j47J83R2r9J48J35J2j23O5mJ41j56M7k22j45J93
$$ 176 174 36 97 35 134 -85 -154 -267 -180 -327 -144 -52 -151 -3 132 144 21 86 82 223 67 114 -108 -253 -60
2836f0K6Pl1k33L60K01k71J12k4L0n1l25L31k64KK21j7j0J03J55l07o4L27k57
$$ -60 -34 -27 -58 -291 69 270 -1 111 87 117 66 -259 72 -192 -190 31 14 4 107 262 -45 -109 218 -39
2860c9K60r4o1n7l23K98Q4j06l0J09M9l8M3l68M24k69kr7M39l15j27L62R6j6l95
$$ -39 221 127 66 9 -314 -16 68 -38 -68 41 90 52 95 -273 151 -118 -120 -217 222 -93 -220 142 238 222 -173
2885a73KJ88j37K53k87j29K23J5p4J63J27k68P9J81j44J37k18l7k4q8J13PM0j92
$$ -173 -171 17 -120 133 -154 -283 -60 -45 -119 44 171 -97 -18 163 19 156 -62 -99 -123 -211 -98 -91 -51 -243
2909b43K42q2M46l58L76m15j09J15j2J96k29Q9j83M8J06K04m0k74K84o8ol13K03
$$ -243 -1 -83 363 5 381 -34 -143 -28 -40 156 -73 16 -167 -119 -13 191 151 -123 161 93 87 -226 -23
2932b3q4j3P1J32j84K77L5o0j00L7k9j75q4K74j05o7j93Q2K81k04J74K3J06q1
$$ -23 -107 -120 -49 83 -101 176 211 151 51 88 59 -116 -200 74 -31 -98 -291 -209 72 -132 42 65 171 90
2956I0M4L9m73L76N1j50J04k37J04J2n5J12n4K21j63k48K37j26jJ5J02Q0k35N8
$$ 90 134 173 -300 76 127 -23 81 -156 -52 -40 -95 17 -37 184 21 -227 10 -116 -117 -102 0 80 -155 -97
2980i7J48L5j42K70k35K08K1l26R9j26Q3J43k01J80J53l66M02j6m07J28N7J94
$$ -97 51 86 -56 214 -21 187 208 -118 -19 -145 -62 81 -120 60 213 -153 249 233 -174 -46 11 205
3002B05k62Q5j52J69p0k59J75O6L29m2l87L46Qj87j0r9L9k9p1pL67j36kn2J15
$$ 205 -57 28 -124 45 -25 -284 -109 -43 286 244 -143 203 211 24 14 -85 -46 -75 -146 -153 214 78 76 24 139
3027A39j4j41m6mRq7J91l3l2mJ65j16n9l1J46k1L1k13q0K43%J33J5m6l26K42K8
$$ 139 125 -16 -62 -66 -57 -144 47 14 -18 -22 143 27 -32 -63 83 62 93 -120 -200 43 43 176 191 145 -181 61 89
3054H9K2k19j5J56j84K6R2M2k35m2M96j14k64K20J66r7k79n7J15j66L63m13j3
$$ 89 111 -108 -123 33 -151 -125 -33 9 -226 -268 228 114 -150 70 236 139 -140 -197 -82 -248 115 -298 -311
3077c11J93m3K26j84K18j43L89l27k0M8o5K61j40j58nJ83k66K86Q2l16K21j49
$$ -311 -118 -161 65 -119 99 -44 345 18 -2 46 -19 242 102 -56 -61 122 -144 142 224 -92 129 -20
3099b0k1k1R2k37J78k2k49K18K79l14K80N8k17K12m00K13j41J73j14j61M6L29
$$ -20 -41 -62 30 -207 -29 -51 -300 -82 197 -117 163 221 4 216 -184 29 -112 61 -53 -214 -168 161
3121A61k41p7L72m80L96k36L37l40J58j27K7L09l53r4K19m8J59J3j62Jj00L47
$$ 161 -80 -157 215 -265 131 -105 232 -108 50 -77 -50 259 -94 -188 31 -17 142 155 -7 -6 -106 241
3143B41j9j57l0JnJ47k99J6J48K7M7j69Q9J05k32P1j47N7K08o0O4l6K4J00k50
$$ 241 222 65 35 36 31 178 -121 -105 43 70 117 -52 37 142 -90 -19 -166 -109 99 39 103 67 91 191 -59
3168e9J33J10k16K36L0j22k06j16K33OP3l0k56L62J89k64j0k81J43k6k17M18n2
$$ -59 74 184 -32 204 234 112 -94 -210 23 29 102 72 -184 178 367 103 93 -188 -45 -71 -288 130 78
3191G8l82J06M03q3J31j03oj58O9j56j28J45j05J36O7K13l36J48j58k9K9K91j51
$$ 78 -304 -198 205 122 253 150 144 -14 55 -101 -229 -84 -189 -53 14 227 -109 39 -119 -148 -119 172 21
3214B1j34m7L07j82P3j6M59m36nj75L13L8l20r0L28m8k05Q8J75j56R6j58o1l8
$$ 21 -113 -160 147 -35 38 22 481 45 40 -135 178 216 -104 -194 134 86 -119 -31 144 -12 84 -74 -135 -173
3238a73L55j25NL0n0R9n1J2k26K85L7l61k2K2R7J96k32J66j72J48q6j21K01j0
$$ -173 182 57 62 92 42 141 90 102 -124 161 198 -163 -185 -163 -66 130 -102 64 -108 40 -46 -167 34 24
3262B4m5k53L32j3j38J34m2J58QJ07m88J01j5Q5J07j01j29K77k70J84K54l94K74
$$ 24 -21 -274 58 45 -93 41 -1 157 165 272 -216 -115 -130 -45 62 -39 -168 109 -161 23 277 -117 157
3285A57j99Qj76J63J26j33j66L26k07P0j67J40k13L22J2j08Q3M5K2l32L41k67
$$ 157 -42 -34 -210 -47 79 -54 -220 106 -101 -31 -198 -58 -271 51 63 -45 38 83 105 -227 114 -153
3307a53j48M14l62M86K4Kl99k73N58l39K01J65j27m4J63o7O9k57L0J25l39K38
$$ -153 -301 113 -249 237 261 263 -136 -409 149 -190 11 176 49 5 168 101 170 -87 -57 68 -271 -33
3329c3j26K57j61J1K96l46J85j21K27k69K39r9k4r5N3J29j06k4j3q6J2r1L08j91
$$ -33 -159 98 -63 -52 244 -102 83 -38 189 -80 159 60 36 -59 -6 123 17 -7 -20 -106 -94 -185 123 -68
3353f8jJ92j26n6J54j32R5j91n9J21K24j21m2q1q4K27R5k00L0p3l5j25L72Q7j47
$$ -68 -69 123 -3 -59 95 -37 58 -133 -192 -71 153 32 -10 -91 -175 52 147 -53 -23 -96 -131 -256 116 203 56
3378E6k13Q1Nk17K32J25j17k4n2j37J39L28k08J12j1j79N49o26J72j33p9J6P8
$$ 56 -157 -76 -71 -288 -56 69 -48 -72 -124 -261 -122 206 -2 110 99 -80 469 -157 15 -118 -197 -181 -103
3401a03p4J65J36j24kK6k80L27k08K52N9j01k63p8K07J4J11J39j03l30q5L19K61
$$ -103 -177 -12 124 0 -2 24 -256 71 -137 115 174 73 -190 -268 -61 -47 64 203 100 -230 -315 4 265
3424B65k69j15M72m71J25M4j61J69j86MJ64J5j64R8L4J10k44lJ06L1J64l09M1
$$ 265 -4 -119 353 -118 7 51 -110 59 -127 -123 41 56 -108 -10 24 134 -110 -113 -7 24 188 -121 -80
3447h0l9J6R2J74m1j05J56j38k74L20l04rJ20n1J66l07K73n8j04M70j91M4N8k53
$$ -80 -119 -103 -11 163 122 17 173 35 -239 81 -223 -232 -112 -163 3 -304 -31 -89 -193 277 86 130 188 -65
3471f5K53k20J49j01j28J98j20J92k79OJ64j84J66R9k21J13k13J89k42k2N81n34
$$ -65 188 -32 117 16 -112 86 -34 158 -121 -115 49 -135 31 130 -91 22 -191 -2 -244 -266 315 -219
3493b19M03k33K2KK75j00k27k8j46l4L56k98K7J29p6K33j09j02N9L09l17k12J82
$$ -219 184 -49 -27 -25 250 150 -77 -105 -251 -285 71 -227 -200 -71 -147 86 -23 -125 -66 243 -74 -286 -104
3516a04n5J99k04L90l53J50J3l16N61l86m6K28j59j6J00kj67M0K70j11j37l7K
$$ -104 -159 40 -164 226 -127 23 36 -280 281 -105 -151 77 -82 -98 2 0 -167 -127 143 32 -105 -142 -140
3539a40k3J40j2k7OJ97j25R2n0j70k79M38R0l7j99p3L12j00J30R3k68KK39j07
$$ -140 -163 -23 -35 -62 -56 141 16 108 58 -112 -391 47 137 100 -99 -172 140 40 170 263 -5 -3 236 129
3563A29q5k65K19k0r3J22J59r3j37K7K2J04k07M61m82K68o7j29J1K25l60oJ81
$$ 129 44 -221 -2 -22 -115 7 166 73 -64 -37 -15 89 -118 343 -139 129 62 -67 -56 169 -191 -197 -16
3586a6lrMO5K53j78l74K80j69L74k80l9K46k55L9ML78j60Q2l26J96R8j70L7l44
$$ -16 -19 -28 -24 41 294 116 -258 22 -147 227 -53 -92 154 -101 -62 -58 320 160 242 -84 112 210 40 77 -267
3611b67M19j09r3%J9J89j89k01K29JM4L8l87K41p7J92k11J69j37O8K53k86J33
$$ -267 152 43 -50 -50 -31 158 -31 -232 -3 -2 42 80 -307 -66 -143 49 -162 7 -130 -62 191 -95 38
3634C8j11j14J35J62l50Q9J12J11n8Q3N7j9q2J16m05K6L21J22o2k30j59L90k68
$$ 38 -73 -187 -52 110 -240 -151 -39 72 14 97 154 135 53 169 -236 -210 111 233 171 -59 -218 172 -96
3657i6K18l56R0l3J30J98j38l4l0J84k6m8m6K55m33L31j2j28n7J78k55mJ20J40
$$ -96 122 -234 -144 -177 -47 151 13 -21 -51 133 107 59 13 268 -165 166 154 26 -31 147 -108 -112 8 148
3681A48J0k12R1O4J6k91L13m3L5j58J35P9k10J62l03L2J47k0l0j05OJ72K38l32
$$ 148 158 -54 37 101 117 -174 139 96 131 -27 108 187 -23 139 -164 -132 15 -5 -35 -140 -134 38 276 -56
3705e6P8J98l93N4J41N5j78j71K36m1n4R3r2L44j99N5j60Q2M47j34j52l28K53
$$ -56 22 220 -173 -119 22 77 -101 -272 -36 -77 -131 -38 -130 214 15 70 -90 -8 439 305 153 -175 78
3728G8l5J7o1J5P5j05N0N8lL1k18j35K04R1o2J06p4k97K79J04q4m1K5j53k5P3
$$ 78 43 60 -1 14 89 -16 34 92 89 120 -98 -233 -29 62 0 106 32 -265 14 118 34 -7 18 -135 -160 -87
3754h7p6K01k70J85J32o9j64m3J4j31L90j46o4m5P7n9K79k44n2L61l73J04J67
$$ -87 -163 38 -232 -47 85 16 -148 -191 -177 -308 82 -64 -128 -173 -96 -155 124 -120 -172 189 -184 -80 87
3777H7L9j96K57J04k08j12j22L62k4l34L42k0k83J07J8J16j03m1m2N0j9j6L3J65
$$ 87 126 -70 187 291 83 -29 -151 211 187 -147 195 175 -108 -1 17 133 30 -11 -53 -3 -22 -38 -5 160
3801A60Kl26R2J02k26L14j6j80L7J20J6J15l15M9l1N8J79j15J14l31q7K19j00
$$ 160 162 -164 -72 30 -196 118 102 -78 -41 79 95 210 -105 -56 -87 -29 150 35 149 -182 -269 -50 -150
3824a50K6Q2Q5r2N2L23l39L1j92J47J21j30R8j76K2r1J89o1K7j20o7l4M02p6J69
$$ -150 -124 -42 43 -49 3 326 -13 18 -174 -27 94 -36 62 -114 -92 -183 6 -55 -28 -148 -215 -249 153 77 246
3849B46k3k78K25k01J11k37J27r7K15P5k26r6J89k33J81L4n8P0M1j52J69n5p5
$$ 246 223 -55 170 -31 80 -157 -30 -127 88 163 -63 -159 30 -203 -22 12 -46 24 65 -87 82 27 -48
3872d8J72j32k25Q9R6J4J75k01J24l12K40M4n9n4K79j29l86K35j25M34k96j23
$$ -48 124 -8 -233 -144 -48 -34 141 -60 64 -248 -8 36 -23 -77 202 73 -313 -78 -203 231 -65 -188
3894a88K98N9O6j56J71k08j35J82k84M6M0J31K8r5J68j47k94K51N3J3P1m9M1K62
$$ -188 110 169 235 79 250 42 -93 89 -195 -149 -109 22 50 -45 123 -24 -318 -67 -14 -1 70 21 62 324
3918C24l53K88j34k05Q1J82j54j92M88p9m21o4N76j77k82K25P2o8L7l7j27K21
$$ 324 -29 259 125 -80 1 183 29 -163 325 246 -175 -239 337 160 -122 103 175 107 144 107 -20 201
3940B01l05l04J78K92N0q5q1R8J43k31n0J34k29K7K28k55L96k92l30M25j92J32
$$ 201 -104 -408 -230 62 112 27 -54 44 187 -44 -94 40 -189 -162 66 -189 207 -85 -415 10 -182 -50
3962e0k80J78L77k20n3J02j9k94L42L2j17K69l10L28r5j65M9m9%j53NJ54J11m26
$$ -50 -330 -152 225 5 -48 54 35 -259 83 115 -2 267 -43 285 190 25 74 25 25 -128 -123 31 142 -284
3986b84L58k0k59K4K12J8l59L96K1M9P0k83L4j70L61k77K4J78j91N6K6l1Pn1L4
$$ -284 74 54 -205 -181 31 49 -310 86 107 156 226 -57 -23 -193 168 -109 -85 93 -98 -42 -16 -47 -40 -91 -57
4011e7l7K31p3J07r7j21n4R2r9L37j34k44RL47l16R7Q9k86M18j20j67l3L02k50
$$ -57 -94 137 64 171 74 -47 -101 -9 -108 229 95 -149 -140 207 -109 -12 77 -209 209 89 -78 -111 191 -59
4035e9O1mN4Q0k82O6L18j70MJ53l14L11j68m7J41k68K43q7j04J14r9P7M2P4l09
$$ -59 2 -2 52 132 -150 -84 234 64 68 221 -93 218 50 3 144 -124 119 32 -72 42 -57 20 62 136 -173
4060a73O0K83J09m33R3l00M86k8J71k88N8m1J3Q1l9p1R1j60K42k42J18N6J3j04
$$ -173 -113 170 279 -154 -61 -361 125 97 268 -20 38 -3 10 91 52 -19 72 -88 154 -88 30 86 99 -5
4084eN9p5Kn0J54j4R3j70J30l4j83R8k40L8J73Q2r5J14l00L61j18J8j05P6p9P5
$$ -5 54 -21 -19 -69 85 71 164 -6 124 90 -93 5 -235 -197 -24 58 -37 77 -223 138 20 38 -67 9 -70 5
4110Emj87J73k03Q2K15j91K67j98K6p4O2p8L4P3J54n1k08N2J06K5j46P8j45K38
$$ 5 1 -186 -13 -216 -134 81 -110 157 -41 -15 -89 -27 -105 -71 2 156 105 -103 -51 55 80 -66 12 -133 105
4135A05r6j22j04J71J73k59L01q4k81J61K36l74O2J2J14K8l58N78m00M58k11k22
$$ 105 9 -113 -217 -46 127 -132 169 85 -196 -35 201 -173 -111 -99 15 43 -315 263 -137 321 110 -112
4157a12J33K6L6l0J08l82L86j81R1k09K10J42j93k8k13J24m7J79Q5k89Ko3Q9M5
$$ -112 21 47 83 53 161 -221 165 -16 75 -134 76 218 25 -3 -216 -92 -139 40 125 -164 -162 -225 -136 -91
4181i1R9j5J48l2j16j8J58j42K06kj36Q5k89J79j07Q6m5J70r5m1j17Q6R2m2k05
$$ -91 8 -7 141 109 -7 -25 133 -9 197 195 59 144 -145 34 -73 13 -32 138 43 2 -115 -29 63 21 -184
4206a84K36p8R5j59K4K48j65j9Q9K9J87j16k56J26N5k81p8K94p8K79k78m0Q6j27
$$ -184 52 -26 69 -90 -66 182 17 -2 87 116 303 187 -69 57 112 -169 -247 47 -31 248 -30 -70 16 -111
4230a11J3lJ01j6l7J01m2k75M91n4k54M8J52k87O9J67j20J30P6j8o0l13K65J89
$$ -111 -98 -101 0 -16 -53 48 6 -269 222 168 -86 -38 114 -173 -104 63 -57 73 149 131 71 -242 23 212
4254B12k3j46R9rO9k86J54J06l0k96Q7j80R5L86k10q6k07K38Q8j50J43m1j46J62
$$ 212 189 43 142 133 202 -84 70 176 146 -150 -63 -243 -148 238 28 -58 -265 -27 61 -89 54 13 -133 29
4278B9Q5l42K67J99l38M0R5r7J59j66l8o9m0J32J07j0l1Q2J8j21o8k6N4k2K21
$$ 29 114 -228 39 238 -100 -60 35 -62 97 -69 -107 -176 -216 -84 23 13 -18 64 82 -39 -107 -133 -79 -101 120
4303A20q0O6j94K13k28J74j76R5L5M4k31l2N4o9K18O7l6j74J64J1qq3K30lj75
$$ 120 40 106 -88 125 -103 71 -105 -10 25 69 -162 -194 -140 -209 9 76 40 -134 30 41 33 -50 180 177 2
4328Bk4q4K33K21k66J38L3j81k30L12j63o1O9j78L53l22j8R0p5K06k59J84J17
$$ 2 -22 -106 127 348 82 220 253 72 -158 154 -9 -70 -1 -179 174 -148 -166 -76 -151 55 -204 -20 97
4351I7k44J79O0q2M6j16K19o6Kp6j15J36J00l39M06l57J03j2l8J62n9j6Q0J34
$$ 97 -147 32 92 10 56 -60 159 93 95 19 -96 40 140 -199 207 -150 -47 -59 -97 65 6 -10 70 204
4375B04j0l9j22J27l84K45j44k0L1M02k27k2j2k94N14m03mK70j17Q7R5j17r8J51
$$ 204 194 155 33 160 -224 21 -123 -143 -112 290 63 41 29 -265 249 -154 -158 112 -5 82 177 60 -38 113
4399A13k37J31J3K0p1J36j08J31r4lk03K81j33K16l60J28K5j04J55J85j31j9j00
$$ 113 -124 7 20 40 -31 105 -3 128 34 31 -172 109 -24 192 -168 -40 -15 -119 36 221 90 71 -29
4422b9L4q4K44j22K3Q8j38K01k86j1r8J93m4J12M4k58r2L46j11o1M7j32J30J22
$$ -29 5 -79 165 43 66 154 16 217 -69 -80 -178 15 -29 83 127 -131 -223 123 12 -49 -2 -134 -4 118
4446A18l09K59k38R2K07p2j14J45q6k8K18k65l4K96l85P4R2p9L4J03Qn6L71m06
$$ 118 -191 68 -170 -78 129 57 -57 88 2 -26 192 -73 -107 189 -196 -122 -30 -109 -75 28 36 -20 351 -55
4470e5q3P2J42j00P0j44Q0L8J66m61J45PO4r8j76J17J71n1lQ2p5l9K15jj32J35
$$ -55 -138 -66 76 -24 46 -98 -18 20 186 -275 -130 -123 -59 -157 -333 -216 -45 -96 -99 -17 -92 -131 84 83 -49 86
4496H6j28J00R4j88J71pL1o9j75L97k34n2K75l72L98n87J25K55R4k85K68m27K35
$$ 86 -42 58 152 -36 135 128 159 90 -85 312 78 26 301 -71 327 -260 -135 120 214 -71 197 -230 5
4519El44Q9Q6L37p8l5j60K37j43o9L8K05r8o1O8j65J09k70L24j00j55j61L57r7
$$ 5 -339 -250 -164 173 95 60 -100 137 -6 -75 -37 168 70 9 77 -88 21 -249 75 -25 -180 -341 16 -81
4543h1J60P2L8j53L1Ll8k25K97n0J00J36k44r6K9j82K14j15J57J22k06R4O2J36
$$ -81 79 151 189 36 67 70 32 -193 104 54 154 290 46 -50 -21 -203 11 -104 53 175 -31 63 125 261
4567B61k29k90P6M10k57m9J36M0m2j92P6J44m7k6n1J53J5p8J99k94k61L90K1J2
$$ 261 32 -258 -182 228 -29 -78 58 98 56 -136 -60 84 37 11 -40 113 128 50 249 -45 -306 84 105 117
4591A17Rk10r4J20m2K82j37k18J53j06p9J85K7L6R3n2j60L2K53j00k14o2P0J10
$$ 117 126 -84 -178 -58 -100 182 45 -173 -20 -126 -205 -20 7 43 136 84 -76 -44 209 109 -105 -167 -97 13
4615A3J20K4k41m4o1K88j28J4J0K23j77p0J17j55J4J73k74l1K18k40K68k66L27
$$ 13 133 157 -84 -128 -189 99 -29 -15 -5 218 41 -29 88 -67 -53 120 -154 -185 33 -207 61 -205 122
4638A22k00L15k18o7k02L65q6P1J66j51j81M87l70n3J78l53M88l70L8J4j00N8
$$ 122 -78 237 19 -48 -250 115 29 100 266 115 -66 421 51 -2 176 -177 311 -59 -21 -7 -107 -49
4660d9p3K5N50l66k32K69k22P3N7l6J48j44K9l4J16l38L51k06K36k38J06n7J21
$$ -49 -122 -97 453 87 -145 124 -98 -25 32 -4 144 0 29 -5 111 -227 124 -82 154 -84 22 -35 86
4683H6k37J84j69J65P9k00J44j35Jn6J47K11j43J3j23j16J30k79L37K50k17j23
$$ 86 -151 33 -136 29 108 -92 52 -83 -82 -138 9 220 77 90 -33 -149 -19 -298 39 289 72 -51
4705e1L25l58R9R8l6K6j90J45l7kO4k34R7o9L48l48j02J00L21l07Q2k4No8l8K90
$$ -51 274 -84 15 113 77 103 -87 58 21 19 83 -151 -54 -123 225 -123 -225 -125 196 -111 -29 -53 -48 -116 -154 136
4731A36r8j20J37J24j71k74P3O5K09Rr0P9n8o6J83j92K5j57P5kL05l25J37K84
$$ 136 38 -82 55 179 8 -266 -193 -128 81 90 0 79 21 -45 138 -54 -29 -186 -111 -113 192 -133 4 288
4755B88l33K1N1J22N9k55j9J13j30k7K70j94Lk8M4J91k60K55Q3j69m2j32J63n3
$$ 288 -45 -24 27 149 208 -47 -66 47 -83 -110 160 -34 -31 -59 -15 176 -84 171 254 85 43 -89 74 21
4779B1J38m33K72j05PK25k48QK35j4k88M67l51J07P7j17q7K2Q7J71l08K92j55
$$ 21 159 -274 -2 -107 -100 125 -123 -115 120 106 -182 285 -66 41 118 1 -86 -64 23 194 -114 178 23
4802B3l9K33k95J55j72m0L44q2l51K77j91J26RN7j97L0LJ66o3n5j0L8O5P6k76
$$ 23 -16 217 -78 77 -95 -135 209 127 -224 53 -138 -12 -3 54 -143 -113 -110 56 -7 -62 -72 -34 31 107 -169
4827a69K13R4k74J68k60J35l8O2J33j1j77J13j03K72k38N4K57k72K6N8Q0N3p4
$$ -169 44 138 -136 32 -228 -93 -131 -69 64 53 -124 -11 -114 158 -80 -26 231 -41 -15 43 123 176 102
4850A02j14J27M9k17k0oJ11P3m1j71L46k9j12j11j82Q4K58k23j7K87l50l2K02
$$ 102 -12 115 164 -53 -73 -79 32 105 64 -107 239 210 98 -13 -195 -111 147 -76 -93 194 -156 -188 14
4873A4j31n8L3L28k85L01j38k90O1K67L3l53J71j34K60k14J76J2k36K11n2J02
$$ 14 -117 -175 -142 186 -99 202 64 -226 -165 102 135 -218 -47 -181 79 -135 41 53 -183 28 -24 78
4895G8L3k92J01J04m2R2o7K29k28K6k46K02K00k53R2j05L1j39J78j98L90j28M
$$ 78 111 -181 -80 24 -18 74 7 236 8 34 -212 -10 190 -63 29 -76 -45 -184 -6 -204 186 58 62
4918F2j26J33O8KO4Jk41M8m7J08J78n82K45R7K37m46K07L06k96l3J01k32M09m87
$$ 62 -64 69 137 139 203 204 -37 11 -36 72 250 -332 -87 10 247 -199 8 314 18 -15 86 -146 263 -224
4942b24K66J2mj33K92j50J49n52O51j09k47J01j35r4K76K1l27J73m5J64oj02R8
$$ -224 42 54 50 -83 209 59 208 -344 307 198 -49 52 -83 -177 99 120 -207 -34 -79 85 79 -23 75
4965G5q7K18j54k07K05M5q5K54k25l9P1k73K88k6J04j82J31k19K11J25k73p6K87
$$ 75 -12 206 52 -155 50 95 10 264 39 0 71 -202 86 60 164 -18 113 -106 105 230 -43 -119 168
4988A68j96P3o0J04L1k43L04n9O8k45k17L60j64N6j46J5PO0j62J35J24Q1l04K32
$$ 168 -28 45 -15 89 120 -123 181 122 190 -55 -272 88 -76 -20 -166 -151 -144 -84 -246 -111 13 94 -210 22
5012B2J50k82L18k33k38L6M18j81j66J86j5j62L17k02m4J29Q1l32l8J70QJl1J39
$$ 22 172 -110 208 -25 -263 -227 191 10 -156 30 15 -147 170 -32 -76 53 134 -198 -236 -66 -58 -57 -88 51
5036E1k27J08J13m19J82M32k53K17Qq9k52J04q5J11K08j75J20O3n5r4j56J48k4
$$ 51 -176 -68 45 -374 -192 240 -13 204 212 123 -129 -25 -110 1 209 34 154 217 162 68 -88 60 36
5059C6J37m68K85j5J43J9m07O9J19O6l8J32o4m0n6L08k01j28N7K24O4k42J61k91
$$ 36 173 -295 -10 -25 118 137 -270 -201 -82 -16 -54 78 14 -26 -82 226 25 -103 -46 178 242 0 161 -130
5083a30J61k41L9J46N6KJ24l03L30j56J36j69M6m8J40r9J1j1j10K29k24O3j84
$$ -130 31 -210 -171 -25 31 33 157 -146 184 28 164 -5 41 -7 133 34 45 34 -76 153 -71 -8 -192
5106a92N5J76L6j70k8J8J30J75j55j18N9P2k77J38J3j04Q8PJ54j31R7k56J81j17
$$ -192 -137 39 75 -95 -123 -105 25 200 45 -73 -14 58 -219 -81 -68 -172 -84 -77 77 -54 43 -213 -32 -149
5130a49J78k48L52j33j77J88N5k68L13L3q0l37J43K61m4P9k13j09K00M4j60J14
$$ -149 29 -219 133 0 -177 11 66 -202 111 144 64 -273 -130 131 87 166 -47 -156 44 88 -72 42
5152D2J02Pj70K31j07k0N7l68K99J3p1M3K9l4q0P6n8O1j8r2q1M0J66n6O1P2K9
$$ 42 144 151 -19 212 105 85 142 -226 73 86 15 58 87 53 -27 49 -9 52 34 -58 -139 -99 67 11 72 144 173
5179A73k78j15K41l9J18k74J45j31K63J4j49O6j06L4j46L8o5L60J18j17j72M7
$$ 173 -105 -220 21 -18 100 -174 -29 -160 103 117 -32 34 -72 -38 -184 -146 -211 149 267 150 -22 25
5201B5m8J9N8p0r4J2q6K18j36J61j7j49L21j89N2J36p5j40j73J33K40l43K68j5
$$ 25 -23 -4 54 -16 -110 -98 -184 34 -102 59 42 -107 214 25 77 213 138 -2 -175 -42 198 -145 123 108
5225A08l00J08N3L06j22r9k17K28j65L32k10K20l33J16j51K91k63J17Q9k25J99
$$ 108 -192 -84 -31 275 153 54 -163 65 -100 232 22 242 -91 25 -126 165 -98 19 108 -117 82
5246H2k48J19J82J36j42j01l32M93l81M5K31k16J36k0qk87J89J21m5J09L5r1o6
$$ 82 -166 -47 135 271 129 28 -304 189 -192 -147 84 -132 4 -16 -24 -311 -122 -1 -46 63 98 7 -59
5269e9l9M2k39M33J12k11k52Q6J70n9j31M2J32J7j13j27oL80l07k33O27l58o8
$$ -59 -98 -56 -295 138 250 39 -213 -127 43 -16 -147 -105 27 44 -69 -196 -202 178 -129 -362 265 -93 -161
5292a61K08o8o2K05l06n0K28%m1J08o8k89K68K55l17L20j31j74J58O8j35K8j06
$$ -161 47 -21 -83 122 -184 -234 -6 -6 -47 61 -7 -296 -28 227 -90 230 99 -75 83 151 16 44 -62
5315f2R4n1n4J70k39K47j95j13J32k13K16jk0K1OJ14j49K3J22q4K94m28j97L42
$$ -62 32 -19 -73 97 -142 105 -90 -203 -71 -284 -68 -69 -89 -68 -62 52 -97 -74 48 -36 258 -170 -367 -25
5339b5r2J10J59k0j28K5l9O0R0k27J5q5J86L7L4j05j12Q1K0k4P8j40J33J11k50
$$ -25 -117 -7 152 132 4 29 -10 50 140 -87 -72 -157 29 66 100 -5 -117 -36 -16 -40 38 -102 31 142 -108
5364a08J83k6P0J9j09J20m6o0J45o7l54K58J00J24r6k38K16k83l5K62j8j94J87
$$ -108 75 49 119 138 29 149 103 43 188 121 -233 25 125 249 153 -85 131 -152 -187 75 57 -137 50
5387E0J07j75J15lj18j21L02M4k65J07q0j8p0J56j58K18o9nJ13j72j23P0K33k53
$$ 50 157 -18 97 94 -24 -145 157 201 -64 43 -37 -55 -125 31 -127 91 22 17 130 -42 -165 -95 138 -115
5411a15L20j28L5j46K09j04K16k64J02k63J15J78j26N2j56R0O7j04j70J54j02
$$ -115 205 77 112 -34 175 71 287 23 125 -138 -23 155 29 81 -75 15 82 -22 -192 -38 -140
5432a40K74k86K80J11l50r5K51L0J7j12M0m9m1l14L78l6j38J19j8NK23m7l3o5
$$ -140 134 -152 128 239 -111 -206 45 75 92 -20 20 -29 -70 -384 -6 -42 -180 -61 -79 -74 149 102 69 4
5456DK38q3l38K25m6j6P8j21K33k65J01j0r8rM1J71j41j6p9L17j12j30J15j9l42
$$ 4 242 159 -179 46 0 -16 62 -59 174 -91 10 0 -98 -107 -66 105 -36 -52 -131 186 74 -56 59 40 -302
5481c02J77L38k89J41j43K84j03j42N8m4OJ48j33q7K3j32L19m8N0J1k05K7L28
$$ -302 -125 213 -76 65 -78 206 103 -39 19 -25 -19 129 -4 -91 -68 -200 119 71 121 132 -73 -46 282
5504B82m64J01J41k00J02o9N0K5q7K57j72K7kL8j02K14j0j6j47L62l26k14L57
$$ 282 -182 -81 60 -140 -38 -107 -57 -32 -119 138 -34 -7 -9 29 -73 141 131 115 -32 330 4 -210 147
5527A47q5L7j93k33J81K32k28Q9nk7K28K1k87Q6k53L22j36K64L5k10J88k2k13
$$ 147 62 99 -94 -327 -146 86 -142 -53 -58 -85 143 164 -123 -37 -290 32 -104 160 195 -15 173 151 -62
5550f2k8J84l15K92j18j13J33J96j53o7o9N1O5m2R7P5k33L28j44jk67K73n2k20
$$ -62 -90 94 -221 71 -47 -160 -27 169 16 -51 -120 -69 -4 -46 51 126 -107 221 77 76 -191 82 30 -190
5574a90K48k62L39j13o1j89L65r8P0j05J7m3J17p1J02l09K88j89J35j97K31R6
$$ -190 58 -204 135 22 -39 -228 137 39 109 4 21 -22 95 24 126 -183 105 -84 51 -146 85 181
5596A81l14J52J47k48j76K99O3K2j73K5M2J04j59L03k99J50j09K1l0o6l2M52k47
$$ 181 -133 19 166 -82 -258 41 104 126 -47 -22 20 124 -35 268 -31 119 10 31 1 -65 -97 355 108
5619A08q1j30J38j54K42mj09K54m04J94M4k37mO1j4p1L00p3j56K69j42j17P0J07
$$ 108 27 -103 35 -119 123 119 10 264 -140 54 98 -139 -143 -82 -96 -167 133 60 -96 173 31 -86 -16 91
5643I1l15K38P3j90m8K85l87J07J92l05L07J59j72J28j20k02K69q4K19k20n8J97
$$ 91 -224 14 87 -103 -151 134 -253 -146 46 -259 48 207 35 163 43 -159 110 26 245 25 -33 164
5665A64p1m4k18J03P1j9R9j00j03K09q5N7l60K40N9P9O0k96P8L73j79M0j85n8
$$ 164 93 49 -169 -66 5 -14 85 -15 -118 91 6 63 -297 -57 2 81 141 -155 -77 296 117 157 -28 -86
5689h6o3Q8l8L8K20q8r5J94j60j90M3K62j7k47J47K46l76O8M9J2K02m25J60L36
$$ -86 -149 -61 -99 -61 159 71 -24 170 10 -180 -137 125 108 -139 8 254 -122 -54 -5 7 209 -216 -56 280
5713B80k17k12M8j7M29k92j76J6J94N7j81K38n1l10R2J4N8p2J15N8P6j84O9j85
$$ 280 63 -149 -101 -118 311 19 -157 -141 53 110 -71 167 116 -194 -102 -88 -30 -102 13 71 147 -37 32 -153
5737a53QK33m3j87l9J6J35P7L5K0n5j36LK39l84J14K76k4k52k6M59j19J5m21K62
$$ -153 -145 88 45 -142 -181 -165 -30 47 82 102 47 -89 -86 153 -231 -117 159 135 -117 -143 316 197 212 -209 53
5762E3J25n8k08K23k60J61K46l17K93k22j14l7J13o5J41j11J40K7r9q6J41j97
$$ 53 178 120 -88 135 -125 36 282 -35 258 36 -78 -115 -2 -67 74 -37 103 130 31 -55 86 -111
5784a11N3n3K38j92j76L81J09l72J64m2l06J42L53l62K69j52o6J05j07L11j8q1
$$ -111 -58 -111 127 -65 -241 140 249 -123 41 -1 -307 -165 188 -174 95 -57 -123 -18 -125 186 168 87
5806H7k30j13K81r4R6l0k0k1J6j2r2J21K01j83j46K85j03m6j55K61k08M2oj12
$$ 87 -143 -256 25 -69 27 -3 -23 -44 -28 -40 -132 -11 190 7 -139 146 43 -3 -158 103 -105 -63 -69 -181
5830a81K93l14L12k61K4L17K5m8p7o1l7K2J05o3L5l6k08K20j35K81j99l24K58
$$ -181 112 -202 110 -151 -127 190 215 167 90 29 -8 14 119 56 91 55 -153 67 -68 213 14 -310 -52
5853e2R4q6K8k70J01O5M58k92j33L40o3k55l5j38M17n18M47j33m4n3K63l0p1o5
$$ -52 42 -44 -16 -286 -185 -120 338 46 -87 253 190 -65 -100 -238 179 -339 108 -25 -69 -122 141 111 40 -25
5877b5j09K72j95Oj79j19K59n9K42J34k74L46k42l40p8M19jj55M0k1j62K38J52
$$ -25 -134 138 -57 -51 -230 -349 -90 -149 93 227 -47 299 57 -283 -361 58 57 -98 -58 -79 -241 -3 149
$$ [...]
8191h2
##END NTUPLES=NMR FID
##END=
