##TITLE=1H_Ser DHA_TFA
 
 8 sc, 
 23.12.2024
##JCAMPDX= 6.0         $$ Bruker NMR JCAMP-DX V2.0
##DATA TYPE= NMR FID
##DATA CLASS= NTUPLES
##ORIGIN= UXNMR, Bruker Analytische Messtechnik GmbH
##OWNER= root
$$ XWIN-NMR		Version 3.5
$$ Mon Dec 23 14:24:39 2024 Russian Standard Time (UT+4h)  she@DPX200
##.OBSERVE FREQUENCY= 200.1315
##.OBSERVE NUCLEUS= ^1H
##.DELAY= (6, 6)
##.ACQUISITION MODE= SIMULTANEOUS
##.ACQUISITION SCHEME= undefined
##.AVERAGES= 8
##.DIGITISER RES= 18
##SPECTROMETER/DATA SYSTEM= spect
##.PULSE SEQUENCE= zg30
##.SOLVENT NAME= CDCl3
##.SHIFT REFERENCE= (INTERNAL, CDCl3, 0, 15.7039)
##AUDIT TRAIL= $$ (NUMBER, WHEN, WHO, WHERE, WHAT)
$$ ##TITLE= Audit trail, XWIN-NMR		Version 3.5
$$ ##JCAMPDX= 5.01
$$ ##ORIGIN= Bruker BioSpin GmbH
$$ ##OWNER= she
$$ F:/spectra/data/she/nmr/H-F/1/audita.txt
$$ ##AUDIT TRAIL=  $$ (NUMBER, WHEN, WHO, WHERE, WHAT)
(   1,<2024-12-23 14:22:44.29 +0400>,<she>,<DPX200>,
      <created by zg, POWCHK disabled, PULCHK disabled
       configuration hash MD5:
       00 E9 B6 7A A2 85 ED C7 34 08 36 98 17 FE 4E 26
       data hash MD5: 16K
       B3 66 6C D1 BD F1 C3 2D DF 4E 1E FB AC 14 23 F2>)
$$ ##END=
$$ 
$$ hash MD5
$$ 83 45 21 AA C9 9C 50 2B F6 85 CE AF 1D FB E5 73
##$RELAX= 
##$RELAX= 
##$RELAX= 
##$RELAX= 
##$RELAX= 
##$RELAX= 
$$ Bruker specific parameters
$$ --------------------------
##$DU= <F:/spectra>
##$EXPNO= 1
##$NAME= <H-F>
##$PROCNO= 1
##$TYPE= <nmr>
##$USER= <she>
##$AMP= (0..31)
100 100 100 100 100 100 100 100 100 100 100 100 100 100 100 100 100 100 
100 100 100 100 100 100 100 100 100 100 100 100 100 100 
##$AQSEQ= 0
##$AQ_mod= 1
##$AUNM= <au_zg>
##$AUTOPOS= <>
##$BF1= 200.13
##$BF2= 200.13
##$BF3= 200.13
##$BF4= 200.13
##$BF5= 200.13
##$BF6= 200.13
##$BF7= 200.13
##$BF8= 200.13
##$BYTORDA= 1
##$CFDGTYP= 0
##$CFRGTYP= 5
##$CHEMSTR= <none>
##$CNST= (0..31)
1 1 145 1 1 1 1 1 1 1 1 1 1 1 1 1 1 1 1 1 1 1 1 1 1 1 1 1 1 1 1 1 
##$CPDPRG= <>
##$CPDPRG1= <>
##$CPDPRG2= <>
##$CPDPRG3= <>
##$CPDPRG4= <mlev>
##$CPDPRG5= <mlev>
##$CPDPRG6= <mlev>
##$CPDPRG7= <mlev>
##$CPDPRG8= <mlev>
##$CPDPRGB= <>
##$CPDPRGT= <>
##$D= (0..31)
0 1.2 0 0 0 0 0 0 0 0.06 0 0.03 0 0 0 0 0.0002 0 0 0 0 0 0 0 0 0 0 0 0 
0 0 0 
##$DATE= 1734949363
##$DBL= (0..7)
120 120 120 120 120 120 120 120 
##$DBP= (0..7)
150 150 150 150 150 150 150 150 
##$DBP07= 0
##$DBPNAM0= <>
##$DBPNAM1= <>
##$DBPNAM2= <>
##$DBPNAM3= <>
##$DBPNAM4= <>
##$DBPNAM5= <>
##$DBPNAM6= <>
##$DBPNAM7= <>
##$DBPOAL= (0..7)
0.5 0.5 0.5 0.5 0.5 0.5 0.5 0.5 
##$DBPOFFS= (0..7)
0 0 0 0 0 0 0 0 
##$DE= 6
##$DECBNUC= <off>
##$DECIM= 24
##$DECNUC= <off>
##$DECSTAT= 4
##$DIGMOD= 1
##$DIGTYP= 9
##$DL= (0..7)
0 120 120 120 120 120 120 120 
##$DP= (0..7)
150 150 150 150 150 150 150 150 
##$DP07= 0
##$DPNAME0= <>
##$DPNAME1= <>
##$DPNAME2= <>
##$DPNAME3= <>
##$DPNAME4= <>
##$DPNAME5= <>
##$DPNAME6= <>
##$DPNAME7= <>
##$DPOAL= (0..7)
0.5 0.5 0.5 0.5 0.5 0.5 0.5 0.5 
##$DPOFFS= (0..7)
0 0 0 0 0 0 0 0 
##$DQDMODE= 0
##$DR= 18
##$DS= 0
##$DSLIST= <SSSSSSSSSSSSSSS>
$$ [...]
##$SUBNAM2= <"">
##$SUBNAM3= <"">
##$SUBNAM4= <"">
##$SUBNAM5= <"">
##$SUBNAM6= <"">
##$SUBNAM7= <"">
##$SUBNAM8= <"">
##$SUBNAM9= <"">
##$SW= 24.0689530833862
##$SWIBOX= (0..15)
0 0 2 0 0 0 0 0 0 0 0 0 0 0 0 0 
##$SW_h= 4816.95568400771
##$TD= 16384
##$TD0= 1
##$TE= 0
##$TE2= 300
##$TE3= 300
##$TEG= 300
##$TL= (0..7)
0 120 120 120 120 120 120 120 
##$TP= (0..7)
150 150 150 150 150 150 150 150 
##$TP07= 0
##$TPNAME0= <>
##$TPNAME1= <>
##$TPNAME2= <>
##$TPNAME3= <>
##$TPNAME4= <>
##$TPNAME5= <>
##$TPNAME6= <>
##$TPNAME7= <>
##$TPOAL= (0..7)
0.5 0.5 0.5 0.5 0.5 0.5 0.5 0.5 
##$TPOFFS= (0..7)
0 0 0 0 0 0 0 0 
##$TUNHIN= 0
##$TUNHOUT= 0
##$TUNXOUT= 0
##$USERA1= <user>
##$USERA2= <user>
##$USERA3= <user>
##$USERA4= <user>
##$USERA5= <user>
##$V9= 5
##$VALIST= <valist>
##$VCLIST= <CCCCCCCCCCCCCCC>
##$VD= 0
##$VDLIST= <DDDDDDDDDDDDDDD>
##$VPLIST= <PPPPPPPPPPPPPPP>
##$VTLIST= <TTTTTTTTTTTTTTT>
##$WBST= 1024
##$WBSW= 4
##$XGAIN= (0..3)
0 0 0 0 
##$XL= 0
##$YL= 0
##$YMAX_a= 621152
##$YMIN_a= -370194
##$ZGOPTNS= <>
##$ZL1= 120
##$ZL2= 120
##$ZL3= 120
##$ZL4= 120
##$ABSF1= 10
##$ABSF2= 0
##$ABSG= 5
##$ABSL= 3
##$ALPHA= 0
##$AQORDER= 0
##$ASSFAC= 0
##$ASSFACI= 0
##$ASSFACX= 0
##$ASSWID= 0
##$AUNMP= <proc_1d>
##$AZFE= 0.1
##$AZFW= 0.1
##$BCFW= 1
##$BC_mod= 2
##$BYTORDP= 1
##$COROFFS= 0
##$CY= 11.3945322036743
##$DATMOD= 1
##$DC= 2
##$DFILT= <>
##$DTYPP= 0
##$F1P= 15.6554695791079
##$F2P= 12.8336369535428
##$FCOR= 0.5
##$FTSIZE= 0
##$FT_mod= 4
##$GAMMA= 1
##$GB= 0.15
##$INTBC= 1
##$INTSCL= 1
##$ISEN= 128
##$LB= 0.24
##$LEV0= 0
##$LPBIN= 0
##$MAXI= 10000
##$MC2= 0
##$MEAN= 0
##$ME_mod= 0
##$MI= 1.114404
##$NCOEF= 0
##$NC_proc= 0
##$NLEV= 6
##$NOISF1= 3.799351
##$NOISF2= 2.8
##$NSP= 1
##$NTH_PI= 0
##$NZP= 0
##$OFFSET= 15.70392
##$PC= 1
##$PHC0= -26732.74
##$PHC1= 14.38744
##$PH_mod= 1
##$PKNL= yes
##$PPARMOD= 0
##$PSCAL= 0
##$PSIGN= 0
##$REVERSE= no
##$SF= 200.130013532006
##$SI= 16384
##$SIGF1= 3
##$SIGF2= 2
##$SINO= 400
##$SIOLD= 16384
##$SREGLST= <1H.CDCl3>
##$SSB= 0
##$STSI= 0
##$STSR= 0
##$SW_p= 3612.71676300578
##$SYMM= 0
##$S_DEV= 0
##$TDeff= 0
##$TDoff= 0
##$TI= <>
##$TILT= no
##$TM1= 0
##$TM2= 0
##$TOPLEV= 0
##$USERP1= <user>
##$USERP2= <user>
##$USERP3= <user>
##$USERP4= <user>
##$USERP5= <user>
##$WDW= 1
##$XDIM= 8192
##$YMAX_p= 0
##$YMIN_p= 0
$$ End of Bruker specific parameters
$$ ---------------------------------
##NTUPLES= NMR FID
##VAR_NAME=  TIME,          FID/REAL,        FID/IMAG
##SYMBOL=    X,             R,               I
##VAR_TYPE=  INDEPENDENT,   DEPENDENT,       DEPENDENT
##VAR_FORM=  AFFN,          ASDF,            ASDF
##VAR_DIM=   8192,          8192,            8192
##UNITS=     SECONDS,       ARBITRARY UNITS, ARBITRARY UNITS
##FACTOR=    0.0002076,     1,               1
##FIRST=     0,             0,               0
##LAST=      1.7004516,     0,               0
##MIN=       0,             -370194,         0
##MAX=       1.7004516,     621152,          0
$$ Real data points
##PAGE= N=1
##DATA TABLE= (X++(R..R)), XYDATA
$$ [...]
1317g77L565j688m508o35M620L984j439m688j692L208L334j808m776r39M327M305
1333D393p99m261j728L080L200j815m884j522M102M425n76m002j670L237L305
1348D485j574n186j951L593M380l88l926j548L355L658j203n136k519K939M193
1363C172l00l836j650L308M035n90m848k952K384L893k92l870j759L223M472k02
1379D188m427l049K081L581l98m138j982L204M578L38m144k967J905L610m33m344
1395b397k269K804M601P54l681k929J899L600r1m229k981K209M475J106l337k754
1411c220J892L972J73m225l337J674M139J137l079k485K043M180N65m122l563
1426d256J150L855J085k951k416K030M355J011l857l627R12L682J007k963k811
$$ y = [-777, 2788, 1100, -3408, -4043, 577, 4561, 3122, -1566, -3258, -50, 3284, 1476, -3300, -4239, 88, 4393, 3594, -667, -2395, 685, 3885, 2070, -2814, -4336, -234, 4191, 3615, -387, -2057, 1180, 4485, 2911, -2275, -4226, -633, 3747, 3359, -567, -2115, 1240, 4898, 3695, -1441, -3960, -1021, 3172, 2872, -964, -2614, 694, 4729, 4139, -709, -3661, -1277, 2616, 2324, -1546, -3305, -82, 4390, 4188, -239, -3288, -1207, 2374, 1976, -2162, -4144, -940, 3638, 3976, -168, -3135, -1230, 2380, 1947, -2397, -4666, -1862, 2739, 3493, -188, -3117, -1218, 2382, 2291, -1938, -4919, -2710, 1765, 2871, -466, -3220, -1328, 2644, 2817, -1408, -4745, -3071, 1068, 2205, -874, -3359, -1316, 2864, 3429, -693, -4256, -3106, 749, 1834, -1117, -3533, -1503, 2852, 3863, 6, -3621, -2709, 973, 1980, -983, -3794]
1441c794J809M544J556l326l670O89L537J073l156l171J471M531K037k872l517
1456b259O87L532J015l253l481J013M299K239k361l238P61L430J109l134l677
1471c318L84M021K271k035l059P57L643J360l030l995O1L640K323k066l023P07
1487a359L887J727k765m018k65L401K201k130l221N33L918K325k272l864n68K964
1503D94K036k071l495J76M008K760j807l655n89K723J929k139l635j19L751L030
1519C397j405l403o49K778J978k169l792n61L549L029j156l249m77K911K290j981
1535A090l965j060L108K981r62l051n33L066K576j541l957j407K600K795q86k967
1551b113n23L079K820j048l694j736K228K718r36l080p12L125L123p09l510j691
$$ y = [-3794, -1985, 2559, 4115, 789, -2881, -2192, 1345, 2418, -738, -3909, -2438, 2093, 4130, 1258, -2259, -1572, 1960, 2975, -278, -3759, -2746, 1553, 3792, 1431, -1807, -1046, 2384, 3493, 359, -3318, -2934, 1087, 3358, 1323, -1736, -979, 2664, 4024, 994, -3001, -2940, 700, 3023, 957, -2066, -1359, 2528, 4255, 1490, -2528, -2793, 608, 2809, 679, -2542, -2009, 1909, 4234, 1962, -1902, -2470, 494, 2530, 459, -3036, -2860, 1148, 3908, 2101, -1554, -2143, 580, 2509, 370, -3265, -3384, 367, 3397, 1992, -1411, -2060, 718, 2696, 527, -3265, -3826, -277, 2752, 1596, -1653, -2130, 781, 3071, 1090, -2875, -3935, -827, 2154, 1192, -1859, -2392, 674, 3250, 1709, -2248, -3655, -1055, 1740, 854, -2113, -2636, 443, 3263, 2215, -1479, -3215, -987, 1731, 795, -2285, -2997, 128, 3251, 2542, -968, -2659]
1567b659K021K568r62l270r46K953L351l56l213j781J994K634q26l583j382K745
1583g12L291N3k969j670K101K711p09l553j945K153L324K03k662j484K104K897
1599C133m74l605k242J824L047K64k510j422K131L080k50l403k419J529K823J19
1615A625k499j446K014L233K21l116k426J267K603J09k708j697J915L422O02k816
1631C03k425J171K551J02k813k095J655L370J057k500k299J089K641J79k884k410
1647c308J252L257J209k118k157J057K736L38k895k557Q96L015J235j904k044
1662a988J154K886N32k723k722N45K779J219j947k010J049L130R42k469k751K90
1678b084K587J102j997k267R97L215J379k058k692J22K288R94j973k366P44L168
$$ y = [-2659, -638, 1930, 968, -2302, -3248, -295, 3056, 2700, -513, -2294, -300, 2334, 1508, -2075, -3457, -712, 2579, 2632, -337, -2007, 94, 2805, 2096, -1457, -3402, -1249, 2075, 2278, -384, -1868, 236, 3133, 2659, -946, -3188, -1364, 1683, 1947, -563, -1985, 146, 3226, 2976, -427, -2846, -1317, 1506, 1625, -874, -2320, -306, 2927, 3148, 32, -2394, -1127, 1476, 1585, -1123, -2820, -905, 2517, 3119, 303, -2122, -951, 1600, 1702, -1111, -3206, -1551, 1819, 2876, 376, -1923, -834, 1807, 1986, -898, -3308, -2056, 1201, 2410, 292, -1865, -808, 1928, 2266, -629, -3186, -2290, 725, 1960, 56, -1988, -834, 2052, 2584, -139, -2861, -2316, 463, 1682, -265, -2275, -1226, 1904, 2846, 377, -2374, -2084, 503, 1605, -392, -2659, -1662, 1553, 2932, 874, -1818, -1696, 592, 1586, -387, -2753, -2009, 1159]
1694A159J682j706k538M7K260R40k038k485L98L072J793j449k350J39K292J094
1710B310k064k748J00K787J930j311k277J56K538J340k020k838l53K556J878j206
1726G78k228K35K530J635j678k881o13K192J718j178k104M5K659J871j314k884
1742a217o86J837J669j190k273m9K622J980j001k597p60J821J534j228k493k94
1758b325K532K175p86k324p16J845J560j175k744o94K312K257n10k182o17J849
1774D57J764j122k852r45J905K262l73k050n94K006J898r51k716j323J755K062
1790A183k49k062o15J976K094n89k641j351J409J957m56k045o42J937K299k78
1806A927k456j380J327J803m65k144r75J869K461N9k217j413J259J857n27k318
$$ y = [1159, 2841, 1135, -1403, -1356, 904, 1844, -194, -2679, -2281, 791, 2584, 1135, -1215, -1076, 1216, 2310, 246, -2502, -2402, 385, 2315, 1004, -1273, -1117, 1421, 2761, 741, -2097, -2450, 106, 1984, 778, -1450, -1215, 1315, 2950, 1272, -1609, -2222, -30, 1688, 510, -1594, -1549, 1110, 2981, 1667, -1217, -1903, -66, 1603, 413, -1860, -1909, 713, 2693, 1692, -905, -1665, 156, 1690, 462, -2031, -2325, 207, 2382, 1596, -728, -1444, 401, 1961, 786, -1958, -2652, -340, 1917, 1407, -775, -1392, 457, 2221, 1099, -1753, -2698, -793, 1469, 1096, -954, -1548, 458, 2356, 1405, -1311, -2634, -879, 1183, 934, -1128, -1743, 233, 2327, 1738, -903, -2254, -845, 1112, 656, -1389, -2031, -94, 2205, 1927, -529, -1909, -582, 1221, 756, -1388, -2363, -494, 1967, 2026, -191, -1604, -345, 1512, 985, -1333]
1822a333j132J594K490L09j934j355J218J898l93k487j365J356K370N10j854j210
1838a318J290J962j96k505j552J080K249M25j748j168J305K283j7k380j789Q91
1854a188K048L54j766j226J327K398L74k102j826O31J740L93j783j372J131K500
1870A633P37j899j843M85J767L70j906j518J008K421Q89j606j699N19J726K96
1886A380j890j733O89K405R77j480j468N53J889L77j934j925M62K192J034j332
1902A96j491O76J985N98j808k077J90J936J069j284j493O14K187Q74j709k004
1918a541j02J785J021j313j607O22K217J124j368k055r7J585Q72j279j705M32
1934a409K124J273j022j886j72J601P95j312j835J21K100J396q82j728m8J642
$$ y = [-1333, -2465, -871, 1619, 1928, -6, -1361, -143, 1755, 1362, -1125, -2490, -1134, 1236, 1746, -108, -1318, -28, 1934, 1738, -767, -2319, -1239, 1010, 1435, -313, -1481, -176, 2107, 2090, -290, -2079, -1188, 860, 1214, -552, -1778, -451, 1947, 2321, 219, -1607, -976, 764, 1157, -626, -1998, -867, 1633, 2370, 471, -1372, -887, 880, 1250, -656, -2174, -1166, 1255, 2144, 538, -1161, -642, 1084, 1380, -510, -2243, -1554, 851, 1828, 348, -1120, -567, 1322, 1699, -235, -2160, -1698, 494, 1528, 196, -1295, -619, 1366, 1964, 156, -1921, -1731, 205, 1274, -10, -1503, -889, 1298, 2172, 463, -1541, -1643, 142, 1163, -150, -1757, -1135, 1082, 2206, 838, -1217, -1314, 271, 1143, -136, -1841, -1409, 715, 1988, 966, -920, -1092, 509, 1304, -8, -1843, -1722, 378, 1774, 892, -836, -884, 758]
1950G58Q70j400k030j38K006J419o93j621M4J633R81j225k157l94J789J483p27
1967E98j531j7J773J188j083k130n70J570J336p13j519n7J854J391q51k049o96
1984a506J358J247p77j658n7J792J585o41j858p72J315J177q22j830l23J767J749
2001A746m17j700o80J204J235q11j916o15J563J723j18j481p32J225J297o60j985
2018a122q23J311J737r0j486n90J325J417n01k033j011J175J552j47j421m77J342
2035A58J578l01j983j095J011J360j57j475n82J399J795r2j925j090Q26J379j89
2052F17j584p63J298J838J75j579j168P77J315j62j638r49J092J808L75j390j069
2069a007Q26J352j98j662j073Q11J722M78j232r41Q16J422m8j677j258O44J582
$$ y = [758, 1628, 228, -1802, -1940, 66, 1485, 792, -829, -785, 848, 1829, 604, -1553, -1947, -158, 1325, 598, -933, -950, 823, 2011, 928, -1202, -1772, -202, 1134, 421, -1098, -1155, 699, 2090, 1239, -810, -1506, -148, 1099, 322, -1336, -1393, 399, 1984, 1343, -515, -1287, 28, 1205, 383, -1447, -1770, -3, 1746, 1329, -371, -1051, 153, 1388, 577, -1339, -1954, -391, 1332, 1214, -267, -999, 226, 1523, 863, -1122, -1945, -634, 1103, 1013, -473, -1063, 262, 1679, 1178, -855, -1866, -691, 861, 714, -707, -1184, 158, 1736, 1435, -548, -1643, -632, 728, 571, -904, -1486, -87, 1708, 1616, -309, -1399, -573, 806, 617, -967, -1730, -432, 1406, 1581, 2, -1166, -389, 926, 764, -874, -1823, -731, 1077, 1452, 62, -1007, -181, 1171, 973, -689, -1762, -951, 771, 1249, 17, -924, -108, 1314, 1266, -411, -1669, -1025, 557]
2086E57M16j084r77R25J581J25j671j392N26J480M53j224r68Q62J796L04j541
2103A68j439L56J367L99j263j045P97J780O25j378j406K78J332L39j240j291O57
2120i64J803P56j119j286K80J338K43j345j334M24J784P85r03j235L49J369L41
2137A286j345j499J45J689Q90q83j146L70J451M88j180j662J6J473Q71q67j066
2154i69L16J508O92j046j536k22J335P13q10j114L31J547Q70r45j475k27J168
2171A36O95j011j163K88J576J059p79j454j60J101O81r23j420O1J543J106n05
2188H31j314k08J100P53q70j566j91J404J140l37j262j69J143Q76q20j579l67
2205a436J219J146m22j057k24J269R84o84j615m66J023J024l92j135o4J259J086
$$ y = [557, 973, -111, -1088, -163, 1418, 1543, -128, -1520, -994, 486, 939, -285, -1253, -391, 1405, 1709, 168, -1271, -915, 452, 851, -412, -1457, -660, 1120, 1745, 367, -1039, -761, 571, 910, -330, -1621, -964, 839, 1595, 476, -810, -530, 808, 1051, -294, -1628, -1204, 580, 1365, 462, -773, -424, 945, 1286, -59, -1558, -1413, 276, 1166, 283, -863, -493, 958, 1446, 266, -1396, -1380, 93, 964, 97, -969, -653, 855, 1547, 501, -1035, -1257, 78, 791, -19, -1133, -802, 745, 1615, 670, -805, -1032, 136, 831, -180, -1343, -1055, 521, 1580, 801, -653, -813, 288, 969, 46, -1374, -1313, 230, 1336, 831, -483, -691, 409, 1162, 292, -1274, -1465, -61, 1079, 742, -520, -689, 454, 1330, 510, -1069, -1436, -217, 929, 507, -550, -774, 495, 1479, 795, -820, -1286, -263, 761, 369, -766, -830, 429, 1515]
2222A515n50j505o56R37R95m88j156j93J281J271l30j402p05Q61R17m83j262k43
2240a196J173J247j32j328o17R08Q98m81j380m45J025J340J3j240n24Q97R35m16
2258F77j461o05Q38J320J0j044m64R00J033l15j495p87P61J167J14j022n17R05
2276A5J249k28j319r09N72J092N5j056m77Q60J319K1j254r05M50R84J4j060o06
2295a183Q02J410J85j130p98L28R20L8j191p41P72J363L36j017q02N01J011k2
2313G82j243r38N82J414L59r05p03M63J071L5j146j085M36J250M60q56p42N56
2331b10J133J86j066j117J84J157M03p77p57N39J226L64j025j102P9R70L84p69
2349a98q32M81J286N13q51j096R6Q73L31q85q55M27J245O59p85r29P3Q87L09r01
$$ y = [1515, 965, -540, -1196, -259, 736, 248, -908, -1101, 180, 1451, 1121, -281, -986, -125, 792, 309, -953, -1196, -23, 1224, 1092, -236, -853, 55, 953, 472, -908, -1353, -328, 1012, 1025, -215, -739, 158, 1093, 677, -784, -1389, -551, 769, 779, -265, -729, 171, 1204, 889, -606, -1393, -632, 535, 649, -373, -890, 15, 1264, 1036, -283, -1192, -620, 472, 527, -529, -1006, -146, 1173, 1194, -60, -965, -515, 469, 483, -577, -1183, -381, 1029, 1214, 84, -714, -386, 534, 572, -619, -1360, -588, 775, 1111, 94, -708, -207, 804, 782, -461, -1399, -817, 597, 956, 51, -652, -189, 882, 917, -229, -1314, -878, 372, 832, -24, -766, -210, 923, 1109, 43, -1074, -890, 267, 670, -107, -864, -325, 901, 1265, 240, -862, -783, 187, 571, -198, -1030, -549, 737, 1250, 399, -697, -601, 272, 603, -282, -1137, -710, 535, 1194, 409, -520, -447, 440, 749, -152]
2369a52j041K96J280N79n40r53J31R35L53q87j150J64J103P25n51q17J73R28N08
2388A084q50j223k6R95P26n49p81J49J059N94o93j246j96R41O05n24q51J62J116
2407D92P10o10j184k18Q13N84n20r35L5J119Q47m25j113l00Q16N40n37j005m0
2426i31R95Q79k87r88k30P57N95o36j012k45R63R11k19p65k79P78O46n68j016
2445f52l85Q56Q05j93p90k00R10O89n26j105m58Q25P20j84p90j79R11Q36l10j139
2465c59n50O46P48k02q26k79Q90R11j30j027n28N00P44k80r10l03Q03J013j9r23
2485h1m65N14O20k77r63l65O99J018L7p84m67N73O45k60q97n79O03R21J20p21
2505a09m59O35P48j52j055n24M03Q55J22p05m17O67Q96j07r01p77L70P76J07p35
$$ y = [-152, -1193, -897, 383, 962, 422, -531, -400, 535, 888, 1, -1149, -985, 118, 843, 292, -525, -352, 576, 1084, 234, -989, -1015, -20, 706, 157, -624, -475, 584, 1178, 485, -761, -957, -16, 589, 65, -786, -624, 492, 1202, 592, -592, -810, 3, 587, 67, -868, -833, 286, 1133, 708, -405, -705, 111, 651, 114, -891, -931, 64, 943, 656, -332, -562, 195, 790, 154, -858, -1103, -140, 771, 552, -213, -492, 286, 932, 364, -652, -1037, -181, 624, 431, -359, -559, 351, 1040, 514, -591, -1049, -224, 496, 312, -478, -657, 254, 1090, 780, -359, -909, -263, 485, 283, -543, -822, 68, 979, 849, -178, -706, -206, 538, 258, -652, -955, -152, 861, 842, -81, -546, -32, 588, 311, -652, -1017, -318, 700, 737, -47, -514, 59, 704, 444, -453, -1032, -429, 492, 612, -109, -568, 67, 815, 663, -392, -916, -513, 342, 464, -241, -658, 9, 905, 798, -103, -880, -510, 266, 373, -362]
2525c62l93O35R97J9r09o67K30P38O2o71n21N70J046J34p60o93K33O68J11p85
2545c18o18M69J017L13p36n95K69O86R0q14p47L59R98L62o37n11K39P49J39q13
2565i9q14J87R55L71n36n66L48P50K62p85q72J77P29L15m47n15L09Q43L17p09
2585B20q19K8P03K76m80o15L05R63L11n62q30l7O50L38o13o49L05Q58M88m13q24
2606c97L1O15K82o64o85J29R11N22l66o76l7P01K41n62p93o4Q30N72l03n65j8
2627b96O74L80n43q88j11P55N10k82n93R3O62M75n13q54k08O67M81l89n41N5Q00
2648C34N29l95q60k33N98L78l08o83P7P49O41l00q08k50N16M61m27o58k8P14P06
2669G53j72p73j60M91M02m11p87j36O26P12k9p48j19N59M01l34p88k52N89O12
$$ y = [-362, -755, -120, 877, 896, -13, -680, -450, 288, 350, -321, -842, -272, 774, 908, 148, -545, -312, 356, 467, -318, -936, -467, 550, 863, 127, -468, -199, 487, 577, -237, -984, -625, 373, 735, 98, -413, -174, 575, 714, -99, -913, -726, 229, 600, 64, -502, -154, 596, 858, 73, -799, -622, 107, 422, -25, -540, -231, 612, 929, 220, -599, -571, 132, 408, -72, -687, -382, 581, 892, 330, -500, -537, 113, 451, -162, -811, -506, 352, 840, 427, -397, -366, 249, 531, -133, -818, -689, 222, 744, 378, -298, -335, 366, 607, 45, -748, -812, 18, 590, 287, -278, -296, 378, 758, 215, -673, -784, -29, 481, 199, -394, -301, 361, 836, 323, -531, -739, -72, 409, 20, -521, -466, 334, 863, 468, -392, -625, -27, 351, 43, -640, -563, 186, 827, 527, -281, -531, -15, 446, 19, -639, -667, 47, 753, 581, -192, -352, 139, 541, 130, -657, -793, -167, 545, 516, -232, -351, 208, 609, 275, -513, -765, -176, 436]
2689D36n2n69k14O07N63l75p91l72M82N90Qo67j54O22O10j73q25l62L48N59o7
2710B04o35j41O14P08j52o90l41K92M59q5o64k71O85O91k6p21k81L00M56j54o45
2731c97m11N39P58J12n83l87L57N07r6p70m20L95P29J46n00l48L40O01q0p42m98
2752g48L06O57J81m97k73K94O81l2p29m77K13O31J40n50l30N13O12R2o33n45R6
2773c98O06R2n29m07M01P23J87n64n15J32N24P4n56m21L20P15K46m65m62J49M97
2794C49O9o02n32K42P46K35l66m33J35N78O3n67n53J48O36K80l53m03K13N12J51
2815E48m79o45L0N66L83l86l98J80O11K45n11o24L2M99K57l65m16K15O14L48m52
2836B52o35n2N79J50l47m98J14O74M22l54n66k2M09K53m47n39J17O11M56k21n71
$$ y = [436, 384, -185, -399, 208, 771, 396, -395, -767, -285, 305, 313, -354, -508, 114, 724, 551, -274, -636, -288, 271, 204, -431, -572, 42, 750, 598, -92, -433, -141, 318, 233, -431, -702, -17, 674, 648, -73, -354, -54, 402, 248, -397, -808, -269, 489, 601, 18, -369, -12, 495, 399, -371, -791, -396, 333, 479, -21, -369, -29, 572, 492, -250, -748, -442, 215, 396, -101, -374, -80, 601, 569, -160, -637, -424, 207, 347, -203, -533, -20, 592, 684, 51, -494, -398, 208, 300, -229, -636, -235, 488, 675, 111, -404, -272, 252, 326, -230, -651, -331, 384, 630, 165, -297, -148, 349, 418, -184, -716, -474, 272, 507, 141, -292, -157, 421, 484, -83, -636, -488, 148, 428, 75, -328, -115, 397, 548, 69, -576, -546, 20, 403, 17, -381, -201, 410, 655, 144, -480, -448, 51, 308, -57, -473, -258, 356, 704, 252, -383, -435, 144, 294, -53, -551, -437, 237, 659, 305, -261, -283, 126, 379, -68, -607, -490, 121, 577, 356, -215]
2857b15rM86J74m32n64K1N55L94j67m59l0N05K93m55o17r9N26M73j83m20n3N17
2879B41L50l27n93k26M16M07j51m52j5N83M01k49o63k21L82M06j74m94n1M91N23
2900E84j58n80k15L42K97k22n00j7M62N52j31m79k30L34L65l34m97j62N23N19
2920D53j19m36j55M02L07k65n85k76M82N30q0l53k00M04M45j99o39k74K78N39
2940B59j5m68j28M11M97r8o26k98K53M18k1m46j63M32M92J5n67l16J58M35q1m52
2962c09k36M05O02Pn32k41J86M07j03n04k57L00O48R8l79l74K20L70k1n06l63
2983e82K78N15J83l99k39J97M09K4n32m34K27M97J49l36k24K15M88K0n14l86Q6
3004c58M90Q2l40k11K12N14J39m72m11N9M33N2l43k75K14N60J46l65m06J1L84
$$ y = [-215, -224, 262, 436, 4, -560, -539, 16, 410, 243, -216, -246, 259, 552, 97, -520, -619, -93, 380, 197, -223, -276, 241, 591, 264, -329, -555, -139, 268, 117, -335, -350, 233, 634, 385, -278, -499, -117, 289, 115, -379, -430, 61, 584, 426, -154, -369, -27, 270, 48, -452, -469, -7, 545, 414, -65, -295, 39, 404, 70, -427, -589, -66, 453, 334, -102, -257, 145, 452, 187, -398, -674, -192, 338, 258, -95, -295, 109, 554, 355, -284, -558, -280, 259, 244, -224, -352, 59, 556, 458, -168, -466, -213, 205, 184, -262, -425, 7, 499, 514, -53, -369, -211, 224, 143, -309, -545, -140, 462, 469, -63, -304, -118, 289, 186, -318, -575, -275, 373, 471, 92, -282, -62, 308, 287, -219, -582, -304, 211, 394, -5, -244, -47, 362, 386, -146, -580, -353, 144, 293, -43, -267, -52, 436, 456, -58, -444, -358, 132, 214, -126, -337, -125, 389, 528, 56, -355, -296, 137, 189, -154, -429, -215, 345, 491, 126, -280, -269, 115]
3025A15J49m32k85J52N79J90k93l70L5L48J05l92m47K20M71K55k35l21O8L28J20
3046C60m46m62P9M72L21k06l34J17M15J54m49m88O1M34K21k45k08L2M75K22l94
3067A31m83J3L11K15j67l34P0M88K60k62l98j52L60J54k24l65Q0M34L54k12m48
3088a75n2L43J52k91m13L5M61L49r4m21j11L95J50k64m63j0L38M25j80l04k2L05
3110A53K54k46n37r0L70L27o4l42j6L66K78k03n09j32K48L52j34k84m7M06K90
3131D40j31n01j57K73K31r1l07q3M02L36r6m24j95K21K67r6l96r2L38M48p7l20
3153a0k01J94K80j26m48j27L23L72L2l47j14J81L11j64m39j86L06L99L4l43j05
3174a78K76K59j55l44k84J87L97L3k86j56L18L20o4l81k86J84K93Pl09j36K75
$$ y = [115, 264, -168, -453, -301, 278, 468, 175, -195, -160, 188, 293, -99, -546, -326, 145, 400, 165, -156, -88, 240, 360, -86, -548, -469, 3, 324, 118, -216, -99, 316, 470, 21, -467, -406, 28, 249, 4, -204, -172, 303, 525, 131, -352, -339, -28, 187, 20, -314, -244, 244, 504, 242, -156, -308, 52, 206, -18, -383, -303, 131, 485, 273, -175, -227, 116, 268, -23, -436, -401, 60, 409, 315, -106, -217, 178, 328, 64, -399, -409, -71, 354, 174, -130, -152, 153, 407, 161, -376, -466, -96, 231, 167, -175, -191, 175, 453, 250, -259, -391, -143, 209, 75, -209, -256, 150, 440, 309, -192, -349, -76, 155, 64, -243, -326, 76, 412, 316, -108, -303, -82, 185, 89, -307, -399, -61, 387, 310, -10, -211, -17, 263, 137, -311, -438, -115, 257, 289, -58, -172, 9, 320, 156, -283, -469, -163, 236, 270, -73, -178, 98, 357, 202, -142, -426, -239, 158, 191, -95, -251, 67, 387, 323, -58, -344, -160, 133, 140, -169, -305, -30]
3195c0L64L6l86k68Q8L13K4l73j10K69M02J05l79k70R1L57q4l43j52J44M51J40
3217C89l22k48J34K84m7l47k02J03M17J00k50j82J75K34nl07l87J53L71J26k04
3238a5j87J73L23N0l46l28M4L53Q6k24k17J87L35J24l17l01n0L73N1k04k18J48
3260a60L76J60k39l40PK51Q6k58k23J25L61K01j79l24m7K94J26l24k67J35L37
3281I8J91j36k78K9K54J11l22k98J7L60J93r4k38qK90J56k37m35M1L04J51q6k13
3304a50J7L71J05j99l64j08K74K18j54k43N2L79K28k04m05m3K35N5pl91M6L93
3326A05K65j56k51j00J29J33r4l03J3K64L34j12k68q6J88J67j87l52l3L09K67
3347B32l8k65%J92J15r6m30m1K52K14O8l32k9K52K23j65l19j43J99K61p8k26k8
$$ y = [-30, 334, 370, -16, -284, -196, 117, 141, -232, -342, -73, 329, 434, 55, -215, -124, 233, 149, -194, -346, -202, 249, 389, 67, -181, -47, 237, 190, -157, -359, -256, 161, 261, 11, -171, 4, 238, 233, -74, -461, -308, 63, 189, -15, -202, -29, 294, 344, -2, -330, -286, 67, 153, -71, -288, -101, 234, 358, 41, -260, -310, 63, 114, -90, -308, -160, 216, 376, 137, -203, -196, 55, 141, -117, -340, -215, 146, 347, 168, -156, -203, 91, 217, -107, -374, -239, 98, 289, 153, -125, -96, 158, 269, -53, -351, -334, 26, 219, 125, -113, -121, 169, 325, 88, -347, -306, -2, 149, 63, -150, -133, 238, 343, 144, -220, -328, -54, 164, 10, -233, -181, 198, 426, 222, -183, -226, 9, 64, 57, -334, -288, 105, 370, 214, -37, -137, -8, 125, 31, -272, -259, 5, 339, 227, -41, -127, 61, 228, 41, -311, -344, -35, 232, 194, -71, -71, 121, 236, 140, -290, -331, -79, 135, 203, -129, -158, 94, 317, 152, -167, -310, -111, 150, 72, -154, -182]
3370a82L21J53j0l32k46J89K09l5k40n1K45K70k4l09j71J25J80m6k75o1K31L72
3392C13k6k72j41J30J93j04k83j82K82K77P1k41k07K42J77n1l63j77K15L36k3
3413A66k08p7J74J80o2l04j70R7K71M1j75q2J19K85l6k42k69J03L12Mk67j04J70
3436g4L09Pk40j64L2K20N1k74j33J40K74J28k11j97jK44k0j96j61J30K60J84k62
3459D6j73P1K25n5j87k01Q0K55J51r0k57N2K72L8k91k59P9K79J19j12j57M8K75
3482B08O6l14k73R3K44R0p2k18Q2K81Q4j67l12K6K06J23j81j78J01K68J32j52
3504A37k52lJ52Q9j57k06J00K75J98j83k69J9J81M5j82k27M3L00J70j31k14O3
3526e2J89N7j80k91N4K04K10j07j74J7J87Q9j85k20n5K32K00j27j53N2K01J06
$$ y = [-182, 139, 292, 282, -50, -296, -107, 102, 67, -173, -224, 21, 291, 267, -42, -213, -88, 92, 46, -229, -290, -59, 313, 287, 15, -126, 4, 197, 93, -190, -372, -90, 187, 258, 17, -190, 52, 229, 178, -185, -362, -147, 189, 166, -42, -119, 55, 235, 173, -131, -301, -204, 67, 108, -67, -149, -30, 255, 219, -23, -292, -189, 123, 127, -140, -244, -74, 235, 242, 2, -162, -130, 90, 141, -133, -266, -126, 148, 276, 65, -132, -133, 111, 91, -105, -266, -136, 124, 308, 46, -127, -56, 169, 114, -73, -274, -194, 61, 212, 122, -135, -83, 189, 227, -64, -323, -244, 35, 154, 42, -115, -67, 208, 274, -40, -313, -220, 24, 114, 42, -176, -94, 187, 271, 104, -208, -182, 24, 147, -34, -212, -111, 157, 289, 137, -115, -118, 34, 123, -34, -240, -140, 135, 333, 150, -119, -100, 81, 126, -56, -283, -240, 60, 230, 99, -115, -52, 137, 194, 14, -277, -223, -19, 191, 84, -90, -73, 114, 203, 18, -202, -257, -25, 175, 48, -105, -53, 148, 254]
3548B54j37k49j21K38J51q4k43P8K67J82k11k19r2J55J37j21j86J4K99J29n2k87
3570i8q0J47J84j51k63K8K59K17q2k40m5J52J01q5k47r1J94K60j6j97n1J44J24
3593A64q7k14j70K12J93K7j75l6J90R5l6k55j71J57K43p0j94j6J70K22q1k98n6
3616a86P7K31r5j78m6J95K62k7k45j84J47J62o4j76n3J01K89L8k24j26K3J69k0
3639G0k43o1J34K53rj08j46J06J64o9k08j68J35K42O2j92p0J00J93o6j42j93J01
3662a15J56M6j37l6R9J46K0k08j60N2J73L3j57m2J36J74M5k23j21j9K22J4j73
3685g5j26Q4K57P1j12k09N5J41l0j29j41J12J82J17j13j47K7J72K0k05j87P1J60
3708eJ91j38j05K4J31M3j67k03P2K08Q4o5j96R5J75K7j59j17m8J73N4j02r5P5
$$ y = [254, 117, -132, -253, -15, 136, 52, -191, -113, 154, 336, 125, -94, -186, -31, 106, -15, -201, -187, 112, 241, 189, -98, -178, -31, 153, 2, -261, -233, 26, 243, 161, -79, -124, 28, 129, 44, -203, -294, -100, 160, 144, -53, -104, 40, 164, 77, -137, -307, -95, 98, 125, -50, -86, 104, 199, 163, -92, -263, -106, 137, 67, -127, -143, 27, 249, 168, -130, -186, -109, 122, 27, -151, -197, -2, 260, 233, -12, -196, -49, 113, 49, -127, -180, -79, 210, 248, 24, -102, -79, 90, 70, -173, -234, -100, 153, 144, 36, -110, -4, 160, 91, -117, -285, -150, 92, 154, -38, -108, -8, 185, 119, -23, -216, -115, 41, 87, -50, -86, 13, 159, 179, -29, -189, -137, 36, 69, -88, -130, 6, 180, 225, 2, -119, -138, 84, 98, -75, -201, -117, 140, 211, 99, -110, -55, 86, 56, -73, -214, -102, 80, 197, 84, -63, -36, 136, 156, -49, -236, -165, -5, 186, 48, -57, -33, 98, 141, -26, -229, -157, 51, 135, 70, -126, -31, 144, 171, 12, -105, -153, 20, 74, -28, -123, -48]
3732d8J35J11j34j61r8K25P4j38j45N7K19J47j32j50q3J48L6q0j03l5K37J56j05
3755A33k14J6P9L0j12j17J0K32J15m4j20jN0P4q7k56L6J82J64q0j69J4J57P3o0
3780A05k73l6J16K23p9j24nJ35J33q9k42l1Q6J63m4j73J6J54J24J7l09J5K2J63
3804F7l2j88lK03J42rj85j34O4J48n1j80l4J87J40K5j91k5N0J11p5j75n1J56J80
3829A40n1r4o4J25N4l7k18p2J31J70ko3j14J03J60l6k23j25J16J83k0q2o9J01
3853A3J40j2j65j74J69M6L8q3p4R0J83l6j02j57N8P7j8j27o8J67J93qj01j47P3
3878b5Q7j3j71j0O4J55K0p3j32R8J12m7j85j51J28J79J07j96m2P9J54n5j50q2
3902a49M2J41O3r4rj2J69k9j49j07M4L6J51j37r4L7K76Kj31j61nJ29M3p0j31M6
$$ y = [-48, 87, 198, 64, -97, -195, 30, 104, -34, -179, -122, 97, 244, 112, -38, -121, 27, 63, -17, -120, -155, 82, 238, 133, -81, -65, 14, 44, -68, -185, -175, 57, 172, 128, 8, 7, 57, 131, 44, -212, -176, 6, 170, 90, -79, -65, 92, 165, 105, -168, -204, -88, 135, 56, -68, -73, 62, 195, 106, -136, -167, -81, 82, 38, -135, -119, 35, 159, 176, -133, -118, -96, 67, 35, -153, -156, 47, 189, 180, -5, -139, -75, 73, 22, -158, -192, -5, 135, 160, -31, -56, -6, 105, 30, -145, -196, -40, 140, 89, -5, -69, 56, 110, 73, -145, -217, -86, 84, 82, 19, -95, 8, 168, 132, -91, -216, -100, 83, 63, -19, -88, 13, 153, 141, -24, -198, -29, 17, 55, -28, -102, -12, 171, 135, 33, -124, -66, 11, -7, -134, -202, -35, 158, 150, 49, -98, -25, 62, 49, -122, -132, -68, 87, 107, 34, -98, 0, 112, 65, -120, -271, -143, 36, 143, -53, -95, -16, 138, 83, -67, -149, -107, 34, 97, 3, -6, -18, 151, 122, -27, -134, -90, -54, 97, -40, -134, -97, 179, 181, 50, -111, -116, 13, 56, -14, -145, -99]
3928i9K28M3j20j29KJ47J7j63p0J48N1R0o8j59O2N9L2j23j09K0K00P2p4r8L3M9
3954D1K9q9j50LJ13J55r5q2M3J16N0p3j71n8J37J06n4j03K2J52R8j35j80OM0R3
3980A4l5p5nJ74J15j02j77L4Q4N2m8j54J1J80P8o7r5m2R7L6p9r0p3J69J27o1q7
4007a9j6J33j5n1j16j13J50J80r2m0r2J12J26p3j43q1O2J67Rj26m3J61K2L5j90
4032e3p4Q1Q2K3r2l5N2J43m7j29r0O0J32n8p6l6J43Q4Nj24r1P3M1K4j61J1O0J41
4060H9K9j02p8L1R8n1j58M4N8J18Q8j14j37J26O3k4j51q8P8J51L9r7q1J17P3k6
4086I5j62n5M7J22j9p3j09J30J48Oj23j88J33Q6Q4j67n9N2K20p4p5j39N5R9Kj12
4112g6l1M5J20P6j41o4O7M8J0p8j12O7J21M8m0r4N0R5n3j17o6L5J07P7j01j3l6
$$ y = [-99, 129, 172, 52, -77, -75, 72, 89, -74, -144, 4, 55, 145, 77, -82, -20, 39, 71, -52, -161, -141, 59, 131, 57, -41, -8, 41, 70, -19, -169, -166, -53, 102, 7, -75, -32, 84, 134, 61, -110, -168, -31, 75, 21, -82, -60, 92, 190, 55, -125, -119, -79, 14, -21, -96, -101, 73, 188, 86, -91, -57, 27, 79, 31, -123, -112, 68, 146, 79, -16, -58, 39, 75, -4, -94, -167, 2, 129, 68, -19, -35, 98, 83, 32, -84, -197, -47, 133, 41, 1, -91, 21, 147, 74, -69, -150, -88, 79, 88, -38, -81, 80, 102, 137, -53, -127, -46, 36, 59, -33, -68, -16, 127, 80, -49, -139, -79, 53, -5, -81, -117, 26, 110, 115, -9, -100, -27, 14, 38, -123, -112, -52, 89, 118, 16, -62, -31, 67, 16, -142, -98, -40, 78, 166, 52, -85, 41, 104, 80, -71, -159, -81, 70, 109, 12, -69, 48, 121, 95, -67, -122, -75, 47, 28, -45, -154, -24, 124, 130, 7, -181, -48, 38, 122, -45, -104, -52, 168, 94, 19, -120, -65, 34, 36, -76, -107, -62, 58, 134, -7, -71, -4, 44, 54, -24, -136, -69, 52, 100, 60, -34, 16, 111, 58, -59, -125, -90, 17, 94, -7, -20, -56]
4139e6J37nr8r3M5R0kqq5Q0K5J12j25j16nR5M5n5o0M0J43%q8j48O4J06m5j0n4
4168g1j6J74N0j52Jk9N6l1k3l6l7K08N0n0j20kL7L1r3p2JJ25P6n0j03N7Q7j0m5
4197A3j21l2J08P0%k1njR0p2q9j17J53J11r1l3j0Q6M2jj46l2O1J0J4k9l2P1J63
4226A60m9j73J9PJ12l3j54L3J26P5q2l6k8L2M8m8r5N1K2J32j08n2OO1Pl5n1o3
4254a16R5J04o9mr5L8J28m8r7n5N7P2K8o9j2N7Q4m5j31n0Q6K6O7q7NK2N0M8j05
4283a6m0m6J45K1j05k7N4Q9K4q8p3P3K5m6o9J5J9M5N1k4r0M7P7k5j14p2Q4Q4P8
4312I6q6q2P3J8M5j33o9O0N8Q5o6pOJ14r3m1r1R8j0O8q0L8J0P0kn6p6k4J02O9
4342I4j11r5R8J08%j26k1j3Q8lm6j4J5P5O9q8k3K9L0o6k8q7OJ66K0k9q5P2l8L3
$$ y = [-56, 81, 76, -22, -115, -70, 20, 18, 10, -75, 5, 30, 142, 17, -99, -104, -9, 36, -19, -79, -39, 104, 104, 16, -132, -68, 38, -7, -17, -71, -87, 87, 137, -15, -14, -43, 13, -18, -41, -77, -114, 94, 144, 94, -26, -28, 9, 40, -53, -125, -124, 1, 77, 27, -76, -19, 68, 58, 13, -108, -140, -32, 38, 38, 17, 12, 11, 101, 29, -60, -177, -24, 87, -4, -37, -47, 39, 81, 80, -66, -98, -37, -27, -13, -42, -74, -3, 160, 111, -62, -43, -36, 76, 43, -111, -78, 48, 123, 41, 5, -23, 9, 57, 9, -86, -35, -13, 119, 11, -41, -35, 26, 33, -2, -53, -116, -21, 83, 14, 10, -85, -47, 81, 33, -64, -119, -62, 10, 38, -31, -43, 14, 98, 53, -78, -128, -42, -16, 51, -36, -31, -9, 41, 89, -16, -56, -102, 43, 64, -41, -68, -14, 75, 99, 11, -62, 11, 36, -10, -79, -64, -45, 0, 51, 27, -63, -16, 61, 36, -78, -150, -66, 18, 96, 10, -72, 1, 19, 64, -69, -138, -78, -20, 65, -1, -8, -2, 112, 19, -22, -113, -15, -25, 43, -37, 1, 11, 81, 79, 23, -53, -77, 25, 94, -17, -112, -14, 94, 94, -32, -53, -66, 22, 19, -27, -41, -26, 49, 118, 30, 7, 36, 66, 0, -28, -115, -109, 57, 77, 48, -37, 35, -3, 30]
4372C0o7m8QQ4Q9n4o2K5P4l4j0j43L1O7O0n9j9j4M5O0%j32j5J5J44q5ok3N3K2
4402C6k5r4j8J05Mo1J8m6J39M4j00%n4N7j6Kq8M3Q8j7J3l0n2R8j5L6j69K0N0J22
4432I0Jj30K7L1L7q2o4l3R6Q1k5l6lK0M4j1j04m1M9J19Rr7oR6l3K6n9j24J10M6
4462C4qp4L8j7R9k1q0n3L8J10j15n5O8N7Q0Mj71L7NP3Lr7o3O3O4N1p3m3K1J11
4492H6n8r6j7kJ07Lk8j5O4K5n7j05jQ1M6%k8j4J2Q1m1l8n0J0K3L3rr9P8L7J3j6
4524B5j07K1L5NJ7o8R1N3Pp0p2pN4M0p3n3P3R9j5k6q7K8O7n6Nj05Q4O3N4r7m4
4555e9P5L7J1n6r4M3K4J7J7n8N0K1J5p1o1oP0M6mj00N2J23l2o6p8J0N4N7m8l6
4585d7L6N0L7l1o1k1K5NQq4J01M9Lj3p8m3Q7pk9Jl9P6O1m0l0n5O1M3r8l2j0J04
$$ y = [30, -37, -85, -77, 7, 96, 42, -20, 5, 79, 45, 35, -108, -77, -10, 50, -9, -28, -42, 3, 63, 63, -69, -84, -69, 75, -10, -16, -39, 14, 36, 11, -83, -101, 4, 8, -53, -35, -81, 58, 102, 2, 2, -52, 5, -11, -9, -97, -54, 34, 17, 30, 0, -52, 46, 31, 67, -102, -82, -32, 90, 91, -39, -12, 19, 56, -26, -90, -123, -27, 54, 29, -7, -10, 10, 54, 43, -61, -102, -53, 66, 75, -22, -28, 68, 35, 61, 2, -122, -12, 34, 26, -48, -10, -27, 72, 51, -29, -82, -44, 66, -49, -104, -36, 21, 101, 105, -66, -29, -24, 49, 52, -45, -108, -45, 19, 70, -3, -46, -25, 86, 28, -68, -85, -87, 20, 23, -5, -20, 44, 69, 12, -93, -94, -13, 33, 33, 5, -9, 3, 84, 43, 5, -45, -35, -12, 21, 12, -87, -9, 28, 41, 25, -82, -61, -26, -21, -4, -72, 19, 72, 79, 9, -63, -70, -16, 24, -49, -102, -29, 70, 55, 29, -58, -30, 37, -19, -14, -119, -35, 28, 82, -15, -59, 16, 53, 64, 8, -86, -43, -19, -2, 15, -43, 7, 28, 43, -28, -89, -95, -25, 21, 17, -83, -31, 92, 60, -6, -84, -74, -20, 37, -11, -47, -11, 39, 76, 45, -16, -37, -12, -7, 1, -83, 18, 67, 70, 57, -21, -64, 23, 16, -13, -12, -51, 25, 86, 46, 16, -39, 22, 65, -33, -65, -75, 29]
4617B9OJ1l5j3K4Q4j30l4k2O3L3k7l4L2J15n7n3m8J3M7J1j7k7J4L7P3n9m9p1J08
4647B4K4p2o2R7j3O4k5m6m0P4J2o1k3LN0L6Lm5l1NN7q3k2K3L3J22p5J4l0k7M6
4678C2l2n7j2O3J5M2m8K7j5O0k1q4j2L3QK1km0N3L9o1Mo6K6O1n3J4m4P7R6j4j08
4710Bm7M2oOMn9O9O4Oj20kJ8O8j0o9J2j3P3pm2J6J6j2l8L4j00N7P7k4n9J7O1J6
4743E0j8mj17J5J08Jl4q5Q2P9k2q6lj0RP7o2m3Q4P8o6o2l3N6j6O2p5k9N0K7L5
4774D8k5o8o1J09oj3K0l2J8O0l8n3K0J4Qp1rL2P2N0j8l3m9O6m6K6o7L2j3P1m1
4805Ck3jO4kn2l4k8N8L5l2j7K3M1L8k0o3n0O2l1L5p0O2L0Pk4j7o4O6M6n0Mk1O9
4838D4N3m6o9j3L4L6n2j5k3L0L0lkj2K0L9o0j10J22l8J13l4q2RNJ08k7r3qM8L7
$$ y = [29, 35, 46, 11, -2, 22, 106, -24, -58, -80, -17, 16, -11, -45, -13, 102, 45, -8, -56, -43, 4, 15, -2, -29, -15, 22, 95, 36, -13, -84, 24, 48, -24, -86, 11, -2, 62, 37, -9, -49, 25, 37, -24, -47, -44, 6, 42, 45, 0, -31, -26, 31, -52, -74, -51, -18, 104, 29, 43, 13, -14, 32, 0, -57, -69, -6, 9, 51, 3, 30, 15, 75, 54, -30, -42, -9, -1, 20, 18, -22, 31, 70, 9, 13, -53, -27, 34, -19, -5, -49, 28, 124, 110, 2, -45, -3, -9, -3, 1, -58, 11, 75, 81, -39, -41, -23, 45, 35, -34, -22, -35, 38, 31, -11, 5, 21, 9, -29, 5, -95, -38, 39, 15, -44, -27, 34, 50, 32, 28, -89, -74, 34, 35, 1, -84, -2, 77, 55, -31, -34, -44, -35, 42, -20, -63, 21, 99, 33, -29, -62, -6, -22, 40, -35, -64, -14, 13, 48, 23, -45, -106, 3, -3, -16, 4, -28, -10, 50, 12, -41, -21, -7, 1, -70, -79, -47, 25, 75, 57, 24, -25, 41, -5, 21, -46, -14, -27, 44, 3, -20, -21, 43, 41, -11, -45, -73, -15, 20, -12, -29, -6, 35, 73, 53, -10, -60, 2, -29, 6, -64, -2, 28, 35, 11, -6, -70, -4, 42, -8, -4, -25, 44, 97, 51, -18, -31, 3, 39, -13, -28, -51, -21, 9, 6, 4, -8, 12, 51, -9, -119, 3, -35, 78, 44, -38, -29, -24, 84, 57, -36, -44, 4, 41]
4869D1p1K4L2N0m0k4l0j8M5mN1r2K5N9J8%q9k9M8j4L2n9j8J30Rj9m8m6mO5pj41
4901a24J20k0L5M8j00PQ7l9L2r4j7O5K6jL3n1k8L3jq2l1J20n5L9K1m3O3ql8n6
4931e9J5N7kL3n9K8k3Q6n1J5%l9K7k8Qn5K7J10p7j6l8JK6k3LlM9M9j7j2k5k1O9
4964E5j5n1j1oO7m0pJ0L6k3nl2k1OL7MJkK8jmk7n7M7k7J16o6k9J3P3l7l9r3Q5
4998a5oM8j1l3mR1m4K0j02O6m4O8k1j32J37J1L2o2K4l7K9Nll0MP4n4J1n3NJ9M8
5030D1n4m7PP4J9j8k6n2L8Mj6J3MpL6K1p4N1K4L6p9Lj9L0J1m1oK2J9K3k5Np6K2
5064c7R1n8k7J7N7Pk1m0k6L6O3j53N0J9O0K1p3mk4P7jr6ON6L5M1m1o3O6n7P8l1
5096B8o1m6R0J1k0RJ2k8L0J9p1k0k2J65o1l6J4m2J26q4k6k6N4m1Pk3M7pO4k0n0
$$ y = [41, -30, -6, 26, 76, 36, 12, -18, -36, 9, 5, 56, -36, -11, 48, 66, 66, -23, -52, -4, -18, 14, -45, -63, 67, 76, 57, 9, -37, -41, 24, 17, -124, -4, -24, 11, 59, -41, -34, 53, 14, 46, -48, -65, 0, 26, 25, 58, 7, -21, 12, 11, -71, -102, 18, -37, 2, 23, -20, 43, 35, -3, -59, -44, 13, 11, 44, -15, 13, -10, 76, 25, 40, 40, 1, 28, 0, 8, -47, -20, 90, 13, -3, -41, -40, -14, -37, -34, -37, 12, 61, 44, 32, 7, -14, 55, 40, -11, -22, -28, 39, -1, -8, 2, 38, 15, 10, -22, -43, -37, 0, 4, 5, 3, 31, 30, 26, -1, -58, -11, -38, 78, 12, -17, -4, 69, 32, -7, -100, -15, -21, 27, 16, -17, -21, 70, 26, 46, -56, 10, -34, 34, 13, -119, 18, 29, 61, -1, 23, -14, 15, 20, 17, -13, -9, 65, 11, 22, -31, -26, -7, 41, -13, -60, -53, 21, 40, 22, -4, -56, -18, -14, -30, -17, -13, -20, 16, 37, -37, 14, 38, 74, -5, -2, -21, 9, 20, -21, -27, -5, 14, 37, 12, 17, -59, -37, 54, -4, -31, -14, 43, 50, 29, -11, -37, -1, 62, -91, -41, -22, 38, 59, -14, -18, -42, 35, 34, -62, -56, 0, 35, 76, 35, -28, 38, -19, 59, 28, -33, -79, 11, 22, 2, 11, 23, -5, 25, 44, -27, -47, -69, 96, 35, -1, 13, -29, 97, 13, -13, -39, 15, -26, -19, -42, 5, -2, 62, 42, -8]
5127hK7m6M9k8K7p4M0O3rlo4L0J6k2l3j8J8O7k3Rl6M7jj2j7m4O8K3m3Jl9Q6o2
5160a1J9oj8QJ6k6J5Qj9M8j4n7j5L6k1O4L2m8K8k9J7n1K2J8j9l0P0p0M2M8l6l3
5192a2j5k1lK3oL7kJ3jlj1kK0L1k8n7K3J4M7m8m0K9O1k3j9ok6M2J8Np0j9N8N8
5226F7r0jM5NQj2p6N8N0%p5Ol5K6K8k2O1n2J4K1l4l0q2R9L4n5J8jR0m0J1m4N2
5259D4o1P1j9m6J1RMQp7Q8m2j6J4r3M0O5M0mm9J3qk2P2n4J2kK4Jl7J6J6jJ6l9
5293fj3O1l3M2q1PK7Q2n4j6l9J5K9J5j2j6K7kJ0p4OJ5K7m8k3J7L3K9j4K3m8jj9
5326c4k3j9K6O2K3k0qj8k6K3j4J8Jk1M0J8k1m4R6n0J6l1o4N7m8M8LK3k9Q1j9o9
5358b3j6K0J9j5J5l3K8K9N5p4J0o6M8rM4l5M1l8nN8n6KoJ9Ok7%P3o6QK3n9P8l6
$$ y = [-8, 19, -27, 22, -6, 21, -53, -13, 50, 41, 38, -26, 4, 20, -2, -35, -53, -35, 32, 9, 18, -18, 29, 28, 16, -1, -45, 23, 46, 3, 4, -35, 51, -11, 8, 2, -16, -8, 8, -18, -3, 5, -14, 34, 20, -37, -52, -16, -37, 27, 59, 11, 39, 10, 27, -24, -2, 16, -3, -33, 37, -33, 9, 57, 21, -12, -27, -48, -51, -28, -34, 3, 1, 14, 13, 10, -1, -3, 17, 48, 20, -37, -14, 0, 47, -1, -41, -12, 49, 26, 7, 1, -25, 17, 35, 40, -30, -49, 9, 67, -23, -24, 21, 26, 34, 22, -54, 4, 54, 54, -21, -15, -50, -24, 4, -18, 43, -9, 5, 26, -8, -38, -120, -21, 13, -42, -24, -25, 65, 25, 36, -8, 44, -17, 54, 35, -11, 0, 9, 13, 21, -56, 32, -10, -26, -12, -105, -65, 0, 40, 36, -13, 0, -8, -30, 42, -12, 0, -2, 22, 23, -14, 2, 18, 17, 33, -6, -19, 42, 9, 51, -30, -23, 4, 86, 32, 16, -23, -8, 21, 36, 24, 8, 35, 33, 43, -31, -25, -10, 17, -31, -54, -37, -4, 25, 11, 34, -14, -15, -34, -57, -76, -50, 12, 35, 15, 7, -11, -37, -14, -28, -10, -9, -30, 10, 28, 7, -37, 59, 9, 25, -6, -70, -13, -61, -13, -10, 13, -16, 65, 46, -23, -39, -19, 0, -15, 0, -33, -5, 24, 79, 5, 15, -51, -3, -12, 32, -3, 38, 0, -5, 53, -3, -1, -7, 12, 18, -9, -9, 64, -2, 6, 29, -30, 48, 12]
5392A2k5k7N3L7l1lk6j9L6k8J0rk9J03k3Jn9N6J5o6rk5K1M8K1jk9N9j8l8J4n9
5424c8L2K7j9K1l7M9Jk5Ko1J4k2N6o0mK4P9nnm9J2ROpn3O5j7J8J3l1nk1Jj3J7
5459b6j0QO4Ml7J2J7j0n7kK9n3J34p5j2KO2q8O7n9Pk5M0K5l5P7p3rM5n5N8l8m1
5492e4R9j5m6J9k2L0K9o0M9r1Q3m4M8m2O3l4l5M8Nqj8k5jj1J8K0K5l6LL5m1%k4
5525c3M4kL6r9K8K2k7R9q4J7k6M2o9O4RQJ4m2j7n7R3l1J9k6j3K1NJ0J3n7Q6j5
5557C2m8m1K0NR8o7K4K0o1K1l0J3M8m3QJ7n1J2N2J8l7o4L9J9J6j0J2m8P1j9Ro2
5589b7J0K3k6J4k4mN0qJ1l5l4J24p3l7L2l4K7M0k8L8j00M5QJK0n8N2L0j7l3m0
5620e3L4L0J5mm8N1JJ8j27L8M9j4k2Q4r1M8k7J5J0RK5J4o9n3M1kM3qK7m2O1n7
$$ y = [12, -13, -40, 13, 50, 19, 16, -10, -29, 7, -21, -11, -20, -49, 54, 31, 32, -27, 29, 44, -22, -31, -56, -35, 13, 34, 33, 4, 63, 45, 7, 21, -38, -6, 21, 2, 23, -14, 35, 36, 11, 13, -48, -34, -56, 0, -60, -64, -40, 39, 34, 29, -20, -8, 1, 7, 0, -53, 12, -5, 13, 26, -5, -10, -31, -30, -43, -26, -36, -28, 36, 40, 3, 15, 32, 22, -35, -37, -8, -61, 73, -2, -14, -12, 50, -38, 29, -30, -23, -48, -8, 17, -18, 59, -14, -23, 22, -33, 25, -13, -54, 45, 30, -16, 3, -19, 11, 40, -20, 29, -62, 21, -23, 25, -17, 46, 12, -23, 25, 30, 22, 4, -21, -22, -33, -15, 5, 30, -6, -3, 32, -9, -9, -33, 11, 9, 45, -54, -26, -4, -31, 68, -16, 1, -25, 17, -52, 12, 21, 29, 43, 1, -16, -73, 20, -11, 8, -18, -31, -10, -5, 5, 18, -39, 47, 32, -16, -57, -37, -32, 66, -1, 23, 43, -18, 3, -27, -14, 34, -9, -1, 16, -35, -23, 29, 47, 10, -54, -15, 4, 20, 10, 22, -26, 45, 26, 35, -27, -17, 6, -20, -6, -30, -34, 16, 8, 19, -16, -50, 74, 1, -36, -4, -38, -11, 29, 1, 39, -61, -16, -8, -7, 13, -45, 7, 37, 20, -13, -53, -19, 11, 26, 22, -26, 25, 26, 44, -83, -45, 4, -10, -32, 52, -39, 9, -18, -3, 7, 16, 41, 55, -14, -67, -26, -28, 15, 7, 34, -8, 53, -4]
5652dj4j9J5j1L3JNl8Q1m5N9j10L5jk3J1M4k3k4N8k4O0o4n0Q8n5MK5n1M8J8K7
5684E6p9j8L5j3J2k0J7j2Q8p9j0N3n8Rk4M7j1K5l7OPK3K8k4j3j1J6l6P9k7o4J3
5716b2N8k8l7mJ2KoL2l0K3N3n1j4k3O1L7p2j2kj0J9M8k5Kn5L6mNN7o8N9k2k7l3
5750d1N2M8l7p8P5nNj6K6m7NK8K3m1j3mK9nL0m6K6J3j2J0k8Km7N8k2L3o5O7rK6
5784D0m9ml6M1jK0oj5K0M7l6q2Q1LQk9l2M1Ql1M8p5O8m6K8J0k8jjP5r9M6oK2M0
5819F9j38P7k0L8m3J2k9R7j11Q8k4l6j2O7j4m4OM1Nj8Jo5LN9k1k1J2QL1j9nK1
5851A5KRp3K6k4K9O%oK1J6k9Jk6OqM0l7L3mj1k5P3o9N2m8K7K9m8K9L7k7mj5Pn2
5887d8O8k3k6OQNM0mo5J6OP7n0qj7J8J9K7r5L0L9J0m1K9k3M5kn8lj8K4J2K2j4
$$ y = [-4, -18, -37, -22, -33, 0, 1, 6, -32, 49, 4, 63, -47, -12, -13, -36, -25, 19, -4, -28, 30, 6, 66, 2, -48, 40, -15, -11, 14, -37, 11, 29, 56, -23, -41, -6, -19, -7, -27, -10, -22, 66, -13, -23, 30, -28, -19, -43, 4, -7, 18, -19, -13, -6, 17, 45, 21, 8, -3, 13, -23, 56, 29, -35, -22, 36, 8, -29, -33, -21, -19, -25, 7, -23, 0, 53, 2, -12, -35, 26, 63, -9, -21, -23, -33, -14, 34, 9, 11, -44, -8, -12, -7, 50, -18, 41, 19, -8, -41, 11, 59, 22, -56, 19, 14, 19, 3, 29, -18, -13, 15, 38, -3, -16, -20, 9, 4, 34, -12, 14, 27, 15, 25, -3, -1, -48, 10, -12, 21, -44, 23, 14, 40, -9, -13, -49, -8, -9, 11, 5, -10, 10, 57, 21, -61, 20, 23, 31, 2, -30, 11, 19, -12, 36, -39, 29, -17, 11, 21, -7, -8, -9, 66, -33, 13, 7, 29, 69, -69, 8, -12, 26, -17, -5, -34, 63, -48, 40, 16, -20, -32, 35, 21, -23, -17, 24, 29, 11, 12, -53, -50, 9, -12, -33, -21, -13, 18, -1, -6, 15, 17, 26, -47, -21, -45, -16, -10, -10, -16, 5, 21, -8, -7, -33, -27, -35, 5, -32, 1, -3, -14, -39, 34, -35, 17, -31, -4, 25, -23, 6, 43, 16, 12, -3, 4, -48, 20, -3, -29, -23, -15, -10, 30, 26, -39, -23, -17, 60, 10, 2, -15, 3, 22, 49, -46, -16, 23, 33, -8, 21, -2, 43, 41, -17, -20, -38, -14, -2, 20, 6]
5921Fl4K8L0n0j2j9M1L6l2p1P2j1N5q7k1Q8k2n6M6OK0o0O6ll2l7N6j4k8P3J7n5
5953dK7o4O8j2j3K9m2j3J0O2m6K6K1n4L6p1M7j9M5K8m8kl8P5q0L5O2q6j6L0mk0
5985c1k2O4K9l8KQp5O9J0l0J9k3M0m1M5l9%J3M3l2lm1K9N6j3oq3M6j6K5Jl0K1
6018ck7J5L4k2K0k6PJ7k9L6n0K5mk2R5r0L7Lk7M0j2o1R6n7K9m9M2p4L5L3K0n0
6050a9j9K6JM9o8K3l1oJ6k1J1K5nL2J7mJ7j5Pm4jJ5j2K2kJ0j6M6k4M4k0q8RK8
6084CM9m2l0K4PlNm4L6j2K1lJ1O1k9q5%O6k7J1n8k0J8J6RL9m4qo3R4M9q4K2J9
6118Hk8M9J6n6K1l6O4m6QMJ5L3m2m6L1L4o7K9j7J4k0j4J27q3k2M3l1N8n3%K1j2
6150Bk2j3j2J13m6k5k3N4k2j0n%MK1o9L1L0k6j2O6r9L0RN4pk1n5L9K1k9K5l7N5
$$ y = [6, -28, 0, 30, -20, -32, -51, -10, 26, -6, -77, -5, -16, 39, -48, -69, 19, -3, -59, -13, -7, 13, -47, 19, 16, -16, -53, 3, -11, -39, 34, 51, -4, 23, -41, 27, 15, 2, 31, -11, -24, -14, 48, 2, 28, 49, -5, 31, -40, 7, -12, 33, 61, 13, 11, -27, 48, -32, 3, 65, -21, -37, -7, -11, -31, -53, 11, 40, 2, 4, 12, -63, 6, 16, -14, 5, -18, 22, -19, 26, -13, -13, 0, 43, 11, 8, -33, -4, 52, 39, 33, -50, -4, -20, 5, 6, -24, -3, -30, -15, 19, -3, 17, -9, -2, 15, -14, 22, -28, -3, -7, -29, 66, -24, 13, 16, -11, 29, 17, -44, 52, -5, 24, -25, 17, -57, -22, 11, 31, -19, -38, -12, -11, 38, -30, -7, -38, -44, -28, -49, -38, -13, -18, 14, 31, 27, 44, 29, 36, -8, -9, 6, -6, 16, 14, 24, 8, 54, 30, 74, 54, -34, -25, 3, 52, 10, -20, 4, 11, 8, 13, -31, 5, -7, 14, 11, 22, 83, 54, -31, -31, 35, 8, 19, -39, -59, -41, -25, -16, 23, -21, -29, -92, 2, 51, -33, -11, 8, -20, 29, 45, -11, 10, -26, 38, -8, 0, 4, 19, 52, 10, -36, -5, 29, -38, -9, -26, -12, -32, -46, 81, -2, -24, 19, -12, 46, -7, -7, 14, 2, -20, -33, -45, 68, 22, -3, -26, 28, 6, -4, -9, -9, -5, 16, -53, -22, 8, -18, -30, 36, -63, -33, -24, 30, 23, 2, -53, -14, 7, -22, 3, -34, 21]
6183B1k6L6J5j3m2j9K3K0k0o0J08lLo2N3l4N1j2K0q5J5O0k3l8M3l5qL8oK4o7J4
6215iM3k8J0j4L0j7l2J7k5N1o4O5j9Ok5lM4RKKm8po2O4J1J3nJj4M2l8J4n4K9n
6250a6J9k4K3JnJ6k3J7L6ql2K9n9J5K1klm5O4o7L9n0M1N1ml6ll5L9l2m4Q5Rlj9
6285eMj7L2nMJ1k7L3Jl2j3K8n4N7qJ0l1k9Q4l2MNl8j4J08m6j1o6M5M1LKK0mk9
6320C1l8m7N8L6l7o5N0rJ8K5l0J0n9O2mK9l5n7O0NJ7o6K4J9J5j3j2J7L7Lm8n2
6352e6M6Oj7K8qk9nN2j3m0L2l1M3j3J0OJn6J13n3k2K6M0Jo9plK6n2K6L1J2m4J9
6386@K6l6L5l2K2n0R9m2m0M4k9k2K1jK3l4l8O1L6p8J7L6mj4rL1m1N4l8M1m4K4
6418A8p7O6Kj1l6K0OjM6Kl9j2J4L4l2k8N4j2J0l9rK9j7qnj3K9N6l0K5j06P8o7
$$ y = [21, -5, 31, 46, 33, -9, -28, -5, 15, -5, -65, 43, 40, 43, -19, 34, 0, 51, 39, 59, -26, -11, 49, 26, -12, 31, -4, -12, 26, 20, 44, -23, -9, 34, 6, 16, 2, 32, 15, -17, 0, -25, 26, -38, 27, 8, 14, -11, -14, 30, 39, 41, 43, -5, -12, -74, -10, 1, 14, 9, 10, -4, 38, 0, 14, -40, -11, -16, 3, -21, 2, 3, -2, 14, -9, 8, 44, 36, 4, 33, -26, -11, 10, 8, 5, -40, 24, -43, -4, -54, -13, 38, 34, -2, -5, -40, -1, -33, -77, 8, 17, 14, -5, -1, -18, 14, 9, 13, 24, -3, 30, 31, -1, -14, 14, -40, 17, 9, 19, -12, -41, 43, 11, 15, 20, -18, -32, 76, 30, 19, -47, -2, 39, 42, 44, 64, 60, 31, -7, -54, 4, 40, 3, -62, -12, -21, -3, 22, -8, 2, -57, 5, 1, 30, -5, -62, -2, 3, 20, -46, -22, -3, 12, -1, -13, 4, 41, 44, -4, -56, -10, -4, -21, 7, -1, -30, -35, 17, 4, -36, -4, -35, 8, -5, 5, 11, 12, -44, 69, 16, -6, 20, 60, 61, -8, -15, -18, 8, -44, -18, 13, 25, -19, 0, 26, -10, 25, -7, 15, -35, 64, 22, -18, 26, -3, -25, -4, -5, 18, -16, -54, 7, 43, -35, -18, 18, 14, 0, -9, 22, -19, 35, -3, 38, -6, 18, -59, 7, 9, -2, -38, -18, -12, -13, 33, 35, -4, -16, -2, 32, 0, -28, 26, 14, 24, -15, -24, 5, -12, -20, -25, -38, -9, 47, 17, 42, -64, 14, -53]
6451e3O4m7OJ4J3m0L7K7p3O9j6M4k8o5J03l1p0L1pj5O4o8J9K1j8j1m5P3M0l4j0
6482fL2JKl3j7N3n5m8P3L5j7o3L6l0K7p%n7M5Q4n6o2O1m6O9j9m4L4Ol6N5m9L0
6515bJpJ6k2j7Qj2J9Q8j00M5J5kJk7k2K9J4k0j0N5m5kK2k1K4m0O2n9oL4j8qQl2
6550c1M6K5kq4L8kM7Kp6J6%K1k5K1nl6L0J3KmnM0n8J8k2P8l3pL0k2K0pl3K1k6
6585a0N1k1qMqN1n7J9l8J7J7J4k9M9r0M3l7O3L4q9K9Qm2L0k4L4mk7Ql5M1K5m0
6618b2NKOm0N3p2N2L9Nl9JM7j1k5K0k5j0O2kn5l2K7k9P6k5j4P2p4N9l8k6K5m2
6651c0K2K4l7L6j3rj3L3j9K6m5ML4MJ8k0%M0n9K6mo4M5J0j2%M4l3n6Q9m5j2K4
6684HQm8J3OL3mkk2%LK6m1P8k3n0J5qM6m7J7j1J4j2k2l7N4l4J7L5l1L6j00L7Q9
$$ y = [-53, 11, -36, -30, -16, -3, -43, -6, 21, -52, 17, 1, 45, 17, -48, 55, 24, -46, -15, -22, -37, 27, -41, -22, -1, -19, -30, -75, -2, 38, 4, -6, 26, 27, 29, -4, -21, 32, -23, -71, 2, 37, 20, -43, -7, -37, -10, -17, -17, -74, -29, 55, -1, -63, -2, -48, 21, 2, -42, -8, -2, -38, 17, -32, -2, -1, -8, 8, -14, -31, -23, -35, -16, 72, -28, 17, 32, 30, 31, 4, -18, 11, 25, 5, -5, 50, 5, 3, 25, 4, 28, -12, 50, -9, -15, 19, 1, -7, 1, -31, 15, 40, 38, -46, -8, -10, 37, 39, -37, -21, -21, 0, -25, -4, -9, -45, -15, -2, 0, -4, -9, 31, -27, -9, -31, 47, 14, 7, 37, 15, 35, 28, -5, 16, -10, 41, 20, 12, 16, 8, 59, 2, 21, -17, 0, 17, 31, 2, 51, -39, 4, -33, 30, 64, -25, 4, 12, -30, 0, -24, 10, 6, -21, -13, -48, -7, 18, -22, -17, -15, -9, -49, 4, -68, -16, 23, 28, -11, -10, 37, 26, 1, 21, -4, -14, 48, 46, -9, -41, -14, -43, 33, 8, -6, 66, -8, 51, 13, -13, 12, -30, -8, 16, -21, 15, 2, -7, -20, 13, -6, 20, -25, -21, 13, 17, 35, 15, 15, 55, -4, 22, 18, -46, -1, 9, -3, -3, 41, 8, -48, 41, -4, -16, 8, 16, -32, -19, -13, 20, 16, 14, -8, -8, -5, 21, -20, 58, 35, -15, 0, -8, 38, -9, 8, -3, 11, -1, -23, -60, -6, -40, -23, 12, -19, 17, -83, -46, 43]
6718D3j6m1qJO3k7J1k1LJ8m7Qk6O5KJ1p1O2j2m3mNM5m0j2N9r9Q6JkLJ7j7m6K8
6753aK2j2K4p2M2N5q6J7o4Q9j5k1j7N0Qo0J21q8m5L6%rk6K3M4l1L1l5j4L2kj4
6785a8qNL7m2N3nPn0M6j5k1j3M1rL0p7N6j4l2O0m3L0j9K1J2j5L0n5K6m5qL2K9
6818B6o5M5M5o0K2K0k6k5k2M8M3p9j5O4l2L6k3J9M3p6j1L9Mj5L6p9k1R8%n7k3
6849d1O9l2nJ6j5O2o5J3K7l6L6j11R5k3J3L2qoj6j4l0M9j0J9k6O2p0J8nJ9N0k8
6881C9k4Lj1nm3L8k1O1p9O0jl2k1M3rK8m8QL6K9j8o9K3kk9O0k8J2L3l5p7O2L0
6914A3j7KL3o3pL1M8o2N6l4Oj2K1j6qOL1l0K9Qn4Qoj2N2n3J4L1k3L6l5k3N7m9
6948b2K2K6q5M4K8o1K9M3j7k6Ll6N4J3o0M9k1L4O2p0l1J7kJ2j1L9n1LJ4j4j2L7
$$ y = [43, 27, -14, -22, -21, 42, 15, 26, 5, 8, 26, -21, -13, -39, 26, 28, 39, -32, 30, 18, -25, -29, -24, 21, -19, -31, 28, -71, 15, 16, 14, 17, 34, 17, -29, -1, 21, 9, 33, -39, 3, 58, -28, -11, -75, 14, -1, -22, -39, 11, 19, -41, 80, -8, -53, -17, -17, -26, -52, -29, 15, -16, 15, -20, -34, -2, -4, -18, -26, -21, 16, -26, 27, 22, 29, -21, 25, 10, -11, -24, 17, 8, 38, -39, 17, 3, -29, 31, -12, 18, -1, 20, 32, 17, 47, -8, 18, -27, -35, -3, 26, -39, 6, 51, -9, 13, 33, 7, -18, -40, 8, 51, -28, -43, 21, -11, 25, 2, 21, 64, -12, -23, 16, 20, 5, 41, -38, -59, 39, 39, -18, -41, 28, -4, -9, 7, -8, 54, -11, 2, 29, -7, 29, -82, 13, -10, 3, 35, 27, 21, 5, -9, -39, 10, 0, 19, -7, 55, -15, 3, -2, 17, 67, 39, 15, 18, 7, 2, -41, -3, -24, 37, -42, 18, 17, -15, -36, 7, -2, 26, -22, -14, 22, 51, 33, -36, -13, -15, -44, 16, -12, 0, 33, -2, -79, -17, 13, -4, -2, 31, -32, -39, -8, 40, -22, 34, 0, 6, -6, 15, -1, -9, -3, 28, -2, 27, 35, -19, -11, -17, -29, 23, -30, -16, 15, -8, 28, -7, -30, 27, -22, 0, 26, -59, -15, 13, -48, -19, 24, 7, -19, -16, -52, 2, 15, -45, 4, -17, 17, 79, 9, -22, -5, -7, 5, -6, 33, -18, -15, -1, -15, -27, 10]
6980A0l9M0L5mm7p2O9K3j1QKK3n4m7N7JOrK0Rm5l6N8k8J0Pj8K0m6J00n7J9L9n3
7014a0J0J9l1oL1p2N1K4j4o4j5J00p6O3M0n3L2k4j7K1n4J1K9O8p1M7J9k2l9j2
7044a5J7K3m1kOJ2j6QM3k0No4J6M1l6L2l0J8RrKQ%Pl9k1N4k7J0J8j7K5M3p9L5
7079A6m1M3m4JM9J0o0k2N4j4O0o5Nj3L0l3J9j6L5K0n2J7LM4j7j6n1rM8Qj7RM2
7112D3q7P3k1k2L3Jk4L5n2K0j0l2j7lL8M5kko8N9J0n6lL0K3m1N4k4J6L1%j7oN
7146B9k1K5K6n1Jl1M9n5Q3k6k6rkJL2m7J5j5M0L1j06M5j3K6K6m2k7O5On8mj5J6
7179c2N8qj4l8M8lj6K8k1K2k2m2M2L5p1N0rm3NNK1J0l8L8l6O5l1l6L5j6J6J9k1
7212@j9L6qj6j5Q7%j04N3L6m1Lj3l3L2k7L8o6M5l3L7ONQj7pRQJ3l8Pj1P8l4j0
$$ y = [10, -29, 11, 46, 42, -5, -77, -8, 15, 4, 12, 14, 37, -17, -64, -7, -6, 0, -9, 11, 20, -25, -61, -3, -31, -21, -14, -32, -12, -58, 42, -15, 4, 43, -10, 0, 19, -12, -18, 13, -59, -8, 16, 2, -62, -77, 23, -53, 10, 50, -3, 29, 5, -12, 9, -45, -34, -5, 63, -8, 39, 58, 36, -3, -15, 2, 25, -16, -18, -12, 0, -16, -8, 35, 15, 20, -44, -28, 13, -23, 9, -21, -3, 6, -3, -1, 7, 7, 14, -25, -46, 8, -19, -9, 9, -8, 17, 60, -19, 16, -25, 18, -26, -25, 24, 34, -26, -48, 6, -8, 52, -13, -8, -21, 9, -24, -5, -21, 14, 34, -18, -1, 2, 46, 29, 13, -38, -47, 1, 9, -8, 1, 43, -44, 29, 8, -14, 19, 20, -4, 31, -21, -1, -11, -43, -60, -63, -25, 20, 18, 16, -52, 7, 17, -39, -42, -12, 11, -30, 24, 0, 16, 47, 47, 30, 24, 29, 8, 33, 59, 8, 9, -22, 27, -28, 55, 29, 3, -6, -8, -7, 25, -22, -7, -22, 18, 49, -57, -12, -25, 1, 27, -15, -42, 23, 29, -29, -33, -48, -32, 26, 18, 4, -34, 14, 11, -5, 23, 2, 24, 2, -40, 2, 37, -34, 16, 7, -36, -31, -26, -5, 5, -33, 5, -31, 34, 3, -33, 2, -14, 2, 21, 0, -19, 17, 9, -7, -22, 65, 65, -39, 14, 50, 9, 12, -1, -34, -2, -29, 9, -57, -12, -45, -8, -2, 3, 11, -6, -13, -4, 4, 17, -21, -14, -25, 53, 19, 9]
7247Il1M0l8J5L0n1K0MpJ0j1P2n0rJ1qk6L6km6M4j9O7o1j3pN2p0lN8Kl4K3k5%
7282a8RJ0n3M6l9K7L0M1q3K8n9nK8R6o6J7k6K2j9k8P0j0K8o6J9L8k4K9k9K3l5
7313AL0k1No0L1J8l3L1k3K8J3k1j0J7Mk7LJpMJ7j1onN7qk7k7JL7l7N8n9J0k9K2
7349b3J3L1m3nK4m4O6J4l2mJ3L2p7M0Ok2mk2L2K7mn0N0K4p0K5J0K1k9N5l7mk1
7382hO4q5J4K3k7O6o4l2L5K3l6l9L5j7OL5J6n3N0JJ0ql8pl8O0lL0m%l8N5l1jK9
7417B3j3k5m1N6L5l1K5j5m6J3j9M8J2l1j8j5N9k0j3N5q5oP2Kl3k3NL0MK0l0L0
7449B5K2j04L0OJ4k8N1j3L6k9Mm2O2o7L0%k4M4m4k2L7J9J6J5l0n2L5O2p6L3j9
7480iM8l8M1n1J1L1j1q0L6NN9l2%qK9J0n2K6pkm4pM5l2N2%J5l7J0J0l5N7n8L6
$$ y = [9, -22, 18, -20, -5, 25, -26, -6, -2, -9, 1, -10, 62, 12, 3, 14, 6, -20, 16, 14, -32, 12, -7, 60, -1, -14, -21, 31, -39, -42, 16, 18, -16, 7, -18, -18, -9, 1, -52, -6, -45, -18, 12, 53, -30, -2, -61, -66, -38, 58, -8, 9, -17, 5, -14, -42, 28, 18, 46, -20, -1, 37, 13, 42, 13, 36, 1, 31, 10, 15, -45, -14, 4, -29, 2, -21, 7, 20, -1, -11, 6, 10, -17, -14, -13, -20, -16, 1, -10, -16, -21, 36, 28, 1, -26, -25, 12, -25, 33, -26, -16, -45, -23, -10, 21, -22, -27, -3, -47, 19, 33, 1, -3, 10, 42, -35, 5, 11, -11, -15, -37, -5, 22, 18, -32, 18, 42, -28, -3, 7, 28, -1, 54, 17, 13, -8, 56, -29, -15, 8, -19, 47, -17, -49, -14, 9, -27, -66, -31, -48, -42, -7, 9, -44, 6, 7, 17, 9, -29, -36, -74, -14, -17, 13, 9, 9, -29, 26, -5, -6, 23, 10, -15, -56, 0, 35, 4, 29, 14, -32, -19, -38, 10, 22, -9, -27, -42, 17, -3, -16, 39, -46, -52, 20, 22, -11, -34, -29, 1, 5, 25, -5, 25, 47, -57, -27, -21, -7, -35, 16, 3, 39, 10, 14, -28, 34, -33, -3, -3, -27, 17, -27, -49, -12, 7, 23, 38, 8, -44, -9, 53, -23, 10, -9, 39, 1, 42, -9, 2, 33, 22, -58, -22, -17, 42, 10, 10, 2, 31, 41, -11, 15, 8, 6, -38, -45, 0, -32, 20, 20, 35, -2, 8, 18, -17, 40, -18, 18]
7514A8n3K4kJ6k4OM3rm9N7m8O2m9j1M1m1N0k2j8L4m5J4K2Lj4Qn7L8Qm9N9J9k9
7547Bj8k8P6j9k1K0n8ON5L4n0j6K2l3K2J3j8L3m5L0M1j9j7l9J3k7M9n2N2Ll0K4
7579EJ9J7l4k8J4LK1l8M8K6Jn5k8J7lNQk8M4m3j3N7p0P5K7m6pJML8m3oNQ2r2L
7615a4K1j9j9K0Rl3M2o0N6L9n6j8K7k9M0mk4L3j7qj4L4j6J8j3L3m1rj7M3lj8K7
7648A0O1m1k6L6J1o1K8Kj4k0kl6J5O1M7m9J1j6k7Pj3mqN1p6%K6K8K4N5q6j0JJ0
7682eN5n6l9O7m6K9N9j09J8K1j1m4O5j4O6Mj40J28k0k3qR6q3l8L3j6N0m9P6l5
7712C1k0rqJ8k8OJ2k1L9J9l4l5L6j0j1j2P8m5J7l4L7j8K4k1l4K1LRn8O1QJ7q5
7745d7J5K5rPL9%L1q6K1K1j2j0k6K0M4l1K0L7o9K5j9j3M8n4N8o7L5m3L1N2k1P
$$ y = [18, -35, -11, -13, 3, -21, -15, 28, 19, -30, 27, -21, 41, -8, -19, 22, -19, 31, 9, -9, 25, -20, -6, 16, 19, 5, 13, -44, -6, 2, -47, 12, 31, 2, -16, -44, 32, 13, -8, 12, -46, -40, 15, 49, -1, -17, 5, -28, -6, 7, -11, 22, -23, 7, 48, 29, 12, -27, -14, -41, 8, -44, 8, 11, -19, 5, 24, 41, 7, -21, -7, -4, 17, -21, 27, 53, 54, -1, -29, -12, -15, -10, -2, -30, 14, -29, -42, 15, -55, 20, 47, 1, -6, -5, -1, 37, -6, -12, -7, 75, -17, -14, 7, -12, -31, -11, -2, -35, 7, -53, 3, 42, -14, -32, -5, -34, 6, 2, -22, 11, -6, -14, -28, 6, -10, 8, -5, 28, -13, -22, -39, 4, 1, -17, 10, 71, 30, 4, 40, 51, -10, 18, 20, 6, -14, -16, -52, -37, 24, 71, 22, 33, 17, -10, -3, -16, -20, -28, 23, -53, -53, -27, 1, 25, 80, -6, -16, -15, -5, 50, -6, -45, 22, -24, 5, 64, -45, -27, -6, -17, -61, 4, -10, 56, 60, -80, 48, 28, 5, -3, 93, 10, -28, 5, -11, 39, -10, 66, 31, 11, 2, -6, 12, -16, -10, 2, -19, 20, 39, 5, -30, 6, -4, -15, -27, 51, 6, 23, -11, 26, 8, 32, 11, -23, -2, 1, 10, -48, 13, 21, 38, -47, -32, -7, -16, -9, 30, 30, 61, -25, -4, 17, 5, -5, -31, -11, 33, 2, 22, 59, -10, 15, -4, -17, 31, -23, 35, -32, 3, -40, -9, 43, 22, 29]
7777B9l5j3M5k8mpK9l5K8L6n3K3j5l6J9L4k3k1L1L7n4NL3o2Q1l1J1j5M1q5K7O
7809bK1l2M5o8M1K1j9l0K8j7J6M9j4j7l3k9N4k5%K1o0J6M4Mm5OJM3m2K0J7p7J03
7842D0l4Lpm8K5L4m4M3J0km7K3N2k2n3kmK3ok6M9mL1j4Qk9J2j7J5J4m5k5J6M9
7876A8j3%L3q5P0K3k1K7r0O0m1L9kk8L3o3P4k3L0k0K7l6m8L3J5n1lN4km4PmK4
7909grKM7k7J6j4m2N7j4L4j7pqn1M3L8p0PN0j9Mj7K3j2p1M8M3n0K1pj0K8j4Ll1
7944c3O6j5m9m3N0N3J0m9j5J3n0P6on7L9K8j9Nk0K6k8K8K0j8J3k9J5k0J5k3k9
7975d6N4J1k8K6m2N3k1o0P3k5L3k5J5K3j2l0M0j5k0nLp0P3K9l6pJ3J6k6k7J2k3
8007d4K6NPnL7L0j4Ln4L7o2KK4L5J0q8M7J9k3Mj5K2K2l7J3N0r6M3k3J3P8m4m7
$$ y = [29, -6, -19, 26, -2, -6, -13, 16, -19, 9, 45, -8, 15, 0, -36, -17, 17, -6, -27, 4, 41, -13, -8, 25, -37, 44, 13, 24, 9, 50, -35, -8, -2, 19, -13, 32, -36, 5, 26, 7, -23, 5, -12, 4, 53, 39, 22, -11, -40, 14, -11, -11, 10, -50, -34, 10, 14, -31, -25, -24, 19, -23, -3, 14, -63, 40, 6, 9, 2, -46, -21, 13, -31, 12, 22, 20, -27, -4, 48, 26, -27, -29, -33, -10, -16, -42, 7, 3, 34, 20, 28, -1, 11, -6, 9, 23, -22, -47, -31, 18, 5, 5, 38, -47, 23, 46, 25, 52, -38, 22, -19, 20, 18, -10, 23, -40, 34, 11, 41, 21, 48, 12, -36, -3, 12, -39, -42, 12, 10, -34, -27, -31, -7, -16, -14, 33, 6, 22, 8, -34, 23, 9, 43, 26, 19, 11, -40, 3, 41, -29, -22, 28, 9, 13, -4, 19, 7, -64, -16, 27, -23, -2, -9, -19, 9, -5, -2, -33, 33, 18, -31, -74, -24, 29, 39, -10, -25, -12, -62, 14, 8, -49, -10, 18, -1, 4, -16, 10, -18, 10, 30, 12, 25, -4, 11, -9, 6, -17, -46, 8, 19, -9, 17, -25, 28, 7, -53, 20, -5, 28, 3, 18, 41, 29, -1, 39, 24, 4, -1, 2, -68, 5, 34, -2, -9, 4, 20, -6, -33, -21, -44, -18, -13, -6, -11, 26, 56, 42, 45, -9, 28, -34, -32, -8, 27, 37, -51, -4, 15, -8, -4, -19, 3, 25, -12, 1, 51, -45, -2, -25, -12, 66, 22, -25]
8040b5jJ6n3mO2L2pjJ4n2K2j3L7J1j8pj7j8K4rj8qN8l5JK9k5n1M4L6n6K6L5p3
8074d4J7k4J6N6l3Rj3K0%j4M0J4m3k7N0j4Rj6k0J4J6j0o1M0%MOj6L0nN2k9L3m9
8108Hj8j2K1lPj9PnJ7l8J2N5o8k5M2K9J0kJ8n7J4Pj1KK8k0k6J1l0j5P0ql4M6l4
8143b1roO1j0M6j6l5J7j1j9J9l7N6o6M3K5n8K4l6Q8k5nl0L5o7J05j10P5n4J1O3
8174E3j6l8k%m1R9o6l6J5O7p6L6PM2k4m1Q
$$ y = [-25, -26, -10, -63, -67, -5, 27, 20, 19, 33, -19, 3, -10, 27, 38, 20, 13, -4, -22, 2, -7, -25, -33, 25, -10, -9, 20, -5, -56, -12, 24, -32, -6, 29, -44, -27, -51, -35, 21, -12, -3, -16, 4, 4, -10, 30, 44, 1, -26, 24, 10, 19, 3, -17, -3, 13, 3, -58, -18, -18, -14, -8, -24, 6, 1, 53, 24, 57, 8, -10, -22, -1, -4, 3, -16, -9, -14, 3, -35, -23, 32, -36, -61, -19, 10, 20, 18, 36, -21, -7, 0, -11, -9, 19, -1, -27, -16, -46, -61, 9, 1, -33, 13, -21, -30, -36, 25, 15, 61, 45, 10, 27, 16, -3, 16, -21, 35, -31, 12, 37, -21, 3, -33, 55, 30, 25, -5, 30, -37, 68, -42, 33, -21, -10, 53, 37, -1, -3, -3, -44, 55, -11, -47, -32, 35, -41, -5, 2, 44, 20, -21, -13]
8191a3
$$ Imaginary data points
##PAGE= N=2
##DATA TABLE= (X++(I..I)), XYDATA
0@%%%qJ6j6J6j6K4l2M0n6P2q8J12j36J60j92K24k64L12l60M16m82N56o41P35q34
28d42R46j071J208j360J523j703J904k126K367k631K919l234L584l970M395m867
44b558N393n979O638p389Q246r235J0398j1783J3468j5574J8286k1939K7162l5304
58b0170M9904q4353L15478L60293j95781K1852L4746P5377o7199n4753j4897P5901
70D96398J6887l4411p6193j8957J0147K3262k7638m4516m1255J1019K2677r702
82C27718o8219m9200P589L3506k6524p9524n6398K4752L7869k7944p9322l7552
94F751K5810K2570m5105p7268l4062K5666K2939k9506o2640l2279J9745K4919
106a32460k3550o1567m2334J3578L4059j0790n8366l6776K6339M5095p231o0292
$$ y = [0, 0, 0, 0, -8, 8, -8, 8, -8, 16, -16, 24, -32, 40, -48, 64, -72, 88, -104, 120, -144, 168, -192, 224, -258, 298, -343, 392, -442, 504, -567, 641, -719, 804, -899, 1005, -1121, 1246, -1385, 1534, -1700, 1884, -2086, 2309, -2558, 2835, -3144, 3494, -3895, 4351, -4884, 5514, -6269, 7199, -8375, 9911, -12028, 15134, -20170, 29734, -54619, 260859, 621152, 425371, 447223, 481969, 557346, 490147, 435394, 420497, 496398, 513285, 478874, 402681, 383724, 393871, 417133, 389495, 344979, 303724, 314743, 337420, 327718, 259499, 210299, 217888, 251394, 224870, 145346, 88948, 113700, 151569, 123625, 44303, 6751, 32561, 55131, 10026, -67242, -101304, -75638, -52699, -82205, -144845, -177124, -157379, -132460, -156010, -217577, -259911, -246333, -212274, -223064, -281430, -318206, -291867, -246772, -254003, -314295]
118c14295m0890K2614M1519n290m7988k5864L2680M7720J67m3565k6278K6307
130c33163M5897O666l8953k6013L0400N5107J7604k8605j9139L2251N1485P839
142a98624l9014k2945L6468O2166K4334k0074j0556L2821M5081Q070k9833j6746
154a28852L4640O0265K9211j4918j6469K2657M7323K0412k3417k1992K6034N6542
166I1436K7469k2111k3467K3995N1829K1275k5795k5952J9255M5651J6303k5304
178A74584k0856K1874M4300J6096k6758k9431R147L5054J3186k5962k8070J0866
190A94030L8093J5395k8572l6339K126L3106J1329l4255l9625K866L5316J4671
202B08141l0357l9180j725K7660O485l6345m2095l370K8401J2122k7994l8197
$$ y = [-314295, -355185, -332571, -291052, -296342, -344330, -370194, -337514, -289794, -289627, -333192, -359470, -333163, -287266, -280600, -319553, -345566, -315166, -260059, -242455, -271060, -290199, -257948, -206463, -198624, -237638, -260583, -224115, -161949, -137615, -157689, -168245, -135424, -90343, -82273, -112106, -128852, -94212, -33947, -4736, -19654, -36123, -13466, 33857, 54269, 30852, 8860, 34894, 91436, 118905, 96794, 73327, 97322, 149151, 170426, 144631, 118679, 137934, 183585, 199888, 174584, 153728, 175602, 219902, 235998, 209240, 179809, 188956, 224010, 237196, 211234, 183164, 194030, 232123, 247518, 218946, 182607, 184733, 217839, 229168, 194913, 155288, 158154, 193470, 208141, 177784, 138604, 136879, 164539, 171024, 134679, 92584, 89214, 117615, 129737, 101743, 63546]
214F3546o639K1901P499l1412m1367q902K1090R402k6138l6571n827K4955J1925
227C462k8242m1997j2803J8360J0133k3306l2134j259K8817J5823k5849m2416
239a31411j3034K0997J5695j7102k8737o81L0150J9315k1160l7332q310K6410
251a45200K1206j3468k8098j530K9952K3284j2363k8274k709K8696K2881j1335
263a16958k6657k370L0373K9027l935k2924j416K9129K5418q172k5940k561L1661
276f5325L1416j865k1444o29L0607K7552o127k4091k779K8144K8069j432j9415
289B681r3K9518K7829l301k3527p642K2623K6892q7k0452m901K6148K9131j836
303A02983k5827j1349K0502K5611k700k5455j0139K2990K7575k110k4782j1307
$$ y = [63546, 56907, 78808, 86307, 54895, 13528, 4626, 25716, 35118, 8980, -27591, -33418, -8463, 3462, -24780, -66777, -79580, -61220, -51087, -74393, -106527, -107786, -78969, -63146, -88995, -131411, -144445, -123448, -107753, -124855, -153592, -154273, -124123, -104808, -125968, -163300, -171610, -145200, -123994, -137462, -165560, -167090, -137138, -113854, -126217, -154491, -157200, -128504, -105623, -116958, -143615, -145985, -115612, -86585, -90520, -113444, -114860, -85731, -60313, -68485, -94425, -96986, -65325, -33909, -35774, -57218, -57847, -27240, 312, -5815, -29906, -32685, -4541, 23528, 22096, 2681, 2588, 32106, 59935, 56634, 33107, 25465, 48088, 74980, 74893, 54441, 49540, 75688, 104819, 102983, 77156, 65807, 86309, 111920, 109220, 83765, 73626, 96616, 124191, 122081, 97299, 85992]
315H5992J6974J9738p887k8683j3092J8918K5621n35k3606j4175J1565J5456r511
328I6775l0097j6271J6294K5341j011k6784j8412R355J6590p675l0307j8809J2974
341B7963K2375k854k7910j9352R703J8999m010k8026k1146P178J8642k010k5074
354b5522j7560J0103K0304p98k5652k1859N089J8179N1k2612j6660J0626K2135
367d4176J929k3190j9963O899K0139J649k2464j7204J1509K4915N821j9377j7278
380i0791Q448K1462L491k0882j6861J1083K6238R734j5264j5435Q437K2848P152
393d0340j7463j7081R191K5883J1404j3163j3863J0261K5898J0123j6722j8086
405d3958P337K4190J0989j1658j1116J2171K5966J0276j5875j8541M345K1841
$$ y = [85992, 102966, 122704, 114817, 86134, 73042, 91960, 117581, 117046, 93440, 79265, 90830, 106286, 96775, 66678, 50407, 66701, 92042, 91031, 64247, 45835, 55190, 71780, 64105, 33798, 14989, 27963, 50338, 47484, 19574, 222, 9925, 28924, 24914, -3112, -24258, -17080, 1562, -448, -25522, -43082, -32979, -12675, -13473, -39125, -60984, -55895, -37716, -37665, -60277, -76937, -66311, -44176, -42247, -65437, -85400, -78501, -58362, -56713, -79177, -96381, -84872, -59957, -54136, -73513, -90791, -82343, -60881, -57390, -78272, -95133, -84050, -57812, -48078, -63342, -78777, -70340, -47492, -40340, -57803, -74884, -65693, -39810, -28406, -41569, -55432, -45171, -19273, -9150, -25872, -43958, -36621, -12431, -1442, -13100, -24216, -12045, 13921, 24197, 8322, -10219, -5874, 15967]
417A5967J2029q937j1089Q854K3629J1578j4065j9778K028K1801J3305j0372j5954
430B8996M574K3046J2790j3225j9714K105K1126J0620j4506j9162K553K1246J2528
443G2977j1515j8328M06J7401Q086j4877k0392j025J8297J2808j0049j9130k386
456C2273J5891R220j4314k2634m073J6472J1886j0863k0035k439J7038R928j4530
469B3820k3526n561J4513J0578j0739j9291k374J6375J1024j2113k2476p166J2909
482a4027J0972r201j9411m790J5638J3960p869k0469p462J2055J1212q702j9896
495d7990n486J6614J6532m624j8137o850J1941J0969q500j8936m347J7517J8089
508b3208l122j7319o239J2973J2853o256j7788m635J6936J8218k536j6629n336
$$ y = [15967, 27996, 19059, 7970, 16824, 40453, 52031, 37966, 18188, 20216, 42017, 55322, 44950, 28996, 33570, 56616, 69406, 56181, 36467, 38572, 59698, 70318, 55812, 36650, 39203, 60449, 72977, 61462, 43134, 43540, 60941, 69027, 54150, 33758, 32733, 51030, 63838, 53789, 34659, 32273, 48164, 57384, 43070, 20436, 16363, 32835, 44721, 33858, 13823, 11384, 28422, 38350, 23820, 294, -5267, 9246, 19824, 9085, -10206, -12580, 3795, 14819, 2706, -19770, -26936, -14027, -3055, -12256, -31667, -36457, -20819, -6859, -14728, -35197, -42659, -30604, -19392, -28094, -47990, -53476, -36862, -20330, -24954, -43091, -49941, -38000, -27031, -35531, -54467, -58814, -41297, -23208, -26330, -43649, -49888, -36915, -24062, -30318, -48106, -52741, -35805, -17587, -20123, -36752, -42088]
521d2088J4952J5890l728j7100o328J4346J7025j131j4733m260J5639J7235j641
534D078j6147q062J1464J6228L36j3414m841J4604J7883J0j5697r084J0399J6122
548B3879J46j4786o720J3787J8513R74j5182r201R628J4902j113j5925q309J2094
562B2687J7812J725j4173r615Q041J3846o81j6223j0829R043J6804K532j3932
575B7037j0485P418J4749J82j7370j3900O472J5746K317j3899j0076Q007J4995
588C1193j44j7954j4886M592J4204K396j2598r611O820J3943M46j6386j4768L287
602i466J3667L184j2557j1366N286J4420K957j4308j4359L233J4054L008j3828
615a6075j3094M813J5710N451j2013j3212K950J3409L236j3431j3185L862J5786
$$ y = [-42088, -27136, -11246, -14974, -32074, -38402, -24056, -7031, -8162, -22895, -27155, -11516, 5719, 4078, -12069, -20131, -8667, 7561, 7897, -5517, -10358, 4246, 22129, 22139, 6442, -2642, 7757, 23879, 24025, 9239, 2519, 16306, 34819, 35793, 20611, 11410, 21038, 35940, 34827, 18902, 10593, 22687, 40499, 42224, 28051, 18436, 26477, 40323, 39642, 23419, 12590, 21633, 38437, 40969, 27037, 16552, 23970, 38719, 38901, 21531, 7631, 14103, 29849, 32166, 18267, 8191, 16198, 31193, 31049, 13095, -1791, 2801, 17005, 19401, 6803, -2808, 4012, 17955, 18401, 2015, -12753, -9466, 4201, 7385, -5172, -16538, -11252, 3168, 6125, -8183, -22542, -19309, -5255, -2247, -16075, -29169, -24356, -8646, -3195, -15208, -28420, -25470, -12061, -8825, -22256, -35441, -31579, -15793]
628a5793P462r446j2192K253J3258M832j1850j3452K763J5278Q227q301j1362
641b8323L111J4606O255j1335j3692K072J4816Q171p776j0605L904J5460P459
654D123j0091j3846R93J4137Q311p273j0898K791J5699R430p980j3461j80J2809
668D564Q006p296j1751J666J5441J0982o158j2866j313J1281P243p625j2144Q88
682I18J4858J1265n307j2928k153J0674P279p190j2651q45J3261J0824n223j2973
696I809k551J0948Q474o590j3823l268J1095J0058m740j2510k527J1322R398o178
710A8917j4774n194R246R525m129j2258k747J1234R678n516j4519n937Q197R074
724A0797m084j2344l364J0578J0271l943j3494o100P403Q566l893j2583m645J0133
$$ y = [-15793, -8331, -17777, -29969, -27716, -14458, -9626, -21476, -34928, -32165, -16887, -8660, -16961, -28323, -25212, -10606, -4351, -15686, -29378, -27306, -12490, -4319, -12095, -22700, -18796, -3336, 4123, -5968, -19814, -18821, -4684, 3627, -3646, -14544, -11753, 3946, 13376, 5396, -8065, -8245, 4564, 12570, 5274, -6477, -4811, 10630, 21612, 15454, 2588, 1275, 12556, 19799, 12174, 30, 918, 15776, 27041, 21734, 8806, 6653, 17327, 24606, 17416, 4765, 3920, 17181, 28005, 22782, 9809, 7258, 18206, 26680, 20090, 6267, 2999, 14094, 24152, 19412, 6902, 4375, 15697, 25095, 18917, 4143, -1051, 8195, 17720, 13591, 1333, -1414, 9820, 19498, 13982, -537, -6474, 1723, 10797, 6713, -5631, -8995, 1583, 11854, 7911, -5583, -11683, -4280, 4286, 393, -12190, -16835, -6702]
738f702J1319k231j2435o182P169R000l643j2946n508R566J1850j096j1524n686
752a9049P686R612k757j2897o731Q109J1913K48j0018n027P703J0420j522j2553
766a4863q023O805J1906J464r003m975P861J0854o17j2053p942O345J1713J483
780I55r104n126P671J1249L77j0668p382N923J0885R95r745o020P124J2108K272
795A1514r394p555M841J0412J006j0328p304O438J2572L551q526p825L983R918
809A3303J355j0223q079M961J1782L886p742p463L611R826J702r869q953L391
823A488J0689L811p305p439L597J0128K432r899r895K230J0056L746p542p796
837a699L350J0743L376r234j0247J153R164L368p599q292K851J0784M781p878
$$ y = [-6702, 4617, 2386, -10049, -16231, -9062, -62, -3705, -16651, -22159, -12593, -743, -1839, -13363, -19049, -11363, -1751, -4508, -17405, -24136, -16027, -4114, -3866, -13884, -18911, -11208, -788, -2310, -14863, -22886, -16081, -4175, -2711, -11714, -16689, -8828, 2026, 1409, -10644, -18586, -12241, -528, 955, -8149, -13275, -5604, 5645, 6022, -4646, -12028, -6105, 4780, 5775, -3970, -9990, -2866, 9242, 11514, 2120, -5435, -594, 9818, 10824, 496, -6808, -370, 12202, 15753, 7227, -598, 3385, 13303, 14658, 4435, -3644, 1317, 13099, 16985, 9243, 1780, 5391, 15217, 16919, 7050, -1903, 1488, 12177, 15988, 8683, 1244, 4841, 14969, 17401, 7502, -2393, -163, 9893, 13639, 6097, -1699, 1651, 12394, 15770, 6536, -3711, -2558, 6606, 9974, 2375, -5917, -3066, 7718, 12499, 4621]
851D621j0114J28Q189L158p417q580K230J0832N529o670r933l28P942L520p265
866d158q768J561J0185N860n937r218l5Q377M190o755r324K77R379O074n022q475
882a1789M56R067N207o517j0117r16Q855O418m188q093N69R699N976n910j0251
897a1534j490Q186O382l771p848J78R557O667m521r421k054P213O089l480p951
912g798m86R161P606l283q921k205O776N904l781q464j195Q960P994k644q507
927h83k048O938N945l937r186k135Q138Q170j926p920k124O900O231l562r632
942a031l656O891Q184q88p440k528O471O570k890r568m485N960P855q62p430k809
958a656O263O950k294q991m533N223O987j437p752l145O302P484j133q286m756
$$ y = [4621, -5493, -5365, 2824, 5982, -1435, -10015, -7785, 3047, 8576, 1906, -8027, -8355, -413, 3107, -4158, -12926, -11365, -1180, 4680, -1257, -10475, -10510, -2133, 2057, -4698, -14022, -13745, -4366, 1708, -3314, -11789, -11333, -2266, 2941, -3576, -13693, -14609, -5754, 664, -3524, -11617, -11048, -1349, 4627, -1283, -11534, -13024, -4838, 1544, -2227, -10075, -9897, -340, 6327, 1806, -7615, -9669, -2456, 3633, 153, -7798, -8284, 877, 8483, 5200, -3721, -5926, 850, 6754, 2973, -5491, -6686, 2274, 10268, 7624, -883, -2931, 4007, 9952, 6015, -3171, -5306, 2832, 11002, 9076, 1156, -968, 5932, 12163, 8601, -1031, -4687, 2204, 10388, 9500, 2060, -468, 6003, 12573, 9683, 115, -4370, 1590, 9445, 8583, 1153, -1656, 4607, 11557, 9263, 272, -4261, 962, 7949, 6512, -1240, -4385, 1917, 9401, 8268, -18, -4774]
973d774M417O412j540q231l844O081Q284M6p874n086L863O531j253q475m597N551
989d489Q509P44p268m823L811O641q14q298n173M516Q053J134o336m293L873O836
1005B623k15p975n740L678P614J466n946m181M108P440O14p664o182L080P347
1020F7J353o053m249M288Q152J432o945o328K388O907J281o047m519M043Q418
1035D188K454o221o339J699O587J594n908n048L336Q180L034n385o132J630O608
1050D277J862n937n629K367P574L164m681n495J935O764J828o088o284J515O979
1065D151L344m252n055J990O967K245o101o912O36O667L419l952n372J518P261
1080F554L059n435p202o1O088L357m045n593J123P126L816m598o876m87N416K963
$$ y = [-4774, -357, 6055, 4515, -3716, -7560, -1479, 6805, 6851, -1023, -6109, -2246, 4285, 3032, -5443, -10040, -4489, 4020, 4764, -2504, -7327, -3516, 3125, 2311, -5987, -11160, -6644, 1409, 2543, -3793, -8086, -4213, 2623, 2408, -5567, -11307, -7629, -15, 1451, -4495, -8676, -4568, 2872, 3486, -4178, -10360, -7280, 67, 1420, -4633, -8882, -4594, 3558, 4990, -1955, -8283, -5895, 1012, 2293, -3754, -8273, -4230, 4188, 6642, 421, -5918, -4219, 2368, 3962, -1946, -6994, -3658, 4522, 7556, 2171, -3961, -2331, 4277, 6139, 202, -5427, -3060, 4514, 7678, 2997, -2498, -563, 6201, 8029, 1941, -4343, -2828, 4151, 7495, 3243, -1812, 178, 7145, 9390, 3289, -3623, -2987, 3680, 7099, 3147, -2225, -707, 6554, 9613, 4178, -3024, -3085, 3003, 6360, 2315, -3278, -2155, 4971, 8787, 4189, -2687, -3174, 2242, 5205]
1096E205m097n754O83O907M188l767o337n37N212K792m317o203J94O703M545l204
1112B213n915m24N397L026m431o815n39O322N090k589n731l60N458L510m083o927
1128f798j297N792N042k154n441n35N505M078l345o650j700N076M630k044n418
1143e259o43N707M683k461o298j963M322M296k183n601q02N947N287j790o064
1158b822k141M133M089k230n896j259N918N626j237n731k192M026M278k107o210
1173c755j987N241N869o89n301k129M049M425j715o259k784M375N532k43m773
1188a44k138M096M616j228o214l294L631N176l17m725j995M198N127q37o067l706
1204c821L087M871n01m948k118M352N488l18n801l897K610M712m30n094k566L917
$$ y = [5205, 1108, -4646, -3963, 2944, 7132, 3365, -2972, -3509, 1703, 4495, 178, -6025, -5831, 872, 5417, 2213, -3702, -4126, 1271, 4297, -134, -6949, -7488, -1166, 3924, 1335, -4396, -4756, 702, 4212, 129, -6798, -8095, -2303, 2739, 585, -4856, -5391, 114, 4192, 847, -5803, -7503, -2427, 2203, 159, -5259, -5902, -195, 4488, 2027, -4271, -6234, -1912, 2384, 201, -5400, -6202, -255, 5032, 3242, -2822, -4963, -830, 3259, 1029, -4867, -6126, -208, 5418, 4181, -1550, -3742, 284, 4562, 2455, -3755, -5742, -501, 5368, 4679, -622, -2751, 1298, 5723, 4008, -2251, -5035, -660, 4872, 4629, -144, -2282, 1814, 6430, 5202, -1012, -4306, -675, 4501, 4184, -541, -2536, 1662, 6789, 5952, -115, -3821, -734, 4137, 3636, -1312, -3430, 922, 6410, 6092, 291, -3606, -996, 3716, 3286, -1808, -4374, -457]
1220d57N762L10n258m005K383M607j28n285l238L282N594R23m590l631K407M644
1236C320m5n502l740K685N363J234m135l108K483M858l3n593m175K236N261J346
1252B455l861l069K529N090O55n273m534J654M982J450l805l223K327N508J403
1267D288m797m697J158M701J349l800l479K134N679K044m174m531R82M438J142
1282B437l953l696J818N612K349l443m174R17M304J161m045m240J355N440K780
1297D622k934m067Q68M535J362m183m649Q19N218K994k755m057Q64M712J832l807
1313A374m904K03M704K873k608l943O57M922K339l283m851m22M076K642k599m042
1329b862P06M941K964k777m799p12L637K318k638m067L06N030L254k310m574q56
$$ y = [-457, 5305, 5615, 357, -3648, -1265, 3342, 3214, -2071, -5309, -2027, 3567, 4490, -100, -3731, -1324, 3320, 3275, -2227, -5967, -3282, 2081, 3315, -820, -3928, -1445, 3413, 3380, -2213, -6388, -4152, 1109, 2455, -1406, -4475, -1946, 3144, 3799, -1474, -6008, -4354, 628, 2078, -1727, -4950, -2623, 2885, 4288, -509, -5206, -4048, 653, 2002, -1798, -5277, -3143, 2536, 4580, 406, -4125, -3143, 1295, 2437, -1516, -5212, -3394, 2218, 4567, 1124, -3050, -2133, 2171, 3332, -713, -4953, -3598, 1842, 4622, 1688, -2379, -1511, 3024, 4386, 203, -4446, -3627, 1591, 4585, 1830, -2227, -1363, 3349, 5181, 1374, -3530, -3327, 1377, 4250, 1642, -2301, -1644, 3278, 5617, 2334, -2517, -2939, 1137, 3779, 1180, -2862, -2156, 2785, 5749, 2972, -1827, -2539, 1098, 3416, 778, -3289, -2983, 2047, 5301, 2991, -1583, -2439]
1345b439L531K367k724m547j6M841L548j957m299p61L606K532k734m789p28M317
1361b52L783j490m120o20L702K726k262n034j339L792L727j177l858o51L819L128
1377C874k014m883j799L311L521j126l879o16M019L575j625m813j958K949L375
1392A911j253l891p97M007L892j078m533k140K784L316j146m210j210L634M241
1407C527n54m001k078K635L268j013m423j818L226M168K1l589j822K538L404j042
1423B447m606k129K815M112R4l235j654K682L423p56m531k691K495L961J72l265
1439f66j733K698L829k20m384k933J926L796J72l315k048K629M228K85m012l154
1455b902J629L503J54l553k182K430M280Q05l517k983J400L233Q0l611k526K105
$$ y = [-2439, 1092, 3459, 735, -3812, -3828, 1013, 4561, 2604, -1695, -2456, 1150, 3682, 948, -3841, -4569, -252, 3531, 2041, -2079, -2699, 1003, 3729, 1467, -3567, -4906, -1114, 2613, 1436, -2422, -3073, 746, 3874, 1860, -3023, -4822, -1511, 2010, 884, -2995, -3611, 408, 3983, 2358, -2455, -4413, -1464, 1911, 658, -3233, -4030, -23, 3869, 2791, -1742, -3882, -1098, 2218, 1072, -3138, -4348, -714, 3527, 2973, -1028, -3106, -471, 2797, 1784, -2639, -4457, -1231, 2937, 2958, -631, -2453, 85, 3489, 2447, -2159, -4288, -1473, 2639, 2733, -502, -2156, 526, 3949, 3193, -1338, -4029, -1534, 2427, 2599, -666, -2399, 299, 4128, 3908, -476, -3409, -1483, 2313, 2485, -830, -2878, -249, 3979, 4264, 252, -2902, -1273, 2230, 2384, -1169, -3351, -921, 3359, 4164, 647, -2336, -936, 2297, 2377, -1234, -3760, -1655]
1471a655M245J138l036k817J276L288J24l717k872J722M124J372k787k729J442
1486h82L441L46l712l230J280L903J463k736k597J437L707Q75l485l455P59L524
1502F38J374k443k701J321M014J354l170l494L65L114J380k505k711J242M113
1517A891J776k750l572K33L052J249k617k850R55M077K119k398l292J79L029J263
1533B344k648l319N52L990K315j924l127K38L049J484k660l471L0L536K463j665
1549A187k842K03L184J678k409l622m36L141K398j501k754L18L295J921k101l665
1565b005p97K868K225j431k884J64L464K279j752l598r58K591K174j521l094j38
1581b413L456K628j358l425r98K476K125j567l337n57L228K906r57l050r53K362
$$ y = [-1655, 2590, 3728, 692, -2125, -849, 2439, 2563, -1154, -4026, -2304, 1820, 3192, 405, -2324, -882, 2559, 2905, -807, -4037, -2757, 1146, 2609, -127, -2724, -1287, 2420, 3295, -190, -3645, -2886, 638, 2012, -431, -3132, -1811, 2203, 3557, 387, -3107, -2742, 372, 1752, -753, -3464, -2222, 1891, 3667, 917, -2655, -2422, 630, 1879, -738, -3588, -2633, 1444, 3563, 1165, -2127, -1948, 1081, 2344, -304, -3623, -3071, 919, 3234, 1310, -1817, -1579, 1470, 2954, 294, -3177, -3147, 389, 2852, 1187, -1655, -1452, 1732, 3410, 1001, -2621, -3057, 84, 2482, 981, -1773, -1455, 1840, 3761, 1660, -2005, -2802, 66, 2291, 860, -2024, -1860, 1604, 3883, 2131, -1467, -2425, 166, 2340, 819, -2275, -2413, 1043, 3671, 2313, -1112, -2110, 366, 2491, 924, -2413, -2970, 258, 3164, 2207, -843, -1796, 566]
1597E66K098j537l554q80K887K924n56k785q55K323K144j341l619j256K554K785
1613A898m23k595p75K453K376j190l485j564K214K702m96k646p60K539K733p74
1629B207l430j821J976K583n75k755r31K522L016l02l196j901J708K428n09k957
1645a937j210K403L148J20k812j865J592K304n35k994j455K090L160L20k449j685
1661a805J458K455m86l050j764J760L027N13k280j644J618K607j85l075k090J428
1677a513K780O15k243j568J696K745K31k950k315R71K655M88k159j595J600L028
1693B466O21k749k404P83K365L94k124j697J428L106Q54k453k308P65K194L83
1709A624k353j914J235L130J038k126k165P73K327L86k482k297R77K940J301j787
$$ y = [566, 2664, 1127, -2427, -3307, -420, 2504, 1948, -837, -1692, 631, 2775, 1434, -2185, -3441, -887, 1898, 1475, -1120, -1895, 558, 2934, 1744, -1741, -3305, -1091, 1611, 1115, -1531, -2291, 248, 2981, 2207, -1223, -3044, -1068, 1515, 940, -1815, -2746, -224, 2792, 2490, -706, -2607, -899, 1529, 1020, -1937, -3147, -744, 2404, 2524, -288, -2153, -561, 1743, 1208, -1786, -3241, -1151, 2009, 2329, -120, -1805, -347, 2108, 1622, -1428, -3192, -1432, 1595, 2108, -172, -1816, -198, 2409, 2224, -851, -2941, -1513, 1267, 1882, -361, -1929, -233, 2512, 2743, -207, -2522, -1551, 1104, 1592, -567, -2162, -562, 2466, 3087, 338, -2066, -1283, 1082, 1476, -648, -2345, -917, 2189, 3043, 590, -1718, -953, 1241, 1624, -729, -2643, -1408, 1722, 2760, 634, -1531, -758, 1569, 1955, -527, -2824, -1847, 1093, 2394, 607]
1725F07k054P39K363N81k386k473M63K745J369j557j939O76K592Q08k257k642
1741b365J49K442J331j462j910O98K702J018j978k605n7K233J176j472k048P01
1757a447K744J370j771k483j50K036J121j582k219M05K877J677j475k403j39K042
1773F03J076j658k528J66K722J901j133k228q2J948J174j686k528j80K463J906
1789A936q30k110j56K124J271j465k636m76K159J855q69j980%K113J577j289k639
1806a415p72J892J799q91k064L3K219J791j002k585q81J613J683q98k133j58K236
1823D67J972n86k439r57J509J604r35k295m48K120K139l90k162q98J461J565r11
1840H16k470o70J966K151k66j944q24J531J689q47k499j001J703K085j34j945
$$ y = [607, -1447, -708, 1655, 2236, -150, -2623, -2160, 585, 1954, 397, -1542, -866, 1726, 2534, 277, -2365, -2216, 226, 1557, 95, -1815, -1117, 1585, 2603, 625, -1980, -2037, 196, 1372, -100, -2148, -1447, 1297, 2667, 896, -1587, -1737, 299, 1420, -162, -2381, -1976, 901, 2578, 1103, -1300, -1439, 603, 1679, 21, -2507, -2341, 381, 2282, 1149, -1079, -1161, 787, 1961, 275, -2253, -2433, 30, 1936, 1106, -1004, -1160, 964, 2235, 770, -1866, -2342, -183, 1672, 803, -1177, -1177, 936, 2513, 1224, -1415, -2187, -295, 1504, 613, -1451, -1418, 801, 2592, 1590, -995, -1876, -263, 1420, 522, -1611, -1769, 467, 2439, 1853, -586, -1543, -34, 1570, 635, -1660, -2108, 12, 2151, 1761, -401, -1299, 162, 1727, 816, -1654, -2324, -358, 1793, 1527, -417, -1241, 290, 1979, 1132, -1367, -2368, -665, 1420, 1286, -659]
1856f59p18J639J920o52k624j149J330J995j24j797p02J684K009k84k476j477
1872b085J137J839p5j825p85J576K174j8k166j544R59J753j52j942q76J432K273
1889A675K66k044j318R04J651k01k045j154J304K293M19j711j349R98J705j53
1905A240k119j445J097K228N85j571j249J032J903n8k137j677Q52K020O57j477
1921a19j225J027K073J84k060j723N00J906O11j447j211J006K090M72j813j756
1937a485L87J658M45j401j304Q35K310O72j598j649K83J535M23j569j510P25K357
1954A114Q73j348j654M09J513M62j613j719M61K162J172j252j510M49J547M90
1970A556j593j799J70J992J131j043j422L72J789O48j523j860l3J798R95r87j419
$$ y = [-659, -1377, 262, 2182, 1530, -1094, -2243, -913, 1082, 958, -839, -1541, 143, 2152, 1868, -608, -2085, -948, 891, 816, -1009, -1794, -218, 1956, 1938, -228, -1772, -813, 940, 788, -1154, -2030, -598, 1675, 1941, -103, -1421, -517, 1134, 933, -1112, -2266, -962, 1331, 1750, 39, -1310, -312, 1393, 1240, -879, -2324, -1227, 1001, 1586, 15, -1234, -202, 1701, 1643, -494, -2171, -1319, 701, 1358, -119, -1344, -317, 1756, 1940, -120, -1843, -1343, 563, 1174, -273, -1484, -478, 1612, 2084, 271, -1485, -1098, 560, 1005, -396, -1700, -865, 1445, 2117, 519, -1130, -847, 688, 1111, -458, -1968, -1243, 1114, 1987, 639, -1015, -606, 907, 1369, -244, -1963, -1502, 660, 1832, 580, -930, -481, 1066, 1556, -37, -1836, -1666, 326, 1457, 414, -1008, -636, 1153, 1801, 278, -1582, -1615, 183, 1178, 191, -1228]
1987a228M40J904Q78j399j942j67J558R75j028j502M48J953J107j105j950k38
2003a296J378R22j053j588K49J928J344q75j779l20J317R32j084j706k1J892J366
2020A606n98j660k22J355R22j084j895k15J716J440o07j428k01J471J056r50k076
2037a370m38J491J439n07j364j28J508J203q27j999p06J331J261m10j418k17J592
2054D41J431o19j895q66J167J325n72j515k46J553J552l91j724q13J015J130n72
2071D01j516m80J474J661k00j553p46R98J124n34j741n50J232J669J9j460p18
2088i20J090J183n01j795q83J191J632R9j375o61J083J350l39j855r96R80J467
2105G50Q2j301o25J141J476j69j731j086P41J395j2j254p08J134J602L3j604j068
$$ y = [-1228, -788, 1116, 1994, 595, -1347, -1514, 44, 1019, -9, -1511, -1063, 890, 1997, 892, -1058, -1296, 82, 1004, -49, -1637, -1388, 540, 1884, 1009, -770, -1090, 227, 1159, 75, -1631, -1652, 240, 1606, 1008, -652, -874, 481, 1403, 319, -1576, -1791, -75, 1365, 758, -670, -871, 600, 1656, 706, -1370, -1808, -317, 1122, 615, -749, -877, 631, 1834, 1007, -992, -1698, -367, 894, 484, -934, -1151, 441, 1872, 1253, -642, -1508, -341, 984, 412, -1103, -1349, 204, 1756, 1365, -359, -1172, -157, 973, 401, -1115, -1595, -121, 1540, 1340, -213, -959, 39, 1163, 629, -1112, -1662, -430, 1239, 1258, -202, -920, 170, 1353, 852, -943, -1826, -635, 997, 1096, -279, -940, 143, 1493, 1154, -701, -1697, -717, 750, 832, -469, -1094, 47, 1523, 1354, -377, -1463, -722, 673, 661, -593, -1301, -167, 1435, 1468, -136, -1204]
2123a204O18J258j6j403p74R63J889K18j425j177O15J253j21j341j022R13J742
2140I86M97j246j130N75J332n0j473j166O47J671O13j178q93O31J251R7j433j322
2158a591M98J546N56j029q99O35J423K36j404j308K60J387M43r43r07O90J530
2175A123M18j357j343J92J300M81j041j083O13J706N53j095j353J07J177M99j107
2192b10j154M54J624P94r16j257N9J112M86j042j343K73J522R54q28j124J55J116
2210F75N07j071j460P9J446R40p16j091K43J180O06j002j518j26J331Q54o72j051
2228h46K63J342P29r13j549k07J137Q29o93j066J59J371R41p58j426l45J058P76
2246H02p21j171Q5J402R92n72j336l36J004O66o91j265o9J269J113l02j178l55
$$ y = [-1204, -586, 672, 656, -747, -1521, -558, 1331, 1549, 124, -1053, -438, 815, 694, -647, -1669, -756, 986, 1483, 237, -893, -318, 1014, 964, -509, -1675, -1028, 643, 1256, 78, -815, -184, 1067, 1164, -269, -1591, -1093, 453, 1009, -20, -919, -284, 1139, 1375, -29, -1337, -1077, 310, 753, -190, -1097, -407, 1123, 1541, 184, -1159, -967, 333, 814, -227, -1310, -697, 1009, 1562, 467, -886, -779, 398, 897, -210, -1364, -910, 714, 1508, 592, -665, -606, 506, 992, -50, -1393, -1120, 402, 1356, 528, -596, -441, 675, 1182, 111, -1349, -1270, 176, 1116, 400, -691, -448, 732, 1338, 336, -1182, -1308, 23, 877, 205, -846, -583, 759, 1488, 575, -974, -1181, -44, 785, 92, -974, -815, 556, 1497, 739, -687, -1032, 26, 802, 81, -1090, -1005, 397, 1389, 817, -519, -855, 149, 815, 124, -1141, -1210, 59, 1172, 870, -308, -663]
2264f63R37P75p77j392k29J212J126l08j049l04J011Q06o48j434m13J033J071
2281G54j78j060j83R54J006n49j410n72Q93R86k30r94k35J029J087l51j400o55
2299a108P78R13k59j048l14J153J160k22j228p21P15Q63l31j148l99R87J280l9
2317A032j102o62O53Q81k79j311m95Q58J306J09j043n49O22R19l06j279o66P46
2335e66J199K63j011n78P58R17j02j290q58N94J107K61r15m82O86J082l4j201
2353a70r02M37J017J03q04o44Q17J197J16j158r31M29R01R6r42o08O42J261K92
2372A149j031q25L14Q61O6r91o98N24J288M05q46q32L59R06N4j008r09L95J224
2391D05N13p74p32L47R67J19j049r45K60J198M31o48p18M40R56J72r14j052J70
$$ y = [-663, 274, 1049, 272, -1120, -1349, -137, 989, 681, -368, -672, 339, 1145, 497, -937, -1350, -317, 754, 576, -484, -667, 287, 1293, 744, -666, -1238, -345, 641, 411, -583, -818, 211, 1298, 947, -453, -1108, -330, 583, 324, -724, -1038, 115, 1275, 1053, -175, -896, -181, 682, 351, -797, -1196, -209, 1071, 1032, -70, -732, -79, 802, 523, -788, -1283, -425, 881, 990, -53, -602, 20, 939, 633, -646, -1312, -566, 633, 896, -115, -693, 65, 982, 880, -410, -1268, -674, 433, 694, -221, -703, -17, 1065, 1031, -170, -1072, -635, 382, 485, -319, -963, -146, 1051, 1167, 9, -922, -493, 408, 504, -438, -1046, -404, 857, 1149, 118, -707, -393, 468, 534, -457, -1155, -631, 657, 1062, 216, -616, -257, 649, 703, -305, -1214, -819, 405, 918, 144, -588, -241, 726, 845, -204, -1149, -889, 309, 740, 92, -626, -186, 770, 942, 28, -1024, -854]
2410h54R80N34p18o96M47J093L62q57j063jR16M25o99o95K76J210M94p10j080
2429f36rQ51L86p02q42K48J171N99n74r05k8P82L53p77r44J73J046O82m47p97
2449c70k7Q10M08p17j039oJ072O45l65q25RQ89M99o92j103j43Q74O56k83p43j6
2470d67R38N69n89j059k26P22O00l30p52J4J000O93m71j103k98O67N88l98q21
2489g23kR79P06k99r60l24O73M90l94r12o9Q45Q78j95q59l60O49N32m83r49j68
2510i45P87Q71j49p92k18O29O87m80j037l61P00Q38n9p55j98P24O90l63r92m93
2530i16N72P35n2p26j47P17P69k59j011m89N36O63j16p32k74P51Q91j12r33n28
2550f61M47N84q5p57l48O44R68lq08n73M72N80j19q53m15N70R25J97p90m37L94
$$ y = [-854, 126, 660, -58, -754, -307, 786, 1148, 291, -772, -773, 143, 568, -131, -826, -550, 660, 1154, 444, -636, -645, 206, 592, -110, -952, -704, 467, 1066, 492, -413, -441, 341, 694, -83, -1027, -854, 192, 874, 427, -370, -397, 413, 821, 104, -935, -941, 131, 776, 411, -414, -405, 484, 983, 291, -812, -955, -81, 575, 292, -451, -467, 471, 1040, 451, -608, -834, -112, 488, 158, -594, -580, 420, 1113, 642, -461, -759, -92, 496, 98, -723, -725, 254, 960, 661, -299, -623, 50, 540, 146, -766, -835, 10, 888, 693, -166, -526, 123, 655, 172, -777, -945, -158, 713, 564, -228, -446, 183, 870, 390, -647, -1008, -308, 530, 471, -284, -482, 242, 932, 569, -423, -916, -344, 391, 339, -387, -534, 183, 952, 693, -318, -807, -271, 392, 276, -456, -730, 21, 912, 800, -133, -661, -214, 370, 285, -472, -820, -176, 792, 789, -19, -592, -120, 460, 341, -512, -927, -357, 568, 765, -25, -462, -68]
2571f8P06k11q17n34M98Q47J66n79m82M76P29j33q14o96M04Q02J89o17l64N11
2591A3P52J2q54p03K41P79J52o17m01N13Q40J10p80o96J48P11J96o20n22M29Q41
2612E44L30o24p39J37O24J42p00n73M08R51K68n46o03J23O23P7o46o68K96R06
2632C30L63m96n23J04O84J60o95p86K29P81L32l93m99K42O93K42p06p97M8P97
2652A10L97n13m87K55P04L62n50q36m6O40L05m31n43K53Q27M40n87p25j02O10
2672H3K92m47o16J86P31O01m37p31k2N21L24n01o49L9P70M93j63p49k2N90K77
2693E70m69p84J6O73N47k43n46p4O62L73n09q38o5N58N36j16n66kN85N07m69q08
2715d62k38N78M55j70n45m5P17N05l51q13j71M38M39k39o21J3O68O52k95p27k65
$$ y = [-68, 638, 427, -390, -924, -426, 421, 587, 8, -474, 2, 731, 598, -216, -912, -508, 294, 483, -134, -498, 13, 765, 777, -77, -780, -539, 240, 392, -225, -626, -113, 727, 837, 57, -639, -491, 220, 416, -204, -726, -297, 544, 874, 250, -489, -352, 272, 414, -286, -859, -451, 500, 768, 222, -381, -258, 365, 442, -204, -872, -576, 330, 693, 197, -326, -222, 462, 622, -73, -859, -630, 151, 483, 90, -409, -167, 526, 768, 62, -735, -687, 110, 507, -6, -493, -238, 466, 828, 278, -558, -604, 36, 341, -90, -633, -380, 447, 887, 300, -425, -527, 83, 375, -72, -688, -502, 229, 830, 393, -338, -360, 161, 485, -16, -665, -626, 144, 637, 474, -275, -297, 293, 570, 101, -683, -667, 6, 553, 310, -236, -310, 352, 725, 216, -622, -687, -129, 407, 291, -275, -277, 308, 815, 346, -462, -700, -122, 333, 163, -382, -427, 290, 795, 444, -369, -540, -102, 337, 98, -523, -510, 158, 810, 515, -212, -477]
2736d77M41M47l09o71q3O29O89j34o67j91L56M08k17p56j78N26O90l2n54k33M17
2757A01M71k83p00l44N21O51m5n05j99N00M58k39p23m03M11N98Pm61k37N05N22
2778F06r8p31l93L72M89k7n22k03N26O10K2p49l79K37N14j9o63k43N09P02L7n19
2800G8m47K08M37J9o45l26M52O28J36m78l82K44M77l9n70m89K90P46J39m03l91
2821c16K82N28ro83m89K13O52K06m56k92L21N45P3o31n13J14N85J86m62l23L49
2842a20O04J37n88n37J59N00P9m09l74L23O58J92l83n97O7M95J37n56l76K10O62
2863B83L60m30m71N6M08J79n02n06J94O49L26k91m80N0N56Q3n29n41O8N69L54
2884C85k63l93J31M94J90m93n61l6N13L72l04l76J12N35L57m92n92pM05L33l51
$$ y = [-477, -36, 411, 102, -569, -652, -23, 666, 532, -135, -326, 30, 438, 221, -535, -713, -187, 503, 471, -83, -316, 101, 572, 289, -411, -755, -234, 417, 372, -133, -332, 168, 626, 387, -336, -739, -328, 270, 277, -184, -421, 84, 606, 508, -223, -616, -244, 245, 218, -304, -507, 19, 629, 651, -98, -477, -240, 274, 255, -408, -651, -142, 560, 597, 78, -369, -161, 276, 295, -350, -676, -224, 404, 540, 62, -320, -76, 401, 362, -208, -697, -407, 339, 478, 75, -316, -34, 494, 485, -198, -687, -474, 178, 384, -72, -364, -43, 502, 575, -56, -569, -455, 130, 316, -146, -469, -120, 484, 621, 33, -504, -345, 155, 234, -175, -549, -226, 432, 624, 241, -356, -289, 206, 343, -213, -589, -379, 283, 643, 213, -258, -202, 206, 385, -117, -623, -429, 220, 546, 255, -225, -175, 381, 464, -65, -606, -538, 31, 385, 122, -271, -140, 354, 544, 51, -510, -546, -33, 339, 35, -341, -229, 306, 663, 171, -421, -428, -23, 310, -41]
2905d1l67J48N64L03l47n50q5M43K16l02m27P2N88M00k68n24j39M56K30l56m77
2926d63mN13N21j92n63p9M41K78l72n54n9N02M52j04n15k6M20K79k74n97j72M35
2948a33M51j46m29K8M65L45l42n07k47L62M11j13m57k2N21L48j56o34j63K90L55
2969B27r8m54m5M53M75j94m82k39L05L31j28n37j06M47N17m6n02k07L38K75k05
2990A25m63k44M56N07n4l40k44K71M10j99m72l32L73M88M8m05j55K91L51p9n17
3011a84l48K90M60k1l73j45M07L82j11l99m36K53L98P3m32j29L16M57L6m92l69
3032c67J59L95k5l78k38L60M56J32m45l08J56L08lm61k37K52N20J22k83l29J38
3053g6L49J4m50l49K42M45K17l85j88J45L49K8m46m07J13N34J21l28j95K61L29
$$ y = [-41, -408, -260, 304, 607, 260, -290, -375, 68, 284, -18, -445, -373, 215, 615, 347, -177, -316, 140, 370, 14, -463, -467, 46, 567, 375, -188, -267, 174, 452, 80, -474, -533, -31, 421, 317, -198, -224, 196, 475, 201, -396, -568, -133, 318, 172, -257, -229, 236, 581, 239, -268, -515, -153, 258, 145, -312, -334, 187, 535, 379, -255, -418, -128, 227, 129, -325, -370, 83, 558, 364, -118, -357, -52, 279, 151, -386, -492, -45, 472, 426, -76, -283, 55, 330, 125, -338, -582, -126, 381, 327, -13, -257, 14, 424, 225, -247, -579, -206, 282, 330, -75, -230, 61, 412, 333, -184, -532, -242, 218, 197, -176, -321, 86, 468, 357, -42, -478, -225, 173, 246, -186, -315, 1, 458, 494, 2, -367, -208, 187, 162, -216, -454, -94, 362, 494, 49, -259, -103, 205, 202, -259, -496, -244, 276, 398, 115, -214, -76, 273, 287, -163, -512, -270, 175, 392, 7, -181, -36, 313, 341, -105, -512, -399, 135, 256, -72, -267, -6, 323]
3074C23R1l98m51J36L69J76l06k13J95M50J42m00m45j2M29J25k83k65J83M42K10
3095D98l09m59L7L51N0k68k49J23M52K28k71l56m5L86J01l09l77J5M80K83j60
3116B01l90M1L24J68l44l79J0L41L43k11k76M8L78J81l65m50rL65K79j35l23O8
3138a35M36J13k90l85q2L32K12k07k73O1M00L25k30m89p6K40K66k00l35N3L71
3159A07L87k36l97m6J97K24k43l77n2M73L50j50l68k4K86R4j79l77o1L17L53k8
3181B50l10j02K53K06j65m22j16K73L93p5l12n0K85L17k42l61j80K14L29q9k65
3202a69p4L27L68j69m07j78J48K70Jl19j13L73L11m6l53k15R3L79j16l71q6K81
3224f5L98J4l66j82J61K33o3l83j57K78L93j8k27k07K03K67j16l37k41K16L88
$$ y = [323, 414, 16, -435, -299, 70, 246, -60, -273, -78, 372, 514, 114, -331, -343, 86, 211, -72, -337, -154, 288, 498, 189, -270, -233, 118, 168, -100, -349, -226, 226, 454, 183, -173, -218, 168, 269, -40, -417, -402, 78, 361, 201, -189, -148, 176, 344, 0, -379, -369, -28, 315, 104, -172, -124, 254, 435, 70, -380, -389, -24, 255, 120, -203, -135, 301, 414, 124, -261, -343, -11, 201, -6, -279, -218, 182, 507, 277, -212, -288, -48, 218, 18, -317, -264, 107, 494, 258, -139, -185, 12, 236, -7, -384, -436, 37, 387, 237, -131, -155, 131, 225, 46, -331, -392, -75, 278, 250, -60, -162, 91, 297, 132, -290, -406, -133, 260, 185, -127, -177, 108, 425, 183, -178, -358, -144, 185, 96, -169, -243, 84, 452, 283, -124, -302, -154, 116, 117, -202, -315, 58, 369, 323, -30, -245, -152, 227, 111, -260, -346, -65, 333, 347, -19, -201, -40, 193, 130, -253, -410, -132, 261, 243, 16, -191, 12, 279, 163, -174, -415, -199, 189]
3245A89P2k32k50J95L76j06l75k90J85L75K2k17j43J98L74k5l65l13P1L35L9k16
3267a01j30J95L26K5k63l41J03L47m1l01j73K91L08J05k62k76M4K75J8k88k67
3288d06K21L91J20k24k60O9K37J7l00k74K13L12J88k10k16Q5K85P6m07k81P3L86
3310I5J37j81j99J27K65Q0k81l10M4K52Q8j75p5N9L30J27l35l11K9K61J23k13
3332f3k02J25L99J05k48l02K8K03R0j96k88J29L55J68j58k40p3K69N9j55l22P0
3354b47L00K60j43l05OK73R4k66k54KK83J96j11j98J7K12K12k77k75r2K19K96
3376B02j53j79K6L02J25j64l26j22K10K12j8k82J2L17K13k01k75j11J78J66q5
3397D7k88l7L54K09q6k79j41J93J77o8l36n7L25L09q7l00NR3J57j49k58p3K07
$$ y = [189, 261, 29, -221, -26, 350, 244, -131, -421, -236, 139, 161, -56, -199, -1, 373, 348, -17, -330, -259, 76, 115, -101, -231, -36, 290, 315, 52, -289, -186, 161, 120, -181, -354, -63, 245, 350, 88, -188, -144, 131, 149, -139, -406, -185, 206, 326, 102, -158, -89, 148, 165, -135, -409, -196, 116, 304, 94, -122, -37, 248, 324, -83, -364, -291, 95, 232, 51, -148, -21, 244, 324, 43, -267, -223, 29, 117, -58, -133, -74, 256, 383, 48, -263, -234, 27, 150, -63, -265, -140, 259, 364, 116, -186, -158, 45, 135, -61, -349, -220, 135, 303, 145, -95, -168, 101, 160, 5, -317, -247, 53, 313, 170, -135, -129, 144, 238, -28, -282, -280, 3, 199, 88, -110, -93, 119, 331, 54, -221, -313, -94, 202, 49, -130, -104, 198, 323, 159, -167, -289, -79, 133, 115, -167, -155, 162, 375, 174, -101, -212, -34, 132, 47, -241, -278, 76, 285, 199, -80, -221, -28, 149, 81, -255, -312, 13, 322, 235, -65, -60, 33, 190, 41, -217, -290, -83]
3420h3L24o8k99J3J98J62j81k41k04L01K35J3k52n1J78K31j15k79j41Q3L18m4
3442I8j94n7K43K30m6l66j59R0K86Jk52j14K53K53j3k96j85J03K37l6k53j16K61
3465c2K51M2k61j28R5J66r3j92j45J91K88R4j96j71O5K61n1l05j87K05K10Q7j98
3488do5J09J97j5l50j45M4K80P7j98j02J59K34k0k30k18Q5K21L9j65r8J05K88
3511B28Q6k53k67O3J44J47k28j37J36K45J46j94k33nK21k4j74k09J30K75J30q1
3533A46k33N6J48Rj92j86M5K47J49p6k16Q1J70M5j99k13K0K17J40j02j04K0J88
3556A60O1k18k02m5K26J10o9k17M1K89J28j59k77j5J62J56j55j65P1K40J36r8
3578A60k70k5J08J00j35j59M5K18K13j00k38k7J54J03j29k41J2K26K05n3k02p2
$$ y = [-83, 241, 173, -126, -113, 85, 247, 66, -175, -379, -78, 157, 170, -82, -133, 45, 276, 161, -118, -259, -176, 142, 98, -96, -153, 90, 320, 274, -92, -251, -161, 125, 126, -126, -240, 13, 266, 253, -43, -228, -125, 112, 76, -177, -293, -32, 219, 261, 0, -128, -33, 133, 40, -152, -297, -106, 182, 276, 80, -91, -26, 235, 184, -121, -308, -103, 107, 194, -4, -69, 40, 237, 222, -128, -273, -229, 51, 128, -70, -172, -13, 221, 201, -29, -247, -162, 59, 98, -67, -165, -60, 228, 314, 61, -206, -143, 1, 148, -80, -217, -81, 164, 310, 116, -117, -122, 99, 75, -99, -308, -178, 97, 227, 146, -87, -31, 117, 126, -66, -252, -207, 40, 189, 113, -103, -22, 148, 193, -6, -219, -199, 18, 158, 56, -48, -28, 160, 221, 3, -199, -244, -18, 92, 23, -194, -153, 136, 264, 105, -172, -187, -25, 131, -24, -189, -118, 122, 258, 160, -110, -135, -27, 73, -62, -221, -176, 42, 255, 155, -83, -110, 44, 147, 18, -223, -211, 15, 220, 167, -35, -107]
3600a07J98Q5j38k30r0K54J85q6j26j8J97J02j21k61j55K49J99m5j92J0J97J26
3622B33j44k12n3J04J68n0j85J6J54J99j03j78r7J12J15l8j71p3K45J92n1j88
3644ej49J48J16r3k02l9K40K12o3j42j20J39J22r9k03j14K22J81J6j24j47J53
3666D9J06kk85r4Q1K46N2k13q1J38K04n5k54j09J81R4j8j01m8J28J80k0j99j42
3690a62J3J79rj10m6J14K69o7j61j51P6J51j9j86o8J37K24O3j94j19P9J18ok11
3714h6j17Q4K72Q2j80j15O8J43o1j20k35J58J89N5q9j10L1J91J2k57j21J0K05
3737IJ26j77o8Q6J76K8k32j18j0K34mm3j12Q6J64N2j37k37O7J81K4j45j09J11
3761d8J69J33j24k41J0J28J8j34q7J13J53J44j48j70M2J37k3r1j56%K09J31o4
$$ y = [-107, 91, 176, 38, -192, -282, -28, 157, 71, -55, -73, 124, 226, 105, -156, -311, -62, 137, 92, -100, -90, 107, 233, 89, -123, -176, -72, 96, 46, -139, -123, 31, 230, 127, -51, -148, -36, 79, 41, -130, -203, 42, 234, 183, -5, -154, -6, 110, 17, -185, -224, 16, 228, 165, 23, -97, 42, 164, 65, -138, -252, -30, 151, 167, 43, -104, 49, 155, 153, -132, -226, -145, 101, 153, -60, -141, -3, 201, 146, -108, -217, -36, 58, 40, -61, -109, 19, 199, 179, -20, -162, -149, 30, 21, -89, -135, -21, 248, 181, 20, -131, -55, 96, 77, -109, -177, -40, 184, 247, 53, -66, 13, 131, 125, -86, -203, -119, 153, 235, 55, -60, 8, 151, 90, -30, -265, -107, 82, 137, 48, -62, -31, 160, 172, -85, -206, -196, 9, 135, -42, -110, -24, 152, 180, -52, -170, -180, 54, 50, 7, -105, -19, 145, 197, 60, -177, -110, 71, 95, -50, -159, -48, 121, 254, 130, -111, -101, 27, 45, -89, -176, -63, 90, 234, 86, -84, -42, 95, 72, -19, -175, -175, 34, 165, 101]
3784A01j71M8J69j9k04r5P8Q3J69j31j05M0J56O4j22k16J6J16N9l2r7N2J33P4
3808A66l7k48n3J30J09pk27O8J87J26r7j85n5J39J0kj56nJ78J32o9j23o1J31K9
3833H0j28o5m3R7J79%j87l8P3J36j14j95l1K21J93r3j61P0P3P6r9j76j01J88N1
3858FOn6m7J37J13n4j81j15J25J23j9j15RJ13J01nj65j19J19J15o5j04r0K16J30
3883A78n5j36n5N8J02o5j67jJ22J72m3q9j26J18J11j04j25j13J42J49N0j22r4
3906i3N7J40m0j77o5Q9J21L8o7n4O6J40o6j07j18J8J82J0j17p3J21J13j8j14j27
3931a41L1J59k2o7j7L4J78k7r8j50L6J24l5r1n1P1J73J16j72j47N7J27l2j23q3
3956a50M2J40J43j19j11rR7M3j65p4P6J39J3pj43N9J32Nj10j48MJ62Q8rj73M8
$$ y = [101, -70, -22, 147, 128, -76, -171, -93, -10, 159, 28, -77, -37, 119, 183, 61, -155, -139, -23, 36, 4, -93, -41, 92, 166, 129, -119, -172, -42, 67, 60, -167, -99, 88, 214, 117, -68, -123, 16, 26, 24, -132, -137, 41, 173, 104, -19, -80, 51, 80, -48, -113, -156, -59, 120, 120, -67, -105, -32, 104, -10, -205, -236, -15, 178, 85, -76, -6, 67, 143, 44, -132, -233, -45, 6, 12, -44, -91, 46, 159, 105, -76, -191, -66, 57, 38, -77, -68, 45, 146, 141, -24, -143, -24, 91, 26, -78, -168, 48, 178, 123, -13, -68, -10, 92, 27, -140, -141, -19, 153, 110, 21, -105, 13, 124, 20, -105, -218, -76, 73, 123, 1, -93, -36, 104, 64, -113, -178, -89, 32, 70, 3, -51, 15, 155, 89, -18, -136, -118, 64, 74, -43, -116, 5, 118, 100, -14, -141, -110, 49, 27, -40, -57, -23, 155, 128, 30, -120, -84, 40, 5, -86, -137, -66, 107, 223, 51, -96, -39, 88, 56, -67, -150, -108, 32, 175, 56, -55, -64, 33, 76, -89, -163, -87, 52, 65, 58, -85, -26, 106, 111, 1, -147, -143, 19, 107, 98, -75, -27]
3982b7K15p6p4j03q1J69N6o7o5M8J18N6o9k08JR0M8j03l1MJ53J17q9j22l7Q4Q0
4009H7j68p5K5J73R1n4j13l8P4P7j45n2l1J52J33k5j47L9L1R6j16k24M0J84R5
4034A09j1j03o1J34P1j04j58J5O9J44p1q6J1J38N3r3j45mR4M0m7k6l2R5R0k2j48
4061d8j7P7O2j29l1lR2J91j23n1o1PJ18p6j20j9J06J40J1r9q5J02L4o2j78L9O7
4088e6J36m0l1PM5M4m2j40j10K17J3m5J2p6R2J72j10j27p8J16K9j1o9k4J32J19
4114A75o7j38j42J13P5o9k8k5J23J10o8p7k4J3K6M1j32o0J40O7K7m7j00M3P6K
4140E4r0m9K6J18N2r5o0O1O0K5j20j09N5J29J6l0l8J6R9rj07p2L2J17L0j58l5
4167h2J1J88L1j63r5M6P0j1Pm6J1J08M1q1j08l0Q6M8o2j02P4J40J7r4n6L2L6L7
$$ y = [-27, 188, 112, 38, -65, -146, 23, 79, 12, -53, -5, 113, 169, 100, -108, -107, -17, 31, -72, -103, -99, 54, 171, 82, -40, -77, 7, 87, -81, -156, -131, 42, 133, 79, -34, -72, 2, 79, -66, -118, -149, 3, 136, 111, -36, 3, 34, 130, 14, -210, -170, 14, 109, 98, -5, -66, 68, 139, 35, -123, -108, -39, 105, 34, -52, -41, 97, 150, 57, -88, -92, 2, 42, -5, -31, -63, 32, 122, 100, -48, -65, 12, 74, -55, -86, -89, 3, 194, 71, 20, -41, -34, 84, 8, -112, -131, -25, 115, 126, 27, -58, 44, 78, 16, -162, -123, -56, 80, 40, 9, 16, 61, 105, 63, -77, -187, 30, 43, -2, 10, -66, 26, 198, 88, -39, -117, -1, 28, 17, -52, -76, 56, 175, 108, -30, -172, -59, 16, -53, -81, -106, 17, 127, 59, -18, -42, -29, -3, 38, -94, -154, -14, 53, 80, 33, -67, -24, 52, 54, -36, -85, -59, 59, 111, 16, -44, 17, 77, 102, -18, -127, -72, 57, 73, 43, 5, 21, 120, 111, 4, -68, -36, 81, 111, -47, -82, -71, 117, 148, -15, -110, -64, 6, -5, 2, -44, -33, 75, 116, 35, -73, -103, -17, 31, -31, -133, -59, 81, 98, 4, -52, -20, 16, 53]
4195E3j02r1P2Q5Q5n9o9K0L4nl3p0n1J56P6r0m7M3Q2Lp1j43J1J30P2q4q6O5J74
4224A60n9j02o4j1O9qK9q0O0Q4j1l6j38l6J19J4mp3J8J21L3l6q8q6J36k1mo0K5
4253d9O4R2k9n9n7J6M1j0j22K8J46nk4j1J5Nj9l0r2qJ04L2Jn4j7R9O6p0j63rO5
4284e4N4M5n1qM2J9K6j27m8N1N3J9o0NJ24lqr6o4P5Q1q4j08M4Q6P8l6m5p2N5P2
4315F5o2o9J4M4P3K2j06OK7N5n5o6o5P7O4PL3p7N1P3o0j00o5P1L9N7r1l0N9J03
4345I4n0p4p4P0Q2n7m0r1J98P2k5j34o2K3M1N5l5p8Q2N7J6q7l1K5L6jj2m0%J11
4375G1N2j33l0L3L8L2r9n0K2J32pJ1j04J1R6m3k6j56O4L4J15q8JK4M4L4j29j1
4403f2o3J11Q3n9m8M0M4K2n6q1J7L5J7m5l4O2O4P8r2r0kN9jJ4p2J0P0L5j2q6l3
$$ y = [53, -49, -140, -68, 17, 102, 43, -26, -6, 28, 23, -10, -80, -131, 25, 101, 11, -36, 7, 89, 92, 21, -122, -111, 19, 91, 7, -79, -14, 160, 101, -1, -65, -76, -7, -15, 14, -66, -6, 78, 67, 31, -107, -143, -24, -10, -14, -87, -69, 52, 85, 49, -39, -125, 11, -10, -14, -74, -49, 15, 107, 78, 19, -38, -22, 19, 9, -113, -85, 61, 56, 32, 21, 36, 41, 22, -8, -100, -108, -4, 28, 29, -25, -42, 57, 123, 53, -110, -119, -54, 0, 45, -6, -14, 28, 47, 73, -54, -102, -51, 2, 21, -39, -34, 90, 87, 79, -17, -81, -6, 75, -9, -117, -73, 13, 91, 55, 10, -62, -7, 65, 3, -66, -52, -8, 65, 87, -19, -13, 14, 69, 14, -52, -117, -40, 24, 31, 64, -13, 38, 111, 51, -49, -114, -43, -4, 53, -38, -68, -9, 94, 44, -30, -104, -34, 48, -9, -49, -140, 58, 130, 105, -29, -91, -68, -27, 28, -7, -85, -3, 54, 70, -17, -48, -23, 13, 12, 0, -40, -40, 71, 123, -10, -40, -7, 31, 63, -36, -86, -64, 68, 61, 72, -32, -21, 75, 32, 6, -150, -86, -52, 63, -25, -24, 0, 44, 78, -51, -62, -125, -14, 69, 10, -38, 2, 46, 68, 12, -69, -52, -17, 0, -45, -79, -17, 47, 125, 33, -57, -59, 0, -1, 13, -59, -49, 21, 56, 44, -42, -75]
4434g5J42k6m2p7K3R0Q2o3o0J0N6l2o1m8nK3J01K1j14R9m7L7j9o5m1J16ml3j1
4463b3M2K9K1n3n7o6J23M0l1p9L2N2J9K2j38N5j1M1J1p8J1O1N7j3r6j4N0L2k6
4492A3o3qN9O2J5j21pJJ39j03l8o4J36K5M0n4k6j2N4nj39J2J9Q7J1k8m3R7j6K2
4522F5q9o9N6J9K8l0RN3N3m6o2p3K6P9j2m7K1rJ18m6q7j9QP1j9n9j1J17K5m9l1
4553a0rK7nJ7m5k5N5O1l5K9q3M2nM4j25oK0Q5Kk9k8J1J0N1l2r4R9m5M2r2J2O7
4585FqR1j03k5n0R2N1Lr8N3N4K1q6l0mJ2O8p2o3N8J13j6o5nK1nNn8m5L8J17M9
4617A19j05n7QN4k2l8k1K8P6L6o7pnP0m4j4p9K0R9o0M9m7k1O9jo1j5o2P4L4jN
4649A4o7P1Np9M0k8L8L7o7J5L4J02m2m4m3K0j3Jol7L2Q4K6p1l2n1R9n4Pm2J2K7
$$ y = [-75, 67, 41, -1, -78, -55, 35, 117, 54, -6, 4, 60, 28, -33, -81, -86, -63, 38, 59, -55, 44, -3, 34, 15, -50, -91, 25, 21, -12, -23, 19, 48, 69, 16, -41, -107, 16, 56, 25, -54, -22, 30, 49, 71, -67, -12, -23, 18, 29, -49, -38, 23, 80, 67, -29, -43, 7, 39, 13, -50, -58, 1, 63, 78, -43, -50, -49, 90, -13, -51, -115, 21, 46, 86, 32, 6, -6, 48, 43, -96, -84, -65, 22, 33, 5, -38, 59, 43, 65, -24, -93, -37, -18, 10, -20, -11, 42, 95, 49, -13, -86, -60, 19, 7, -40, -19, -28, 90, 44, -43, -62, -54, 17, -2, -61, -72, 45, 70, 21, -10, -19, 8, 3, 20, -25, -50, 5, 66, 31, 60, -23, 19, 14, 58, -67, -73, -53, 32, 34, 5, -23, -12, -2, 49, 17, -77, 22, -23, 19, -73, -61, 6, -2, 89, -14, -39, -89, 3, 54, 57, -41, 12, 66, 87, 1, -29, -33, -21, 47, -25, -88, -30, 83, 67, 2, -3, 18, 13, 18, -40, -85, -47, 70, 119, 14, -43, -35, 19, -3, -41, -62, -34, 42, 78, 11, 4, -1, 69, 25, 11, -68, -48, 51, -9, 40, -7, -28, 41, 40, -21, -36, -98, -24, 10, 9, 14, -53, 18, 23, -56, -16, -44, -6, 31, -36, -21, 13, 115, 73, 29, -14, 6, -7, -6, -12, -49, -17, 67, 93, 22, -10, -61, 38, -16, -9, -51, -39, -12]
4681a2J25o3o6K1J8J0m1l3NL9K6rl5J9M0m4J3q1l2J16J0l8jJ0L5O6p6q6J0K9M3
4712A8J2m7J5N6nrn8j1KK1J5j4k4J3R8o4j6m9K4J9J1n4NO5K1L5p3j3nJ8Mj31O7
4745e4J9O0n1%j7J6M3n1L8n3j6O2N0j1m6M3j2j1k6j7M5k0M1j7n6Q4K1j3m8p6P6
4776Ck0N1n0pJ6J15l2q1k3j4L8k7j0J5L2J8Q4j31ql9M8k5J9l6O7Q8n7n3L0j2k6
4807b7l2N5n6L1L6N9q1J8nM5po6LOK7J0j5j2K0R5n2o9mk7NN2j3j2K6R3n0kjj50
4841a00J05M2q0j4K3O3JK5j20M2J2L6j12oK1P8M9n2k7j8J8P8o1l0k2O4N8qj38
4870g3O7L8j2k1l9J6mJ15o9Nm9M8K8o8j9%J1N5l3L0n5J17oq3k8l5L5R2j03jM3
4901BN8l2J5o6j0O8l4m4l9O1RN0j7n4n4O6J1k2m7L7R9j5k5M8p6L7K3m9j6J2OK1
$$ y = [-12, 113, 50, -16, 5, 23, 33, -8, -41, -36, 3, 29, 20, -15, 4, 44, 0, 13, -68, -100, 16, 26, -12, -13, -3, 32, 98, 22, -64, -54, -25, 18, 30, -17, -2, 54, 49, 40, -18, -29, -27, -6, 9, -5, -29, -16, 82, 18, 2, -47, -23, -4, 7, -47, -42, 23, 44, 79, 6, -7, -12, 6, 10, -121, -54, -35, 25, -26, -26, -43, -27, 16, -35, 3, -50, -66, -4, 46, 35, -11, 32, 20, 9, -17, -34, 11, -9, 32, 15, -41, 43, 64, 51, 3, -73, 3, -17, 34, -16, -23, -7, 108, 76, -5, -28, -42, -4, -31, -41, -26, 6, 24, 108, -23, -31, -70, -22, -47, -28, -64, 3, 91, 34, -19, 11, -1, -27, -59, -4, -60, -29, 7, 66, -15, 3, -2, 43, 36, -30, -27, -21, 6, 16, 1, -11, 9, 104, 52, -17, -21, -48, -43, 9, -4, -16, 10, 103, 53, 51, 50, -100, 5, 47, -33, -47, -24, 39, 40, 65, -55, -13, -1, 35, -77, -83, -62, 16, 65, 13, -14, -32, -14, 64, 3, -27, -49, 15, 73, 65, -73, -6, 32, 20, -1, -40, -24, -28, 87, 18, 23, -26, 22, 50, -18, -37, -37, -26, 29, -4, 26, -29, 88, 82, -1, -29, -64, -29, 63, -40, -41, 2, 60, 28, 43, -23, -33, 35, 1, -43, -82, -21, -12, 38, 21, -33, -87, -21, -10, -32, -79, -42, 57, 42, 17, 65, -11, 26, 49, 0, -16, -4, 2, 23]
4933B3j0Ql8P3J5p4j0k9L6L9l4j9J1M1N2q5n2lO2o5P5k5Kj2N2mk9Om1J7Qk1J5
4966a6L5N5l4j05K8L9j7K0l8K4l7Q5Ko1j0M6k0J6om2kQ0j1n9RN7j3Nk8m8N0Jk
4999Cl6O4m9N7K3q3om0J14k7k0oJ0O0l6k3k8LO9o5k0J7QK6%J5r0J9K7L3p2L0K9
5032FQKm9j6M9M4k8l7l5O7O6k5K2p4mQ2l5o7k9J8PJ04n3k8mM3j7n4n9O8O0M2p1
5065CLl7J21o2j8k9rkoK4oJ2K0M5p4n0K9J1kK5n5K6J13n2K2o0l5P5k8Pn6J8Q2
5098E5k0o8j7L9P0J2q1j6MoQ0l9k9O9n8P4q1J9j6L0RPm0Rrm1P6n7k3J3M2n3J6
5131c0L4M0k3j5l6p0P3N2p2L8l9L7K3k8J6Kn4J5Q2p4k1J25k0m7J0qp0O0l8M4j0
5162dJ0L8j0k5J3ml0J2k4o2J34k3N2j10%N5j4l8JNJ4M7m8l2L3K3LJ4o0l0P0J1
$$ y = [23, 13, 21, -17, 56, 71, -3, -13, -42, -6, 33, -1, -20, -9, 32, 84, -1, -53, -56, 6, -59, 16, -9, -7, -19, 33, 29, 0, 6, -35, -18, -10, -31, -16, 19, 74, 40, -65, -37, 2, -15, 5, -33, -9, -46, 39, 41, -20, -30, 16, -4, 12, 6, -36, -38, 42, 31, -28, -19, 38, 25, 30, 2, -46, 4, 5, 3, -33, 31, -18, 39, 62, -21, -27, -67, 47, 20, 0, -6, 4, 64, 28, 5, -23, -20, 49, -16, -36, -19, -11, 15, 15, 30, -60, -41, -14, 19, -53, -23, 6, 14, 16, -33, -49, 0, 44, 16, -21, -56, 11, 77, 52, 74, 0, -4, 78, 43, -24, -53, -35, -28, 76, 23, -5, -9, 34, 17, -37, -96, -28, 32, 74, 3, 6, -31, 90, 28, 10, -19, -28, -30, -36, -12, -18, -6, 14, 59, -15, -65, -36, -25, -27, -2, -57, -31, 82, 30, 52, -8, -43, 32, 4, 11, -45, -27, 55, 35, -33, -50, -11, 59, 71, -10, -26, -22, -28, 52, 13, -16, 53, -5, 69, -12, 7, -9, 21, 30, 37, -3, 6, -3, -44, 32, -25, -48, -35, 7, -46, -30, 4, 44, 21, 6, -30, -100, -27, 25, -47, -9, -48, -11, 12, -16, 0, 2, -52, -37, 45, -29, -50, 75, 55, 8, 18, 10, -60, 0, -38, 6, -4, 6, 44, 34, 9, 22, 18, -12, 0, -24, -86, 48, 25, 77, -33, -33, 22, 8, -30, -29, -24, -10, 37, -11, -43, -10, 13, 16, 30, -30, -60, 10, 21]
5194B1m8M3p5P8j5L4o3L1k2K4l1k2jK0R9Kn7n3QK5pj9O4l2kP3n1n3oO1l1KqOQ5
5229H0rq5j3J3K5J9o4KOPL6Nm1L9kKm3l1L3k1Q1m0lL1j6Mj4k0K1nJ1l1L6J4j6
5264A1K8j1k0pL0qm0l0L1M5j1Jo0K8k1KM8l5J5k4L9L4o2Qk4N8n7J0L3m8L8kMm6
5298d3N8jn9k4N2j2L3Ln1L5jK4j1Mm9N6M6p3KJ3QJ5j2j4j7j6K4Jl2N2P5q1L6p1
5332c0lM9kl2k0M7j1K8J4l8JjM2l4l7K8k3M8k2j1M5k4m1L7l7j5J3pK9L6k6M7q
5365D2l3j8n6J6J9KMj0K5Kj0mj2K3M0n9lN2j7Nl6NM1j6J4l0oL1k7M7Jn8K7L3o4
5400c0N1q4K9Q9r5NL9l6J0J4k3K2j4kKN3n3L4j5oL1k8k0kL1j1l3N0QO5m0p7j0
5433d6K0L2k3oJ6Qk4L1l5L7l0qMN9k0J4J8o8j5L8n0J04q2j6K6J7M7l5k1j4k2p
$$ y = [21, -27, 16, -59, 19, 4, 38, -25, 6, -16, 8, -23, -45, -46, -26, 73, 75, 18, -35, -27, -2, -9, -28, 36, 4, 2, 75, 24, -29, -35, 26, -5, -3, -11, -5, 80, 71, -14, -27, -14, 11, 30, -34, -32, -26, -19, 17, 22, -19, 20, 18, 20, -23, -54, -21, -42, 39, -1, -4, 27, 11, 15, 1, -19, 2, -3, 8, -23, 13, 27, 11, 39, 28, 8, 1, 31, 23, -17, -47, -16, 29, 18, 19, -41, -13, -34, -32, 16, -19, -4, -28, 11, 45, -17, -9, -33, 25, -32, -22, 11, -37, 1, -1, 3, -43, 15, 14, -45, -69, -17, -29, 4, 7, -44, -9, -10, 14, 3, 7, -42, 14, 60, -13, -11, 2, 10, 25, 13, -1, -18, -34, -10, -9, -41, 11, 86, 5, 41, -30, -33, 16, 14, -18, -38, 9, -2, 26, 40, 2, 3, 2, 44, 10, -27, 1, -22, 26, 4, -7, 38, 14, -27, 10, -27, -42, -29, -36, -7, 29, 3, 50, 42, 9, -9, -65, -49, -30, -28, -24, -34, -9, -7, -17, -21, -33, -10, 30, -29, -32, 20, 3, 8, -28, -23, 18, 2, 16, -14, -20, 11, -16, 31, 32, -26, 1, 34, -30, 21, -63, -34, 55, -40, -35, 4, -32, -22, -8, -31, -9, -23, -25, -23, 30, -23, 11, -4, -10, 21, -7, -27, -29, 2, -9, -42, 8, 16, 81, 41, -36, -46, -26, 6, -17, -23, -7, 1, -23, 8, -27, 10, -20, -28, -24, 35, 15, 29, 47, -21, -36, 2, -48, 56, -26, -42, -16, 1, 48, 13, -8, -22, -44, -51]
5465e1N9Jm8J3K3L4j12O2k2K2K5k2rJ6K9k8M3p3M9P3r7L4j02J07l7L4l5N9j9O
5495C4M2m0j7l8M9l2M3j05P7J1j0j5n3L7Ok9J9M8o5L2K0J6k6k5K7k1l6N6j5pj2
$$ y = [-51, 8, 9, -39, -26, -3, 31, -81, -19, -41, -19, 6, -16, -25, -9, 20, -8, 35, -38, 11, 84, -13, 21, -81, 26, -11, 23, -12, 47, 28, 34, 76, 36, 19, -19, 30, -2, 41, -64, 13, 24, 14, -1, -54, -17, -11, -40, -21, 27, -38, -6, 14, 30, 4, -21, 6, -15, -51, 5, -10, -17, -29]
$$ [...]
8191A5
##END NTUPLES=NMR FID
##END=
