##TITLE=1H_Ser DHA_TFA 60 min
 
 8 sc, 
 23.12.2024
##JCAMPDX= 6.0         $$ Bruker NMR JCAMP-DX V2.0
##DATA TYPE= NMR FID
##DATA CLASS= NTUPLES
##ORIGIN= UXNMR, Bruker Analytische Messtechnik GmbH
##OWNER= root
$$ XWIN-NMR		Version 3.5
$$ Mon Dec 23 15:18:06 2024 Russian Standard Time (UT+4h)  she@DPX200
##.OBSERVE FREQUENCY= 200.1315
##.OBSERVE NUCLEUS= ^1H
##.DELAY= (6, 6)
##.ACQUISITION MODE= SIMULTANEOUS
##.ACQUISITION SCHEME= undefined
##.AVERAGES= 8
##.DIGITISER RES= 18
##SPECTROMETER/DATA SYSTEM= spect
##.PULSE SEQUENCE= zg30
##.SOLVENT NAME= Acetone
##.SHIFT REFERENCE= (INTERNAL, Acetone, 0, 15.7039)
##AUDIT TRAIL= $$ (NUMBER, WHEN, WHO, WHERE, WHAT)
$$ ##TITLE= Audit trail, XWIN-NMR		Version 3.5
$$ ##JCAMPDX= 5.01
$$ ##ORIGIN= Bruker BioSpin GmbH
$$ ##OWNER= she
$$ F:/spectra/data/she/nmr/H-F/1/audita.txt
$$ ##AUDIT TRAIL=  $$ (NUMBER, WHEN, WHO, WHERE, WHAT)
(   1,<2024-12-23 15:16:46.06 +0400>,<she>,<DPX200>,
      <created by zg, POWCHK disabled, PULCHK disabled
       configuration hash MD5:
       00 E9 B6 7A A2 85 ED C7 34 08 36 98 17 FE 4E 26
       data hash MD5: 16K
       46 D0 AD D1 E3 B8 0F A6 81 35 DE 80 66 03 15 B0>)
$$ ##END=
$$ 
$$ hash MD5
$$ 92 B4 0F 16 9A 13 74 16 DE 9A 7B A1 ED A9 99 A5
##$RELAX= 
##$RELAX= 
##$RELAX= 
##$RELAX= 
##$RELAX= 
##$RELAX= 
$$ Bruker specific parameters
$$ --------------------------
##$DU= <F:/spectra>
##$EXPNO= 1
##$NAME= <H-F>
##$PROCNO= 1
##$TYPE= <nmr>
##$USER= <she>
##$AMP= (0..31)
100 100 100 100 100 100 100 100 100 100 100 100 100 100 100 100 100 100 
100 100 100 100 100 100 100 100 100 100 100 100 100 100 
##$AQSEQ= 0
##$AQ_mod= 1
##$AUNM= <au_zg>
##$AUTOPOS= <>
##$BF1= 200.13
##$BF2= 200.13
##$BF3= 200.13
##$BF4= 200.13
##$BF5= 200.13
##$BF6= 200.13
##$BF7= 200.13
##$BF8= 200.13
##$BYTORDA= 1
##$CFDGTYP= 0
##$CFRGTYP= 5
##$CHEMSTR= <none>
##$CNST= (0..31)
1 1 145 1 1 1 1 1 1 1 1 1 1 1 1 1 1 1 1 1 1 1 1 1 1 1 1 1 1 1 1 1 
##$CPDPRG= <>
##$CPDPRG1= <>
##$CPDPRG2= <>
##$CPDPRG3= <>
##$CPDPRG4= <mlev>
##$CPDPRG5= <mlev>
##$CPDPRG6= <mlev>
##$CPDPRG7= <mlev>
##$CPDPRG8= <mlev>
##$CPDPRGB= <>
##$CPDPRGT= <>
##$D= (0..31)
0 1.2 0 0 0 0 0 0 0 0.06 0 0.03 0 0 0 0 0.0002 0 0 0 0 0 0 0 0 0 0 0 0 
0 0 0 
##$DATE= 1734952605
##$DBL= (0..7)
120 120 120 120 120 120 120 120 
##$DBP= (0..7)
150 150 150 150 150 150 150 150 
##$DBP07= 0
##$DBPNAM0= <>
##$DBPNAM1= <>
##$DBPNAM2= <>
##$DBPNAM3= <>
##$DBPNAM4= <>
##$DBPNAM5= <>
##$DBPNAM6= <>
##$DBPNAM7= <>
##$DBPOAL= (0..7)
0.5 0.5 0.5 0.5 0.5 0.5 0.5 0.5 
##$DBPOFFS= (0..7)
0 0 0 0 0 0 0 0 
##$DE= 6
##$DECBNUC= <off>
##$DECIM= 24
##$DECNUC= <off>
##$DECSTAT= 4
##$DIGMOD= 1
##$DIGTYP= 9
##$DL= (0..7)
0 120 120 120 120 120 120 120 
##$DP= (0..7)
150 150 150 150 150 150 150 150 
##$DP07= 0
##$DPNAME0= <>
##$DPNAME1= <>
##$DPNAME2= <>
##$DPNAME3= <>
##$DPNAME4= <>
##$DPNAME5= <>
##$DPNAME6= <>
##$DPNAME7= <>
##$DPOAL= (0..7)
0.5 0.5 0.5 0.5 0.5 0.5 0.5 0.5 
##$DPOFFS= (0..7)
0 0 0 0 0 0 0 0 
##$DQDMODE= 0
##$DR= 18
##$DS= 0
##$DSLIST= <SSSSSSSSSSSSSSS>
$$ [...]
##$SUBNAM2= <"">
##$SUBNAM3= <"">
##$SUBNAM4= <"">
##$SUBNAM5= <"">
##$SUBNAM6= <"">
##$SUBNAM7= <"">
##$SUBNAM8= <"">
##$SUBNAM9= <"">
##$SW= 24.0689530833862
##$SWIBOX= (0..15)
0 0 2 0 0 0 0 0 0 0 0 0 0 0 0 0 
##$SW_h= 4816.95568400771
##$TD= 16384
##$TD0= 1
##$TE= 0
##$TE2= 300
##$TE3= 300
##$TEG= 300
##$TL= (0..7)
0 120 120 120 120 120 120 120 
##$TP= (0..7)
150 150 150 150 150 150 150 150 
##$TP07= 0
##$TPNAME0= <>
##$TPNAME1= <>
##$TPNAME2= <>
##$TPNAME3= <>
##$TPNAME4= <>
##$TPNAME5= <>
##$TPNAME6= <>
##$TPNAME7= <>
##$TPOAL= (0..7)
0.5 0.5 0.5 0.5 0.5 0.5 0.5 0.5 
##$TPOFFS= (0..7)
0 0 0 0 0 0 0 0 
##$TUNHIN= 0
##$TUNHOUT= 0
##$TUNXOUT= 0
##$USERA1= <user>
##$USERA2= <user>
##$USERA3= <user>
##$USERA4= <user>
##$USERA5= <user>
##$V9= 5
##$VALIST= <valist>
##$VCLIST= <CCCCCCCCCCCCCCC>
##$VD= 0
##$VDLIST= <DDDDDDDDDDDDDDD>
##$VPLIST= <PPPPPPPPPPPPPPP>
##$VTLIST= <TTTTTTTTTTTTTTT>
##$WBST= 1024
##$WBSW= 4
##$XGAIN= (0..3)
0 0 0 0 
##$XL= 0
##$YL= 0
##$YMAX_a= 605790
##$YMIN_a= -468192
##$ZGOPTNS= <>
##$ZL1= 120
##$ZL2= 120
##$ZL3= 120
##$ZL4= 120
##$ABSF1= 10
##$ABSF2= 0
##$ABSG= 5
##$ABSL= 3
##$ALPHA= 0
##$AQORDER= 0
##$ASSFAC= 0
##$ASSFACI= 0
##$ASSFACX= 0
##$ASSWID= 0
##$AUNMP= <proc_1d>
##$AZFE= 0.1
##$AZFW= 0.1
##$BCFW= 1
##$BC_mod= 2
##$BYTORDP= 1
##$COROFFS= 0
##$CY= 11.3945322036743
##$DATMOD= 1
##$DC= 2
##$DFILT= <>
##$DTYPP= 0
##$F1P= 15.6554695791079
##$F2P= 12.8336369535428
##$FCOR= 0.5
##$FTSIZE= 0
##$FT_mod= 4
##$GAMMA= 1
##$GB= 0.15
##$INTBC= 1
##$INTSCL= 1
##$ISEN= 128
##$LB= 0.24
##$LEV0= 0
##$LPBIN= 0
##$MAXI= 10000
##$MC2= 0
##$MEAN= 0
##$ME_mod= 0
##$MI= 1.114404
##$NCOEF= 0
##$NC_proc= 0
##$NLEV= 6
##$NOISF1= 3.799351
##$NOISF2= 2.8
##$NSP= 1
##$NTH_PI= 0
##$NZP= 0
##$OFFSET= 15.70392
##$PC= 1
##$PHC0= -26735.63
##$PHC1= 20.18744
##$PH_mod= 1
##$PKNL= yes
##$PPARMOD= 0
##$PSCAL= 0
##$PSIGN= 0
##$REVERSE= no
##$SF= 200.130013532006
##$SI= 16384
##$SIGF1= 3
##$SIGF2= 2
##$SINO= 400
##$SIOLD= 16384
##$SREGLST= <1H.CDCl3>
##$SSB= 0
##$STSI= 0
##$STSR= 0
##$SW_p= 3612.71676300578
##$SYMM= 0
##$S_DEV= 0
##$TDeff= 0
##$TDoff= 0
##$TI= <>
##$TILT= no
##$TM1= 0
##$TM2= 0
##$TOPLEV= 0
##$USERP1= <user>
##$USERP2= <user>
##$USERP3= <user>
##$USERP4= <user>
##$USERP5= <user>
##$WDW= 1
##$XDIM= 8192
##$YMAX_p= 0
##$YMIN_p= 0
$$ End of Bruker specific parameters
$$ ---------------------------------
##NTUPLES= NMR FID
##VAR_NAME=  TIME,          FID/REAL,        FID/IMAG
##SYMBOL=    X,             R,               I
##VAR_TYPE=  INDEPENDENT,   DEPENDENT,       DEPENDENT
##VAR_FORM=  AFFN,          ASDF,            ASDF
##VAR_DIM=   8192,          8192,            8192
##UNITS=     SECONDS,       ARBITRARY UNITS, ARBITRARY UNITS
##FACTOR=    0.0002076,     1,               1
##FIRST=     0,             0,               0
##LAST=      1.7004516,     0,               0
##MIN=       0,             -468192,         0
##MAX=       1.7004516,     605790,          0
$$ Real data points
##PAGE= N=1
##DATA TABLE= (X++(R..R)), XYDATA
0@%%%%%%%%%LlQj2J2j6J8j9K5l2L6m4N1o0O9q0Q9j02J18j34J53j73J96k20K49
34A32k77L10l45L83m26M72n23N81o42P09p88Q72r68J076j197J334j494J684j912
53a019K189k533K979l581M444n784Q163j7189J38856J02169L823J09018J31058
66D72593L1838n8331j0065J4661o1840j47672j38665j01397r0037j09350j09413
77c07678q0862k8465k574j5029n78P7294J16013P8675O4159J24227J53078Q2383
89B60643J6737N3553Q5001J1804o5402m4651j3584o8258j39446j22143o0894n5125
101a41765r5050r3094k8842K0163M760j2904L0189R7605J09474O3174N1659J03047
113A08416J15784M6554n231K5283N5193Q58p2131p0814l5858n4495j08073j06695
$$ plain form
0 0 0 0 0 0 0 0 0 0 0 3 0 8 -4 8 -8 10 -9 16 -16 20 -24 27 -33 36 -44 45 -57 61 -73 80 -93 103 -117 132
34 132 -145 165 -180 203 -223 249 -274 307 -335 374 -414 458 -510 566 -631 703 -791 893 -1019
53 -1019 1170 -1363 1616 -1965 2479 -3305 4858 -12331 126525 228694 232517 341535 472593
66 472593 504431 446100 436035 450696 388856 241184 102519 1122 -88915 -198265 -307678
77 -307678 -388540 -417005 -419579 -434608 -435186 -357892 -241879 -163204 -99045 25182 178260 260643
89 260643 277380 330933 415934 427738 362336 317685 304101 235843 96397 -25746 -86640 -141765
101 -141765 -236815 -329909 -358751 -338588 -333828 -346732 -316543 -218938 -109464 -46290 5369 108416
113 108416 224200 270754 265523 290806 345999 346857 274726 203912 168054 113559 5486 -101209
125a01209m8848k6317n7880o5574j4876L5651K9158M516L6257R7099R9164N0913
137C8054L9494P5660P6261J8217j4810J7371L5607k0219q4211p6452l8375m8861
149A7736q3030p1419k5119j1664m4120n4608j432N6031N2696K2333L4494P7743
161c0359P9492L3807J8427N5919O8530J4507l2692j4106Q754k8438p6375o6337
173C1129k8118l2149o6322o0812j6950p40k2695k3563J9833N6878M5799K1395
185g6315L4982O7399O0656K0667J1476M1197M4597l434m1304k2800K65l1637p4746
198C1003n7926j2263j4950n4733n4886o871J8548l637j3081K6149O2272M5684
210c4691J2779K1655N4194N2716J6666O98K0431K5526j1555m2480l0470j1457
$$ plain form
125 -101209 -150057 -176374 -234254 -299828 -314704 -279053 -249895 -245379 -209122 -112023 -12859 38054
137 38054 77548 153208 229469 247686 232876 250247 285854 265635 181424 104972 66597 17736
149 17736 -65294 -136713 -161832 -173496 -217616 -272224 -273656 -217625 -164929 -142596 -108102 -30359
161 -30359 49133 82940 101367 157286 225816 240323 207631 193525 202279 173841 97466 31129
173 31129 3011 -29138 -95460 -156272 -173222 -173962 -196657 -220220 -200387 -143509 -97710 -76315
185 -76315 -41333 26066 86722 107389 118865 160062 204659 201225 159921 137121 137386 105749 31003
198 31003 -26923 -39186 -54136 -108869 -163755 -170626 -152078 -155715 -168796 -142647 -80375 -34691
210 -34691 -21912 -257 53937 106653 123319 124017 144448 169974 158419 115939 85469 74012
222G4012k7770n5045m3972j0836j1048l9568l8616O48K4507J0797M121L1565N2375
235b8830L1163L012J7012N1532M6663O473j0624O547Q899k3956m5568k2687J034
248D0670k0438n3624m4035p588j252k4004k2265J3298L2794J3989O2K2637M6486
261c270L2582P286J2821L5798L0661l235j9180k591L628k1834l9898k2311k935
274G522j8798m3505l1930L51M433j5324j0903K1603L3673J1738j2K1220M0936
287B1004K7087L414Q976K8037J7689j4712k5713o336M112j7006l6859k3538l076
300a6921j3274l5360k5168P667J5068m735p432J8510L2631J3596o15J7295L6126
313C7388K3270J042K733J4996N312j9700k3623l268L518j7148l2738k1160n924
$$ plain form
222 74012 46242 -8803 -52775 -63611 -74659 -114227 -152843 -152195 -127688 -116891 -112770 -81205 -28830
235 -28830 2333 5345 22357 73889 120552 127025 116401 122948 131847 107891 62323 39636 40670
248 40670 20232 -33392 -77427 -85015 -86267 -110271 -132536 -119238 -86444 -72455 -72393 -49756 -3270
261 -3270 29312 36598 49419 85217 115878 112643 93463 90872 94500 72666 32768 10457 7522
274 7522 -11276 -54781 -86711 -86360 -81927 -97251 -108154 -86551 -52878 -41140 -41152 -19932 21004
287 21004 48091 51505 60481 88518 106207 91495 65782 59446 63558 46552 9693 -13845 -16921
300 -16921 -30195 -65555 -90723 -83056 -67988 -72723 -80155 -61645 -29014 -15418 -16033 1262 37388
313 37388 60658 61700 64433 79429 84741 65041 41418 38150 41668 24520 -8218 -29378 -35302
326c5302j2878k3751q884J7671J6917o585q595J8141L1527J4673K289J7308L1056
339E3587J3423j1758p046J2936P962j7906k4922o853J053j6953l1102j7427K256
352d2750k144j5586o834J4826J6507m47l187J6636K7931J4120J892J1719K1199
365E3882O736j2675q100P755L179j7443k1635n654j197j8830k7243q404R555J914
379c8160j2386l917J6126J5366j728j109K0323K8159J0010n049M334J6040M868
392E2877j3631j0335N998L066j7222k3011p996l31j2373j9900m278J2517N002
405b9617r838l475J3716J4505K711M326J9636K1266K155r705J456J2740L389j0725
419C2540q062J929l603k0176k1023k466O224p091j6278l506J1245N133q002q81
$$ plain form
326 -35302 -48180 -71931 -80815 -63144 -46227 -52812 -61407 -43266 -11739 2934 5223 22531 53587
339 53587 67010 55252 48206 61142 69104 51198 26276 19423 20476 3523 -27579 -45006 -42750
352 -42750 -44894 -60480 -67314 -52488 -35981 -36428 -39615 -22979 4952 19072 20964 32683 53882
365 53882 60618 47943 39843 47598 50777 33334 11699 6045 4848 -13982 -41225 -49629 -40074 -38160
379 -38160 -50546 -54463 -38337 -22971 -24699 -25808 -5485 22674 32684 27635 31969 48009 52877
392 52877 39246 28911 34909 37975 20753 -2258 -10254 -10585 -22958 -42858 -47136 -34619 -29617
405 -29617 -39455 -42930 -29214 -14709 -11998 -7672 11964 33230 35385 25680 27136 39876 43265 32540
419 32540 24478 26407 22804 2628 -18395 -20861 -14637 -21728 -38006 -41512 -30267 -25134 -33136 -34017
433c4017J8207J8139J209j554J3709J7761Q02j0288q0J1256K098j3576j1329K17
447A2554l154j6436j6047q94O422l903j2005j612J0331M881m564K877J7705J5517
461A1672K01l011R360J2719j716r782K166J0659k276j7371j2563J153m60j3580
475a2829j2702L252Q070n340j2523J82J3300Q358k731J805J5434J3793k023o315
489I731O007J1542N54q533j732N756l458j6867j2420K202K952p990r441J406M663
504a5628n206q514M802J6293Q307l991P49J1854Q571l667l567Q759J0459m485
518B4736j3008k922N636l645j4799q677M661L470r077j0384K537Q200j614o593
532b1479M815J4855P904m090j959R080R028k620m484N804P636m822j2734m916
$$ plain form
433 -34017 -15810 2329 3538 1984 15693 33454 34256 23968 23888 35144 37242 23666 12337 12554
447 12554 9400 -7036 -23083 -23977 -17555 -21458 -33463 -35075 -24744 -19863 -24427 -21550 -3845 11672
461 11672 11873 8862 18222 30941 29225 19443 21609 32268 29992 12621 58 1211 751 -12829
475 -12829 -25531 -22279 -14209 -19549 -32072 -31890 -18590 -10232 -12963 -11158 4276 18069 16046 9731
489 9731 15738 27280 27834 19301 17569 23325 19867 3000 -9420 -7218 -4266 -12256 -21697 -20291 -15628
504 -15628 -20834 -29348 -24546 -8253 54 -3937 -3188 8666 17237 13570 10003 18762 29221 24736
518 24736 11728 8806 14442 10797 -4002 -12679 -8018 -4548 -13625 -24009 -21472 -13272 -14886 -21479
532 -21479 -16664 -1809 6095 2005 46 9126 18154 15534 11050 16854 24490 19668 6934 2018
546B018L828j740j1124o103N086K304r522q731M483R334O12l962N371J2620L857
561H331o755q39J0846Q483l652o027L187N539o206j3145l403O388Q9j0479o922
576a4565M073L364p339p686N716J2109K410m899K375R460L256m928n4J0387P614
591B1293n597q438N29L337m908q602o25N352k103j1210o199N298M822m720m270
606a6041O654R746l06o073K701J0988M100n956j426Q970N673p382r594R54N556
621H564l477r484j704N531r65j0148n801N630O961j929l922M594Q156r1n489K163
637a411R795M708m433k676M904K746p249p515K780N537l606r240k135M513j251
652d533q360k434Q442O628m098n008M821Q240k92n156K685J0229L530p171m992
$$ plain form
546 2018 5846 4106 -7018 -13121 -8035 -5731 -15253 -23984 -19501 -10167 -9555 -13517 -8146 4474 8331
561 8331 1576 737 11583 20066 16414 10387 13574 19113 12907 -238 -3641 2747 2836 -7643 -14565
576 -14565 -10492 -7128 -14467 -22153 -16437 -4328 -1918 -6817 -4442 5018 8274 3346 3292 13679 21293
591 21293 15696 7258 7787 11124 6216 -2386 -3011 2341 238 -10972 -17171 -11873 -7051 -11771 -16041
606 -16041 -9387 359 53 -6020 -3319 7669 11769 5813 4387 13357 19030 11648 2054 3008 8564
621 8564 5087 -4397 -6101 -570 -1535 -11683 -17484 -11854 -4893 -6822 -10744 -6150 2006 1915 -3574 -1411
637 -1411 8384 13092 8659 5983 10887 13633 6384 -1131 1649 7186 3580 -5660 -7795 -3282 -4533
652 -4533 -12893 -15327 -6885 -257 -4355 -9363 -4542 3698 3406 -1750 935 11164 14694 7523 2531
667B531M219L490n672o797K358N721l408j0302l487N021K060m688j618O544M920
682H92m124n207M532Q844J460l975J378O435O66o819l607N103L824n653o977J657
698a571M329l900q632j063O713K480n311k447O370N224m092m782M830R209J420
713H777n530o77N636J085o742l662N030M299m863p492k77L895k301o371K96O692
729b205K293n188k939M775M794j973k614M883P159r85o351o88N324J359n481k957
745g94M476K824o221p541J268N358j214n683J83O469J948o018l425N825O669j166
761B958l518K915N544j127o573j176O145L021m978m483J853J931m414n237J815
776e324N484m98n506q70M895J786l827j178N660M973k215m000K489M908j497n518
$$ plain form
667 2531 6750 10240 4568 -2229 129 5850 2442 -7860 -11347 -6326 -4266 -8954 -10572 -4028 892
682 892 -3232 -8439 -3907 4937 6397 2422 3800 10235 10901 4082 475 5578 9402 3749 -3228 -1571
698 -1571 2758 -1142 -9774 -10837 -4124 -1644 -6955 -9402 -3032 2192 -1900 -6682 -1852 7357 8777
713 8777 3247 2570 8206 9291 2549 -1113 3917 8216 3353 -4139 -4416 -521 -2822 -9193 -8897 -2205
729 -2205 88 -5100 -8039 -3264 1530 -443 -3057 1826 8985 8000 1649 961 6285 7644 2163 -794
745 -794 3682 6506 285 -7256 -5988 -630 -1844 -7527 -7344 -875 1073 -4945 -8370 -2545 4124 2958
761 2958 -560 2355 7899 6772 199 -977 5168 8189 3211 -1272 581 2512 -1902 -7139 -5324
776 -5324 160 -338 -5844 -6714 -1819 -33 -3860 -5038 622 5595 3380 -620 1869 6777 5280 -238
792b38J20N737J383n933m730K622K720m042m838K759N861r56o186j495N340L287
808A411k964j591M994M607k648m966J156M970N38m220r47L866M86n612m058K608
824b370L400k137l799J318L944j239m972M4N842L095l058j770L878L296l073m325
840a926K337N513j82n065j634L304M91n144l307L683M460k435n078K91L944J29
856f19l616L46N569K903l507l248K650L734j330k997J453L764q29m901j783L150
872G39J157l657k260K789K792k664m074J027M201K67l115O17M855J628m158k852
888b708L349M080j412l471J150L533j446n416j431M090K226l205l100J867K739
903H45k238l756J440M808J137l013r91L042J731k724j942L092L496j516l610J2
$$ plain form
792 -238 -118 5619 7002 1069 -3661 -1039 1681 -2361 -7199 -4440 1421 465 -5721 -7216 -1876 1411
808 1411 -1553 -3144 1850 6457 3809 -1157 -1 4969 5507 1287 340 4206 4692 -920 -4978 -2370
824 -2370 1030 -1107 -4906 -3588 356 -883 -5855 -5811 31 3126 68 -1702 2176 5472 2399 -1926
840 -1926 411 5924 5742 677 -957 2347 2838 -2306 -5613 -1930 2530 95 -4983 -4692 -748 -619
856 -619 -4235 -3889 1680 4583 1076 -2172 478 4212 2882 -115 1338 5102 4273 -628 -2411 739
872 739 1896 -1761 -4021 -1232 1560 -1104 -5178 -4151 50 317 -2798 -2181 2674 4302 144 -2708
888 -2708 641 4721 3309 -162 988 4521 3075 -2341 -3772 318 2544 -661 -3761 -1894 845
903 845 -1393 -5149 -3709 1099 2236 -777 -1768 1274 3005 281 -1661 1431 4927 3411 -199 -187
919a87K362q17l536m37L590J287l678k665J948K372j765k323K139M374p9m031
935a446r37L479J985k398j403K855K798k416m533P5L549L93l212r88K563J006
951A370l222k760K177L472o58k603R27K984K5k940n70L255J972j979j814J897
967A533J759k369l112P05L151K03l071j090K299N78l110j678K959L431j089l058
983a959L20K998J86k786o6L639J883k660k802J137K230j221k681P85K941j59l449
1000a664j530K040J416j398j257K007K320j380k704N00K829N11j746n1K372Q37
1016C102k848k150J696K273j153k211P31K048q75l309p41K979J904j875j562J751
1032b40J815j541k412J108L467P76k569j187J960R33k109j611J546K323q98k742
$$ plain form
919 -187 2175 1358 -2178 -2615 975 2262 -1416 -4081 -2133 239 -1526 -3849 -1710 2664 2585 -1446
935 -1446 -2383 1096 3081 683 -720 2135 4933 2517 -2016 -1941 1608 2001 -1211 -2199 364 1370
951 1370 -1852 -4612 -2435 1037 379 -2224 -1297 1687 1712 -1228 -1798 1457 3429 1450 -364 1533
967 1533 3292 923 -2189 -1484 1667 1870 -1201 -2291 8 586 -2524 -4202 -1243 2188 1099 -1959
983 -1959 -1639 1359 1545 -1241 -1307 2332 4215 1555 -1247 -110 2120 899 -1782 -997 1944 1785 -1664
1000 -1664 -3194 -1154 262 -1136 -2393 -386 1934 554 -2150 -1650 1179 1690 -56 -107 2265 3102
1016 3102 254 -1896 -200 2073 920 -1291 -560 1488 613 -2696 -3437 -458 1446 -429 -1991 -240
1032 -240 1575 34 -2378 -1270 2197 2973 404 -783 1177 2110 1 -1610 -64 2259 1361 -1381
1048a381k23J892r5k166l26K382J379j614j623J100J630q89j431J357K587k35
1064B344k490r03J705Q92j706r94J882J626j880k844K77K303L62j907k92K264
1080F39R24k282j792J650K419l63j664L83K064j81k528p67K080J405j338j434
1096g85P67J127j280k099N59K314L40j763m77J473N14j686q80J936K113q29j895
1113e51L08J523l96j849K3K310Q77j953j909Q36J441r89j439P70K175k8k304q83
1131b038J808J238j166q43J356J596q90j918J35J657K25j459k04J579M87j827
1147b64j554R22J451m81j151N79J511n85k034j54J975J146j073q71J115J069j393
1164B08j667Q30K191J36j837o82J296M72j756j142J495J787p27j736P3J363K0
$$ plain form
1048 -1381 -1604 288 193 -1973 -2299 83 1462 -152 -1775 -675 955 66 -1365 -8 2579 2344
1064 2344 -146 -1049 656 1548 -158 -1152 730 2356 476 -2368 -2091 212 574 -1333 -1625 639
1080 639 1563 -719 -2511 -861 1558 1195 -469 -86 1978 1797 -731 -1498 582 1987 649 -785
1096 -785 -18 1109 -171 -2270 -1711 603 943 -820 -1297 176 690 -996 -1876 60 2173 1344 -551
1113 -551 -243 1280 884 -965 -942 1368 2245 292 -1617 -781 660 -329 -1768 -998 1177 1149 -1155 -2038
1131 -2038 -230 1008 -158 -1001 355 1951 1061 -857 -722 935 1160 -299 -503 1076 1563 -264
1147 -264 -1818 -896 555 74 -1077 -498 1013 428 -1606 -1760 215 1361 288 -583 532 1601 208
1164 208 -1459 -629 1562 1698 -139 -821 475 947 -809 -1951 -456 1331 604 -1132 -1059 304 324
1181C24j480j09J962J067j344j286P61R76n46j050O18J582p5j835p36J123M60
1198D12r98n41J294J105j137j684L45J560J25j173L01J471L42j653j194J216J586
1215A377n87j292N18J209m43j833m11J565R69j102j051R49J027r63j519N14J730
1232F57L67j109m44J093L14j261p70J282J316n58j289O9R10m11j295J56J684N33
1250A244j401j098Q46Q49o85r98R10J645k30j694m26J261O56r79o32J184J148
1267A600r95j626J17J332J53j144p0J160M49j369j131Q61J324l88q20M66J025
1284I44l09j430k49J371P96q89n79P86N11j016j157N30J527mj287k49J001J56
1302D53j257n42J215J319n97j332K64J190j63j332L5J438P28j127j012N18Q50
$$ plain form
1181 324 -1156 -1265 697 1764 420 -866 -105 871 325 -725 -107 1475 1400 -435 -1171 -48 412
1198 412 -586 -1127 167 1272 135 -1549 -1204 356 481 -692 -391 1080 1422 -231 -1425 -209 1377
1215 1377 790 -502 16 1225 782 -1051 -1462 103 1072 -30 -1081 -132 895 -68 -1587 -1073 657
1232 657 1024 -85 -529 564 878 -383 -1153 129 1445 887 -402 -333 577 166 -1129 -973 711 1244
1250 1244 -157 -1255 -409 440 -245 -1243 -333 1312 1082 -612 -1038 223 879 -100 -732 452 1600
1267 1600 605 -1021 -904 428 581 -563 -633 527 976 -393 -1524 -663 661 273 -547 -81 944
1284 944 635 -795 -1044 327 1123 234 -345 441 952 -64 -1221 -691 836 832 -455 -704 297 453
1302 453 -804 -1346 -131 1188 591 -741 -477 713 550 -782 -747 691 1419 292 -720 -202 648
1319F48n99j080O43J362q2j337n50Q36N64q25m23J084R40p85j308K16J072J53
1337E29q26J00J092J30j335p58Q28R92m85q70M30R65l72j476j65J405O31q82n90
1356f57Q00O76p75j140M61J391K43j130l13Q81K72j070o89R82J083m36j117O0
1374d78Q04j93r78N3J164O36r05r29O22P20n27p25O81J130k21j233m12R84M03
1393E96q69l82R22P52p31j266K02J131Q4r63p2J122L92j136p99O32R82j36q41
1412c80K87R35k26j247k52R56P03n93n19M02O09p96q85M21J108J13q35k78P33
1431B56K19r27m74R27J014m99r48J76P40j41r71k3J123N78r46q49N24O72m99p92
1451h40M23J123O8j173m27Q37M69n89n31P96P79m80j100P0Q58J06o63KP44K20
$$ plain form
1319 648 49 -1031 -388 974 892 -445 -995 -159 405 -420 -843 241 1181 396 -912 -696 376 529
1337 529 -297 -197 895 1025 -310 -1068 -240 752 267 -603 -173 792 420 -1056 -1221 184 815 -67 -657
1356 -657 143 819 44 -1096 -635 756 999 -131 -444 437 709 -361 -1050 -68 1015 579 -538 -478
1374 -478 326 133 -845 -792 372 1008 103 -826 -204 516 -11 -736 -55 1075 854 -379 -791 193 596
1393 596 -273 -655 267 1019 288 -978 -776 355 439 -524 -596 526 918 -218 -1017 -385 597 461 -380
1412 -380 -93 842 616 -631 -883 73 776 183 -336 66 675 -121 -1006 -585 523 636 -199 -477 256
1431 256 475 -452 -926 1 1015 516 -432 -256 484 343 -628 -651 472 1050 104 -745 -221 451 -48 -840
1451 -840 -417 706 774 -399 -826 11 480 -109 -640 156 935 455 -645 -575 283 389 -274 -272 472 692
1471F92q54p47N49Q43k54o77L23P18k42r34k35R37N76o02n02N95N35o15q84K88
1491d90J082L3p85k75P37K20q43o24Q03Q48j86q53q8O90qp86j21J018M98o50p11
1512d91K99N18k65n93L37Q71k4r59k89N91L36n00l44O15O42n29r10J74P70N2n46
1533b45j01P73K86p97p08N32Q24k51o61K17O68q3r63k32P09O31l84o21M26M53
1553D73m42o73J19Q09L13o05l05M86K65o58m02N86P32k93p20M5N50q1o77m4Q47
1574C25K95n82o04L62N61l39n82K97Q49L1p80l65N39L63m49l71N76O00l97q24
1594d95j5O87J61n33n1N04L64o75o27L50O49n6n00J23N22l6p42k16O21M48m13
1615G0k72K66L78m39n86J37Q06P2n31k11M66J84o01l49M92O66j76o18j0N35q9
$$ plain form
1471 692 -162 -909 -360 483 229 -448 -125 593 351 -583 -818 119 695 93 -409 186 721 106 -778 -490
1491 -490 592 625 -160 -435 302 522 -321 -945 -142 706 520 -333 -421 269 261 -525 -646 372 870 220 -491
1512 -491 -192 326 61 -532 -195 676 652 -307 -596 -5 331 -169 -513 102 744 215 -695 -521 249 301 -245
1533 -245 -346 427 713 -84 -792 -260 564 313 -348 -131 537 454 -509 -741 -32 599 215 -406 20 473
1553 473 31 -642 -523 286 599 -6 -311 175 440 -218 -620 -34 698 405 -315 -270 280 199 -478 -522 325
1574 325 620 38 -566 -204 357 18 -564 -267 582 613 -167 -532 7 370 -79 -450 126 726 329 -495
1594 -495 -510 177 338 -195 -246 258 622 -53 -680 -330 319 263 -237 -114 408 372 -370 -586 35 483 70
1615 70 -202 64 442 3 -583 -446 360 432 -99 -310 156 340 -261 -610 -118 548 372 -246 -256 279 190
1636A90n11j41P00M36m70n93J87M83k52m24J90N93J42o60l45M23L44l33k60L71
1656G0M48k59o33J9N08J23l91o8M79J51m95m62L12N01j46m38J75M56n7o73k00
1677e80N30M19k48l55K06L83k46n81J12O05K27m00k42K48J73l79l84L51O04j66
1697B77m61n6L94q9l48r5N59L14m21l72K33K90k20l12J82N58k6n61j75L26K51
1718B48l55j87L53M20k45o25MM81J22l24r6M02K21m77m02J79N26m6l76J12L66
1739C01o7m60j88L89L28j59l22J66K69k53m13J47M39J09k37j96K48Q5l45k28L48
1760c9L59l1m03m6L17J5m42o7N62K25l26l88J32K50p0l44J49M96j1m40k21K76
1782d7J89j43k19K48L46j94m82L3L23O4j62o1K85J09k96l78K42K83l2k16P3K67
$$ plain form
1636 190 -321 -462 238 674 204 -389 -202 281 29 -395 -205 388 530 -130 -475 -52 292 -41 -301 70
1656 70 518 259 -374 -355 153 276 -115 -183 296 447 -48 -510 -198 303 157 -281 -106 350 293 -380 -580
1677 -580 -50 369 121 -234 -28 355 109 -472 -360 245 472 72 -170 78 251 -128 -512 -161 443 277
1697 277 -184 -240 154 65 -283 -378 181 495 74 -298 -65 225 5 -307 -125 433 407 -154 -329 -3 248
1718 248 -107 -294 59 479 234 -391 -387 94 216 -108 -204 198 419 -58 -460 -281 245 199 -177 -65 301
1739 301 234 -226 -414 -25 303 144 -178 -12 257 4 -409 -262 177 286 49 -147 101 186 -159 -387 -39
1760 -39 320 289 -114 -160 157 172 -270 -337 225 450 124 -264 -132 118 48 -296 -147 349 338 -102 -323 -47
1782 -47 142 -1 -220 28 374 180 -302 -269 54 118 -44 -105 180 289 -7 -385 -143 140 108 -108 -35 232
1804B32n5m46j8K79K67j73k30J96K09k51k94P7L51J60l15j35K55M4l28j58K31
1825a02M02l7l69l7K54n8k47k2L41K48k56l33Q8K35o2k80J61L40K1l17k41K33
1847c8J33j89q1K55K66k71l08j4L03O5k37L6K39J79l56l27J58L34m3j88O4K52
1869B32o1l90j19L06K60j50j89J27J57q2l62P3L61R3k66r6K30Mk04k04K57K87
1891B64p1k65J8J95o7k72J2K97J78k19k72J65J91j64k04J72K92J2l04j61K05R9
1913A01k10o1K44K34j97k34j49L23Q0j78l4K10J59k38k96Q2L07o5j81R0J66J9
1935A72l62m2K60R8o9r6Q9J29j51k76J13K50J09k36m2J38L2j81k24K61K43r8j97
1958h0k7J79Qk49JK70J57j92j77QJ68n2j90M9K57Q3k88p4J45R0j82r2K92J66k22
$$ plain form
1804 232 177 -269 -287 -8 259 86 -144 52 261 10 -284 -207 144 304 -11 -146 109 153 -175 -333 -102
1825 -102 300 263 -106 -143 111 53 -194 -216 125 373 117 -216 -128 107 45 -235 -74 266 287 -30 -271 -38
1847 -38 95 -94 -175 80 346 75 -233 -247 56 121 -116 -80 159 338 -18 -345 -187 147 104 -84 -20 232
1869 232 171 -219 -338 -32 228 78 -111 16 173 91 -271 -198 163 256 -10 -106 124 128 -76 -280 -23 264
1891 264 193 -72 -54 141 74 -198 -186 111 289 70 -202 -37 154 -10 -214 -42 250 262 -42 -203 2 101
1913 101 -109 -170 74 308 111 -123 -272 51 131 -47 -81 129 288 50 -246 -164 143 78 -103 -13 153 172
1935 172 -190 -232 28 126 57 -39 50 179 28 -248 -135 115 224 -12 -54 84 116 -65 -289 -28 215 117 -80
1958 -80 -107 72 80 -169 -168 102 259 67 -110 -102 66 14 -176 -127 130 213 -75 -149 -4 86 -96 -188 104 270 48
1983D8j81l4K05P4j69K1J83N2k85j28O7L05j12j58O4K21ql12j17K68J54j26j75
2006a43J83J13j02k05M5K11Q0j65r2J30N3j65j43J70J52J9k29K5J58k1k02k8K16
2029F0J47j65j53J27J5q1j38J41K60p0k08r3J52R3j42p5J91J61j10k86P8Q2R9
2052H5j01o9K14Q7k54j37J20J70r0q7P5J31n4k14m1J55M8k3q1Q1J36j56k00Q5
2076a20J96N1j10m2R6nj88r4K19J57nj93mJ43p5j54n3K41J45j45j84M1J90l2j92
2101a17P9K21ok28j47K06P9n8j17J25J58p8j90j6J18j2p5L1J26K1j38j29R2J47
2125I2k5p9j1J36m7k01k1J68P5j8j38O1J23j21j48N8J90L8j81k6J39Nj20j35K04
2150A8Q7K7j98JK06q5j25l5J95J07j75j23K8J75j34n5N4J74j2j60p0P3N0p8o7
$$ plain form
1983 48 -133 -167 38 112 -57 -36 147 199 -86 -214 -147 158 46 -112 -48 173 165 -147 -264 4 158 32 -143
2006 -143 40 153 51 -154 -109 102 182 17 -75 55 108 -57 -200 -30 122 141 -88 -63 95 74 -128 -156 60
2029 60 207 42 -111 16 31 -50 -188 -47 213 143 -65 -158 -6 87 -55 -130 61 222 112 -174 -96 -14 85
2052 85 -16 -85 129 216 -38 -175 -55 115 25 -62 13 144 90 -124 -165 -10 38 15 -66 15 151 -5 -205 -120
2076 -120 76 127 17 -25 71 66 -122 -216 3 160 155 -38 -42 101 26 -128 -181 60 205 60 -124 -83 107 75 -117
2101 -117 -38 183 177 -51 -198 8 87 29 -88 37 195 117 -73 -89 29 17 -58 -27 99 120 -18 -147 -55 92
2125 92 67 -12 -23 113 66 -135 -156 12 87 69 -69 -8 115 -6 -154 -96 94 132 -49 -75 64 69 -51 -186 18
2150 18 105 132 -66 -65 141 56 -69 -104 91 198 23 -100 -72 103 -31 -86 -32 142 130 -30 -100 -27 23 -55 -122
2175a22K06N0p5j98O8J40J2j01j04J83O1j26j40N6J74J9j75J04J09lk48r1J72
2198b9J02k7j07O1J31j60j13P2J10O9n8j24J03O1j53j22J76J36m7r2J0MJr4j0
2223a00J51R0r5j47R0P6l1q6k2K26l9j47j28J50J7j9o8J05J60j35j21j8R0K2o2
2248d1K2J02j6l9j74Q5J05j4r0R2J09k6k11k1P2J46o8q9M3P0n8j20RJ41P0q8q5
2275g4J32J2j12q8N8J86j3j31n2J72n8j31k2J40J10j33l8kO4m8o8P1J49l7j50
2300f3l3M1R2r8j1R4J22rk01m5P4P8m7%R7j3q5j50R0J32k3k1k1P3K4q1j26J47
2328C7rk1%L2M9r1j29L3J67O3j26m7P6O0j40m6N6Q5M4j21J7N3%j47P3M9P0m1q8
2357d2J9J20mk06M8J20K5j21k1N7L9q0k4J29pj4j04j7O2N1k3n9J53rn9p4QP7m9
$$ plain form
2175 -122 84 134 59 -139 -71 69 81 -20 -124 59 120 -6 -146 -90 84 103 -72 32 141 138 -110 -201 -29
2198 -29 73 46 -61 0 131 -29 -142 -70 40 109 51 -73 30 91 -62 -184 -8 128 81 -11 -1 3 4 -90 -100
2223 -100 51 141 46 -101 -11 65 34 -52 -74 152 113 -34 -162 -12 5 -14 -82 23 183 48 -73 -91 -1 21 -41
2248 -41 -19 83 67 28 -146 -61 44 30 -60 32 141 115 -96 -117 -45 101 33 -56 -13 57 -1 -121 -112 29 99 11 -74
2275 -74 58 70 -42 -130 -72 114 101 -30 -82 90 32 -99 -121 19 129 -4 -42 -44 20 -28 -96 -25 124 87 -63
2300 -63 -96 -55 37 -61 -72 22 144 135 -66 -111 -37 41 -6 -6 91 78 -7 -157 -67 65 42 21 0 73 97 16 -110 37
2328 37 28 7 7 39 88 -3 -132 -99 68 131 5 -42 34 94 -46 -92 -36 49 93 -28 -11 42 42 -105 -32 17 87 46 -42
2357 -42 -23 97 93 -113 -65 55 80 -41 -62 -5 34 -46 -70 59 52 38 -66 -83 -21 30 7 -52 101 92 33 -41 -33 44 -5
2386eqj0J63p3j21m9J04N3n4n8P7O5o6r8k6J23L4o1k5M6Kp7l6M6J16j4r7Q3n5
2415b1Q1j04nQ9K3l3p8%N4L1n6J0J01l5j00RM1N4rn9oQ6k7p1qM6K5o4j1J33m1
2446E5l0j09M9P9m0mjP0m5q6J4L9P0m5k3L8J2k8q8j4J33Qj05O2K4RKj00M3K3K2
2477C4l7L0Onm5n1R2M8n2q7P4k2J0Ol5J35k7o7j2K7k7l2K7J1P0n4k3k7PO9o0N4
2509C7l4M8n9q3O3N1J6m9O0k5Kj9r6Q0M2m6k2J1N9l2j18R6L3K8o9N8p8P3k9r9
2539a01Q6P1Ln9KM3%r1k6J66rq2k5M4O7q7l3k3J29J4j05q2Q1M9m1RN2j3k2p8L8
2570b3J7K9n1l2Q8O0r4l3K4j2K0K0M3Ok6n3n7M4N9j6n6N0K1k9r6M9Q7J8j05N9
2600A1J5k1j2k4J0J12m5j8p4P2l4j5k8P6P8l8p6J1mM9j07M4O8qL1r2l5L4M5n5
$$ plain form
2386 -5 -13 -23 140 67 -54 -103 1 54 0 -58 19 84 18 -80 -106 17 51 -10 -35 11 13 -64 -100 -54 62 48 -49 34 -21
2415 -21 60 -44 -49 40 63 30 -48 -48 6 37 -19 -9 92 57 -43 -34 7 61 52 -7 -13 73 46 -25 -33 13 38 -26 -37 96 55
2446 55 25 -84 -35 44 4 0 -1 69 24 -62 -48 -9 61 16 -7 31 43 15 -73 -87 46 54 -51 11 35 44 46 -54 -11 12 34
2477 34 -3 27 33 28 -17 -68 24 72 20 -67 7 -15 -5 1 -34 101 74 7 -5 22 -5 -37 -10 1 71 17 -6 -33 -26 43 -17 37
2509 37 3 51 -8 -91 -28 23 39 -10 50 25 27 8 -88 -8 34 -12 -34 -23 36 4 -114 -18 15 43 -26 32 -46 27 -2 -101
2539 -101 -15 56 59 0 2 45 45 -46 -72 94 85 3 -22 22 89 2 -31 -54 75 89 -16 -98 -17 32 -9 0 52 39 17 -61 -23
2570 -23 -6 23 -28 -60 28 88 -6 -39 -15 -27 -7 13 56 62 36 -17 -74 -30 29 13 -43 7 28 -1 -97 -48 39 57 -48 11
2600 11 26 5 -7 -31 -21 91 46 28 -46 26 -8 -23 -51 25 103 65 -11 0 -4 45 -62 -18 50 42 73 -19 -54 -20 25 -30
2630c0P2nJ6o6j9K7O5j06k1J04j4k7j2k7N5K0n2K1R6q2k0q5P9N3o6M9OM8k9q2
2660c2k2Q2nro2J32o8m4n6J08J9n9j8k0O6km4N3Jk3M9l8k5Pk4k5K3M0O2j05k6
2691f5L5J9p8P4K2L4J6j02J2MK7L6p5K5J04j40L2n6Q3Oj1j1oM7p7K4OP6j0m5k3
2722a7O3l8q1K2J01k0J0o5K0M1n2l9J3O8J9n2k3K3J7m1m4Q0M0m6k1Jj1M2m3j7
2752e0Q5j9k9m1R2k8o7K2M6K6l5J5k0J8L8m1n4K9J12o2p0j3L1K1k3K9M9k9n8k3
2782d9Q6J6m4j7K8j0nj5K7j5L4j7k8J8K1m2n8J8R4q2L8k3K3M4p7K2N6j3Lp4K6
2813a5L4p1J8M3LL2q7lM1QK6o2M7O4l6r3J9J1N6m6k7P5j3j9K3o4K0M8p1N5J0K7
2845E3q0J7jJ2Om9O9l5Jp2K9L2P9j4p5N3m8m5P7l0N4l2k9O0l8k2%oMM7pl5j0k
$$ plain form
2630 -30 42 37 53 -13 -32 -5 60 -46 -67 37 23 -4 -16 -43 12 32 -20 1 97 15 -5 -90 -11 42 -24 25 31 79 50 -32
2660 -32 -54 28 23 14 -48 84 16 -28 -84 24 43 -16 -34 -54 12 10 -34 19 20 -3 46 8 -17 -10 -34 -59 -36 4 66 -39 -65
2691 -65 -30 -11 -89 -15 7 41 57 -45 -33 -29 -2 34 -41 -16 88 -52 -20 -76 7 13 2 -9 -15 32 -45 -21 -15 61 51 6 -17
2722 -17 46 8 -73 -51 50 30 40 -25 -5 36 -16 -55 -42 26 45 -7 -30 -7 10 -31 -75 5 45 -1 -22 -21 -32 10 -33 -50
2752 -50 35 16 -13 -54 38 10 -57 -35 11 37 2 17 -3 15 53 12 -42 -13 99 37 -33 -46 -15 6 -17 12 61 32 -26 -49
2782 -49 37 53 9 -8 20 10 5 -10 17 2 36 19 -9 9 30 -12 -70 -52 42 -40 -2 -25 -2 42 -35 -13 43 30 33 -41 -15
2813 -15 19 -52 -34 9 12 44 -43 -46 -5 3 29 -33 14 78 42 -51 -32 -21 35 -11 -38 37 24 5 28 -36 -16 32 -39 16 26 53
2845 53 -27 -10 -11 1 7 -42 27 -8 -7 -79 -50 -18 61 47 -28 25 -23 -68 9 -21 33 1 -28 32 -6 -28 -28 -34 -30 17 10 -25 -35 -37
2879c7MRM6Pl2QQl4M3m5L7OK0J3k7Pp9R7p1%K4k0rK8Qj7L1pm2M1L7p9LJ1Pj5n7
2916g6J11m4k0K9l0P3ok8k4QJ6j4k9RM5lo8J3J4L5j6j5L7L6K2j01J3j1K1m8K0
2947c1P3oo7MP3k4qk0k4P6pm5K9l1L7k8l3J08k3mo0m0J27r7l3K2R4q6J8k7O3J
2979C1l0J1J5k0Jk4j8O8rK7m3m3L5j2m8Q0l1J5k7K9M1J8j61Q1N4k3K7o5J6oM1
3010C0r6O1N3Ok4p2P9pKl0J0L0m6k5J5k0mO7k4oP7p6rk4L4j1ML0Qn7L0m5OlJ6
3045b1K9J2j6J6n2O5LM0j8l5k8J3n7M2K0mK5m7QK8J4J3q1K6L8nKm1J1K2o5L1L9
3078B7m1K3k2l6jK4M2l7M0l2j8L0M4K1j00RQ6m3k5j6k3Q4n2L6L5o5k3J7l5O4K5
3109C8Rj7%j3k2nL9j2Kn9L5j4M0p0M5OJ2L1n0K1J0m9L6m3K4L5m5M9l1J0m8O3o9
$$ plain form
2879 -37 -33 -24 22 29 -3 5 13 -21 22 -23 14 20 40 53 26 33 -46 51 -20 -20 4 -16 -25 3 11 -6 25 18 -24 17 54 -25 -22 -11 -4 -19 -76
2916 -76 35 -9 -29 0 -30 43 37 9 -15 -7 9 -5 -34 -25 20 17 -51 -38 -24 11 -5 -20 17 53 75 -26 -13 -24 -3 -51 -31
2947 -31 42 36 -31 -27 46 22 14 -6 -30 46 39 -6 23 -8 29 1 -32 76 53 49 -11 -51 76 -21 -54 -32 62 -24 -6 -33 30 31
2979 31 1 12 27 7 8 -16 -34 34 25 52 9 -34 1 -11 -59 21 -10 5 -22 7 48 66 -95 -14 40 17 44 -21 -5 -11 30
3010 30 -66 -5 48 54 30 -42 37 30 32 2 12 42 -4 -29 -14 -34 -38 29 5 -1 76 0 -9 -33 1 -10 -6 24 32 -25 5 -40 -34 -37 -21
3045 -21 8 20 4 20 -32 33 36 76 58 23 -5 8 -49 -7 13 9 34 -13 -5 23 37 50 -31 -5 33 28 30 -11 0 22 -43 -12 27
3078 27 -14 9 -13 -49 -50 -26 16 -21 19 -13 -31 -1 43 64 -36 -27 59 16 -9 -25 -48 36 -16 20 55 -10 -33 -16 -51 13 38
3109 38 47 30 30 17 -5 -10 29 17 19 -40 -5 -19 21 -49 -4 2 14 45 -5 16 26 -23 13 -30 -6 29 -16 33 2 12 -36 27 -42
3142d2N6Km9MK6K7K8o4KK9k7j0K6n9P9m7K9j8MN9r3O7Noj4m7O2N2j12P9k6j8j
3175CnL6k1Kk0k9K7L7qJ1jL1m5ll4lL9l5k3j1Q7j6k9j6M8k7l9M5n9P4j1RK9n8
3209a5L3on1M3K1m0k3Q9n0L0k5m1K6L0k0N3m4k1M4J1o7oN4j9L4k8kk8J7O6p9j7
3241c1J4P0l3j07P1O3Mm0l6J0L2l3J4L8k6qrk5N9J5n1L0l7L7L9p1M4m4k5jL1K7
3273B1j3k2n0J21n2mLj7K5K3p0M1J2o%Pnj4k4m1M8JrK6M3n7K1k8K5OJ8m1J6k8
3307b4N3q0j3K4j0J04o8QJ0j0N4o0j3L2l6M0j1n0M7M8j0qj4J3j9k9JL6K3p4M6
3338A0L1l4o8Q8p4P6m5P7p6j7K7K9J5n0j6M3n2M8k9n8O6j1L8ll1J3K6k8J1N1m6
3369A1J5k8K4J1o5Mm5P9l7k2M4k1N0o4O9j1K4k5kj9K8k3pM0k7P3r6K9J4L5q2L3
$$ plain form
3142 -42 14 16 -33 -29 -3 24 52 -12 -10 19 -8 -18 8 -51 28 -19 10 -8 -4 55 -38 29 34 28 14 -33 29 81 -31 48 22 4 3
3175 3 -2 34 13 15 -5 -34 -7 30 22 33 32 63 18 15 -19 -22 17 -18 -41 -52 35 19 -10 -26 22 -5 -44 1 -58 16 5 14 43 -15
3209 -15 18 12 -39 4 25 -15 -38 51 1 31 6 -35 -9 21 1 54 10 -11 33 44 -23 -29 25 6 40 12 10 -18 -1 65 -14 -31
3241 -31 -17 53 20 -87 -16 47 51 11 -25 -15 17 -16 -2 36 10 2 -7 -32 27 42 -9 21 -16 21 60 -11 33 -11 -36 -37 -6 21
3273 21 8 -14 -64 57 5 1 4 -13 12 35 -35 6 18 12 12 19 14 0 -24 -65 -17 -16 -25 1 44 -13 8 -20 5 11 29 -12 4 -24
3307 -24 29 -51 -64 -40 -50 54 -14 -6 4 -6 48 -12 -25 7 -29 11 0 -50 -3 45 35 27 13 26 7 -22 -21 15 38 -36 10
3338 10 41 7 -61 27 -47 29 -16 61 -15 -32 -5 24 39 -11 -27 16 -36 12 -17 -75 -9 -20 18 15 -16 -3 23 -5 6 57 11
3369 11 26 -2 22 33 -32 -28 -73 6 -31 -53 -9 -30 20 -44 25 14 38 13 11 -8 20 -3 -10 30 3 76 -20 9 23 58 -24 9
3401Iq%oO5r1J0M8J6j4L4n2n8N7J0m0P5n6K7l2J5Nj8j4l1O3k5M5mM3j12m3J05
3433B3qj4N3j01N1oK2k0OJ2n4N6rPj9N7n0L2m9M0J1nL1o6l0O3j0L6p7M3M9j13
3465c9K5L8j2N9r3J7KK6n2K4qO2n2l3M8J7p9L3K9k4Joj3JL6j7J8K7o7N4p0N2n2
3498d8L2L5pKj3PJ4l6J7JJ2Ok2K4m4PJ2J6QKo2M0k7M7p7L0O7n0nM0N6n7nj7m7
3533d2O7pk9L2Mq5K4oK8L9n3J6K0l5Q9l5l0M0j5k9MQm0L7jJ4j1o9L0J04l7l8M
3566bK0j0j4J9J5o5K2M9k6J4j2m5P0q0O4M4p6RM5l8l7P4k8MM2o6K2j5K4K0o5K2
3598@J3n6N8nj1MJ2Lk2J9k0nLJ2rJ3j8M9o2K1J6kM7l3Po0OR0q9L2LJ4nN0o6RK4
3635D2%Mp6M8j4RJ1%J2j0l5j9N1n2P9j9p0Q5K1j01mkL0l4M4j3K1kLo1M5P1o1K
$$ plain form
3401 9 1 1 -5 60 -31 -21 27 43 29 63 11 -47 10 20 -20 55 -1 26 -6 9 14 -4 -18 -49 14 -11 34 30 73 -39 -82 23
3433 23 15 1 54 -47 4 -2 20 0 6 18 -36 20 11 18 -1 56 6 38 -11 29 40 35 66 0 -30 33 23 59 -18 25 74 -39
3465 -39 -14 24 12 71 -22 -5 -3 23 -29 -5 -13 49 -3 -36 12 29 -50 -17 12 -12 -11 -17 -30 -29 7 -10 8 35 -32 22 -48 4 -48
3498 -48 -16 19 12 14 1 8 22 -14 3 4 16 22 0 24 -20 -13 -1 15 23 25 -37 3 -24 23 -54 -24 43 -7 -12 28 84 27 22 5 -42
3533 -42 25 18 -11 21 25 -60 -36 -42 -14 25 -28 -12 8 -27 62 27 -3 37 22 -7 -3 5 -35 2 1 15 4 -65 -35 69 32 -6 -2
3566 -2 18 8 -6 13 28 -37 -15 34 8 22 10 -35 35 -45 19 63 -13 -4 41 3 -34 40 12 16 58 -8 14 -1 23 43 -22 0
3598 0 13 -43 15 10 -1 3 15 18 -4 15 -5 -10 -7 5 -4 9 -9 40 -22 -1 15 13 60 27 34 -26 -20 70 -19 13 16 30 25 75 9 18 42
3635 42 42 46 -30 18 4 13 24 24 36 26 -9 -28 23 -29 50 31 -39 46 67 -34 -38 -40 -10 -44 0 -13 8 6 9 -52 -7 64 3 5
3669Ek4K4j6N4m5pL7L4k0o6R2m3Nl1J5K9ll9k7L0rJ1l7j7M2J1rj7J6l1OM3m1M4
3703A6J6m2j5M9mpnJ9j9K5J4n7P2n9m8P7Lj2j4m2L5Jm4K7M2l9L6Mj0j7J3oM2l
3737D8m9PJkn9P5Jk9Qj2K0Qn0K6MLK7k3p3O1m9R7J5p2K8m3J6L1m7RK6N3n0m3M7
3772A0l9J6M1M5l3j16J6P4n9O6l1K8j5L1nj5l5K5Rj2%l%M6m7L9K0m4k4M3m6J3
3804bj7j8M8J5j7Jq2L8R0j3l5o4k0R2n2N5pMk5K5KJ4J3m2RM2m5j9N4r2N2j3j3
3837b2K0Lj6l7PM9njklRK8mj2l9L9l2j5J6OK3mj4l2M0l3J9%K7o4K6L3m1L2%Rn6
3874d6J3Q2r1L2L7m3J1m0M0K2j6Ol5N2m0N5k2k5PK6p4N8jj1kl7P1Rp0NM1qJ1o7
3908e0R3j06N9RoNKmK2J0j4Nl8M9o0K1n2M4j6L8j1qKJ5n8M2MLj1L9j00Q5O4q2
$$ plain form
3669 5 -19 5 -11 43 -2 -9 28 62 42 -24 68 25 30 -1 14 43 40 1 -26 4 -5 6 -31 -48 -6 5 -4 -21 -5 -36 -30 13 -28 16
3703 16 32 -10 -25 24 20 13 8 27 8 33 47 -10 62 3 -45 32 35 23 9 -33 2 3 -41 -14 28 -11 25 29 19 2 15 9 51 48
3737 48 -1 6 7 5 -54 21 22 -7 1 -11 9 17 -33 -7 -3 0 27 4 -69 -8 -57 40 55 -17 11 -32 -16 15 -32 -23 3 56 6 -37 10
3772 10 -29 -13 28 73 40 -76 -60 14 -45 21 -10 18 3 34 29 14 -21 4 13 1 1 -2 -2 44 -3 36 56 12 -12 31 -15 -2
3804 -2 -19 -37 11 26 9 10 -72 -34 56 43 8 -56 -76 16 -36 19 12 16 -9 16 18 32 45 3 12 54 9 -10 44 -48 4 -9 -22
3837 -22 -2 1 -15 -52 -45 4 -1 -2 -4 -7 2 30 26 14 -25 14 -18 -33 -17 -11 12 8 -6 -38 2 -31 -12 -12 15 -49 -23 10 -31 1 1 10 -46
3874 -46 -33 49 -42 -10 27 -16 -5 -45 -5 17 1 7 -28 24 -16 39 17 -8 -1 25 -49 9 8 -3 -5 -42 29 38 -32 -27 14 6 17 -50
3908 -50 43 -63 -4 5 -1 4 6 2 24 34 20 25 -13 36 -24 -3 -55 -11 -27 11 0 -8 -6 9 -49 -7 -3 0 -11 28 -72 13 77 -5
3942eL0j02P9mJ6M3k5l7j8N6l8kl1K0L6mL3k9l0NM4q5L8K6K0J5Jj14O1J6j8n9
3974f2J3j9P7M2l3k0k8N5l2l1J0Q2q4P1jnk5k1k2JJ1L1N1m6mJ7lq1P7om1mO3o
4008B7j0J4jQm6j7Q8q7ll3O6N4l5k2k4P6r1K7O7n9n4P4j9k4L1m5P8p1J7Mk4K2
4040a2J3j1rL8l5M0J3Ql6j1J6l9j6O3j7J6N4p1k4J3j6O7n9N3o5M0J1m0j4J0L9
4071A9q7L4J1k5K1J1J8j5Ork9J5J7M7m3J6n5M9m1L8j4K6k1j5K8m2L8l4M0KJ2q
4103A0j6l9P2k8L4n7L1K6Kk9p5K7L0K3n9N0KK5k7K1k5j0L0k8j5P3n5j3J2k0M5
4134A7ll9J9j6j2L9PM9r0R5m0l3m9O5J9j3k4m8O4nL9lk1l8N0j1J8m9K4k2K3n6
4166d4N2rJ4J0J3J5p9L0L4k5m6K3L1r0J01m0j5kM5k8Lj3L3lJ5n0LL3Mjk3j8K9
$$ plain form
3942 -5 25 -77 2 -2 14 57 32 -5 -23 33 -5 -7 -38 -18 18 14 47 18 -12 -7 37 -48 -10 16 36 51 52 -62 -1 15 -3 -62
3974 -62 -49 -68 9 51 18 -2 -30 25 -7 -38 -28 54 -30 41 40 35 10 -11 -33 -32 -21 10 61 15 11 28 25 -56 21 15 -26 -30 33 27
4008 27 17 31 30 38 -8 -25 63 -24 -27 -60 6 60 25 3 -21 55 -36 -9 58 -1 -55 19 0 -24 7 -38 40 -31 -14 -10 -34 -12
4040 -12 1 -10 -19 19 -16 24 37 45 9 -2 14 -25 -41 22 5 21 75 4 -20 -7 -23 44 -15 38 -27 13 24 -16 -30 -20 19
4071 19 -68 -34 -23 -48 -27 -16 2 -13 -7 -16 -45 -30 -13 34 -9 7 -48 1 -40 -2 -16 10 -11 -26 2 -40 -2 -36 4 6 18 10
4103 10 -6 -45 27 -1 33 -24 7 33 35 6 -69 -42 -12 11 -48 2 4 29 2 23 -2 -12 18 -10 -25 48 -7 -20 -8 -28 17
4134 17 14 -25 -6 -22 -34 5 12 61 -29 66 26 -7 -56 9 28 15 -9 -57 7 2 41 38 17 -21 29 18 36 -13 11 -11 12 -44
4166 -44 8 -1 13 23 36 51 -28 2 36 11 -35 -12 19 -71 30 -10 -25 -27 18 -10 -7 -20 13 10 25 -25 -22 11 15 14 -9 -27 2
4199Bk7jL7M5p0M9kk3NNk5oK0k5K4m9N4j0mk0L6j2Jk7M1j3LJ8j6k2K2J8jk1K8
4234C4k4l3l7J7L0J5L0l4O4j24N8j1K2p3P5J6K7p4K6l7L5J1M9k4j12L2M8Nm5J4
4264b0j1L5k6MLJ4jJj7JK9jj0J6On2M2k9Q1j02O6j9k8J4J0Lj2jJ3KOl5N4m1k5
4299c0K9K9j8j8M1j6l3J8p%l2K8J8K3l2l6JL6nJON1o7L0l0jq4P6Om8J20p1kj3
4333c0Mk3R4n5N3l0JMk5N2m0JM1m2j2M0n3M1j2l2kK5K2jn2M6j7n5P0l3N7J4r0
4366c9J9J8J7n6P4m8j1ok8L6j5j4J3M7ooll1P7q9N8Mj3M6m3Kn0O4j0j4k7O5m0
4399iK5ll3K1J6L9j22L5M6j6KJ8l0K9j1nKj6RJ0l0L0MK5n4K5J4j3Lk2K7j9MJ7
4433A8j1k7N6n0K7K1m5L8k1L4k6pm1j9L5L3Mn5K7m0M1m2N8k0M4p2N3M2k3j9k0
$$ plain form
4199 2 -25 -26 11 56 -14 35 33 10 15 20 -5 -11 9 -16 8 -41 13 3 -1 -21 15 3 4 -23 18 5 8 26 10 -12 10 28 27 6 34
4234 34 10 -23 -60 -43 -13 2 32 -2 62 -62 -4 -15 7 -66 9 25 52 -22 4 -33 2 13 62 38 -74 -42 6 11 -34 -20
4264 -20 -31 4 -22 -18 -15 -1 -2 -1 -18 -17 12 11 1 17 23 -29 13 -16 65 -37 29 10 -18 -4 6 9 -3 -4 9 11 17 -18 36 -5 -30
4299 -30 -1 28 10 -8 33 17 -16 2 -5 -5 -37 -9 9 32 0 -36 -35 1 -4 -3 3 54 -13 17 -13 -14 -98 -22 -16 -64 56 -15 -17 -30
4333 -30 -26 -49 45 -10 43 13 14 18 -7 45 5 6 47 5 -7 33 -20 21 9 -23 -25 0 22 21 -31 15 -2 -57 13 -20 37 51 -39
4366 -39 -20 -2 15 -41 33 -15 -26 -32 -60 -24 -39 -53 -40 7 1 -5 -8 -39 38 -51 7 11 -2 44 1 3 -47 17 7 -7 -34 31 -9
4399 -9 16 13 -20 1 17 56 -66 -31 15 -1 1 19 -11 18 7 2 4 -12 -3 7 -23 7 11 36 -18 7 21 8 11 -11 16 -3 1 18
4433 18 7 -20 36 -14 13 34 -11 27 6 40 14 7 -34 -53 -18 15 19 -36 -9 -49 -8 -50 8 -12 32 -40 13 55 32 13 -7
4464gj1RMJ5L1k8K0pm6K1j1m1P6mK1l3J3J8m4L2l7L2l9K4m2K5m0J27n8lj4n1N4
4497Fj9K5k1n4P0PJ3Np2L6M2j7p2P6j8j5j1P5n9j1Pk0RKOL3l8OK4K5k9l0k8L4
4531a3l9N2k8L4LK9Qo5NN2j8l6M3l0k1J3K5j1rn1L2K3mj8jOL4j5K6n6L7M8m3k6
4565a4K1j%k1j2OO2m7j0J7J1P3r3J4jN4l2m0j0ON3k9n1O3l6N6Lp9O5m2PLK1k9
4599a2L8l2OQl3m0J08q5K3N4j9J5qo2N5q4P1L8k2qj3%k4K5Kk3N2l2M4k6j0pNN
4633IN1n4L3l6k8J1k1K5J0j8j8O0kj5k0M9nk8K0m0lL5m6P2k0Om6K8k0k9K3K1K4
4666B8k3KO8n9j1J4j0Lk0jPj1QnQMj4Q4j43N0N0n7j1M5J5l7nK6j1OOl4N1n6M2
4701Ijm3N6l6Lj2J4J5Rk7J6j7N8m7L6k7j5J6Pj6k8M3Lnqk7O5o3j2LK2nk5L4K9
$$ plain form
4464 -7 -18 -9 -5 10 41 13 33 26 -20 1 -10 -51 25 21 42 9 22 40 -4 28 -9 23 -16 8 -34 -9 -49 78 20 17 3 -48 6
4497 6 -13 12 -9 -63 7 14 27 32 -40 -4 38 21 -51 25 7 -8 -19 56 -3 -14 -7 -27 -18 -16 -10 23 -15 -9 15 40 11 -19 -47 -13
4531 -13 -52 0 -28 6 9 38 46 -19 -14 38 20 -16 27 -3 -24 -11 14 3 -6 -57 -25 -2 -6 -24 -25 -19 15 0 26 -30 7 55 12 -14
4565 -14 7 6 6 -15 -27 -21 41 -6 -16 1 12 85 -8 6 5 59 27 -13 -23 -17 36 7 -44 19 -17 39 42 -37 28 -14 -7 -4 17 -12
4599 -12 26 -6 0 8 -25 -65 43 -42 -19 35 16 31 23 -39 16 -68 3 41 19 11 -2 -2 -26 -1 1 -22 30 -2 42 16 6 -1 4 9
4633 9 60 6 39 3 -25 -14 -35 -10 0 -18 -36 24 22 7 -13 36 31 3 23 -17 -20 15 -31 41 21 27 -19 9 -11 -40 -17 4 28
4666 28 5 7 75 16 5 19 9 12 -8 -9 -2 -13 -5 -10 -2 2 -12 72 -71 -21 29 -28 -39 6 21 -16 -21 5 -6 0 6 -28 23 -33 9
4701 9 8 -35 21 -15 -12 -24 -10 5 14 -13 3 -14 44 -3 33 6 -9 7 14 -2 -30 13 16 11 3 -24 41 -22 -34 -31 -9 -14 -39 -5 24
4736B4l3J0j5J0M4m6J4l9O7p3M5J7j9K6J8l9qk0M9o4M8n7M1J3j6J0j6jqL0l5M3
4768B0k1N3n5JPm6N0j5J4K4km6pK8qqKm0M6PK3l3j5K1j3K6J9p3N9Nl1K4k6M8J1
4803D9j0l8j8K8J7k0l4k2P5j1rK6p5O1l4PM4ll7k2P5l6l6M9J0m2N0o3J0J9q3R2
4835A9q2Q4j6j0N1n6k5N8n4K4JM8L1q9klJO3m9L6m5j1L3lKrj1L4K0p4Q7n6J7J5
4869B9pm0L7l0l9lR5n8l8Q5q1K9K1LQm9P7Qp6j1N0Pnk5lk6J9jL0nNmK5j01M3L3
4905BL8m0Lj2K1m7J7K3L3l0j9j4K4kK3L1k4m9j6P1o7K3Kj3K3J0l5J3J9l4L4pj
4938@l2L2l3k0Q4n1L5o8L6L6Ol7n9P5j1L5m0M9Pj9lk8M1l5m8M0K0l1N0p5O5l2
4970a1J2k3L3J4n1L3Nl7J9k7L3j9L5m2j8M4N8l1n4Lm1L4J2K4m1J6JkL0m8%L5j5
$$ plain form
4736 24 -9 1 -14 -4 40 -6 8 -31 36 -37 8 25 6 32 50 11 3 -17 32 -32 16 -41 0 13 -3 7 -9 -10 -18 12 -23 20
4768 20 -1 52 -3 -2 5 -41 9 -6 8 32 30 -16 -23 5 -3 -11 -9 -49 -3 4 27 -6 -21 0 -13 13 32 -41 18 23 -8 16 -10 38 49
4803 49 39 1 -17 11 28 8 -26 -48 27 16 7 33 -42 19 -15 -8 36 33 -4 -26 49 13 -23 26 36 -6 44 -19 -9 10 -73 19
4835 19 -63 21 5 -5 46 -10 -35 23 -31 -7 -6 42 73 -16 -18 -21 -20 43 -6 30 -15 -26 7 4 6 -3 -14 20 40 -34 53 -3 14 29
4869 29 22 -18 19 -11 -50 -53 42 -16 -54 31 -50 -21 0 3 11 -38 39 47 -29 -40 10 17 12 -13 -16 -42 -23 -24 6 1 6 2 27 -74 -31 2
4905 2 40 0 3 -9 12 -35 -18 5 38 8 -11 -25 -1 -3 20 51 27 -22 -38 33 -34 -11 -9 -22 1 11 -24 -11 8 -26 8 1 0
4938 0 -32 0 -33 -53 31 -20 15 -53 -17 19 25 -12 -71 4 -7 28 -12 37 44 25 22 -6 35 0 -48 -8 12 -19 31 -44 21 -11
4970 -11 1 -22 11 25 -26 7 12 -25 -6 -33 0 -19 16 -26 -44 0 58 27 -27 -24 -65 -31 -19 5 -36 -20 -19 -21 9 -39 -39 -4 -19
5003a9J1J3Nnlk3rL2L0j7o9K9kK6n8J00k5k6JLL1J7j01O2nL3k3j1L2Ol0M6p7N0
5037B4o9M3J6nj9K1ll1QL4n2L0L7j8k3LJ9j8Oj6L7o8M8l9N0k1j6M8m2KM3o6ML4
5071Ak0k5J5M7l3l8K1O1k4j3L2K1p0O8m8L7m9K1qJ3K3k0Jj3M1n2M0L1p5k6M9m
5103Dj0J0k8QK5M9p3nK6J8k7kJ8m2L4oQk9Q0k9j9K7n8j0O6o9M9J7p3O3n7L8k1
5136a8J1l7P2o2L5L5qk9r4P9j8kpN8j4K3o0j0L9K1J9o7M0Oj3%J1j7J2K3n4O1l7
5169bn9N4O3o7j5P4n6L2qj4k2J6rj1MJ2L0p6N7l6L3Lo4M0NK3J3om2J3J8o2Q0O
5203B7ok6N6k0p3L7k7K4Lj0j8O8n9J6%N0l8l2J7lM7j7j0J4k7j5N1n2P5l7J9J5
5235D9n2MlK9k9J6o0K0N6k4K1k5k5NJ4J8Lk0J9j2nQK4JJ0m9k3O9l4K6k6K6k5q1
$$ plain form
5003 -19 -8 5 10 5 2 -21 -30 2 32 15 -54 -25 -27 -1 -59 41 16 -10 -9 -6 25 42 -59 3 -2 31 8 -3 29 35 5 51 -26 24
5037 24 -45 -2 14 9 -10 11 8 -23 -15 19 -33 -3 34 16 -7 -4 15 -3 3 -13 24 -44 4 -35 15 -6 -22 26 -16 -14 29 -37 -33 1
5071 1 -19 -44 -29 18 -15 -53 -32 29 5 -8 24 45 -25 43 -5 32 -17 4 -4 9 32 12 13 0 41 -11 29 60 -15 -41 8 4
5103 4 -6 4 -24 -16 9 58 -15 -20 6 24 -3 -5 13 -29 5 -1 7 -22 58 29 10 37 -21 -31 35 -34 15 32 -41 22 -35 3 -18
5136 -18 -7 -44 28 -34 1 36 28 -1 -95 -16 -34 -36 -43 15 1 24 -36 -46 -7 14 33 -34 6 12 -1 -1 10 -7 5 28 -26 35 -2
5169 -2 -61 -7 56 -11 -26 48 -8 24 16 2 -20 -4 -13 -24 -20 -8 22 -54 3 -33 0 3 -61 -21 -16 7 20 14 -28 -15 3 -59 21 27
5203 27 21 -5 51 31 -42 -5 -32 -8 -5 -15 -33 35 -24 -8 -8 42 4 -28 -11 -14 33 16 6 20 -7 -22 29 -23 52 15 34 49
5235 49 -3 1 -2 27 -2 14 -46 -26 30 6 27 2 -23 -18 -4 14 17 -3 16 4 -1 7 31 32 42 -7 -30 39 5 31 5 31 6 -75
5269g5M8J9kk5O6n2N6m5NORrm9J14m6K0q0K6NJ2N6m7jL0Nl0Rm1L3Mk6j8k6M7L8
5304C6l7kLmJJ7k3O8l6llQn2L5j6jKJ8l4M4l6LlL2l7l7O5j5MJ6l9L4J3n4L7l5
5340c1J0RL5Pk3L7k7n2L8K6qok2J5m0L6L3j7n2K3L6l3mrlK6n1N2j8l5L7L2k7L1
5374B5k1l1K3k6L5QNl4J4k9J1j6J7ORJ2p0P6n0L1k5M9q7M6K6o0Q1n5J7K9n4M5
5406Gk2O2r8KL3k0J8M4k2k3K2pojJ2rL7j2n2K0pJ9J2L1p6L3j7L5j8L6k1n6L5j
5440a0n7L5K7j7K4J0m2OjJ8%m9O8q8N9P4m6lL4l6m1L5O3p5M9l9j5j5oQ2l1n9M3
5473cO6n6OJ7n3N3j2jJ1n4J6jL7m2O1m1k6oO3l7L2o6rN3qJj9M5k2k2J8Pmk3L6
5508A7J5k0j6K1l0M4o7M1O4o0K0Lm8K5n3O3M0o5lpL4nk7NK8J0l7L0j3J4l2J9l1
$$ plain form
5269 -75 -27 -8 -10 -35 31 -21 35 -10 -5 1 10 1 -48 66 20 40 -40 -14 -9 3 59 12 11 41 46 16 25 -16 17 21 -5 -23 -49 -2 36
5304 36 -1 -3 0 -4 -3 14 -9 59 23 20 17 25 -27 8 -8 -9 -7 11 -23 21 -15 -12 -15 17 -20 -57 8 -7 -3 13 -26 8 21 -33 4 -31
5340 -31 -21 -12 23 30 7 44 17 -35 3 29 21 15 -7 8 -32 4 37 20 -32 -9 27 -6 -10 -19 -22 4 -47 5 -13 -48 -11 21 -6 25
5374 25 4 -27 -4 -30 5 13 18 -16 -2 -31 -20 -36 -19 -13 -4 8 -62 14 -36 -5 -30 19 -68 -22 4 -56 25 -30 -13 16 -38 7
5406 7 -15 47 -51 -49 -16 -36 -18 26 4 -19 3 -4 -10 -11 1 -8 29 17 -35 -15 -22 -3 9 40 -36 -3 -20 15 -3 33 12 -44 -9 -10
5440 -10 -67 -32 -5 -22 2 12 -30 -24 -25 -7 -7 -56 12 -76 -17 57 11 8 42 6 -35 0 63 -12 37 -2 -17 -32 -38 44 13 -46 -3
5473 -3 63 7 13 30 -23 30 18 17 28 -26 -10 -11 26 -16 45 4 -22 -28 35 -2 30 -36 -45 8 0 1 -18 27 5 -17 1 8 4 -19 17
5508 17 32 12 -4 17 -13 31 -36 5 69 9 29 32 -16 9 -44 19 59 -6 -9 -16 18 13 -14 -9 19 29 -8 22 9 23 -9 10 -21
5541b1J0L8n3K9k0K0J4m8J7jJ3L1j3l2K0K7k9LJ4j5oK6j9Op1Q2p7O1RJn7P3n8
5574b6K3j8L9J3m3K3Mj4l3N6k7o2R7j6k1j7N8qo6O5l5lJ5J5o6O6l0N2m6m1M6Q
5606HJ1nK0m3kJ9L1mk0j6O9m5o0J01o5j9OK9%l1O6q6O3n3KL4lK7j0o8P3l4L5p1
5640d1R9p6M4j1l8M2Lk0Nrl4K4K0j2L5qm9N3m1J5J0k6K5QROj1k3K4L4m0Pl1j5
5674b2L8m8N4nn6M1M0o8j3L2M0k1L1k6l0L1Pk1J7k5K1j3n9O1pK3r6M2L2M9l5j4
5706@j9%J1JJ0j3j4R4j01J0M0p7Q8o0NK3q0J38o0L3k0m3k1O5j7k3l1N3NM4nn2
5738a6L5k5Nk1N4kl2MpK0%j7kK2N5q5J1OL6l6L9r0J01o4LL1l3N5n6pQJl3M4m5
5773d1O7m7L7jl6M2lqNOn6M0pl7Q5m7J1KMk9L1k1L7k8lJl0L0k7M2K3o0K1NJ1j9
$$ plain form
5541 -21 -11 27 -26 3 -17 3 17 -31 -14 -15 -2 29 16 -16 4 31 2 5 19 4 -2 24 5 11 -60 22 -55 6 15 16 -41 32 -26
5574 -26 -3 -21 18 31 -12 11 15 1 -32 24 -3 -65 32 16 -5 -22 36 28 -38 27 -8 -11 4 19 -47 19 -11 41 -5 -46 0 8
5606 8 19 14 34 -9 -11 8 39 35 15 -1 68 23 -37 64 -1 -20 -14 15 15 -16 50 -36 27 -26 -24 10 7 34 24 -44 29 -5 30 -41
5640 -41 58 -18 26 15 -23 19 22 2 7 -2 -36 -12 8 -4 31 23 -26 27 -14 1 11 -15 10 18 27 33 22 -1 23 57 17 24 -7 -22
5674 -22 16 -32 22 17 -39 2 42 -26 -39 -7 33 12 43 17 -13 18 25 4 21 -4 17 4 -55 6 -1 22 -74 -32 0 49 14 0
5706 0 -19 -19 -8 -7 3 -10 -24 70 -31 -21 19 -58 30 -30 -25 -2 -82 56 -4 29 9 -34 -55 10 -7 -30 -61 -8 -3 41 36 -16
5738 -16 19 -6 -1 -22 32 30 -2 2 -5 15 15 -2 -4 18 73 -12 -1 5 41 5 44 -46 55 -9 -6 25 -8 47 -9 -16 -8 -7 -40 4 -41
5773 -41 26 -21 16 15 -21 21 18 10 15 21 -35 5 -2 -39 46 -1 10 12 16 -13 18 -3 34 6 3 4 -26 4 -23 19 42 -18 3 8 19 0
5809@qk4M7%j1J5k7Jj2nj1M3pOJ1M8l9k4kj6j1Q1n2l2KJ03n9l4l6Q0n3L1M9j18
5843f4P3n4O8n1M4j4J1j0J2l1N3m1J1rj3RKJok5j6N7Ool8nmQ2p2K2l6L8LP7j20
5878d6M7l0J9j7J1j5K4N0k0k7k2L1k0L3k7k0K0L4qj3KPL9o4N7l6M4n3rO0l7Om5
5911b5L6n9J1L2O4q0L7j8J6l4Q2j23M2Q1o8j5O6m1N1o7LLL1j8m1R1l0l1J2Mo6
5942e4M7L1kk3L3J7o9LO1p4K1m1J8k7Q4prj8k9O3J0kmropJ6lk5N3K5m7Qn9M3l9
5978b1R7j00n5Q1Pkj0j9M6j5n9J09o8M9n6L3l3mJ3J8Ql5K5j1Qk5OK5K0m6K8qJ8
6011B4L7o8J4k0L0m5qO7m5j5P2q3M0l9K4N5p8M8oK2K8l8m9L7j4M9ql7m1M7K1J5
6043C6m2K1k4L1Lm0MJ5j6M7m5K8m0N7j9Ol4K9n5J4R4o2J3K3o7K5mJ9k7RJ0Om7
$$ plain form
5809 0 -8 -32 15 15 4 19 -8 -7 -19 -24 -35 8 1 7 18 66 27 3 1 -15 -26 55 3 -29 -27 76 17 -17 -53 27 -26 5 54 -64
5843 -64 9 -45 23 -28 16 2 13 3 15 -16 37 -4 7 -2 -15 -6 -4 -3 -9 -34 -50 7 13 7 -31 -36 -40 42 -30 -8 -44 -6 -3 74 -46
5878 -46 1 -29 -10 -27 -16 -31 -7 43 23 -4 -26 5 -15 18 -9 -29 -9 25 17 4 6 13 52 -12 45 9 53 0 -9 51 14 20 -25
5911 -25 11 -48 -37 -5 59 -21 16 -2 14 -20 62 -61 -19 62 -6 -21 45 4 55 -12 -9 -6 25 7 -34 57 27 -4 8 12 -54
5942 -54 -7 24 22 -1 32 49 -20 -17 44 -30 -9 -50 -32 -59 25 18 9 -9 -38 25 35 33 29 20 14 7 23 20 -5 48 73 26 34 -25 18 -21
5978 -21 76 -24 -79 2 9 7 -3 -22 24 9 -50 59 -9 40 -16 17 -16 -20 -7 11 19 -16 9 -2 6 -19 -13 12 32 -14 14 6 24
6011 24 61 -7 7 -13 17 -28 -36 31 -14 -29 43 -40 0 -39 -15 40 -38 10 4 26 54 16 -33 4 -10 39 31 -6 -47 0 21 36
6043 36 -6 15 -9 22 25 -15 -11 4 -12 35 -10 18 -22 35 16 22 -12 17 -38 -24 70 8 21 44 -23 2 -2 17 -10 -1 9 15 -32
6076c2P0l7k1P3k0p3qQ4l1J4m0N4j5j0j2k2j8L6J3J9j9J2qK0l5Mm0R8o5L7p5O1
6108A4k6KM4l7J8j6oJ1K7k1n1N1J7m2L2J3p1LQ4l8j3J9l5N1Ok2m2Q1j4K2n1k0
6140a0N9l8K6J9m6KJ1Ok7K7j3p%jm6N1J1m1L3n3M8Ml9KO9o2N0m6L2nj0K7l9M8
6174D2j2j2J4Oq3O1o2N5l5km1Q1j6OK6m3N1m0pN4n8K0mK1rjjoJ2k2L6j5l2K3M9
6209E6n4l3j8P6nn2L6Lk8L3LJ1o1K7L3l0K6j0k0jM0j9N3o8LO5m4l2M1j6%pm2J8
6243a6M9j3n2L5rM0k8J0L9p2M2Kj8l7Q3p0P8o3Mo0O2k4J1rJ7M4r7R2l8l5M0n4
6275d7K6N6n9k3kL3j7J4N8n3j8K9Ql4K8M3q3K5Nk4J4pLj3M4pk6P2j1l6l9P1j8
6308A2k5P6n0M8n5M9l6N5n5q4O7MM9q7L7j6j3M0%oPj0m6K5l6N0lJ2K2l3l3M5J1
$$ plain form
6076 -32 38 1 -20 53 33 -40 -48 36 5 19 -21 33 18 8 -4 -26 -44 -8 5 24 5 17 9 29 -6 -2 -42 56 -9 28 -47 14
6108 14 -12 -10 34 -3 15 -1 -7 4 31 10 -41 10 27 -15 17 30 -41 -38 46 8 -5 14 -21 30 36 14 -28 53 39 61 10 -10
6140 -10 49 11 37 56 10 12 23 29 2 29 16 9 9 8 -38 13 24 -17 16 -37 11 15 -24 -22 47 -15 35 -11 21 16 6 33 -6 42
6174 42 30 18 32 38 -45 16 -46 9 -26 -28 -69 12 -4 2 28 -15 36 -4 -11 43 -15 5 1 22 13 12 11 5 17 -5 31 16 -16 7 56
6209 56 2 -31 -49 27 22 -30 6 9 -19 14 17 28 -33 -6 27 -3 23 13 -7 -8 32 13 66 -2 1 66 22 -10 31 15 15 8 -34 -16
6243 -16 33 20 -32 3 -6 34 6 16 55 -17 25 27 9 -28 55 -15 63 0 4 -56 6 -18 -7 -16 1 45 -52 40 2 -33 7 -47
6275 -47 -21 35 -24 -47 -49 -16 -33 -19 39 -14 -32 -3 5 -29 -1 42 -41 -16 -11 -35 -21 -28 -25 -38 6 -1 -27 45 34 -2 -41 30 12
6308 12 -13 63 13 61 6 55 19 74 19 -65 2 6 55 -32 5 -11 -24 16 16 10 17 7 -39 -14 -50 0 -3 9 31 -2 -35 10 21
6341B1jk2j9M2o1K8O9o2m4M9lk6K1M2j6j7nRM2r1O6k5J4l3MJ6L7k6qo1Q0N3m1
6374C2q5R2o1oK5j6K1j0OnL6J6k4l0Q3r1M7j9J5J9o2L9l3J8K7o3L5jK1k6m3N6
6406A3pn3J2O3m9L1K3p4QK8%K6J0o3P1m4j9M0j7J1k9%%L5l1oM6o9L4qj0RK2qL
6441bM4m9k6j0KN8k6l9J9O5o0M2m0K1N4l5m5Nk1Q0k1k5K9j8k1J9K8l6M7r2O3L3
6473D3o6L4m7O1l0j0K7J1O3q0k8O0n0l1L2l9P7l7K5oK0n5j5qM7lP2p9N1n1QO5
6505F1n4Pk2K3m0N3%l3J2M9p4J8J4J9l4J0orL4n0L4k0O2k9J3p4L0L8k0k6M3k1
6537HK8l8j9k2K6Rk0O8l6k3M6KJ0m4j6M0J7k9qk2qK1l3K1m1M5J3KrL4k6L9k7o6
6571e8O5k4K3K7mrj1n1N6J4l2lP1rmm3K1%j6J4k0L2m7n1K8O0l5n%K7j9m9N3q%
$$ plain form
6341 21 20 -2 -21 21 -40 -12 57 -5 -49 0 -3 -29 -8 34 18 1 -4 5 47 -44 22 -3 11 -22 -18 -2 35 9 1 -60 20 73 32
6374 32 -53 39 -22 -28 -3 -19 2 -8 -2 -7 29 45 21 -9 74 -17 30 11 26 45 -17 22 -11 7 34 -29 6 5 26 0 -43 13
6406 13 6 -47 -35 28 -21 10 33 -41 -33 -5 -5 21 31 -32 39 -5 -24 16 -1 10 -19 -19 -19 16 -15 -21 25 -44 -10 -18 -28 -19 3 -5 -2
6441 -2 42 -7 -33 -43 -41 17 -9 -48 -29 36 -24 18 -22 -1 53 18 -27 -22 -43 37 16 -9 20 2 -19 0 28 -8 39 -53 10 43
6473 43 -23 11 -36 25 -5 -15 12 23 86 6 -22 38 -12 -43 -11 -50 27 -10 15 9 29 -26 -41 -49 -2 -5 67 -12 39 -12 -4 61
6505 61 7 14 -8 15 -25 28 28 -5 7 56 -18 0 14 33 -1 9 3 -6 28 -22 12 -8 54 25 38 -36 -6 32 12 -14 29 8
6537 8 36 -2 -21 -43 -17 -8 -28 40 4 -19 27 29 39 -5 -21 19 36 7 -1 -23 -31 -10 -43 -22 -63 -18 -5 -3 -12 22 -4 35 8 -58
6571 -58 7 -17 6 33 29 20 9 -42 14 28 -4 -7 64 55 51 8 29 29 13 27 7 39 -8 -59 -31 29 -6 -11 -11 16 -3 -52 1 -7 -7
6606gJ1nN5l0m1nL9l1O1np8L4M4k6l4O1l6L4m2l1Q0jo5L3n4L6n1O4K4k7k8M5l4
6639a0L7j9J4m7N7l0n0N3Kjm8P4l9J7kol2O4qo8M5M1n8J7M5o8L5j6jk9K5n7Q4
6672B1j3nK0mK8l6oJ0o9K6qK8K9o1M7j1l2J5M0k3K0j8j7k1O2Pm9k6L2j0qkK8k3
6706b9M1M5m0l0k5L8m3M7L8m2O0j0m2l4J0L9J0m9K5J9p2O4J4j3l4MK1k7ok3Q8
6737D4jn4M1m9J3K7opk0N9k2n6O1k7J8j2k1j3J4k1J5jJ4N9lJop0mNM0K5Lkk3k9
6773hL2j4mJ5m3kL4k1K1J8m3J7j9L2om5K8L3k4j3K2rn9M3L3J3o9O8p8P6l1J8o
6806In9Q7pj0j8M0p3L7J3J0j5M1j8N2m9J7J4o3%J1m3K8m8J1O7m6J1o3M2N8j3j3
6838A0M9m5J6m1j3QK3k9%K9J5j9Mk3M1l6K8m1j8O6jk8J0M2r3L5K2l5N2qJ8l5J9
$$ plain form
6606 -7 4 -1 54 24 -17 -22 17 -14 47 42 -36 -2 42 16 -18 43 7 41 -1 -32 48 47 -18 15 -39 -3 -54 10 34 7 -21 24 -10
6639 -10 27 8 22 -25 32 2 -48 5 7 6 -42 32 -7 10 8 2 -30 34 26 -42 3 44 -14 3 48 -20 15 -1 -2 -31 -6 -63 21
6672 21 8 3 23 19 47 11 5 15 -54 -28 -36 -8 21 -40 7 -4 -36 -21 19 -4 16 -2 -19 -40 22 29 -20 -46 -14 -24 -32 -34 -6 -29
6706 -29 12 57 17 -13 -38 0 -43 4 42 0 60 50 8 -26 -16 23 33 -16 9 28 -44 20 34 21 -13 -9 12 -15 -21 -44 44
6737 44 43 -11 30 -19 -6 21 15 8 -12 47 25 -31 30 3 21 9 -12 -25 -11 -32 -17 -18 -4 55 52 53 47 -23 -27 -22 18 43 46 44 21 -8
6773 -8 24 10 6 21 -22 -24 10 -11 10 28 -15 2 -17 15 9 -36 -8 25 1 -12 10 1 -58 -15 18 31 -38 30 -48 28 -3 15 9
6806 9 -50 37 30 20 2 42 -31 6 19 29 14 55 37 89 40 57 71 8 8 19 -24 4 -44 -33 34 -12 -1 -64 -22 36 23 10
6838 10 59 14 30 -11 -24 -16 7 -22 -22 7 22 3 7 -16 25 -11 17 -24 -42 24 23 -5 5 47 -46 -11 11 -24 28 20 38 3 22
6871B2L4m2k0k5M1l1J6j1J3J7m5J7O5k6m3J9K3qqK8n0j0N6o6Q4o1k8K6oK7m0O1
6903B9lk4J6K6p0L4j5M5n0J9Pm4M7k9K9KRm6k4K2N7m5j5K5kO8p0J8Kkl3L6n7J8
6937b0K0Mj7K6lm2O2n9L7k2J0Rk5m0P0j9M5n9M9l9L5j1K2k6k3k6K5M1l4Mj7K9
6969FOJ1o6M5j0K9Ml0J4k1K7l4O1m7l0P8r1P2rpJ0K4j5k2K7mn3N6l5J1qLL2l6
7003bK0j8K0M0p8O6n1Pj3N0Rq6L8J8qj2nj9L8l9M0J0m2j2L0K0l5K1l6N6l6J1j1
7036in1Q3n0L2Ol1J3J8k4J1Q4j03L0Np7M3j2O3k4K9m2OL5j5j2k5J2k6L9K1p5j
7068d7P3J4m5j6N8o4R3l2l3k9M7l7M2l4K2m1N4M8q7L3rK5j01J0J08j02M8J1k1
7097a2NKm4P6mJ7n0k3JN9rj2L8j0j7l1j4l1J0K6J0J8n3R2prJ6o9K6m5K2Rj1M2
$$ plain form
6871 22 56 14 -6 -31 10 -21 -5 -16 -3 14 -31 -14 51 25 -18 1 24 16 8 36 -14 -24 32 -34 50 -11 -39 -13 -19 8 -32 29
6903 29 26 2 18 44 -26 8 -7 38 -12 7 14 -30 17 -12 17 19 28 -18 -42 -20 37 -8 -23 2 0 68 -2 16 18 16 -17 19 -38 -20
6937 -20 0 4 -13 13 10 -32 30 -29 8 -14 -4 5 -20 -60 10 -9 36 -23 26 -13 22 11 33 7 -16 -42 -17 24 -10 -6 -23 6
6969 6 12 23 -43 2 -8 21 25 -5 9 -12 15 -19 42 -5 -35 43 -48 24 15 8 18 42 27 5 32 28 -25 31 -4 7 -1 2 34 -2
7003 -2 18 0 20 60 -18 48 -3 4 -9 41 50 -36 2 20 12 0 -5 -24 14 -25 15 25 -17 -29 1 21 -14 7 -29 27 -9 2 -9
7036 -9 -60 23 -27 5 11 -20 -7 11 -13 -2 82 -21 9 14 -63 -20 -32 31 7 36 -6 0 35 20 8 -17 -5 -31 8 29 -46 -47
7068 -47 26 40 -5 -21 37 -27 66 34 1 -28 19 -18 24 -10 12 -29 25 73 -14 19 10 35 -66 -56 52 -50 -2 9 -12
7097 -12 -7 -5 -49 27 23 40 -10 -33 -32 27 18 6 44 34 17 -14 -28 -59 -49 -23 -13 5 -48 44 37 28 44 -25 1 -44 -22 -13 -24 18
7131A8jRmj1ml9M0L9o9j5kj0N3K2k6J0OK9n3J9j3k0pM5m5oK3Mj8O6q4N6q7N8N0
7166C3m1N0l1k6OL1j7o7L2kM3m5M9M3o1N0l8j3j7K2LJ1LQo0J1MJO1p7N9j0m2M1
7200A4k4K8kK2n3L3nl5RPlk6lj6N6L1m4j3LM1k5PM9m6J9j3J3j4l1j7N9K1mp3M1
7235Fl2L7ql1L4jL6o3LJ3pO1o5K5K9n8L3pQPKj0Lj2nj8N2j6oOK0q4M3L2l2n9L3
7272c1RJ8%M2p6OJ5J1k6N1l3l8R3m3K9o7M9l0M8Kk2J5k6PL0m7Qk5Q6k4o6O6k9
7305Bl5L5l3N1lq5K0K0N3k4n4L8M1j06M2J2M3O%mM4r3Lj8M9q%j5j2N8n9R4o6j2
7339a6jJ7k9L3olJ7p3rP3J3NK3m5K1j3Rm7P3o1oJ0K7Ol7J1K5m3rK1K2j5J8kK7
7374C6o3pL1k5ML6rM7p5QK9n7P7j3%m6J3N7j1L1r6M0JMqj6RK8l8K5%j2ql4N6M
$$ plain form
7131 18 17 26 22 11 7 -32 8 47 -22 -37 -39 -49 4 26 0 10 16 45 -8 11 -2 -22 -29 16 -29 -35 -12 -8 -26 40 -44 12 -75 -17 33
7166 33 -8 42 11 -15 -9 22 5 -62 -30 -32 11 -34 15 58 -3 47 9 -4 -21 1 4 15 18 26 -34 -23 -19 -18 43 -34 25 15 -27 14
7200 14 -10 18 16 38 -15 18 13 -22 -13 -6 -9 -35 -38 -54 2 33 -11 -24 -21 20 -5 2 51 5 24 11 24 10 -21 -38 21 42 38 -35 6
7235 6 -26 11 3 -28 6 5 41 -22 -19 -6 -13 48 -17 8 37 -21 12 5 13 20 22 12 15 3 -2 -20 32 16 10 16 36 -48 -5 27 -5 -64 -31
7272 -31 -22 -4 -4 38 -38 -32 -17 -6 -32 19 -14 -52 41 -2 27 -40 9 -21 27 29 7 22 -4 3 33 -14 -6 -31 55 31 -35 31 2
7305 2 -33 2 -31 20 17 -68 -48 -28 25 1 -53 -15 26 -80 -38 -26 17 23 23 19 63 -30 -27 -45 4 -4 -4 -19 -31 27 -32 62 -4 -16
7339 -16 -17 0 -29 4 -2 -5 12 -61 -70 3 16 21 44 -1 20 7 16 -31 42 -19 -25 -15 12 18 -19 -8 17 -26 -35 -14 8 -7 11 9 36
7374 36 -27 -34 -3 -28 -24 12 3 50 -25 -17 12 -45 32 19 19 -27 -14 43 32 63 -33 7 8 12 4 -12 -3 25 -13 12 12 0 -8 -42 14 18
7410A8No4N3k4L7m2K4l5J1lK6J9n2O8j6Rn0j1oNKL4j6L9q3Q5k0k2%nJ6j9O8n7
7444fl0M2K0n2j7M6L0m3ll8M9n2J1M9m0K2J0O6p0M5l0j4ok4M3p4N6Jm4J14l1m
7476B6l3L8k5mj5kl3P3n5J4K8l0M3j7j07Q2J1j5L7K6j3m4J8LM3j31P7l5P3l2k1
7507b0l2K5K9m2RO9k6n0N8k7l1M5k4k8N8L4K3m4n3L1m4O4%n2M1j5j1l6O5m3K6
7538aj0L2k0pk3M4l8qL7j8km2M4jpL2o0L6KL7Ll4ll8M9J1l5KK0j0LOmJ7j2l0P0
7575D2r2M9Nj8M2j0l3NL1j4l1K6M7p3qJ4L5ok3K5l3K2j3k7K8j5O3lk0pJ3k0N9
7608F0m3J9l3l7qL7O9o3M1l7m0QM7n2K6Ok8N3J4m4J0L4m2j2J7l6N7p0P3K6n6J2
7640H%ON5r9N4k1l4R3q8P4p8%KL0k1K9l1mJ8j4lRNO0l4l8L0L0m1l8N3k6M1m0l9
$$ plain form
7410 18 23 -41 12 -12 25 -17 7 -28 -17 -20 6 25 -27 41 25 34 -16 -27 -33 -28 -26 8 -8 31 -52 33 13 -9 -9 -14 2 -17 51 -6
7444 -6 -36 6 26 -26 -43 3 33 -10 -13 -51 -2 -54 -43 6 -34 -12 -2 64 -6 39 9 -5 -11 -35 8 -66 -10 -9 -53 61 30 26
7476 26 -7 31 6 2 -13 -15 -48 25 -30 -16 12 -18 25 8 -99 -17 -6 -21 16 42 29 -15 3 6 49 -82 -5 -40 33 1 -20
7507 -20 -52 -27 2 -40 -31 38 12 -38 20 -7 -38 7 -17 -45 13 47 70 26 -27 4 -40 24 24 -28 13 -2 -13 -49 16 -27 -1
7538 -1 -11 21 1 -6 -29 15 -23 -31 6 -12 -14 -56 -12 -13 -20 12 -48 -12 -10 27 30 -4 -7 -45 4 15 -20 -18 2 -8 -5 1 -3 14 2 -28 42
7575 42 -50 -1 4 -14 28 18 -15 -10 21 7 -24 2 49 -24 -32 -18 17 11 -12 13 -20 2 -11 -38 -10 -25 38 35 15 8 21 1 60
7608 60 17 36 3 -34 -42 -5 64 1 42 5 -35 -27 20 -32 -6 0 -28 25 39 -5 5 39 -3 -15 2 -34 23 -47 26 52 -4 8
7640 8 8 14 69 -30 24 3 -31 62 -26 48 -30 -30 -28 2 -19 10 -21 -25 -7 -21 -24 -15 -10 50 16 -22 8 38 -3 -41 12 -14 27 -13 -52
7675e2O6j5l5M5n1j0M4J4L3j4l4l4L1K9m6N1l1k7J2n5J07l1j8oROJ3J3l%L0q4
7707d3RJ8K8j2oLPkj4j6M8j7J7k0k5N5q9M0P%rL1l9MMl9M8M6k6N5m0K9m2M9p7
7742a8OK9J0l4K7k9J9L5l0K2m3j8P0Nj21J01k4J0Om1j4K0l7N0J0m3O7n1k7M8k5
7773b0Q0p8j1MK7M1k7m7J5k8K9RmOJ1j9j6j1mMM6K0l3J5m0J4K6k2NRj8j7j1N7
7807A2k0KN8o7J5PlL4k9j1qQ7o2nOm9Q3j04M3J9J6q2K3N9m5k5Q0M3p4l5L6j8l9
7840e3N4Oklj4k8L4pN2r0M1m3N9J0l4pL5plK4n8M9j2j2N8j2l5L1m3J3k6Kk3O0
7874A6m4M4M4o9K3j0Lk5K8mj3m8N0m9N1K6n1J0K1J1Mj9nl5QL9k5J0k6QK3K0Ql4
7908a0j3O3o8N4k6L3l7jm7K9M8Op8Q3p6K9RJ0k1j9M6nn2O0pk7J5j8K5j4L7n0N2
$$ plain form
7675 -52 14 -1 -36 9 -42 -52 -8 6 39 25 -9 -43 -12 17 -29 22 -9 -36 -24 -79 28 -3 -21 -27 -18 -12 1 14 11 11 41 -43
7707 -43 -34 -16 12 0 -6 -3 4 2 -12 -28 20 3 20 0 -25 30 -59 -19 -12 -12 -21 10 -29 -25 -21 -60 -12 34 8 63 23 52 10 59 -18
7742 -18 -12 17 27 -7 20 -9 10 45 15 37 -6 -24 46 51 -70 31 7 17 23 -18 -32 -12 -49 1 11 -32 35 -16 -43 5 -20
7773 -20 60 -18 -29 -25 2 43 16 -31 -16 -44 -15 -6 -10 -4 7 -12 -28 -39 -43 -39 7 27 -6 9 -31 -17 9 -13 -8 1 -17 -34 -45 12
7807 12 -8 -6 52 -15 0 7 4 38 9 -2 -10 77 15 10 16 -33 50 -54 -11 8 24 -58 -35 24 -21 -46 34 77 3 -32 4 -14 -53
7840 -53 1 7 5 2 -12 -40 -6 -13 39 -51 -10 -53 6 16 -18 -25 10 3 0 24 -34 15 3 -9 49 37 2 33 -10 3 -23 -21 -44 16
7874 16 -28 16 60 -9 14 4 7 -18 10 6 -7 -55 -5 -54 -3 23 -28 -18 3 14 18 -1 -6 -41 -33 6 -19 -9 -35 -27 -4 16 24 -10
7908 -10 -23 40 -28 26 0 33 -4 -5 -52 -23 25 31 -47 36 -40 -11 -2 8 -13 -32 14 9 -43 17 10 -17 -2 -20 5 -9 28 -22 30
7941C0qk4L0Qm4M4o9RN8j8J4J0j9p1Q4m7J9m6J25j08K0j3oR3n8mRQJ2k0m0L4j
7974A1k5O3J2r9N5j2J6l4j5L6L8o6K2k3K4J6Jj0n7K9M5J1r6O6K6m4j4oL0J1l5
8005b4L0rl7j1P0J5n1N4p1L8j0lj5RN0k1K3m2j2l4P1l4M2o6MN6ok3jK3r4L1Q3
8038C5k5m0M9j2lQJl2J8n5R6m2K1k4j1l0J26j13lRJ5qRj4JL3l2L3k0P6m6j1J2
8071B1l7j9K8K4o5j2O1K2l1k0J0jJ4J6oOJ0k8K5L0k1k5j7K4j7J4m0L8m1N4n7P
8103c3nL6ok5K8j4J1jJ5Ol6J9k1L6m3N7p6N8n3O7jJ6m1pj6k0M3L6mo1M3Ok6M3
8137C1n5M8j6L2Rn5J6j6jl3P1j9K0Lm6KK8k9J3jj5L7j9j5MK3k2k6J8J9p1L6J3
8170a6j2L3J0l3K9j2JjL9m0pK5K6k9j3j1Ql3k2Q0o7
$$ plain form
7941 30 22 -2 28 36 -8 36 -33 -24 34 16 30 40 21 -50 34 -13 6 -40 85 -23 -3 -16 -22 71 13 9 18 26 38 18 -22 12 11
7974 11 -14 49 61 -38 17 5 21 -13 -28 8 46 -20 2 -21 3 19 20 10 -47 -18 27 38 -58 8 34 -10 -24 -30 0 11 -24
8005 -24 6 -3 -40 -51 19 34 -17 37 -34 4 -6 -9 -24 -15 35 14 37 -5 -17 -51 20 -14 28 -38 -34 22 16 -7 -8 15 -79 -48 35
8038 35 10 -30 19 7 4 12 13 -19 -1 -56 40 -2 19 -5 -16 -46 80 -33 -36 -27 -12 -20 -11 -25 -24 9 -23 10 -10 66 20 9 21
8071 21 -16 -35 -7 17 -48 -60 1 23 -8 -28 -18 -19 -5 11 5 11 21 -7 18 48 27 2 -15 9 -8 6 -34 4 -37 17 -40 -33
8103 -33 -38 -2 -8 -33 -5 -19 -8 -9 6 12 -24 -5 -26 10 -33 24 -52 6 -47 20 19 35 -6 -13 -29 -49 -6 30 26 -35 8 14 -12 31
8137 31 -24 24 8 40 49 -6 10 -6 -7 -40 31 12 32 35 -11 -9 19 -10 3 2 -13 24 5 -10 -6 17 -5 -31 -13 6 -65 -29 -16
8170 -16 -28 5 15 -18 11 -1 0 -1 38 -2 -9 16 42 13 0 -11 -3 -36 -58 22 -45
8191d5
$$ Imaginary data points
##PAGE= N=2
##DATA TABLE= (X++(I..I)), XYDATA
0@%%%qJ6j6J6j6K4l2M0n6P2q8J04j28J60j92K24k64L12l68M25m89N68o48P38q42
28d48R58j083J222j374J542j727J928k150K392k660K952l272L624m016M448m924
44b588N454o048O715p474Q342r342J0520j1920J3625j5755J8502k2197K7477l5707
58b0396N0451q5176L16946L43965k24304R498l9609q6659k02425r1797o8788r6848
70a95142j67487q4370k1193K2554P26K9172N8100J10532J09801R3298P9769J29800
82A65560J26604O1414J2559M6823M2587l9024j08486o5990l0778r0875j51192
93c0798j01152m4103p0737j09343n4465K9947M3654Q923K2218Q5813J18970Q3185
105a7888N1160P8033J14129Q7472J6306j2543J9803J5539n9825j04032o2616k7237
$$ plain form
0 0 0 0 0 -8 8 -8 8 -8 16 -16 24 -32 40 -48 56 -72 88 -104 120 -144 168 -200 225 -264 304 -344 394 -448
28 -448 510 -573 649 -725 817 -910 1018 -1132 1260 -1400 1552 -1720 1904 -2112 2336 -2588
44 -2588 2866 -3182 3533 -3941 4401 -4941 5579 -6341 7284 -8471 10031 -12166 15311 -20396
58 -20396 30055 -55121 261825 605790 381486 390984 351375 264716 62291 -29506 -98294 -195142
70 -195142 -362629 -446999 -468192 -445638 -444912 -415740 -357640 -247108 -137307 -44009 35760 165560
82 165560 292164 353578 366137 412960 455547 416523 308037 242047 211269 120394 -30798
93 -30798 -131950 -176053 -246790 -356133 -410598 -380651 -336997 -328074 -305856 -220043 -101073 -17888
105 -17888 33272 111305 225434 312906 329212 316669 336472 352011 292186 188154 125538 98301
117I8301p3169j25056r3099l0603k8574n8505l3260L7960O2387K8987K3521P1911
129a19199J05269P8105L7909N1593Q5852N9050r769l1085k421p810o4027q7569
141I5898m6824k4492o9754j08572o9583o969k796k6043l023M6908N5950K4119
153a35181J8866O7617J04260P3263K2477K1070M7573L2171k2860m1197q476l137
165A76446n6501r1706n7244k0968m5253p4629m2691J0094J3351j3487J23M7406
177a55059N9334L1544K6615O0462P7524M5266P234J0936L0803J1924l2647m1447
189A32489j3138j2794n6203p8660m4602j0601l0447n6686k3943K8743K6566r412
201a48688j774M8283O5998L3549J6656M5514O4052K9907j1976o308J9971Q199
$$ plain form
117 98301 25132 -99924 -193023 -223626 -252200 -310705 -343965 -306005 -243618 -214631 -191110 -119199
129 -119199 -13930 64175 102084 153677 239529 298579 288810 257725 255304 247494 183467 95898
141 95898 49074 24582 -45172 -153744 -223327 -230296 -233092 -259135 -262158 -215250 -159300 -135181
153 -135181 -116315 -48698 55562 128825 151302 172372 219945 252116 229256 188059 179583 176446
165 176446 119945 28239 -29005 -49973 -95226 -169855 -212546 -202452 -189101 -202588 -202465 -155059
177 -155059 -95725 -64181 -37566 22896 100420 145686 152920 163856 194659 206583 173936 132489
189 132489 119351 106557 50354 -28306 -72908 -83509 -113956 -170642 -194585 -165842 -139276 -148688
201 -148688 -150462 -102179 -36181 -2632 14024 59538 123590 153497 141521 135213 155184 163383
213A63383l2712m5985k2938j5616m5640o3096l5396n446j3686l0133j0061K6547
225a30779K6346M91O211M4546N8809L2939J5145L1551L9597R285k0446p470J9270
238A25495M199l9502n0706k4916j5466l8652m7287j5230J1806o357l0498r237
250a36351L1645L5549J0050J0465M0981M9341K0279M92J7533L2288R258k0400
262A01130j5482M096n444l7581m5375k0333p887k6482l5225r894J2614L8j7837
275a03662O53L3790L3814J0122J1113L6718L8877Q667o350J1914K4077K527k3637
288G8623j8012l46j1375l8755l9009j1533J545j6284k8734q308J5569P565r727
301g8781M456L5147L5592R545L726K5075L1359O283j0898M720J8090j203k5443
$$ plain form
213 163383 130671 84686 61748 46132 492 -62604 -98000 -103446 -117132 -147265 -157326 -130779
225 -130779 -104433 -103942 -97731 -53185 5624 38563 53708 85259 124856 134141 113695 106225 125495
238 125495 129694 90192 39486 14570 -896 -39548 -86835 -102065 -90259 -96616 -127114 -136351
250 -136351 -104706 -69157 -59107 -48642 -7661 41680 61959 62451 79984 112272 121530 101130
262 101130 85648 89744 84300 46719 1344 -18989 -26876 -53358 -88583 -98477 -85863 -85825 -103662
275 -103662 -103009 -69219 -35405 -25283 -14170 22548 61425 70092 63742 75656 99733 102260 78623
288 78623 60611 60265 48890 10135 -28874 -40407 -38862 -55146 -83880 -92188 -76619 -69054 -78781
301 -78781 -74325 -39178 -3586 5959 9685 34760 66119 72402 61504 66224 84314 83111 57668
314E7668k1633o907j3467l1753k7322k416N002j3817k2846l763J5527J0340R82
327e4405J4414L4028K5494n81k357K2017K8240M050j2074K42R786r774l1554k1428
341F098R17l770k6314k6286k541P233q483j6733K286K2304J5875J030Q588K6141
355F345K1824J601k028J4939K0173R12j4123n338K930j1248k6614j7242P60l235
369a0344k0632j9361P70P341p041j0560J0555K5843J3748k044N960K2588J7584
382C4407k158k607J5042J6266o424k0746q944L254p710k3011j5606K336j00j7595
396c3596j7681K228J1449M33n113J0462K3682J2129m051K624J8354J5169l66j618
410C4105R598O744j2800k1140o533N025n324j8277j2509j47l356j4864j0245R925
$$ plain form
314 57668 36035 29128 15661 -16092 -43414 -45830 -40828 -54645 -77491 -81254 -65727 -55387 -54405
327 -54405 -39991 -5963 19531 18950 16593 38610 66850 70900 58826 59068 68854 59080 27526 6098
341 6098 7015 3245 -23069 -49355 -51896 -44663 -53146 -69879 -67593 -45289 -29414 -28384 -19796 6345
355 6345 28169 29770 27742 42681 62854 63766 49643 44305 47235 35987 9373 -7869 -7109 -10344
369 -10344 -30976 -50337 -49567 -42226 -49267 -59827 -49272 -23429 -9681 -11725 -5765 16823 34407
382 34407 32249 29642 44684 60950 54526 33780 24836 28090 20380 -2631 -18237 -15901 -16001 -33596
396 -33596 -51277 -49049 -37600 -37167 -42280 -31818 -8136 3993 -58 2566 20920 36089 35723 34105
410 34105 43703 50447 37647 16507 9974 14999 9675 -8602 -21111 -21258 -24614 -39478 -49723 -39798
424c9798J6611J708o527P496J9904J0767l218L086J8436J3485o256r709M935O596
438C7516j0893j9311n980N115m633j8060j2188K410J196r689n644J0293J5020
451a4848K913m468O108J6490Q763k225L664J4657Q091q861j0952J710M294r778
465A5558j5801k775N188p382j8883q960P047N513o435l944J1478J3992m21o083
479a1908P439J7837Q822m184n15J0301N756j0286j2662J007N642o483j4108n669
493i011K478m984j4561o192R496R036l187l924P364J0052M52k133R645J6660M829
508B6020q480l362P603K755r419q345L338L436j0635j5963l043O392k614j1509
522b3826k660J0513P577m898m478Q752J2685J575l630O645J3395L070r159n473
$$ plain form
424 -39798 -23187 -21479 -28006 -20510 -606 10161 6943 10029 28465 41950 35694 25985 30920 37516
438 37516 26623 7312 1332 6447 1814 -16246 -28434 -26024 -24828 -34517 -40161 -29868 -14848
451 -14848 -11935 -16403 -10295 6195 14958 12733 16397 31054 39145 30284 19332 21042 25336 15558
465 15558 -243 -3018 2170 -5212 -24095 -33055 -26008 -20495 -26930 -30874 -19396 -5404 -5825 -11908
479 -11908 -4469 13368 22190 18006 17491 27792 33548 23262 10600 11607 17249 10766 -3342 -9011
493 -9011 -6533 -11517 -26078 -32270 -22774 -13738 -16925 -20849 -13485 -3433 -2981 -5114 4531 21191 26020
508 26020 17540 14178 21781 24536 15117 6772 10110 13546 2911 -13052 -16095 -9703 -12317 -23826
522 -23826 -26486 -15973 -8396 -13294 -17772 -9020 3665 5240 1610 8255 21650 24720 15561 10088
536A0088N544M065p858r156J224K590r044j3572k748O612R18p360j532R279N672
551e278n387k887J0197J2424J381l870M376R307n46j0180l136P854L032r522j0083
566b318K32K602p383j1519R8R445J850q065k724Q505O956l336k707R622J2943
581A4201N05p247N76P307K96p660k413O379J772j0768j1047K75L796m114o689
596a4831J693O742o96p814q53J0250P940k510k096P752Q659k404p152J897Q602
611A5179K29r534m102N655J268j0644r924K420O420k904p901O40P703Q48o840
626a1487r42J0151Q719j650l553M367O873j806o572J302P427N18q390n563K539
641A933O00p880o394M073O051l707p751P88P362J440m815J356J0454O272n088
$$ plain form
536 10088 15632 19697 11839 2683 3907 6497 -2547 -16119 -18867 -12255 -11337 -18697 -20229 -10950 -5278
551 -5278 -10665 -13552 -3355 9069 10450 6580 10956 20263 19717 9537 6401 14255 17287 7765 -2318
566 -2318 -2086 516 -6867 -18386 -18288 -8843 -6993 -15058 -17782 -9277 -2321 -5657 -8364 1258 14201
581 14201 14706 7459 8035 15342 15638 7978 5565 11944 13716 2948 -8099 -7824 -4028 -8142 -14831
596 -14831 -13138 -6396 -7092 -14906 -15759 -5509 2431 -79 -2175 5577 14236 11832 4680 6577 15179
611 15179 15408 5874 1772 7427 8695 -1949 -11873 -9453 -3033 -5937 -13838 -13198 -5495 -4647 -11487
626 -11487 -12429 -2278 6441 4791 1238 5605 12478 10672 4100 5402 12829 13347 4957 -606 1933
641 1933 2533 -5347 -11741 -7668 -1617 -5324 -13075 -12287 -4925 -3485 -8300 -6944 3510 9782 4694
656D694m917N176P309k208o586J366O954q60j0534o114L960K957n883n872L456
671g102N769l293q192L76Q896M444l181j77O843M128m650m264N052P569j321o935
687C962q83L820j836p993l329N014K862o304o063L183N395k678n880K437Q964
702F71L265m816j480O736M486m640m451M979P293k089q304k346M361k28p293l113
718f969N274L308n626o623K096N837k76m022K357P724J914n261j987N681M629
733H056k731l255L360M459l835p921q69N034L67o124k751M281K281o009n410M188
749f879P125k52m617J504O797J513n769k065O702N795l229n237J495L660k922
764C621o842o34N908J579o351m590K795K796l025l128L779O182n67n040L57N852
$$ plain form
656 4694 -223 4953 12262 10054 3468 4834 11788 10928 394 -5720 -1760 1197 -4686 -10558 -7102
671 -7102 -1333 -4626 -12818 -12442 -3546 898 -2283 -2460 4383 8511 3861 -403 4649 12218 10897 3962
687 3962 3079 6899 5063 -2930 -6259 -1245 1617 -4687 -10750 -7567 -2172 -4850 -10730 -8293 671
702 671 3936 -880 -2360 4376 8862 4222 -229 4750 12043 9954 1650 -696 3665 3437 -3856 -6969
718 -6969 -1695 1613 -4013 -10636 -8540 -2703 -2979 -7001 -4644 3080 4994 -267 -2254 3427 8056
733 8056 5325 2070 5430 9889 6054 -1867 -2736 2298 2665 -3459 -6210 -1929 352 -5657 -11067 -6879
749 -6879 246 -6 -4623 -3119 3678 5191 -578 -2643 4059 9854 6625 1388 2883 6543 3621
764 3621 -3221 -3855 2053 3632 -2719 -7309 -4514 -1718 -4743 -7871 -4092 2090 1523 -3517 -3160 2692
780B692K045l655r34N261L130m198m918J714L782k580n816K96N223L1o516l647
796h090L944L864k892l256M133N847j408n697J72O423L185l532k080L911K796
811G320m409n372J562M582o65n083j327L325J46n188k382M367M152j863l274K071
827b038M212q97m001J351O120J943m189k599L072K150l903m078K459M716j750
842B568n965j368L651Q04m172j684M820M337k884m616J565M922N59l121O59M909
858D984J281m822l438K929L354k106l662J002K837j744m885p84L898J564l156
873b748j522L439K782k623l168K294M688J73l238L96L965K75m816k450L622L435
889D504k495m268Q24K999j820m728N1M907K079l491k688K578L159j759k765K420
$$ plain form
780 2692 4737 1082 148 5409 8539 4341 -577 1137 4919 2339 -3477 -3181 2042 2073 -4443 -8090
796 -8090 -4146 -282 -3174 -6430 -2297 3550 2142 -3555 -3383 3040 6225 2693 613 4524 7320
811 7320 2911 -2461 -899 3683 3018 -2065 -3392 -67 79 -5109 -7491 -3124 1028 -835 -4109 -2038
827 -2038 2174 1277 -2724 -1373 4747 6690 2501 -98 2974 5124 1221 -2857 -398 4318 2568
842 2568 -3397 -4765 -1114 -310 -4482 -6166 -1346 2991 107 -4509 -2944 1978 2537 -584 75 4984
858 4984 6265 1443 -1995 934 4288 2182 -1480 -478 2359 615 -4270 -5054 -1156 408 -2748
873 -2748 -4270 -831 1951 -672 -3840 -1546 3142 3315 77 473 4438 4713 -103 -2553 1069 4504
889 4504 2009 -2259 -1435 1564 -256 -4984 -4933 -26 2053 -1438 -4126 -1548 1611 -148 -2913 -493
905d93M729J35l867j244K803J303k902j910K851K500k760m115K41K675m42k828
921c324K34L717J009l773j942L097K868j373j928K276L606j177m384n75L792J476
937C599k959j794K346J674l162m078J087M106K77l271p68K837J006k840j655L171
953d24L580j016k919Q09K747m34l003k31L095J169k786k191J576J432k390k664
969c650J640L248k63l121p70K703R09k368p85L519K772j890l311O38K964K4k811
986e52q7L294O61l589k730J648K389j106k442R84K806o13l249o89K932J812j396
1003G3j075J930J776j695k595J031K845J17k234m95J889N0k915j659K279K266
1019A588j460k251Q29J982q17k673L17L493J666k302j699J726J721j520k052J455
$$ plain form
905 -493 4236 4371 504 -740 2063 3366 464 -1446 1405 3905 1145 -2970 -2729 -54 -496 -3324
921 -3324 -3090 627 1636 -2137 -4079 -982 1886 513 -1415 861 4467 3290 -1094 -1669 2123 3599
937 3599 640 -1154 1192 2866 -296 -4374 -3287 819 1096 -2175 -2943 -106 900 -1940 -3595 -424
953 -424 3156 2140 -779 30 2777 2343 -660 -891 2204 3373 587 -1604 -28 1404 -986 -3650
969 -3650 -2010 1238 975 -2146 -2916 -213 696 -1672 -2457 1062 3834 1944 -1367 -729 2235 2259 -552
986 -552 -639 2655 3316 -273 -3003 -1355 1034 -72 -2514 -1530 1276 663 -2586 -3275 -343 1469 73
1003 73 -1002 928 2704 1009 -1586 -555 2290 2407 173 -322 1567 1617 -1298 -2957 -678 1588
1019 1588 128 -2123 -1294 688 -129 -2802 -2485 1008 2674 372 -1327 399 2120 600 -1452 3
1035CK995k25l218j262J971R66k131j311J887J959j376k663K55K394J66j849J73
1052a266K482R49j972j484J351J676q55j474J208J951j013k787o32K010R19j605
1068e42j015J758J139k041k296J202K699K66j862k11K118N73k302j305K127K238
1084B546q87k079J75J632m59k439l17K323J181j767j607Q79J229j047j474J138
1100i73K355O4k023m52J626M99j458m38J862J517j505k173L81J613m76j628K25
1117i84K091M04k376j588J409J786p50j356J009J954n08k200m42K133J232j356
1133D58j026J263J132j264j947M10J836J75j597l41J379K20j848r70J469J597
1149I46n36j204N59J270o77j628K83K193P44j480j055Q92Q80j367j369J161K014
$$ plain form
1035 3 2998 2773 -445 -1707 264 1230 -901 -2212 -325 1634 258 -2405 -2150 244 410 -1439 -1266
1052 -1266 1216 2165 193 -1291 60 1736 881 -593 615 2566 1553 -1234 -1866 144 1063 -542
1068 -542 -1557 201 1340 -701 -2997 -1795 904 1170 -692 -903 1215 1788 -514 -1819 308 2546
1084 2546 1659 -420 -245 1387 928 -1511 -1828 495 1676 -91 -1698 -819 410 -637 -2111 -973
1100 -973 1382 1446 -577 -1029 597 1096 -362 -800 1062 2579 1074 -1099 -718 895 419 -1209 -984
1117 -984 1107 1511 -865 -2453 -1044 742 -8 -1364 -355 1599 1091 -1109 -1551 582 1814 458
1133 458 -568 695 1827 563 -1384 -974 862 1037 -560 -901 478 698 -1150 -2120 -651 946
1149 946 410 -794 -235 1035 358 -1270 -987 1206 1950 470 -585 307 1187 -180 -1549 -388 1626
1166A626m43k109n48J394N10j448o87J811J532j074j854L67J640R0j355J08J737
1183A297N67j746j321R12J210o06j044O66J182m19j961l91J561O58r66l72J221
1200D48P10j288j379P83J787L2j328Q1J297j8j803p79J556J401r39j487M51J149
1218F74n94j566M0J850Q26j324j031R46J043j016j030Q11J688J4j443m44J031
1235D75K51j200m70J333J071j025j458K06R80j88j025L77J547K17j640q08J021
1252c36J080n69p80P70J329n71j744k42J504N82j048o39R80Q26j264j412M67J637
1270E70L7j163o4J115J62j255p83J284J200m74r43K87Q73m32j290J31J415N53
1288A223j155p73P49M35r32q10Q18J477k24j495j76J093K20j081k33J353J005
$$ plain form
1166 1626 1183 -926 -1474 -80 430 -1018 -1705 106 1638 564 -1290 -923 717 807 -548 -440 1297
1183 1297 1864 118 -1203 -291 919 313 -731 -65 1117 698 -1263 -1654 -93 565 -401 -773 448
1200 448 1158 -130 -1509 -726 1061 1093 -235 -154 1143 1125 -678 -1457 99 1500 561 -926 -475 674
1218 674 80 -1486 -1446 404 1230 -94 -1125 -179 864 -152 -1182 -371 1317 1331 -112 -556 475
1235 475 726 -474 -944 389 1460 435 -1023 -817 163 -25 -1050 -673 874 1091 -549 -1357 -336
1252 -336 744 175 -605 165 1494 923 -821 -1063 441 1023 -25 -664 316 1142 -122 -1534 -1067 570
1270 570 607 -556 -620 495 657 -598 -1381 -97 1103 629 -314 -27 846 414 -876 -745 670 1223
1288 1223 68 -705 44 479 -453 -1263 -445 1032 808 -687 -863 230 450 -631 -864 489 1494
1305A494r89j357L58J258k00j167Q4J389K88j365r89Q02R79n45r86P29J239m60
1323E62j372l28J122O55o64l98R29N82r90j099M49J290j3q86n8Q42L7j395n47
1342a282J198R65o49r27N02Q68n29j214K13J457M85j055o63P82O94q48r94O90
1360c07J394j25j294l44Q85K30r56l98J045R10p11j233K54R43j02p53J50J153
1378G41K32j042p75O52Q47n03o79O85Q40m48j320j50J072N00q47l87Q50N36r09
1397a05r84M47J216M2r58k9R43K12j168o33R43J006m47q47J97Q12l54j107NJ131
1417C22N29p69o53M49M97o09o64N94J130r5j006j96O66J78p55k74R80P76p87r79
1437f66K71Q06j88q21R6J136K74j149p24P00P63m64o27M99R48k02j242k90J036
$$ plain form
1305 1494 505 -852 -494 764 564 -603 -519 870 1158 -207 -1196 -394 585 40 -946 -217 1022 562
1323 562 -810 -1138 -16 639 -25 -423 506 1088 98 -1001 -552 738 725 -161 -219 623 660 -735 -1282
1342 -1282 -84 881 232 -695 -193 675 146 -1068 -855 602 1087 32 -631 151 845 -3 -997 -307
1360 -307 1087 962 -332 -676 209 439 -517 -915 130 1040 329 -904 -650 293 191 -562 -412 741
1378 741 973 -69 -844 -192 655 152 -527 158 998 550 -770 -920 152 652 -195 -582 268 804 -105
1397 -105 -1089 -642 574 616 -342 -371 572 784 -384 -1017 -74 932 485 -362 -165 647 293 -814 -809 322
1417 322 851 82 -571 -122 375 -234 -898 -304 826 731 -275 -471 195 373 -382 -656 324 1100 313 -666
1437 -666 -395 411 223 -598 -502 634 908 -241 -965 -265 498 34 -593 -94 854 652 -590 -880 156
1456A56M98o80l93O48N76o44j012K48J018O6p03j06P25R7r42m67P74Q30l21o95
1476c27J65O92l06q56M0J028L80p42n84N51N03o73o56M67J013l2j001k57P51K28
1496C84p78l60Q90P40n46q67N2P85J3p08L2R27K51p95p09M59N85j62n90L03P15
1517F21k05r87j58Q63K86m99k55N47M27n72q17L00R50l6o49m0O40J01q04n10P04
1538i3P87l92o78K41N55j93r05LQ69N43o42n69M43M57m42o07L35Q55L1p42k77
1559d21N72J07n12j56N15N94m49p11Q3N79l7n34J9Q03J76p30m99M25N80k65n33
1580c94L29P23j95q15l00P40L58m54m00N70M85m89p60J48P68R2n58j66N46J80
1600D08o60m31N93O07j55n45K5M99j06o85m4P27L63m78m19K87K98l67m97L56P27
$$ plain form
1456 156 654 -26 -419 229 805 161 -851 -603 415 481 -222 -328 397 494 -448 -915 -141 689 368 -327
1476 -327 -162 530 224 -632 -592 436 816 74 -510 41 544 -129 -785 -318 695 663 -338 -595 156 384
1496 384 -394 -754 136 876 330 -537 -485 300 313 -395 -363 564 815 20 -689 -230 355 193 -397 -94 621
1517 621 416 -571 -729 134 420 -79 -334 213 640 68 -749 -449 501 465 -184 -224 416 517 -287 -797 -93
1538 -93 694 302 -376 -135 420 227 -678 -675 194 737 95 -474 -31 426 -16 -623 -288 567 598 -144 -421
1559 -421 151 258 -254 -410 105 699 250 -461 -378 201 164 -370 -351 452 628 -102 -601 -176 404 139 -394
1580 -394 -65 658 463 -352 -652 88 446 -8 -408 162 647 158 -602 -454 314 406 -152 -318 228 408
1600 408 -252 -683 -90 517 362 -183 -158 341 235 -450 -494 233 596 118 -301 -14 284 -83 -580 -224 503
1621E03L1p40j36M58J27m88k16N49N71l12p78R7O14j15m43j0N83L01o04n21L04
1642b25M81j62l63J79N68j21o72k52N19M40l35k97L90K91l83n06R8N99J43m98
1662a06o5L93Q3n75k74L57N95j78n35J81L83o9o35j8O46L18l96l81J92L35k28
1683B3m63K35O62L7n56k27L30J62l54k62M63M65k94n20k1M02N1l14j5M77J85m51
1705A5l43K12L59j83k39J68M16r1n84j60M53K52l20j71L13K96l15m71K3O14N1
1726B95l87j23N17L9m59l44L44M82j39l52J5L34j09m46K0M33L28l23l42K02J59
1747A44j97k38J61M62J1l70j83K97R8l64j26L58L98k87m46M5L58o1k92J7M81J25
1769C91m33l47K12L39o5l16K03L83r4m66k01L87K26j26k58K42K44k58l72OM86
$$ plain form
1621 503 534 -206 -342 116 243 -245 -461 88 659 347 -431 -334 280 165 -278 -288 295 596 -8 -529 -225
1642 -225 256 94 -269 -90 478 357 -315 -567 -48 392 57 -240 150 441 58 -448 -350 249 392 -106
1662 -106 -171 222 305 -270 -544 -187 408 230 -305 -124 259 190 -445 -463 183 501 105 -276 -84 251 23
1683 23 -440 -205 457 494 -62 -289 41 203 -151 -413 50 515 221 -299 -320 82 133 -181 -196 281 466 15
1705 15 -328 -116 243 60 -179 -11 405 314 -270 -430 23 275 -45 -216 97 393 78 -393 -370 244 295
1726 295 -92 -215 302 341 -118 -462 -118 364 225 -127 -112 222 113 -333 -313 120 448 125 -217 -15 144
1747 144 -53 -291 -130 332 343 -27 -210 87 185 -179 -305 53 451 164 -282 -237 121 60 -232 -215 266 391
1769 391 -42 -389 -177 162 97 -219 -16 367 273 -193 -394 -7 219 93 -165 77 321 63 -309 -303 183
1790A83K4k04j42K64J14l36k08J76M46j93k28R9J55r7k93o1M05K65k39k29R3K26
1812B20k33k68J86M08L7m39j02J89J06k06j67L18K73j41l72m3L11kk39L4K99J70
1834C39l69k50J65K45j27j67J04L26j19l55j11K70K21j54j69K54J85k45l41J07
1854a91L30M9k25m8K79J5l12k20K58L24m3l01K3K37k3l87oL17K34k07k78J76J83
1877A84k08k19R8L65M8l25j36K07Q5k65j6K56J69j25k62OJ95k4j95R7K10J46l17
1900b6k64J67K07r0j50K13K48j26l79q8L08J70j70j29K23J67k31l08Q8L10L3k30
1922e7M4J01P8k45j32J71K05pk78R7J87q7l21N8K62J71j97j58R0J06j67j66J30
1945a15L22J3k56j08J48J05k04j79L74J75j89k71Q0J60n2p7nK53O6k83j86R7K04
$$ plain form
1790 183 207 3 -139 125 239 -97 -305 -129 317 124 -104 -5 150 53 -240 -301 104 369 130 -99 -6 220
1812 220 -13 -281 -95 313 350 -89 -191 -2 104 -102 -269 49 322 181 -191 -234 77 75 -164 -130 169 339
1834 339 -30 -280 -115 130 3 -164 -60 266 147 -208 -319 -49 172 18 -151 103 288 43 -298 -191
1854 -191 139 188 -37 -85 194 209 -103 -323 -65 259 216 -85 -62 175 152 -235 -241 76 310 103 -175 1 184
1877 184 -24 -243 -145 220 268 -57 -193 14 99 -166 -182 74 243 118 -144 -138 57 33 -162 -65 145 291 -26
1900 -26 -290 -123 84 -6 -156 57 305 179 -200 -288 20 190 20 -109 114 281 50 -258 -170 140 173 -57
1922 -57 -13 88 166 -79 -211 -40 165 158 -120 -23 164 77 -244 -186 76 247 50 -108 -18 88 -79 -245 -115
1945 -115 207 220 -36 -144 4 109 -95 -274 100 275 86 -185 -105 55 3 -74 -79 174 240 -43 -229 -132 72
1968G2l6j31J43J73j07k40p6K17J16j13k9J10P7j10k56N6K32J9j53J3J53j2k68
1991a50r2J41K64o2j73L4J58p7k61O6K40J53j82k08J05J72k00j76J69K73K1k27
2013a2n4O8O5k07j2J70K04r2k49J6J45kj66J21K02j5j82j48Q9J57q1r4Q2J60n1
2038A14k24r4K04O5j09k4J35R0j69j83N5K00L3j72OJ85J2k09j35J77K00o4j41
2061d8R9N0l3k32K7K36O2q8j37M9J32j71r2Q6K43m4j32r5J55k3j36p0J93J56k7
2086A60k35j5J71o8j23L7K05L5j99j24R8J64n5j37J18Q7J8k69n6J60O7p2p3J60
2110E4J31k11j36Q0J13L0r7M7R6k3j78p7J72J14n8j25N3J46r5j70rK13J51k30
2134ip8J18L2p6j80J28K14J5k25rQ8M8j23n8J23J84j14j70O4L9Q5j48j4J63O3
$$ plain form
1968 72 36 -95 48 221 114 -126 -202 15 131 18 -11 99 176 66 -190 -134 98 117 -36 -23 130 118 -150
1991 -150 -242 -101 163 101 -72 -38 120 43 -218 -152 88 241 59 -149 -44 128 -72 -248 -79 194 215 -12
2013 -12 -66 2 67 -140 -152 18 222 130 -119 -103 42 40 -126 -5 197 182 0 -148 -59 98 17 -77 5 165 114
2038 114 -110 -204 0 65 -44 -68 67 157 -12 -195 -140 60 93 -79 -73 112 124 -85 -220 -43 157 93 -48
2061 -48 51 101 68 -164 -137 99 161 73 -64 -15 117 -54 -146 -60 183 139 7 -88 67 44 -92 -162 31 187 160
2086 160 -75 -90 81 13 -110 -73 132 167 -32 -156 -58 106 51 -86 32 119 137 -132 -188 -28 39 -33 -106 54
2110 54 185 -26 -162 -82 31 61 -36 11 107 84 -94 -171 1 115 57 -68 -15 131 36 -134 -143 70 221 -9
2134 -9 -87 31 63 -13 -193 -65 149 164 -61 -70 18 66 -57 -115 8 192 78 -92 -28 11 96 -52 -66 97 160
2159A60j54q3oJ32j43nP6J42o8j08n5Q7J32j14n0Q4J12j21j54J2K02l2n6RR0J0
2185I9j72j08J40J70n0j41KJ23%j63K2J66L6j09j04P4P8p5q9O9J28L0j22r4J03
2210A3rm0o1J66N4p5j02n9J30J1p5k7J96k0j46j11Q6J32o4q7N3K13q9j28j09J09
2236c9R5p9l2J47N2q3j98QK24K4j64mP3M1j44n1N4K22o1j52R0Q3l9j60J3Q3J32
2263A35r7j10K8J28q1q3k0J85K3j44o6R3P4p9q8J02J54j60p5M4K3Q1j01o9J61
2288E8O4j33r6L6J73o8p5N4R3lj48o9Q9L9O4p2L0Q9q4j21k2J66O5j22m0J23j6
2315G4r5r5N2K20j19l9L0K6Kj68pJ24J13j24p4P6J11q9j30O1J30L6j04k9QK6j12
2342i6K0O0J22l2r2o6J53l2j01n2J50N8r5m6L7J4l4J0N6R2o0j43L2R0K2n4o3J01
$$ plain form
2159 160 6 -77 -83 49 -94 -99 -23 119 51 -57 -112 -25 107 -7 -57 27 139 18 -136 -124 78 46 -10 -1 89 99
2185 99 -73 -181 -41 129 79 -62 -60 63 63 -100 -78 88 124 15 -89 -15 63 -12 -101 -32 96 126 4 -90 13
2210 13 4 -36 -97 69 123 48 -54 -113 17 28 -47 -74 122 102 -44 -155 -69 63 -1 -88 -35 178 89 -39 -148 -39
2236 -39 56 -23 -55 92 144 61 -137 -129 95 119 -45 -49 24 65 -79 -130 -76 146 85 -67 23 106 67 -93 -80 3 135
2263 135 38 -72 -44 84 3 -80 -100 85 108 -36 -102 -9 65 -14 -102 0 154 -6 -81 -37 -14 67 -34 -103 58
2288 58 122 -11 -107 -71 102 34 -41 13 106 103 -45 -114 -25 14 78 6 36 125 41 -80 -102 64 129 7 -33 90 74
2315 74 -21 -116 -64 156 37 -2 28 54 56 -112 -119 5 118 -6 -80 -4 107 18 -112 -51 79 115 11 -18 -10 16 -96
2342 -96 -76 -16 106 74 -18 -84 69 37 -64 -116 34 92 -3 -49 -12 2 -32 -22 34 126 66 -77 -45 45 67 13 -50 51
2370E1qj8q4n0J82n7n7jQ4qp3l1K0Q3L9j28N6K3q6j7J6Q3K9k5m6J4K9l2l1j8J33
2401G2J8j17mM6n1m0J0J12O9m0o6o5O7k0Rk2P4L3q8o1J2P0qk3J9J01m1r7j0J6
2431b5J29j10L5m9P7l2r4JP9K1m7M2K6Kj30NM0R6m8o1K5Q3p4o1j9R5N8q4m5Q9
2461B4Qn0j7j1J10k5o0J4k0Q0n1q1O9J07l0p7NL6j7m2k6J28Nj9j01K7L4p6M1K7
2491A2N0l0q2J6l1N2ll7L2P5l0o4k4R8%r7L5R6qq8m5L7R9p9j6N1J3j6p5J8Q2J8
2523E9l1o1JN5Kn9L9M0Qo1rL1j9j4jO0LJ8o3Ql5N5m9m1Q0L0n0n1P7l6lRM7J7n4
2558Bnm1P7Kjm7K6Mj4n9J4Q0pm5L2j3P4r4k7O7M7m0k5qO3r1K7%K6N9n3j5kkm7
2593c6P6o2N5N3o1j13J17j2j03O6M1N3m7n4J5K6j5o4K8K7Npl2oM2N1n7L8k5K9
$$ plain form
2370 51 43 25 -59 -109 73 16 -41 -42 42 34 -39 -70 -50 33 72 -56 0 23 -63 -80 -64 19 48 23 -23 -9 20 -12 -43 -61 72
2401 72 90 -27 -31 15 -36 -76 -66 46 115 75 9 -56 11 -9 0 -22 52 85 -3 -64 -52 18 10 -13 6 107 66 -31 -41 -25
2431 -25 104 -6 29 -20 57 25 -69 -68 11 32 -15 27 53 55 -75 -70 -30 66 18 -43 -18 65 -9 -70 -89 6 64 -20 -65 24
2461 24 32 -18 -35 -46 64 39 -21 -7 -27 53 2 -79 -10 97 67 -10 -5 31 14 -28 -54 74 79 60 -41 -14 20 -56 -15 12
2491 12 62 32 -50 -34 -65 -13 -16 -53 -21 54 24 -40 -64 34 34 -63 -28 68 60 -28 -73 -36 63 -16 -32 19 32 16 -59 -41 41 59
2523 59 28 -33 -32 23 25 -34 5 45 53 -8 -17 14 -5 -19 -20 40 43 61 -2 6 -29 26 -23 -64 16 46 -4 -55 22 -14 -17 -8 39 56 2
2558 2 -3 -44 33 35 34 -13 13 17 3 -56 -42 38 31 -14 18 5 79 -15 -42 25 72 32 7 -1 62 -29 -2 -2 24 83 30 15 13 11 -36
2593 -36 40 -22 33 86 25 -88 29 17 -86 -20 21 74 27 -27 -12 14 -1 -65 -37 -10 -5 -12 -44 -50 -8 43 -14 24 -1 28
2623B8p6j7j3R6mn1J14m0j3j00M2M3J3nl4R8o1k5qqM6rn7O6o3K9l5N3j3M8n8o1
2655g5Q6J7J7l5K6oK9m0p1P4l2L2q7O1Q5o7o1M6KM6q4P1oJ5J4j52P1O4Jo0lR6
2687G4m0q5m8J01L1m2j6oM1J4r1K9K1P0j04N1L7J9n1n8Q9PKj21J17l5l0OJ7jK7
2718B5J2q4N5k8l5k0O9O2o9m0K5J2N3p1oN9K3m9m3L5J4onQM4M0j13rL2l5L8Oj5
2751a6M8J7r5LJ4M2k4KOkj9Rl6M1K2k0K4N6n8Pj4J7j9L0l0j9J4pm1JK8N9k8Nj7
2786@J5l5m0%O0M3m2n7N7M1n5LK0M1j3n1Oj5O0q6QR5m2llM6n0j8K5K7J5Po0j5
2820a6J7k1m6M6K3M4o6L4j5k0L8k0l0j9Q6o1j8M6%o0R4m2l6N7o5j9Q8LNJ9r2N6
2852A0j4n8N6L3k7j4J4K1m1j3L7l1P6l2K9l0j6M4k9j0J3Jl5PK3k7M9k8j1K1j6
$$ plain form
2623 28 -48 -65 -78 18 14 -37 77 37 24 -76 -34 9 22 17 -17 81 20 -5 -13 -21 25 16 -41 25 -38 -9 -44 9 -4 44 -14 -75
2655 -75 11 28 45 10 36 30 59 19 -52 22 -10 22 -65 -4 81 14 -47 -1 1 47 -37 34 28 43 57 -95 -24 40 41 -19 -22 74
2687 74 34 -51 -99 2 33 -9 -25 -31 10 24 -67 -38 -17 53 -51 0 37 56 5 -53 36 43 45 -76 41 6 -24 -18 -1 -2 25
2718 25 37 -47 8 -20 -55 -75 -6 56 -13 -53 -28 -16 37 -34 -40 19 42 -7 -50 -15 -1 -7 -12 -4 40 80 -33 -42 -10 -45 -7 -1 -16
2751 -16 32 49 -46 -43 -29 13 -11 -9 -3 -5 -24 -15 -51 -10 12 -8 16 72 14 21 7 24 5 35 5 -14 0 -7 -48 -47 -19 40 12 17 0
2786 0 15 -20 -60 -60 0 43 1 -56 1 42 -13 -10 10 51 38 -13 -7 -22 38 -48 -40 55 13 10 7 53 3 -15 10 37 52 59 -1 -16
2820 -16 1 -20 -66 -20 3 47 -19 15 0 -20 18 -2 -32 -51 35 -26 -44 2 2 -58 36 -6 -42 15 -50 -69 19 22 27 46 -46 10
2852 10 -4 -62 -6 27 0 -14 0 21 -20 -33 4 -27 49 17 46 16 0 44 15 5 18 19 -16 -9 14 -13 36 8 -3 18 2
2883Bj1l8JJ00j0o7N6oK5o6p1J34k7lnk3J6k1l8P7n0J8lm5O5qn4J5M7N8m9j5K1
2916B5k9lj9N5mM4o8K5J6k3ml2M7kl8K4l8L4qk5L9L6l5q1M7m4R9Kl0o5J35r6N
2949a1qRn1Q7J6q6N8L1j08N8j7K5%m2J19j3o2j7k2O7j9j8RKk1JJ7jM1l1k0k1L2
2982DQm0N8O5o1J4r7R6l5p3O1J2M4k9l6j9mK4k8O7k5MM4j21Q4n2N6j6k7%K3ol6
3015d1M8l1OOj6L4N4j18K6K5K3l6L4K7%l3m1N9rn0N8n5P2k2j9rjM1ol1rP0q1j
3049b6M2k6M5j7l2j8N8l7m4O9nl5J0l5k4N0O3n8O7r7M6ql9P6k3J3l2L9K2l9k4
3080a9Mj2M1K1l1J8k6K1j9M8rl8K5K1Jl3n7M1J9j9J4M2Pn8j6p%M9j2p0N4PK3n8
3114b8M2n4JK6J5l2N4l8J5j2j0L3n8L6J6l9M0j3M8Pn3j9LN4k1j9J9LLj7m2L2p
$$ plain form
2883 2 -9 -47 -46 54 44 -23 33 27 52 -14 -85 49 22 19 14 -9 7 -14 -52 25 -25 -7 -10 -55 10 2 -52 -37 10 68 19 4 25
2916 25 -4 -7 -26 29 25 69 1 26 42 19 15 -17 30 28 -10 14 -24 10 2 -23 16 52 17 -64 -17 -61 38 40 10 -55 80 -16 -11
2949 -11 -19 -10 -61 26 42 -44 14 45 -63 -5 -22 3 3 -39 80 67 5 -12 -34 33 14 -4 5 7 -14 -13 4 3 44 13 -7 -28 4
2982 4 12 -28 30 95 34 48 -49 47 12 -61 0 12 56 27 -9 -28 -32 -8 -36 31 6 10 54 -67 17 -35 21 5 -22 -22 1 -5 -41
3015 -41 7 -24 -18 -12 -28 6 60 -58 -32 -7 16 -20 14 41 41 8 -33 26 17 -33 25 -30 42 20 1 -8 -9 32 26 -5 -14 56 -25 -26
3049 -26 16 -10 35 18 -14 -32 26 -11 -55 14 9 -26 -16 -51 -75 -25 38 -20 47 -50 -4 -12 -51 25 2 15 -17 22 44 5 -19
3080 -19 -15 -27 14 35 4 22 -4 17 -2 46 37 -1 24 45 46 13 -44 -3 16 -3 11 53 60 2 -14 -21 -21 28 16 -54 0 7 30 -28
3114 -28 14 -40 -39 -13 2 -30 24 -14 1 -11 -21 12 -46 -10 6 -33 7 -6 42 49 -4 -23 -20 34 13 -6 13 16 19 2 -40 -8 -15
3147a5PL9l1rJ4K4l3J4J2j1J4J4j2j6j5J6m0L5J4m5OO0q1LJ0K0j6K2j0L1l3N0
3179C8m7N6j5l6k8N5j2Lk3%N4qm9M1j2l9L9PPm4M6j3o2L9qj3K5KP4k7o0pK5l9
3213c1K4M5k0J2lp9M8K1oj8P2j05N2On4M4l7JL8K6o2J0J8n1RK0J1Mk7L5Rk3M7
3246C6m1Lk2K3J2K2o8N6J3Ok2L5m3j4j6LM1J3JKr5K1M0rQJ8n2M4j3ONJ1n8L8N
3281Il1k9K5K7Rl2L0k3L0l6kL5K3o0N3o6N8J0n7PlR8q8l0L9nJ9PJ9k0nk4mJ8j4
3316a3L5qJql3PJJ3kk0j4j5J24n6k8L5k2k8O6m1J9QJl7J2j4K8k3NJ6olj0N4n4
3351a0J3Nl7M4j2qJ8J7K3j1m3j8J4L1n3N9l0J7j4j7K7J6j5M9o3L2m2RJ1k5R%P
3384CKm0L9l6J9Pkm0L0L2j3k1l2O6m9J6J1l8J1J6L3k7m4N0pL4l6J2J7m2N2j9k
$$ plain form
3147 -15 -8 31 0 -9 5 29 -4 10 22 11 25 39 27 11 -4 12 -28 7 21 -24 -18 42 -39 -36 -26 -6 -22 0 -10 21 -12 38
3179 38 -9 47 32 -4 -32 23 11 14 -9 -9 45 37 -12 29 17 -22 17 24 31 -13 33 20 -42 -3 -11 -24 1 3 77 50 -10 -17 8 -31
3213 -31 -7 38 18 30 27 -52 -4 17 11 -7 65 -40 12 18 -36 8 -29 -28 10 36 -26 -16 2 -49 -40 -20 -9 -5 -32 3 12 -11 36
3246 36 -5 -2 -24 -1 11 33 -35 21 34 40 18 53 10 -4 -20 -17 24 37 38 40 -55 -34 6 -3 5 23 -29 15 2 8 13 24 -34 4 9
3281 9 -22 -51 -26 1 10 -22 8 -15 15 -21 -23 12 35 -25 28 -38 20 30 -27 -20 -23 75 -13 -43 -4 -9 10 17 36 16 11 -13 -17 1 -13
3316 -13 22 14 15 7 -26 -19 -18 -5 -7 -27 -41 -56 68 12 -16 19 -3 -31 35 -6 13 21 22 -15 -3 -17 11 -12 -7 9 3 0 -10 44 -10
3351 -10 3 8 -29 15 3 -5 13 30 53 42 -1 -19 -5 26 -27 32 2 19 5 -12 15 31 16 65 2 34 -8 1 12 -13 -4 -4 3
3384 3 5 -35 4 -32 -13 -6 -8 -48 -18 14 1 -20 -52 14 -35 -19 -8 -46 -35 -19 14 -13 -57 -7 -14 20 -16 -4 13 -29 23 4 2
3417Bj9%k4J0N0j6J5l6J3L2l3n0Q1o3N9rj8K9k2l1L2M5%k8j8k5O7q0K0J3l6M7
3449GrL3j8n9L8jJ5m6O2n0O3n9Pl2K5L1n5Q6o7L0nj1O6l4j2L2k6lLj0k6j0N0k
3483A3l0L9l4K2l2N6k6kmj8K6j0K0j8K3oL3p4QK1K5j9pN3k3m6k7Q7n1m1K7Qj6
3516b3oJ9p%L4L4Ln6l5jJ3Q2n3j6J1QRJ0J2m4ON9o0K5k9L4k8qj1M9m5L0L%L6l9
3552A6l4K0nJ3Rm4N3m1J7M6l8k2M4K4j7k5k4m9N7M6o1L2K0K9p7k5K9M9n6M2l1
3583cL0j8n3J5M3m0PoK3N2k8j0K0L0p7K0rj7P1n9J1l2J3L2n1J01j06J6M1rl4K9
3615Bql5L3k5N5k7kk1M2j6K2m8N0Kp4P5o0K2M0J0j4k7K7k1mj0K5l6M6j8lM9o5
3648a4J1J6j5%M0k5K8l6QPj7K3lo7N6j8l4O3j3L3m4J0m7K3j3j3J03j01j4jN3j1
$$ plain form
3417 2 -17 -17 -41 -31 19 3 18 -18 -5 27 -6 -56 25 -38 21 12 -6 23 1 -30 2 47 47 19 1 -24 43 -37 -17 -4 -40 7
3449 7 -2 31 13 -46 -8 -9 6 -40 22 -28 35 -24 -17 -49 -24 7 -48 38 -29 1 -4 -15 51 17 5 37 11 8 11 1 -25 -35 15 13
3483 13 -17 22 -12 10 -22 34 8 6 2 -16 10 0 20 2 25 19 52 -22 -14 7 32 13 6 59 36 -10 -37 50 -1 -42 -15 -7 -23
3516 -23 -29 -10 -17 -17 17 51 54 -2 -37 -38 -25 57 4 -12 -1 7 16 26 38 -6 0 59 -1 24 -5 29 1 -7 -18 31 -14 16 19 19 55 16
3552 16 -18 2 -3 10 19 -25 28 -13 4 50 12 -10 34 58 41 16 -8 -57 0 46 -15 17 37 66 -11 -36 -7 42 -14 28 -3
3583 -3 27 9 -44 -29 14 -26 -19 -25 -2 50 22 12 32 62 -15 5 -4 -21 50 -9 2 -30 -17 15 -36 65 -41 -25 16 7 -27 2
3615 2 -6 -41 -8 -33 22 -5 -7 -28 14 -2 20 -28 22 24 -50 25 -35 -13 27 37 23 -4 23 2 -2 -12 13 -23 23 5 2 51 -14
3648 -14 -3 13 -2 -2 38 13 41 5 13 20 3 26 23 -44 12 -6 -40 23 10 43 -1 9 -38 -15 -28 -41 62 -39 -53 -54 -1 -12
3680a2L5n1K7L6pmn2L5j4J6o5O9K0k6l7N1m1M7l1J2m6K8M4l5M8l7j2K4k9P4o4
3711CK1j5mJ8p5M0M4kJ7n5o8J6Q4n1J05r4j2N5n5M6k6Ok1j6O2nQK1q4j3K7J3M8
3744C8q4mK5J4mM0k8m0P0n9K8j3L3j7J6m1J3M4q6M7l4P0n4N2K2n9K9J5l6PMJ8
3776B6k2mK3m1N7l2K7l3J0j4m0K7K4j0%l5M9k1l2M7K1o1M5mrL4j4NJ1J8k5k7m7
3809d7K0j6O0oKll1M1Qo0J1K5J4LPk3J8j0k4k9OM4jQo7K3L2Nl8K0%m0K5LJ9l7
3845c8M9l6K3rPk7k0N8n8O5j9M5l1Nl4N4m2K8K2J0p1L8l9N5j2K3j1k0Jj1J7k5
3877cL8n3N1l3j2M0j9LJ0l1K9k2l6N8l5l1j2rPP5n2M3j7k8K0l2M4j4l1Q3k1K4
3909C4j08P0k9L8mL6k7jJ7k4PKl2nM2jj2LOk4J7k8P9n4nplj2O5m0j4j0j4j9Q0
$$ plain form
3680 -12 23 -28 -1 35 28 24 -28 7 -7 9 -56 13 33 7 -30 21 -20 27 -4 8 -38 -10 34 -1 47 10 -2 22 -7 67 3
3711 3 24 9 5 23 -52 -12 32 30 47 -8 -76 -60 24 -27 78 -16 -28 27 -28 18 -8 -2 -23 -39 23 18 26 47 -37 -50 -23 -10 38
3744 38 -46 -50 -25 -11 -15 25 -3 -43 27 -32 -4 -17 16 -1 15 -26 -13 31 -55 -8 -42 28 -26 26 48 -11 18 33 -3 4 8 26
3776 26 4 0 23 -18 39 7 34 1 11 -3 -43 -16 8 -2 -2 -37 12 -9 -41 6 27 -34 11 7 -2 32 18 23 34 52 27 0 -47
3809 -47 -27 -43 17 11 13 10 -21 20 28 -32 -21 4 18 21 28 5 23 13 -11 -40 -34 10 9 17 -50 -27 5 10 -28 -8 -8 -48 -23 -20 -1 -38
3845 -38 11 -25 -2 -11 -4 -31 -51 7 -51 14 -5 40 9 14 -20 34 -8 20 42 52 -19 19 -20 35 23 46 35 15 16 5 22 -3
3877 -3 35 -18 33 0 -12 28 9 12 22 -9 20 -2 -38 20 -15 -46 -58 -67 -60 15 -37 6 -11 -39 -19 -51 -7 -21 -52 31 10 34
3909 34 -74 -4 -33 5 1 37 10 9 26 2 9 11 -21 -26 16 15 3 6 12 -12 5 -23 56 2 -3 -10 -13 -25 40 0 -14 -24 -38 -57 23
3944B3pPRn4N2K0k9qPK6k3M4r0k4L1kK6j4Qj2nkP9r2k7R4k5N5j16N4L1m0j3l3
3978e0J10l3o2M8j2m6NM8M8n5K0j3l5M3Ll8N2pq3O2O5j11JO4Npj5J3q7J18m8k2
4010a9l0O1l7J1m2N1K2l3O9m7K4K1l9k8MM0k7pMJj2%O4m8n1N9j4K2rMK6k3j7M8
4044D8n0K6J6rN0j01M4Pk9QPl6k7J9M6nm2j4rO7m0QK7l0l7P8l9L6l8KL7l7l6N8
4078Ej1PM2j7l8J3j5n3O4j7PK8J4o0M5j6j2j1MJ7K1nj5J9p6R2k8J4j4K9l4Rp0
4111f2O2K6j5k1JL6o0K3k4jJ3J1J0J5k0pJ7L1q6kM4k4J8K8J2kJ4p3N7j4J8n9j
4144c5N1k7K4k8L7K8m0k6jL3L7l6k8J4J6K4l9M3o7K6k6N3n2l8P8kj8j5J6j1mO1
4176D8j07O3OJ5Oj11J10j9l7L5K6k1K8m5L1k9n7K4N5l9M0j5k0J5m6N5k0oK1J3
$$ plain form
3944 23 16 23 32 -22 30 50 21 13 20 46 23 67 -23 -47 -16 -18 8 -6 2 -10 -15 -17 62 -30 -57 37 12 67 -49 5 36 -4 -17 -50
3978 -50 60 27 -35 13 1 -45 -40 8 56 1 21 8 -27 16 19 -19 33 26 -57 5 70 -41 -40 24 29 22 7 20 -67 51 3 -19
4010 -19 -49 12 -25 -14 -56 -5 17 -16 53 6 30 51 12 -16 -12 28 1 -6 -2 -1 -13 -13 51 3 -48 11 -3 19 10 14 40 17 0 48
4044 48 -2 24 40 31 81 -20 24 31 2 10 17 -19 -46 -27 19 14 -28 -42 -51 16 -24 -16 11 -19 -56 22 -17 19 -19 -17 20 -17 -53 5
4078 5 -6 1 43 26 -12 1 -14 -67 -3 -20 -13 15 29 -31 14 -2 -14 -25 -21 -4 17 12 -3 16 -60 32 4 18 4 33 -1 8 -62
4111 -62 0 26 11 -10 -9 27 -33 -10 -34 -35 -22 -11 -1 14 -6 -13 4 35 -51 -53 -9 -33 -15 13 25 23 37 -36 21 7 25 -34 -35
4144 -35 16 -11 13 -15 22 50 10 -16 -17 16 53 17 -11 3 19 43 4 47 -20 6 -20 33 -19 -57 21 19 1 -14 2 -9 -13 48
4176 48 -59 4 10 25 31 -80 30 11 -26 9 35 14 42 -3 28 -1 -58 -34 21 -18 22 7 -13 2 -44 11 -9 -15 6 19
4206A9L4qn4K3l1m4R8pPlo0R9k4r0J0RN3r2K0J18r4J1M1l3k4oMQj0O2o9K2O1n5
4240epm5L2JMk0L9J1NOk0j6N1n5J8l2K9L3j6lqom2O1rJ1j2kM9l5j6N2m1K9k9k8
4276a6K9k7O9rl9l5M0J7m0K9l1j2pLP3o2O6o9L9m3K4Rl3m6R1o7M2NL2k6J6j8l1
4309b7O3J2o6K8Lj3KOJ9l4j4O5n4L3J5j7j5J1j3%j4L1M1q1J1n3J00o9J9mMk9Q5
4342D5o3M1l7K0M3n4K4kk4J5n4Pj4K8PNj9L7%n0L9PM0k9K0om1j1M2j2O3n2l6O0
4376C9j2l9m2P1K8o4N1pJ1m7Pk5M2K6j0o9QkK5J8J4L8q3M0o1O0l2j9M0o9Q5j5
4408GrL8r0J1K6lK0J5n8K3rK4L7k2jj9K2k5J0L6l4J3j9K7K2o3O4m7j2P2m4LJ7
4441C2o2M4L3p0RO1n4L5lK2k7l9K2O%%Pm2k1K4kNoJ4j6%K1MqJ9J5l1K5n3K3j4
$$ plain form
4206 19 53 45 -9 14 -17 -61 37 30 37 34 -26 73 49 -41 -31 -22 31 -61 -41 77 -17 -6 35 2 -22 -28 -24 -16 -26 36 -33 -11 50 -5
4240 -5 -12 -57 -25 -24 -20 -40 -1 10 15 21 1 -15 36 -19 -1 -33 -4 29 13 10 2 -4 -46 15 6 17 5 3 52 17 1 53 12 41 12 -16
4276 -16 13 -14 55 46 7 -28 12 29 -11 18 -13 -25 -32 -29 44 -18 48 -21 18 -25 -1 8 -25 -71 20 -47 -5 0 32 6 22 4 -27
4309 -27 36 48 -18 10 13 0 2 8 27 -7 -21 44 -10 23 38 21 6 17 4 4 -10 21 62 -19 -8 -61 39 -30 -11 -15 -11 -40 45
4342 45 -18 23 -14 6 49 -5 19 17 -7 8 -46 -39 -53 -25 -18 -13 -32 5 5 -45 -6 1 41 12 32 26 -15 -26 16 4 67 15 -21 39
4376 39 27 -12 -54 17 45 -19 32 25 36 -11 -4 -29 13 39 29 -40 -32 -34 -9 9 23 61 -22 18 -43 17 -15 -34 6 -63 22 7
4408 7 -2 36 -54 -43 -17 -20 0 15 -43 -20 -29 -5 32 10 9 -10 12 -13 -3 33 -1 12 -7 20 42 -21 43 -4 -16 56 12 15 32
4441 32 -30 14 47 -23 -14 47 -7 28 25 47 20 -19 3 9 9 9 16 -26 -47 -23 -25 -20 -26 -12 -28 -28 -7 -3 -11 8 23 -8 17 -36 -13 -27
4477b7jJ5N1J4k8Jk8l2K1L7j8N9p8%J8l8P2Ln1M2qk8M4mn1N1n2pk2P1j8J1k8J9
4511A0M6q3J2m0QK7l8Q7k3jj5K4m9N1k7K0j6pJ2lmj9N5l2M4m2N2m9j7M9j3l6J9
4544BM8n2J3m9J9JK4lJpL1m4l2M3k9RM7n7O6Mk0l8l0O8l8K7j8O2m7mj9k2Q2m1
4578ck3J0J0J2l8L6l1KLN1K3j21Q8qNj6l3L6NJ9m5M3lL5o7k0J4M7l4k2L6jpJ1
4612A4j4oj1LL7j0Nj0K4m2K5K0o0L3m7M1Rnj5K5n8O1k4J4ln5R4o7L4k9PkJ1Qo
4647Aj5K6j5n8O2n3P1m3M8n6M9K6j7J0n4M5j9%k9M1m0K9J2k3L3p4J5N1k0J7lk4
4679gj5O2k2pPn3O1m9N4l3Km1M5j1k5O0q6O6J9m8J4L1j6j0J3J1j4Nn4N8j0L4m5
4712dl3L8N5ol8rk2K5J9j3K4mr6Q0l2O9k6o4knK2L1k0j9N0L7n7M8q8M7o1L2J8
$$ plain form
4477 -27 -28 -13 38 52 24 25 -3 -35 -14 23 5 64 -14 -14 4 -34 38 41 -10 32 24 -4 40 36 -15 36 -16 -23 -45 26 8 19 -9 10
4511 10 56 -27 -15 -55 -47 -20 -58 29 6 5 -10 14 -35 16 -11 9 -7 -14 -2 -5 -9 -28 27 -5 39 -3 49 0 -17 32 19 -17 2
4544 2 50 -2 11 -38 -19 -18 6 3 4 -3 28 -16 -48 -5 -34 -25 22 -35 31 35 15 -23 -53 15 -23 4 -14 48 1 -3 -22 -44 38 -3
4578 -3 -26 -16 -6 6 -32 4 -27 -25 -22 29 52 -69 19 11 16 0 -33 3 8 27 -18 25 22 57 -10 -30 -16 31 -3 -25 11 10 3 14
4612 14 0 -6 -17 -14 23 13 18 8 32 -10 15 35 -25 8 -39 2 11 6 -9 16 -42 19 -5 9 6 -49 45 -22 12 -17 -10 -12 -1 7 1
4647 1 -14 12 -3 -61 1 -52 19 -24 24 -32 17 43 26 36 -18 27 8 8 -21 20 -20 9 21 -2 31 -43 -28 23 3 20 17 -7
4679 -7 -22 40 18 11 18 -35 26 -23 31 -2 0 -41 4 -7 -32 28 -58 8 27 -21 -7 24 8 -2 11 22 8 13 -41 17 7 41 -4
4712 -4 -37 1 56 50 12 3 -19 6 25 12 36 32 -64 16 -16 53 27 -37 -39 -44 -22 9 -11 -30 20 57 0 48 -40 7 -54 -22 -4
4745dkpM7n7k1M8j5j7K9J6K2j7l5j6K4k3L5k7M2j05Q4Pj3K0o5N3j4O9k6j4k2O
4777Bj5J7k4M2J1j0Mo1l2K3K0N9Qk9k1LM5o9L6k2Oj5M8l8kl7M8j2l3J2L0k9lM8
4811A0m6O4o4O2k3K1j5J7m3K4k6J3M5j7K2j8o3M5M0q3L1O8n7K4L7n9pj5N1p5R5
4842E8r4P0m5l2O1m1M2l5Jl9M6m1L1oJ6J3m0L5j9Om5P3L9j9Nm6K4l6K1Rl1M2m9
4875b6P8n0K6l8L1l7nK2L1Pj2Ok4J0l6K8J6l6J0J4%Om0N9m0NK1l9L4qL3p5P5q1
4909c5N7o3kJ6k8J13m0ll0L7Km0n4M7P8n2J7p0R5l8qJ3n2M1J0k1q9J09qj7j0L2
4941Gl9j7Q2l2j8L1n0J9L5rj6j4K5NJ8n0K7K9k3j1m3J14n2l8nKPk5K0J2N7r1N0
4974Gk6J1Lj5J9L9m8QK2j3l0omJP0m8N1l0j4l2J1N4J9p8O6K8n1J6k2mm0P5o4l8
$$ plain form
4745 -4 -6 -13 34 -23 -44 4 -11 -28 1 17 39 22 -13 -29 -5 -28 7 -20 22 -83 1 8 -5 15 -50 3 -11 58 32 18 -4 2
4777 2 -13 4 -20 22 33 23 27 -34 -66 -43 -23 36 44 15 -6 -3 42 -27 9 -13 -7 -22 26 -12 -14 -51 -3 -15 -48 -36 -6 -35 -38 10
4811 10 -36 28 -36 26 3 24 9 26 -17 7 -19 -6 39 22 44 26 -37 8 48 -35 -4 64 7 31 68 9 2 -13 38 -37 58
4842 58 -36 34 -11 -43 18 -23 19 -16 -15 -54 -8 -49 -18 -24 -8 5 -35 0 -19 -13 -58 15 54 35 40 -6 18 -18 3 12 -19 23 -26
4875 -26 52 2 28 -10 21 -16 -21 1 32 39 27 33 9 19 -17 11 27 -9 1 15 15 21 -19 40 0 5 26 -13 21 13 46 -29 46 -35
4909 -35 22 -41 -43 -27 -55 58 18 15 -15 22 24 -16 -70 -23 55 3 20 -50 45 7 -1 12 -40 1 11 -10 -99 10 2 -15 -25 7
4941 7 -32 -49 33 1 -17 14 -36 -17 18 9 -7 -21 4 9 27 -23 4 33 10 -1 -44 70 18 -20 -25 -23 -16 -41 -21 -9 48 -43 7
4974 7 -19 -8 -5 -20 -1 38 -10 -2 20 7 -23 -29 -33 -32 38 -10 41 11 -3 -35 -24 30 49 -29 37 65 14 30 8 4 -36 39 -25 -63
5008f3J07l5k2mK8L0n6N1k1Rj3j9q6Q8K4k1J5j6Rj9k7L1J2k3n2O8L2r3P7o8L9
5039a8N8l3k7K4O4p7Pk5L3NL3n5K9n6K9K8m2N4j6Nj7K5o0K6l4L9j2J8k7N5pMj0
5072B0j5m2P0Ml9j6M6l0m3P6l9qM5qj2rJ8n0L0L6k0k9J5J0M3m3k6K7j0nj0l9P3
5105B0Rk2N0n1qK1l6O0j6m4k7R5k6p5O7j9j7j2K0J5Mj5j0nnNJ2J3MJ2j3l6pJ2
5139b5N2j9mmK0k1ll3L9MOk0nQK9ol1P1l5m8K1K7k8J2J7Ok0l0L8l7M5ro3N7RJ3
5175C3Kn4j4Rl0K3M2j9L9k9K3q7O0K7p1j3J29j17M5m9K2M0Jl1k3O0Ppn0L6j8M4
5207C0Mm1L3k5k7M3l3rN3o4O0M6j10M8j6nOJ2J2jl2l8Q4m3NkK8J0J2o2qL8J8j3
5241A3k1RQ3q3k6K6j7Rlk5L1k4R2j11j5Q2l4K4k0J2KppM4r7P8nk4M9n6L3j0j9
$$ plain form
5008 -63 44 9 -13 -17 11 41 -15 36 15 24 11 -8 -94 -6 18 -3 12 -4 5 -14 -41 -10 2 -21 -73 -5 27 -66 11 -57 -18
5039 -18 40 7 -20 4 68 -9 -2 -27 6 11 44 -11 18 -38 -9 19 -23 31 15 20 3 28 -32 -6 -40 -1 -13 5 -22 33 26 30 20
5072 20 5 -37 33 37 -2 -18 28 -2 -45 31 -8 -16 29 21 9 0 18 -32 -2 34 14 -15 0 10 53 10 -16 11 1 -4 -14 -53 20
5105 20 29 7 57 6 -2 19 -17 43 27 -17 -44 51 25 -50 17 -2 -19 -31 -11 4 8 -7 -17 -22 -27 -22 -10 3 7 19 6 -30 -37 -25
5139 -25 27 8 4 0 20 -1 -4 -37 2 6 12 -8 -13 -5 24 18 -13 58 23 -25 -4 23 -5 7 24 30 10 -20 18 -19 26 17 -46 11 20 33
5175 33 35 -19 -33 -24 -54 -31 11 -8 31 2 25 -62 -2 25 -46 -59 70 -47 -2 -51 -29 11 12 -19 -42 18 25 18 -32 4 -14 30
5207 30 34 -7 26 1 -26 17 -16 -25 28 -36 24 70 -40 8 -8 -13 -7 5 17 16 -16 -54 30 -13 -8 -10 18 28 40 -22 -30 8 26 13
5241 13 -8 1 84 1 -25 1 -16 -7 -10 -35 -4 -28 64 -47 -62 20 -14 10 -10 2 4 -3 -10 34 -63 15 10 -14 35 -21 12 2 -17
5274a7L3rL5n6L2ml8R1m1n0J1j4N5n2k8N9Pl1J8m5P4n3k9M0N3o0MJ8l2L9n8P3
5306B5j6l8M1j3m9O0l2pQ7l1nj0n5K4pM8rm0M4k1L8Mk3n1M6M2q4O3o6L9m8N1%
5339GpJ4JoM2o1m5N3M0On9l0M6k0%QN3k6M2p0J2qj6N7p9P2m2k9L2J9j7J4J3kL
5374A7j1nnK8k4j7O7l1o3K5lO%J0N9l4koln9R9l9PL1m3l0K9Ol2K9j3k5J6L6k1
5409aK0p2O9l2K0k2k5N1K4o8K2L0j2j6O5l7o4N7qlL6n8M3J2n2L5L6k5k0k4J8K3
5441B2%k5k0QjO4j8jl1J3j4k1L2J0l8R3m3p4L2Oj8L7m9N1Qj4L9p2l2N4NJ7m3J4
$$ plain form
5274 -17 16 7 42 -14 18 14 -24 67 26 -24 -13 -27 28 -24 -52 7 14 -17 1 -44 30 -23 -52 -12 41 -19 -15 3 -29 10 -48 25
5306 25 9 -29 12 -1 -50 10 -22 -29 58 27 22 12 -43 -19 -26 22 13 -27 17 -4 34 38 15 -36 10 52 -32 31 -35 4 -44 7 7
5339 7 0 14 15 9 51 -10 -55 -2 38 44 -15 -45 1 -19 -19 -11 42 16 58 -12 0 -8 -24 33 -46 26 -16 -45 -13 6 -11 3 16 14 17
5374 17 6 1 -4 24 0 -17 50 19 -44 -19 -22 -16 -16 -6 53 19 17 11 8 -51 48 9 16 47 4 -26 3 9 -23 6 -7 -32 -16 20 -1
5409 -1 19 -53 16 -16 4 -18 -43 8 32 -36 -14 16 4 -12 53 16 -48 9 1 -2 34 -24 19 31 -21 14 50 25 5 -19 -1 22
5441 22 22 -3 -23 -15 -16 48 30 29 -2 11 -3 -24 8 18 -20 73 30 -44 -12 -6 -24 13 -36 15 23 9 48 -24 -56 -2 3 20 -23 -9
$$ [...]
8191A4
##END NTUPLES=NMR FID
##END=
