##TITLE=1H_Ser DHA_TFA 30min
 
 8 sc, 
 23.12.2024
##JCAMPDX= 6.0         $$ Bruker NMR JCAMP-DX V2.0
##DATA TYPE= NMR FID
##DATA CLASS= NTUPLES
##ORIGIN= UXNMR, Bruker Analytische Messtechnik GmbH
##OWNER= root
$$ XWIN-NMR		Version 3.5
$$ Mon Dec 23 14:51:48 2024 Russian Standard Time (UT+4h)  she@DPX200
##.OBSERVE FREQUENCY= 200.1315
##.OBSERVE NUCLEUS= ^1H
##.DELAY= (6, 6)
##.ACQUISITION MODE= SIMULTANEOUS
##.ACQUISITION SCHEME= undefined
##.AVERAGES= 8
##.DIGITISER RES= 18
##SPECTROMETER/DATA SYSTEM= spect
##.PULSE SEQUENCE= zg30
##.SOLVENT NAME= Acetone
##.SHIFT REFERENCE= (INTERNAL, Acetone, 0, 15.7039)
##AUDIT TRAIL= $$ (NUMBER, WHEN, WHO, WHERE, WHAT)
$$ ##TITLE= Audit trail, XWIN-NMR		Version 3.5
$$ ##JCAMPDX= 5.01
$$ ##ORIGIN= Bruker BioSpin GmbH
$$ ##OWNER= she
$$ F:/spectra/data/she/nmr/H-F/1/audita.txt
$$ ##AUDIT TRAIL=  $$ (NUMBER, WHEN, WHO, WHERE, WHAT)
(   1,<2024-12-23 14:50:43.34 +0400>,<she>,<DPX200>,
      <created by zg, POWCHK disabled, PULCHK disabled
       configuration hash MD5:
       00 E9 B6 7A A2 85 ED C7 34 08 36 98 17 FE 4E 26
       data hash MD5: 16K
       3B 81 ED D4 9A FB 6B 5F 10 C3 3F 3A F3 03 73 C3>)
$$ ##END=
$$ 
$$ hash MD5
$$ FF 19 1D 80 42 EE E2 E5 E3 F3 38 D9 AE 17 CB 2E
##$RELAX= 
##$RELAX= 
##$RELAX= 
##$RELAX= 
##$RELAX= 
##$RELAX= 
$$ Bruker specific parameters
$$ --------------------------
##$DU= <F:/spectra>
##$EXPNO= 1
##$NAME= <H-F>
##$PROCNO= 1
##$TYPE= <nmr>
##$USER= <she>
##$AMP= (0..31)
100 100 100 100 100 100 100 100 100 100 100 100 100 100 100 100 100 100 
100 100 100 100 100 100 100 100 100 100 100 100 100 100 
##$AQSEQ= 0
##$AQ_mod= 1
##$AUNM= <au_zg>
##$AUTOPOS= <>
##$BF1= 200.13
##$BF2= 200.13
##$BF3= 200.13
##$BF4= 200.13
##$BF5= 200.13
##$BF6= 200.13
##$BF7= 200.13
##$BF8= 200.13
##$BYTORDA= 1
##$CFDGTYP= 0
##$CFRGTYP= 5
##$CHEMSTR= <none>
##$CNST= (0..31)
1 1 145 1 1 1 1 1 1 1 1 1 1 1 1 1 1 1 1 1 1 1 1 1 1 1 1 1 1 1 1 1 
##$CPDPRG= <>
##$CPDPRG1= <>
##$CPDPRG2= <>
##$CPDPRG3= <>
##$CPDPRG4= <mlev>
##$CPDPRG5= <mlev>
##$CPDPRG6= <mlev>
##$CPDPRG7= <mlev>
##$CPDPRG8= <mlev>
##$CPDPRGB= <>
##$CPDPRGT= <>
##$D= (0..31)
0 1.2 0 0 0 0 0 0 0 0.06 0 0.03 0 0 0 0 0.0002 0 0 0 0 0 0 0 0 0 0 0 0 
0 0 0 
##$DATE= 1734951042
##$DBL= (0..7)
120 120 120 120 120 120 120 120 
##$DBP= (0..7)
150 150 150 150 150 150 150 150 
##$DBP07= 0
##$DBPNAM0= <>
##$DBPNAM1= <>
##$DBPNAM2= <>
##$DBPNAM3= <>
##$DBPNAM4= <>
##$DBPNAM5= <>
##$DBPNAM6= <>
##$DBPNAM7= <>
##$DBPOAL= (0..7)
0.5 0.5 0.5 0.5 0.5 0.5 0.5 0.5 
##$DBPOFFS= (0..7)
0 0 0 0 0 0 0 0 
##$DE= 6
##$DECBNUC= <off>
##$DECIM= 24
##$DECNUC= <off>
##$DECSTAT= 4
##$DIGMOD= 1
##$DIGTYP= 9
##$DL= (0..7)
0 120 120 120 120 120 120 120 
##$DP= (0..7)
150 150 150 150 150 150 150 150 
##$DP07= 0
##$DPNAME0= <>
##$DPNAME1= <>
##$DPNAME2= <>
##$DPNAME3= <>
##$DPNAME4= <>
##$DPNAME5= <>
##$DPNAME6= <>
##$DPNAME7= <>
##$DPOAL= (0..7)
0.5 0.5 0.5 0.5 0.5 0.5 0.5 0.5 
##$DPOFFS= (0..7)
0 0 0 0 0 0 0 0 
##$DQDMODE= 0
##$DR= 18
##$DS= 0
##$DSLIST= <SSSSSSSSSSSSSSS>
$$ [...]
##$SUBNAM2= <"">
##$SUBNAM3= <"">
##$SUBNAM4= <"">
##$SUBNAM5= <"">
##$SUBNAM6= <"">
##$SUBNAM7= <"">
##$SUBNAM8= <"">
##$SUBNAM9= <"">
##$SW= 24.0689530833862
##$SWIBOX= (0..15)
0 0 2 0 0 0 0 0 0 0 0 0 0 0 0 0 
##$SW_h= 4816.95568400771
##$TD= 16384
##$TD0= 1
##$TE= 0
##$TE2= 300
##$TE3= 300
##$TEG= 300
##$TL= (0..7)
0 120 120 120 120 120 120 120 
##$TP= (0..7)
150 150 150 150 150 150 150 150 
##$TP07= 0
##$TPNAME0= <>
##$TPNAME1= <>
##$TPNAME2= <>
##$TPNAME3= <>
##$TPNAME4= <>
##$TPNAME5= <>
##$TPNAME6= <>
##$TPNAME7= <>
##$TPOAL= (0..7)
0.5 0.5 0.5 0.5 0.5 0.5 0.5 0.5 
##$TPOFFS= (0..7)
0 0 0 0 0 0 0 0 
##$TUNHIN= 0
##$TUNHOUT= 0
##$TUNXOUT= 0
##$USERA1= <user>
##$USERA2= <user>
##$USERA3= <user>
##$USERA4= <user>
##$USERA5= <user>
##$V9= 5
##$VALIST= <valist>
##$VCLIST= <CCCCCCCCCCCCCCC>
##$VD= 0
##$VDLIST= <DDDDDDDDDDDDDDD>
##$VPLIST= <PPPPPPPPPPPPPPP>
##$VTLIST= <TTTTTTTTTTTTTTT>
##$WBST= 1024
##$WBSW= 4
##$XGAIN= (0..3)
0 0 0 0 
##$XL= 0
##$YL= 0
##$YMAX_a= 608307
##$YMIN_a= -464908
##$ZGOPTNS= <>
##$ZL1= 120
##$ZL2= 120
##$ZL3= 120
##$ZL4= 120
##$ABSF1= 10
##$ABSF2= 0
##$ABSG= 5
##$ABSL= 3
##$ALPHA= 0
##$AQORDER= 0
##$ASSFAC= 0
##$ASSFACI= 0
##$ASSFACX= 0
##$ASSWID= 0
##$AUNMP= <proc_1d>
##$AZFE= 0.1
##$AZFW= 0.1
##$BCFW= 1
##$BC_mod= 2
##$BYTORDP= 1
##$COROFFS= 0
##$CY= 11.3945322036743
##$DATMOD= 1
##$DC= 2
##$DFILT= <>
##$DTYPP= 0
##$F1P= 15.6554695791079
##$F2P= 12.8336369535428
##$FCOR= 0.5
##$FTSIZE= 0
##$FT_mod= 4
##$GAMMA= 1
##$GB= 0.15
##$INTBC= 1
##$INTSCL= 1
##$ISEN= 128
##$LB= 0.24
##$LEV0= 0
##$LPBIN= 0
##$MAXI= 10000
##$MC2= 0
##$MEAN= 0
##$ME_mod= 0
##$MI= 1.114404
##$NCOEF= 0
##$NC_proc= 0
##$NLEV= 6
##$NOISF1= 3.799351
##$NOISF2= 2.8
##$NSP= 1
##$NTH_PI= 0
##$NZP= 0
##$OFFSET= 15.70392
##$PC= 1
##$PHC0= -26733.7
##$PHC1= 16.18744
##$PH_mod= 1
##$PKNL= yes
##$PPARMOD= 0
##$PSCAL= 0
##$PSIGN= 0
##$REVERSE= no
##$SF= 200.130013532006
##$SI= 16384
##$SIGF1= 3
##$SIGF2= 2
##$SINO= 400
##$SIOLD= 16384
##$SREGLST= <1H.CDCl3>
##$SSB= 0
##$STSI= 0
##$STSR= 0
##$SW_p= 3612.71676300578
##$SYMM= 0
##$S_DEV= 0
##$TDeff= 0
##$TDoff= 0
##$TI= <>
##$TILT= no
##$TM1= 0
##$TM2= 0
##$TOPLEV= 0
##$USERP1= <user>
##$USERP2= <user>
##$USERP3= <user>
##$USERP4= <user>
##$USERP5= <user>
##$WDW= 1
##$XDIM= 8192
##$YMAX_p= 0
##$YMIN_p= 0
$$ End of Bruker specific parameters
$$ ---------------------------------
##NTUPLES= NMR FID
##VAR_NAME=  TIME,          FID/REAL,        FID/IMAG
##SYMBOL=    X,             R,               I
##VAR_TYPE=  INDEPENDENT,   DEPENDENT,       DEPENDENT
##VAR_FORM=  AFFN,          ASDF,            ASDF
##VAR_DIM=   8192,          8192,            8192
##UNITS=     SECONDS,       ARBITRARY UNITS, ARBITRARY UNITS
##FACTOR=    0.0002076,     1,               1
##FIRST=     0,             0,               0
##LAST=      1.7004516,     0,               0
##MIN=       0,             -464908,         0
##MAX=       1.7004516,     608307,          0
$$ Real data points
##PAGE= N=1
##DATA TABLE= (X++(R..R)), XYDATA
0@%%%%%%%%%MmQj3J3j6K0k4K8l2L7m5N2o3P2q2R6j11J26j44J64j84K08k33K62
34A39k93L28l64M03m49N00n53O13o81P51q31R21j022J134j265J415j584J784k025
53a079K319k685L159l805M735o183Q812j9500J38069J01032j345J11098J37342
66D71969L3751o0414o369K3097n6934j48553j38531r7136q6901j13171j16536
77b95728q4333k9128q211k6373r909P5070J14881P1801N6448J26288J61365Q5814
89B37985J6376O0504R9458K2967o0893l8788j776n8702j38894j25154o0596n5576
101a03089j02345j05298l9360J2031n650k6852J8140R2158J06416N7997M8996
112d6856J08571J25834N4419J554L8222P3223J4559o4970o1807k3000m7413j11057
$$ y = [0, 0, 0, 0, 0, 0, 0, 0, 0, 0, 4, 0, 8, -5, 8, -8, 12, -12, 16, -16, 21, -24, 28, -35, 37, -45, 51, -60, 66, -78, 86, -98, 110, -123, 139, -154, 174, -190, 213, -236, 264, -289, 324, -357, 394, -437, 484, -538, 596, -669, 746, -838, 946, -1079, 1240, -1445, 1714, -2091, 2644, -3539, 5273, -14227, 123842, 224874, 223529, 334627, 471969, 505720, 445306, 438937, 462034, 405100, 256547, 118016, 20880, -66021, -179192, -295728, -380061, -409189, -417400, -443773, -453682, -378612, -263731, -191930, -135482, -9194, 152171, 237985, 254361, 314865, 414323, 437290, 376397, 337609, 335833, 277131, 138237, 13083, -47513, -103089, -205434, -310732, -350092, -338061, -343711, -370563, -352423, -260265, -153849, -95852, -46856, 61715, 187549, 241968, 243522, 281744, 354967, 369526, 304556, 242749, 219749, 172336, 61279]
124F1279j12437n1339l0165p0672q4092k9355K6251J6639j2742K3151R3637R9794
136g0051M8892L8718Q4556R2453L1204n539L2055N6061l621p5406o9617k9841
148A29864m4599q8079q0459l2365k0543n9932p4518j8277M2871L9178Q328K5396
160a73135P6676Q1762L4825K2863O9463Q7084L0040k0141K617K9220j3619p1185
172A56470o2618k1257l0308p6025p5316k7535j1279m0773m6325K319M6698L5711
184a50238Q906K7561O9967O7852K6718J9086N6541O5428J4527k7870q054J7702
196A88126j9071p1133n7965j1183j7497o6286p1628k0986N347k2278l4256J1229
208a87581N4310L7940L871J8890O1240O3046K4985J1345L8945M6977M848l1259
$$ y = [61279, -51158, -102497, -132662, -203334, -287426, -316781, -290530, -273891, -286633, -263482, -169845, -70051, -21159, 17559, 102115, 194568, 225772, 220233, 252288, 308349, 304728, 229322, 159705, 129864, 85265, -2814, -83273, -115638, -136181, -196113, -270631, -288908, -246037, -206859, -198531, -173135, -96459, -14697, 20128, 42991, 112454, 199538, 229578, 209437, 212054, 241274, 227655, 156470, 93852, 72595, 42287, -33738, -109054, -136589, -147868, -188641, -234966, -232647, -185949, -150238, -141332, -113771, -43804, 24048, 50766, 69852, 126393, 191821, 206348, 178478, 170424, 188126, 169055, 97922, 39957, 28774, 11277, -55009, -126637, -147623, -142276, -164554, -198810, -187581, -133271, -95331, -91460, -72570, -11330, 51716, 76701, 88046, 126991, 173968, 178816, 147557]
220A47557j7216L715j9103n6277m8360j2751j6005n4222n7968j5240J1530n585
232a39925j4919J8633M8320K8548j908J6307O0664O1001J8926J870K4199K8742
244A50458r252l6693j3200J2366j5079n7665n1283j3675j0574m0679m1330q79
256a27485K1350r61j6130J3610M5608L2824N837J6734M9032M7079R170p720J4274
269A03222K2695r413l4445j6508N022j6752n1683m3419q126n062l1918l0371P717
282a09041K4701O79j2611J4868M2955L1267O251J5850M2498L4639j777j4476Q145
295H3948J9640p299l3397k0824L58j5583m6303l8232k064M714k1014k5424P053
308i4427K6282N494j0673J4632M2503L0570N938J0961L1218K3010q395j5416Q710
$$ y = [147557, 130341, 134056, 114953, 58676, 10316, -2435, -18440, -72662, -130630, -145870, -134340, -139925, -154844, -136211, -87891, -59343, -61251, -44944, 15720, 76721, 95647, 97517, 121716, 150458, 141206, 104513, 91313, 103679, 88600, 30935, -20348, -34023, -44597, -85276, -126606, -127485, -106135, -107096, -123226, -109616, -64008, -31184, -25347, -8613, 40419, 87498, 96668, 88948, 103222, 125917, 116504, 82059, 65551, 70573, 53821, 2138, -41281, -49407, -54469, -86387, -116758, -109041, -84340, -83661, -96272, -81404, -38449, -7182, -931, 14919, 57417, 92056, 90279, 75803, 83948, 103588, 96289, 62892, 42068, 42426, 26843, -19460, -57692, -59756, -55042, -76056, -101480, -94427, -68145, -62651, -73324, -58692, -16189, 14381, 20319, 31280, 62498, 85508, 77113, 61697, 70407]
321G0407J7521r695l3030k2315o132j8021l6890k3605P643Q172k0521k4918P577
334h3807K7101J0117k846J8173M0001K3443n171J398K7938K4278p152j7691L028
347E8810J1201j3768l5011k1543j85q896k9635k1294N440Q035j3378j7002R553
360f7673K7402J2894p42J5006L2311J8233n423l7K1832J8616q455j7537P95O257
374E3479j8161l4271j5616N354n146k5727j8142P153Q386j2504j2040J6295L0526
387b0414J1929m512R323K7369J6471o036k302J8932J6173j0887k1297m322M106
400C4533j4685k9115j2629P968k158k3231j6917O445R292n946l999J9116K7023
413d303O629q344O383K4368J5456k967p60J2959P273j6259k2753k535Q317r718
$$ y = [70407, 87928, 78233, 45203, 22888, 16756, -1265, -38155, -61760, -54117, -45945, -66466, -91384, -83807, -56706, -46589, -49435, -31262, 8739, 32182, 27011, 28409, 56347, 80625, 73473, 55782, 58810, 70011, 56243, 21232, -311, -496, -9392, -39027, -60321, -54881, -46846, -60224, -77226, -67673, -40271, -27377, -28119, -13113, 19198, 37431, 32008, 31971, 53803, 72419, 63964, 46427, 47222, 53479, 35318, 1047, -14569, -9215, -14361, -40088, -58230, -51077, -42691, -55195, -67235, -50940, -20414, -8485, -12997, -3674, 23695, 40166, 34130, 31828, 50760, 66933, 56046, 34749, 30427, 34533, 19848, -9267, -21896, -13928, -16086, -39317, -56234, -49789, -40497, -46443, -50442, -31326, -4303, 2326, -6018, 365, 24733, 40189, 37222, 36462, 49421, 56694, 40435, 17682, 15147, 23464, 13746]
427A3746k5555j3029N224k220k0287j2964J2449J5949l906p095J4820K4553O153
440G838p546O470K3382J3477p243n951R335M972j5392j9690k233O903q241k2377
454a6296j1589M919j423j5824p686J4233J6056k164o663J1636K0833M966o549
467D449Q249K2600Q892j2440r682O990N264j3870j7445L14P068j0530k3171r657
481c2969Q086L065j1330o029J3884J5623k550p979R560K0084P562m489M454J6681
495C3653N812j4083j2018O009P245r614j5285k376K882j1320j9978m516J2915
508b0674N821j0523n731J1684J1736l094m098J3577K0348L488r812J511J4378
521B8611L976j3273r330P069N979j1986j7433k545N474p247j6387k924J2513O279
$$ y = [13746, -11809, -24838, -19614, -21834, -42121, -55085, -42636, -26687, -30593, -37688, -22868, 1685, 7838, 292, 6762, 30144, 43621, 36378, 30427, 39762, 44734, 29342, 9652, 7419, 14322, 6081, -16296, -27885, -22966, -24389, -40213, -47899, -33666, -17610, -19774, -26437, -14801, 6032, 10998, 4449, 12698, 35298, 44190, 31750, 22068, 29058, 34322, 20452, 3007, 3321, 10389, -141, -23312, -32969, -24883, -21818, -33148, -39177, -25293, -9670, -12220, -20199, -10639, 9445, 17007, 12518, 16972, 33653, 39465, 25382, 13364, 19373, 26618, 17004, 1719, -657, 2225, -9095, -29073, -33589, -20674, -14853, -25376, -31107, -19423, -7687, -10781, -14879, -1302, 19046, 22534, 12722, 14233, 28611, 32587, 19314, 9984, 17053, 23032, 11046, -6387, -8932, -3458, -10705, -27092, -30016, -17503, -11224]
535a1224q970o435J0228J3197n36l808J1197J7476K401j0185j660J0962M317j1056
549A5904q292O420M076j3496j7140j402O938l927j2415j130J1690L663j0532m593
563b4236J3026J4259k7m347Q114J4107L31j1380j455J2077M922j1168j0029L557
577G751L660j1964j6127R4J0452j117j2071k662R490L710q102k234J4366J4702
591I948j560p076M756J0826J18p823J088J0476J744j3601j1194L416M443q831
605c270j1769J705Q531k930j2458j993J1982O350o985k415J3011J2547l385q545
619C76M515J2285J180r322j280R112J165j3358j1097L306O162n940j0650M78P597
634e471k248j0960j229J1677P943m150k832R222R433m159p256N812J2214M48r974
$$ y = [-11224, -20194, -26629, -16401, -3204, -3740, -7548, 3649, 21125, 23526, 13341, 11681, 22643, 26960, 15904, 7612, 14032, 18108, 4612, -12528, -13930, -6992, -10919, -23334, -24464, -12774, -9111, -19643, -24236, -11210, 3049, 3022, -1325, 6789, 20896, 21227, 9847, 8392, 20469, 25391, 14223, 4194, 7751, 11411, -553, -16680, -16586, -6134, -7251, -19322, -21984, -12494, -8784, -16886, -19120, -4754, 9948, 8388, 1312, 6068, 16894, 17012, 9189, 10277, 20753, 22497, 8896, -2298, 1118, 5561, -3270, -15039, -13334, -4803, -7733, -20191, -22184, -10202, -3852, -10837, -13252, -241, 12306, 8921, 376, 4891, 17176, 18356, 9034, 7754, 16866, 18031, 4673, -6424, -3118, 3044, -2896, -13546, -13068, -5471, -7719, -18679, -19908, -8231, -288, -4438, -7270, 1952, 11385, 7226, -30, 5782, 17996, 18444, 8470]
649H470l084O543o5j2377q113O399O621p650j1656Q15Q076j334r183L73J3110
664c055P687o293m879P903R317k572o463M962J1467j87j2035n670N622K242q448
679d02o475M963M849p804j1652R51R690J654o584M39R869M586o459l843Q928J0200
695A2910k581p210L162Q526j730j1125l978P112L043q901p653M290N159o943j0244
710a6163K119J0738K599o988j411R027N032o163l642Q708R936k166q220N75O876
725A0857j424r432k518P359K674q889q057K715M714m271p054L539R851P32q023
740g227j599Q672N578m329k931P838Q057m473r322R04P805k41q689k749O546K210
756F050r560q640L883P295k376o573K238Q143N03p979j851R582P570l430m430
$$ y = [8470, 5386, 11929, 11864, -513, -8626, -2227, 4394, -3256, -14912, -14097, -6021, -7355, -16538, -16165, -3055, 4632, -1661, -6540, 1363, 10680, 8108, 1645, 6607, 18074, 17887, 5852, 182, 5804, 8046, -402, -6877, -1914, 2935, -4869, -16521, -15570, -5880, -4226, -10810, -10371, -502, 4084, -2375, -6218, 2710, 12910, 10329, 3119, 6281, 14807, 13077, 1952, -2026, 5086, 8129, -772, -8425, -4135, 1024, -5919, -16163, -14044, -3306, -707, -7695, -9106, -79, 4953, -1210, -4852, 3856, 13792, 11626, 3406, 3981, 10857, 9433, 1, -2517, 4842, 7516, -1373, -9430, -6715, -2001, -6272, -13326, -9787, 64, 796, -7227, -8826, -154, 5424, 1095, -1836, 6002, 14059, 9586, 264, 1168, 8973, 8732, 43, -2706, 3840, 6050, -3510, -12150, -8267, -972, -3348, -9921, -7683, 460, 963, -7016, -8867, 715, 8285, 4855, 425]
771D25M380N602l738p508J506Q017L68q793m397M676J630p229n462M816O498l003
787b212p030J767P871N64o572j38R381N795m939n395M202O063l568p205K041P814
803H439l03r470n148M488L431n622n054M667O527l124p487N82P662K788m453o74
819b751P304M207n499n396L884O300j674n967L84N392j411q808l425N803L909
834B252m988m938L614N244l291o675K092Q839K624n240j649N989L487n220m930
849b790M685P279j901p490j322M536l97o825k383O005M085n247o331K422N493
864a81j149m414K137P112J515n622k350N525L931l703l762L724M954k854p060
879b197p09M977L09n988j936N432K970n734n688L191O393n10m674J670O747O03
$$ y = [425, 4805, 10407, 6669, -839, 667, 8684, 9052, 259, -4138, 538, 2168, -5061, -10523, -5707, 791, -2212, -9242, -7475, 396, 960, -5612, -5750, 3631, 9426, 4487, -908, 3294, 9357, 5789, -1416, 625, 8439, 8136, -1334, -6482, -1994, 1437, -4185, -9239, -4572, 1955, -1169, -8656, -8074, -412, 2376, -2077, -2751, 4553, 8760, 3261, -2135, 1749, 8049, 6375, 408, 792, 6184, 4773, -4035, -7460, -1657, 2252, -2736, -7674, -4060, 1184, -2107, -8782, -6690, 2149, 4773, -467, -2116, 3873, 7360, 2140, -2790, 1895, 9174, 7273, -217, -1539, 2997, 2600, -4225, -6608, -603, 3482, -1765, -8096, -5674, -181, -1330, -5744, -3607, 3505, 5020, -602, -2952, 2573, 6504, 2801, -961, 2763, 7717, 4863, -2197, -2906, 2071, 2380, -3608, -5544, -112, 2858, -2876, -8564, -5373, 1020, 510, -4164, -2494, 4253, 4856]
895D856o423k203O063M917l095m572K271M252k958o787k09N842J480n304l162
910e032L278K597m106m106L669O258m30m673P2M945R79m451j186N862L838m126
926C388m884J988L687k463n230P64N710M59o364l350L897L008l165l086L857N631
942C847j452n936k62N793K372l546j557M236K880m227n194J847N013r03n029l44
958b462L963R3n238k366L960L693k597l194K773M318j751m556O71N569J991l624
974A243j949L586J998m183m207K792M949j056n299j209L789L57m754j696M963
989f76L846k934m247J572M318n29l786R87N344J479m425k827K807K641k520l076
1005b026K053L798j701n315q37L642J084l214j129L762K566l334l811K194M588
$$ y = [4856, -1567, -3770, 2293, 7210, 4115, -457, 1814, 6066, 3108, -3679, -3888, 1954, 3434, -1870, -5032, -1754, 843, -3263, -7369, -3700, 2558, 2128, -2545, -2473, 2472, 3451, -1000, -2186, 3676, 7514, 3388, -1496, 492, 4179, 1716, -3514, -2750, 2960, 3419, -2945, -6295, -2398, 610, -2555, -5641, -1784, 3847, 2395, -3541, -3803, 1990, 4362, 816, -741, 3495, 6375, 2148, -3046, -1199, 3814, 2911, -2118, -2462, 1501, 1594, -3644, -6010, -2050, 1643, -954, -4148, -1375, 2943, 1192, -3364, -2693, 2876, 4867, 1243, -706, 2880, 4878, 695, -3512, -720, 4229, 3173, -2126, -3335, 454, 811, -3943, -5639, -676, 3170, 236, -4011, -2439, 1879, 1350, -2436, -1449, 3895, 5374, 949, -1878, 929, 3570, 1050, -2026, 27, 3825, 2124, -3191, -4028, -386, 698, -2516, -3645, 117, 2683, -651, -4462, -2268, 2320]
1020B320k18l242Q65M204L06m770k493L830L472k550l456J611K904k165m799j08
1036d289M785J917l636k421K890K398k597k850K355M720r8l822m73L437R02l633
1052d15j574L279K708k415l602Q05K631j385l574O57M181R18l666k229K583K428
1068A330k021k136K917L999j256m304m84L628J353l033j379L225K099l389m022
1083c473J182L599k73l191j37L346O68l815k061L108L209j300k302J400K883j013
1099A830l627m3L877J342k821j649K078J291k815k872J816L660o14l440l37K743
1115D19K52l103r35L714L005k151l090J076K897o46k876N09L727Q89l578k452
1131b343K048K200j860k508J553K932q02l539o64K860J219k227r60K848K086k146
$$ y = [2320, 2102, -1140, -275, 3929, 4235, -535, -3028, 802, 4274, 1724, -1732, -121, 2783, 618, -4181, -4289, 496, 2413, -1223, -3644, -754, 1644, -953, -3803, -1448, 3272, 3174, -648, -1121, 2316, 3218, -415, -1989, 1290, 3998, 1583, -2019, -1214, 1417, 32, -3542, -2885, 1296, 2214, -1452, -3681, -1098, 1330, -691, -2827, 90, 4089, 2833, -1471, -1955, 1673, 3026, -7, -1386, 1839, 3938, 549, -3473, -2291, 1308, 1035, -2156, -2293, 1053, 1721, -2094, -4155, -1047, 2162, 862, -1440, -40, 2843, 1830, -1797, -1840, 2037, 3379, 558, -1091, 987, 2278, -537, -3409, -1593, 2067, 1453, -1987, -2324, 419, 671, -2432, -3367, 347, 3352, 1201, -1889, -813, 2084, 1438, -1438, -929, 2798, 3687, 109, -2343, -295, 1905, 45, -2463, -910, 2022, 1220, -2319, -2983, -123, 1096, -1131, -2091, 757, 2843, 697]
1147F97k801J026K906j35k355L77K837P3l629j767K512K246j543k226J138K348
1163A704j410l458J77L641J388k342j477K180J793k258k472J842L451r9l076n37
1179i53K217M56k716j397K566K391j782k823N18K166n55k330K97L135J111k714
1195d13j626J866J660j433j550J811K683q89l210n22K421O63k219p46K385J417
1211B298k401k847J042K903j78k333K85K603L55k813j500K387K469j177k189J136
1227D0K270r18k865k94K635J145k046j376J704J161k062k113J297K788n9k283
1243i76l00K005K58k291p60K715K093j579k237O40J938p59k361M53K921O08k721
1260c53j769J561J549j327j774J393K671o40k870m78K326R81j705p75K117J580
$$ y = [697, -2104, -1078, 1828, 1693, -662, -285, 2552, 2625, -1004, -2771, -259, 1987, 444, -1782, -644, 1704, 294, -3164, -2987, 654, 2042, -300, -1777, 403, 2196, -62, -2534, -692, 2759, 2660, -416, -953, 1264, 1720, -996, -2393, 173, 2564, 782, -2041, -1523, 643, 88, -2242, -1945, 1190, 2301, -413, -2039, -173, 1487, 54, -1496, 315, 2998, 2109, -1101, -1623, 798, 1461, -758, -1504, 881, 2298, -103, -2950, -1908, 995, 817, -1516, -1231, 1372, 1727, -1086, -2586, -199, 2270, 1093, -1096, 40, 2310, 1392, -1473, -1767, 868, 2013, -33, -1409, 295, 1456, -606, -2719, -1422, 1366, 1307, -976, -1276, 729, 987, -1304, -2064, 651, 2744, 1165, -1072, -432, 1506, 747, -1614, -1161, 1760, 2368, -353, -2122, -561, 988, -339, -2113, -720, 1951, 1311, -1559, -2037, 289, 1270, -435, -1210, 907, 2487]
1276B487j717k486P09K321j67j864O1K035J91k492j484J792J944j122j542J028
1292c06J768r69k452L9K672J118j787j061J659J098j855j844J274K618k34k469
1308g31m39J952L39k303r43K041J937j234k188N41K004m84k103K46K566Q53j918
1325A36j427J176J392j202j479J336K125n84k456n54J651O60j500n91J795J378
1341A856j866k072Q45K099r3j585J63K085K88k391j189J794J764j064j521P83
1357a04J769p78k445k19K277J015j633j120J298J099j405j860R60K404J05j888
1373e25l08J544L47j764q35J789J773j057j977M46J512n75j796L11K175N80j962
1390c22j381J308J278j055j325J190J971m36k173m47J788Q09j488q19J681J326
$$ y = [2487, 770, -1716, -1007, 1314, 1147, -717, -656, 1379, 1570, -922, -2406, -614, 1330, 208, -1334, -306, 1462, 493, -1959, -1920, 752, 1870, 83, -978, 681, 1779, -76, -1920, -646, 1972, 1738, -731, -1170, 782, 1121, -1182, -2125, -84, 1853, 619, -1569, -1028, 976, 492, -1611, -1365, 1201, 2054, 136, -1291, -115, 1277, 75, -1404, -68, 2057, 1473, -983, -1537, 114, 774, -726, -1317, 478, 1856, -10, -2082, -1237, 862, 769, -816, -653, 1432, 1720, -671, -1860, -66, 1698, 634, -887, -104, 1665, 887, -1558, -1777, 500, 1515, -118, -1238, 60, 1159, -246, -2106, -1146, 1258, 1363, -525, -833, 711, 1058, -706, -1541, 248, 2021, 964, -1013, -567, 945, 370, -1426, -1115, 1060, 1640, -322, -1703, -395, 883, -172, -1497, -307, 1664, 1228, -945, -1392, 396, 1205, -283, -1102, 579, 1905]
1406A905j349k048M50J786O0j593r6J803M25j998j222J318J565o02j270O46J556
1423A336n57k021j62J964R25j327q79J113Q49j305j625R88J985j44j805k79J373
1440D29L70j695q62J755J651j007j756M91J498l01j684N5K030Q54j656j400J030
1457a98J198r36j217P30J851k26j988o29J478P01j175o05J323J130j049j675K78
1474a009J652J28j337J20J464L30j812j003J191J418p21j287O05J350m59j858
1490a228k03J767P96j153r24J029J042j116j493O30J900J43j407m53J202L59j379
1507d88r47J443J437p07j457K6J248k24j294n8J750O37j439j018P51J025o43j065
1525a023P70J550j89j770m03J336N44j035o53J169J186j100j650L11J428J55j231
$$ y = [1905, 556, -1492, -1042, 744, 804, -789, -885, 918, 1343, -655, -1877, -559, 1006, 404, -866, -220, 1336, 779, -1242, -1404, 560, 1485, 158, -721, 392, 1241, -64, -1689, -701, 1284, 1140, -665, -944, 429, 799, -896, -1758, -3, 1648, 641, -1115, -624, 874, 573, -1111, -1056, 974, 1828, 172, -1228, -198, 1000, 64, -1153, -423, 1428, 1202, -786, -1415, 63, 764, -411, -1016, 307, 1437, 388, -1287, -1009, 643, 771, -566, -446, 1018, 1348, -464, -1467, -276, 1142, 421, -866, -261, 1089, 630, -1228, -1431, 336, 1132, -21, -945, 84, 1126, 10, -1483, -853, 1047, 1190, -217, -670, 532, 891, -488, -1435, 8, 1445, 738, -719, -693, 555, 331, -963, -1021, 729, 1366, -73, -1091, -340, 685, 42, -1023, -253, 1297, 1108, -662, -1065, 271, 815, -220, -873, 296, 1482, 382, -1268, -957, 471, 626, -605]
1542f05p6J354N15j506j142R81J433m33j136M36J196k66j528m05J410R21r97p79
1560f27P68P41q96j195M30J557J69j275m56J145K97j217o23J182J286o79j258
1577f51J42J211k06j293j07J578O61j208j112O98J010o91j078O06J481m2j514
1594e15n32J016O75q30n45R12J090p73j447J24J178K97r58j37J042M33j319r22
1612a211Q50J043l02r06L09R81k53j295l34J291P24q20o80O89P63p38j170M28
1630f31J383J82j195k88Q80L01j053o76R22J233m18j251Q8R17rj121p4J250O58
1649A098r27q97M41Q19m22q12M38J133m7j175m60Q13N53p53n14Q21Q96o48j171
1668h14N9J090J46q94j22J090L21j017r28P50R83k01r08K96R49j90j278l38J077
$$ y = [-605, -681, 673, 1188, -318, -1460, -479, 954, 521, -615, -179, 1017, 751, -777, -1182, 228, 1149, 152, -627, 141, 882, -14, -1209, -779, 778, 947, -328, -784, 361, 658, -559, -1182, 0, 1286, 607, -651, -509, 702, 496, -797, -904, 674, 1335, 127, -985, -287, 723, 32, -1046, -440, 1041, 999, -515, -1047, -31, 644, -186, -731, 181, 1271, 498, -949, -825, 353, 650, -308, -445, 597, 1030, -289, -1211, -361, 682, 380, -526, -217, 764, 511, -784, -1118, 173, 897, 77, -603, 86, 849, 111, -1059, -631, 752, 934, -261, -549, 331, 632, -421, -1097, -175, 1058, 640, -611, -523, 394, 385, -736, -810, 440, 1098, 171, -726, -285, 534, 112, -700, -262, 871, 824, -351, -811, 2, 555, -198, -712, 109, 1005, 357, -814, -755, 335, 481, -413, -535, 555, 876, -141, -1069, -319, 664, 463, -445, -149, 800, 610, -668, -1006, 71]
1687G1P13n50o76L97O87n47j045K88J151K48q81l28P01K85p50o20Q07R78m13r55
1707d39J20P43j15q82j22J136N35q62q13M80O77m44p82M89J052K1j106n04Q50
1726C4N28p16m64P43Q20n17j085m7R59K53p28j55P88L37q83p07M09R43j94o79
1746c61J90P23j24r74k19Q00O40n45n29N00N27n85q13K39J005J46p58k76O25K78
1766D89q25m90O89Q93k82q41N4N84M0q45j02J055M26p25o65L17N98k33o88K56
1786b95R71k7r07l94O22L76m50l59N06O39l43r68J03P52R0n44r7O83K87p12p04
1807g71M53P58j60o12K39O40j22r85k07Q62N32n61m49M32M79m77p41J78Q91K65
1827F44p09k86N65J56n52m57N80O40j46p27QN01k2n93p4P22L83n42n27K65M81
$$ y = [71, 784, 234, -442, -45, 642, 95, -950, -662, 489, 737, -144, -472, 229, 514, -236, -856, -49, 929, 516, -439, -319, 424, 309, -573, -695, 441, 976, 114, -699, -219, 458, 14, -768, -279, 773, 794, -312, -816, 34, 562, -154, -618, 125, 945, 428, -657, -704, 255, 508, -220, -375, 413, 750, -133, -840, -431, 512, 318, -361, -171, 552, 428, -546, -765, 35, 675, 130, -399, 101, 628, 43, -770, -531, 474, 620, -138, -414, 211, 489, -336, -826, -137, 756, 474, -367, -313, 271, 311, -534, -636, 419, 845, 120, -545, -228, 370, 137, -551, -295, 676, 649, -258, -652, -30, 346, -104, -463, 43, 682, 339, -629, -526, 226, 316, -228, -325, 358, 645, -67, -771, -318, 440, 280, -332, -93, 547, 425, -560, -767, 95, 627, 66, -383, 49, 528, 51, -690, -512, 379, 644, -65, -351, 214, 370, -182, -639, -59, 581, 435, -292, -284, 217, 195, -398, -472, 250, 633, 91, -436, -171, 310]
1848C10l19n29K79Q37j8p47l50M99L91m62l70N93N86l78q57J09N82J42n21q0O28
1869C25L11o67o63L99O69j58m16J36M97l9p51k82O36N08m09l78L19L43l43o32
1889e95J37Q02N9m88j82M42J50o27k51M89N81j66o30J8N41j18n30m4O61L94n17
1910A26n75K91M40k79m38K31P33ko45l66M23L37l33l76N30N07l63n88p2N45J35
1931B61m18q1N49K25o08n29L91N02j16m14J67M82j40o44j67N16M78l25l78K99
1951E0L76l77o09J61P05P5m40j66L53K10n16l66M00O34j39n26n7L98k1m93r0O36
1973A98L86m84m05K12L50k18l88J98O12m6n16l35L92K68l57j61L24N05l20n74
1993c59j0M86J26m91L3N25J37m57m93K40N16j17l82J56M57j00n66k20N02L97k60
$$ y = [310, -9, -538, -259, 578, 560, -187, -537, -38, 353, -109, -479, 114, 700, 322, -535, -426, 156, 298, -223, -303, 325, 636, -31, -694, -295, 374, 216, -200, -64, 433, 394, -357, -639, -3, 505, 96, -282, 37, 380, 37, -595, -458, 344, 403, -85, -267, 175, 325, -302, -553, -64, 517, 351, -279, -261, 280, 162, -368, -412, 249, 643, 126, -449, -158, 282, 3, -435, -204, 529, 527, -118, -484, -61, 276, -57, -433, 97, 604, 241, -347, -419, 126, 261, -157, -238, 311, 536, -72, -601, -210, 292, 176, -238, -71, 411, 271, -373, -540, -24, 454, 129, -249, 50, 426, 49, -560, -399, 306, 381, -59, -225, 128, 338, -178, -544, -144, 490, 351, -175, -232, 166, 145, -348, -438, 198, 584, 100, -305, -93, 257, 39, -349, -151, 461, 415, -101, -436, -44, 224, -133, -294, 30, 535, 215, -359, -369, 117, 243, -248, -215, 310, 447, -10, -503, -263, 253, 136, -246, -90, 367, 267, -299, -519, -17, 380, 120]
2014A20l24K35L45l60m29P8N82J36m00j78L56J17m15l15L73M84r5m69j2L53p6
2035A06m40k7N33L28m33l79K27K55j38l95J75N90J0n65j91L43K18l24k15M14L80
2056D72k39n39k2M58Q0l70k9L81J94m31m45K51M67q8l08Q3M22o6n36k00M21M08
2078C64k41l17K45L03l08m64Q4M82J54l29j95L66J30m38k70K96N36j19m07p9L69
2099A62j7m14r4M80L03k77m11J43K85r4l76J28M65R3m73k25K85K08k05k66L25
2120B5L79j87n23N3L72K7k44r4M05K35m75l85K45M31j06l27K3M37p5m42k09M30
2142eL18k52k45K20K39k07m06rN11J84l21k00K53J87l61k52K29M47m3m04l3K42
2164I2K7l45p3L51L45l09k98J20K68j85l19J77L86O9m29j41K29K05k30k00K83
$$ y = [120, -204, 31, 376, 16, -413, -335, 247, 383, -17, -195, 161, 278, -137, -452, -79, 405, 310, -159, -171, 182, 106, -334, -361, 172, 500, 67, -312, -85, 170, 32, -363, -188, 402, 412, -153, -344, -1, 217, -107, -322, 92, 472, 233, -306, -328, 130, 210, -160, -189, 192, 386, -45, -490, -239, 228, 140, -168, -85, 337, 271, -265, -465, -44, 364, 123, -194, 51, 354, 46, -418, -334, 148, 302, -27, -222, 144, 274, -164, -434, -138, 398, 279, -128, -207, 162, 145, -269, -363, 117, 420, 143, -268, -125, 160, 66, -310, -182, 283, 376, -97, -322, -37, 171, -34, -300, 25, 404, 217, -306, -253, 119, 146, -98, -192, 213, 448, -27, -412, -167, 264, 158, -169, -146, 291, 216, -226, -435, -5, 313, 61, -184, 36, 275, 68, -338, -347, 164, 348, 27, -173, 80, 267, -94, -346, -117, 330, 287, -117, -150, 92, 119, -226, -299, 52, 397, 88, -210, -90, 178, -7, -326, -149, 237, 306, -123, -264, -35, 170, -60, -260, 23]
2185B3K88j25l98l7L45R7k82r2L42J71l23l51J49L68m6k61N7K94M8m23k17L43
2207c0K48j16k59K13K32k09l66M9M06J11l04j31K63R0k94k70K36M17p5l17o2K46
2229G8N2l21r9L94K79k40l77J15L02j73j84K6L92K6l37k06K40J89j99j90K86K59
2251C12j40m00k6K77J43k44p3K99J09k81k35J75K68o6k73O9L26j6m03j04K33K37
2273A87j09j81J21K40j57l92R6K98J30j99j93K13J88l16j99J78L09P2l70k2J98
2294I2L1k76p2K69K40j69k71M0J81l8j62PL11J74m03j49J47J81j54j78J83K77
2316B61j10k80p0K50K6j50o0K36J97k99k22J02K36j3k12O8K72m8l67n3J86K36
2338A86r8k64J53J92j05k88N2K25J81j78j53J63R2j38k61J91K67l6k71j8K00K0
$$ y = [23, 311, 186, -212, -249, 96, 193, -89, -181, 161, 332, 9, -342, -193, 175, 129, -132, -75, 219, 267, -156, -373, -30, 218, 102, -157, 56, 288, 79, -287, -238, 168, 279, -25, -156, 107, 197, -97, -367, -131, 286, 211, -106, -168, 78, 130, -191, -290, 104, 383, 143, -234, -119, 183, 10, -174, -148, 244, 270, -67, -273, -33, 156, -43, -233, 53, 312, 172, -228, -254, 23, 166, -78, -151, 148, 257, -24, -259, -84, 184, 118, -155, -86, 240, 224, -179, -283, -50, 187, 78, -103, 18, 258, 101, -291, -195, 103, 233, 34, -159, 54, 242, -74, -273, -95, 214, 286, -84, -106, 92, 123, -153, -225, 44, 284, 115, -156, -116, 65, 27, -135, -128, 183, 357, -46, -195, -48, 133, -21, -199, -16, 261, 151, -129, -199, 51, 77, -73, -133, 103, 300, 1, -221, -119, 117, 104, -108, -40, 232, 184, -183, -236, -50, 186, 88, -176, -23, 169, 64, -224, -172, 53, 234, 56, -97, 66, 158, 20, -241, -50, 217, 181, -90, -108, 92, 112]
2360A12k22r2K55K40k13k27J11J17p1k13J22K78P3k35j85J85P1j18j67J84K54
2381B59r8k51j06K51J02k24n7J84J73j99k44O2K63j5j82P0J31N2k61j25J82J34
2403A01n2j52J37J37o8k96n3L37J51k32r2J05J37j62k06J24K52N5k60p7J97M0
2425A23k31m4J39K19q9k13L2J52l4j85K4J95J33k11j61J72M0n4j49J21J94j9l01
2448a47J5J39Q7k01k2K00J17j92j80R6J96N6k76N7J49J00k25j48J37J77j02j27
2470i4J27J38r8k44j3K41P9j23j04J18J00j45j64J04K05L9k37L0N3M5j36p3J96
2493D4J49r9k10Q1J49p7j78O7J78R5k17j50J54Q2j19j02J61J84p0j61j12J03J75
2516A27j27r5R9J76j71j66K6J77K9j18O2J15l1k22m8J48R6Pj13M6Q3kk10n8K38
$$ y = [112, -110, -202, 53, 293, 80, -147, -36, 81, 10, -203, -81, 197, 270, 35, -150, 35, 106, -12, -179, 5, 259, 161, -90, -196, 55, 157, -67, -124, 60, 233, 34, -210, -148, 115, 100, -82, -12, 119, 171, -90, -215, -33, 101, 49, -103, 34, 171, 103, -193, -246, 91, 242, 10, -82, 23, 160, -2, -208, -84, 168, 223, -37, -114, 83, 123, -108, -152, -13, 206, 117, -96, -64, 88, 54, -131, -107, 88, 221, 10, -151, 21, 61, 7, -142, -21, 173, 154, -147, -132, 7, 94, -107, -129, 71, 188, -4, -184, -88, 108, 164, -112, -55, 94, 194, -31, -179, -42, 135, 33, -94, 33, 171, 73, -171, -184, 57, 136, 13, -91, 27, 127, -18, -182, -78, 127, 166, -71, -41, 12, 57, -79, -152, 44, 193, 94, -116, -35, 114, 37, -141, -74, 104, 199, -18, -168, -14, 68, -51, -153, 8, 192, 122, -39, -151, -48, 127, 0, -95, 4, 180, 9, -157, -131, 46, 75, -43, 19, 134, 103, -119, -167, -19, 77, 84, -29, 17, 100, 98, -112, -170, 68]
2541F8k4k7o9J08Q9k21j00J01K27m6j18l6J03K9j47j30K06J73p0j56j4J09k8j09
2565h2jK16L8j72r4Q5N3q0o0N7J94l3j40j39J75R7j43r0J37J27j37j42Q2J13l
2590E8j66R8J25k1j76n9J17J13k4q1NJ36m6k30J7J41J59j29p4K5J08j22j15J03
2614c8J64J5j77rM9N1j01q7J20J75j00j30K9J00l0j41L8K04L1j38j15N2O4J5j13
2639g2N4J70m1j58m9J29K9j00oL8J48q6j30LJ24Mj38OJ65L9j64r9R4O1k1J0mQ4
2667I0k3j76n5K16lk4m1K1N7n5j68J57J08L7j65m6J41n6o5j37K13O7j7j28lJ04
2693D9k4j13J8J38O7j13j46R1Q9o8o8Q5J12Pj19j06P8N5j2j21J18J11o4j62K6
2718g2P3L3p3j0J20Rj25q9J11J42p9j36J35O2k9j61oJ09O6o1j16R8L4pj32L2R8
$$ y = [68, 44, 17, -52, 56, 145, -76, -176, -75, 152, 106, -12, -48, 55, 84, -63, -193, 13, 186, 116, -40, -54, 55, 27, -82, -83, 133, 171, -1, -95, -10, 43, -37, -97, -40, 154, 121, -19, -158, 17, 114, -29, -119, 18, 145, 8, -134, -52, 61, 58, -108, -10, 115, 94, -82, -141, -24, 89, 65, -16, -11, 125, 79, -151, -134, 7, 166, 37, -37, -12, 96, -26, -141, -38, 126, 141, -36, -45, 4, 55, -46, -133, -13, 162, 62, -68, -39, 61, 31, -110, -72, 132, 163, 25, -90, -38, 26, 41, -72, -18, 152, 111, -47, -96, 33, 62, -38, -44, -6, 142, 56, -74, -71, 53, 57, -81, -75, 90, 129, -35, -134, -40, 21, 0, 10, 6, 90, 67, -109, -164, 52, 49, 25, -16, 5, 62, 7, -161, -4, 104, 141, -24, -70, 71, 15, -50, -187, 26, 93, 76, -52, -55, 49, 25, -88, -70, 68, 135, 22, -124, -33, 56, -12, -80, 5, 117, 124, 5, -101, -23, 32, 20, -101, 17, 128, 64, -98, -72, 1, 34, -39, -49, 71, 80, -45, -134, -23, 119, 40, -96, 39, 101, 72, -89, -95, 14, 80, 19, -97, 1, 35, 28, -104, -72, 26]
2745B6Q0j30K7J4Jj03QJ09R8r7l4l0M2K5p7JJ00L4r6n7O4O3n6p5M3J17l4p1r1
2774i9J16L6o8j9N4M3m3j07NJ47n6q7P6P6Kq6n0j1J36K6j05l3J55p5j05j2J17
2801C3Q6j55qL9M3o7o6J9J19N9r9o3R0J3j10n7J31J07l3j02K9J1j1q4%J23P3n6
2829F4j44M4J4K9n8K5O0O6j75m6J09P7q4l9R7M5n3j35K5J31J8r7k4J73o1o4o7
2856g0kJ26m7J3j4P8o1p6o7J40L5q3M1L6M3j30o5J6J60n0n2J7M3J7p8m9R6R7n4
2885F0r2J4J7J7j17M4M5R2q2r9R4L7n3n1L5J09k7o8k6M6O2k3j02Q8O2q4p2K1P2
2914A9L5n3r0J41Ol6j04P9O2n9j4NK1or2j1J05N3m6LqP7q0j03O0J16j9r2K0J5
2944DRk7r9J29L6m4k1k4j1K3j7O1l6J05q7m1J6L2np9O1J07Rj34m0K0J05n1l3J2
$$ y = [26, 106, -24, 3, 17, 18, -85, -77, 32, 130, 33, -1, -31, 11, 36, -41, -40, 60, 94, -2, -59, 5, 68, 12, -63, -20, 97, 63, -8, -99, 17, 53, -15, -34, 20, 63, 20, -87, -82, 65, 9, -78, -2, 74, 76, -10, -60, -71, 65, 91, -14, -47, 108, 33, -72, -84, 33, 119, -36, -44, -5, 38, -29, -95, -76, 43, 102, 3, -60, 30, 43, -67, -124, 7, 114, 81, -21, 8, 19, 8, -76, -76, 47, 120, 64, -80, -36, -22, 7, -51, -26, 34, 100, -75, -121, -12, 65, -19, -58, 39, 84, 31, -104, -79, 52, 70, -27, -51, 122, 61, -3, -70, -72, 54, 7, 20, 6, 84, 23, -53, -120, 20, 55, -28, 13, 49, 92, -38, -103, -87, 73, 23, -29, -12, 31, 48, -30, -79, 17, 114, 60, -32, -18, -1, 16, -101, -57, -12, 80, -2, -101, -7, 30, -23, -74, -39, 70, 43, -25, -51, -5, 57, 34, -68, 20, 82, -2, -74, -53, 19, 54, 1, -89, 52, 58, 22, -82, -3, 59, 0, -14, -9, 12, 6, -86, -97, 8, 61, 15, 18, 10, 87, 7, -96, -36, 80, 61, -31, -11, 4, 13, -14, -113, 16, 52, 8, -13, -37, -48, -25, -42, 19, -17, 88, 1, -40, -24, 8, 3, -76, -15, 92, 101, -33, -73, -53, 52, 1, -32, -20]
2974b0J21o3j16K9M7J2k6o1J25M4q4k0l3Q0K3m0JM0l9j3j34J29J0M2j11O3O3p3
3002dj9k1O0Q3j20k1Q9m0n1l2N5J04l2p7J1K0Pm7j0M2P2Pj15O6k0L1j12N7O4J2
3032E9r8l8P3L9p0RN3O4p8p9QN0K2Kn7N5Q6q2o5J9N9j3qn5N0Jm2L3l8N3pk4QQ6
3066G5j03m5j2Q1N5n6pk0R5j15k0L5P8K0m1r5N4P8n1m7J00j4l6n1M7Qo0J4nJ13
3096G5j8m3o1%lPJ9M4Q7j01q5L0P6%r6J6J11J1m7m0J7N2mo3J3O9o3j6m7N0K5L9
3128E4n4nN0jn0l7P2M4m7o2N9mpl5m4J06O1m9q2J08n2p2K6kJ07l6l2j4jJ9j7k1
3160a8J8O9r8k3nQ9m2n9N7L0L1o2m3M9kj8pP2Ml2j26L9Q8j3l2M8k6K0m1OjO4p
3193B9o3O5ll0J1n5Q3Ok0m0K9%l3k4L6Q7l2q2J5%J04q5l4N4J2j6Pn0N4Qr0O6O6
$$ y = [-20, 101, 38, -78, -49, -2, 10, -16, -77, 48, 92, 8, -12, -45, 35, 58, 18, 19, 59, 20, 7, -127, 2, 12, 54, -57, 6, 69, -4, -23, -44, 16, 99, -21, -42, 47, 7, -44, -76, -21, 83, 51, -26, -15, 5, 12, -35, -45, -3, 69, 76, -39, 27, 7, 38, -74, -17, 47, 59, -39, -77, -4, 35, -35, -26, 27, 91, 13, -66, -58, -8, 14, 16, -41, 14, 100, 18, -47, -28, 31, 18, 10, -45, 5, 6, -36, -3, -41, 12, 5, -19, -11, 75, -28, -73, -85, -4, 51, -5, -12, -32, 63, -52, -72, -37, 41, 61, 20, -75, -21, 57, 6, -41, 59, 45, 9, -42, 5, 13, -47, -33, -38, 75, 57, 14, -47, -47, -50, -43, -24, 20, 107, 6, -79, -49, 27, 27, -69, -53, 58, 69, 22, -18, -1, 51, 47, -16, -3, 66, 3, -13, -60, -10, 15, 54, 0, -5, 45, 44, -6, -43, 29, 73, 26, -36, 23, 19, 12, -23, -67, 39, 100, 51, -31, 77, 25, -47, -21, -23, 84, 48, 16, 2, 1, 20, 3, -18, 0, 69, -29, -52, -57, 32, -10, -69, -12, 18, 49, -13, -56, -7, -9, -27, -34, 38, 42, 10, -116, -77, 11, -2, -34, 14, -12, 8, -33, -27, -28, 36, 29, -34, 31, 28, -2, 9, -46, 37, 43, 23, -17, 12, 12, -21, -45, -9, 78, 46, -36, -21, -21, 83, -2, -36, 18, 30, 14, 21, -29, 25, 33, -57, 9, 75]
3226G5l3m3k1K0qL1m9K5Q0l2j8p5Q7p9k4R3l0K2l6q1J06J1n0RQO0Nn4j5N3K2o0
3258ak1K1nj0K2l6M3L3m8j9N1NKq0JN4j5L2r8N2jJ7j2pN0K5k8j0K1m7o3O4M6L
3292D1p4mkN2J4o1OO6k1m4J2j6O1o2kM5K8n7J2m5J13k9l1mL3j4J3n8L6K3n4N5
3324C2k6K9n4l5L8O5m1Mk5MjJ2l0J8L3J4ln5k8O7%k6J3L6p6poL3O0r7M3O2j3k6
3358A4o4QN7k7OqL9K9j15NM0L4m2l3Q5J7l1jL4j8pj3j2QK4k3n6M1M9n5O0r0L5
3391a0l5N8l0N1j9J5k0k4LJ2j5l5N8j0n4N6j3K6j2n1O4k5N1o5k0O7l1PnK2N0p7
3423a1J7M4k2k0L1k0Nj2l5j8N7qj1k4N4j9m0K7pL0qmj3L4Lj7rpM1l4j6K3k4N7
3457D4n9L1RJ5k7n8R4j8Jo9J5L7K5j4n4KK6K0r5O7R6m3l1K4L0j22N2k4L3O5p0
$$ y = [75, 42, -1, -22, -2, -10, 21, -28, -3, 77, 45, 27, -48, 39, -40, -64, 29, -1, 21, -15, -96, 10, 21, -29, -20, -12, 48, 53, -1, -16, 37, 59, -1, -22, -1, -6, -16, 6, -30, 13, 46, -2, -21, 30, 35, 37, -43, -42, 12, -3, 29, -69, -17, -18, -1, -13, -20, 30, 55, 27, 17, 38, -9, -72, -8, 38, 41, -33, -37, -39, 13, 27, -34, -28, 38, 17, -27, -15, -31, 30, -32, -34, 11, 39, -18, -6, -51, 62, 33, 2, -2, 31, 17, 30, -28, 8, 31, -23, 32, 6, 35, -19, -54, -16, 49, 8, 12, -13, -9, -10, 2, -28, -10, 23, 37, 34, -21, -49, 18, 18, -8, 5, 41, -35, -42, -48, -15, 45, -52, -9, 53, 40, 14, -50, -42, 15, -12, -6, -14, 25, 54, -61, -56, -16, 18, -24, -57, 28, 45, 14, 13, 47, 29, 22, 9, -3, 5, 29, 6, -50, -9, 40, -15, 45, -45, -10, -45, 13, -17, 34, 15, 30, 10, -14, -11, 1, -14, -49, 9, -1, -55, 1, -12, 14, 2, -49, 15, -10, 41, -24, -44, 23, -8, -1, -6, 16, 66, -11, 6, 50, 28, 8, 39, 19, 24, 12, -23, -41, 16, 8, -3, -27, 27, 8, -32, -5, -12, 18, 10, 6, -7, 27, 30, 13, 4, -3, 38, 4, -12, 11, -13, 44, -15, 16, 25, 40, 13, -45, 49, 31, 32, -37, -22, 15, 40, 26, -28, -26, 0, 20, -75, -8, 88, 45, 14, 38, 68, -54, -2, -26, 7, 72, 2]
3488BJ6j0l1M3n1JO4l0j9J0LK8o5L5J6L2n4k9L4j8P8m5k6R6n8o7L9M8m0Rp8L3
3520c4K7K6j4lrP9Jr3K7Oj3m1N1P6j06M8m1J0L2j5MJ1pO3p1k3lj6pM0j2J1l5J2
3554a9OK9k1k8P4L1m4l1k0LlO5r6R0Rj5r2M3M9k2o8O7K3j8j5o2M4j4K5kO9o0K3
3587B0p6M5K0KK2n4J9J3J9n7K7k1k6O1n3N0k0k5M7M4m1Ml9qM8l7K4k4M0k0Nk8
3619a9PJ1J6jOK2n0L6m2J0K5lm1N8L0o7J2K7l3k7Nl9Q3nn9L2J9J7K4p2J9j3J7
3652E%m8J23r0k9P9l3O5k3l5l4M3mj3m6QJ9KoL6K6j7n5K9J3k0nm3P2j2p0L9J4
3685a0Qk5K5l1L8K4m9RQ4n7m7J8jL6n2K9j3j4L5l8K8O%rj2JN3k3%K9n8M5m8pM4
3720A8K4p5OO7no1J0j7j0O8j1j7K1k9m5P8Kj0L8m5l7M1j5k6J7lj2L8okN1j3m2
$$ y = [2, 18, 8, -23, 20, -31, -30, 34, 4, -15, -5, -2, 26, -39, -4, 12, 44, -10, -39, -5, -23, 55, 10, -16, 80, 22, -45, -6, 42, 2, 11, -67, -34, -7, 19, 5, 2, -7, 72, 73, -20, 7, 13, 0, -41, 10, 86, -20, 28, -13, -3, 29, 14, 18, 29, 22, 85, 14, -9, -12, -28, -35, 5, -7, 4, -31, -19, -13, 16, -5, -33, 41, 72, 28, -3, -23, -20, -23, 42, -54, 36, 45, 30, -62, -19, 30, 8, -60, 7, 30, 12, -3, -65, -21, -35, -10, -12, 57, -3, 20, -56, -11, 9, 11, 33, -21, -2, 11, 30, -27, 0, -21, -47, 14, -39, 11, -9, -34, 13, 57, 16, 20, -19, -27, 21, -16, 8, -16, 24, 4, 9, -19, -12, -1, 15, 14, 20, 42, -8, 28, -14, -4, 21, 18, -23, 35, 65, -2, 10, 37, 4, -23, -18, -57, 26, 21, -38, -6, 13, 30, 54, -18, 1, -12, 5, 5, -43, 80, -10, -39, 40, 7, 72, 49, 14, -20, 23, 19, 6, -40, -32, -13, -11, -17, 19, 45, 28, -27, 2, 15, -5, -10, -53, 19, 7, -63, -24, -10, -2, -27, -2, -33, 5, 29, -20, -11, 73, 16, -31, -13, -14, 22, -30, -1, -14, -28, 7, -31, -3, 3, 3, -6, -18, -17, 36, 13, 13, 42, -16, 29, -19, -26, 18, 42, -33, -27, 40, 35, -26, -16, -33, -43, 25, 14, -3, 18, -11, -56, 22, 24, 14, 52, 7, -30, 11, -4, -30, -13, -16, -28, 10, 4, 2, 53, 40, -2]
3753bK5nM6n9k1J2Om1J4K8L7j9K7Kr6P6k6oM1k5mk1L2m8K4ql6P3o0oO8k7L2k9
3787DJ7J1n6P1q9M5MK9m3n0M0J9l7MP3Jj8jo7O3oL0m7L3k0L9o4J1qj1pM6Pn1O6
3822C8l3l1L4J0j2k9N4l2n2P9m7N2m5j1M9mk3J8k8l9O4rK8n7K8jj8m8M6Q2p7l9
3854e3M8M5k1p1J7K3L4m0K8J2Mk6n4O2K6ok1n7M4L8l1M3m6J3j0K0pk1k7M1K3M8
3886G8j15J5K8PnNk4L4Jj7L2j5n0J4Oj6L9k6k8L8K5j9J4p3J13q2m5N1O3n6j5K8
3918EL1p8J16r4j1M4J6K4n7J8l4M3k8J5l8N0n0j7K8j4j2k4K5M5J5m2M9n5NL9j2
3949BL7rj3l7M8on3M4Oj4PRj4p1J34r2k9L4KM6p5mJ4O2l3rL0j5L8n4L1K9l3k5
3983a3Kj5R5o7M8o5K0Nj2mk8M0m2N5l1L3k0K0K8p7P4p9K6L5k5jL3Lj6j3lj1M7
$$ y = [-2, 23, 18, 64, 5, -16, -4, 2, -39, -25, 3, 40, 21, 48, 50, -46, 30, 4, -2, 39, 14, 10, -11, 21, -27, -3, -11, -47, 26, -34, -40, 28, 1, 33, 4, 21, 32, -24, 47, -42, 3, 7, 36, -7, -57, -17, 2, -35, -31, 42, 43, 25, 24, -43, 20, 14, 44, -3, 30, 10, 49, -15, -4, -12, -23, -30, 16, 23, -28, 38, 5, -26, 8, 18, 6, -23, 31, -1, -53, 26, -21, 31, -14, -25, 24, 20, -3, 15, -13, -52, 12, 3, 31, -26, 2, 1, -17, -65, -19, 63, -14, -53, -5, 40, 19, -52, -35, -12, 22, -18, 10, 22, 26, 0, -54, 8, 34, 28, 7, -50, -6, 32, 1, 44, -2, 11, 1, 21, 14, -7, -34, 7, 30, 78, -37, -22, 6, 13, 8, 13, -11, 23, 24, 7, 39, 24, -26, -12, -6, -22, 17, -9, -37, 1, 26, 7, 21, -52, 61, -21, -66, -15, 48, -8, -23, 5, 36, -42, 74, -20, -31, 13, 29, 53, -4, 14, -20, 23, -5, 10, -28, 22, -28, -45, -17, -31, -43, -67, -42, 3, 18, -24, 25, -30, -25, 14, 2, 39, 30, 17, -20, 28, 22, -31, 13, 19, 5, 12, 21, 7, -64, 70, -22, -51, -17, -15, 31, -44, -48, -34, 28, -5, -14, 16, 1, 39, -15, 16, 45, 12, -13, -11, -26, 69, 2, 50, -15, 5, 10, -2, -6, -34, 6, -36, 19, -12, 21, 1, 21, 49, -28, 46, -33, -7, 28, 3, 2, 35, 38, 22, 9, 6, -5, 42]
4016D2k0n9j2N6k5kL0l0K8m0j5K8J4j8JM1k9k1K3j0M4j4j2lKJ2k0OOJ8j9m0kN7
4050A7l5L1J4lm5R8j24O4n2O4k9l6j3M8mj8M8pqLJ5n6kk2L4Mj4K4jkL6Jll1mm1
4086d9P5j8L2o2Mj5j7N5Ln4M8K0Ol7M9j4J1l4L1k4P2p8l3R1q8K5%M5j00L1L5k6
4118a6L1j0n4J4qJ2Onm5J24q3K2O1o9j0L7j04Q6K6J4l6j9LM2j5k1L8K6m2JL5p4
4150c3J3RK9k4j8K9J8%l8K7l7K7J8j6k5J9k1l8K4J4KK7K8K1o9PN7m6j1K5l7P6
4182E7q0L3j5l3P3l1J6j6Ql2M1j3k4LN8o5l1N2k2O8o1L1j6J0qk3Q5q6loO4nMJ1
4216D4j9mL3l1l6M7k3J6k1n4P4n9L3J7m3K9L1n5LL0L2m4Ok0L0J7Jn0k9J4J3J1
4248gJ9pqj7O0p3J3k0M0Oj1j9N9nj0o6P4j1Q3p0j5J3k7M5r4Q8q4QJ7qM4qmN0m9
$$ y = [42, 22, -37, -49, 7, -18, -20, 10, -20, 8, -32, -47, -19, -5, -23, -22, 19, -10, -31, -8, -18, 26, 12, 0, -3, -1, 11, -9, -3, 3, 21, 2, -38, -40, 17, -18, 13, 27, 24, -21, 77, -47, 17, -35, 29, 0, -36, -49, -1, -5, -23, 25, 18, 10, 13, 28, -28, -30, -52, -18, -14, -28, -4, -5, -7, 29, 30, 27, -4, -8, -49, 26, 8, 40, -22, -18, -33, -50, 5, 8, -46, 2, 22, 28, -9, 40, 26, 37, 3, 34, 10, 82, 4, -29, 62, -26, -1, -1, 44, -56, -25, 10, -16, 15, 5, -49, -35, -43, -31, -25, -30, -75, 49, -34, -12, 49, -20, -30, 7, -97, -11, 15, 29, -7, -26, -23, 19, 4, -17, 21, 47, 5, 6, 41, -33, -20, -11, 18, -6, -24, 5, 23, 23, -15, 12, -25, 2, 20, 4, -21, -2, -23, -61, -37, -23, -21, 6, 34, 55, -14, -7, 50, 4, -7, 18, -19, 57, -23, 10, -5, -38, 35, 4, 20, 4, 12, -20, 21, 8, -16, -13, 45, -20, -51, 1, -21, 47, -14, 17, 1, 11, 3, -20, 65, -21, -24, -30, 34, 29, 33, 44, 25, 21, 54, 23, -13, 34, 11, 27, 6, -48, 26, -33, 0, 17, -26, 3, 34, -21, -18, 12, 44, 0, 6, -14, 16, 33, 34, -16, -45, -31, -18, -7, 12, 5, -3, -20, 40, -33, -20, -40, 0, 6, -5, -24, 35, 30, 20, -46, 28, 17, 100, 30, 15, 28, 1, 46, -48, 40, -44, -36, -19, -27, 17, 9, 5, 55, 6]
4283FJ0j1%Kj2N5k2n4J6J0%j8L9o2L8Qql7N5m0K0p4M0rL1J7kK6lk5l9R5k4m6O2
4318D4l4k0J0k0J5K8n4K5MnpK2L3o4K0M5m7k4K0JnOL2m2J3PjK4m8K2j4Qk2pQj4
4354d1Qj9Q9k5N7k3l8J1j5K5j8k2nM4o1N1l9M3L5r3M3j2qj6m0Q7q4M7O8n8j2O
4386a5m0M8L1k3J1o5pP2mj3l2N3K6o8L7qkk7k8O5K7m7olRk8J2J7L3k1k5L3pl8
4420c3L1J9k7J7K5kj3m4L5K5K8p5L7qrl1L2lNn4N4ml3K9Pk3K3QJ4o6QM4o0Q4p7
4455c7L2j8K0n1PN0l5P1n3J4J0j0L1l8l0K6J0kOLK0k2l1L3m2L5J7j6NNn7N0k5
4488b2M8l4K5pJ1l9M2l7O4n0j7M8n3L3l4K0J0m9KO3L0n1o9O2Lj4L0l8K0L9n0P
4520gj8O4m5lJ7n8M5qj4PL3k7m2R1p3O2%l1J1j7J4K0j3qL7q9O9m3M7Mj4rk4K7
$$ y = [6, 16, 5, 5, 7, -5, 50, 28, -26, -10, 0, 0, -18, 21, -41, -3, 5, -3, -40, 15, -25, -5, -79, -39, -48, -17, 0, -2, 24, 21, -4, -43, 52, 28, -18, 44, 10, -10, 0, -20, -5, 23, -31, -6, -2, -7, -14, 8, 41, -23, -3, 42, -5, -29, -9, -8, -13, -7, 25, -17, -4, 3, 2, 26, -22, 0, -14, -6, -28, -35, -27, -41, -33, -52, 37, 12, 69, 46, 8, 19, 4, 29, 11, -11, -16, 28, -33, 18, -21, 22, 57, -36, 7, -5, -13, -29, -69, 18, -66, -19, 49, -9, -21, -15, -55, -7, 24, 1, 12, -53, -60, 12, 8, -5, -37, 16, 42, -26, 11, 3, 1, -26, -54, 11, 38, -9, -15, -18, -9, -37, -25, -8, 25, 4, -21, 12, 5, -33, -2, 17, -10, 7, 32, 30, 17, -27, 8, 33, 61, -14, 23, 15, 6, -25, 7, 4, 9, -45, 9, 5, -28, 1, 8, -15, 8, 16, 30, -36, -28, 16, -44, 40, -37, -5, -23, -3, -54, -47, 3, -32, 39, -14, 0, 10, 0, 31, -7, -37, -11, -1, -3, 3, 6, 26, 4, -27, 6, -36, -1, 16, 0, 5, 10, -47, 3, -22, 26, -8, 17, 10, 21, -18, 24, -13, 51, 1, -16, 32, -21, 12, -22, -2, 8, -41, -39, 24, 54, 3, -66, -4, -1, -15, 15, -23, -3, 36, -14, -7, -25, 39, -6, -9, 8, -50, -5, -13, -27, -20, 13, -14, -56, 35, -38, 24, 24, -7, 4, -13, 1, 21, 8, 0, 37, -52, 17, -26, 21, 25, 11, 2, -22, 5]
4554Ek3NPk9Q4m2L3l8l1K8NN0q0M1qJ5j4K1m4J9QK5%k2k9MPK7p1L8J8j3L7m9L2
4589A6l3L7m0J7J1M8k8k5k3J2J9nj0L8l5K0K9n6Rm0N0m2K2m3O3J9j0Lk7L0k9r
4621a2J4K7n1J3L9q9J9lJ03m5o3LO7n3M6k6qK7k2mN5l0l9k7O5j2M1n2M0m5jK8
4653EoN2n9j7K1L6m4L1j0j9J5qRj0Oj6J1K8p0N6nLJ4J7qlm0%j2L4l6J0K8J8m2
4688a1KM6n9L0K0l5N9o3P9o2K2k2k8KJJ8Nj1l2J3K8jj7L3l3K9m7M8nRJ6l3Q4j03
4722a8J4M1j5Ok3k6J8L0k6J1m0M3Pj0k3qN6r7P9J0j7mPk6O5M2j04M9j04P0m0K4
4754ik0N7n4OK7Lmj3O0k4k9M0l0l3N8j7l6O9r2N5M7p0M5k2k3j4L4K0k0m6P0n8
4786b3K8j9Kk4L2k8J5L5o5L9L3k6l1j8O8m7l3M5J9M%mJ2m3Pj7L0Q9n9o6L2J8K5
$$ y = [5, -18, -13, -6, -35, 49, 7, 40, 2, -29, -1, 4, 54, -26, 15, 7, 22, 8, 29, -15, 4, 12, 37, 37, 15, -14, -10, -3, 24, -47, -9, 9, -4, 33, -16, 16, -17, 20, -20, -3, 8, 56, 28, 3, -20, -8, 11, 6, -4, 34, -1, 19, 48, -8, 1, -39, 11, -31, -9, -52, 11, 30, 20, 23, -4, 26, -3, -12, 2, 29, -22, -9, 30, -59, -40, -43, 60, 15, -48, -45, 22, -31, 15, -11, -19, 8, -14, -18, 37, 7, -32, -59, 6, -6, 35, -17, 23, -22, -23, 5, -1, 51, -8, -25, -4, 32, -12, 19, 9, -10, 5, -3, 6, -4, 2, -14, -3, 25, -45, 11, 6, 9, 23, 40, 32, 29, -11, -11, -23, 11, -25, -15, 13, 31, -11, -9, 37, -22, 8, 28, -7, 52, -11, 68, 6, 28, 6, -22, -20, -19, -1, 4, -7, -39, -26, 2, 1, -16, 17, -16, 13, -34, 14, 9, 18, 34, 1, 85, -18, -4, 37, 22, 28, 5, -21, -3, 27, 1, 12, -28, 15, 22, 12, -11, -19, 37, -60, 19, 29, 12, 8, 15, -11, 54, 96, -8, 41, -63, 7, -33, -9, -29, 28, -26, -20, 7, 10, 6, -7, 53, 29, 0, 40, 10, -23, 35, 18, -18, 51, -41, 14, 61, -9, 36, 14, -9, -23, 11, 31, 11, -35, 35, -23, 5, -14, -12, -36, -4, -32, -17, 18, -47, -8, 25, -1, -32, -50, 18, -29, -62, -17, 2, 6, 6, 2, 14, -29, -22, -39, -9, 80, 21, -45, -13, 5, 30]
4819C0l8l4K8L9l3ML0oqm3M2k4K9k5mk4N3Jm8LR4l5m5J0l0K7lk7P7l3j6k4LJ6
4853a4rK8n8L3PM1j5Kj5mK8n8j2L7Nj1J8j1L6k8rJ1k1J5J1k0k3L3J9J4m0K6J6
4886C2q8N8k8L3k6L6l9L2k0M3r7M1mM9j0k9M4m9Mk4nM2L0l3jM8k5K5j7o5P0k6
4918AJ1l5M6Pl6l3M7m0mP1o2L6qJ7m0L8mo9M6kRJ6J6k1N2m5NmNkl7P1o2J8l4P
4954a9L8n1K2J5Pm5J3j7J1J5KK6l1N1q4K2J1k2jK9M8l6J4l9k3M7lm7J8K6K9rj2
4987ElK5k0pK6Km9O8p2N7J0m9J1K3k8j7j5O9Oj4j06R4m0N1j6%j3j4N0n6M4k9K2
5020A5Mo4k0M3N4l0j1J0J0n3M9m1O1rm0K1j2RJ9J5l6L9ll4M4j1k2L9m1J2m1J5
5052i%Mm1M7K8J4n5K8%J5J2m3K3Nk2pJ7K6p0K7J1k9M2n4N9k6k2K8m1L7k3L3n4
$$ y = [30, -8, -42, -14, 25, -8, -4, 26, 20, 12, -31, 11, -13, 16, -9, -13, -37, 16, 17, -31, -28, 66, 31, -14, -4, -34, -7, -10, -37, 40, 7, -9, -33, -30, -14, -23, 5, -53, -20, -13, 28, 13, 15, 0, -4, 24, -34, -46, -9, -4, -15, 3, -8, 28, 0, -9, 2, -19, -4, 7, -13, -36, -3, 16, 30, -10, 16, 32, -56, 2, -26, 7, -19, 17, -22, 10, -10, 33, -64, -23, -27, 22, 12, -17, 27, -22, -18, -42, -47, -5, 25, -8, -9, 39, 14, 39, 22, -43, 27, 1, 12, -23, 23, 30, -6, -39, 8, -32, -36, 35, -27, 9, 1, 18, -22, 16, 12, -57, -11, -13, -4, 12, 28, 7, 59, 14, 19, 15, 20, 18, -19, 52, -10, 8, -26, -19, 19, -32, -10, 5, 12, -33, -20, -37, -26, -11, -9, 17, -14, 37, -47, -25, -14, -36, -37, -8, 40, 4, 18, -21, -44, 3, 0, -47, -29, -3, 26, 17, 5, 2, 27, 7, 0, 26, 28, -21, 47, -25, 32, 42, -7, 4, 27, -1, -18, -33, 36, 42, 28, -78, 16, -24, 27, 11, 11, -2, -16, 34, -22, 22, -7, 15, 19, -45, -65, -22, 32, 2, -9, 1, 11, -42, 7, -34, 27, 18, -22, -1, -13, -4, 15, 30, -6, 33, 30, -4, 40, 29, 7, 46, 5, 17, -24, -9, -9, -5, -46, 1, 29, 43, -12, 16, 16, 31, 43, 0, 23, 28, 6, -1, 16, 42, -28, -1, 10, -19, 23, -31, 28, 2, -20, 8, -33, 4, -19, 14, -40]
5085d0Pj4O1r1J06l4Qqj4O6m9N1l3M2m0ML9l9J0n9J9K2L5m9K4n6Q3k1m0jl2J04
5117F1m8N2n6l8L1n5Q9Pn7K1j2NK9m1L0m8M4j3O2n1J2rkJ8jl3l7N9l0k9JP3j9
5150A5j9Ll7L1m0K0L1Mj8K9l6k0MM3L0qok7K0l4LLK1jn3K1L3j4j9QK5l5O8J3q1
5185b3N8m7L9l3l8O9q8M7l9R5l6N8r3L0J5k5M2k3j2nJ1J4k9JJ9K5k9K4m4j7L4
5216@jJ5k5j0N0j6M4o3J3K8l4l5M4k0LOl9L2j1J7l6K8L8p0J1PN1j7k7OL9K0j4
5249C4j7Nn6N0n3L5L8n0l4R7n9O6n2rj8L5J0mNq4O4mK0j1J5Jq8N1K0Mk9RP8p8
5283iK0j6J6N3l9k5%Lj4lJ6j9O8o7N9j6p3L8RJ6l2l3OK5L1k3j0J7Q0n7l8QK6j7
5317@Kk2oJ1J1lk9J4jP2p4L2nK9l2K1J1n1j3L3N2o8K2k5J0J7j3L3Pq4O9q0N7j5
$$ y = [-40, -33, -47, 14, -77, 29, -5, 3, -5, -19, 47, -2, 49, 16, 58, 18, 22, 61, 22, 32, -27, -8, 14, 49, 0, 24, -32, 51, 30, -10, -11, -43, 61, 13, 65, 9, -29, 2, -53, 36, 43, -14, 7, -5, 0, 29, -12, 18, -30, 14, 1, 63, 12, 24, 15, 13, 31, 30, -3, -40, 19, -11, -40, -39, 34, 15, -4, -1, -38, -7, -47, -27, 4, 8, -10, 19, -17, -37, -33, 10, 40, 32, 26, -1, 19, -15, -12, -9, 12, 11, -42, -21, 12, -2, -21, -13, 12, -23, 45, 58, -23, 35, -12, 27, -6, -44, 25, -63, -16, -55, 40, 4, 62, -31, -1, 14, -11, 31, 8, -4, -9, 2, 16, -13, -12, 7, 32, 3, 27, -17, -34, 0, -1, 14, -11, -21, 29, 13, 57, -6, 7, 35, 1, -34, 10, -10, -7, -1, -40, -8, -19, -2, -38, -10, 28, -42, -31, -24, 27, 10, -17, -11, 28, 48, 34, 17, 22, -34, 16, -37, -2, 36, -14, -48, 49, -10, 56, 4, -5, -23, 12, 22, 18, 23, -61, 3, -1, 19, 8, 23, 24, -64, -13, 7, 11, -18, -9, 69, -9, 11, -5, 11, 64, 25, 0, 0, 3, -11, -14, 2, -17, 51, -16, 43, 27, -46, -8, 1, 17, -15, -48, -42, -17, 14, -9, -19, -2, 78, 21, -17, -9, 17, 0, 2, -20, -26, -15, -4, -7, -36, -22, -23, 49, -25, 7, 2, 31, -1, 20, 31, -20, -33, 0, 52, -16, 6, -19, -9, 8, -5, 28, 35, -49, 20, -60, -3, -18]
5351a8M4j1j3K0l9loM4%K6j2p0J9M4j8ol2L3kO1o0J3Lj9K0k0K3nm9N0lJ7p1k1
5385f1L8qQ8p3M7l9R7q5jK8L6m8pjQj8J5l8K6km0O9Ok6k8N3q7J8L0L2k5K8K4l2
5419B4rl0J8M1n6RQK7m0Q2o8oK3J8l3L1l5j5K3j8K5l1J9koM3l6Pk9J7j0lM1rj6
5454DMl6P3l8j5N4n4NL6k3j1n8Q8Ko0mQ0o0K7L9nm6Ojl9O8k2J5j3k8N1o7N1m3
5488b0RL0rJ2K1k1k0K5n6O1m6mjJ1l3M9M5o8J5rj1J6j3N5pJ1ll4K1l5mrM4NJ0
5523C7j8n3L2NKJ9m8J1M4k3M5k4m2K2k6K1Mjj6L0m1N0p6L5l6PN4l7L4KJ3m3Km3
5557e8N2QL8j8m7K1K7j4m3L3K7oJ6l8m7M0mL3qk6OL7j5l5L4j1jL7k9j5K9Kpr3
5591g5J01J0n8M6n0QL2n1NrO6jl5M5m2M5Lm1lN7m1o9L7M8L1n2K5K2l0n6J3J5O
$$ y = [-18, 26, 15, 2, 22, -17, -20, -26, 18, 18, 44, 32, -38, -19, 25, 7, 1, -31, 2, 0, 61, 1, 14, 17, -2, 18, -2, 21, 16, -33, 17, 14, 31, -40, -61, -23, -31, 57, -16, 31, -8, 89, 4, 3, 31, 67, 19, 12, 11, 19, 1, 16, -22, 4, 2, -38, 31, 37, 11, -17, 36, -51, -33, -3, 29, 4, 32, 56, 24, 15, -15, 3, 44, -12, -3, 5, 32, -8, 74, 6, 0, 23, 41, 8, 39, 4, -11, 12, -6, 19, -12, 7, 5, -1, 42, 6, 13, -16, 1, -9, -12, 29, 20, 4, 8, -28, 45, 7, -8, 46, -8, -3, 33, 10, -1, -59, 29, 31, -29, -33, 47, -13, 14, 53, 48, 2, 8, 7, -32, 36, 14, 29, 16, -12, 39, -28, 23, -20, -11, 19, 10, 22, 43, 22, 2, 27, -29, 32, -14, -18, -19, -8, -41, 8, 53, -15, 0, -9, -20, -4, -17, 38, 31, 42, 39, 5, 26, -9, -13, -22, 22, 27, 37, 19, -34, -2, 3, 5, 24, -24, -13, 31, 8, 53, 29, -13, 9, -17, 4, 8, 7, -9, 21, -20, 30, -46, -11, -47, -40, 14, -23, 11, 13, 26, -17, -15, -58, -6, 2, 40, 22, -25, -4, 23, 9, -34, -1, 26, 20, 36, -2, -49, -9, -13, 20, 12, -14, -8, 29, 14, -21, 13, 2, 1, 38, 9, -6, 23, 25, 18, -75, 26, 36, -22, 24, -26, -18, 14, -37, -32, -41, 25, 24, -11, 34, -8, 37, 40, -1, -4, 53, 12, -57, -20, 28, 59, 7, 32, 54, 24, -32, -19, -4, 2]
5624Bl9N4JoK8l9M0p5oO1r1Q0k3L8k0qm0P8l7o5O9k6%PJ4JK1Ml1M3o2Q0m6O1q3
5659a5ORj8LM5j3k5K2l8P8j09K4K5L5k6j3K8k2N5m2%L3l6J0j6M2l8j4J9p0O4k7
5691b4M9l4L0j5Rrm4Q2j2o3P1k6J1j0K5l7j1k3J5L5k7M3p2L0pL6L1n6N6n8J1K6
5723C2L2ro0rL3l9L3k4J2j6L2m3J8mK1KK5k5N8l3q3R1m6k0kN4j7m1M6j4Rj1k0
5756a8j0l2Q9k0J7m5m3R3n9K3l3Q9k5j0L4r0N5l7O0k5j2L2Nm0K6%J2jn7O7p6J0
5788b1J3L5nm0M6j0o4L4Jl1L5K0ok8J2j3k9RRP9l4j9J9K7k8k8J4j4NK0L1n4J8
5821Cn2N5j0j4j6M6L7l0j9M1rk2Llk2N8j4J7n3K6o7L9K2M9k0n7P8l9JOo3N4k5
5854@lN3m5k2L0K6n9L1N0j19R0n6qM6l3NL9J1l3lN2k2j0K4r2O2m8O1n1mK6m7M5
$$ y = [2, -37, 17, 18, 12, 40, 1, 41, -34, -40, 21, -70, 10, -13, 25, 5, -3, -43, 35, -2, -67, 2, -24, -24, -17, -3, -2, 19, 23, -8, 35, -27, 53, 7, 68, -15, -9, 0, -18, -15, 30, 17, -8, 14, -24, 54, -55, -31, -6, 29, 3, -10, 18, -4, 51, 9, 9, 42, 6, 16, 0, 42, 4, -10, 9, -61, 3, -24, 25, -9, 21, 6, 15, 6, -38, 44, 32, -31, 40, 14, 25, 15, 40, 3, -8, -31, -16, 19, -8, 35, -37, -7, -14, 22, 53, -3, 53, -5, 6, 32, 64, 55, -5, -14, 19, -20, 13, -11, 1, -15, 17, -26, -8, -12, 9, 11, 36, 11, 69, 36, -47, 44, -2, -22, -24, 30, 13, -28, 18, 4, 13, 2, -18, -28, -60, 29, 9, 26, -19, -62, 31, -28, -5, -38, 51, 26, 16, 50, -40, 15, -22, 38, 13, 1, 33, 38, -2, 24, 24, 36, 35, -22, 45, -31, -21, -8, 27, 22, -18, 28, 18, -46, -12, -11, -42, -7, 13, 7, -21, -9, -22, -51, -42, -33, 46, 12, -7, 12, 39, 11, -17, -3, -17, -12, 8, 39, -15, 3, -49, 6, -4, -18, -34, 12, 49, 19, 0, 41, 32, 10, 13, 10, -12, 46, 32, 49, -4, 22, -45, -6, 16, 65, 45, -12, 66, 27, 28, 34, -29, 25, 0, -3, 50, 5, -17, 13, 39, -20, 11, 61, -58, 32, -24, -32, 14, -19, -14, 25, 36, 3, 0, 52, 30, 20, 44, -48, 14, -34, 27, -24, -28, -2, -49, -4]
5887dj3lK1K4n4K0j2j0pN1j7P0j5qJ4o0j3L3J9Lj3mkJ9%k5l2L2j5K7k3Oo%j8M
5923a1J3p6Q4L2k9o2O3Qj3ql2M8L4n1PK6l7L5K1j3O8r6pMJ7l4L6j5k2Jj3nL8L0
5957D1p9P4rk8O7m5J8k3k8Oj3j9L6rK9n1J01k6pl4jJ3kk0qJ3j9Nl7N9j4k4N9l3
5991hKJ1k2K6K0n2J1lj1K9J1Rl4P9k0l8n6Q4%n8P0m3l7P2n6QJ1j0K6n1K4k4M1
6024A1lm6N1l0L2l1M6oo0O8J0m3M2k1j9m3N3L0l4J5j0rL6n4rL5L2l4L0n9J6j4
6056a8M4k8J3j7N2j4k8lJ3Lj0J9o7Q7l5J5rj7jN3r1L2JK7j8l1L5k0J7k6nMK3J9
6090A9l3m3P0J5j9J0k3OJK4J1p4K9j8k5N3K2L0n9M3l6j3N1n6k8L2J5QO4o4NjJ0
6123B6rj3nK8m7J3M2n6J4M3M0n6k7%kO4o2Ml1LQ1l7m1OK8n0J5j1K6Poj6jL9j4
$$ y = [-4, -17, -20, 1, 25, -29, -9, -21, -31, -38, 13, -4, 66, 51, 43, 57, -3, -16, 17, 36, 39, 26, 22, 20, 39, 39, 14, -18, 14, -1, 26, 3, 9, 3, 3, -15, -11, 2, -74, 10, 42, 13, -49, 14, 22, 9, 1, -31, 17, 51, 0, 7, 33, -4, 31, 52, 39, 107, 11, 4, 8, 25, -9, 27, 12, -10, -9, -22, -27, 11, 41, -38, 36, 27, -1, 66, 21, 39, 16, -12, -6, -19, -38, -2, -11, 18, -33, 68, 42, 35, 1, 0, 13, 11, -9, -17, -4, -23, -18, -55, 4, -10, -34, 25, -8, -6, 5, -17, 9, 29, -23, -12, -15, -26, 3, 14, 23, -11, 68, 48, 10, -46, 38, 38, -20, 50, 7, -30, 42, -14, -6, 5, -5, 21, -30, -6, -30, 11, 8, -38, 13, -17, 15, -16, 30, 24, -36, 32, 42, -1, 41, 20, 1, -42, 11, 41, 7, 22, 12, 3, 39, -15, -24, 11, 43, 9, 39, -20, -4, -18, 26, -2, 11, -6, 46, 32, 4, 1, 14, 17, 7, 26, -41, 46, 11, 26, 17, 0, -1, 52, -39, -7, -6, 21, 3, -28, 7, -13, 4, -22, -27, -23, 0, 19, -14, -57, 13, 28, 9, 19, -4, 2, 3, 27, 38, -36, -7, -25, -50, 3, 25, 55, -4, 39, 3, -10, 41, -15, -43, -11, 4, 12, 76, 12, 17, 16, 26, 17, 4, -1, 27, -20, -7, 35, -21, -7, 36, 76, 20, -7, -7, -9, 55, -7, -3, -34, -31, 50, 13, -28, -22, 6, -44, -29, -40, -14, -7, -13, -29, -30, 9, -5]
6158eMJ3l1j5N1l4L6m4K3L1l3K0k9RKK1K3o4M2OJ0J3k6J2k3l9J6L7l7J0QK1o2
6191c4L2%Nn2N2J2n9J3L6j%l8J4L3l3J6J3p9O1j8O8o8M5j4pl6P2k6k4M9l7oj8
6224b9JP1ok1j3j9J1J6k4JJ1k4K3L8pjq4O2J4mnm3QK2J9m7K4M8n1n0Q9m0L6Kj7
6259A1Qpo7Q8jr2O7J2J5Mq2J1M5rJ0o4M4JK0oj8J6k3Q3q9L0k6oL3l6N3J9p4N5
6293B5L2j7l8JM6k6j2n8P5Kj4n5K5O4l2l4K5m5jN8Lk8l3OL7j9lK0l1J6%K2m7O6
6327C0j2j9o2L4M2n7M4l1L2j3N5q9M4k1M5Om1J00p6J0o2O1k0M2q9Q7j7L7p0k8
6357c8K6j6MK5j0K1n1N9k2l5K7k3N5k4Nj3k6K6K8J4l8J9n0K7N6l7l0OM2%LrQR
6391C8kJ1m2k9N2q9P7J1l5J4L2l5JkOJ3pLo2K5M7j9J5Lo7P8o1kRM4j7n7J02o6
$$ y = [-5, -1, 12, -19, -34, 17, -17, 19, -25, -2, 29, -4, 16, -13, -4, -2, 19, 42, -22, 20, 26, 36, 49, 23, 35, 12, -27, -11, 26, -11, -1, 7, 28, -34, -2, -2, 3, -49, 3, 15, -44, -31, 5, 4, 4, -34, -20, 13, -20, -4, 9, -70, -9, -27, 41, -27, 18, 4, -3, -39, 33, 7, -17, 32, -5, -11, -29, -28, 43, 37, 16, 3, -16, -5, 11, -13, -12, -1, -25, -2, 36, 29, 28, -56, 6, 20, 16, 11, -32, -24, -2, 17, -30, -6, 42, -9, -59, 30, -10, 26, 28, 11, 19, 12, -55, 33, 32, -60, 7, 19, 34, 38, -44, -33, 12, 3, 13, -51, -7, -6, 14, 8, -10, 6, -17, 66, -23, 7, -19, -25, 8, -28, 25, 44, -30, 25, 57, 40, 2, 3, 49, 23, 11, -47, 28, 30, 16, -39, -14, 50, 18, -16, 9, -36, -37, 21, 24, -4, -37, -31, 6, -13, -16, 4, -27, -11, -11, 11, -36, 30, 18, -1, -63, -29, 13, -44, 0, -31, 1, -12, 43, -46, -2, -23, 22, 28, -13, 87, 11, 21, -41, 20, 0, 42, -47, 40, 23, 60, -10, -38, -12, -28, -24, 1, -9, 12, -39, 20, -2, -37, -10, -33, 22, -2, 3, -10, -36, -10, 18, 32, -6, 13, -37, -10, 46, 9, -21, -15, 27, 27, 30, 21, 29, 38, 36, 47, 5, -24, 28, -61, 16, 27, -8, 6, 38, 3, 4, 2, 8, 21, 14, 17, -45, -20, 27, 8, 23, 26, -41, 37, -24, -26, -17, 27, 10, -47, 55, -11]
6425a1O4q2L1j0L3j1n4K6L5k5J8k2j2N9q4O1m0K7L0k7N5n8j4j1K4k3k8P2m9LJ5
6456hj4L9k2M9q2KL7JMnJ1rl5O8o7K6LQRj5j4qj8j8M0L3m3NM5l5j9K6Jj7L0kq
6493bj1NJK0On2P2lj0J4k9l6K8L1jl7J1l4j3M0%j0J9J5m5QJ0k1L4M2m2n4K6l3
6527e1O1nl6R6o2k6l8P9k1j7K6%J4k8j3jL4p2Q4n3N0J0%m8j5M9p8K5L4n2NJ02
6559E3p5j0l0J04m4nj7O6l9rj1J2mJ2j2QjJ6%k0J5l0j0J4M3j2j1ok2K2k4N6l6
6592gL1l7J8LJ3Nm5k6L5j0K0Rlj5M0om3k2LM5m3lj0K4M5rq7J08J6l1k5RpM7m5
6627cKojK4j4K2m1L7Jo1M4l9L3m0J5J2K9J5n9J0M2pp0O4p0P2J3j2L1lon1mK7m8
6662d2N6nj0Rm9K6J6J8k0m7OJ06j05jM8LPl9K6MLjj0O5q1N3p1MML5J5q2Q4J3j7
$$ y = [-11, 53, -29, 2, -8, 25, 14, -40, -14, 21, -4, 14, -8, -20, 39, -45, 16, -24, 3, 33, 6, 61, 3, -11, -22, 2, -21, -49, 23, -26, -23, -8, -22, 17, -5, 44, -38, -36, 1, 2, 6, 1, 12, 3, -32, 36, -31, -5, -2, 6, 15, 0, -14, -22, -40, -58, -18, 15, -28, -23, 22, -13, -32, -6, -5, -22, 8, 6, -2, -13, -8, -7, 13, 19, -33, 39, 36, 26, 40, 11, -25, 3, 34, 33, -4, 7, -27, -40, 0, 0, -10, 9, 24, -21, -13, -3, -24, 10, 52, 10, -44, -18, -51, 10, 5, -31, 65, 3, -23, -61, 18, -3, -20, 6, 6, 20, -8, -21, -22, 12, -60, 24, -29, 21, 31, 31, -17, -32, 17, -61, -36, -2, -54, -49, 53, -22, -32, -62, 42, -2, -7, -24, 42, 3, -6, -17, -5, -9, 3, -9, -1, -2, 14, 14, -6, 9, -21, -31, -17, 26, 14, 3, -3, -25, -3, -27, 29, -7, 24, -13, 5, 8, 21, 26, -19, -45, -10, -20, 0, 9, 6, -9, 31, 25, -18, -40, -37, 8, -35, -38, -48, -24, 21, 12, -75, 33, 49, 18, -7, 2, -5, 42, -3, -1, -7, -8, 16, 2, 24, -17, 20, 21, -40, 4, -35, -2, -42, -27, -15, 14, 29, -30, -20, 22, 15, -55, 9, -61, 11, 24, 12, 43, 40, 34, -17, -21, 6, -42, 14, 9, -1, 8, -41, -15, 1, 19, -1, -48, -42, 64, -41, -42, 6, 9, 16, -23, 3, 7, 10, 9, -1, 64, -17, 36, -35, -31, -27, 8, 23, -59, 25, 38, 21]
6697B1k8K2n0O9j0l2k8N7l8k6M4j8MJ1Pj8K2l5l3Q5QMl6j8M6K4l7mK1m8NK7OL5
6731E9q2M6j4m3J6P5n4kj2L6p2M1K0J0l4J2k9N6k4k2J4kk0LK1Qm6j5N9L6J0p7
6763b6j5QK7K7j1lj6m8R1k1j5N2n1J0K1o5L8k1O7n1J0j4rOl8L7m0k0P2k9L8L9
6795E0m8K5j8JKJ0J4lj2k7l5K8RO5l6k5Ml4J2K6k7Nk1N5o3K1pQJ7N2r0J6L%ol2
6831f1O1Kk8L7Opj5j9mk2R9p8L4j2j1J9Rl9QL0j1l9L7L2j8j6j8RL0l7N1o3j6J12
6865F2m8n6O8J0q8M0K4j6rO3q7N4o4O0l7lN5p1O8n7M2l4M8k2l1K3L3k1K1n6K1
6896hM3m1L2k4J9m8N1L4j05K6M3k8k3L2LPk9MM1Om1K0k6J3K4p7O3rk6O6m2Rk0
6929a1PK9l6j1rJ3l3M6lK2l2J3M7m7l8K4qK4j8N9J6p4kLM2l8K9k5L2k8J5L1l8
$$ y = [21, -7, 15, -35, 34, 24, -8, -36, 21, -17, -43, 1, -17, -13, -2, 5, -13, 9, -26, -59, 26, 34, 38, 2, -16, 30, 54, 17, 13, 34, -14, -9, 18, 24, 59, -23, 23, 9, -34, -18, 57, 3, 1, -11, 25, -47, -6, 14, 24, -10, 2, -27, 29, 5, -17, -3, -5, -25, -22, -1, 7, -39, -54, 5, 41, 51, -26, -41, -33, -6, 21, 10, 7, -9, -57, 34, 13, -2, 50, -1, 9, 30, -35, 3, -18, 49, -2, 8, -6, -15, -9, -47, -10, -50, -70, 2, -27, 11, 50, 2, 27, 9, 10, 12, 22, 36, 33, 21, -6, -41, -13, -4, 61, 25, 0, 4, -30, -18, 8, -19, -14, -35, 20, -43, -22, -29, -21, -4, 48, -42, -26, -23, -23, -29, -61, 0, 2, -26, 11, 17, 10, -5, -24, -28, -50, 49, -29, 5, -7, -18, 1, 10, -29, -21, 9, -2, -41, -4, 28, 10, -6, -24, -15, 15, -22, 29, -34, -50, 62, 14, -42, 26, 36, -52, -12, 12, -4, -13, 50, -37, 17, -47, 13, -24, -27, 28, -43, 25, -32, 10, -24, 24, 2, -29, -6, 27, 6, 27, -29, -8, 35, -6, 26, 2, 21, -27, 24, 58, -47, -21, 22, -6, -29, 3, 6, 13, -16, -12, 29, 35, -6, 14, -12, 1, 25, -52, 11, 2, -24, 42, 0, 9, -11, -4, 25, -11, -22, -31, -18, -51, -5, -8, 14, -18, -5, 42, -5, -43, -19, -27, -3, -21, 38, 54, -20, -22, -19, 23, -15, 14, -11, 21, -7, 8, 39, 1]
6962Aj2N5k5j8jpK2l3L9n2KN3l0ol7N1k3K2m8lK5L8j9m1%P2Mn3%O3m4K0k8M0n3
6997b6QO2n9N7k9j7LoqRJ8n1N7n6L4K1k4PK7l0L4oj2JoqJ0j9j5NM5j7J3k2qK1
7033A3K6q8K3M8o7M1nm6R1oj0k0j3l5PO0K9m5O6r8jN7qJ9o2K6j5K3j6L4J4n2R
7066aL3n5L8J4ol8lpJ1J3J2n7M9j2J9J5k4j2J5j3k9K7L1k4N6k7On4kk3Q8Mq3O4
7100B5n2M3%lk8l1J5RRK5npQ%k8N1pl2M1J0mm7K3j8J4K1k5Ql6M5lK8o0M0pl1k
7137a1L7jm0L2Mj9j6K7J4Lk5qKk0J9K3ko0pN0j9n4P9l0M9ll1k7J4N5o2L5Lk6L3
7172A8o2O0rn6K4K1K4jm0M1l1J4K4j2k8J2L2rNK2pl1m9O4k3Mn4L7K1MJ7lj8m5
7206c4K0oL0m3J9J2j2M3m6L4m1K6mJ3K2pJ9n0J3Ll5k9P7Kk4l2J8m0O9j6%n3O7
$$ y = [1, -11, 44, 19, 1, 0, -7, 15, -18, 21, -31, -29, 24, -6, -12, -49, 2, -21, 1, -47, -50, -25, 13, -6, -47, -47, 25, 29, -24, -24, 39, -5, 15, -13, 27, -26, -18, 44, -15, 42, 13, -4, -1, -7, -15, -6, 12, -39, 18, -38, -4, 17, -7, 0, 27, -3, 31, 25, 13, 14, 8, 0, 10, -9, -24, -19, 26, 9, 22, 0, -8, 13, 39, -49, -26, 22, -45, -4, -9, -55, 36, 30, 20, 0, -13, -48, -41, 19, 48, 3, 69, -29, -30, 27, 19, 38, -24, 2, -13, 10, -6, 28, 42, -10, -1, 32, -23, 15, 29, 23, -15, -18, -25, -14, -1, 11, -46, 3, -9, 10, 25, 1, -11, 4, -9, -38, -11, 20, -4, 52, 25, 31, -23, -25, -48, 40, 44, -39, 25, -27, 16, 16, 13, -15, -46, -31, -22, -13, 12, 7, 0, 8, 8, -20, 31, 24, -8, 33, 43, 39, -8, 15, -3, 11, 32, 7, 15, -21, 24, 21, 49, -11, 29, 22, -9, -11, 26, 25, -15, 17, 21, 2, -14, 13, 27, 30, 5, -3, -1, -21, -2, 21, 19, -41, -48, 2, -17, -71, 8, -22, 27, 24, -7, -34, -20, 35, -27, 8, 11, -15, 18, -44, 16, 7, -49, -25, -4, 20, 19, -21, 20, -11, 3, 27, 15, -13, -1, 31, 22, 27, 49, 42, 11, -38, 26, 3, 7, -47, -10, 11, 15, 32, 29, 11, -34, -14, -20, 10, -33, -14, -2, -14, 29, -17, 17, -24, 2, -2, 11, 33, 26, 45, -5, 8, 11, -24, -53, 24, 26, 2, -30, -12, -52, 17, 1, 1, -52, 15]
7239A5M4l9k6K6j9j3L5Rj9j5M3pl5Pm3L7M4j05N9M4m8m6JQ9p6K9L%K7l4Nl0L3
7272eJ9j6k4k2N9k1K1J1j6j4m1O9JK7l5O6p4k1O7m2j3J9oj2oM7j3PJ4o2N1n5J1
7305iL0nk5M4m6N4l7j0K2%J6j6Om0RlN5l9o4M0QONk2l3K9j1rM4N%k4qmJ1J4k5
7342c2j6O0n3L4J3Kmj2M1j2l8K0MnM0m5K9m5qL8Kl1L9n3N1k7qj3J2kK1l1O1n4
7376b2PJ0ooK2J5l8J7j6L2j5rM9n7kL0L9m4l4MOJ2kjK1q1N4k3M1k4J0K5m2PJ5
7411fJ8rK4o9N1J3n0J4O2mm9n8N6jj2kj4n%M3j5O3m9RK7J0k4k6J6Mlj6QK2rk3
7447dk4L7Qm1j8N0l2L7J5k8j3K3j7PK7j8l0M8k3K7l3oK6k5J9M8j1o2J7qqmJ8J3
7481A5n4M1L0k9k1Ok4M6No7O0k7L6k2KL3n4L3l8L8k8M3n5L5l3K2J6m2P2m1k1J5
$$ y = [15, 59, 20, -6, 20, 1, -12, 23, 32, 13, -2, 41, 34, -1, 6, -37, 0, 44, -61, -2, 42, -6, -52, -51, 38, -38, -9, -6, -6, 21, -13, -8, -38, -5, 14, -2, -26, -48, 11, -10, 11, 22, 6, -8, -49, 20, 21, 48, 13, 79, 5, -16, 51, 9, -4, 15, 9, -3, -9, 38, 25, 32, 46, -16, 35, -20, -9, 21, 16, -9, 35, -11, 43, 6, -4, 18, 18, 34, 18, 24, -16, -7, -10, 45, 6, -58, -18, -10, -4, 1, -21, -54, -25, -36, -45, -1, 4, 4, -20, -28, -32, -21, -7, -32, -48, 12, -41, -7, 6, 8, 4, -8, 33, 21, -17, 3, 7, 2, 42, -3, 26, -19, -27, 11, 13, -18, 21, -32, 19, -8, -16, -29, -17, -19, 2, -29, 32, -22, -15, -5, -11, -17, 5, 20, -18, -1, -17, 15, 0, -9, 40, -17, -19, 11, 50, 6, -28, -24, -18, -6, -8, -9, 12, -69, -15, -38, 3, -21, -11, 14, -28, -21, -6, 12, 3, 27, -42, 9, 22, -28, -14, 48, 44, -5, -63, -7, -8, -20, -22, -36, -41, -41, 2, -13, 50, 1, 10, 37, 47, 23, -3, 13, 17, 14, -2, 6, 28, 19, -4, -28, 9, 17, -24, -42, 8, -24, 13, 28, 0, -13, 10, -7, 0, 27, 9, -21, 27, 4, 31, -2, -8, 18, -7, 12, 60, 49, -13, 4, -4, -12, -16, 2, 15, -39, 2, 32, 3, -18, -12, -36, 10, 15, -52, 8, -19, 17, -5, -3, 30, -24, 9, -29, 9, -19, 24, -31, 4, -29, -7, 9, -33, 39, -2, -23, -8]
7513hL8Lk5rL1l7k1N0l2k3O8m7PJ0J8k8O0l9L5n1K6j5j2k3K6k3l4M5k8L0%J1K0
7546B3m3qK8l6K4l4M3Kl4O4n8L7l7K9k0l4jO2j3J0o2O5qo0R9k7n6O7n7L5K2np1
7579e4O0J9p1N2k0j0M7k0J1lnJ7r3N5J5J0J6JK1o5j2L6j4L5j8J3n1K0M5k2n5J4
7611b6K6N3q2M1L2o5nO2k7j5oK3n3L0mN1J1j6rk6k0M7onp4O1K6l7L3k6J0qj0L2
7645A8K2l0n8J04n0k1j6L7j0L4n2ROORoJ0rj7Ojk8N4m9K6J6K5k6K3m8jK5l9L2
7679Aqm4LK5M3l1nJ0L5o3K6jk5L8Kl3K1PlJM7n4k0NJ3l7K5LNl4lM8J0J8lqm3l0
7717e9M4N4n8R2j24P1m8M7J0rn3k1Q6k4j4l1O5k6kOj1qL0k8k0K9l8L4nM8m9P1
7749E9j4n5L4l4P5q8K1J2L1n8J6K2o4J1N6ok9pK0J5J8p1K0k3j3P6l5k4N0n2K2
$$ y = [-8, 30, 33, 8, -1, 30, -7, -28, 22, -10, -33, 35, -12, -5, 5, 23, -5, 55, 16, 51, 0, 26, 11, -1, -24, 2, -21, -55, -10, -38, -8, -8, 3, 23, -20, -28, 0, -36, -12, -46, -3, -1, -35, 29, -29, 8, -29, 0, -20, -54, -55, 7, -6, 4, -58, 7, -1, -61, 38, 11, -45, 22, -35, 0, 22, 17, -54, 6, 25, -46, 6, -14, -24, 23, 3, 14, 11, 6, 23, -70, -15, 0, 10, 26, 27, 48, -17, -29, 7, -7, 28, 10, 23, -28, -8, 37, 15, -40, -26, 0, 53, -29, 12, 44, -21, -26, 36, 9, -6, -12, 11, -42, -12, -16, 35, 46, 30, 21, -5, -25, 22, 16, 11, -63, -2, 24, -13, 20, -6, 4, -4, -14, 18, 40, 10, -48, 56, 6, -15, -31, 6, -4, 30, -22, -13, -7, -1, 8, 2, 12, 3, -14, -8, -9, -37, 17, -32, -6, 10, 35, 9, 32, -16, -17, 8, -31, 1, -7, -51, -48, -23, 20, -11, -16, -6, 29, -34, -8, -9, -34, 4, 6, -27, -6, 1, -2, -1, 46, -8, -28, -23, -10, -47, -22, -19, -14, -48, -51, -3, 7, 25, 22, 14, -29, -59, -15, 39, -19, 73, -51, 20, -28, 19, 29, 20, -33, -54, 32, 8, -6, -37, 28, 2, 0, 6, -5, -13, 17, -11, -31, -2, -40, -6, -11, 37, -12, 59, 45, -10, 24, -10, 65, -23, -2, 10, 41, -17, -1, 21, -43, -32, 24, 18, -11, -18, 2, 17, 35, -36, -16, -39, -52, 24, -11, -35, 15, -37, -15]
7780a5J9l2M5j9m4%L1%jN2j1rj3nOJ1j0k0K1J5n8N6j0K8n9N5k9oJ9m2J3m6P7q
7814A1OJ2J4n7N7n8M5nm1L5Ml8m6L9lM4m0oJ4N6o8JpL0J8k8L0o3M6k8L3p2M7J3
7848ek2J3L9Mj2j9m0N9J6j4nn6P8Pj1J3j5j6j2j5J4k1K0j6k3P3l5j9J1mj4n3L5
7881d5K9rJ0L0j4k4M6m5M2j2j5Nl3K4K9k5l1Q6p1QN4J1n1PN6o7K6K6m4L1j9mm1
7914c0L7nR8o7q5M2j5L9l3J2mL2n5N9Qn4k3N0Jk0PL2m9J4M0p2L6J2o0M7l7J4J8
7947a1O1p7MJK4k6M3l5J4l8J9J0K3m1K1K8rOJ0m6M9pl2PK7m3L6j3k1Lj1J9M3o3
7981b5j1K3j8L1K0j8K6m6L7j3j9l4K0KK2J0K3k3j1j8%L3J5k7J9L3n7lJl0M5kL1
8014C6k1moLM6m0L5o6L0j1K2l3Mn6L6L8o4O5pj0L0p4N6L3J2r2L6K1l2J2l4Kk3
$$ y = [-15, 4, -28, 17, -2, -46, -46, -15, -15, -16, 36, 25, 16, 3, -2, 4, 15, 5, -15, 6, 21, -37, 19, 9, 37, -22, 33, 4, -2, 17, -25, -12, -58, 19, 11, 17, 29, 43, -14, 43, -15, 30, 25, -16, 19, 23, -15, -61, -22, -25, 19, -21, -27, -13, 43, -25, -24, -31, -1, 17, -11, 19, -44, 2, -26, 7, -65, -18, -5, -27, -14, 25, 29, 17, -2, -42, 17, 33, 19, 14, -42, 36, 43, 32, 45, 30, 14, 2, -13, 1, -20, 0, -16, -39, 34, -1, -20, -9, -13, -27, -80, -45, -16, -25, -15, 15, 1, -23, 23, -22, 20, 8, -7, -2, -35, -11, 18, -7, -38, 48, -23, -15, 39, 50, -1, 6, 62, -5, 21, 47, 3, 34, 15, 11, -30, 7, 2, 100, 33, -52, -10, -25, 14, -19, -7, -11, 21, -34, 25, 33, -21, -44, 6, 7, -13, -6, 26, -23, -9, 31, -41, -5, 7, -53, -6, -43, -29, -11, 50, -27, -23, -22, 2, -24, 19, -16, -2, -40, -21, -11, 12, -29, -8, 20, 11, 17, 27, -19, 30, 23, -9, -2, 25, -18, 18, 5, -16, -13, -24, -5, 38, -25, -36, -13, -31, 0, 20, 2, 28, -18, 19, 6, -13, -47, -27, -25, -3, 7, 30, 7, -4, -22, -22, 11, 26, -1, 18, 51, -6, -9, -8, -38, 7, 5, 36, 15, 11, 5, 8, 54, 14, 49, -17, 13, 2, 24, -9, -5, -61, -25, 13, -51, 14, 7, -3, 27, -47, 9, 42, 54, -38, -2, 19, -13, -1, -35, -33, -56]
8047e6J07p3qj1K0n5Q8j0Ll2M6k1J6l0kK5k9mK5N1k4l9Mj1K8k4L5lMpq6Q7n2M9
8081A1l7N7o8O2j7m7L1j1K0P2p6K0n6O0L2n5qM6nn0j5k1K6L1m0M3j4j1K4PPk0
8113bJ9l3K2J2l3pNj4K5qM1n4j3K8Oj0N2Rj13N5L9Ln7P3Qn0PL9mp4N6j8J7%j0
8148A6oM3m9m9RR4n6Nk4NK5k2oJ7L4m7j2QL4o2O9n1O1k0j0J1ll6M6K1j0Mp1M8
8182A6l0j2J8Kn0J02n3nO7
$$ y = [-56, 51, -22, -30, -41, -21, -76, 12, 2, 5, -27, 19, -2, 14, -16, -18, 7, -22, -26, -1, 50, 26, -13, -9, -20, 8, -16, 19, 16, 20, 13, -73, 14, -38, 11, -26, 31, -37, 25, 8, -39, -8, -19, 1, 73, -3, 17, -39, 21, 53, -2, -10, 36, 31, -19, -34, -55, -29, 2, -38, 5, -9, -20, 4, 11, 18, -2, 17, -16, 6, 18, -15, -22, -17, -31, -6, -14, 27, -27, -40, -12, -6, -16, 36, 45, -68, -13, 26, 29, -28, 45, 53, 3, 10, 49, 45, -29, 27, 9, 26, 26, 16, 10, 53, 4, -45, -36, 58, 2, 7, -17, -12, 13, -9, -15, 2, 36, -11, -23, -15, 19, -43, 26, -25, 36, 16, 6, 17, 14, -22, 24, 45, 35, 39, -32, 16, -14, -26, -8, -6, -56, 46, -7, -12, 55]
8191E5
$$ Imaginary data points
##PAGE= N=2
##DATA TABLE= (X++(I..I)), XYDATA
0@%%%qJ6j6J6j6K4l2M0n6P2q8J05j29J60j92K24k64L12l68M26m90N68o50P43q47
28d50R62j088J226j379J547j732J938k162K404k671K966l290L643m036M469m948
44b601N479o076O748p507Q377r384J0566j1970J3683j5824J8584k2297K7603l5871
58b0490N0686q5574L18263L45422k27138J3032l2549q5086k05796r0160o3630
69h3020r7160j73944q9162k1622K0322p296K0290N4837J10845J06624Q6987P8373
81F074J36034J33594O3193J4311N7081N6789l2236j07408n9580j9935q6940j55995
93D982j05448m3680p3744j21403o8068K2062L6963k247R999P9111J17504Q2020
105f1949M9089Q0347J23517R8843K4660l256L4559L1096n0694r8762n5018j9012
$$ y = [0, 0, 0, 0, -8, 8, -8, 8, -8, 16, -16, 24, -32, 40, -48, 57, -72, 88, -104, 120, -144, 168, -200, 226, -264, 304, -346, 397, -450, 512, -576, 650, -729, 818, -914, 1024, -1138, 1266, -1405, 1561, -1729, 1914, -2122, 2347, -2601, 2878, -3198, 3550, -3957, 4420, -4964, 5602, -6368, 7315, -8509, 10075, -12222, 15381, -20490, 30196, -55378, 262885, 608307, 381169, 394201, 361652, 276566, 70770, -19390, -83020, -180180, -354124, -443286, -464908, -444586, -451882, -431592, -376755, -265910, -159286, -72299, 6074, 142108, 275702, 338895, 353206, 410287, 467076, 434840, 327432, 267852, 247917, 160977, 4982, -100466, -144146, -217890, -339293, -407361, -385299, -348336, -350583, -340584, -261473, -143969, -61949, -12860, 67487, 191004, 289847, 314507, 311251, 345810, 376906, 326212, 227450, 172432, 153420]
117A53420p2453j32807j00033l4521l8261p6312n0222K7875N3651J5169R539O6705
129a78250J08114P9959L7732N7486J01243P6135K048k0276J4076J0779n3737q4894
141A50415m2514j8279p1132j19690q2330j6993j5591m4820k1680L4542M6260J1895
153a89917Q012O4775J08413P8898K8989L2561O5186M9980r184k7756Q895J3405
165B32257m8511r0745n5875j9286n1601r0554n8696j048m52l4615k0271L6282
177b03115N2841K2045J7751O1304Q7803N5902J5430K3763N0968L2354j8195k9601
189A69250J380J233n0315q1352m8369j3903l9685p3977m2508J4677J2263k8167
201a79473j9768L8178O1629K8451J2989N1005P7406M2775j404Q674M0881K7642
$$ y = [153420, 80967, -51840, -151873, -186394, -224655, -300967, -351189, -323314, -269663, -254494, -244955, -178250, -70136, 9823, 47555, 105041, 206284, 282419, 284467, 264191, 278267, 289046, 235309, 150415, 107901, 89622, 18490, -101200, -183530, -200523, -216114, -260934, -282614, -248072, -201812, -189917, -181905, -117130, -8717, 70181, 99170, 131731, 196917, 246897, 237713, 209957, 218852, 232257, 183746, 93001, 37126, 17840, -33761, -124315, -183011, -184059, -184511, -219126, -239397, -203115, -150274, -128229, -110478, -49174, 38629, 94531, 109961, 133724, 184692, 217046, 198851, 169250, 170630, 171863, 121548, 40196, -8173, -22076, -61761, -135738, -178246, -163569, -151306, -179473, -199241, -161063, -99434, -70983, -57994, -6989, 70417, 113192, 111788, 120462, 161343, 188985]
213A88985k0393l5985j0198n479m5481p0084m1917j1336k6027n0086k9202J3460
225a43743J3986j6665r841L7709N9000L2681J5570L9580N5830K5065r050N893
237A06015L8713K3241k7960m4112j7702j0463m1892n7380k4903L719j9445n0239
249a22408k7976J8780K4000l664k93L9129N3235K2719L691K8596M9976K5198q761
262A02222j777K2578J0041l0928m3315j6424n377l2887m8728k1951L638j3289
274g6197l7546j7513K3735K6636J97K953L7987M6711J5179p31K3654M2107J9150
287A06322j2005o279J4463O93l5333m0174j1882j07k4541m2960k1480M782n938
300g4439k7628j0552K8010L1444L125m66K9736M1865J4846m066J7404L6976J4522
$$ y = [188985, 168592, 132607, 122409, 116930, 71449, 1365, -40552, -51888, -77915, -128001, -157203, -143743, -129757, -146422, -156263, -118554, -59554, -26873, -11303, 28277, 84107, 109172, 100122, 106015, 144728, 167969, 140009, 95897, 78195, 67732, 25840, -31540, -56443, -52724, -72169, -122408, -150384, -131604, -107604, -111268, -111561, -72432, -19197, 3522, 7213, 35809, 85785, 110983, 102222, 100445, 123023, 133064, 102136, 58821, 42397, 37020, 4133, -44595, -66546, -62908, -76197, -113743, -131256, -107521, -80885, -80688, -77735, -39748, 6963, 22142, 21411, 45065, 87172, 106322, 94317, 88038, 102501, 103194, 67861, 27687, 15805, 15698, -8843, -51803, -73283, -68501, -74439, -102067, -112619, -84609, -53165, -50040, -50506, -20770, 21095, 35941, 31875, 49279, 86255, 100777]
313A00777j6410j2652N496m518l2589l3018n258K367k3367l9032j8301N110j674
326g3069j4591K337L0327K5786l198m436K7749M0438J5250k974J2990K6631M024
339H7264k4874j6111R307K093k8992l3748p977J624k0165l3120j1002J3802O217
352e5682j1702k86K5557K4177J306r25K3678L4188J2394o022O076J8383L25k2891
366D8576j5161O109K51k5791k9452o872J295j8466k6760k010J9697P497j1323
379e2410n73K4064K2382L59N99K5054L0839M937j3276M38J5466R82k1176j5484
393B2201M878K78k4942k9091o090M889j0782j9698L42K0110Q357j1295j479K2490
407a9832K2140L621L011K0818K1614k667j6292j7J5240J910j8282j4813m18n189
$$ y = [100777, 84367, 71715, 77211, 72693, 40104, 7086, 1828, 4195, -19172, -58204, -76505, -71395, -73069, -87660, -85323, -54996, -29210, -32408, -36844, -9095, 31343, 46593, 43619, 56609, 83240, 87264, 62390, 46279, 55586, 57679, 28687, -5061, -13038, -11414, -31579, -64699, -75701, -61899, -55682, -67384, -67670, -42113, -17936, -16630, -17555, 6123, 40311, 52705, 46683, 52759, 71142, 71467, 48576, 33415, 39524, 39775, 13984, -15468, -22340, -21045, -39511, -66271, -68281, -48584, -41087, -52410, -52983, -28919, -6537, -6178, -5579, 19475, 50314, 55251, 41975, 42413, 57879, 58861, 37685, 22201, 27079, 27357, 2415, -26676, -32766, -27877, -38659, -58357, -58015, -37905, -29548, -40843, -42322, -19832, 2308, 5929, 8940, 29758, 51372, 48705, 32413, 32396, 47636, 49546, 31264, 16451, 16033, 10844]
421A0844k3717k3031Q70J1196o570j8789j707J7340R156p367J636K4356K2633
434A6850m64m886J4929J9829k167j5497o90J3274k87k1012j6664O70k225j9449
448a7789j8035K550J0554m601j5171o85J6470R559m471L822K2322J8569k448o873
462A3773J0355J6126k071j3820R3J1401m622k3748j6026L364J787j5116j5306
475c3810M380J0405o379j4856K708J9662J1649l878J566J8271J5678m240q728
488A2428Q479J5709m88j3468m414O417m800k1145j4364N441N905j1150j4301J150
502b8601P783m325r398P149K1317J0123p108j512J5081J2552l972m984J0112J2568
516C6785o357j7923m588Q076l149j8226j0771O330M393j2458j3961L587J1810
$$ y = [10844, -12873, -35904, -35034, -23838, -30408, -49197, -50904, -33564, -24408, -31775, -30139, -5783, 16850, 16386, 11500, 26429, 46258, 44091, 28594, 27904, 41178, 40891, 19879, 3215, 3885, 1660, -17789, -35824, -33274, -22720, -27321, -42492, -43177, -26707, -17148, -21619, -17797, 4525, 23094, 20646, 13773, 24128, 40254, 38183, 24363, 24456, 35857, 31235, 7487, -8539, -5175, -3388, -18504, -33810, -29430, -19025, -25404, -40260, -37552, -17890, -6241, -10119, -8553, 9718, 25396, 21156, 12428, 20907, 36616, 36128, 22660, 18246, 24663, 19863, -1282, -15646, -10205, -4300, -15450, -29751, -28601, -20818, -25143, -34541, -27392, -6075, 4048, -3060, -4572, 10509, 23061, 19089, 14105, 24217, 36785, 30428, 12505, 7917, 15993, 12844, -5382, -16153, -9823, -5430, -17888, -31849, -28262, -16452]
529a6452p82q242N979J8647Q665o958k873J2881J3110k719o810O539R723o624
543B4084j7073n643P064m36j4498r601N496L314j2339j1826O363J3620J148o628
557a6955M596J5362N497q017r72J5032J2071m901q935L215P412o388j5634l778
571b395R001K62j4781j0680M644M738q813r890P434J5499J814q840J603J3497
585C093N971n635J35J3791J0098p887j2059J657P239m227j1402j922O340k917
599B275j5226r006O996P325n918p359O667J1818m72q231L148J5023P023p005k479
614D579J1273P957q781j1675K442Q951l400j3027l649O410j546j3613p729P837
628a3971Q974l925p506M376J0632M23p003L144J3954P125o283m551O930N820p404
$$ y = [-16452, -17234, -25476, -19497, -850, 7815, 857, -2016, 10865, 23975, 21256, 14446, 20985, 30708, 24084, 7011, 1368, 8432, 7996, -6502, -16103, -10607, -7293, -19632, -31458, -25095, -11475, -10327, -16955, -12359, 3003, 8500, 483, -489, 14543, 26614, 21713, 12778, 15993, 23405, 17017, 1383, -2395, 6606, 6868, -7913, -18593, -13949, -9211, -18024, -27914, -20480, -4981, -3167, -12007, -10404, 3093, 9064, 3429, 3564, 17355, 27453, 19566, 7507, 9164, 16403, 12176, 774, -1148, 5192, 2275, -12951, -21957, -14961, -7636, -13554, -20913, -14246, -2428, -2900, -11131, -7983, 7040, 14063, 7058, 4579, 15852, 23809, 15028, 3353, 5795, 14746, 11346, -1681, -5330, 1080, -466, -14079, -21808, -13971, -4997, -8922, -16428, -12052, -1420, -997, -8000, -4856, 9098, 16223, 9940, 5389, 12319, 18139, 10735]
643A0735r251L951Q330m676j3593m383N900m35j0712m467R556P816o524q497N391
658a0859J1579J021o217L244J3334N104r126o145P001O940n748q732K518P152
672A1066m896j4194m951P381L210p375m526O736N748n987p348O089J2838K710
686F501o192Q61R185K739p747l977P810O837o665j0091J171O012m347j1574k392
701a1869Q304L055q407n566O778O750m779o368O381J2536K037p629j260Q697L639
716A2299p283m067P405O255o729j0775m54N980k232r086j306P935K108q654n587
731a4191O156P379k119m281N455R814m18q269n44R036M209o186m394N469M390
746A1506p613j0230J444P647j385q938j895O898K052q386n085P660R293j705n701
$$ y = [10735, 1484, 5435, 13765, 9089, -4504, -8887, -2987, -3422, -14134, -18601, -9045, -1229, -7753, -16250, -10859, 720, 1741, -4476, -1232, 12102, 17206, 8080, 1935, 8936, 15876, 10128, 1396, 3914, 11066, 6170, -8024, -12975, -5594, -2384, -9759, -14285, -7549, -1801, -7788, -15136, -9047, 3791, 6501, 309, 1170, 10355, 13094, 5347, 1370, 9180, 16017, 9352, -739, 432, 6444, 2097, -9477, -11869, -3565, -510, -8917, -14483, -7705, -955, -5734, -12102, -5721, 6815, 8852, 1223, -37, 8660, 12299, 5016, 949, 8354, 14609, 7880, -2895, -3349, 2631, 399, -8687, -9993, -2058, 50, -8604, -14191, -8035, -656, -2775, -7056, -1601, 8213, 7795, -474, -1018, 8018, 12227, 6041, 1647, 7116, 11506, 3893, -6337, -4893, 2754, 1369, -7569, -9464, -2566, -514, -8900, -13985, -6325, 2968, 1263, -4438]
761d438L235Q074k43p392m39R622N223o760o744K780L803n151p368J929P088j442
777A777r321l135O294K961n417k803P066O957l004o008L106Q198J86o541L03Q298
793H917K853p759o617L651M932m622p322K229O876k069r569k894P042M777m355
808c930l269N870O421l425o414K585Q483J956n482j612N625J901p167n500M103
823A45N454l349o852J90M868j627p488q75P815M372n005l820M735N589k871n281
839d000L593Q550P95p036k416N118K062o066m655M647N612m003q301n30N383K93
855i54n456n90O919L593n487m938M304O674q57m226K312N978l68o679k175N302
871C352K917m914m385L191L774m133o695O90N914O57n240q60O034K627n417l883
$$ y = [-4438, -1203, 6871, 6628, -764, -1203, 8419, 13642, 6882, 138, 2918, 6721, 1570, -5798, -3869, 3219, 1777, -7544, -10679, -4385, -1424, -6841, -9644, -2578, 4379, 1375, -4633, -1527, 6671, 6857, 316, 619, 8917, 11770, 4011, -2606, 1045, 5977, 1355, -5967, -3738, 3138, 1069, -8500, -11394, -4352, 425, -3930, -7199, -1329, 5092, 1667, -4747, -2162, 6321, 8277, 2795, 1183, 6808, 8709, 1542, -3958, 145, 5599, 2250, -4602, -4412, 456, -1171, -8659, -9534, -1719, 2653, -2352, -6172, -1437, 4152, 1281, -4000, -407, 8143, 8938, 1902, -514, 4604, 6666, 600, -4055, 592, 6204, 2201, -6100, -6630, -1247, -954, -6410, -7000, -81, 3512, -1975, -6913, -2609, 4065, 3208, -1018, 1294, 7272, 6904, 225, -1950, 3352, 6269, 1355, -3030, 161, 3935, -198, -6893, -6203, -289, 368, -4872, -5732, 302, 2929, -2488, -6371]
887f371N132O845j107m979J238N594p04o915j533O190L492m993n461J941L744
902B113l147n837J432O520R66n489k293M295L283l242k734M666N840j764n454
917h45K88M579L28m564j091M998K029n655m979K348L931k240m437J646N529k12
933A653o168j825N511L753k903k405L971M501k655n950O00O111J422m685k260
948a329L537J540m942m337K777N122j399n071P2M310K56m360r16N151L648k890
964A169l210K860L726k183m393J353N185O34m877k453L159J522m350l183L576
979a465M503k057n345k84M511R67l903m67N371L133l865m140K423M394q16l829
995h69Q70M464n0n484k538L281K535k648k883K083L265k177m728N50M746J438
$$ y = [-6371, -1239, 5606, 4499, -480, 758, 6352, 5648, -1267, -2800, 3390, 6882, 1889, -3572, -1631, 2113, -1034, -6871, -5439, 1081, 2047, -3442, -5735, -1440, 1843, -1399, -4133, 533, 6373, 4609, -845, -557, 4022, 4350, -214, -1305, 3693, 5722, 67, -4912, -2564, 1367, -873, -5310, -3664, 1865, 1653, -4515, -6340, -829, 2924, 21, -2384, 1587, 6088, 3433, -2517, -1917, 4194, 5616, 931, -1329, 2208, 3748, -1194, -5531, -2754, 2368, 969, -4102, -4030, 280, 536, -3824, -4740, 411, 4059, 1169, -2041, 819, 4545, 2362, -2031, -678, 4507, 5141, 264, -2189, 970, 2492, -1858, -5041, -1465, 3038, 981, -4364, -4648, -137, 830, -3073, -3540, 1831, 4964, 1099, -3041, -618, 3776, 2960, -869, 1, 4465, 4415, -1069, -3607, -326, 2209, -439, -3322, -1239, 2026, -151, -4879, -4329, 417, 1855]
1011A855l031q96L758J942l650l039L019M451r93l919M42L382o92m924j547M344
1027E02K873l268l700J735K950k006l726J351N254J345m121k193L319K562k499
1042C78k367K771L889j309m488n77L426N27l654j205L359J994l180l439J440L113
1058F78r47k902J362M123K46l987j557L295K569j956j980K609K860k403m461K30
1074b221L954R02l287j560K851J471l634l183K365M044m54l236J36L285M47l602
1090a722j099L803K894k053k808J257K367j430l302N17L719O68l514j806K141
1105c68J291k535j954K537L476j120l592R2L120M00k694k16L692K038k982l347
1121b162J412L004q39k874N70L277r8l945k054K803K408j859k204J774K731j220
$$ y = [1855, -1176, -2072, 1686, 3628, -22, -3061, -42, 4409, 3416, -503, -61, 3321, 2629, -2295, -3842, 502, 3375, 107, -3593, -1858, 1092, -914, -4640, -3289, 1965, 3310, -811, -3004, 315, 2877, 378, -1989, 782, 4671, 3362, -1126, -1703, 1723, 2250, -1404, -2609, 750, 2744, -436, -3875, -2435, 678, -269, -3171, -1809, 2314, 2560, -1427, -2984, 311, 2880, 924, -1056, 1553, 4413, 2010, -2451, -2221, 1733, 2635, -652, -2212, 639, 2110, -1524, -4707, -2342, 1702, 1248, -1988, -1852, 1433, 1880, -1722, -2821, 982, 3876, 1823, -985, 272, 2639, 1209, -2093, -1576, 2143, 2811, -703, -2509, -368, 923, -1612, -3566, -1029, 2447, 1327, -2265, -2173, 947, 1347, -1347, -1563, 2129, 4167, 1185, -2162, -750, 2254, 1415, -1459, -889, 2388, 2290, -1655, -3709, -906, 1502, -357, -2561, -787, 1944, 724]
1137G24l262J67L370J254k347r49K645J366k630k496J533K910m96k690J16K333
1153A548m28l445r89L095K276j919k317J320K234j297k818J111L872P71l005j461
1169a452K148J535k213k126K190L032j115l446m96K440M31k529q06K767J978k294
1185D4k703J092K514l31k038O64K939L76l038j498K290J692j528j528J577J980
1201B504j543l200m1K891O65k227o75K231R57k550k139J928L104m40k437K53K401
1218A682m9k710q63K732K028j765k371R56K003j176k661L29K869Q30k383j383
1234a932J675J316j841j605J896K714o66k455j90J939L34j974m15K662J383k286
1250E55k395R32J970o58k059O76K638n3k979j271K144J739j303j447J471K241
$$ y = [724, -2538, -2371, 999, 2253, -94, -1043, 1602, 2968, 338, -2158, -625, 2285, 1789, -901, -785, 1548, 1120, -2325, -3314, -219, 2057, 138, -2179, -859, 1375, 78, -2740, -1629, 2243, 3014, 9, -1452, 696, 2231, 18, -2108, 82, 3114, 1999, -1447, -1943, 497, 928, -1601, -2407, 360, 2338, 44, -2659, -1567, 947, 616, -1422, -758, 2181, 2557, -481, -1979, 311, 2003, 475, -1053, 524, 2504, 961, -2239, -2280, 611, 1276, -951, -1626, 605, 1562, -988, -3127, -1199, 1905, 1465, -972, -719, 1682, 1633, -1077, -1940, 792, 2820, 1055, -1316, -360, 1643, 467, -2194, -1865, 1004, 1834, -549, -1932, -257, 1059, -782, -2387, -491, 2223, 1557, -898, -1088, 851, 1185, -789, -1204, 1458, 2841, 555, -1840, -908, 1062, 404, -1655, -979, 1659, 1606, -1373, -2644, -500, 1239, -64, -1511, -40, 2201]
1266B201j105k857P1K739Q15j862q31J817J097k066k275J227K413l51k011O1J796
1283H79q0k319q78K279J865j263j724J094J504j007k030O12K753O26k286j248
1299a223J610R85j819j438J616K280p70k711k41K082M69k028n75K314J508j685
1315C74k116Q39K126l81j965M81K385K70k399j344J505J484j159j341J231J773
1331A763j043k562m4K171P19j462n96J688R67j922j751J385K244l23j765R8J783
1348A350q8k387p68K182J577j339j731Q47J483r15k101L67K438P73j984j095J389
1365bJ105j392j332J314K199m17k196k80J620L11j686m66J878J285j562j928O12
1382i37J582m11j466M83K059J29k212j062J604J520j127j198J246J613r03k243
$$ y = [2201, 1096, -1761, -1690, 1049, 1864, 2, -829, 988, 2085, 19, -2256, -1029, 1384, 1033, -978, -917, 879, 799, -1520, -2398, -119, 1746, 483, -1241, -147, 1357, 350, -1680, -1068, 1685, 2311, 25, -1223, 387, 1372, -447, -1885, -269, 2011, 1241, -1470, -1711, 371, 840, -1188, -1763, 551, 2059, 374, -1742, -903, 1223, 842, -1123, -642, 1743, 2013, -386, -1730, -225, 1259, 100, -1241, -10, 1763, 720, -1842, -1886, 285, 1004, -458, -1054, 634, 1601, -321, -2072, -687, 1557, 1234, -531, -433, 1350, 1262, -1125, -1893, 289, 1866, 527, -1204, -357, 1126, 211, -1890, -1523, 915, 1688, -296, -1391, -2, 1103, -289, -1621, -307, 1892, 1475, -721, -1001, 619, 930, -756, -1222, 656, 1941, 379, -1549, -937, 645, 234, -1232, -749, 1310, 1439, -773, -1835, -231, 1289, 162, -1036, 210, 1823, 920, -1323]
1398a323m4K106O63j636p57J576R67j669j775Q76J997r8j605j02J643J58j950
1415i73p87J694J629r10j367N12J317o62j809K82K131N79j640j001J062P45j162
1432c60j257J205J930n68j930j65J537L55j445n62J808J366j421j792O33J636
1448I70l34j523K33J840M54k078j189J276J338r47j156R17J533n63j995k55J760
1465B81P65j191n63J224P85j333j405P09J834m3j482l4J276Qj651p29J501J362
1483A314r60j301O01J259o06j649K76J898N59j466q90J046R72j161j239J021J770
1500A444k71j684m07J277L49j342n98J537J187j077j544K46J348r8j178J93J615
1517I97L13j648r50J105J088o86r34P17J296n13j801j66J523N99j199n62J147
$$ y = [-1323, -1367, 739, 1402, -234, -991, 585, 1552, -117, -1892, -1016, 981, 883, -722, -824, 819, 977, -973, -1760, -66, 1563, 653, -714, -202, 1115, 453, -1356, -1074, 1057, 1636, -4, -1005, 57, 802, -360, -1617, -412, 1518, 950, -980, -1145, 392, 747, -698, -1260, 548, 1914, 493, -1299, -666, 970, 636, -887, -654, 1186, 1640, -438, -1627, -351, 987, 40, -1116, -199, 1334, 771, -1224, -1479, 281, 1046, -145, -708, 516, 1301, -32, -1437, -728, 1106, 1063, -419, -453, 823, 831, -820, -1549, -48, 1314, 354, -947, -346, 913, 307, -1342, -1066, 832, 1391, -75, -965, 81, 1053, -108, -1347, -326, 1444, 1173, -511, -918, 359, 708, -634, -1232, 305, 1492, 415, -1129, -883, 465, 367, -811, -618, 997, 1310, -338, -1288, -183, 905, 219, -715, 2, 1298, 785, -1016, -1182, 341, 940, -259, -821, 326]
1534C26Q53j221j475O24J689K2j326j04J274K32j424q43J310J351o94j239L70
1551b75J122m73j357j0J563P29j294q41P57P37q89r19Q21J417j40j426l16J077
1569B83L82j152l86J290R40r13j361L46J200j76j215J74J408L02j422r42Q75J083
1587G16n54j024O62J320m02j594k46J238P40q37o06R19P67r82j298N10J294J45
1605G68j036j91Q98K46j290o24J114J069n40r66L04Q67l04j233O9J394N89j080
1623E4p77P84P04q40r15O02J443q7j428l47J028L13j030m25J051J018o65j341
1641h58K20J017kr32N1J183L67j069r54O54R35m19q09N47R36k51j303k95J068
1660H6N96p55n03Q50N76q35j008L95J136R2q79j67R75J97j167o11Q94R70l79r35
$$ y = [326, 1179, -42, -1517, -893, 796, 818, -508, -612, 662, 894, -530, -1373, -63, 1288, 594, -645, -275, 847, 374, -983, -993, 570, 1299, 5, -836, -79, 658, -231, -1150, -329, 1088, 948, -478, -794, 283, 665, -487, -873, 417, 1357, 444, -917, -571, 629, 453, -762, -588, 820, 1122, -300, -1242, -367, 716, 162, -862, -200, 1120, 718, -876, -1122, 116, 856, 19, -587, 332, 1099, 117, -1181, -671, 623, 768, -268, -459, 439, 685, -605, -1229, -115, 954, 414, -552, -248, 619, 315, -918, -849, 545, 1134, 54, -723, 61, 765, -75, -990, -388, 1055, 968, -460, -807, 221, 534, -496, -921, 130, 1148, 483, -858, -638, 379, 377, -555, -504, 679, 1046, -23, -977, -323, 612, 193, -616, -69, 867, 616, -687, -982, 86, 682, -73, -576, 274, 850, 15, -993, -598, 538, 630, -249, -416, 559, 756, -411, -1022, -128, 842, 463, -472]
1680d72J97Q60k50j179M2J160N90p81p17L97O53n03q70N23J147Oj102l10P23L64
1700D78p94l95Q69Q11o41j016J17Q80o5p30M1R45M02j100p07O97O81l81o34M48
1720i4Q76j70j207k83R75N60o56m45O95N73o65j020K47J069J77q07j33O83K05
1739E80r10n47P29Q54k79p61J14O96j99q15j09R23N12o63n93M30M57n26o34M82
1759b59Q90o2q38k92O27L10p07l37P92P76n51r41J00Q25m5p24K0R59L10r57o63
1780g67M97O57k35n60K57Q09j38r48l14P63M73m77m00N48M67n17p98K08Q71Q3
1800D79o32j39O39J40p91n03O81P90l70p05J70O72k58p45p6Q61N09n93n90L95
1820f6M37m47n44L47Q40Q6q11l27N03L35n96k51N85N72l55p14nN92J2n78J34O49
$$ y = [-472, -275, 585, 335, -844, -802, 358, 948, 167, -550, -153, 500, -3, -873, -350, 797, 803, -299, -609, 114, 478, -316, -711, 158, 969, 328, -688, -571, 309, 244, -486, -445, 500, 902, -198, -905, -208, 473, 92, -542, -94, 782, 612, -595, -878, 97, 657, 1, -444, 251, 824, 159, -861, -614, 455, 632, -175, -308, 375, 580, -330, -877, -148, 706, 427, -334, -220, 476, 277, -538, -647, 276, 788, 125, -468, -38, 419, -107, -741, -259, 631, 569, -269, -561, 66, 376, -331, -668, 124, 900, 349, -592, -492, 333, 288, -436, -416, 543, 853, -104, -767, -270, 387, 152, -408, -151, 658, 520, -428, -742, 21, 494, 17, -383, 165, 632, 115, -683, -475, 396, 479, -153, -292, 347, 487, -304, -807, -126, 664, 294, -411, -241, 431, 173, -572, -648, 213, 722, 129, -461, -66, 371, -76, -620, -273, 567, 653, -158, -485, 18, 353, -243, -494, 91, 663, 308, -406, -411, 181, 193, -385, -251, 398]
1842C98K54o84n71L85N68k55m95L46P00k11q69r2N53M11m67l28N17M47n18q08
1862g19K24P59J38n28j30N01K14o96n07N80O90k12o20J55M30j08n99j63P97M04
1882F10n11m40L08K92l57m23L10O69J2o77j52M52J45n08k43O70M61l44p08O4O20
1903B50j12m84P0O87J78n88o06M00N16k60m43L15N67j56o35k56N95L81m05l01
1923b87M50L69m82n81J38O33J12m87q4M63J67o36l35M09N56j87m07R4M61j82n55
1944c71q0N95L60l97l94L08K91l33n23L50O47J9n68k29L90J56l98k09M75M71k94
1965B66o06M2M28j6l13l8N62K19n64m89L75M05k00l87K67M77o6o95j49M91K88
1986B97l30k50M22K67m03m77P5O35L4m08l0M13P5o00k82M58M80q7n11O7M62j32
$$ y = [398, 652, -32, -603, -218, 350, 95, -400, -54, 646, 435, -434, -526, 27, 438, -29, -357, 160, 607, 89, -719, -495, 264, 402, -126, -256, 245, 459, -237, -744, -164, 526, 314, -306, -151, 279, 171, -428, -591, 206, 610, 99, -341, -33, 259, -98, -521, -211, 458, 470, -207, -359, 93, 238, -270, -513, 157, 618, 274, -434, -370, 250, 138, -346, -276, 411, 589, 1, -605, -205, 311, 51, -392, -77, 490, 334, -301, -557, 38, 419, 14, -287, 163, 532, 50, -531, -393, 240, 352, -135, -219, 244, 411, -225, -560, -151, 405, 218, -189, -95, 366, 184, -371, -451, 144, 504, 107, -287, 21, 312, -21, -544, -194, 453, 472, -96, -325, 65, 221, -177, -386, 89, 560, 266, -340, -298, 130, 114, -199, -237, 325, 544, -20, -509, -134, 271, 71, -316, -49, 428, 362, -333, -482, 9, 297, -33, -283, 139, 406, 3, -474, -399, 236, 270, -138, -168, 245, 320, -280, -562, -104, 376, 289, -222, -155, 307, 175]
2008A75n51n7N76L37l11m27J88L57k66m55K99N01J5n02j75M04L4l67j11M06M64
2029E34l12m73Q3L24p3l61QN68J77n22m03K68L39r8l28K03M90r6n86j79M79K19
2051B61k48k19K60L41l00n20J23M28J36l45r8L54J07m22l31K80N25j04l48N2K74
2072B06o4m89mM93K49k69l34K31K03k82l47J90N71M0n13j79L51J24l15k20M09
2093E1M02k15n28M9L76K6m05k0N10J78m39l59K20L71r1l47J82M09j20m52j43L34
2115a1K25k04j53K28K51k50m49J30M02L2k96m9L54J02m59k65K87M31q1m46J39
2136h2L54j26m24j13N00L17l62l08K35K12j74l90J83M56R3m91j84K84J93k61k16
2157c04L34L44j99m09lL06J7k98J3L62J94l57k80K33K70j25k79J44L28n5m60o1
$$ y = [175, -376, -433, 143, 480, 169, -258, -70, 287, 21, -434, -135, 366, 381, -121, -296, 108, 142, -225, -336, 70, 534, 222, -251, -168, 156, 83, -278, -270, 298, 475, -47, -450, -182, 157, 59, -269, -66, 424, 328, -258, -437, 42, 261, 13, -206, 54, 395, 95, -425, -302, 126, 262, -83, -181, 173, 280, -142, -473, -193, 332, 228, -120, -68, 206, 142, -347, -351, 142, 391, 122, -212, 19, 222, -60, -407, -217, 354, 394, -119, -298, 53, 177, -138, -358, 51, 453, 238, -290, -241, 135, 161, -244, -264, 246, 424, -15, -374, -154, 217, 126, -221, -39, 370, 250, -202, -345, -11, 214, 10, -143, 85, 336, 86, -363, -233, 169, 201, -95, -144, 210, 312, -147, -412, -125, 306, 225, -221, -82, 272, 146, -278, -391, 109, 426, 64, -244, -9, 203, 29, -361, -178, 278, 371, -120, -304, -20, 173, -88, -304, 30, 374, 175, -234, -237, 69, 86, -212, -199, 163, 357, 0, -280, -47, 223, 98, -181, -37, 291, 236, -224, -285]
2179b85K93K01k25j70K91K48k85m04Q9M05M1k40j24L33J16m01k91K96L75p9k72
2200h8%L04m5l69j35L69K87k71k36J84K01k12k73P8M33L1l26j31K14J03j83k03
2222b68K98L02j28l82jK86Lk68o6L80J90l28l03J11L27p3k70J03L49j4l78j98
2244c28L36K00k15j23J26L04k16l48NL35J45k65o2K39Q3l35k27K19L06k1k36k6
2266a04L17j24l47j5L27K79k90k21J19K20j42l12J43L69M7l10j84K52J29k68j35
2287b50K27L29j51l02n7K40Q9k63n6L60J16k14l29J64J50M1k70Q4L44k8l98r5
2309b69K29J70j51r9J69J74o1m30N0L53Lj78j3J59Q3k51k37J41L52j5k78N0K12
2332A63j3l12r7K95K25j70k71J17J95j12k88R9L40N0k05j18J13R6j57j95K20K70
$$ y = [-285, 8, 209, -16, -186, 105, 353, 68, -336, -247, 158, 199, -41, -165, 168, 284, -117, -408, -112, 263, 184, -88, -88, 216, 171, -198, -333, 36, 323, 52, -184, 0, 201, -11, -284, -206, 227, 258, -68, -199, 15, 118, -65, -268, 30, 332, 204, -178, -179, 107, 110, -158, -224, 156, 346, 18, -285, -174, 153, 80, -190, -87, 262, 248, -130, -328, 8, 208, -7, -130, -4, 300, 84, -264, -259, 76, 221, -44, -106, 133, 216, -119, -346, -127, 179, 158, -78, -104, 213, 89, -258, -273, 54, 333, 43, -178, -59, 161, 19, -293, -150, 219, 266, -44, -228, 24, 153, -115, -250, -23, 306, 155, -147, -204, 36, 125, -138, -194, 166, 282, 68, -261, -97, 53, 94, -176, -92, 252, 224, -174, -269, -40, 130, -21, -120, 49, 223, 162, -268, -218, 135, 138, -40, -53, 106, 189, -62, -299, -158, 194, 179, -99, -49, 163, 150, -162, -259, 36, 261, 91, -180, -63, 132, 20, -268, -169, 171, 221, 16, -102, 11, 107, -50, -245, -25, 245]
2354B45j43k60j6J76N8j76n9K76J73k19k87J13J93ok27J36K11K6l24j70K46J54
2376A20q9j60J32J90r4l23N4J86J18k13J3R9J06j95j47R6K61k2k16L3J38Pk62
2399a68k3J97K24j41k16J85O4r4j39J1K50Q8k93j24K02J06j64j70J67K86l2l07
2421i1m0K34Nk33j8J72J85j46j93j8K28j2k08P9J95Rk20j70J35J82r2r4J35J27
2445A51j08j67p2K76M9j73K1J09J06k54j29J18K17j7j67m9K03Rk71o7J93K15j33
2468F0j42N9J11o0j89J9K70M1j62j06J26L7j25j14J66K25m5k99k6J83L1j19n2
2491a11J50J22q6k66L9K57p8j36J06R5O0j99j14J30J16o4j09J18J83j20k52J7
2513a42J83J31j76rJ14K9j18j50R0J27jj37M6J20l2j87k9J58J52j70q1M6J36q7
$$ y = [245, 102, -158, -174, 2, 60, -116, -175, 101, 274, 55, -232, -119, 74, 68, -159, -23, 188, 214, -110, -280, -34, 120, 31, -129, 3, 193, 99, -224, -170, 16, 134, -79, -66, 33, 139, -56, -203, -107, 154, 132, -84, -51, 87, 94, -168, -191, 6, 230, 89, -127, 58, 122, 28, -111, -100, 150, 238, -55, -179, 23, 129, -35, -205, -38, 248, 216, -91, -131, 103, 108, -125, -143, 29, 214, 68, -125, -143, 85, 73, -135, -56, 139, 148, -72, -242, -107, 75, -17, -111, 24, 151, 43, -124, -196, 80, 129, -44, -23, 86, 192, -62, -191, -73, 144, 127, -40, -89, 114, 123, -148, -215, -22, 193, 60, -82, -23, 88, 28, -161, -142, 128, 169, 7, -99, 27, 64, -61, -175, -9, 216, 171, -128, -154, 29, 60, -59, -111, 39, 161, 75, -191, -152, 105, 27, -109, -3, 92, 152, -47, -161, -31, 85, 21, -88, 30, 213, 93, -159, -142, 41, 172, -4, -13, 101, 130, 12, -138, -48, 79, 78, -59, -13, 107, 75, -112, -141, 17, 169, -1, -82, -36, 100, 13]
2537A3j48M7J78O1j02j82J03R8n6j52J02J53n3r9p8J32K8j27m1J53J72j54j83
2560a35Q5R6Lj89J01J53J4j44j05Q8J23r2o8J06J10r0j60k6J64O2j09lR2L8j66
2585e2q5M6J43Pj03J1J26j0j59l5P6J50q9q0M7R7j23r2j2K20oo3r8L7R1j14k4
2612i4P3J44J4k11K2N6J8r3J7R3J38j45j20P3M9L8j40O2Q2L1j41n7Q7R8n7n3O2
2639D6Q3o7j38k6J72j0l7q2Q3O5j00j00M9J46J3j71L9J20l8j49k0P3J58o7j14
2664g2NJ21l4j08j4J93O0j36r7J02K7n4r4O1J37nj01%M1m0p2L9J25Ro1j20LJ04
2692A9l4n3L5Q6M8j65l0P6L4qm1j7J74j23j22OJ22O0j07j0Q1M9j65RJ0J50j0r7
2720b3j7J27l4j19p1J18J17q5o6K8N1pj19K2J95k3j27j2MJ01p3j16J42J15Qj43
$$ y = [13, -135, -88, 90, 151, 49, -133, -30, 68, 12, -140, -38, 115, 62, -37, -115, 17, 45, -82, -123, 30, 202, 48, -135, -50, 46, 49, -140, -39, 114, 128, -16, -121, -33, 90, -2, -70, 36, 146, 56, -104, -130, 34, 96, -13, -16, 76, 114, -52, -137, -91, 52, 59, -44, -33, 93, 83, -76, -111, -35, 115, 26, -54, -7, 90, -33, -125, -137, 83, 77, 14, -84, -47, 44, -70, -94, -21, 123, 137, -74, -52, 4, 22, -71, -54, 39, 177, 32, -88, -15, 34, 72, -68, -6, 76, 107, -34, -91, -4, 94, 37, -16, 46, 129, 62, -76, -102, 70, 60, 23, -59, 24, 89, -11, -111, -62, 84, 97, -74, -35, 85, 47, -102, -122, -49, 109, 42, -72, -67, 54, 20, -88, -102, 91, 151, 15, -82, 20, 47, -7, -101, -40, 97, 92, -9, -9, 32, -8, -80, -41, 84, 93, 32, -88, -85, 19, -15, -68, -33, 53, 101, -64, -94, -18, 16, 8, -33, -50, 124, 1, -121, -115, 7, 67, -40, -50, 31, 80, -85, -76, -66, 84, 74, -23, -40, 87, 53, -66, -137, -19, 98, 13, -53, -25, 26, 19, -100, -78, 117, 94, -33, -45, -41, 60, -13, -129, 13, 128, 136, -7]
2746gl3Q7j9r3K5R6P0j30p1oJ03Ro5l3J34P5j63j17J71K0o6n4R6R5q7r8q0J53
2774A2N5m2loJ25j06j34K1J69j4j00m1J47J2j59n0J13N3L0q3MkJm3l2J16QMr4
2803c9M8K0l8n6JJ66J0j65o5J63j9o2l6J70K5o9j42N7P6o5j2J6L3M5k8j65P5P3
2831A7k0QN9j1Lj09O0pJ16j54l1O7O9j0j76N1J00N0p7k6M1j1j6p0J05P0p3n3J9
2860iQ1o8l2r0J43O0q7o6N9K7kj24J19M6J9j24l1Q0Qo4k8P3J54j49j2m6Q4J3n1
2889a7lQ5M8j17q5O6O2m4m0N7P4l5r9JM5N6n7k0M1N1p5o6N6N1j9l1N2K9o6%q9
2920h9Q4R0m5n9k2J04j1q2o1P1L7l5l3P2Pk9m8L5P2k6j05j5R3L7q2J7M1R0o7o9
2950b8o3R1om4j8J00j3o1l2L9O6j2m7QN9L7j53L9oJ18n0k7K1L8m4o6pJ18j1m0
$$ y = [-7, -40, 47, 28, -65, -40, 56, 126, -4, -75, -81, 22, 31, -34, -67, 67, 142, -21, -138, 33, 53, -13, -67, 29, 124, 37, -61, -141, 12, 67, 25, 22, 16, 141, 35, -99, -78, 91, 77, -23, -64, 83, 95, -64, -114, -1, 52, 82, -1, 3, 1, 2, -41, -73, 43, 51, 55, -39, 9, 29, -9, -65, -64, 102, 112, -53, -118, 45, 26, -36, -72, 98, 123, 54, -88, -31, 45, -20, -32, -16, 17, 62, 34, -131, -56, 17, -3, 5, 64, 53, 56, -53, 7, 0, 116, -38, -69, -2, 67, 57, -119, -68, 32, 82, 5, -21, 20, 9, -7, -77, 28, 98, 25, -28, -9, 72, 4, -28, -118, 25, 85, -2, -68, -9, 18, 16, -108, 11, 57, 76, -48, -79, 1, 9, -55, -83, -10, 144, -5, -17, -63, 21, 34, -17, -20, 65, 113, -4, -89, -23, 39, -5, -45, 12, 86, 51, -48, -47, -2, 54, -3, -23, 18, 69, -6, -72, -16, 35, 16, -15, 37, 66, 0, 0, -89, -5, 85, 40, -19, -41, 63, 52, -30, -91, -20, 17, -18, -51, 21, 28, -1, -49, -14, 58, 32, -73, -88, 5, 42, -40, -23, 18, 108, 41, -28, -91, 0, -6, -50, -68, 32, 19, -42, -74, -35, 31, 19, -28, -20, 39, 76, -77, -38, -44, 74, 24, -3, 18, 56, 12, -54, -61, 57, 46, 6]
2980Fl9j0J11o1j6RJ8j2l1kM9rm4j3J05K2p0p8O9L1l6l4PN9j5or4Q6km2k7O0P4
3013F5j1j17k9J50m8PmJ4M6n6m0J1O5m4l9J0O8L1q0j3L4K6l4n9P4j6J9r6j3J09
3043C0Np5OO5Jm7m4K1J10Pp9j7N5J2j28M7J9L6M9q1J7J6k3l2L6K5J5n6ojO6l6
3075A3p8J29L5q0j3KRRm9M9J0Kk1p9M6M1k2l0M5K5M6j27l5J02j6j8%J1OK0r5J6
3107d7O7J9p0L6N4p3j7j7L0P5m6k8P2J5m0l8m1M3Pj5j9Q1J4m7l9J7J0J7j7j0k
3138iK5n4L8NM5j2q6QR5j1o8lN5K6m3m6N2kl2j9OL8K5m4n9P6N0l1m1K8ok4l3M
3172d7Q5mk1l3L0Om6l5M8L7n6J1JkL2oj4K4N5m2m1J4K5%q6K9R3K0j01qN4K4Mm4
3206FJ4NJ1k6n9O0o8M9m2M9M7n1k4LP1J5j18O7N2q8k0M5m5O6m9JJ8N0J1p4KK2
$$ y = [6, -33, -43, 68, 7, -9, 0, 18, 6, -25, -27, 22, 13, -31, -44, 61, 83, 13, -65, 4, 35, -1, -35, -28, 31, 16, 10, -84, 2, 0, -42, -69, -9, 65, 54, -63, -92, 58, 10, 17, 13, 27, 73, 17, -23, -12, 53, 9, -30, -20, 48, 79, -1, -14, 20, 46, 12, -47, 27, 11, 30, -66, -79, 30, 35, -40, -34, 31, 32, -15, -59, -38, 72, 79, 0, -17, 38, 50, -78, -31, -12, 24, 73, -8, 9, 25, 2, -30, 6, 31, 46, -10, -16, -17, 49, 13, -65, 64, 99, 19, 6, 8, 17, 26, -23, 26, 36, 38, 17, -62, -16, 25, 3, -27, 18, 43, 89, -38, -73, 29, 13, -5, -5, 6, 12, 32, -63, -47, 20, 39, -31, 5, 59, -14, -31, -48, -18, 57, 11, -17, 55, 70, 30, -8, -49, -6, 1, -14, -33, 48, 62, 15, -24, -7, 3, 20, 3, -7, -9, 16, -38, 0, 5, 50, 38, -48, -40, 55, 44, -24, -27, 28, 54, 11, -35, 17, 15, -17, -36, -30, 8, 33, -11, -70, 6, 56, 25, -16, 12, 6, -18, -51, -47, 38, 34, 13, -20, 10, 16, -30, -65, -17, 20, -36, -25, -24, -26, 6, 0, -14, 10, 65, 23, -18, -4, 21, 21, -65, -36, 57, 77, -24, -32, 22, 46, 50, 6, 20, 25, 36, 10, -49, 11, -57, -8, -50, -1, 46, -5, -29, -26, 45, 60, -58, 9, 61, -27, -47, -2, -47, 19, -30, -29, -11, 39, 50, -24, -22, 0]
3238@J3l9j8RP5l3p3O4J3oK9k6nK2mm5K1N1m1l3J8pMl2K6M2L9l6l7JJ1M5q8O7
3272B7l5j7M1q9M9P0j00L0M1J7n3j8k3P5M0j12O2N9m3L1q8j3P4ol3L0N8m1l1K
3302DM0l3KL0l2J7k1j1n2J30l7l6L5k8J6n9L8J8K1k8Rn2N2Qn1j5L5O1o1m3Q6k4
3334A9o3K8M0Nn2lp6N5J0J9pL9M2l7q3O0Po6QL0P8j1j7m8M9P9m0m5n7J35j33K0
3366a5J6L0l1M4j8k4M2m8n4M3P6p3K3n4L0J1n0M4l4P3l7j2j9m5M4K0kJN7k4K0
3397C4m8Nj8M8m0L7J4Nm3k1K2M6q2N2J9k1n3J8Q1q8OJ1K4J8KKj5O0m1l7%N1p8
3430c0k8QO4orj2L8m0m8LJ1N6kj5L1l1j1L1l9OO1n1m9N7K9kMk2mN6r3Q6o0j0o
3465b7J8O6l2J4p1M3L3k5l5J6oL5j8k9j1L3K4m5K0L2pn8M3j6%J1K1l8Q9o9m7K3
$$ y = [0, 13, -26, -44, -35, 40, 7, -66, -2, 11, 5, 34, 8, 3, 25, 21, -24, -3, 48, 7, -26, -8, -15, -11, -43, -17, 25, 64, 28, -9, -8, 3, 48, -40, 27, -8, -25, 16, -73, -24, 46, -54, -24, 17, 34, -19, -37, -60, 15, 55, -57, 5, 64, 21, 52, -36, -49, 25, 19, -14, 16, 74, 33, 2, 4, 44, 11, 13, 43, 11, 28, 7, -4, -56, 74, 37, 1, 36, 8, 24, -35, 3, 21, 42, 14, 23, -29, 23, 31, -20, -35, 0, 61, 0, -43, 43, 19, -44, -16, 24, 29, -23, -26, -102, -47, -37, -18, -25, 14, 56, 19, -64, -4, 3, -63, -55, -25, 53, 42, 25, -23, 26, 105, 65, 20, -37, 98, -35, -15, 1, 31, 0, 44, 26, 2, 44, -4, -58, -15, 61, -12, 11, -43, -13, -2, -52, -8, -42, 31, -6, -18, -37, -82, -38, -18, -20, -19, 38, 14, 34, -14, -9, -27, 21, -19, 18, 32, 37, -6, -27, -5, 41, -41, 11, 30, 9, -44, -26, 55, -33, -27, -16, 8, 26, 28, 30, 15, 75, 34, -3, -3, 48, -30, -58, -50, 14, 8, -1, -13, 25, -15, -63, -60, -49, 7, 5, -10, 21, -10, -21, 10, -29, -23, 38, -13, -62, -5, 24, 22, 26, 4, 0, 56, -37, 49, -11, -21, -27, -9, 57, 25, 39, -32, 11, 44, 19, -16, 0, -6, 29, 11, -18, -29, 4, 28, -17, 3, 35, 28, -30, 13, -3, -3, 8, 29, -9, 80, 11, -36, -13]
3497a3k2K2j2p2Q0P0j00K4o9R5L5l7n7J00k6j2j1k5O3L8q2jM9k6J7m7P2Rp8O0
3527D4l3kk4k3O7j1n1N9Rj4n3l7P1M7l8Ln1j9M6K8k4N1l5j8NLM2m6l2M3qj4ql2
3561e5R5n9L1Om9L7ol1N7l4O0m4M1p1L2J3m4JM6Qj0KJ8kK2o1k2L2L5j0n4M1Po
3595B6p4J9O3l6n4MO1Jo0NM3k9N8p5K2K1j8K5%J3l7Lm4N7M3l0mJ6K9l4rk3J2k
3629hPk9O1j1Op9M6MK7o4M6knMJ1KJ3j4o4P8j5pJ3L7j9J6o2Nl8L6M3n7K2K8J6
3664D7o4nK0qLoQM2l1rj2N4m7j9j4J4N5o2K0N8k6l5K2JJ7olL2q2L5KM1n1L5lk3
3700@j5L8nj1k3N4k4j3m2N4K0plj2M7k5k8l3M6m7N2j34J35l2J0m0Q4j6J3k6l2
3731a5K5m4L8q1O6N2k7m9nM2M0n8K9Rl5J0M0Mk9JJ8N7p2m3m4K2P9n1L6nm2M1j
$$ y = [-13, -35, -13, -25, -97, -17, 53, -47, -23, -92, 3, 38, 1, -56, 44, 18, 6, -5, -30, 33, 71, -11, -12, 37, 11, 28, -19, 53, 62, -16, 44, 11, 9, -15, -38, 29, 18, -33, 26, 35, 21, -32, -69, 2, 49, 11, 14, -37, -56, -10, 18, -6, 45, 10, -8, -3, 0, 42, -4, -36, 7, -1, -15, -23, -55, 40, -19, 12, 18, -31, 6, 0, -31, 26, -8, 52, 8, 49, -22, 10, 23, -21, -20, 26, 34, 24, 26, 44, 42, 64, 3, -19, 13, 48, 38, -16, 25, 32, 26, -48, -29, 34, -2, -56, -52, 9, 10, -50, -45, -2, -31, 27, -48, -26, -5, -23, 2, 2, 15, -22, -19, -63, -6, 37, 7, 3, 19, 48, 14, 5, -18, -6, -8, -1, -30, 31, 20, 26, -53, -7, -3, 24, -40, 6, 4, -1, 3, 14, 16, 29, 15, -49, 29, 14, 7, 20, 57, 38, 54, -8, -3, -41, -5, 38, -19, 3, 31, 47, -17, -22, -2, -10, -7, -13, -5, 37, 6, -3, -15, 39, -8, -27, -41, -27, 28, -34, -14, 44, 18, -17, 5, 6, 23, 17, 14, 46, -36, -1, 1, 42, -9, 26, 23, 0, -15, 23, 18, 7, -16, 38, 14, 1, -41, 13, 33, 26, 23, 11, 58, 33, 5, -28, 18, -29, 23, -111, 24, -8, 2, -38, 46, 30, 43, 17, -15, 10, -34, 4, -77, -11, 41, 14, -35, -40, 2, 42, -16, 13, 22, -13, -3, 37, 41, 12, 13, 31, 88, 16, -27, -71, -49, 30, -21, 15, 10, -32, 9, 8]
3764Hpk5K6L6j1j1K6j6j0k9K3L8j5m2j5L7KMk6j3J3O1p9N5Mm8l6M2N1k2lpmm3
3798c6M9l9L3O5q7j1N1m2K7oJ3L8J0j0o6J2J4j2Pj9J0m3K4k2L4J8qj2N7mq6K6
3830a5m7M9Knn5Q1J0j1r8O9M1l7L8OJ1j6k0j7L7Qm0k2j0N2J1j2JNJ5om6J1pJ6
3864ak4M3K2k7L2l8J1Q%K5l5m2L6k1L9k5l7L8J8rnl2nnR1k9p6M4j9L5q2M9K0k
3898crPJ9m9lJ2L7K0k0MK5m2K3p5L9J9M1q5M6O4j02K8j3L8l2J3j2j5N2J1m3j3
3930a8PN3o9J24j14K0m8J5L6K7n1N0l2j0Lj1m9J25k9K0m9p4P7K1k5L5Kk5K2n3
3960b0K1j6NJ8jJJ4m4n6P3KJ9K0l3K3mk7J4nL6qj7oj5M3ml6J1K4n2N6l0%K7j1
3995B2Mk0MNj6J1k0l3J0PJ9j2J4No3L7MK5P0m9m9J2J9k1K7J2o7M7Ln3Q0j2LjK
$$ y = [8, 1, -24, 2, 38, 27, 16, 42, 26, 16, -13, 10, 48, 33, -9, -24, 13, 15, 19, -7, -20, -7, 54, -25, 30, 34, -14, -50, -8, 43, 21, 18, 11, 7, -36, 13, -26, 7, 72, -15, -26, 25, -17, 10, 4, 17, 55, 65, 55, -11, 1, 15, 3, 10, -9, 1, -42, -18, -40, -6, 12, 4, -8, 49, 45, -41, -15, -62, -13, -11, -16, -71, 10, 20, 9, -89, -20, 21, -16, 22, 28, 39, 23, 3, -14, 23, 31, -9, -31, -41, 11, 22, 10, 11, 16, 31, 25, -21, -10, -17, -1, -25, 18, 40, 13, 45, 7, 18, 26, 26, 51, 16, -26, 10, -11, 28, 3, -34, 4, 22, 13, 8, -24, -29, -34, 57, 28, -48, -4, -23, 12, -70, -21, -1, -3, -12, -5, 14, -35, -38, -26, 11, 31, 11, 15, 40, -2, 21, -54, -15, 4, 45, -40, 6, 70, -32, -4, -17, 21, -11, 2, -10, -25, 27, 38, -5, -18, -11, 42, -27, 97, -17, 3, -45, -30, 6, 33, -18, 32, 0, -10, -7, -18, -67, 58, 29, 49, 0, -74, 3, 24, -1, 34, 36, 11, 33, -20, 1, -15, -10, 8, 7, 8, 22, -22, -78, -5, -3, 16, 36, 3, 26, 22, -5, 9, 4, 40, 32, 15, 9, -6, 37, 33, -3, 8, 32, -20, 36, 6, 6, 33, 22, 26, 6, 10, 15, -1, 10, -10, -43, -33, -26, -7, -19, -5, 0, -63, -26, -22, 3, 73, 24, -25, -13, 6, -15, 12, 24, -43, 4, 7, -46, 34, 22, 25, 24, 26]
4030B6J6nk1m2K3J9J5On0M0n3R5r3L1j0l7J01j01O4nm0K1j0Q5o9n6L8p7J13k0
4060DJ1k8k1J3j1K0O9p4L6Rk0Qj7j3kL5K0rm1K9J5o0J0j0J04j06L7j1m6N5J1J0
4092B7jjpM7r0KJ1N6m9M5l9j6l2QK4P3l5k1K6m3K6k0j7j2PO5p8N6k3n9O3n%P1
4126E9l0m0j8K9Nj0k0O1m7J8oR8r1LK8n8j4K7K5l0J5j0K5K7Nl9pp9R6J3j2l3L2
4159B2Pn0K7nJ2%K1l0JL5r5N5l7M7mnrk5O2j9m4J5oj2M7%J5k4J2Om1kO2p3M6j2
4195aN7n0%l0O1K2n5n8M9j0M2j3qL6k5l4J9J9jj4lK4k2qk9MN0j5j1Nl2L2qP8j06
4230c5K2k7N9mk1L6m2J9%Mk4K0j2n2R4o6N4m2qM6j1K8m9K9l3M0K2n2j8K2J0j5
4262fJ4j5Kj6m0J07j5n8L8n1P2k8l5J7J7k4M5o7K6N5l8L0m2L2pn5K6L3k7M4j8
$$ y = [26, 42, 37, 16, -26, -3, 16, 31, 37, -13, 27, -26, 69, -24, 7, -3, -40, 61, -40, 24, 19, -21, 0, -10, 75, 6, -50, -12, -89, 24, 4, 15, -13, -34, -21, -32, -12, 57, -17, 19, 28, 8, 16, -1, -14, -16, 19, 39, 30, -11, 18, 33, -27, -17, -27, 77, -29, 8, -3, -49, 6, 17, 27, 26, 25, 18, 65, -25, -23, -12, 44, -5, 40, 1, -15, -47, -39, -15, 58, 23, 2, 28, -15, 11, -9, -26, -38, -31, 34, -44, 12, -11, -70, -7, -12, -12, 59, 29, -11, -29, 0, 5, -5, -25, 36, -11, 7, 1, 99, 8, 11, 39, -19, -33, -6, 19, -11, 4, -6, 19, 46, 51, 12, 5, -74, 22, 35, 23, -10, 22, 29, -21, 6, 1, 13, 13, 34, 4, 5, 40, -55, 0, -37, 10, 6, 1, -8, -33, 29, 10, -34, -19, -25, -37, 10, 10, 25, 1, 13, 19, -22, -24, 38, -35, 11, -1, 56, 6, 6, -24, 37, 59, 4, -54, -5, -15, 27, 14, 6, 42, 17, -17, 2, 21, 20, 6, 3, 27, 5, -3, -32, -28, 22, 7, -4, 1, -31, 1, -7, 71, -35, -13, -40, 19, 15, -6, 30, -12, 7, 7, 11, -13, 7, -5, -57, 37, -29, 25, -17, -25, 21, 10, 38, -11, 18, -15, 25, 47, -5, -23, -1, 9, -6, 8, -7, -5, -21, -61, 46, 31, -27, 11, -40, 32, 4, -31, -14, 3, -21, 24, -43, -17, 38, 0, 30, -12, 20, 13, -42, -16, 17, -10, 34, 16]
4293A6J8o0N1l2l5K7kP6r0J9L3l1%M0m3K9lNrk2L4n2K8J6k6k9L3k5j1Q0J8o6l4
4326d7LL8l5K5J9L0q0k2O5KPk5m0J5M7M4o6lK2K1kj6pL2k8j5K9j8L5j8m0Q7n1
4359Hl0J2P3l3J6k2k3jK8k0J2q2O2K2n4O0l4M5n3P4q1m5J7Q9p6j9L6lM9k8j1N
4391gMlpmK2PNKl0J8n7R5p2j0N6OqJ9k5k2J2l0J8J4p9N3N8l7M8k7j7Q1o0J4m4
4426gJ5K7n3o1J08p5J6K9n3R8n8M2j5k4L3m9J7qJ8pkNJ8Pm4L8lo6N8m2O0o9%O8
4460B1M7q1L8k1pk5L9j7n1R0Nk4qK6J2k0N6p0jOl4K4L2j3k1J1lK0l0L3J5k3o1
4493c5M2k4N0m6OnO1p7K1j4qNL9n9oN8l8l6Q1lk4J6k9N0Mnkm0j1J4K0K7j4m0N9
4528C7m0j9M5K1l0j1lnL7qk9lK%qQ5k9l2L6k0m7pM7Jrk7L4k7pK4qRl9K3Qk3K4
$$ y = [16, 34, -26, 25, -7, -42, -15, -17, 59, -31, -12, 21, -10, -10, 30, -13, 16, 13, 18, 9, -13, 21, -31, -3, 13, -13, -42, -9, -34, -45, 35, 53, -13, -47, -44, -6, -41, -16, 3, 33, -47, -69, -4, -2, 5, -20, -60, -45, 2, 46, -20, -23, -1, 20, 18, 2, -5, 27, -1, -16, 13, -5, 30, 12, -28, 59, 8, -22, -10, 63, 30, 46, 24, 1, 0, 28, 8, 20, -62, 0, 22, -32, 28, -6, 39, -14, 60, -21, -66, -49, 40, -36, -55, -19, -22, 27, -1, -12, -7, -3, -6, -13, -17, 5, 12, 17, 19, -11, 7, -50, 45, -27, -37, 19, 25, 17, 36, 11, -11, 1, -29, -11, 3, -76, -23, 35, -2, 46, 19, 2, 83, 23, 37, -7, 8, 35, -18, -79, 29, -46, -30, -1, -54, 44, -14, 28, 13, -11, 22, -27, -10, -18, 0, -7, -9, -4, 14, 21, -23, 15, 12, -54, 4, -38, 22, -47, -47, 21, 68, -13, 25, 4, -3, -28, 11, -6, -57, 33, 38, 14, 6, 32, 44, 24, 80, 10, 9, 15, -19, 5, 37, 24, 3, 14, 11, 31, 1, 34, 49, 26, -35, 7, -17, 33, -13, -7, -12, 49, -28, -7, -21, -29, -24, 15, -44, -50, 8, -30, -66, 15, 12, -12, 4, -25, 25, 29, 24, 22, -18, -29, -15, 5, 32, 18, -22, 37, -3, -22, 23, 44, 14, 3, 0, -5, 32, 24, -5, -8, -6, -6, -14, 71, 42, 10, 46, 26, -21, -28, 19, 20, 11, -16, 18, -9, -16, 8, 0, 9, -30, -7, 1, -22, 2]
4565BNo3J7M8nm7j0J01k2k0Lo0M1lK6L1j5l5m2Q9k1L9k8o5N9kOl1K0k1J7k3MJ5
4599A0jlRj2l9N7k3j8L4l1j9k3O4j6pL0m9M3J4j4j9j7J4J0L5L4m8p7L4K3LJ3L
4632A4n7P5qj1rK7m8K7M6k6J4l4o2P2nJ4Lj3rJ4m8J5J8J1n2L6J9r8J22q6K3l0
4664d6M7jj4k1J1o7J09l0loj8kL4J2k3L4m8jL9nPl3l1M7M9on2LpO6p0N2l2Olq
4700a1lmO8omo9K8k0N2l7l2O3k8K4m0R4p6j2L6K9r2P3p9P3o0j1L6J0m0O0m4mR
4733a7qK3m4M8j2j1O7m3l1N0K8n2K6k0N3Lr5JM3k9L8J6m8j3l4M5K9l2L6k9qM2
4765B2n3LJ4M1j7Kl5K2J2K1k3k4O2o2J2j4K7m0N5m7L1j3m3M0k6J8l7P7n7L1nj6
$$ y = [2, 7, -56, -39, 9, 4, -43, -53, 48, 26, 6, 9, -51, -10, -13, 13, 44, 29, -6, -48, 41, 20, 59, 31, -34, 25, 23, 29, -2, 18, -3, 14, -9, -5, 10, 9, 6, 15, 3, -36, 21, -2, -20, 14, -17, -36, -59, 5, -11, -18, 12, -37, 6, 20, 6, -13, -30, -16, -6, 29, 63, 15, -62, -28, -5, -2, 11, 14, -43, 32, 24, 13, 4, 31, -17, 10, 56, 30, 44, 10, -52, 20, 15, 29, 32, 19, 10, 24, -24, -9, 9, 20, -32, 4, 23, -75, 47, -39, -16, -46, 1, 0, -14, -35, -24, -91, 18, -12, -15, -21, -39, -41, -7, 5, -18, 16, -32, -33, 6, 1, 8, -25, -56, -9, 40, 34, -18, -15, -22, 44, -26, 26, -6, 0, -3, -11, -14, -18, 50, 44, 40, -29, -1, -21, 31, -6, -38, 25, -3, 21, -19, 75, -1, -13, 23, 52, -40, 33, -46, 27, -33, -44, -8, 2, -38, 22, -22, -26, -17, -25, -2, -46, 2, -10, -21, 46, 3, -28, 22, 50, -2, 24, 4, 57, 60, -35, -34, 9, -20, 18, 34, -14, -27, -61, -16, 13, -19, 17, -12, -20, 22, -31, -28, -14, 27, 10, 12, -23, -1, 11, 32, 9, -15, 47, -15, -3, -17, 10, -30, 25, -22, 9, -4, -47, -7, -33, -15, -52, 25, -32, -1, -6, -22]
$$ [...]
8191I
##END NTUPLES=NMR FID
##END=
