##TITLE=1H_Ser DHAN
 CDCl3
 8 sc, 
 17.03.2022
##JCAMPDX= 6.0         $$ Bruker NMR JCAMP-DX V2.0
##DATA TYPE= NMR FID
##DATA CLASS= NTUPLES
##ORIGIN= UXNMR, Bruker Analytische Messtechnik GmbH
##OWNER= root
$$ XWIN-NMR		Version 3.5
$$ Fri Mar 18 10:42:10 2022 Russian Standard Time (UT+4h)  she@DPX200
##.OBSERVE FREQUENCY= 200.131346
##.OBSERVE NUCLEUS= ^1H
##.DELAY= (6, 6)
##.ACQUISITION MODE= SIMULTANEOUS
##.ACQUISITION SCHEME= undefined
##.AVERAGES= 8
##.DIGITISER RES= 18
##SPECTROMETER/DATA SYSTEM= spect
##.PULSE SEQUENCE= zg30
##.SOLVENT NAME= D2O
##.SHIFT REFERENCE= (INTERNAL, D2O, 0, 15.7039)
##AUDIT TRAIL= $$ (NUMBER, WHEN, WHO, WHERE, WHAT)
$$ ##TITLE= Audit trail, XWIN-NMR		Version 3.5
$$ ##JCAMPDX= 5.01
$$ ##ORIGIN= Bruker BioSpin GmbH
$$ ##OWNER= she
$$ F:/spectra/data/she/nmr/H-F/1/audita.txt
$$ ##AUDIT TRAIL=  $$ (NUMBER, WHEN, WHO, WHERE, WHAT)
(   1,<2022-03-18 10:40:13.95 +0400>,<she>,<DPX200>,
      <created by zg, POWCHK disabled, PULCHK disabled
       configuration hash MD5:
       00 E9 B6 7A A2 85 ED C7 34 08 36 98 17 FE 4E 26
       data hash MD5: 16K
       C8 E2 F2 D1 C8 C8 EF 0A 01 B8 D6 6F 75 8B 18 06>)
$$ ##END=
$$ 
$$ hash MD5
$$ CB 45 9A 01 5C CB 3D B9 89 34 9C 73 8F 17 38 F3
##$RELAX= 
##$RELAX= 
##$RELAX= 
##$RELAX= 
##$RELAX= 
##$RELAX= 
$$ Bruker specific parameters
$$ --------------------------
##$DU= <F:/spectra>
##$EXPNO= 1
##$NAME= <H-F>
##$PROCNO= 1
##$TYPE= <nmr>
##$USER= <she>
##$AMP= (0..31)
100 100 100 100 100 100 100 100 100 100 100 100 100 100 100 100 100 100 
100 100 100 100 100 100 100 100 100 100 100 100 100 100 
##$AQSEQ= 0
##$AQ_mod= 1
##$AUNM= <au_zg>
##$AUTOPOS= <>
##$BF1= 200.13
##$BF2= 200.13
##$BF3= 200.13
##$BF4= 200.13
##$BF5= 200.13
##$BF6= 200.13
##$BF7= 200.13
##$BF8= 200.13
##$BYTORDA= 1
##$CFDGTYP= 0
##$CFRGTYP= 5
##$CHEMSTR= <none>
##$CNST= (0..31)
1 1 145 1 1 1 1 1 1 1 1 1 1 1 1 1 1 1 1 1 1 1 1 1 1 1 1 1 1 1 1 1 
##$CPDPRG= <>
##$CPDPRG1= <>
##$CPDPRG2= <>
##$CPDPRG3= <>
##$CPDPRG4= <mlev>
##$CPDPRG5= <mlev>
##$CPDPRG6= <mlev>
##$CPDPRG7= <mlev>
##$CPDPRG8= <mlev>
##$CPDPRGB= <>
##$CPDPRGT= <>
##$D= (0..31)
0 1.2 0 0 0 0 0 0 0 0.06 0 0.03 0 0 0 0 0.0002 0 0 0 0 0 0 0 0 0 0 0 0 
0 0 0 
##$DATE= 1647585613
##$DBL= (0..7)
120 120 120 120 120 120 120 120 
##$DBP= (0..7)
150 150 150 150 150 150 150 150 
##$DBP07= 0
##$DBPNAM0= <>
##$DBPNAM1= <>
##$DBPNAM2= <>
##$DBPNAM3= <>
##$DBPNAM4= <>
##$DBPNAM5= <>
##$DBPNAM6= <>
##$DBPNAM7= <>
##$DBPOAL= (0..7)
0.5 0.5 0.5 0.5 0.5 0.5 0.5 0.5 
##$DBPOFFS= (0..7)
0 0 0 0 0 0 0 0 
##$DE= 6
##$DECBNUC= <off>
##$DECIM= 32
##$DECNUC= <off>
##$DECSTAT= 4
##$DIGMOD= 1
##$DIGTYP= 9
##$DL= (0..7)
0 120 120 120 120 120 120 120 
##$DP= (0..7)
150 150 150 150 150 150 150 150 
##$DP07= 0
##$DPNAME0= <>
##$DPNAME1= <>
##$DPNAME2= <>
##$DPNAME3= <>
##$DPNAME4= <>
##$DPNAME5= <>
##$DPNAME6= <>
##$DPNAME7= <>
##$DPOAL= (0..7)
0.5 0.5 0.5 0.5 0.5 0.5 0.5 0.5 
##$DPOFFS= (0..7)
0 0 0 0 0 0 0 0 
##$DQDMODE= 0
##$DR= 18
##$DS= 0
##$DSLIST= <SSSSSSSSSSSSSSS>
$$ [...]
##$SUBNAM2= <"">
##$SUBNAM3= <"">
##$SUBNAM4= <"">
##$SUBNAM5= <"">
##$SUBNAM6= <"">
##$SUBNAM7= <"">
##$SUBNAM8= <"">
##$SUBNAM9= <"">
##$SW= 18.0517287032376
##$SWIBOX= (0..15)
0 0 2 0 0 0 0 0 0 0 0 0 0 0 0 0 
##$SW_h= 3612.71676300578
##$TD= 16384
##$TD0= 1
##$TE= 0
##$TE2= 300
##$TE3= 300
##$TEG= 300
##$TL= (0..7)
0 120 120 120 120 120 120 120 
##$TP= (0..7)
150 150 150 150 150 150 150 150 
##$TP07= 0
##$TPNAME0= <>
##$TPNAME1= <>
##$TPNAME2= <>
##$TPNAME3= <>
##$TPNAME4= <>
##$TPNAME5= <>
##$TPNAME6= <>
##$TPNAME7= <>
##$TPOAL= (0..7)
0.5 0.5 0.5 0.5 0.5 0.5 0.5 0.5 
##$TPOFFS= (0..7)
0 0 0 0 0 0 0 0 
##$TUNHIN= 0
##$TUNHOUT= 0
##$TUNXOUT= 0
##$USERA1= <user>
##$USERA2= <user>
##$USERA3= <user>
##$USERA4= <user>
##$USERA5= <user>
##$V9= 5
##$VALIST= <valist>
##$VCLIST= <CCCCCCCCCCCCCCC>
##$VD= 0
##$VDLIST= <DDDDDDDDDDDDDDD>
##$VPLIST= <PPPPPPPPPPPPPPP>
##$VTLIST= <TTTTTTTTTTTTTTT>
##$WBST= 1024
##$WBSW= 4
##$XGAIN= (0..3)
0 0 0 0 
##$XL= 0
##$YL= 0
##$YMAX_a= 123996
##$YMIN_a= -168391
##$ZGOPTNS= <>
##$ZL1= 120
##$ZL2= 120
##$ZL3= 120
##$ZL4= 120
##$ABSF1= 10
##$ABSF2= 0
##$ABSG= 5
##$ABSL= 3
##$ALPHA= 0
##$AQORDER= 0
##$ASSFAC= 0
##$ASSFACI= 0
##$ASSFACX= 0
##$ASSWID= 0
##$AUNMP= <proc_1d>
##$AZFE= 0.1
##$AZFW= 0.1
##$BCFW= 1
##$BC_mod= 2
##$BYTORDP= 1
##$COROFFS= 0
##$CY= 11.3945322036743
##$DATMOD= 1
##$DC= 2
##$DFILT= <>
##$DTYPP= 0
##$F1P= 2.36226072786647
##$F2P= -0.459571619588291
##$FCOR= 0.5
##$FTSIZE= 0
##$FT_mod= 4
##$GAMMA= 1
##$GB= 0.15
##$INTBC= 1
##$INTSCL= 1
##$ISEN= 128
##$LB= 0.24
##$LEV0= 0
##$LPBIN= 0
##$MAXI= 10000
##$MC2= 0
##$MEAN= 0
##$ME_mod= 0
##$MI= 1.114404
##$NCOEF= 0
##$NC_proc= 0
##$NLEV= 6
##$NOISF1= 3.799351
##$NOISF2= 2.8
##$NSP= 1
##$NTH_PI= 0
##$NZP= 0
##$OFFSET= 15.70392
##$PC= 1
##$PHC0= -17312.78
##$PHC1= 16.40078
##$PH_mod= 1
##$PKNL= yes
##$PPARMOD= 0
##$PSCAL= 0
##$PSIGN= 0
##$REVERSE= no
##$SF= 200.130013532006
##$SI= 16384
##$SIGF1= 3
##$SIGF2= 2
##$SINO= 400
##$SIOLD= 16384
##$SREGLST= <1H.CDCl3>
##$SSB= 0
##$STSI= 0
##$STSR= 0
##$SW_p= 3612.71676300578
##$SYMM= 0
##$S_DEV= 0
##$TDeff= 0
##$TDoff= 0
##$TI= <>
##$TILT= no
##$TM1= 0
##$TM2= 0
##$TOPLEV= 0
##$USERP1= <user>
##$USERP2= <user>
##$USERP3= <user>
##$USERP4= <user>
##$USERP5= <user>
##$WDW= 1
##$XDIM= 8192
##$YMAX_p= 0
##$YMIN_p= 0
$$ End of Bruker specific parameters
$$ ---------------------------------
##NTUPLES= NMR FID
##VAR_NAME=  TIME,          FID/REAL,        FID/IMAG
##SYMBOL=    X,             R,               I
##VAR_TYPE=  INDEPENDENT,   DEPENDENT,       DEPENDENT
##VAR_FORM=  AFFN,          ASDF,            ASDF
##VAR_DIM=   8192,          8192,            8192
##UNITS=     SECONDS,       ARBITRARY UNITS, ARBITRARY UNITS
##FACTOR=    0.0002768,     1,               1
##FIRST=     0,             0,               0
##LAST=      2.2672688,     0,               0
##MIN=       0,             -168391,         0
##MAX=       2.2672688,     123996,          0
$$ Real data points
##PAGE= N=1
##DATA TABLE= (X++(R..R)), XYDATA
$$ plain form
0 0 0 0 0 0 0 0 0 0 0 0 0 0 0 8 -8 8 -8 8 -16 16 -16 24 -24 32 -38 41 -49 57 -65 73 -88 97 -113 129 -145
35 -145 161 -183 203 -227 253 -282 312 -349 385 -425 473 -521 574 -631 696 -767 847 -933 1029
54 1029 -1137 1259 -1396 1557 -1741 1961 -2222 2541 -2948 3476 -4200 5253 -6938 10087 -18029
69 -18029 87861 101353 -41080 -60363 -99392 -122987 -109463 -23075 36811 61253 69936 99702
81 99702 93617 34621 -41683 -64961 -71521 -93367 -91137 -25321 34591 53021 67997 99770 87632
94 87632 17762 -47484 -68400 -81782 -93654 -68902 -659 61491 82047 83402 90218 64664 -10676
107 -10676 -77177 -85783 -75212 -76813 -46337 29131 80043 81012 73831 67934 28746 -42677 -95120
120 -95120 -96002 -70828 -47689 -8835 55841 98096 79515 44173 30562 1671 -53900 -82109
$$ packed form
0@%%%%%%%%%%%%%Qj6J6j6J6k4L2l2M0m8N6p0P9r0J06j22J38j61J85k10K42k74
35a45L06l44L86m30M80n35N94o61P34q10Q98r94J095j205J327j463J614j780J962
54A029k166K396k655K953l298L702m183M763n489O424p676R453j2191J7025k8116
69a8029J05890J3492j42433j9283l9029k3595J3524Q6388N9886K4442Q683K9766
81I9702o085n8996p6304k3278o560k1846K230O5816N9912J8430J4976L1773j2138
94H7632o9870o5246k0916j3382j1872K4752O8243O2150K0556J355O816k5554p5340
107a0676o6501q606J0571j601L0476P5468N0912R69p181n897l9188p1423n2443
120i5120q82K5174K3139L8854O4676M2255j8581l5342j3611k8891n5571k8209
$$ plain form
132 -82109 -62414 -38544 -27661 2227 55690 86680 72917 44513 21556 -13206 -66589 -95702
144 -95702 -71027 -29515 -5346 25063 70667 87787 53508 12825 -6908 -34521 -73139 -81130
156 -81130 -48020 -10121 13916 38959 71786 81508 48577 4383 -20446 -42858 -75100 -79320
168 -79320 -35330 13109 35209 55633 77900 66708 18909 -26628 -46188 -56787 -66291 -53034
180 -53034 -9737 30110 41580 43305 53640 46601 6439 -30848 -40279 -46968 -59185 -45896 152
193 152 40951 53219 56853 56984 34561 -10895 -48536 -55558 -47517 -42290 -23457 19017 51882 51758
207 51758 41572 38168 17634 -25985 -56223 -55595 -46699 -37100 -10561 31623 60755 58619 40388
220 40388 23995 -1665 -40831 -64048 -51140 -25754 -10215 12274 46903 60299 42361 20244
$$ packed form
132h2109J9695K3870J0883K9888N3463L0990j3763k8404k2957l4762n3383k9113
144i5702K4675M1512K4169L0409M5604J7120l4279m0683j9733k7613l8618p991
156h1130L3110L7899K4037K5043L2827R722l2931m4194k4829k2412l2242m220
168g9320M3990M8439K2100K0424K2267j1192m7799m5537j9560j0599r504J3257
180e3034M3297L9847J1470J725J0335p039m0162l7287r431o689j2217J3289M6048
193A52M0799J2268L634J31k2423m5456l7641p022Q041N227J8833M2474L2865j24
207E1758j0186l404k0534m3619l0238O28Q896R599K6539M2184K9132k136j8231
220D0388j6393k5660l9166k3217J2908K5386J5539K2489L4629J3396j7938k2117
$$ plain form
232 20244 6740 -12628 -41163 -53840 -40246 -19637 -5664 13295 41776 56889 40729 13884
244 13884 -3213 -24822 -54134 -61541 -36259 -5107 14294 33609 54417 52921 25753 -2280
256 -2280 -18638 -31680 -46086 -45764 -21146 7466 22161 34544 50576 48305 18385 -13676 -29291
269 -29291 -41787 -53470 -42662 -9618 21008 35370 40953 42926 29309 -1991 -29116 -36676 -35194
282 -35194 -35930 -24770 5088 29772 34645 35440 37983 24177 -6426 -30208 -36662 -36158 -33823 -16545
296 -16545 14190 37678 41498 34506 26693 8699 -22224 -43062 -40889 -31191 -23411 -5201 24004
309 24004 41101 37387 28518 19272 -810 -27644 -43728 -39742 -26017 -11884 9424 36895 50615
322 50615 39409 19262 2207 -16733 -38663 -43383 -26198 -8384 2926 16725 31688 34321
$$ packed form
232B0244j3504j9368k8535j2677J3594K0609J3973J8959K8481J5113j6160k6845
244A3884j7097k1609k9312p407K5282L1152J9401J9315K0808j496k7168k8033
256b280j6358j3042j4406L22K4618K8612J4695J2383J6032k271k9920l2061j5615
269b9291j2496j1683J0808L3044L0626J4362N583J973j3617l1300k7125p560J482
282c5194p36J1160K9858K4684M873P95K543j3806l0603k3782o454N04K335J7278
296a6545L0735K3488L820o992p813j7994l0923k0838K173R698P780J8210K9205
309B4004J7097l714q869r246k0082k6834j6084L986J3725J4133K1308K7471J3720
322E0615j1206k0147j7055j8940k1930m720J7185J7814J1310J3799J4963K633
$$ plain form
334 34321 22259 7615 -2761 -16486 -33694 -39975 -27381 -8957 4865 21288 40628 42306
346 42306 23460 2514 -12641 -27953 -40552 -35942 -14593 6671 20760 32215 38467 32034 10433
359 10433 -11218 -22246 -29911 -36343 -28869 -7219 12043 22208 30490 35283 24045 152 -19426
372 -19426 -29402 -33847 -31353 -17035 6739 24634 29648 28943 25244 12357 -7854 -21763 -23252 -22621
386 -22621 -21976 -10539 8456 21109 26278 28013 24748 10190 -12909 -29745 -34214 -30562 -21055 -2420
400 -2420 20358 33434 30424 21987 12019 -5395 -24545 -31667 -26125 -18037 -7964 9136 25894
413 25894 31796 26917 17823 6008 -9951 -26580 -31731 -24159 -12231 -630 15276 29602 29570 17981
427 17981 5986 -4926 -19456 -29041 -26611 -15673 -4755 5188 16649 25790 24804 15487 4779
$$ packed form
334C4321j2062j4644j0376j3725j7208o281J2594J8424J3822J6423J9340J678
346D2306j8846k0946j5155j5312j2599M610K1349K1264J4089J1455O252o433k1601
359A0433k1651j1028p665o432P474K1650J9262J0165Q282M793j1238k3893j9578
372a9426r976m445K494J4318K3774J7895N014p05l699j2887k0211j3909j489O31
386b2621O45J1437J8995J2653N169J735l265j4558k3099j6836m469L652R507J8635
400b420K2778J3076l010q437r968j7414j9150p122N542Q088J0073J7100J6758
413B5894N902m879r094j1815j5959j6629n151P572J1928J1601J5906J4326l2j1589
427A7981j1995j0912j4530r585K430J0938J0918R943J1461R141r86r317j0708
$$ plain form
440 4779 -5156 -17919 -29117 -27451 -13965 -148 13026 27922 34659 26170 8305 -6929 -19414
453 -19414 -28673 -29919 -18285 -1351 11494 18244 23322 23943 13667 -1963 -12271 -18582 -25276 -26383
467 -26383 -13609 3490 14778 21951 27047 23547 9151 -7525 -17546 -21040 -21936 -17691 -3542
480 -3542 12078 18963 20086 20804 16557 2297 -12566 -18518 -20499 -22484 -17566 -2523 12964 20679
494 20679 22729 22073 13612 -4174 -21005 -26987 -23793 -17342 -6890 11671 26066 25885 18859 12719
508 12719 2783 -12024 -21985 -20201 -14344 -10053 -1678 11972 22221 21913 14788 8890 -881 -16678
522 -16678 -27294 -23521 -13651 -5747 4177 18578 25094 17945 7896 1930 -6324 -17477 -22479 -16127
536 -16127 -6562 -635 7614 19681 25731 19062 7205 -484 -9920 -23512 -27384 -16634 -2779 6285
$$ packed form
440D779r935j2763j1198J666J3486J3817J3174J4896O737q489j7865j5234j2485
453a9414r259j246J1634J6934J2845O750N078O21j0276j5630j0308o311o694j107
467b6383J2774J7099J1288P173N096l500j4396j6676j0021l494q96M245J4149
480c542J5620O885J123P18m247j4260j4863n952j981j985M918J5043J5487P715
494B0679K050o56q461j7786j6831n982L194O451J0452J8561J4395j81p026o140
508A2719r936j4807r961J784N857M291Q375J3650J0249l08p125n898r771j5797
522a6678j0616L773R870P904R924J4401O516p149j0049n966q254j1153n002O352
536a6127R565N927Q249J2067O050o669j1857p689r436j3592l872J0750J3855R064
$$ plain form
550 6285 15433 24868 24243 10217 -4092 -12344 -17991 -23332 -20749 -6886 6834 11298 14265 20166
564 20166 18610 5482 -5893 -10013 -14029 -20028 -17596 -3269 9499 14717 17749 21052 15894 96
578 96 -13547 -16046 -16260 -18081 -13033 1905 13183 13979 13284 16373 10979 -4036 -15315 -17312 -17183
593 -17183 -17589 -9713 8108 20852 21301 17182 13817 4445 -12281 -22323 -17944 -11428 -8141 540
607 540 14585 20913 15062 8714 6124 -1156 -13763 -20114 -15572 -9532 -7397 -480 13919 21605 15507
622 15507 7804 4187 -4833 -18664 -22916 -13370 -3514 1204 9114 19519 21147 11318 1433 -1845
636 -1845 -7158 -17190 -19238 -9947 -646 1774 7599 18972 21081 9604 -1763 -6620 -14441 -23273
650 -23273 -20893 -6435 6533 10758 14453 19578 15694 1318 -9455 -10284 -11046 -15972 -12534 1196
$$ packed form
550F285R148R435o25j4026j4309q252n647n341K583J3863J3720M464K967N901
564B0166j556j3128j1375m120m016n999K432J4327J2768N218L032L303n158j5798
578I6j3643k499k14j821N048J4938J1278P96o95L089n394j5015j1279j997J29
593a7183m06P876J7821J2744M49m119l365r372j6726j0042M379O516L287Q681
607E40J4045O328n851o348k590p280j2607o351M542O040K135O917J4399P686o098
622A5507p703l617r020j3831m252R546R856M718P910J0405J628r829r885l278
636a845n313j0032k048R291R301K420N825J1373K109j1477j1367m857p821q832
650b3273K380J4458J2968M225L695N125l884j4376j0773q29p62m926L438J3730
$$ plain form
664 1196 10501 10715 12524 17186 13217 -827 -10804 -11666 -12944 -16595 -11616 3075 13384 12612 11144
679 11144 13229 7591 -7379 -16030 -13371 -10904 -12948 -6562 7955 15709 13321 11397 12704 6323
693 6323 -8360 -17499 -14578 -10948 -9986 -1589 14494 22229 15686 7938 5135 -3495 -17226 -20567 -11619
708 -11619 -3660 -2007 3080 13625 15799 8066 2107 2322 -2314 -13115 -17121 -9454 -2818 -1956 4508
723 4508 16714 19998 10126 1669 -560 -6916 -16796 -17165 -6367 1983 3741 8302 16806 16644 4782
738 4782 -4344 -5587 -9551 -17593 -16999 -4369 5141 6476 10455 17523 14603 1356 -8693 -10041 -11388
753 -11388 -15569 -10853 3509 12682 11001 9917 13128 8831 -3921 -10489 -7508 -7573 -11669 -9027 2598
768 2598 9760 8130 8758 12566 8080 -5289 -13960 -12369 -10692 -12076 -5723 8953 15882 11582 8186
$$ packed form
664A196R305K14J809M662l969j4044r977q62j278l651M979J4691J0309p72j468
679A1144K085n638j4970q651K659K467k044O386J4517P754k388j924J307o381
693F323j4683r139K921L630R62Q397J6083P735o543p748k803q630j3731l341Q948
708a1619P959J653N087J0545K174p733n959K15m636j0801m006P667O636Q62O464
723D508J2206L284r872q457k229o356r880l69J0798Q350J758M561Q504j62j1862
738D782r126j243l964q042N94J2630R510J335L979P068k920j3247j0049j348j347
753a1388m181M716J4362R173j681j084L211m297j2752o568K981o5m096K642J1625
768B598P162j630O28L808m486j3369q671J591J677j384O353J4676O929m300l396
$$ plain form
783 8186 8031 2787 -9616 -14699 -9691 -5680 -6161 -816 10962 16312 10818 6039 5371 -674 -12866
798 -12866 -17316 -10589 -4722 -3313 2784 14200 16173 7355 271 -1096 -5357 -13595 -14391 -5114 1033
813 1033 651 3903 12267 14148 5899 494 551 -3472 -13055 -14367 -5948 1332 3177 7676 15294 14647
829 14647 3798 -5098 -6773 -9554 -14817 -12488 -816 6381 5948 7469 12163 10027 -148 -7132
843 -7132 -6553 -8174 -12614 -9565 2049 9476 9291 9864 12377 8145 -3916 -11230 -8782 -7508 -9123
858 -9123 -4940 5619 11041 7322 5371 7181 3659 -5872 -10902 -7966 -6456 -8505 -4927 5856 11582
873 11582 8898 6906 7562 2708 -8523 -13797 -8995 -4905 -4124 1239 11308 14655 8406 3409 2478
888 2478 -1955 -10415 -12983 -6918 -2122 -1891 1943 10523 12765 6453 804 -450 -5133 -12851 -13453 -5299
$$ packed form
783H186j55n244j2403n083N008M011m81N345J1778N350n494m779o68o045j2192
798a2866m450O727N867J409O097J1416J973q818p084j367m261q238p96R277O147
813A033l82L252Q364J881q249n405N7m023r583j312Q419P280J845M499P618o47
829A4647j0849q896j675k781n263K329J1672P197m33J521M694k136j0175o984
843g132N79j621m440L049J1614P427j85N73K513m232j2061p314K448J274j615
858i123M183J0559N422l719j951J810l522r531n030K936J510k049L578J0783N726
873A1582k684j992O56m854j1231n274M802M090P81N363J0069L347o249m997r31
888B478m433q460k568O065M796K31L834Q580K242o312n649j254m683p718o02Q154
$$ plain form
904 -5299 1041 2250 6009 12033 11125 3063 -2561 -2193 -4085 -9296 -9364 -2115 2603 2499 4746 10948
920 10948 10844 3201 -2958 -4195 -7387 -12849 -11079 -1433 5251 6200 8040 10808 7467 -2189 -8131
935 -8131 -7225 -7111 -9083 -5442 3630 8519 7024 6496 8577 5548 -3049 -7877 -6293 -6162 -7815 -4445
951 -4445 4823 10057 7839 6293 6264 1744 -7493 -11271 -7411 -4524 -4610 -652 6137 8649 5377 3088
967 3088 4182 1232 -6146 -9073 -5926 -4132 -4113 130 8811 11845 7697 3906 2418 -2907 -10222 -11226
983 -11226 -5659 -1090 327 3819 9390 9504 3931 -830 -1719 -4532 -9664 -9700 -3846 495 1885 4486
999 4486 9463 9118 2732 -1515 -2431 -5218 -8810 -7363 -819 4010 4108 5450 8381 6449 171 -3669
1015 -3669 -3282 -4465 -7766 -7039 -1007 2602 3096 5569 8556 6920 -271 -5477 -6647 -8015 -8996 -4837
$$ packed form
904e299O340J209L759O024r08q062n624L68j892n211o8P249M718j04K247O202
920A0948j04p643o159j237l192n462J770R646O684R49J840K768l341r656n942
935h131R06J14j972L641R072M889j495n28K081l029q597m828J584J31j653L370
951d445R268N234k218j546k9m520r237l778L860K887q6L958O789K512l272k289
967C088J094k950p378k927L147J794J9M243Q681L034m148l791j488n325p315j004
983a1226N567M569J417L492N571J14n573m761q89k813n132l6N854M341J390K601
999D486M977l45o386m247r16k787l592J447O544M829R8J342K931j932o278l840
1015c669L87j183l301P27O032L609M94K473K987j636p191n206j170j368r81M159
$$ plain form
1031 -4837 3102 8021 7438 6643 6640 2558 -4351 -6874 -5358 -4128 -4422 -1221 4693 6805 5366 4486 4389
1048 4389 1189 -5010 -8138 -6005 -5096 -4465 -747 5547 7338 5320 3135 2420 -1114 -6317 -7238 -4499
1064 -4499 -2599 -1597 1594 6643 7763 4860 3240 2329 -1235 -6565 -8059 -5185 -2735 -794 4004
1079 4004 8929 8444 3727 -139 -2466 -6054 -8939 -7022 -1930 1322 2582 4425 6568 5447 855
1094 855 -981 -1651 -4110 -6344 -4919 -889 1920 3421 5813 7585 5475 505 -2747 -3761 -5598
1109 -5598 -6784 -4178 551 3064 3618 4537 5756 2712 -1550 -3889 -4133 -5409 -6285 -3312 1560 4282
1125 4282 5144 6278 6387 2377 -3010 -5803 -5692 -5275 -4140 235 5557 6765 5358 4022 2530 -1435
1141 -1435 -5431 -5518 -3675 -3587 -2958 531 3900 4469 3568 3411 2391 -1631 -5633 -5804 -4062 -3071 -1083
$$ packed form
1031d837P939M919n83p95lm082o909k523J516J230k94L201N914K112j439q80r7
1048D389l200o199l128K133R09O31L718O294J791k018k185p15l534n203r21K739
1064d499J900J002L191N049J120k903j620r11l564n330j494K874K450J941M798
1079D004M925m85m717l866k327l588k885J917N092L252J260J843K143j121m592
1094H55j836o70k459k234J425M030K809J501K392J772k110m970l252j014j837
1109e598j186K606M729K513N54R19J219l044m262k339k44j276q76K973M872K722
1125D282Q62J134J09m010n387k793J11M17J135M375N322J208j407j336j492l965
1141a435l996q7J843Q8O29L489L369N69r01j57j020m022m002j71J742R91J988
$$ plain form
1158 -1083 2977 6108 5813 3620 2505 1223 -2450 -5554 -4927 -2962 -1872 -225 3436 6146 5298 2908
1174 2908 1384 -1117 -5117 -7541 -6091 -2662 -509 2319 5714 6971 4201 353 -1669 -3227 -5099
1189 -5099 -5482 -2312 1043 2010 2525 4716 5214 2923 379 -397 -1655 -4474 -5594 -3287 70 1273
1205 1273 3159 5719 5585 1919 -2058 -3554 -4038 -5770 -4791 -726 2352 3101 3300 4619 4499 879
1221 879 -2322 -2362 -3475 -4972 -4086 311 3854 4538 4823 5276 3095 -1643 -5150 -4564 -3879 -3916 -1655 2314
1239 2314 4050 3297 2175 2305 1073 -2806 -4343 -3019 -2473 -3032 -1747 1943 4815 3792 3428 3624
1255 3624 1632 -2869 -5199 -4037 -2429 -1968 377 4400 5474 3288 1629 1218 -897 -4464 -5610
1270 -5610 -3229 -1783 -1542 44 4210 5175 3104 1070 466 -1843 -5474 -5871 -2528 365 1302 3096
$$ packed form
1158a083M060L131k95k193j115j282l673l104O27J965J090J647L661K710q48k390
1174B908j524k501m000k424J450L429K153K828L395J257k770l848k022j558j872
1189e099l83L170L355R67N15K191M98k291k544p76j258k819j120K307L357J203
1205A273J886K560j34l666l977j496m84j732R79M065L078P49J99J319j20l620
1221H79l201m0j113j497Q86M397L543O84K85M53k181m738l507N86O85l7K261L969
1239B314J736p53j122J30j232l879j537J324N46n59J285L690K872j023l64J96
1255C624j992m501k330J162J608M61K345M023J074k186j659m11k115l567j146
1270e610K381J446K41J586M166R65k071k034o04k309l631l97L343K893R37J794
$$ plain form
1286 3096 5740 5122 1355 -903 -1231 -2080 -4066 -3617 -454 608 477 1404 4215 3979 1050 -1120 -1302
1303 -1302 -2906 -5621 -5054 -1350 1368 1838 3112 5371 4236 -436 -2537 -2366 -2728 -4106 -2948 1163
1319 1163 3267 2639 3053 4497 3176 -1409 -3202 -2723 -3065 -4435 -2779 1991 4298 3147 2750 3298
1335 3298 1091 -4036 -4919 -2862 -1954 -2395 -575 3188 4166 2128 1489 2908 1384 -2312 -3386 -2022
1351 -2022 -1912 -2759 -850 3547 5089 2915 2164 1959 -527 -4775 -5852 -2890 -1202 -1393 704 4347
1367 4347 4713 1331 273 574 -1365 -4598 -4776 -1506 -38 -397 1818 5364 5167 1636 -324 -448
1383 -448 -2184 -4977 -4380 -257 1655 998 2035 4105 3276 -728 -2026 -816 -1792 -4068 -3566 -172
1399 -172 1167 21 1759 4805 4001 221 -1556 -1449 -2595 -4789 -3192 1188 3684 2629 3085 4496
$$ packed form
1286C096K644o18l767k258l28q49j986M49L163J062j31R27K811k36k929k170j82
1303a302j604k715N67L704K718M70J274K259j135m672k101J71l62j378J158M111
1319A163K104o28M14J444j321m585j793M79l42j370J656M770K307j151l97N48
1335C298k207n127q83K057R08m41J820L763R78k038o39J419j524l696j074J364
1351b022J10q47J909M397J542k174p51k05k486m248j077K962J688j91K097L643
1367D347L66l382j058L01j939l233j78L270J468l59K215L546j97l531j960j24
1383d48j736k793N97M123J912o57J037K070q29m004j298J210r76k276N02L394
1399a72J339j146J738L046q04l780j777J07j146k194J597M380K496j055M56J411
$$ plain form
1415 4496 2500 -2079 -3996 -1996 -2162 -3643 -1688 2270 3368 1779 1552 3040 1145 -3262 -4342
1430 -4342 -2427 -2017 -2998 -841 3123 4224 1955 1383 2635 580 -3209 -3613 -1138 -317 -1843 -222
1446 -222 3374 3911 1643 1263 2344 346 -3920 -4714 -2303 -1502 -2025 123 4491 4743 1421 -61 263
1463 263 -1935 -5027 -4374 -674 960 60 1632 4446 3869 499 -413 416 -1026 -4202 -3473 121 1199
1480 1199 600 1904 4569 3624 -646 -2161 -1273 -2222 -4422 -3330 516 1973 330 1273 3514 2668
1496 2668 -759 -1794 -759 -1532 -3767 -2940 1028 2442 1712 2355 4578 2971 -1201 -3199 -2208 -2659
1512 -2659 -3826 -1779 2760 4079 1982 1531 2616 484 -3408 -3807 -1611 -1217 -2323 -1101 2727 3487
1528 3487 1661 1168 2284 436 -3238 -3929 -1437 -500 -1518 288 3730 3814 1167 601 1426 -195 -3429
$$ packed form
1415D496j996m579j917K000j66j481J955L958J098j589k27J488j895m407j080
1430d342J915M10r81K157L964J101k269n72J252k055l789m04K475Q21j526J621
1446b22L596N37k268l80J081j998m266p94K411Q01n23K148M368K52l322j482L24
1463B63k198l092O53L700J634r00J572K814n77l370r12Q29j442l176P29L594J078
1480A199n99J304K665r45m270j515Q88r49k200J092L846J457j643R43K241q46
1496B668l427j035J035p73k235Q27L968J414p30O43K223j607m172j998R91m51
1512b659j167K047M539J319k097m51J085k132l892l99K196L94j106J222L828P60
1528C487j826m93J116j848l674o91K492R37j018J806L442Q4k647n66Q25j621l234
$$ plain form
1545 -3429 -3404 -953 -565 -1697 -374 3138 3856 998 352 959 -1014 -4721 -4384 -1098 347 -155 1775
1562 1775 4665 3856 471 -1125 -516 -1307 -3844 -2769 696 1941 831 1346 3596 2822 -345 -1583
1578 -1583 -286 -1487 -3881 -2967 115 1680 967 1083 3460 2357 -1316 -2612 -1235 -1449 -3374 -1722
1594 -1722 1777 2576 1008 1621 3491 2243 -1329 -2328 -954 -1651 -3225 -2005 1852 3243 1814 1650
1610 1650 2790 544 -3269 -3798 -1967 -1445 -1987 -291 2849 3242 760 601 1450 155 -2860 -3171 -885
1627 -885 -142 -1388 -82 3251 3690 1135 453 1369 -252 -3309 -3231 -905 113 -269 602 3010 2969 299
1645 299 -646 402 -685 -3352 -3348 -633 101 -516 775 3460 3547 552 -471 -51 -1601 -3925 -2879
1662 -2879 435 2055 1127 1961 3704 2179 -1268 -2151 -1114 -1417 -2808 -1812 1022 1340 363 993 2372
$$ packed form
1545c429K5K451L88j132J323L512P18k858o46O07j973l707L37L286J445n02J930
1562A775K890q09l385j596O09p91k537J075L465J245j110N15K250p74l167j238
1578a583J297j201k394R14L082J565p13J16K377j103l673j296J377k14j925J652
1594a722L499P99j568O13J870j248l572r99J374o97j574J220L857J391j429j64
1610A650J140k246l813n29J831N22n42J696L140L93k482j59Q49j295l015l11K286
1627h85P43j246J306L333M39k555o82R16j621l057P8K326J018l82Q71K408m1k670
1645B99r45J048j087k667MK715P34o17J291K685Q7k995j023M20j550k324J046
1662b879L314J620r28Q34J743j525l447q83J037l03j391R96K834L18r77O30J379
$$ plain form
1679 2372 1803 -995 -1802 -782 -1722 -2967 -1690 1149 2341 1458 1760 2985 1622 -1343 -2192 -1316 -1270
1696 -1270 -2285 -644 1938 2459 1437 1149 1944 859 -2139 -2991 -1818 -1596 -2104 -454 2581 3073 1326
1713 1326 485 1026 -681 -3008 -2875 -807 63 -244 692 2827 2598 488 263 979 -44 -2212 -2055
1730 -2055 -587 -440 -621 480 2909 2770 553 -303 -172 -1566 -3286 -2564 -479 38 48 1238 2977
1747 2977 2410 307 -540 -363 -1119 -2837 -1831 258 1021 924 1791 3029 2250 -592 -1521 -1168 -2076 -2745
1765 -2745 -1571 963 1717 699 1108 1823 461 -1183 -1992 -591 -1105 -1874 -670 655 1452 1051 1291
1782 1291 2322 1378 -892 -1426 -939 -1494 -1866 -305 1793 2216 1529 1274 1597 -77 -1690 -2184 -1209 -1034
1800 -1034 -1358 -363 1794 2069 1059 923 1064 -157 -2140 -2369 -1298 -438 -636 1140 2756 2298 734
$$ packed form
1679B372n69k798q07J020r40j245J277K839J192q83L02J225j363k965q49Q76M6
1696a270j015J641K582N21j022k88P95j085k998q52J173K22n08J650L035M92j747
1713A326q41N41j707k327J33K068Q70l07R36K135k29k110k25P16j023k168J57
1730b055J468J47j81J101K429j39k217q56J31j394j720P22K085N17J0J190J739
1747B977n67k103q47J77p56j718J006K089P63r7Q67J238p79k842r29L53r08o69
1765b745J174K534P54j018M09P15j362j644q09J401n14p69J204J325P97m01K40
1782A291J031r44k270n34M87n55l72J561K098M23o87k55L23j674j613m94R75J75
1800a034l24R95K157K75j010j36J41j221j983k29J071Q60j98J776J616m58j564
$$ plain form
1817 734 497 276 -1309 -2126 -1653 -295 129 -29 869 1884 1214 225 47 80 -1165 -2297 -1909 -809
1835 -809 -331 44 1427 2384 1777 367 -463 -685 -1349 -2399 -1229 357 1001 644 1641 2269 1116 -237
1853 -237 -464 -711 -1771 -1937 -1154 189 921 931 1530 1831 523 -1127 -1675 -1407 -1914 -1563 -93 1272
1871 1272 1189 929 947 1244 -97 -868 -750 -542 -1003 -1074 -16 1154 1090 1055 1937 1620 61 -1351 -1559 -1424
1891 -1424 -1697 -1249 269 1698 1525 591 805 576 -807 -2026 -1400 -980 -657 -302 947 2027 1498 799
1909 799 857 353 -1010 -1613 -1243 -670 -389 273 1599 1822 1124 -60 -3 -506 -1336 -1507 -913 -227 -509 -292
1929 -292 995 1241 731 419 439 -101 -1523 -2017 -1317 -220 481 1174 2135 2325 979 -376 -818 -840 -1591
1948 -1591 -1398 -349 560 555 747 1529 1249 -133 -788 -820 -1110 -1830 -1441 25 883 791 912 1841 1037 -285
$$ packed form
1817G34k37k21j585q17M73J358M24j58Q98J015o70r89j78L3j245j132L88J100
1835h09M78L75J383R57o07j410q30k22o64j050J170J586O44l57R97O28j153j353
1853b37k27k47j060j66P83J343P32J0N99L01j308j650n48K68n07L51J470J365
1871A272q3k60J8K97j341p71J18K08m61p1J058J170o4l5Q82l17j559j412k08J35
1891a424k73M48J518J429j73r34K14k29j383j219O26M20L23L55J249J080n29o99
1909G99N8n04j363o03L70N73K81O62J326K23o98j184N7n03q30j71N94O86k82K17
1929b92J287K46n10l12K0n40j422m94P00J097P01O93R61J90j346j355m42k2p51
1948a591J93J049R09nJ92P82k80j382o55l2k90p20L89J466Q58r2J21R29q04j322
$$ plain form
1968 -285 -871 -563 -808 -908 -834 590 1192 822 880 1335 884 -145 -764 -841 -712 -1509 -1175 310 1088 940
1988 940 688 1203 574 -1036 -1389 -1125 -995 -1145 84 1492 1726 809 551 870 197 -1205 -1264 -406 -381
2007 -381 -564 -149 1411 1530 326 331 441 -125 -1316 -1667 -543 160 -432 95 1290 1367 195 -290 342
2026 342 46 -1276 -1369 -38 232 -249 331 1670 1890 820 202 226 -465 -1864 -1853 -296 657 357 1033
2045 1033 1913 1162 -103 -1220 -710 -703 -1719 -1211 569 774 125 159 1450 826 -278 -994 -25 -572 -1307
2064 -1307 -896 944 1237 454 861 1667 1060 -725 -706 -422 -330 -1037 -994 665 818 14 480 1033 421 -1132
2084 -1132 -1407 -685 -886 -1665 -675 1346 1715 701 645 1112 247 -1498 -1431 -283 45 -452 -143 1725 1772
2103 1772 289 110 739 146 -1177 -1356 -158 -250 -1010 -362 1319 1394 56 -72 290 -35 -1714 -1555
$$ packed form
1968b85n86L08k45j00P4J424O02l70N8M55m51j029o19p7J29p97L34J485P78j48
1988I40k52N15o29j610l53K64J30j50J229J408K34r17k58L19o73j402n9Q58K5
2007c81j83M15J560J19j204NJ10n66j191l51J124P03n92N27J195P7j172m85O32
2026C42k96j322r3J331K70m81N80J339K20j070o18K4o91j399J1J557R53l00O76
2045A033Q80p51j265j117N10Pj016N08J780K05o49L4J291o24j104p16R69n47p35
2064a307M11J840K93p83M07Q06o07j785J9K84R2p07M3J659J53q04M66N53o12j553
2084a132k75P22k01p79R90K021L69j014n6M67q65j745O7J148L28m97L09J868M7
2103A772j483j79O29n93j323j79J198r2p60O48J681P5j338j28L62l25j679J59
$$ plain form
2121 -1555 -103 290 -480 232 1651 1538 130 60 816 51 -1636 -1614 -394 351 -327 398 1769 1431
2139 1431 96 -589 -69 -765 -2193 -1383 572 1137 8 690 1378 965 -546 -1023 11 -148 -1493
2156 -1493 -925 818 1295 -8 508 1511 1185 -278 -1072 63 -507 -1549 -772 852 1265 255 408
2173 408 1272 512 -1121 -1405 -457 -457 -1009 -551 866 1382 203 425 1259 730 -1178 -1462 -192 -191 -655 -125
2193 -125 1748 1654 273 2 666 16 -1687 -1629 64 151 -859 -117 1184 1174 -140 -379 720 -37 -1339
2212 -1339 -1493 108 -36 -708 14 1619 1849 9 -97 341 14 -1470 -1212 118 527 -233 83 1449
2230 1449 1154 -218 -388 40 -427 -1965 -1468 87 819 130 364 1559 1257 -748 -1155 -412 -449 -1608
2248 -1608 -822 1008 1307 247 260 1122 784 -868 -864 131 194 -1079 -846 515 824 -74 -138 1565 829
$$ packed form
2121a555J452L93p70P12J419j13j408p0P56p65j687K2J220P45o78P25J371l38
2139A431j335o85N20o96j428Q10J955N65j129O82O88m13j511m77J034j59j345
2156a493N68J743M77j303N16J003l26j463p94J135n70j042P77J624M13j010J53
2173D08Q64p60j633k84R48%n52M58J417N16j179K22Q34n29j908k84J270Jm64N30
2193a25J873r4j381k71O64o50j703N8J693Q7j010P42J301j0j314k39J099p57j302
2212a339j54J601j44o72P22J605K30j840j06M38l27j484K58J330M09p60L16J366
2230A449k95j372j70M28m67j538M97J555P32o89K34J195l02k005m07P43l7j159
2248a608P86J830K99j060J3Q62l38j652MR95O3j273K33J361L09q98o4J703p36
$$ plain form
2267 829 -873 -1331 -479 -457 -1183 -836 979 1374 237 326 1171 322 -1212 -1031 -108 -120 -744 -87 1480
2286 1480 1446 494 276 840 131 -1609 -1627 -202 164 -602 239 1345 1061 -503 -636 261 13 -1392 -1191
2305 -1191 290 217 -558 -99 1264 1405 41 3 619 243 -1353 -1042 140 396 -76 245 1409 1344 -118
2324 -118 -770 -4 -302 -1403 -1102 367 537 2 63 1664 975 -554 -873 125 -612 -1262 -952 643 1149
2343 1149 301 397 1344 887 -655 -867 24 -297 -854 -650 921 709 -205 -33 1027 566 -819 -1048 -220
2362 -220 -181 -1339 -911 585 1013 510 551 1074 662 -1175 -1334 -170 -251 -844 -322 1337 1293 412 145 731
2382 731 217 -1271 -1066 -45 210 -552 -173 1036 1202 -2 -206 230 -102 -1600 -1339 61 291 -564
2400 -564 199 1321 1158 -368 -291 331 -55 -866 -758 306 -64 -282 161 1137 1277 -257 -373 -122 -498
$$ packed form
2267H29j702m58Q52K2p26L47J815L95j137Q9Q45q49j534J81R23j2o24O57J567
2286A480l4r52k18N64p09j740j8J425L66p66Q41J106k84j564j33Q97k48j405K01
2305a191J481p3p75M59J363J41j364l8O16l76j596L11J182K56m72L21J164o5j462
2324a18o52P66k98j101L01J469J70n35O1J601o89j529l19R98p37o50L10J595N06
2343A149q48R6R47m57j542k12Q91l21n57K04J571k12r14J72J060m61j385k29Q28
2362b20L9j158M28J496M28n03M1N23m12j837j59J164q1n93N22J659m4q81k67N86
2382G31n14j488K05J021K55p62L79J209J66j204k04M36l32j498K61J400K30q55
2400e64P63J122j63j526P7O22l86q11J08J064l70k18M43R76J40j534j16K51l76
$$ plain form
2419 -498 -1549 -1149 -30 452 -11 168 1056 1026 -543 -879 -127 -210 -799 -884 708 618 172 258 1282 533
2439 533 -387 -654 54 -343 -1283 -575 741 733 116 357 687 286 -945 -940 -396 -213 -902 -615 234 606 -30
2460 -30 199 751 281 -583 -900 -296 -263 -678 -76 1238 1347 413 365 737 92 -994 -956 -184 172 -467 222
2481 222 913 1015 -230 -149 118 -236 -948 -887 -116 3 -359 138 969 885 36 -67 275 -70 -989 -611 426
2502 426 476 238 612 1215 796 64 -111 -29 -223 -800 -847 49 -68 -138 659 948 848 -177 -590 -164 -558
2523 -558 -1009 -865 659 778 198 533 736 771 -521 -647 122 -195 -436 -80 770 493 395 252 704 176
2543 176 -509 -741 -110 -470 -485 -228 776 858 -83 108 824 71 -1027 -579 -158 -197 -672 86 581 520 324
2564 324 504 554 371 -872 -545 -217 -393 -479 103 941 738 -95 26 48 -496 -1004 -724 -25 -142 -172 361
$$ packed form
2419d98j051M00J119M82m63J79Q88l0j569l36P52q3n89q5J592r0m46Q6J024p49
2439E33r20k67P08l97r40P08J316qo17K41L30m01j231NN44J83o89K87Q49L72o36
2460c0K29N52m70q64l17O04L3m15O02J314J09r34m8L72o45j086L8P72L56o39O89
2481B22O91J02j245Q1K67l54p12O1P71J19l62M97Q31q4q49j03L42l45r19L78J037
2502D26N0k38L74O03m19p32j75Q2j94n77m7Q96j17p0P97K89j00j025m13M26l94
2523e58m51J44J524J19n80L35K03L5j292j26P69l17k41L56Q50k77r8j43M52n28
2543A76o85k32O31l60j5K57J004Q2r41J91P16p53j098M48M21l9m75P58M95o1j96
2564C24J80N0j83j243L27L28j76q6N82Q38k03q33J21K2n44n08K80O99j17l0N33
$$ plain form
2585 361 601 555 -134 -164 228 -177 -704 -537 472 205 27 487 797 462 -205 -1 21 -281 -857 -531 -70
2606 -70 38 -53 192 663 411 -396 -38 -208 -745 -1011 -598 217 379 124 624 1010 600 -205 -191 -120 -494
2627 -494 -710 215 716 663 344 643 416 -223 -461 -377 -91 -548 -636 -252 496 78 -233 187 615 -110 -345
2648 -345 -384 28 -335 -627 223 579 137 209 532 755 -30 -516 -467 -189 -657 -450 436 752 586 77 56
2669 56 283 -440 -927 -523 -152 -431 -415 567 744 191 -43 84 140 -332 -582 -108 425 -198 -15 401 494
2690 494 182 23 282 142 -610 -772 -462 -65 -61 -355 533 750 -13 -31 -107 160 -504 -850 -207 126 -100
2711 -100 -10 658 680 194 -336 -54 -189 -548 -697 81 743 480 112 714 665 -203 -593 -388 -44 -549 -648
2732 -648 105 647 204 -159 523 323 -139 -351 -175 33 -811 -514 280 601 195 153 1040 550 -215 -489
$$ packed form
2585C61K40m6o89l0L92m05n27J67J009k67j78M60L10l35o67K04K2l02n76L26M61
2606g0J08r1K45M71k52q07L58j70n37k66M13Q15J62k55N00L86m10q05J4P1l74
2627d94k16R25N01n3l19K99k27o39k38Q4K86m57q8L84P48m18l11M20M28p25k35
2648c45l9M12l63k92Q50L56m42P2L23K23p85m86M9K78m68K07Q86L16j66n09k1
2669E6K27p23m87M04L71k79J6R82J77n53k34J27N6m72k50M74N33o23J83M16R3
2690D94l12j59K59j40p52j62L10L97Mk94Q88K17p63j8p6K67o64l46O43L33k26
2711a00R0O68K2m86n30K82j35l59j49P78O62k63l68O02m9q68l90K05L44n05r9
2732f48P53N42m43l63O82k00m62k12J76K08q44K97P94L21m06m2Q87m90p65k74
$$ plain form
2752 -489 -202 107 -373 -545 272 789 212 -61 568 425 -600 -625 -381 -10 -412 -508 428 1033 186 -96
2772 -96 186 198 -624 -861 -282 97 -229 -150 552 638 37 -130 276 216 -325 -646 9 72 -283 -232 619 791
2794 791 -253 -379 379 -12 -855 -716 -75 495 -174 78 721 945 78 -358 266 61 -707 -688 -101 474
2814 474 217 242 668 803 -192 -353 -20 74 -636 -799 407 258 -438 -169 386 392 -595 -565 -32 217 -482
2835 -482 -629 507 643 -102 25 440 694 -496 -444 167 295 -743 -599 652 636 177 27 243 649
2854 649 -683 -443 -342 70 -740 -429 472 708 286 -156 379 398 -680 -729 21 44 -450 -351 713 881
2874 881 -166 -222 389 176 -431 -527 229 378 -280 -395 528 669 -117 -556 173 108 -592 -824 134 -24 -340
2895 -340 -191 795 969 -139 -233 261 130 -495 -909 191 781 -45 97 1210 780 -15 -334 213 78
$$ packed form
2752d89K87L09m80j72Q17N17n77k73O29j43j025k5K44L71m02r6R36O05q47k82
2772i6K82J2q22k37N79L79l26P9P02Q6o01j67M06o0n41l21O55O3l55N1Q51J72
2794G91j044j26P58l91q43J39O41N70o69K52O43K24q67m36O24k05p68J9N87N75
2814D74k57K5M26J35r95j61L33R4p10j63J206j49o96K69N55Or87L0N33K49o99
2835d82j47J136J36p45J27M15K54j190N2O11J28j038J44J251j6m59j50K16M06
2854F49j332K40J01M12q10L11R01K36m22m42N35J9j078m9P50K3m94R9J064J68
2874H81j047n6O11k13o07r6P56J49o58j15R23J41p86m39P29o5p00k32R58j58l16
2895c40J49R86J74j108r4M94j31o25m14J100N90q26J42J113m30p95l19N47j35
$$ plain form
2914 78 -724 -790 36 635 -140 -353 703 475 -612 -693 -241 -16 -605 -518 600 638 -174 -227 868 592 -281
2935 -281 -286 77 80 -525 -446 564 589 -35 -297 894 717 -308 -586 -177 70 -793 -334 427 713 -58 -402
2956 -402 726 236 -456 -763 -304 145 -358 -262 737 955 -339 -130 405 602 -664 -875 46 457 -400
2975 -400 -191 628 679 -283 -563 119 -15 -671 -1068 246 262 -572 -386 664 694 -116 -604 227 312 -744
2995 -744 -674 74 625 -227 150 996 988 -123 -619 43 19 -873 -692 464 643 -112 -106 627 699 -589 -716
3016 -716 35 60 -632 -518 309 596 -25 -139 758 935 -217 -547 49 386 -525 -362 516 782 70 -25
3036 -25 781 661 -426 -615 157 -27 -746 -687 480 728 -50 -241 368 329 -678 -938 -81 288 -240 -419
3056 -419 749 831 -3 -78 399 261 -522 -502 256 456 -319 -376 778 607 -43 -216 521 191 -624 -782 389
$$ packed form
2914G8q02o6Q26N99p75k13J056k28j087q1M52K25n89Q7J118L8q12n3J095k76q73
2935b81nL63Lo05P9J010K5o24k62J191j77j025k78M09K47q63M59P61K86p71l44
2956d02J128m90o92l07M59M49n03R6R99K18j294K09N35J97j266k11R21M11q57
2975d00K09Q19N1r62k80O82j34o56l97J314J6q34J86J050L0q10m88Q31Q5j056
2995g44P0P48N51q52L77Q46qj111m96O62k4q92J81J156J79p55OP33P2j288j27
3016g16P51K5o92J14Q27K87o21j14Q97J77j152l30N96L37r11J63Q78K66p12r5
3036b5Q06j20j087j89P72j84p19N9J167K48p78j91O09l9j007k60Q57L69n28j79
3056d19J168Q2q34p5M77j38p83K0P58K00p75n7J154j71o50j73P37l30q15j58J171
$$ plain form
3077 389 90 -557 -455 352 604 -183 -261 384 182 -461 -339 188 366 -196 153 904 924 -265 -451 204
3097 204 252 -497 -309 367 455 -154 -136 650 629 -423 -837 126 -21 -552 -396 560 511 -20 -238 210 372
3118 372 -430 -507 185 370 -546 -245 412 583 -28 11 429 245 -529 -685 334 300 -410 -508 469 644 -136
3139 -136 -42 347 447 -741 -620 118 -129 -311 -283 566 744 -52 -35 451 253 -579 -583 148 76 -70 39 501
3161 501 741 -30 -312 168 230 -536 -564 76 183 -393 -492 433 658 -235 -105 187 150 -564 -435 273 391
3182 391 -195 224 807 535 -159 -247 490 64 -537 -597 244 485 94 -33 457 478 -190 -761 -313 -32 -592
3203 -592 -376 106 293 -197 -163 366 306 -272 -366 87 276 -326 -218 501 510 41 -51 551 407 -216 -176 -131 48
3226 48 -666 -398 343 269 -177 -370 660 185 -607 -560 173 -43 -356 -17 542 507 199 48 618 69 -376
$$ packed form
3077C89k99o47J02Q07K52p87p8O45k02o43J22N27J78n62L49P51K0j189j86O55
3097B04M8p49J88O76Q8o09J8P86k1j052m14R63j47n31J56R56m9n31k18M48J62
3118C72q02p7O92J85r16L01O57J71o11L9M18j84p74j56J019l4p10r8R77J75p80
3139a36R4L89J00j188J21P38k47j82K8Q49J78p96J7M86j98q32mP31p2j46J09M62
3161E01K40p71k82M80O2p66k8O40J07n76r9R25K25q93J30K92l7p14J29P08J18
3182C91n86M19N83k72o94q8P37m26o01o0Q41K41l91j27M90K1o68n71M48K81n60
3203e92K16M82J87m90L4N29o0n78r4M53J89o02J08P19Rm69r2O02j44o23M0M5J79
3226D8p14K68P41p4m46j93J030m75p92M7P33k16l13L39N59l5l08j51N70n49m45
$$ plain form
3247 -376 -517 185 107 -161 248 758 699 -397 -247 53 91 -666 -521 68 378 -143 -259 146 396 -287 -385
3268 -385 111 249 -401 -295 246 182 -160 206 554 298 153 -187 526 6 -534 -136 439 -150 -73 230 431
3289 431 290 -518 -553 25 -94 -702 -360 91 201 -202 213 512 103 -371 -311 -17 202 -423 -43 380 367
3310 367 -133 243 172 -39 -481 -187 321 -263 -253 -56 85 128 -367 70 360 -28 -478 -228 -71 -171 -562
3331 -562 69 460 328 -159 12 469 14 -448 -439 240 17 -273 223 619 431 -130 108 175 -97 -523 -341
3352 -341 49 154 -303 110 188 139 -236 -219 -264 -116 -404 -266 495 84 -64 111 400 86 -122 55 474
3373 474 159 -194 -118 147 138 -395 157 348 58 -123 -89 40 -346 -520 -411 98 135 42 496 364 -179 -389
3395 -389 -346 -17 -370 -420 149 535 345 -84 355 390 -403 -425 -96 305 -115 -412 101 235 40 -144 -26
$$ packed form
3247c76j41P02p8k68M09N10n9j096J50L00L8p57J45N89L10n21j16M05K50o83r8
3268c85M96J38o50J06N41o4l42L66L48k56j45l40P13n20n40L98N75n89P7L03K01
3289D31j41q08l5N78j19o08L42M51J10m03M15K99m09m74O0K94K19o25L80M23j3
3310C67n00L76p1k11m42K94N08n84J0J97J41M3m95M37K90l88m50K50J57j00l91
3331e62O31L91j32m87J71M57m55m62RO79k23k90M96L96j88n61K38O7k72m26J82
3352c41L90J05m57M13P8m9l75J7m5J48k88J38P61m11j48J75K89l14k08J77M19
3373D74l15l53P6K65rn33N52J91k90j81L4J29l86j74J09N09L7r3M54j32n43k10
3395c89M3L29l53n0N69L86j90m29M39L5p93k2L29M01m20k97N13J34j95j84J18
$$ plain form
3416 -26 274 -267 -555 -188 14 -447 -478 42 313 -54 -77 333 167 -93 -243 -236 -77 -142 -414 325 461 127
3438 127 -160 240 586 -313 -401 -25 -89 -27 -199 136 721 147 -354 88 43 -336 -399 -93 99 -6 -311 445
3460 445 467 193 -265 385 109 -106 -324 437 329 -184 -26 301 590 -150 -123 150 134 -637 -675 -56 56
3481 56 -296 -119 353 449 -96 -521 213 -57 -162 -294 236 501 -157 79 335 487 -463 -484 50 -87 -191
3502 -191 -383 370 534 -473 -458 439 437 -522 -531 -106 269 -573 -360 182 390 -399 -14 552 372 -183 -361
3523 -361 -81 244 -95 -340 521 383 13 -253 573 252 -242 -653 -8 30 -304 -222 254 475 -295 -453 22
3544 22 101 -269 -434 301 364 -315 -76 511 628 -143 -429 254 463 -185 -270 290 243 -286 -220 541 414 -328
3566 -328 -117 215 245 -642 -631 311 304 -207 -95 -16 312 -113 -320 107 236 -256 -570 459 309 143 -97
$$ packed form
3416b6L00n41k88L67K02m61l1N20K71l67k3M10j66k60j50PJ59o5k72P39J36l34
3438A27k87M00L46q99q8L76o4O2j72L35N85n74n01M42m5l79o3L06J92j05l05P56
3460D45K2k74m58O50k76k15k18P61j08n13J58L27K89p40K7K73j6p71l8O19J12
3481E6l52J77M72R6n45m25P34k70j05j32N30K65o58K36K56J52r50k1N34j37j04
3502a91j92P53J64j007J5Q97kr59rM25L75q42K13N42K08p89L85N66j80n55j78
3523c61K80L25l39k45Q61j38l70k66Q26l21m94m11O45L8l34Q2M76K21p70j58M75
3544B2P9l70j65P35O3o79K39N87J17p71k86O83K09o48q5N60m7n29O6P61j27p42
3566c28K11L32L0q87J1R42pn11J12P9L28m25k07M27J29m92l14J029j50j66k40
$$ plain form
3587 -97 589 457 -83 -279 226 121 -335 -420 465 681 -170 -388 327 341 -265 -485 55 159 -543 -392 353
3608 353 358 -424 -553 134 248 -350 -513 210 298 -416 -228 496 530 -88 -103 135 330 -333 -740 -73 256 -473
3630 -473 -236 512 465 -122 -243 -40 337 -675 -761 211 200 -595 -291 359 218 13 -265 258 91 -354 -346
3651 -346 345 173 -207 -265 493 445 -325 -212 623 192 -453 -704 386 218 -403 -324 263 493 -65 -523 207
3672 207 267 -757 -483 266 398 -114 -400 563 448 -250 -257 485 221 -615 -335 601 463 -235 -284 245 426
3693 426 -590 -481 211 232 -357 -345 471 289 -522 -338 379 644 -387 -252 142 170 -411 -194 545 698
3713 698 -148 -150 387 613 -545 -254 65 215 -475 -264 481 237 -503 -203 427 42 -737 -428 -12 -21 -308
3734 -308 -283 462 515 -467 -180 352 356 -593 -378 348 175 -339 -276 622 600 -245 -58 471 145 -349 -234 367
$$ packed form
3587i7O86j32n40j96N05j05m56q5Q85K16q51k18P15J4o06k20N40J04p02J51P45
3608C53Np82j29O87J14n98j63P23Q8p14J88P24L4o18j5K38J95o63m07O67L29p29
3630d73K37P48m7n87j21K03L77j012q6R72j1p95L04O50j41k05k78N23j67m45Q
3651c46O91j72l80n8P58m8p70J13Q35m31o45k51J090j68o21P9N87K30n58m58P30
3672B07O0j024K74P49J32n12k86R63j15o98pP42k64q36K80R36j38o98m9N29J81
3693D26j016J09O92K1n89J2Q16j82q11J84P17K65j031J35L94K8n81K17P39J53
3713F98q46kN37K26j158K91L19J50o90K11P45k44p40L00O30l85p79L09M16rk87
3734c08K5P45N3r82K87N32Mr49K15P26j73n14O3Q98k2q45J87N29l26m94J15O01
$$ plain form
3756 367 399 -529 -305 464 380 -118 -73 100 173 -483 -321 173 373 -368 -78 508 495 -283 -502 262 379 -394
3778 -394 -457 303 395 -325 108 535 356 -499 -391 115 215 -435 -285 470 465 -327 -263 256 398 -476 -291 457
3800 457 112 -421 -87 364 588 -377 -122 459 293 -383 -238 229 150 -277 -289 347 549 -199 -62 418 22
3821 22 -566 -805 240 113 -310 -416 292 390 -70 -319 23 179 -270 -198 453 620 -119 53 461 379 -118
3842 -118 -288 276 618 -289 -197 288 158 -374 -250 539 311 -366 -404 261 3 -613 -474 410 83 -399 -172
3863 -172 219 278 -386 -296 153 188 -569 -414 334 510 -358 -104 637 159 -488 -346 89 220 -465 -86 342
3884 342 123 -232 -173 218 253 -370 -149 227 301 -310 127 256 561 -144 -66 314 -98 -200 -142 349 51 -193
3906 -193 -307 405 424 -355 -31 80 35 -627 -145 176 110 -454 -403 153 112 -299 -76 444 18 -367 -113 325
$$ packed form
3756C67L2r28K24P69q4m98M5J73P3o56J62M94K00p41K90N86j3p78k19P64J17p73
3778c94o3P60R2p20M33M27j79q55J08N06J00o50J50P55np92O4N19J42q74J85P48
3800D57l45n33L34M51K24r65K55N81j66o76J45M67p9m27j2O36K02p48J37M80l96
3821B2n88k39J045j27m23j06P08R8m60k49L42J56m49P2O51J67p39J72M08q2m97
3842a18j70N64L42r07R2M85j30n32J24P89k28o77l8O65k58o16J39Q84l27m82K27
3863a72L91N9o64R0M49L5p57J55P48J76q68K54P41m78o47J42M35J31o85L79M28
3884C42k19l55N9L91L5o23K21L76P4o11M37J29L05p05P8L80m12j02N8M91k98k44
3906a93j14P12J9p79L24J11m5o62M82L21o6n64N1N56m1m11K23N20m26l85K54M38
$$ plain form
3928 325 211 117 -54 466 502 -348 -124 331 111 -263 -307 256 -78 -283 -58 125 246 -350 -245 87 -50
3949 -50 -547 -403 270 96 -421 -165 537 254 -274 -30 288 88 -278 -247 140 306 74 -43 394 179 -360
3970 -360 -83 102 -5 -308 65 409 174 -181 -151 163 -54 -313 -287 100 -78 -348 43 60 53 -233 -25 270
3992 270 349 -137 51 216 253 -319 109 287 42 -102 28 143 -456 -301 -201 244 -38 -314 -72 300 179
4013 179 -267 6 70 53 -607 -124 87 73 -294 -39 397 65 -74 -335 -166 -105 -263 -82 189 144 -317 244
4035 244 271 198 -302 17 169 -69 -460 -204 164 -205 -344 -8 327 -198 -206 -168 221 11 -338 123 280 160
4057 160 43 152 207 44 -5 -60 196 -75 -229 124 331 136 -271 67 275 -46 -409 -234 -10 -81 -255
4078 -255 100 497 27 -71 79 214 -174 -84 40 -43 -16 -619 115 82 -14 233 94 549 -122 -537 -180 45
$$ packed form
3928C25j14r4j71N20L6q50K24M55k20l74m4N63l34k05K25J83J21n96J05L32j37
3949e0m97J44O73j74n17K56P02k83n28K44L18k00l66L1L87J66k32j17M37k15n39
3970c60K77J85j07l03L73L44k35l55L0L14k17k59K6L87j78k70L91J7pk86K08K95
3992B70P9m86J88J65L7n72M28J78k45j44J30J15n99J55J00M45k82k76K42L72j21
4013A79m46K73O4j7o60M83K11j4l67K55M36l32j39k61J69O1j58J81K71m5m61N61
4035B44K7p3n00L19J52k38l91K56L68l69j39L36L35n25qL8L89k10l49M61J57j20
4057A60j17J09N5j63m9n5K56k71j54L53K07j95m07L38K08l21l63J75K24p1j74
4078b55L55L97m70r8J50J35l88R0J24q3K7o03P34l3r6K47j39M55o71m15L57K25
$$ plain form
4100 45 -191 -453 -159 374 181 -317 155 66 -58 -371 -104 291 119 -76 405 408 -33 -162 -4 166 -99
4121 -99 -72 218 253 -68 -47 299 183 -202 -250 96 118 -247 -481 68 -55 -200 -207 -70 339 -66 -346 199 138
4144 138 -232 -560 121 46 21 -59 286 495 51 48 -19 222 -32 -229 126 204 -52 -124 399 326 -188 -366 -105
4167 -105 -50 -230 -300 146 429 123 121 355 232 -206 -113 43 383 -105 -162 398 320 -295 51 50 300 -315 -613
4190 -613 219 272 -313 -191 211 165 -169 -265 204 66 -387 -248 148 52 -245 -73 340 323 -7 -122 283 199
4212 199 -139 -170 75 506 -92 24 422 240 -410 -257 61 88 -191 -441 278 185 -267 -154 105 124 -193
4233 -193 -467 281 445 -553 -148 163 190 -315 -175 293 212 -155 -96 311 109 -217 -215 367 310 96 -91 292
4255 292 336 -325 -364 -65 58 -333 -475 272 167 -144 -316 268 189 -275 -290 -3 54 -95 -132 317 197 -335
$$ packed form
4100D5k36k62K94N33j93m98M72q9j24l13K67L95j72j95M81Lm41j29J58J70k65
4121i9K7K90L5l21K1L46j16l85m8L46K2l65k34N49j23j45pJ37M09m05k80N45o1
4144A38l70l28O81p5k5q0L45K09m44lo7K41k54j97L55P8k56p2N23p3n14j78K61
4167a05N5j80p0M46K83l06kK34j23m38R3J56L40m88n7N60p8o15L46jK50o15k98
4190f13Q32N3n85J22M02m6l34r6M69j38m53J39L96r6k97J72M13j7l30j15M05q4
4212A99l38l1K45M31n98J16L98j82o50J53L18K7k79k50P19r3m52J13K59J9l17
4233a93k74P48J64r98M05L11K7n05J40M68q1l67N9M07k02l26KN82n7k14j87L83
4255B92M4o61l9K99J23l91j42P47j05l11j72N84p9m64j5K87N7j49l7M49j20n32
$$ plain form
4277 -335 -182 282 254 -127 -232 78 123 -237 -157 404 60 -89 -361 186 278 -415 -536 -19 149 -279 -11
4298 -11 269 499 -177 -125 224 76 -154 -137 165 214 -129 65 419 107 -205 -117 303 -55 -340 -142 -47 132
4320 132 -132 -371 205 -12 -248 -84 40 138 -266 -297 96 284 -134 -210 537 243 -88 123 265 238 -10
4341 -10 -2 304 218 -237 -192 320 429 -393 -413 252 72 -385 -305 229 105 -197 -120 333 328 -266 -334 335 112 -265
4365 -265 -276 490 318 -438 79 411 326 -359 -284 424 38 -333 -224 277 178 -260 -228 423 116 -403 -201 184
4387 184 146 -483 -14 244 283 -183 21 622 7 -122 -164 586 270 -187 170 204 397 -210 54 297 -112
4408 -112 -362 -161 461 125 -305 -188 170 291 -249 -288 238 37 -381 -199 200 379 -276 -488 118 119 -264
4429 -264 -273 533 12 -72 13 255 4 -202 -171 524 236 -180 -305 365 -131 -450 -262 306 316 -146 -224 238
$$ packed form
4277c35J53M64k8l81j05L10M5l60Q0N61l44j49k72N47R2o93j21N17J68m28K68
4298a1K80K30o76N2L49j48k30J7L02M9l43J94L54l12l12Q8M20l58k85J98R5J79
4320A32k64k39N76k17k36J64J24R8m04l1L93J88m18p6P47k94l31K11J42k7k48
4341a0QL06q6m55M5N12J09q22k0O65j80m57Q0N34j24l02P7M53nn94o8O69k23l77
4365b65j1P66j72p56N17L32q5o85P5P08l86l71J09N01r9m38L2O51l07n19K02L85
4387A84l8o29M69K58L9m66K04O01o15j29m2P50l16m57L57L4J93o07K64K43m09
4408a12k50K01O22l36m30J17L58J21n40l9N26k01m18J82L99J79o55k12O06Jl83
4429b64rQ06n21q4Q5K42k51k06L1O95k88m16j25O70m96l19J88N68J0m62p8M62
$$ plain form
4451 238 143 -469 -317 144 171 -189 112 274 379 -2 -346 349 46 30 -32 163 253 -249 6 87 45 -371
4473 -371 -110 467 -108 -540 -68 233 118 -454 -171 283 189 -243 -39 490 204 -103 -137 294 -19 -125 131
4494 131 392 215 -10 191 193 117 -315 -224 155 215 -361 124 302 394 -210 -179 275 54 -285 -296 160 294 -169
4517 -169 -161 202 15 -111 -55 507 372 -247 -29 113 122 43 24 284 110 -131 -174 245 -102 -367 -286 147 250
4540 250 -169 -189 357 172 -411 -211 5 -28 -177 -62 620 31 -146 -339 72 22 -305 41 108 -6 -424
4561 -424 95 385 176 -24 -261 123 -25 -123 -100 61 24 -309 64 95 79 -376 -20 259 61 -397 -208 401
4583 401 100 -181 -28 254 280 -77 -214 175 -78 -436 -244 304 209 -152 132 162 38 -306 -501 191 63
4604 63 -178 -144 433 150 -287 -233 77 -145 -339 -275 409 59 -493 -115 241 391 -27 -14 321 173 -264 -282
$$ packed form
4451B38r5o12J52M61K7l60L01J62J05l81l44O95l03j6o2J95R0n02K55Q1m2m16
4473c71K61N77n75m32M72L01j15n72K83M54r4m32K04N29k86l07l4M31l13j06K56
4494A31K61j77k25K01Kp6m32R1L79O0n76M85J78R2o04L1M54k21l39j1M56J34m63
4517a69QL63j87j26N6N62j35o19K18J42Rp9j9K60j74k41m3M19l47k65Q1M33J03
4540B50m19k0N46j85n83K00K16l3j49J15O82n89j77j93M11n0l27L46O7j14m18
4561d24N19K90k09k00k37L84j48r8K3J61l7l33L73L1j6m55L56K79j98m58J89O09
4583D01l01k81J53K82K6l57j37L89k53l58J92N48r5l61K84L0j24l44j95O92j28
4604F3k41L4N77k83m37N4L10k22j94O4O84l50n52L78L56J50m18J3L35j48m37j8
$$ plain form
4626 -282 335 85 -457 -246 165 -28 -207 131 16 10 -236 -362 0 -85 -338 -432 348 53 -360 40 167
4647 167 81 -265 -196 237 282 -488 -58 371 90 -245 -197 310 146 -179 -100 141 64 -302 -115 -130 194 -306
4669 -306 -132 463 -42 -264 -42 146 199 -193 156 369 219 -182 -87 368 100 -359 25 100 220 -119 -209
4690 -209 248 -63 -186 -48 -76 -95 -451 -70 366 197 -253 86 -109 6 -168 -247 72 192 -356 215 312
4711 312 59 -258 119 328 33 -27 -34 236 31 -240 87 107 56 19 181 276 -127 -363 -23 -84 -161 -160 110 290
4735 290 -13 -221 26 20 270 30 -4 -29 98 -145 275 477 75 51 -118 84 41 -353 -31 -68 136 -108
4757 -108 -44 310 98 -282 -61 165 85 -123 39 345 62 -170 61 322 -81 38 -59 204 -215 -265 -200 -109
4779 -109 -205 -284 15 115 -89 -243 192 -83 33 -128 -74 131 32 -371 -54 416 162 9 320 273 -220 -291
$$ packed form
4626b82O17k50n42K11M11j93j79L38j15ok46j26L62q5k53r4P80k95m13M00J27
4647A67q6l46O9M33M5p70M30M29k81l35M8N07j64l25P9K41p7l66J87j5L24n00
4669c06J74N95n05k22K22J88N3l92L49K13j50m01R5M55k68m59L84P5J20l39r0
4690b09M57l11j23J38k8j9l56L81M36j69m50L39j95J15j74p9L19J20n48N71R7
4711C12k53l17L77K09k95o0pK70k05k71L27K0n1l7J62R5m03k36L40o1p7JK70J80
4735B90l03k08K47oK50k40l4k5J27k43M20K02m02k4j69K02m3l94L22l7K04k44
4757a08O4L54k12l80K21K26q0k08J62L06k83k32K31K61m03J19r7K63m19n0O5R1
4779a09r6p9K99J00k04j54M35k75J16j61N4K05r9m03L17M70k54j53L11m7m93p1
$$ plain form
4801 -291 -15 362 190 -123 38 -81 -183 -187 36 312 -96 6 12 257 -212 -168 38 122 -225 -353 219 -68
4823 -68 -175 -224 44 121 -149 -209 -109 381 10 -170 3 233 -180 -220 155 292 153 -215 -25 -26 85 -211
4845 -211 -134 227 115 127 294 -4 13 -343 -117 103 -232 -555 259 276 170 -83 248 7 17 -169 233 190
4867 190 93 -246 -61 209 -29 -6 243 258 -102 -196 68 -7 -34 -200 87 189 -406 -135 84 14 -195 -127 57
4890 57 250 -226 -22 34 344 29 -90 116 331 39 -104 15 224 -337 -2 241 44 -220 -121 137 129 -97
4912 -97 -295 142 101 -298 -269 -226 88 -81 -40 219 -22 -131 -104 -89 91 -116 -79 200 284 66 -98 192 101
4935 101 -347 -201 59 150 -75 -195 -80 8 -165 -265 -74 34 -77 -102 41 129 -307 -32 18 281 -13 -195
4957 -195 102 154 -57 -188 -130 278 -134 -293 233 201 -68 -330 481 363 -126 -75 284 -101 -45 -243 15 94
$$ packed form
4801b91K76L77j72l13J61j19j02mK23K76m08J02OK45m69M4K06Q4l47j28N72k87
4823f8j07m9K68P7k70o0J00M90l71j80J73K30m13m0L75J37j39l68J90jJ11k96
4845b11P7L61j12J2J67k98J7l56K26K20l35l23Q14J7j06k53L31k41J0j86M02m3
4867A90r7l39J85K70k38K3K49J5l60r4K64p5k7j66K87J02n95K71K19p0k09O8J84
4890E7J93m76K04N6L10l15j19K06K15k92j43J19K09n61L35K43j97k64R9K58qk26
4912i7j98M37m1l99K9M3L14j69M1K59k41j09K7J5J80k07L7K79Q4k18j64K90r1
4935A01m48J46K60R1k25j20J15Q8j73j00J91J08j11k5J43Q8m36K75N0K63k94j82
4957a95K97N2k11j31N8M08m12j59N26l2k69k62Q11j18m89N1L59l85N6j98K58P9
$$ plain form
4979 94 -277 -86 -41 -85 -95 97 293 146 16 -319 330 73 -62 -69 141 -199 -222 -59 518 256 101 -118
5001 -118 130 -147 -217 -193 374 14 -243 -240 227 -7 65 -230 106 173 13 -326 -14 -11 -160 -214 195 230 -19
5024 -19 -82 272 141 18 30 83 185 -228 -341 92 160 -251 -113 150 -314 -563 -163 195 205 -305 -33 251
5046 251 184 -248 -85 106 141 -305 -35 224 146 -294 130 161 285 -69 -62 190 62 -205 -34 136 -140 -395
5068 -395 -41 119 131 -187 -150 166 -113 -136 -78 348 208 -166 -15 369 70 -198 -136 101 173 -223 -188 276
5090 276 140 -120 -75 153 67 -179 -72 509 22 -319 9 0 -130 -45 -165 130 198 -221 -142 170 90 -72 130
5113 130 157 94 -84 -48 306 185 -54 -268 -45 36 -97 -201 151 43 -101 51 -124 177 -429 -108 29
5134 29 144 -84 -191 68 217 139 -160 -28 390 -174 -22 238 371 -199 -24 144 191 -169 -78 402 -79
$$ packed form
4979I4l71J91M5m4j0J92J96j47j30l35O49k57j35pK10l40k3J63N77k62j55k19
5001a18K48k77p0K4N67l60k57LM67k34P2k95L36O7j60l39L12Lj49n4M09L5k49
5024a9o3L54j31j23J2N3J02m13j13M33O8m11J38K63m64k49M00L58J0n10K72K84
5046B51o7m32J63J91L5m46K70K59p8m40M24L1J24l54PK52j28k67J71J70k76k55
5068c95L54J60J2l18L7L16k79k3N8M26j40l74J51L84k99k68O2K37P2l96L5M64
5090B76j36k60M5K28q6k46J07N81m87l41L28rj30Q5j20K95O8m19P9L12q0j62K02
5113A30K7o3j78L6L54j21k39k14K23Q1j33j04L52j08j44J52j75L01o06L21J37
5134B9J15k28j07K59J49p8k99J32M18n64J52K60J33n70J75J68M7l60R1M80m81
$$ plain form
5155 -79 -129 92 69 84 51 -152 388 -68 -341 -124 95 -127 -357 -273 248 95 -134 59 158 -23 -120 191 203
5178 203 61 -84 -279 287 124 -156 -24 172 -173 -14 79 56 48 -232 25 87 120 -184 -87 -48 42 -48 -145 150
5202 150 71 -258 -98 118 206 -68 170 44 201 -77 -199 121 136 -115 -69 357 82 -106 -19 -110 51 -219
5224 -219 -71 85 119 -187 -67 173 -97 -175 -199 352 112 -192 41 238 144 -12 104 429 -65 -256 -254 228
5246 228 44 -186 -129 178 131 -381 21 265 88 -225 -259 261 158 -267 -205 114 48 -45 -145 -158 117 -272
5268 -272 45 129 44 -14 -127 257 146 53 -48 219 123 -117 -103 107 133 -198 -53 89 60 -114 -265 -47 55
5291 55 53 -97 28 54 -329 192 14 7 -250 -79 281 205 -263 -12 155 185 -147 -6 -99 -50 -138 -207 -38 26
5315 26 -216 198 -112 -61 -159 -28 219 -2 -166 -76 266 97 -113 42 110 40 -25 70 163 41 -145 16 358
$$ packed form
5155g9n0K21k3J5l3k03N40m56k73K17K19k22k30Q4N21j53k29J93R9j81r7L11J2
5178B03j42j45j95N66j63k80J32J96l45J59R3k3qk80K57O2L3l04R7L9R0r0r7K95
5202A50p9l29J60K16Q8k74K38j26J57k78j22L20J5k51M6M26k75j88Q7r1J61k70
5224b19J48J56L4l06J20K40k70p8k4N51k40l04K33J97r4j56J16L25m94j91KM82
5246B28j84k30N7L07m7n12M02K44j77l13l4N20j03m25O2L19o6r3j00j3K75l89
5268b72L17Q4q5n8j13L84j11r3j01K67r6k40J4K10K6l31J45J42k9j74j51K18J02
5291E5kj50J25K6l83N21j78pk57J71L60p6m68K51J67L0l32J41r3M9q8o9J69O4
5315B6k42M14l10N1r8J31K47k21j64R0L42j69k10J55O8p0o5R5R3j22j86J61L42
$$ plain form
5338 358 122 -197 151 261 220 101 17 208 -147 -93 -18 315 51 -242 -67 88 90 -40 146 218 22 -22 -34
5361 -34 52 41 -65 -99 169 -60 -158 -135 177 36 -129 17 261 56 -189 -151 202 192 271 -267 301 -36 -234
5384 -234 105 155 -111 -186 -222 45 127 -26 225 166 -65 -160 6 111 -205 6 79 226 -65 28 27 114 -35 -241
5408 -241 -272 -106 -1 -490 -68 97 1 -180 -6 308 -37 -237 -276 13 -40 -134 116 191 -183 3 -130 177
5430 177 -91 -61 40 257 -108 -183 -61 25 -216 -356 -9 316 77 -146 -111 -81 138 -97 -66 374 46 -86
5452 -86 -68 159 72 -115 -165 176 51 -201 55 186 103 -38 98 132 -280 -419 40 159 13 -145 50 42 57
5475 57 -287 -38 9 -100 -259 54 61 -133 -316 -86 31 162 -9 177 156 -56 120 -76 79 -62 61 155
5497 155 204 -32 -320 -145 -2 123 -28 -88 49 104 -143 144 156 -254 -103 32 55 174 -77 54 -22 -98
$$ packed form
5338C58k36l19L48J10m1j19q4J91l55N4P5L33k64k93J75J55Kj30J86P2j96m4j2
5361c4Q6j1j06l4K68k29r8K3L12j41j65J46K44k05k45L8L53j0P9n38N68l37j98
5384b34L39N0k66p5l6K67Q2j53K51n9k31r5J66J05l16K11P3J47k91R3jQ7j49k06
5408b41l1J66J05m89M22J65r6j81J74L14l45k00l9K89n3r4K50P5l74J86j33L07
5430A77k68L0J01K17l65p5J22Q6k41j40L47L25k39k23L5L0K19k35L1M40l28j32
5452h6J8K27q7j87n0L41j25k52K56J31q3j41J36L4m12j39M59J19j46j58J95qJ5
5475E7l44K49M7j09j59L13Pj94j83K30J17J31j71J86k1k12J76j96J55j41J23R4
5497A55M9k36k88J75J43J25j51o0J37N5k47K87J2m10J51J35K3J19k51J31p6p6
$$ plain form
5519 -98 -131 12 223 -57 -94 39 206 -195 -62 -14 386 29 -37 -6 45 51 54 -66 9 -93 -285 -19 196 53
5543 53 -101 120 161 75 -140 54 126 166 -47 107 118 -122 -284 -83 85 12 -157 -243 -16 47 -222 -59 -27
5566 -27 7 -230 93 73 334 -219 138 184 79 -75 -15 66 -17 8 121 189 -157 20 -6 169 -15 -137 29
5589 29 67 -195 -121 110 29 -83 -39 206 -9 -221 105 105 55 -194 -166 82 9 -78 180 -27 249 -132 19 151
5613 151 163 89 -7 112 109 -90 -227 -105 55 217 33 -90 226 11 -84 50 -55 -80 17 49 -126 54 -274
5636 -274 186 41 -42 -188 -20 163 -127 162 -34 255 -99 -88 75 218 -13 -59 270 2 14 -114 -81 333
5658 333 -257 -411 -97 77 -144 -85 166 -193 -65 -7 -50 92 -11 -145 161 97 -109 56 146 59 45 -240
5680 -240 137 59 85 89 -12 180 14 -216 44 244 -88 -309 141 188 -15 -49 87 157 -207 -176 60 253 123
$$ packed form
5519i8l3J43K11k80l7J33J67m01J33M8M00l57o6L1N1OLj20P5j02j92K66K15j43
5543E3j54K21M1q6k15J94P2M0k13J54J1k40j62K01J68p3j69q6K27O3k69J63L2
5566b7L4k37L23k0K61n53L57M6j05j54O0Q1q3K5J13O8l46J77k6J75j84j22J66
5589B9L8k62P4K31q1j12M4K45k15k12L26%n0k49K8K48p3q7K58k07K76l81J51J32
5613A51J2p4r6J19lj99j37J22J60J62j84j23L16k15r5J34j05k5R7L2j75J80l28
5636b74M60j45q3j46J68J83k90K89j96K89l54J1J63J43k31m6L29k68J2j28L3M14
5658C33n90j54L14J74k21N9K51l59J28N8m3J42j03j34L06o4k06J65R0q7j4k85
5680b40L77p8K6Mj01J92j66k30K60K00l32k21M50M7k03l4J36P0l64L1K36J93j30
$$ plain form
5703 123 -135 137 -55 -199 -50 109 16 -202 -117 129 97 -73 31 51 -86 61 -40 169 -293 -152 117
5724 117 2 -102 51 -32 112 23 143 7 291 -36 -149 278 259 117 94 -59 -80 111 93 -139 13 153
5746 153 46 40 178 280 42 28 -24 -59 -155 -269 193 74 -146 -39 165 -282 -117 -57 -12 225 -247 59 54
5769 54 -71 202 -75 41 -7 7 -75 326 -77 -266 15 -106 138 -33 -258 78 -27 -202 -192 37 -76 -175
5791 -175 -63 123 -280 55 68 -9 201 -47 -177 28 274 -66 -49 153 395 7 19 129 70 -305 -247 -87
5813 -87 85 61 35 352 26 -83 -183 -59 10 -24 33 138 334 -47 -146 327 356 -20 -274 21 23 -137 219
5836 219 -10 126 -67 -124 17 183 -144 -420 38 -56 71 4 210 -57 50 -218 105 209 -185 121 183
5857 183 253 -54 -336 42 149 31 23 141 177 -47 -24 375 -37 -84 -22 -66 211 -75 -1 94 -170 -68 -209
$$ packed form
5703A23k58K72j92j44J49J59r3k18Q5K46l2j70J04K0j37J47j01K09m62J41K69
5724A17j15j04J53q3J44q9J20j36K84l27j13M27j9j42k3j53k1J91j8k32J52J40
5746A53j07oJ38J02k38j4n2l5r6j14M62j19k20J07K04m47J65O0M5K37m72L06n
5769E4j25K73k77J16m8J4q2M01m03j89K81j21K44j71k25L36j05j75J0K29j13r9
5791a75J12J86m03L35J3p7K10k48j30K05K46l40J7K02K42l88J2J10n9l75N8J60
5813h7J72k4k6L17l26j09j00J24O9l4N7J05J96l81r9M73K9l76k54K95Kj60L56
5836B19k29J36j93n7J41J66l27k76M58r4J27o7K06k67J07k68L23J04l94L06O2
5857A83P0l07k82L78J07j18qJ18L6k24K3L99m12m7O2m4K77k86P4R5k64J02j41
$$ plain form
5880 -209 1 86 -13 83 188 42 45 19 137 -47 -20 1 266 -20 12 -80 -51 -89 -176 -76 147 151 209 -147 66
5905 66 257 -35 -114 132 118 -89 -96 108 89 -311 -134 128 31 -32 123 416 -109 -115 -55 206 130 -172 71 -81
5929 -81 11 -120 -72 -20 119 -261 -49 4 182 -154 25 73 108 -243 9 -80 185 -124 -45 273 99 -101 18
5952 18 -57 -158 -150 24 221 30 -242 92 179 -182 50 -127 203 -29 -128 -125 -71 83 -169 -221 -1 0 114 -6
5976 -6 -50 -35 -66 -131 213 -88 -245 -19 217 -52 -114 -296 54 259 -174 -51 137 -137 -140 -47 137 22 51 91
6000 91 2 211 -174 -93 -6 106 -197 -82 22 76 -99 -215 226 262 130 -71 130 238 -151 -56 -241 40
6022 40 -293 17 294 11 -240 -100 -26 126 -98 -7 117 137 -37 -33 24 -264 23 37 232 -33 -271 137 335
6045 335 -54 -197 -93 69 98 92 -162 110 -9 -154 167 244 -56 -399 102 39 88 -126 -151 -95 169 -102 79
$$ packed form
5880b09K10Q5r9R6J05j46Lk6J18j84K7K1K65k86L2r2K9l8q7J00K23MN8l56K13
5905F6J91k92p9K46j4k07pK04j9m00J77K62r7o3J55K93n25oO0K61p6l02K43j52
5929h1R2j31M8N2J39l80K12N3J78l36J79M8L5l51K52q9K65l09P9L18j74k00J19
5952A8p5j01QJ74J97j91k72L34Q7l61K32j77L30k32r9LN4J54k52n2K20JJ14j20
5976fm4J5l1o5L44l01j57K26K36k69o2j82L50K05m33J23J88k74lR3J84j15K9M0
6000I1q9K09l85Q1Q7J12l03J15J04N4j75j16M41L6j32k01K01J08l89R5j85K81
6022D0l33L10K77k83k51J40P4J52k24R1J24K0j74MN7k88K87J4J95k65k38M08J98
6045C35l89j43J04J62K9ok54K72j19j45L21P7l00l43N01o3M9k14k5N6K64k71J81
$$ plain form
6068 79 185 -136 -72 -44 186 295 68 62 -103 -161 -72 -236 -41 156 -199 117 322 0 -239 82 182 -139
6090 -139 -26 -104 250 30 -163 -31 21 93 -53 60 66 -125 -179 271 261 -157 -155 75 -172 -30 84 -191 -44
6113 -44 279 -76 -245 246 143 34 98 69 340 184 135 -38 270 6 -163 21 -109 -51 -21 -38 -28 -248 -56
6136 -56 84 195 -111 -248 159 -3 -219 30 127 -49 -29 218 96 -90 -119 98 112 178 -87 130 18 -176
6158 -176 -194 -249 217 -34 -126 27 -23 133 -45 -27 5 -179 110 -65 33 5 -87 119 245 -72 47 -325 -8
6181 -8 109 -296 140 115 128 27 203 119 -314 96 95 162 112 -224 99 127 5 -83 43 237 271 -37 91 112
6205 112 -100 106 -39 34 84 -107 207 83 47 -300 10 60 397 -20 -92 14 -364 -76 -103 282 -40 -160
6227 -160 -137 353 66 -50 145 251 79 22 33 62 -161 -71 176 -86 -210 -1 51 8 70 -212 -6 10 -36
$$ packed form
6068G9J06l21O4K8K30J09k27oj65n8Q9j64J95J97l55L16K05l22k39L21J00l21
6090a39J13p8L54k20j93J32N2P2j46J13Oj91n4M50j0m18KK30k47J42J14k75J47
6113d4L23l55j69M91j03j09O4k9K71j56m9j73L08k64j69J84j30N8L0j7J0k20J92
6136e6J40J11l06j37M07j62k16K49R7j76K0K47j22j86k9K17J4O6k65K17j12j94
6158a76j8n5M66k51r2J53n0J56j78J8L2j84K89j75R8k8r2K06J26l17J19l72L17
6181hJ17m05M36k5J3j01J76q4m33M10jO7n0l36L23K8j22q8J26J94L4l08J28K1
6205A12k12K06j45P3N0j91L14j24l6l47L10N0L37m17p2J06l78K88k7L85l22j20
6227a60K3M90k87j16J95J06j72n7J1K9k23R0K47k62j24K09N2m3O2k82K06J6m6
$$ plain form
6250 -36 -136 65 -31 -95 -102 120 -4 -171 54 115 69 101 -72 208 -77 96 33 -198 89 -24 -188 215 240
6273 240 -87 -83 -91 334 31 -189 -180 141 238 197 44 112 81 -74 83 203 100 -220 131 65 125 -83 -14 -82 -47
6298 -47 93 -22 293 -135 28 104 55 -109 -171 180 -17 164 -52 176 142 -13 -108 49 85 -58 9 176 385
6321 385 41 -70 45 -184 10 165 88 -8 51 -132 -147 -24 62 90 189 245 219 -65 -46 -10 -25 -63 176 36
6345 36 -102 96 115 -89 198 18 181 212 -341 115 -223 126 127 37 27 246 -148 -169 171 -18 -253 -111 141
6368 141 222 -57 -11 -14 -7 59 -261 0 -209 -166 -1 -85 -8 119 -109 72 -22 19 53 97 144 4 -218 -85 226
6393 226 -70 -59 -113 156 -61 -263 41 120 -163 -49 -150 -16 -116 -162 84 187 -31 -17 279 69 -82 107
6415 107 149 239 6 -92 218 177 187 -120 34 -19 175 -195 7 53 -89 -120 -114 102 -84 26 198 -328 -148
$$ packed form
6250c6j00K01r6o4pK22j24j67K25O1m6L2j73K80k85J73o3k31K87j13j64M03K5
6273B40l27MqM25l03k20RL21R7m1j53O8l1j55J57J20j03l20L51o6O0k08O9o8L5
6298d7J40j15L15m28J63P6m9j64o2L51j97J81k16K28l4j55r5J57L6j43O7J67K09
6321C85l44j11J15k29J94J55p7r6N9j83j5J23Q6K8R9N6k6k84J9L6j5l8K39j40
6345C6j38J98J9k04K87j80J63L1n53M56l38L49Jr0j0K19l94k1L40j89k35J42K52
6368A41Q1k79M6lPO6l20K61k09M3J65q4P7J27k28J81r4M1L4M4M7j40k22J33L11
6393B26k96J1n4K69k17k02L04P9k83J14j01J34j00m6K46J03k18J4K96k10j51J89
6415A07M2R0k33r8L10m1J0l07J54n3J94l70K02M6j42l1OK16j86J10J72n26J80
$$ plain form
6438 -148 -16 -134 120 -73 -90 152 138 -108 168 275 46 -86 247 192 129 -50 190 -146 189 -55 85
6459 85 60 -86 -114 -85 -55 72 -165 -78 153 -263 -48 -58 -10 -180 -161 -239 -54 38 55 -62 -5 99 19 -276 24
6484 24 -35 136 -67 43 313 -69 -32 38 -51 148 54 -38 -42 54 -99 -91 -246 -53 -30 -66 101 -113 240 79 245
6509 245 102 86 342 -209 -82 -12 86 129 64 -231 -179 424 58 -97 85 -100 -29 136 108 154 -145 -282 -47
6532 -47 107 32 -96 12 108 103 -99 138 159 196 -126 -168 -86 108 -58 214 164 -24 -144 50 87 -149 -103 166
6556 166 120 1 -217 -28 -114 109 -65 165 81 -308 131 114 98 -246 -47 22 244 -31 27 67 9 -129 166
6579 166 57 151 -61 -124 -123 -20 31 43 -31 36 -133 -62 92 25 -74 133 400 35 58 -198 -94 128 -1 -79
6603 -79 39 -230 -142 -181 -51 28 31 14 167 73 -80 -189 -155 -70 14 -142 133 138 84 89 136 1 -193 28 72 103
$$ packed form
6438a48J32j18K54j93j7K42j4k46K76J07k29j32L33n5o3j79K40l36L35k44J40
6459H5k5j46k8K9L0J27k37Q7K31m16K15j0M8j70J9p8J85R2J7j17N7J04q0k95L00
6484B4n9J71k03J10K70l82L7P0q9J99r4r2mR6j53Qj55J93K3l6J67k14L53j61J66
6509B45j43j6K56n51J27P0R8M3o5k95N2O03l66j55J82j85P1J65k8M6k99j37K35
6532d7J54p5j28J08R6nk02K37K1L7l22m2Q2J94j66K72n0j88j20J94L7k36M6K69
6556A66m6j19k18J89q6K23j74K30q4l89M39j7j6l44J99O9K22k75N8M0n8j38K95
6579A66j09R4k12o3JJ03N1J2p4O7j69P1J54o7r9K07K67l65K3k56J04K22j29p8
6603g9J18k69Q8l9J30P9Lj7J53r4j53j09L4Q5Q4j56K75Nn4NM7j35j94K21M4L1
$$ plain form
6629 103 -102 -10 -40 18 -80 72 -178 -126 -124 -50 235 8 93 132 189 189 21 -130 10 276 -52 -96 4 9 89 109
6655 109 104 -128 -64 4 200 107 21 46 158 -53 -202 -105 54 27 177 218 -214 -41 -43 -50 267 24 -148 -1 -64
6680 -64 -11 -54 -275 -18 -184 -197 -330 20 61 7 46 122 155 -47 -217 130 14 7 46 32 225 7 21 58 -49
6705 -49 15 -54 -185 28 -39 61 103 74 -87 -349 96 163 26 -69 21 3 -170 -213 18 -130 -50 242 34 128
6729 128 -79 183 96 -14 -255 69 -92 126 -30 -128 87 -39 39 41 240 0 55 142 140 88 62 -38 32 72
6753 72 77 17 100 -9 -95 -191 259 28 15 -41 -96 -35 50 -155 85 -63 -121 238 160 186 -212 50 -4 58 105 -74
6779 -74 144 -38 84 -122 56 50 -55 -203 10 38 42 285 -200 -113 323 -102 -9 107 -140 -9 14 162 3
6802 3 -140 272 128 -185 50 -141 109 -74 -21 0 122 -146 103 174 -4 -283 -36 -147 -112 -48 -39 31 142
$$ packed form
6629A03k05R2l0N8r8J52k50N2KP4K85k27Q5L9N7%j68j51J40K66l28m4J00NQ0K0
6655A09nk32O4O8J96r3q6K5J12k11j49R7J59k7J50M1m32J73kpL17k43j72J47o3
6680f4N3m3k21K57j66j3j33L50M1n4L9P6L3k02j70L47j16pL9j4J93k18J4L7j07
6705d9O4o9j31K13o7J00M2k9j61k62M45O7j37r5R0j8j73m3K31j48Q0K92k08R4
6729A28k07K62q7j10k41L24j61K18j56r8K15j26P8KJ99k40N5Q7kn2k6j00P0M0
6753G2No0Q3j09q6r6M50k31j3n6n5O1Q5k05K40j48n8L59p8K6l98K62n4O2M7j79
6779g4K18j82J22k06J78oj05j48K13K8MK43m85Q7M36m25R3J16k47J31K3J48j59
6802Cj43M12j44l13K35j91K50j83N3K1J22k68K49P1j78k79K47j11L5O4RP0J11
$$ plain form
6825 142 -186 54 -88 39 -105 -2 -10 -30 -181 -65 -50 151 7 11 -51 -198 -349 -19 304 -178 -71 -58 -152
6848 -152 -100 -48 -30 -146 19 -147 11 93 -62 -124 23 42 -48 -284 102 -93 180 -183 -34 82 247 91
6870 91 -246 213 -96 -170 -278 -88 72 -21 -14 -26 113 -30 283 -166 -77 52 41 -46 31 -36 -146 5 -110 -86
6894 -86 -206 -137 107 81 248 35 138 155 16 2 -13 -23 252 -146 -234 -73 -52 -140 -90 -152 -224 -91 -48 -21 158
6919 158 -73 158 -45 162 -131 31 78 -10 -227 -4 -157 -9 208 -215 -36 226 243 -156 -105 -34 58 -71
6941 -71 -73 5 -101 -52 -163 -65 -110 212 -250 113 109 56 -24 63 43 -73 -58 95 33 18 -30 -9 77 -191 -121 -143 -28
6968 -28 270 -84 -6 -274 -77 -57 28 188 1 -12 55 149 -81 -146 113 -245 -103 120 -82 254 -87 170 96
6991 96 -143 -95 -171 157 -88 -115 -14 96 121 19 -144 16 -65 3 -341 -10 62 -51 -69 -25 23 -55 182 -178
$$ packed form
6825A42l28K40j42J27j44J03qk0j51J16J5K01j44Mo2j47j51L30L23m82J07J3r4
6848a52N2N2J8j16J65j66J58Q2j55o2J47J9r0k36L86j95K73l63J49J16J65j56
6870I1l37M59l09p4j08J90J60r3Pj2J39j43L13m49Q9J29j1q7P7o7j10J51j15K4
6894h6j20O9K44k6J67k13J03J7j39j4j5j0K75l98q8J61K1q8N0o2p2J33M3K7J79
6919A58k31K31k03K07k93J62M7q8k17K23j53J48K17m23J79K62J7l99N1P1R2j29
6941g1kP8j06M9j11R8m5L22m62L63mn3q0Q7k0j16J5J53o2j5m8K1Q6k68P0k2J15
6968b8K98l54P8k68J97K0Q5J60j87j3O7R4k30o5K59l58J42K23k02L36l41K57p4
6991I6k39M8p6L28k45k7J01J10K5j02j63J60q1O8l44L31P2j13j8M4M8p8K37l60
$$ plain form
7015 -178 168 -128 -121 245 52 -12 -87 -116 -35 -287 -20 -66 -25 47 93 16 89 -48 -367 -117 201 84 -195 206
7039 206 113 111 -73 -156 -90 -54 83 -54 386 -92 250 36 74 56 98 -49 371 163 246 101 -126 84 163 -111
7063 -111 14 -28 -24 -175 157 114 -182 29 -76 92 114 -21 -60 77 -116 60 -147 -197 59 -12 -48 294 -123
7086 -123 122 7 -4 -179 61 178 44 -65 -152 98 -184 -67 42 -22 187 67 -3 129 45 -82 116 -13
7108 -13 -150 58 -76 116 70 12 -43 -26 170 -191 91 265 337 -145 -155 151 133 41 315 101 -311 47 218
7131 218 -50 -100 43 -27 347 35 -1 206 31 -125 114 -86 -110 18 -164 45 28 187 -281 161 -172 -127
7153 -127 -185 -29 149 -214 -69 279 95 -9 57 -49 278 -136 -80 116 37 -106 -24 36 39 145 185 187 63 -144
7177 -144 -108 -131 229 -86 -194 45 -27 -53 27 178 165 -106 22 143 -137 -8 -101 174 146 75 -264 -9 154
$$ packed form
7015a78L46k96PL66j93o4p5k9Q1k52K67m6M1P2M6p7P3j37l19K50L18j17k79M01
7039B06r3kj84q3O6L6J37j37M40m78L42k14L8j8M2j47M20k08Q3j45k27K10P9k74
7063a11J25m2Mj51L32m3k96K11j05J68K2j35l9J37j93J76k07n0K56p1l6L42m17
7086a23K45j15j1j75K40J17j34j09q7K50k82J17J09o4K09j20p0J32q4j27J98j29
7108a3j37K08j34J92m6n8n5J7J96l61K82J74P2m82j0L06j8r2K74k14m12L58J71
7131B18k68n0J43p0L74l12l6K07j75j56K39k00k4J28j82K09j7J59m68M42l33M5
7153a27n8J56J78l63J45L48j84j04O6j06L27m14N6J96p9j43Q2O0LJ06M0Kj24k07
7177a44L6k3L60l15j08K39p2k6Q0J51j3k71J28J21k80J29r3K75k8p1l39K55J63
$$ plain form
7200 154 -80 -238 -79 -43 -90 -113 29 64 -79 178 6 87 -170 167 188 -292 -102 40 -21 -19 116 64 44 150
7224 150 -71 -202 10 8 -203 -164 -234 169 236 116 60 11 240 80 10 97 -293 -6 57 5 113 57 347 -155
7248 -155 10 -13 37 54 -71 -180 143 -73 -264 -122 -104 264 -164 -359 -58 204 -165 8 49 -11 176 -12
7270 -12 201 91 109 -56 -51 162 128 -17 0 194 -269 -63 -30 -155 96 33 81 263 -26 -59 -85 -22 100 54
7294 54 -11 -128 -70 171 14 -26 168 94 42 -71 279 -80 252 207 154 72 186 26 -168 45 159 -67 -53
7317 -53 -110 -62 -103 109 -41 -177 45 -139 -141 266 15 -78 54 131 55 -232 98 -243 37 -261 104 -137 -84
7340 -84 30 -29 -88 39 107 119 72 166 -102 -113 315 55 -110 118 27 -47 5 -29 6 -178 -178 124 118 112 55 -22 -29 -71
7368 -71 106 -154 -102 -86 74 27 65 -42 71 31 -65 193 -121 -287 60 22 -27 26 73 140 -168 14 232 -73
$$ packed form
7200A54k34j58J59L6m7k3J42L5j43K57j72Q1k57L37K1m80J90J42o1KJ35n2k0J06
7224A50k21j31K12kk11L9p0M03O7j20n6m9K29j60p0Q7l90K87O3n2J08n6K90n02
7248a55J65k3N0J7j25j09L23k16j91J42J8L68m28j95L01K62l69J73M1o0J87j88
7270a2K13j10J8j65NK13l4j45J7J94m63K06L3j25K51o3M8J82k89l3k6O3J22m6
7294E4o5j17N8K41j57m0J94p4n2j13L50l59L32m5n3q2J14j60j94K13J14k26J4
7317e3n7M8m1K12j50j36K22j84kM07k51r3J32P7p6k87L30l41K80k98L65k41N3
7340h4J14n9n9J27O8J2m7R4k68j1M28k60j65K28r1p4N2l4L5j84%L02oon7p7pm2
7368g1J77k60N2J6J60m7L8j07J13m0r6K58l14j66L47l8m9N3M7O7l08J82K18l05
$$ plain form
7392 -73 -130 -76 -32 216 36 -268 28 173 -212 -56 92 75 134 -170 140 112 25 66 -36 40 298 182 370
7415 370 1 -226 140 85 158 -109 54 -51 -49 68 31 66 -11 -238 -32 12 13 -85 -123 13 235 72 76 -131 60
7440 60 69 -128 26 -83 -116 37 314 328 -73 45 40 207 -219 -93 -101 86 120 -5 -16 363 -103 -25 102 -143
7464 -143 -137 -45 -134 -217 57 -191 89 -246 85 -158 -13 183 -110 -200 388 248 -192 15 44 201 -40 110
7486 110 140 72 -13 -41 435 38 2 -383 -168 27 -196 -98 86 -28 -39 25 -124 138 -82 -94 -90 -125 -84 -138 290
7511 290 50 -32 89 -148 47 -29 1 244 207 288 -44 278 -187 -261 -115 -97 -29 -155 112 36 240 -237 -131
7534 -131 36 17 -60 83 -40 71 -19 191 -156 -93 7 -133 377 108 -78 -126 263 203 -40 -94 32 -83
7556 -83 -120 24 65 4 60 -62 179 -114 -269 -132 125 271 -6 42 57 155 -63 -202 -88 65 -204 208 -112
$$ packed form
7392g3n7N4M4K48j80l04K96J45l85J56J48j7N9l04L10k8q7M1j02P6K58j16J88
7415C70l69k27L66n5P3k67J63j05KJ17l7L5p7k27K06M4Jr8l8J36K22j63Mk07J91
7440F0Rj97J54j09l3J53K77J4m01J18nJ67m26J26qJ87L4j25j1L79m66P8J27k45
7464a43OR2q9q3K74k48K80l35L31k43J45J96k93r0N88j40m40K07K9J57k41J50
7486A10L0o8q5k8M76l97l6l85K15J95k23R8J84j14j1O4j49K62k20j2Ml5M1n4M28
7511B90k40q2J21k37J95p6L0K43l7Q1l32L22m65p4J46J8O8j26K67p6K04m77J06
7534a31J67j9p7J43j23J11r0K10l47O3J00j40N10k69j86m8L89o0k43n4J26j15
7556h3l7J44M1o1N6j22K41k93j55J37K57J46k77M8J5R8k18j39J14J53k69M12l20
$$ plain form
7579 -112 19 140 -149 25 28 -40 33 110 102 28 -134 127 -4 32 -218 -76 -30 37 -23 124 15 -35 -190 78
7603 78 -48 -67 -18 -64 68 -13 -158 -55 -94 -19 -120 -138 50 -176 94 -118 -39 -16 139 120 -93 34 -52 -25
7627 -25 -145 -25 4 241 34 -53 -40 176 86 -174 33 -3 -117 197 43 214 -146 270 -61 249 -36 31
7649 31 -229 -44 81 -7 6 13 -187 -233 0 72 -77 69 -59 193 -42 8 180 2 8 -312 -224 106 67 145
7673 145 -65 -76 97 -104 91 -69 -96 -144 31 88 37 -331 51 -192 -108 86 -261 63 -161 -27 203 99
7695 99 -93 54 77 101 21 -88 -147 45 -57 -111 -111 7 141 -78 -143 -89 165 -216 -51 76 -209 -226 98 44
7719 44 -139 44 19 25 221 127 358 105 3 23 189 156 -15 -53 -74 -46 -35 -17 -221 266 24 -157 -140 -97 32
7744 32 202 -54 87 -83 -45 21 70 53 49 -102 -199 -49 115 -77 244 209 -4 94 -91 -83 54 -101 209 -95
$$ packed form
7579a12J31J21k89J74Lo8P3P7qp4j62K61j31L6k50J42M6O7o0J47j09n0j55K68
7603G8j26j9M9m6J32q1j45J03l9P5j01j8J88k26K70k12P9K3J55j9k13J27q6K7
7627b5j20J20K9K37k07q7J3K16r0k60K07l6j14L14j54J71l60M16l31L10k85O7
7649C1k60J85J25q8J3Pk00m6K33P2j49J46j28K52k35N0J72j78Ol20Q8L30l9P8
7673A45k10j1J73k01J95j60k7m8J75N7n1l68L82k43Q4J94l47L24k24J34K30j04
7695I9j92J47K3K4q0j09n9J92j02n4%J18J34k19o5N4K54l81J65J27k85j7L24n4
7719D4j83J83k5OJ96r4K31k53j02K0J66l3j71l8k1K8J1J8k04M87k42j81J7M3J29
7744C2J70k56J41j70L8O6M9j7mj51r7J50J64j92L21l5k13R8j85QJ37j55L10l04
$$ plain form
7768 -95 -39 22 24 155 48 112 35 74 -19 17 71 -23 -112 -185 137 -95 52 -156 -57 120 -257 11 82 -28 -225
7793 -225 54 227 -35 93 59 -96 162 10 -154 -161 -91 12 127 -79 112 -210 -6 227 206 67 -16 -207
7815 -207 38 27 9 104 -14 -113 -183 200 253 -27 -38 54 185 -97 121 219 46 -128 52 130 126 68 -224 3
7839 3 214 -44 -27 -33 -112 -144 -32 92 -50 -23 -81 136 88 -103 144 -26 136 -24 86 94 -38 -139 -200 -127 174
7864 174 130 -23 8 176 -339 60 -41 228 49 -268 25 2 -63 103 104 -64 -77 193 -87 -253 18 63 64
7887 64 -37 -106 41 322 -42 -175 -68 105 -155 101 81 146 -33 83 -170 138 32 -65 -144 171 -84 -108
7909 -108 -173 112 -75 -1 40 32 42 -99 120 161 -28 174 152 103 28 -136 -50 145 229 -10 -63 1 39 -8 -50 199
7935 199 -67 0 73 173 108 -126 49 -86 -198 -112 170 107 323 28 -75 -99 -72 -206 68 -113 14 42 -203
$$ packed form
7768i5N6O1KJ31j07O4p7L9r3L6N4r4q9p3L22k32J47k08R9J77l77K68P1j10j97
7793b25K79J73k62J28l4j55K58j52j64pP0J03J15k06J91l22K04K33k1j39q3j91
7815b07K45j1j8R5j18r9p0L83N3k80j1R2J31k82K18R8j73j74J80P8mn8k92K27
7839CK11k58J7op9l2J12J24j42K7n8K17m8j91K47j70J62j60J10Qj32j01o1P3L01
7864A74m4j53L1J68n15L99j01K69j79l17K93k3o5J66Jj68j3K70k80j66K71M5J
7887F4j01o9J47K81l64j33J07J73k60K56k0O5j79J16k53L08j06r7p9L15k55k4
7909a08o5K85j87P4M1qJ0j41K19M1j89K02k2m9p5j64Q6J95Q4k39n3O4L8m7m2K49
7935A99k66O7P3J00o5k34J75j35j12Q6K82o3K16k95j03k4K7j34K74j81J27K8k45
$$ plain form
7958 -203 -2 -184 241 -55 63 83 -56 162 45 -66 -13 -216 10 53 31 -244 63 -228 -7 -162 148
7979 148 99 -249 61 155 168 -78 -111 -122 87 53 -92 -207 76 -171 14 273 -48 63 -221 -54 21 241
8001 241 9 9 18 -177 259 -29 96 -50 44 246 -45 -39 107 173 48 20 -196 49 -262 -138 0 -155 86
8024 86 -6 80 130 -123 -130 -18 175 -42 12 21 304 57 -290 33 157 -336 -55 114 4 3 -229 -198 100 69
8048 69 -218 8 49 -58 -317 -31 249 106 15 122 -12 -99 -250 240 77 -56 -164 141 -25 186 -40
8069 -40 24 165 -36 142 -37 -43 -257 -162 -33 128 22 -190 -259 29 -65 34 -81 -20 -182 16 -9 45 -175 -184
8093 -184 85 -20 -106 -79 -93 262 152 -362 1 1 -155 -217 121 206 53 -201 35 -41 29 13 55 -27 -96 163
8117 163 -15 9 -156 -199 211 152 -26 -177 240 33 155 262 44 168 89 -51 30 165 -102 147 84 185
$$ packed form
7958b03K01j82M25k96J18K0j39K18j17j11N3k03K26M3k2k75L07k91K21j55L10
7979A48m9l48L10R4J3k46l3j1K09l4j45j15K83k47J85K59l21J11k84J67P5K20
8001B41k32%Rj95M36k88J25j46R4K02k91OJ46O6j25k8k16K45l11J24J38j55K41
8024H6r2Q6N0k53pJ12J93k17N4RK83k47l47L23J24m93K81J69j10jk32L1K98l1
8048F9k87K26M1j07k59K86K80j43r1J07j34q7j51M90j63j33j08L05j66K11k26
8069d0O4J41k01J78j79ok14R5J29J61j06k12o9K88r4R9j15O1j62J98k5N4k20r
8093a84K69j05q6K7j4L55j10n14L63%j56o2L38Q5j53k54K36p6P0j6M2q2o9K59
8117A63j78K4j65m3M10n9j78j51M17k07J22J07k18J24p9j40Q1J35k67K49o3J01
$$ plain form
8139 185 -56 -170 113 287 -144 -65 110 99 -138 212 -44 45 -56 179 24 119 -89 29 -21 363 199 42
8161 42 224 191 -71 -89 136 120 68 26 6 -22 -190 -57 271 183 174 -15 139 178 -30 18 -45 151 19 -142 -70
8186 -70 59 -125 -125 -25 74
$$ packed form
8139A85k41j14K83J74m31P9J75j1k37L50k56Q9j01K35j55R5k08J18n0L84j64j57
8161D2J82l3k62j8K25j6n2m2k0k8j68J33L28q8rj89J54L9k08M8o3J96j32j61P2
8186g0J29j84%J00R9
8191G4
$$ Imaginary data points
##PAGE= N=2
##DATA TABLE= (X++(I..I)), XYDATA
$$ plain form
0 0 0 0 0 0 0 0 0 0 0 0 0 0 0 0 0 0 0 -6 8 -8 8 -8 8 -14 16 -16 16 -24 24 -30 32 -38 42 -48 55 -62 69 -78 86
39 86 -94 108 -117 132 -144 160 -176 194 -215 236 -261 287 -316 348 -386 425 -473 526 -586 658
59 658 -743 845 -973 1138 -1358 1663 -2126 2903 -4445 8715 -46574 -168391 -135753 -88234
73 -88234 -55690 -1178 86936 123996 98556 59426 42306 7570 -58722 -110613 -94312 -49787
85 -49787 -28573 -1636 64145 104679 81996 47910 34639 -4490 -76843 -116104 -90304 -50668
97 -50668 -21964 22513 83076 110790 82237 35321 5126 -33008 -90355 -115521 -72534 -13294
109 -13294 14601 46813 99064 109760 59869 9901 -18567 -56128 -99655 -104253 -53640 7849
121 7849 43282 66900 92407 86259 26479 -34338 -51260 -59488 -81701 -71934 -17691 27937 41179
$$ packed form
0@%%%%%%%%%%%%%%%%%oJ4j6J6j6J6k2L0l2L2m0M8n4O2p0Q0r0J03j17J31j47J64
39H6j80K02k25K49k76L04l36L70m09M51m97N48o03O64p34Q11q98R99j112J244
59F58j401J588j818K111k496L021l789N029p348J3160n5289j21817L2638M7519
73h8234L2544N4512Q8114L7060k5440l9130j7120l4736o6292n1891J6301M4525
85d9787K1214K6937O5781M0534k2683l4086j3271l9129p2353l9261K5800L9636
97e0668K8704M4477O0563K7714k8553m6916l0195l8134n7347k5166M2987N9240
109a3294K7895L2212N2251J0696m9891m9968k8468l7561m3527m598N0613O1489
121G849L5433K3618K5507o148n9780o0817j6922q228k2213R767N4243M5628J3242
$$ plain form
134 41179 55261 78470 70471 20565 -28708 -50620 -63497 -77198 -62450 -4576 51001 65960
146 65960 65665 70844 48724 -11109 -58779 -63892 -59990 -62349 -37415 16796 55780 61438 55680 51296
160 51296 28357 -22811 -65387 -69135 -56329 -48208 -21509 36316 77495 72000 53027 39082 4565
173 4565 -48191 -76054 -63530 -37506 -17641 10734 50687 70882 53087 24460 9996 -9219
185 -9219 -47261 -68474 -51437 -27712 -14988 10510 52518 71590 51701 22154 518 -27777
197 -27777 -60608 -69736 -43449 -7122 14847 33913 59871 66375 36681 2289 -14413 -32153
209 -32153 -58862 -62172 -31289 1372 20892 40976 61470 58443 24580 -14069 -35535 -48921
221 -48921 -61425 -53519 -14378 25380 39677 44494 52825 40405 2048 -28204 -35548 -38633 -43493
$$ packed form
134D1179J4082K3209p999m9906m9273k1912j2877j3701J4748N7874N5577J4959
146F5960k95N179k2120n9833m7670n113L902k359K4934N4211L8984N658n758m384
160E1296k2939n1168m2576l748J2806Q121K6699N7825M1179n495j8973j3945l4517
173D565n2756k7863J2524K6024J9865K8375L9953K0195j7795k8627j4464j9215
185i219l8042k1213J7037K3725J2724K5498M2008J9072j9889k9547k1636k8295
197b7777l2831r128K6287L6327K1969J9066K5958O504k9694l4392j6702j7740
209c2153k6709l310L0883L2661J9520K0084K0494l027l3863l8649k1466j3386
221d8921j2504P906L9141L9758J4297M817Q331j2420l8357l0252p344l085m860
$$ plain form
234 -43493 -31985 388 28944 38464 41244 45426 34542 -508 -34820 -44618 -44675 -45873 -28135 12635
248 12635 43853 47749 41343 34396 11696 -24777 -47770 -46535 -36045 -26138 -7993 23682 47135
261 47135 45506 34455 26642 7323 -27457 -50914 -45633 -30713 -18549 5927 39423 55354 44463
274 44463 24232 6286 -15520 -41837 -52518 -37514 -15306 -1179 14061 36878 46075 30154
286 30154 10746 -304 -17802 -40629 -46920 -30383 -8947 6428 25346 45495 48647 29374
298 29374 3688 -13708 -27887 -44013 -43780 -19633 5558 18277 29868 42862 38934 14422 -9220
311 -9220 -22377 -34625 -45148 -38579 -14547 11820 27712 37198 43868 34021 4787 -23195 -34574
324 -34574 -36563 -36124 -20855 8794 28815 31856 31310 29036 15965 -5907 -22611 -27217 -28156 -29027
$$ packed form
234d3493J1508L2373K8556R520K780M182j0884l5050l4312r798n7j198J7738M0770
248A2635L1218L896o406o947k2700l6473k2993J235J0490R907J8145L1675K3453
261D7135j629j1051p813j9319l4780k3457N281J4920J2164K4476L3496J5931j0891
274D4463k0231j7946k1806k6317j0681J5004K2208J4127J5240K2817R197j5921
286C0154j9408j1050j7498k2827o291J6537K1436J5375J8918K0149L152j9273
298B9374k5686j7396j4179j6126K33K4147K5191J2719J1591J2994l928k4512k3642
311i220j3157j2248j0523O569K4032K6367J5892R486O670r847k9234k7982j1379
324c4574j989M39J5269K9649K0021L041n46k274j3071k1872j6704m606r39q71
$$ plain form
338 -29027 -18468 4707 25243 31620 30914 29218 13271 -15500 -35573 -37248 -32864 -24711 -4846
351 -4846 22085 37599 36158 28275 17102 -1411 -23790 -36513 -31932 -20499 -10784 5630 27330
364 27330 37626 31323 20578 9662 -9391 -31978 -39457 -31252 -17529 -2243 15932 32307 35612
377 35612 22955 6657 -5809 -18104 -30813 -31461 -18056 -3991 4004 16509 30058 30787 20520
390 20520 8616 -3383 -18905 -33036 -33540 -19703 -1711 14059 27792 36655 30927 10665 -8523
403 -8523 -19962 -29499 -34787 -25179 -6041 9488 18836 27106 30118 20332 3028 -12232 -21424 -27461
417 -27461 -28330 -18224 2354 18378 25583 29247 27872 13924 -6806 -19949 -23738 -25218 -21749 -7297
431 -7297 9562 19266 21813 21517 17502 5485 -10503 -20624 -23536 -24423 -21003 -6979 12887 24789
$$ packed form
338b9027J0559K3175K0536O377p06j696j5947k8771k0073j675M384Q153J9865
351d846K6931J5514j441p883j1173j8513k2379j2723M581J1433R715J6414K1700
364B7330J0296o303j0745j0916j9053k2587p479Q205J3723J5286J8175J6375L305
377C5612j2657j6298j2466j2295j2709o48J3405J4065P995J2505J3549P29j0267
390B0520j1904j1999j5522j4131n04J3837J7992J5770J3733Q863n728k0262j9188
403h523j1439r537n288R608J9138J5529R348Q270L012r786j7304j5260r192o037
417b7461q69J0106K0578J6024P205L664j375j3948k0730j3143l789j480L469J4452
431g297J6859R704K547k96m015j2017j5988j0121k912q87L420J4024J9866J1902
$$ plain form
445 24789 27486 26757 18137 -1163 -21039 -29215 -26727 -19537 -7199 10572 25453 28819 22550 13948
459 13948 4601 -9818 -23291 -25752 -19906 -13765 -5448 10803 24684 25920 18347 10145 -1863 -17498
473 -17498 -27921 -25965 -15505 -5042 5294 18242 26846 23030 12008 3464 -4816 -16892 -24529
486 -24529 -19496 -9674 -2298 7307 19988 27023 21884 10539 -714 -12589 -25421 -30819 -22064 -5785
500 -5785 7215 16625 26078 27103 13349 -3123 -12170 -17985 -23825 -21832 -8643 4746 11668 16802
514 16802 22972 21731 10589 -3452 -12323 -17425 -23302 -21401 -6710 9730 16928 19343 21832 16095
528 16095 -66 -13785 -17605 -18681 -19708 -14317 -398 12266 15983 16899 18917 14445 -443 -14374
542 -14374 -18914 -18810 -19268 -11540 6818 21231 23514 20855 17241 6234 -11566 -23416 -22371 -16255
$$ packed form
445B4789K697p29q620j9300j9876q176K488P190J2338J7771J4881L366o269q602
459A3948r347j4419j3473k461N846O141Q317J6251J3881J236p573q202j2008j5635
473a7498j0423J956J0460J0463J0336J2948Q604l816j1022q544q280j2076p637
486b4529N033R822P376R605J2681P035n139j1345j1253j1875j2832n398Q755J6279
500e785J3000R410R453J025j3754j6472r047n815n840J993J3189J3389O922N134
514A6802O170j241j1142j4041q871n102n877J901J4691J6440P198K415K489n737
528A6095j6161j3719l820j076j027N391J3919J2664L717R16K018m472j4888j3931
542a4374m540J04m58P728J8358J4413K283k659l614j1007j7800j1850J045O116
$$ plain form
556 -16255 -10557 -1440 13242 21977 18086 10606 7096 -547 -14269 -21749 -17858 -11457 -8275 86
570 86 15420 23395 19049 11417 5530 -3797 -17122 -23420 -15648 -5522 -331 6928 18522 22635 13888
585 13888 4120 140 -6938 -19499 -23352 -15073 -5299 1090 9782 21473 23887 12426 -851 -8471
599 -8471 -15032 -23145 -21928 -7118 6534 11162 14988 21333 18070 4318 -6974 -9506 -12252 -17344
613 -17344 -14827 -2651 7102 10093 12448 18651 16606 1800 -10667 -13837 -16482 -20536 -14781 1611
627 1611 13809 14869 14003 15483 8830 -5698 -15296 -14062 -11477 -12899 -7442 6540 15995 14731 13158
642 13158 15144 8763 -7312 -17924 -16863 -14287 -13223 -3410 12949 21788 16735 10046 6210 -2706
656 -2706 -16169 -21577 -14392 -6529 -4606 1547 14492 18966 11837 5969 4552 -2058 -14516 -19067
$$ packed form
556a6255N698R117J4682Q735l891p480l510p643j3722p480L891O401L182Q361
570H6J5334P975m346p632n887r327j3325o298P772J0126N191P259J1594M113q747
585A3888r768l980p078j2561l853Q279R774O389Q692J1691K414j1461j3277p620
599h471o561q113J217J4810J3652M628L826O345l263j3752j1292k532k746n092
613a7344K517J2176R753K991K355O203k045j4806j2467l170k645m054N755J6392
627A611J2198J060q66J480o653j4528r598J234K585j422N457J3982R455j264j573
642A3158J986o381j6075j0612J061K576J064R813J6359Q839n053o689l836q916
656b706j3463n408P185P863J923O153J2945M474p129n868j417o610j2458m551
$$ plain form
670 -19067 -11035 -4174 -1381 5938 17619 21047 11414 1913 -774 -7168 -18078 -19551 -8773 -40
684 -40 1764 6971 16734 17044 6624 -1923 -3995 -9382 -18598 -19152 -7070 3214 6928 12616 21006
699 21006 19141 4303 -8196 -10429 -13080 -18128 -12556 2595 12069 11326 10761 13737 9556 -2986
713 -2986 -10486 -9236 -9069 -14040 -11552 1203 9839 9114 10056 14894 9870 -4685 -13694 -12131 -10988
728 -10988 -12711 -6191 8381 16116 12912 10158 11329 5285 -8566 -15822 -11697 -8521 -9185 -3151 10654
743 10654 17506 11912 7942 6963 -513 -14093 -19819 -13330 -6670 -4312 2845 15071 18468 9565 1890
758 1890 823 -3853 -13795 -14767 -5664 107 -638 3360 13127 15850 7933 2334 1773 -4053 -14967 -17535
774 -17535 -8599 -140 2035 7260 16505 15920 4320 -4522 -5684 -8839 -16084 -14406 -2689 5156 5544
$$ packed form
670a9067Q032O861K793P319J1681L428r633r501k687o394j0910j473J0778Q733
684d0J804N207R763L10j0420q547k072n387r216n54J2082J0284L714N688Q390
699B1006j865j4838j2499k233k651n048N572J5151R474p43n65K976m181j2542
713b986p500J250J67m971K488J2755Q636p25R42M838n024j4555r009J563J143
728a0988j723O520J4572P735l204k754J171o044j3851p256M125L176o64O034J3805
743A0654O852n594l970r79p476j3580n726O489O660K358P157J2226L397q903p675
758A890j067m676r942r72R103N771p45L998R767K723p917n599n61n826j0914k568
774a7535Q936Q459K175N225R245n85j1600q842j162l155p245J678J1717P845L88
$$ plain form
789 5544 8474 15120 13663 2402 -6152 -6557 -8683 -14543 -11858 886 9695 9420 10424 14463 9623
804 9623 -3929 -11636 -10288 -9422 -10998 -6931 4673 10390 7543 6042 8889 5989 -4559 -10558 -7719
819 -7719 -7011 -10617 -6316 5674 12982 10817 9181 10267 4346 -8543 -14735 -10683 -6627 -5668 190
834 190 10962 15048 8644 4107 3567 -913 -10913 -14826 -9058 -4804 -4330 1142 11513 14795 8496
849 8496 2349 1035 -3755 -13215 -14809 -6211 508 2053 5981 13097 13593 4496 -1356 -1375 -4328 -11224
865 -11224 -11442 -3856 1438 1278 4378 11535 12065 3807 -2806 -4170 -7405 -14043 -13254 -2721 4941 6037
881 6037 8228 12957 10374 -232 -7142 -6700 -7134 -10220 -7411 2370 8305 7492 7695 10618 7654 -2225
897 -2225 -8920 -8215 -8277 -10237 -6193 4633 10368 8130 6355 6831 2520 -6715 -11278 -7537 -4773 -5659
$$ packed form
789E544K930O646j457j1261q554m05k126n860K685J2744Q809k75J004M039m840
804I623j3552p707J348Q66j576M067J1604N717k847j501K847k900j0548n999K839
819g719P08l606M301J1990P308k165j636J086n921j2889o192M052M056R59N858
834A90J0772M086o404m537n40m480j0000l913N768M254M74N472J0371L282o299
849H496o147j314m790r460j594Q598O719J545L928P116M96r097n852j9k953o896
865a1224k18P586N294j60L100P157N30q258o613j364l235o638P89J0533P662J096
881F037K191M729k583j0606o910M42m34l086K809R781N935q13K03K923k964r879
897b225o695P05o2j960M044J0826N735k238j775M76m311r235m563L741K764q86
$$ plain form
913 -5659 -2483 5705 9943 6729 4974 7217 3920 -5560 -10099 -7445 -5628 -5409 -559 9410 13475
928 13475 8509 4312 2597 -2425 -10982 -13260 -6922 -2079 -1066 2830 9761 10941 4800 242 -141
943 -141 -3276 -9597 -10555 -4606 -196 928 4641 11393 11971 4882 -722 -2381 -5467 -10904 -9588 -1777
959 -1777 3741 3719 5250 9156 7407 333 -3937 -3514 -4755 -9160 -8455 -1940 2624 3323 5986 10324
975 10324 8827 478 -5249 -5963 -7310 -9476 -5781 3072 8120 7460 6973 7927 4275 -3718 -7700 -6392
991 -6392 -5618 -6779 -3627 3977 7708 5996 4896 5536 1794 -5724 -8838 -6889 -5576 -4912 -673 6569
1007 6569 9194 6331 3916 3495 295 -5951 -7744 -4452 -2374 -2759 38 6164 8240 5790 3996
1022 3996 3407 -778 -7744 -10345 -7036 -3550 -1488 3206 9483 10006 4421 120 -1962 -5448 -9421
$$ packed form
913e659L176Q188M238l214j755K243l297r480m539K654J817K19M850R969M065
928A3475m966m197j715n022q557k278O338M843J013L896O931J180o141m558l83
943a41l135o321r58N949M410J124L713O752N78p089n604j659l086n437J316P811
959a777N518k2J531L906j749p074m270M23j241m405P05O515M564O99K663M338
975A0324j497q349n727p14j347k166L695Q853N048o60m87R54l652p993l982J308
991f392P74j161L152P604L731j712j100O40l742p518l114J949J313O64M239P242
1007F569K625k863k415m21l200o246j793L292K078l85K797O126K076k450j794
1022C996n89m185o966k601L309L486K062M694O277N23n585m301k082l486l973
$$ plain form
1037 -9421 -8040 -2356 1368 2243 4521 8175 7418 2542 -535 -1429 -3887 -7562 -6696 -1833 2150 2663
1053 2663 5395 8268 6113 505 -3254 -3897 -5709 -7835 -5604 -113 3106 3503 4714 6549 4647
1068 4647 -322 -3600 -3670 -5055 -7175 -4814 1298 5417 6076 7411 7994 3671 -2955 -6918 -6833 -5961 -4990
1085 -4990 -439 4957 6898 4766 3351 2901 -443 -5283 -6321 -4449 -4124 -3994 -642 4712 6102 5050
1101 5050 4176 3586 -591 -5565 -6574 -4684 -2950 -1235 2230 6567 6689 4186 2595 1045 -2279 -5878
1117 -5878 -6134 -3582 -2459 -1298 2273 6010 6400 3630 1736 -367 -4414 -8006 -7188 -3356 -81 2162
1133 2162 5921 8260 6151 1199 -1388 -2717 -4957 -6115 -3528 613 1829 2581 4368 5801 4028
1148 4028 556 -1090 -2728 -5374 -6864 -4237 -150 2047 3108 5141 5870 2591 -1592 -2945 -3587
$$ packed form
1037i421J381N684L724Q75K278L654p57m876l077q94k458l675Q66M863L983N13
1053B663K732K873k155n608l759o43j812k126K231N491L219L97J211J835j902
1068D647m969l278p0j385k120K361O112M119O59J335N83m323o626l963Q5Q72R71
1085d990M551N396J941k132j415m50l344m840j038J872L25J30L352N354J390j052
1101E050q74n90m177m974j009J890J734J715L465M337J22k503j591j550l324l599
1117e878k56K552J123J161L571L737L90k770j894k103m047l592Q18L832L275K243
1133B162L759K339k109m952k587j329k240j158K587M141J216P52J787J433j773
1148D028l472j646j638k646j490K627M087K197J061K033P29l279m183j353o42
$$ plain form
1163 -3587 -4834 -5190 -2027 2130 3290 3844 5641 5789 2235 -1727 -3618 -4119 -5661 -5111 -1017 3915
1179 3915 5034 5261 5061 3206 -1494 -5448 -5504 -4567 -3812 -2279 1732 4512 4281 2668 2731 1734 -1742
1196 -1742 -3710 -3689 -2608 -2997 -1984 2188 5164 5294 4132 3706 1601 -2983 -5766 -5017 -3108 -2320 -70
1213 -70 3599 5570 3660 1655 1058 -193 -3939 -6094 -4108 -2418 -1534 758 4458 6503 4485 2065
1229 2065 567 -1993 -5412 -5982 -2985 460 1526 3073 5402 5151 2135 -921 -1441 -2365 -4877 -4762
1245 -4762 -1702 399 282 1421 4222 4684 1584 -660 -1432 -3019 -5492 -5346 -1302 1811 2522 3725
1261 3725 5661 4511 481 -2250 -2176 -2859 -4283 -3190 546 3063 2511 3267 4828 3356 -860 -3868
1277 -3868 -3633 -4215 -5213 -3192 1796 4361 3895 3384 3515 930 -3222 -4714 -2892 -1829 -2257 -1024 3080
$$ packed form
1163c587j247l56L163M157J160N54J797J48l554l962j891n01j542N50M094M932
1179C915J119K27k00j855m700l954n6R37P55J533M011K780k31j613O3r97l476
1196a742j968K1J081l89J013M172K976J30j162m26k105m584k783P49J909P88K250
1213g0L669J971j910k005n97j251l746k155J986J690Q84K292L700K045k018k420
1229B065j498k560l419n70K997L445J066J547K329k51l016l056n20r24k512J15
1245d762L060K101j17J139K801M62l100k244p72j587k473J46M044L113P11J203
1261C725J936j150m030k731P4o83j424J093L736K517n52P56J561j472m216l008
1277c868K35n82r98K021M988K565m66n11J31k585m152j492J822J063m28J233M104
$$ plain form
1294 3080 4222 2540 2158 3257 1588 -2044 -3910 -2689 -2486 -3507 -1172 3117 4912 3453 2358
1309 2358 2018 -654 -4685 -5735 -3227 -1492 -1439 521 4533 5164 2284 1075 1395 -763 -4619 -4785
1325 -4785 -1950 -406 -165 1786 5424 5521 2239 -491 -765 -2487 -5527 -4666 -608 1126 915 2087
1341 2087 4040 3212 -357 -1607 -580 -1691 -4588 -3788 -622 1084 846 2465 5407 4788 840 -1423
1357 -1423 -1467 -2791 -4985 -3380 1208 3272 2459 2830 4234 2630 -1625 -3533 -2283 -2704 -4314 -2514
1373 -2514 1490 3123 1929 2305 3796 1915 -2569 -4477 -2826 -2520 -3322 -723 3760 4881 2874 1999
1389 1999 2307 830 -2940 -3805 -1139 -557 -2047 -704 2808 3491 1484 1156 2553 733 -3819 -4768
1405 -4768 -2750 -2120 -2533 214 4463 5417 2157 934 747 -1415 -4879 -4335 -913 593 51 1925
$$ packed form
1294C080J142j682l82J099j669l632j866J221K03j021K335M289J795j459j095
1309B358l40k672m031j050K508J735N3J960M012O31k880j209L20k158l856j66
1325d785K835J544K41J951L638R7l282k730k74j722l040Q61M058J734k11J172
1341B087J953q28l569j250J027j111k897Q00L166J706k38J619K942o19l948k263
1357a423m4j324k194J605M588K064q13L71J404j604m255j908J250m21j610J800
1373b514M004J633j194L76J491j881m484j908J651L06q02K599M483J121k007q75
1389A999L08j477l770q65K666N82j490J343L512O83k007l28J397j820m552r49
1405d768K018O30m13K747M249R54l260j223j87k162l464N44L422J506n42J874
$$ plain form
1421 1925 5203 4526 1022 -319 140 -1460 -4627 -4383 -460 1203 510 1596 4223 3653 -449 -2092
1437 -2092 -977 -1909 -4486 -3433 354 1973 712 1518 4349 3377 -334 -1329 -234 -1453 -4375 -3251
1453 -3251 758 2512 1602 2743 4971 2991 -1527 -3547 -2426 -2743 -4266 -2019 2271 3516 1625
1468 1625 1181 2925 1004 -3091 -3270 -1556 -1574 -3035 -1407 3108 3818 2324 1742 2990 1077 -3413
1484 -3413 -4132 -1572 -890 -1684 251 3913 3849 1066 330 1664 -4 -3516 -3839 -1329 -837 -2134 -641
1501 -641 3437 4107 1366 826 1387 -594 -4289 -4818 -1167 103 -439 1825 5179 4609 596 -914 -330
1518 -330 -1386 -4329 -3220 329 1483 52 1011 3566 3079 -600 -1650 -632 -1836 -4237 -3660 345
1534 345 1889 706 1960 4011 2848 -933 -2278 -826 -1375 -3348 -2029 1647 2411 997 1636 3867
$$ packed form
1421A925L278o77l504j341M59j600l167K44L923J663o93J086K627n70m102j643
1437b092J115r32k577J053L787J619j261Q06K831r72l711r95J095j219k922J124
1453c251M009J754r10J141K228j980m518k020J121l17j523K247M290J245j891
1468A625m44J744j921m095j79J714j8j461J628M515P10j494n82J248j913m490
1484c413p19K560O82p94J935L662o4k783p36J334j668l512l23K510M92j297J493
1501f41M078O70k741n40N61j981l695n29L651J270n42K264L354n70m013j510N84
1518c30j056k943J109L549J154j431R59K555m87l679j050J018j204k401N77M005
1534C45J544j183J254K051j163l781j345J452n49j973J319L676P64j414O39K231
$$ plain form
1550 3867 2813 -1218 -2604 -1297 -2267 -3922 -2461 1764 3135 1861 1910 2946 927 -2968 -4266 -1914
1566 -1914 -1461 -2107 -466 3219 3706 1408 874 2187 701 -2449 -3054 -816 -702 -1899 -190 3057
1582 3057 3637 1539 473 1321 -189 -3612 -3928 -1310 -259 -1222 195 3447 3365 617 -80 636 -465
1599 -465 -3370 -3422 -972 -25 -379 1088 4133 4261 1429 -193 -80 -1388 -4351 -3534 63 1500 951
1616 951 1948 3864 2411 -979 -2091 -974 -1359 -3285 -2286 1018 1685 504 1134 3188 2414 -542 -1968
1633 -1968 -751 -1218 -3110 -1930 1259 2671 1381 1753 3020 2033 -1497 -2537 -1148 -1261 -2764 -1716
1649 -1716 1295 2404 1166 1342 2564 1196 -2146 -3327 -2040 -1593 -2517 -585 3000 3685 1968 1209
1665 1209 1525 -184 -2854 -2993 -693 72 -725 494 2836 2598 499 162 982 -202 -2629 -2697 -1083
$$ packed form
1550C867j054m031j386J307r70j655J461M225J371j274M9J036k019l895j298K352
1566a914M53o46J641L685M87k298n34J313j486l150o05K238J14j197J709L247
1582C057N80k098j066Q48j510l423l16K618J051r63J417L252q2k748o97P16j101
1599d65k905n2K450R47l54J467L045J28k832j622J13j308k963Q17L597J437n49
1616I51R97J916j453l390j112J117l85j926R99L304O67j181O30K054p74k956j426
1633a968J217m67j892J180L189J412j290L72J267r87l530j040J389j13j503J048
1649a716L011J109j238J76J222j368l342j181J287M47r24J932L585O85j717p59
1665A209L16j709k670j39K300P65p97J219K342k38k099l37Q20j184k427o8J614
$$ plain form
1682 -1083 -583 -1093 63 2818 2742 635 -12 82 -937 -3506 -3059 -537 281 20 1412 3218 2794 536
1700 536 -341 32 -1008 -3172 -2632 -84 1043 731 1605 3340 2268 -780 -1648 -1248 -2241 -3174 -1702
1717 -1702 927 1839 1057 1224 2136 1246 -1162 -1729 -504 -769 -2165 -1382 1099 1720 1096 1866 2875 1865
1735 1865 -1047 -1969 -1374 -1534 -2281 -997 1724 2206 1311 1095 1867 273 -2017 -2432 -1518 -1195 -1837 -583
1753 -583 1820 2388 1503 1632 1628 134 -2231 -2605 -1165 -654 -713 881 3088 2943 891 65 271 -1055
1771 -1055 -2359 -1866 -528 -308 -705 484 2032 1866 368 153 237 -841 -2380 -2462 -674 -167 98 1522
1789 1522 3048 2535 601 -306 -409 -1387 -2349 -1351 -9 1288 721 1506 2570 1633 -53 -958 -774 -1666
1807 -1666 -2807 -1574 248 884 998 1872 2165 710 -1033 -1806 -1444 -1536 -1684 -290 1431 1708 926 1275
$$ packed form
1682a083N00n10J156K755p6k107o47R4j019k569M47K522Q18k61J392J806m24k258
1700E36q77L73j040k164N40K548J127l12Q74J735j072l048q68M00r93r33J472
1717a702K629R12p82J67R12q90k408n67J225k65j396P83K481O21o24P70J009j010
1735A865k912r22N95j60p47J284K721M82q95k16P72j594k290m15R14L23o42J254
1753e83K403N68q85J29mj494k365l74J440N11n9J594K207j45k052q26K06j326
1771a055j304M93J338K20l97J189J548j66j498k15Q4j078j539q2J788N07K65J424
1789A522J526n13j934r07j03r78r62R98J342J297n67P85J064r37j686r05J84q92
1807a666j141J233J822O36J14Q74K93j455j743p73L62r2j48J394J721K77p82L49
$$ plain form
1825 1275 1735 649 -871 -962 -394 -1330 -1768 -631 798 1216 1151 1415 1483 120 -1733 -2290 -1452 -1822 -1435
1844 -1435 46 1941 1790 987 920 987 -136 -1772 -1370 -716 -661 -604 724 2313 2189 1211 631 269 -892
1863 -892 -2406 -1694 -750 -393 -31 1192 2031 1100 -173 -104 -226 -1273 -1799 -1115 -303 -217 -127 864 1750 1506
1883 1506 583 503 103 -1358 -2054 -1355 -193 351 552 1807 2495 1081 -334 -453 -925 -1790 -1883 -956 443
1902 443 490 704 1251 1612 450 -1056 -920 -1054 -1536 -1431 -128 957 1365 1075 1923 1035 99 -930 -915
1921 -915 -458 -1028 -917 182 924 416 714 895 1103 279 -968 -703 -1250 -1708 -1644 114 1424 1166 1220
1940 1220 1490 904 -943 -2089 -1336 -716 -895 86 1320 2009 1482 758 1003 342 -938 -1529 -1080 -734
1958 -734 -865 -258 1140 1596 768 409 354 -269 -1507 -1930 -1000 -231 -284 240 1363 1663 651 45 461
$$ packed form
1825A275M60j086j520r1N68r36m38J137J429M18o5K64O8j363j853n57Q38l70L87
1844a435J481J895j51q03o7O7j123j636M02O54N5N7J328J589j24r78n80l62j161
1863h92j514P12R44L57L62J223Q39r31j273O9j22j047n26O84Q12Q6R0R91Q86k44
1883A506r23q0m00j461o96O99J162N44K01J255O88j414j415j19m72q65r3R27J399
1902D43M7K14N47L61j162j506J36j34m82J05J303J085M08k90Q48q88r36j029J5
1921i15M57n70J11J099P42n08K98J81K08q24j247K65n47m58O4J758J310k58N4
1940A220K70n86j847j146P53O20j79R81J234O89n27p24K45o61j280n91M49L46
1958g34j31O07J398M56q28l59n5o23j238m23R30P69n3N24J123L00j012o06M16
$$ plain form
1977 461 370 -1184 -1290 -562 -286 -59 177 1971 1887 893 285 205 -824 -1943 -1947 -716 246 325 1036 1721
1997 1721 1381 -245 -1238 -623 -717 -1428 -1163 -16 749 477 712 1813 1226 157 -564 -372 -558 -1229 -857
2016 -857 441 1113 813 534 1420 894 -716 -1000 -528 -748 -1426 -1004 328 777 369 506 1652 1311 -596
2035 -596 -1268 -920 -1096 -1277 -648 1489 1814 971 809 1108 379 -1705 -1507 -498 -279 -500 -56 1159 1213
2054 1213 305 -192 417 100 -1417 -1486 -612 -381 -1030 -143 1578 1669 518 60 596 -181 -1331 -1320 118
2073 118 -32 -114 -10 1649 1573 540 8 335 -118 -1642 -1730 -653 74 -367 523 1872 1597 -138 -762
2092 -762 -247 -937 -1972 -1176 358 848 311 759 1534 1021 -426 -922 161 -199 -1181 -1090 558 1055 110
2111 110 267 1431 1170 -700 -1086 -551 -523 -1803 -1092 685 866 -32 185 1007 718 -801 -1153 -452 -577
$$ packed form
1977D61r1j554j06P28K76K27K36J794q4r94o08q0j029j119mJ231R62P9P11O85
1997A721l40j626r93O15r4p11K65J147P65k72K35J101n87j069p21J92j86o71L72
2016h57J298O72l00k79Q86n26j610k84M72k20o78M22J332M49m08J37J146l41j907
2035e96o72L48j76j81O29K137L25q43j62K99p29k084J98J009K19k21M44J215N4
2054A213r08m97O09l17j517o9Q74K31o49Q87J721R1j151m58N36p77j150J1J438
2073A18j50q2J04J659p6j033n32L27m53j524q8J077P27m41Q90J349k75j735o24
2092g62N15o90j035P96J534M90n37M48P75n13j447m96J083l60r82R1J648M97r45
2111A10J57J164k61j870l86N35K8j280P11J777J81q98K17Q22k89j519l52P01j25
$$ plain form
2130 -577 -1244 -789 953 1567 503 678 1513 1051 -1053 -1621 -635 -621 -1010 -312 1498 1525 100 -151 713
2149 713 -367 -1916 -1609 -61 126 -1029 -106 945 1120 162 -180 840 116 -1113 -1244 79 98 -680
2167 -680 119 1791 1696 59 -180 585 -249 -1631 -1517 -65 189 -658 329 1404 1313 -224 -492 246 -693
2186 -693 -2214 -1470 171 670 352 743 2052 1433 -651 -1091 -48 -383 -1392 -753 802 1189 128
2203 128 291 1124 860 -810 -1116 -101 -523 -1484 -1101 644 886 10 202 1341 1021 -860 -1509 -98
2221 -98 -312 -1181 -570 1235 1344 295 475 1335 840 -996 -1073 -215 -265 -1101 -235 1113 1573 384 220
2240 220 840 2 -1598 -1800 -228 178 -657 -34 1229 1106 -144 -387 545 -25 -1177 -1236 388 640
2258 640 -241 -296 1394 1544 133 -133 797 156 -1530 -1662 23 223 -466 315 1422 1281 -112 -411
$$ packed form
2130e77o67M55J742O14j064J75Q35m62k104n68R86J4l89O98J810K7j425k51Q64
2149G13j080j549L07J548J87j155R23J051J75r58l42J020p24j229j31J323J9p78
2167f80P99J672r5j637k39P65q34j382J14J452K54q47R87J075r1j537k68P38r39
2186f93j521P44J641M99l18L91J309o19k084m40J043l35j009O39J555L87j061
2203A28J63Q33k64j670l06J015m22r61L83J745K42q76J92J139l20j881o49J411
2221i8k14q69O11J805J09j049J80Q60m95j836p7Q58n0q36Q66J348M60j189j64
2240B20O20q38j600k02J572M06q35O23J263j23j250k43R32n70j152n9J624K52
2258F40q81n5J690J50j411k66R30o41j686j32J685K00o89P81J107j41j393k99
$$ plain form
2276 -411 -23 -299 -1688 -1523 0 464 -41 420 1632 1422 -327 -867 99 -205 -1271 -1041 876 1062
2294 1062 150 393 1542 874 -782 -1133 -148 -82 -1225 -748 921 728 -218 14 1144 624 -775 -1241
2312 -1241 -41 -326 -1301 -762 842 1157 320 441 1186 994 -607 -1163 -287 -127 -714 -348 1335 1381 333
2331 333 121 738 241 -1347 -1299 -361 -188 -635 -145 1208 1342 -142 -238 401 50 -1573 -1175 366 426
2350 426 -167 379 1420 1258 -56 -266 673 217 -1161 -1102 148 250 -452 -251 984 1219 83 -303
2368 -303 111 -483 -1538 -1527 27 266 194 436 1251 1118 -373 -485 7 -286 -853 -718 629 1246 108
2387 108 463 1488 966 -474 -1110 -148 -288 -1156 -760 804 1070 -8 201 1003 357 -909 -857 -143 -240
2406 -240 -647 -944 540 908 299 441 1326 732 -571 -1093 -95 -421 -703 -514 1087 1359 218 412 536
$$ packed form
2276d11L88k76j389J65J523M64n05M61J212k10j749n40R66l04j066K30J917J86
2294A062r12K43J149o68j656l51R85O6j143M77J669j93r46K32J130n20j399m66
2312a241J200k85r75N39J604L15q37J21P45j92j601n56Q76J60n87L66J683M6j048
2331C33k12O17m97j588M8R38J73m47M90J353J34j484r6O39l51j623L98J541O0
2350D26n93N46J041j62j314k10R39m56j378N9J250J02p02K01J235K35j136l86
2368c03M14n94j055J1J554K39p2K42Q15j33j491j12M92k93n67J35J347O17j138
2387A08L55J025n22j440o36R62j40q68L96J564K66j078K09Q02o46j266N2P14r7
2406b40m07k97J484L68o09J42Q85n94j303n22R98l26k82J89J601K72j141J94J24
$$ plain form
2425 536 25 -1323 -1347 -185 61 -891 -131 777 802 91 -8 451 -192 -1253 -1192 80 159 -243 115 1242
2445 1242 1159 22 -133 487 -10 -1185 -750 230 418 -67 -88 815 605 -261 -189 131 -300 -1031 -1045 -183
$$ packed form
2425E36n11j348k4J162K46r52P60R08K5p11r9M59o43j061O1J272P9m02L58J127
2445A242q3j137j55O20m97j175M35R80J88m85k1R03k10q66P2L20m31p31j4Q62
$$ [...]
8191a09
##END NTUPLES=NMR FID
##END=
