##TITLE=1H_Ser DHA
 CDCl3
 8 sc, 
 8.2.2024
##JCAMPDX= 6.0         $$ Bruker NMR JCAMP-DX V2.0
##DATA TYPE= NMR FID
##DATA CLASS= NTUPLES
##ORIGIN= UXNMR, Bruker Analytische Messtechnik GmbH
##OWNER= root
$$ XWIN-NMR		Version 3.5
$$ Thu Feb  8 14:39:06 2024 Russian Standard Time (UT+4h)  she@DPX200
##.OBSERVE FREQUENCY= 200.1313
##.OBSERVE NUCLEUS= ^1H
##.DELAY= (6, 6)
##.ACQUISITION MODE= SIMULTANEOUS
##.ACQUISITION SCHEME= undefined
##.AVERAGES= 8
##.DIGITISER RES= 18
##SPECTROMETER/DATA SYSTEM= spect
##.PULSE SEQUENCE= zg30
##.SOLVENT NAME= CDCl3
##.SHIFT REFERENCE= (INTERNAL, CDCl3, 0, 15.7039)
##AUDIT TRAIL= $$ (NUMBER, WHEN, WHO, WHERE, WHAT)
$$ ##TITLE= Audit trail, XWIN-NMR		Version 3.5
$$ ##JCAMPDX= 5.01
$$ ##ORIGIN= Bruker BioSpin GmbH
$$ ##OWNER= she
$$ F:/spectra/data/she/nmr/H-F/1/audita.txt
$$ ##AUDIT TRAIL=  $$ (NUMBER, WHEN, WHO, WHERE, WHAT)
(   1,<2024-02-08 14:37:55.04 +0400>,<she>,<DPX200>,
      <created by zg, POWCHK disabled, PULCHK disabled
       configuration hash MD5:
       00 E9 B6 7A A2 85 ED C7 34 08 36 98 17 FE 4E 26
       data hash MD5: 16K
       3D B7 9E E8 A2 C4 2B 0D 79 CC F8 D1 BA DE 84 E7>)
$$ ##END=
$$ 
$$ hash MD5
$$ 39 40 7A 63 8C 40 08 95 AE 92 B1 FE 25 86 C5 8E
##$RELAX= 
##$RELAX= 
##$RELAX= 
##$RELAX= 
##$RELAX= 
##$RELAX= 
$$ Bruker specific parameters
$$ --------------------------
##$DU= <F:/spectra>
##$EXPNO= 1
##$NAME= <H-F>
##$PROCNO= 1
##$TYPE= <nmr>
##$USER= <she>
##$AMP= (0..31)
100 100 100 100 100 100 100 100 100 100 100 100 100 100 100 100 100 100 
100 100 100 100 100 100 100 100 100 100 100 100 100 100 
##$AQSEQ= 0
##$AQ_mod= 1
##$AUNM= <au_zg>
##$AUTOPOS= <>
##$BF1= 200.13
##$BF2= 200.13
##$BF3= 200.13
##$BF4= 200.13
##$BF5= 200.13
##$BF6= 200.13
##$BF7= 200.13
##$BF8= 200.13
##$BYTORDA= 1
##$CFDGTYP= 0
##$CFRGTYP= 5
##$CHEMSTR= <none>
##$CNST= (0..31)
1 1 145 1 1 1 1 1 1 1 1 1 1 1 1 1 1 1 1 1 1 1 1 1 1 1 1 1 1 1 1 1 
##$CPDPRG= <>
##$CPDPRG1= <>
##$CPDPRG2= <>
##$CPDPRG3= <>
##$CPDPRG4= <mlev>
##$CPDPRG5= <mlev>
##$CPDPRG6= <mlev>
##$CPDPRG7= <mlev>
##$CPDPRG8= <mlev>
##$CPDPRGB= <>
##$CPDPRGT= <>
##$D= (0..31)
0 1.2 0 0 0 0 0 0 0 0.06 0 0.03 0 0 0 0 0.0002 0 0 0 0 0 0 0 0 0 0 0 0 
0 0 0 
##$DATE= 1707388674
##$DBL= (0..7)
120 120 120 120 120 120 120 120 
##$DBP= (0..7)
150 150 150 150 150 150 150 150 
##$DBP07= 0
##$DBPNAM0= <>
##$DBPNAM1= <>
##$DBPNAM2= <>
##$DBPNAM3= <>
##$DBPNAM4= <>
##$DBPNAM5= <>
##$DBPNAM6= <>
##$DBPNAM7= <>
##$DBPOAL= (0..7)
0.5 0.5 0.5 0.5 0.5 0.5 0.5 0.5 
##$DBPOFFS= (0..7)
0 0 0 0 0 0 0 0 
##$DE= 6
##$DECBNUC= <off>
##$DECIM= 32
##$DECNUC= <off>
##$DECSTAT= 4
##$DIGMOD= 1
##$DIGTYP= 9
##$DL= (0..7)
0 120 120 120 120 120 120 120 
##$DP= (0..7)
150 150 150 150 150 150 150 150 
##$DP07= 0
##$DPNAME0= <>
##$DPNAME1= <>
##$DPNAME2= <>
##$DPNAME3= <>
##$DPNAME4= <>
##$DPNAME5= <>
##$DPNAME6= <>
##$DPNAME7= <>
##$DPOAL= (0..7)
0.5 0.5 0.5 0.5 0.5 0.5 0.5 0.5 
##$DPOFFS= (0..7)
0 0 0 0 0 0 0 0 
##$DQDMODE= 0
##$DR= 18
##$DS= 0
##$DSLIST= <SSSSSSSSSSSSSSS>
$$ [...]
##$SUBNAM2= <"">
##$SUBNAM3= <"">
##$SUBNAM4= <"">
##$SUBNAM5= <"">
##$SUBNAM6= <"">
##$SUBNAM7= <"">
##$SUBNAM8= <"">
##$SUBNAM9= <"">
##$SW= 18.0517328524113
##$SWIBOX= (0..15)
0 0 2 0 0 0 0 0 0 0 0 0 0 0 0 0 
##$SW_h= 3612.71676300578
##$TD= 16384
##$TD0= 1
##$TE= 0
##$TE2= 300
##$TE3= 300
##$TEG= 300
##$TL= (0..7)
0 120 120 120 120 120 120 120 
##$TP= (0..7)
150 150 150 150 150 150 150 150 
##$TP07= 0
##$TPNAME0= <>
##$TPNAME1= <>
##$TPNAME2= <>
##$TPNAME3= <>
##$TPNAME4= <>
##$TPNAME5= <>
##$TPNAME6= <>
##$TPNAME7= <>
##$TPOAL= (0..7)
0.5 0.5 0.5 0.5 0.5 0.5 0.5 0.5 
##$TPOFFS= (0..7)
0 0 0 0 0 0 0 0 
##$TUNHIN= 0
##$TUNHOUT= 0
##$TUNXOUT= 0
##$USERA1= <user>
##$USERA2= <user>
##$USERA3= <user>
##$USERA4= <user>
##$USERA5= <user>
##$V9= 5
##$VALIST= <valist>
##$VCLIST= <CCCCCCCCCCCCCCC>
##$VD= 0
##$VDLIST= <DDDDDDDDDDDDDDD>
##$VPLIST= <PPPPPPPPPPPPPPP>
##$VTLIST= <TTTTTTTTTTTTTTT>
##$WBST= 1024
##$WBSW= 4
##$XGAIN= (0..3)
0 0 0 0 
##$XL= 0
##$YL= 0
##$YMAX_a= 236570
##$YMIN_a= -399306
##$ZGOPTNS= <>
##$ZL1= 120
##$ZL2= 120
##$ZL3= 120
##$ZL4= 120
##$ABSF1= 10
##$ABSF2= 0
##$ABSG= 5
##$ABSL= 3
##$ALPHA= 0
##$AQORDER= 0
##$ASSFAC= 0
##$ASSFACI= 0
##$ASSFACX= 0
##$ASSWID= 0
##$AUNMP= <proc_1d>
##$AZFE= 0.1
##$AZFW= 0.1
##$BCFW= 1
##$BC_mod= 2
##$BYTORDP= 1
##$COROFFS= 0
##$CY= 11.3945322036743
##$DATMOD= 1
##$DC= 2
##$DFILT= <>
##$DTYPP= 0
##$F1P= 15.7292609196834
##$F2P= 12.9074282941183
##$FCOR= 0.5
##$FTSIZE= 0
##$FT_mod= 4
##$GAMMA= 1
##$GB= 0.15
##$INTBC= 1
##$INTSCL= 1
##$ISEN= 128
##$LB= 0.24
##$LEV0= 0
##$LPBIN= 0
##$MAXI= 10000
##$MC2= 0
##$MEAN= 0
##$ME_mod= 0
##$MI= 1.114404
##$NCOEF= 0
##$NC_proc= 0
##$NLEV= 6
##$NOISF1= 3.799351
##$NOISF2= 2.8
##$NSP= 1
##$NTH_PI= 0
##$NZP= 0
##$OFFSET= 15.70392
##$PC= 1
##$PHC0= -24593.8
##$PHC1= 18.45268
##$PH_mod= 1
##$PKNL= yes
##$PPARMOD= 0
##$PSCAL= 0
##$PSIGN= 0
##$REVERSE= no
##$SF= 200.130013532006
##$SI= 16384
##$SIGF1= 3
##$SIGF2= 2
##$SINO= 400
##$SIOLD= 16384
##$SREGLST= <1H.CDCl3>
##$SSB= 0
##$STSI= 0
##$STSR= 0
##$SW_p= 3612.71676300578
##$SYMM= 0
##$S_DEV= 0
##$TDeff= 0
##$TDoff= 0
##$TI= <>
##$TILT= no
##$TM1= 0
##$TM2= 0
##$TOPLEV= 0
##$USERP1= <user>
##$USERP2= <user>
##$USERP3= <user>
##$USERP4= <user>
##$USERP5= <user>
##$WDW= 1
##$XDIM= 8192
##$YMAX_p= 0
##$YMIN_p= 0
$$ End of Bruker specific parameters
$$ ---------------------------------
##NTUPLES= NMR FID
##VAR_NAME=  TIME,          FID/REAL,        FID/IMAG
##SYMBOL=    X,             R,               I
##VAR_TYPE=  INDEPENDENT,   DEPENDENT,       DEPENDENT
##VAR_FORM=  AFFN,          ASDF,            ASDF
##VAR_DIM=   8192,          8192,            8192
##UNITS=     SECONDS,       ARBITRARY UNITS, ARBITRARY UNITS
##FACTOR=    0.0002768,     1,               1
##FIRST=     0,             0,               0
##LAST=      2.2672688,     0,               0
##MIN=       0,             -399306,         0
##MAX=       2.2672688,     236570,          0
$$ Real data points
##PAGE= N=1
##DATA TABLE= (X++(R..R)), XYDATA
$$ [...]
2167B22j7j04j94J38q6P3j0l11K77P4m3k57K96M7o2N8k13L49k08L20j36l72K37
2190G8Pm13M71k05j07K78k36j36L31j56K4J89l22o4J01j3L65m69Q3J89PQ4n2k13
2214a79M5K46J94k40P6k86P5n14L38L7j33M49K35j16j79j02m4o0K29j42J41O2
2236A32j72K67L3n81N5J78j21R4K77n71M79O6N0k29o9J15J97l43J19q7L88m30
2258a53m52L31M39P37q22K02m28J16M81l45L74m03l47J15L35m30Q23q03P34K92
2278G96r7p72K37N97r75r6j07O9N21J32j12J20J27r20P7N44k95M5o1J22J02j26
2300g2P4k38L78n3k12P7Q5M1j10mJ91j67j39K78P1o45M21J49O2l37N1J64J53l17
2324i9J70o2q3L00j10j44j29J78j53N8J2J58ll45J93N0k41J97N0mQ3k07J95K51
$$ plain form
2167 222 205 101 -93 45 -41 32 22 -289 -12 62 19 -238 58 105 43 101 -112 237 29 349 213 -159 78
2190 78 85 -328 143 -62 -169 109 -127 -263 68 -88 -64 125 -197 -261 -160 -173 192 -277 -194 -5 2 86 34 -179
2214 -179 -134 112 306 66 142 -144 -69 -583 -245 -208 -341 108 343 227 48 -54 -98 -158 71 -71 70 132
2236 132 -40 227 260 -321 -266 -88 -209 -115 162 -409 70 136 186 -43 -112 3 200 -143 -24 -111 277 -153
2258 -153 -605 -274 165 902 80 282 -146 -30 451 106 480 77 -270 -155 180 -250 573 -230 504 796
2278 796 699 -73 164 761 -214 -310 -417 -348 173 305 193 313 440 -480 -403 141 -154 -109 -170 -48 54 -72
2300 -72 2 -236 142 89 -123 -46 39 80 -30 -34 157 -10 -149 129 200 -445 -24 125 187 -150 -99 65 218 -99
2324 -99 71 9 -74 226 116 -28 -157 21 -132 -74 -62 96 93 -252 -59 -9 -250 -53 -3 -7 76 -131 64 315
2348C15l45K31Pm76nM68n30M90j56n4O5K25l90L47k12L4L1j4p2m3J1J9n8m6J29
2373b9J30K8M2m61K78j19j97J47o5L99j76Q2k25J20L10k52K77j57M6j36j30K16
2395A28m42L51r9O9l22K39K92l04N0Q8j6l43M96r4k86K53j2M4k2p9m7J75j84j77
2419b42J32n0K25k51J22J08k53j83J62M24p1q8j45J17j41L22p6M1l7k74o4P4M36
2442B88k67J79j55j92R3j92L21J7R1j63P5p54N81n52M46J63l57P36m2m69j01J75
2464g9K3k94O37j09k77j97J16L66j36j00M1M32o84J42L37k30m60N13j93K89j86
2485d9L73k94m86M65J65l98R14m47o33k40R35o52J83j43m55N54m42R94k01Q17
2505I60j929M64R00N8p67M22o31P14J75m77j24j25k50J455q54K24l81j70J097
$$ plain form
2348 315 -30 201 208 -268 -273 195 -335 155 -1 -55 10 235 -155 192 -20 14 45 31 -41 -84 -73 -54 -112 -158 -29
2373 -29 101 129 171 -290 -12 -131 -328 -181 -246 153 -23 59 -166 -46 264 12 289 132 178 42 -88 128
2395 128 -314 37 -62 7 -315 -76 216 -88 -38 50 34 -309 187 93 -193 60 48 92 70 -9 -56 119 -65 -242
2419 -242 -110 -160 65 -186 -64 44 -209 -392 -230 194 123 35 -110 7 -134 188 112 153 116 -158 -222 -148 288
2442 288 21 200 45 -147 -54 -246 75 92 183 20 95 -659 -78 -630 -184 -21 -378 358 316 -153 -254 -79
2464 -79 -56 -350 287 178 -99 -296 -180 186 50 -50 -9 423 -261 -119 218 -12 -472 41 -152 137 -49
2485 -49 324 30 -456 9 174 -224 690 243 -390 -630 305 -347 -164 -307 -762 -208 -650 344 143 960
2505 960 -969 -505 395 453 -314 108 -523 191 366 -111 -235 -360 -610 845 -9 215 -166 -336 761
2524G61p59K34j57J0K3r4n61L15j07J04p1M68l28K21n90K79O68m71j78l37R62
2545C92k58j86j03M17o72O0K4L17o4J74j7o10M71o59L28K53K90l00O5R4n6m9L10
2568B21j82k74J09J64k60J73L40l8o1O3k68p3L7O2j94p4M32j46p1r9J64j07J05
2591B3p3L7J0n4P3P7p8k52K30R9j75k02N88k26k68jM2J08j38J27K55k78J12J21
2615A57m56N11J34l20l7n0K8j21R5P4l8o2PO6k08L36JJ42j73J20j06j21JK53j05
2640A28N9l51M26k38j13j33L79m26L95p5j02J38j54J93J06l1j5j61k46J55L0l1
2662f7K09m84L13J43k90J82J4l70L14m0m08N05J62n2j00K0k38o2O77k87l46L74
2684A69m03M81n86J27K11k57m43O16j87K23p79J040Lm5k31LL59m67o6m28M14L4
$$ plain form
2524 761 2 236 79 89 112 18 -543 -228 -335 -231 -302 166 -162 59 -531 -252 416 -55 -233 -570 392
2545 392 134 -52 -155 262 -410 -350 -326 -9 -73 101 84 -526 -55 -714 -386 -133 157 -143 -78 16 -40 -89 221
2568 221 39 -235 -126 38 -222 -49 291 253 192 255 -13 -86 -49 13 -181 -255 177 31 -40 -139 25 -82 23
2591 23 -50 -13 -3 -57 16 93 15 -237 -7 92 -83 -285 303 77 -191 -192 -150 -42 -180 -53 202 -76 36 157
2615 157 -299 212 346 26 -11 -61 -33 -154 -59 15 -23 -85 -78 -12 -220 116 117 259 86 206 100 -21 -20 233 128
2640 128 187 -164 262 24 -89 -222 157 -269 126 51 -51 87 -67 126 232 201 186 25 -221 -66 -36 -67
2662 -67 142 -342 -29 114 -176 6 20 -350 -36 -76 -484 21 183 131 31 51 -187 -249 428 141 -205 169
2684 169 -234 247 -339 -212 -1 -258 -701 -85 -272 -49 -828 212 215 170 -61 -58 301 -166 -232 -660 -246 -212
2706b12M5M49l48j49n88K53P39p57K58K49l79Q46j21n72k44R36R0j225N84o75
2726h21R63M5o75M97K85o11M11K81q27M68O37q8r70Q00m64n57J20%J160m84o71
2747e01k9P36P1K70p92K44k69k06L20nO73r74M33O75m83m19j29L62n17l13O46
2768b07L92m12j4K75q05R21m97O64k27ko22K65M75k02O92r37r98J112O20o84J61
2789c0j19J64j10K86j12l06K22J94m77M55j66J12m0M4k42j81P42j113P07J75k05
2810@J50L50j17r77M75m3L91m34J36k1j77L29r2j99Q2K7K64j14J12j10J81o01
2832c88N94n70J49K24J33O6k69P7J82K06j88l20o2j18K3N92m06k76K43J98k13
2853a23OK78n45P66l49M07J77j063O95j82j46K45l91k19K61L39J68l74j67K31
$$ plain form
2706 -212 -167 282 -66 -215 -803 -550 189 -568 -310 -61 -440 406 285 -287 -531 405 495 -730 -146 -821
2726 -821 142 187 -488 9 294 -317 94 375 -452 16 653 565 -405 395 -69 -626 -506 -506 654 170 -501
2747 -501 -530 206 277 547 -245 -1 -270 -476 -156 -161 512 -462 -29 646 163 -256 -385 -23 -540 -853 -207
2768 -207 185 -227 -241 34 -771 150 -347 317 90 88 -534 -269 206 4 696 -241 -1239 -127 493 -191 -30
2789 -30 -149 15 -95 191 79 -227 -5 189 -288 167 1 113 73 117 -125 -306 436 -677 30 205 0
2810 0 150 500 383 -594 -119 -162 229 -205 -69 -90 -267 62 -30 -229 -147 -120 144 30 142 32 213 -388
2832 -388 206 -364 -215 9 142 208 -61 16 198 404 216 -104 -166 -284 -261 331 -75 -351 -108 90 -123
2853 -123 -117 161 -384 382 33 440 617 -446 249 67 -79 166 -225 -444 -183 156 324 -50 -217 14
2873A4K7o05Q02k15L0L09l58K2M50r21K92K15J65m30K72J34o6K87m40J90k5P5
2895B24k87j8J95l47J99J5m6K03J09k55K5J80N3k02k4J3k64J11L8j26m3L31k67
2918a83R7Q3j22J1K06m82J58L60j47pK78l81j16J61K05j1M5mk28J51j37l9L71
2941B69j97J1j44KL7LJ62j91J15j61R6j89M1K43k17R6p4j57K62m7J97n37K10M65
2965B95l02j92L22M35n48M9kLj53J28l9P1r5J08oJ8k53p9M69l9l29L31k42nJ72
2990A17k88J94O6n7K06j1j75J67j21k46Q8J83k6m24L33J07on9R0k34L9k21L57
3013G9j83K48J0k10p4K66o7J21k54l7K91q2k64o4K37k06L29nq3m4J33j97J72n4
3037F2o8k55K62j51L29q0L4l28J70K41j85j51J53N6j2m55J41N21n25K46p0J84
$$ plain form
2873 14 41 -564 238 23 53 362 4 26 476 -445 -153 62 227 -203 69 203 137 424 -16 174 149 224
2895 224 -63 -81 114 -233 -34 -19 -65 138 247 -8 17 197 250 48 24 37 -227 -116 -78 -204 -247 84 -183
2918 -183 -86 -3 -125 -114 92 -390 -232 128 -19 -26 252 -129 -245 -84 121 110 155 151 -77 74 -63 -102 269
2941 269 72 83 -61 -59 -22 -19 143 -48 67 -94 2 -187 -146 97 -120 -24 -98 -255 7 -40 157 -380 -170 295
2965 295 -7 -199 123 558 10 59 57 60 -93 35 -4 67 -28 80 74 92 -161 -240 229 190 -139 192 -50 -55 117
2990 117 -171 23 89 32 238 227 52 219 98 -148 -60 123 97 -327 6 113 107 48 138 -96 -57 -278 79
3013 79 -104 144 154 -56 -130 136 69 190 -64 -101 190 108 -156 -220 17 -189 140 135 52 8 141 -56 116 62
3037 62 -6 -261 1 -150 179 99 133 -195 -25 216 31 -120 33 89 77 -378 -237 284 -241 5 -65 119
3059A19k94L61j56J75k16m9o3J18l0l5L0N0j75K73k3m20M35j74J04Q6m8K3l14
3082b23K71o0L3j66J19j24J46N0q5m9Q6K09j53m8L9k12K03l1J8r0N5L29p67O76
3106B26k20L21m59K93j54k23K67m08N14k6j80J70j67j47J01K00k0k94J57O1K13
3127B25l08K01p27N89Q0N37q04j27L67j76n4L44l39K59k79R4Q50o90J4j19K80
3148B17j53j43j8J36j86K59j39mM2lQ0k15O3J70j45l07N60qm97M28k80L35k71
3171g9L16l60K34l3J86j98J4k34J28k07K47J17j30l6j39J49L65j85j59M93j74
3192C15n0L2nP27J3k086J013K5J04j73J65r45Q32j63K38K19J1l87N4L64qn24J56
3215g3r18J008K14K71p3l0L01l07k09j15L19o10L44l52L26k86r3N5n6J77rP47
$$ plain form
3059 119 -175 186 30 205 -11 -60 -123 -5 -35 -70 -40 10 -165 108 85 -335 100 -74 30 116 68 91 -223
3082 -223 48 -12 21 -145 -26 -150 -4 46 -39 -88 -2 207 54 6 45 -167 36 5 23 -67 -12 317 -450 226
3106 226 6 327 -132 161 7 -216 51 -357 157 131 -49 121 -46 -193 -92 108 88 -206 -49 12 225
3127 225 -83 118 -609 -20 60 597 -207 -334 33 -143 -197 147 -192 67 -212 -118 732 42 56 -63 217
3148 217 64 -79 -97 39 -147 112 -27 -31 11 8 88 -127 -64 106 -39 -346 214 206 -291 137 -143 192 -79
3171 -79 237 -123 111 78 264 66 80 -154 -26 -233 14 131 1 -35 -174 -25 340 155 -4 489 315
3192 315 265 297 292 1019 1032 -1054 -41 -16 88 -85 80 -865 -33 -196 42 261 272 -115 -61 303 295 -229 -73
3215 -73 -991 17 231 502 429 399 700 393 184 69 388 -222 122 -230 96 -190 -283 -228 -284 -107 -116 631
3237F31Mm80l02P7K48k28M01j332J059j87J40l28J334j487J164p98O28j22P3m9
3257D46n23J97j31M85M48o77P3j76J139j200m40K73J79j54R35R6j118J99j60J69
3277F0K04l48L5J3j94K76k23O7J25K14o10K53K59m85K61O79o1q83J033q37J076
3298I14p61j52k31M21O05o99N57k08o59O24m51K99L80L90j57J40p55o00P09j095
3318g29J462q90M42l21M28l95K58j01o30R94q9q68M56L74M94r75J10L72r6m75
3338a79k77M96j13Q8m56M61N35M17j059N90l72K7m2N7K91n91Q9k02K98j19J98
3359A37Jj46m5J34m7j65o2J90j4j19Q6J55j57K64q4k28P7L30q2k26j13K17o6J03
3383A40o1k65J54N1k7j01K98l18L2l7k00L93r3N4j52K03k70J30k5q5J49J07Q0
$$ plain form
3237 631 635 155 -147 -70 178 -50 351 -981 78 -109 31 -297 1037 -450 714 -84 544 422 495 446
3257 446 -77 120 -11 474 922 245 318 142 1281 81 -359 -86 93 -61 874 970 -148 51 -109 60
3277 60 264 -84 -49 -36 -230 46 -177 -110 15 229 -381 -128 131 -354 -93 586 525 -358 675 -162 914
3298 914 153 1 -230 191 796 97 654 446 -213 411 -40 259 639 1029 872 1012 257 -343 366 -729
3318 -729 733 -157 285 -36 392 -3 255 154 -476 518 429 -439 17 391 885 -90 20 392 296 -179
3338 -179 -456 40 -73 15 -441 20 555 972 -87 503 131 158 116 173 464 -127 -38 -240 58 -61 137
3359 137 138 -8 -53 81 34 -131 -193 -3 -17 -136 -50 105 -52 212 128 -100 -23 307 225 -1 -114 103 37 140
3383 140 79 -186 -32 19 -8 -109 189 -129 -97 -134 -334 59 -34 20 -132 71 -199 -69 -94 -179 -30 77 157
3406A57k07J40k67J42o0J41N7l03J8j9R4j6J74r9N5j78Q3j24J82M6L2p1J63L4
3430A74m53K71K15k19j51K38j49J87l41K44q0j3k21J40K85o7j45P9K85l86K73
3451A66j43J67j8r2M3r4j30K03mp2o9j47N3R0K81k41J61k00J81l07L81k51j2J05
3475E1j20J69Oj72l4O2k5J00j98K91k47N8k54K97Q0J63k54j56K84k01L56p5k87
3498a06J94k9l18L58m51L45J01j79L40j60k26J41o0L2J96q3q1J6j95J01n1K60
3520A45l08J80J67l51R4j79J17K21l33M82k08m0n7J66N9l39K49Rj27L14n63J55
3542a47o1K78K3k20n5R0P3L0j8m6O8k47J50J64j12J3j0J85j65o2M4j11P0N1n0
3567f5P2R4J46m8j83R0k68L02k48J47L2J5l7j0L9m1k21J70j0L7N4k99M66k34k07
$$ plain form
3406 157 -50 90 -177 -35 -95 46 103 -200 -182 -201 -107 -123 51 -48 7 -171 -88 -212 -30 16 48 -23 140 174
3430 174 -279 -8 207 -12 -163 75 -74 113 -228 16 -64 -77 -298 -158 127 60 -85 -6 279 -107 166
3451 166 23 190 172 80 123 29 -101 102 98 26 -43 -190 -137 -47 234 -7 154 -46 135 -172 209 -42 -54 51
3475 51 -69 100 106 -66 -100 -38 -63 37 -161 130 -117 -59 -313 -16 64 227 -27 -183 101 -100 256 181 -106
3498 -106 88 59 -259 99 -352 -7 94 -85 255 95 -131 10 -50 -18 178 95 14 30 -165 -64 -115 145
3520 145 -163 17 184 -167 -73 -252 -135 86 -247 235 27 -13 -70 96 155 -184 65 74 -53 261 -302 -147
3542 -147 -208 70 93 -127 -182 -92 -19 11 -7 -53 15 -232 -82 82 -30 -17 -27 158 -7 -69 -25 -136 -66 -15 -65
3567 -65 7 101 247 199 16 106 -162 140 -108 39 71 86 49 39 78 37 -184 -14 -24 13 67 -232 234 0 -207
3592b07L92j99m1k33L37j33M9K5o9P0j3J38l7j23O2j64NL92l02j1M9J09j73M5
3616c2j37q8K31K7kP5l01K36j40K12km31K52J61j96N4n4L43q9m6j56J17j47J54
3640D1k12Q8j10K97m49K86o1K3L70l43J28j38J70J69m07j35K97n6L86k01k21J41
3662F3j97O9p1M5J38j86K36q5j30J72k42JJ73K8J06j47R4j27J34J8j71P9N8J21
3686A79j79J02p2J55Nk85l5K52J31j78j62p5k5L41j91K27l99K05n8QJ21J95m05
3709a43q8K43k02M06Nk71R2j90J98j77N0J12M1j56K36k62J89J4k9k36L10j05M0
3732G7j54M75o2l56r9m6J9P7j3n5m1M62o13J21p36J43M51K49L09j140O46P87L80
3755H81j624J091q05L37K73m47K14m70R72k80p6j30K26j88L0j53K87o9K8Lm7N9
$$ plain form
3592 -207 185 -14 -55 -288 49 -84 -35 -10 -79 -9 -22 116 79 -44 18 -146 -141 251 -51 -62 -13 96 -77 -32
3616 -32 -169 -257 -26 1 -1 74 -227 9 -131 81 79 -352 -100 61 -135 -81 -135 208 119 73 -83 34 -113 41
3640 41 -171 -83 -193 104 -345 -59 -120 -97 273 -70 58 -80 90 259 -148 -283 14 -42 344 143 -78 63
3662 63 -134 -65 -136 -91 47 -139 97 12 -118 54 -188 -187 -14 14 120 -27 67 -60 74 92 -79 0 58 179
3686 179 0 102 30 185 190 -95 -130 122 253 75 -87 -162 -187 154 -37 190 -209 -4 -62 -54 67 262 -143
3709 -143 -231 12 -190 216 221 -50 42 -148 50 -127 -77 35 76 -80 156 -106 83 97 68 -168 142 37 77
3732 77 -77 398 336 -20 -119 -165 -146 -69 -82 -137 -178 284 -329 -208 -944 -801 -350 -101 208 -932 -286 501 881
3755 881 -743 348 -457 -120 153 -294 -80 -550 422 142 66 -64 162 -26 4 -149 138 69 97 100 53 112
3777A12Q9m51K98J75m47K4R8j13L66k3j20LJ04K09o21M59j12J16K6j83J20k05
3799g6J98Oj76J92l07J35J17k17Q7j37J51Q4r8o9O4J47p4NMj10K02q5j28n3L05
3824A67j79J43k2l19K06J20j58l6j74K22o7j84M46p8j86r2K00q6Q2%o6J56j55
3847f0K0L1J4l38k43N39m2K32l37L89l65j14N28k10O5N5p8o5j38pK24J02n9k84
3871a41K80j02j13J61l5R4k29j2J84m5j40K83k35R5k99L28m9k17j9J311p44r90
3893f34R18k13K79m53J90l43J10k29L19j60N32j10p41J73k36Q81l35m0r4k27J115
3914G02j143M30p35R19M75j657J432p43M94n09M68N07k13q81j5J60P43q09k42
3933f17N57K98j355O36p04K077q52L19k90n8q85P79R41k060M80M23k78l31J442
$$ plain form
3777 112 201 -250 48 223 -224 -200 -102 -215 151 128 8 11 115 324 -297 162 50 166 192 9 129 -76
3799 -76 122 128 -48 144 -163 -28 89 -128 -41 -178 -27 57 -41 -110 -46 101 27 32 36 -74 128 43 -85 -138 167
3824 167 -12 131 109 -210 -4 116 -42 -78 -252 -30 -97 -281 165 87 -99 -191 9 -77 5 5 -61 95 -60
3847 -60 -40 -9 5 -333 -576 -37 -79 153 -184 205 -160 -274 254 44 109 164 86 21 -117 -124 100 202 143 -141
3871 -141 139 37 -76 85 50 144 -85 -97 87 42 -98 185 -50 45 -254 74 25 -192 -211 1100 356 -634
3893 -634 284 71 350 -103 87 -256 -146 -375 -56 -216 316 206 -535 -362 -598 283 -52 -92 -186 -413 702
3914 702 -441 -11 -746 173 648 -1009 423 -320 174 -335 133 640 427 -454 -469 -309 434 -375 -617
3933 -617 -60 238 -1117 -481 -1185 892 40 359 69 11 -874 -95 846 -1214 -734 -311 -589 -920 522
3952E22q34k83R56p85P33m35m72j8Q31l09K43L24q83R19m58J03M74r57K83O0K86
3973C00j246P04O6m08M14l97J33L01j51J50K79Q4j07l86L51k7o4o8k31K77j77
3994b03M72k28J97K57o72P26l22M20k29L87j615O97M26o21L48K90j73o61K40J64
4014a00L09k36j8o1m6K21j82J52k46L69q66n9J588j277M12l5J87m07L41L39k53
4035A32R9K4j4l85R1J44m1q0K77p9k22J79j22J64p5J00k14K60l87J85j1j19K18
4058A24L10L16l7n14m5k38j36K69j50n4M01k37j21J32j5K38l01J61J4j76Q6P6
4080A03k61M46j85q1r0K46k66O7J23J08k86j12K98rj64j4J45kq9L02l90n61O18
4103e4K52O3o80J271q91N80K3q51J60j16L55n24M21K70R2l23O7k5m08J85R2k8
$$ plain form
3952 522 -312 -595 361 -424 309 -126 -598 -616 215 -94 149 473 -410 509 51 154 628 -329 -46 14 300
3973 300 -946 -242 -176 -584 -170 -567 -434 -133 -284 -134 145 229 122 -264 87 60 -4 -72 -303 -26 -203
3994 -203 269 41 238 495 -177 549 227 647 418 805 -810 -113 313 -308 40 330 157 -504 -264 -100
4014 -100 209 -27 -45 -106 -152 69 -113 39 -207 162 -704 -763 825 -452 -40 -75 112 -295 46 385 132
4035 132 231 255 241 -144 -53 91 50 -30 247 168 -54 125 3 167 92 192 -22 238 -149 36 25 -94 124
4058 124 434 750 713 199 154 -84 -220 49 -101 -155 246 9 -112 20 5 243 -58 103 117 -59 27 103
4080 103 -158 288 103 22 -68 178 -88 -21 102 210 -76 -188 110 101 -63 -77 68 66 -23 279 -111 -672 -54
4103 -54 198 261 -419 852 -39 541 564 -287 -127 -243 112 -412 9 279 371 48 115 90 -318 -133 -41 -69
4125f9K51j19j90K47j79L1nj46o0K18m26L96pJ95p3N4q6n1J38k28J78j15q9L02
4149A67j72N0j64J27J85j99J53r8j69j00K81P2l77l7O82k17Q9k67k4o7K21n82
4171d46O5M47N0j81R7P9J0j18p6j9L84j18k74P8K64k1j88j58J17k21L46M9k09
4194d3q0L2J02p1J64j8k00K5L49l28J80K8m23K86L61j85n32K75J61L87r27M75
4216A8j4m40R77j005N12j19j196J235L97m11q01K74N89j39j09N19l60n3M78k76
4236G6l71J13N11m97L05k69k4n27P72J15j22l12O6L44J34o65J66j07L33L90l47
4257H4L02p09M92K47q4m50L98L38m60L02j343M45O1M50j66o74l66L24J253j68
4277B76l49p61N9R51L77l62k51M16K27m38K85j151L93k0L32o02J405p88K90p54
$$ plain form
4125 -69 182 63 -127 120 -59 -28 -33 -179 -239 -21 -447 -51 -58 137 64 118 32 -19 119 -109 69 -46 -135 167
4149 167 -5 45 -119 8 193 -6 147 49 -120 -220 61 133 -244 -281 401 184 273 6 -18 -85 136 -446
4171 -446 -381 66 116 -65 32 111 121 3 -73 -92 292 174 -100 -22 242 221 33 -125 -8 -229 117 166 -43
4194 -43 -123 -91 11 -60 104 86 -114 -89 260 -68 112 140 -283 3 364 179 -353 -78 83 470 -457 18
4216 18 4 -436 541 -464 48 -71 -1267 -32 365 -46 -847 -573 16 -123 -232 287 -73 -126 352 76
4236 76 -295 -182 329 -168 137 -132 -156 -683 89 204 82 -230 -164 180 314 -351 -185 -292 41 431 84
4257 84 386 -323 169 416 332 -118 280 618 158 460 -883 -438 -377 73 -93 -767 -1133 -809 444 276
4277 276 -73 -834 -775 176 553 191 -60 356 583 145 430 -721 -328 -348 -16 -618 787 -1 289 -465
4297d65K35l52N50K25p86j57J173K81n33K33j046K00j49K92p8L38n3O77m73m50
4317c38N49n05M17m69JM59P7l16K02j91o9L60l12L50l22L30m3j10k52mK34q9r2
4340a33L48l09l1K39k96M11r1K4k41J06k64K55k73L00j86L92k01k12j81M61P22
4361H40m60ol40j0J09j14J2j44J86o4Q6o9Q1R7rN0Pr0o39Q59J0n05K80j89j23
4386a45n7j71J21N05Q5n99K25K65m49L48j27j36q1K02J0l17j74K99J093q63J27
4407A61m94L64K9j34J97j76r2L6J42J06N77o09N8O8r46O08J84o1j58K10n32K36
4429b26L29J66m8r14P27o93K78K49k28M77n78J19K58o4J88m5p14J257q99K73K5
4450f3q47J104o96L26K24J0k8J61K00J86r16l33O54j43m03M78p0Q8j76J53M4j76
$$ plain form
4297 -465 -230 -582 -32 193 -593 -750 423 704 171 404 -642 -442 -591 -299 -377 -39 -92 585 112 -338
4317 -338 211 -294 123 -346 -345 114 191 -125 77 -114 -183 177 -135 215 -107 223 180 70 -182 -186 48 -41 -133
4340 -133 215 -94 -125 114 -182 229 138 162 -79 27 -237 18 -255 45 -141 251 50 -162 -343 118 840
4361 840 380 374 34 24 133 19 31 -113 73 9 95 26 107 204 195 245 252 162 -477 382 392 -113 167 -22 -145
4386 -145 -202 -373 -252 253 338 -261 -36 229 -220 128 1 -135 -216 -14 -4 -321 -495 -196 897 34 161
4407 161 -333 31 60 -74 123 -53 -145 -109 33 139 716 107 165 233 -713 -105 79 18 -140 70 -462 -226
4429 -226 103 269 221 -693 34 -659 -381 -132 -360 117 -461 -342 -84 -148 40 -5 -719 538 -361 -88 -63
4450 -63 -910 194 -502 -176 48 58 30 191 391 577 -339 -672 -18 -161 -564 -86 -156 -68 -244 -91 -47 -223
4472b23N7J7L18J60r75N70J4l99K07N32o09K63k4J39l91Q75o84R36p97M73p29
4493b70j6Q7L35q99M66O24k18J67o61L14p76R42J59L96o90O52o72J25j86j94O23
4514C08m36l78Q97p29O86K45q78O89J39m09Q9p91M72N80q28M32J82O3M46n40l15
4535g6J215j000n60K49J03J93l12j0K66J26o88P02J04j84M63K80o50p94R77n16
4555a12K10j13K69O58j387m45J128M65m12J04K1q68M75p10O41j08j094J545l7
4574B30m22K29m7q87R55l41n75J012l13l3k8J29m27L05j30O89P2r14O83j51M00
4595D36p68O54m56M3J28m13M47l04p5N21l7k90J79M0k15J64K37nl27j01J51l70
4617c61K39J43l6m8Q8lJ93n11N29l53J06Q79p55m55k36L73m26N90J54N44p81L37
$$ plain form
4472 -223 -166 -149 169 329 -646 -76 -62 -461 -254 278 -331 -68 -92 47 -344 531 -153 783 -14 459 -270
4493 -270 -286 -199 136 -763 -297 327 109 276 -385 -71 -847 95 254 650 -40 612 -60 65 -121 -315 308
4514 308 -128 -506 391 -338 348 593 -285 404 543 134 223 -568 -96 484 -344 88 270 333 779 239 -76
4535 -76 1139 139 -421 -172 -69 124 -188 -198 68 194 -494 208 312 128 591 871 221 -573 404 -112
4555 -112 98 -15 254 912 -475 -920 208 673 261 365 386 -482 -7 -717 -76 -184 -1278 267 230
4574 230 -192 37 -10 -897 58 -283 -858 154 -159 -192 -220 -91 -518 -213 -343 346 418 -496 187 36 436
4595 436 -332 322 -134 -91 37 -376 71 -233 -308 213 176 -114 65 105 -110 54 291 286 -41 -142 9 -361
4617 -361 -122 21 -15 -63 25 22 215 -296 233 -120 -14 865 110 -345 -581 -208 -634 -44 110 654 -127 210
4639B10m82M04j8j0k04K36n8j54j75L32J39k32j67j38K33L29j56j12k03k40R13
4660D47r35n7Q91l29q4L25l79m7q6M06m27N39p40R98l13m34M84n0L5m90j55P9
4682c22N15q57L34j43K22M35j44M84r23j37M03M84o46P04J42p21M80l58j17P46
4702E81r30P32m37L3j89O57o05Q43l16m42r66J83J334p59o52N54N15p13K87r32
4722a222J660m19k10%P03r26nQ69k64m17M1j38J49J3O3k91P45l80L08p27K11Q8
4744a49k61O42o2L9l31M66m30j70L75j28N9N30p23m5n55J231k21j204J227l09
4764a9L10l77O18q53N86M4k97K75p88J11M9K90m26M70j72L23P2m05N0M96p3j83
4786A01L6J48k67L1r4K29k6j96J87j13Lk79M86k51R3k74M74m47K60j35J15p0J36
$$ plain form
4639 210 -272 132 114 104 -100 136 78 -76 -251 81 220 -12 -179 -317 -84 245 89 -23 -226 -466 447
4660 447 -488 -545 346 17 -67 258 -121 -168 -254 152 -275 264 -476 522 209 -225 259 209 244 -246 -401 -322
4682 -322 193 -664 -330 -473 -251 184 40 524 -399 -536 -133 351 -295 409 551 -170 310 -48 -165 581
4702 581 -349 383 -54 -21 -210 447 -158 685 369 -73 -1039 -856 478 -281 -933 -379 136 -577 -290 -1222
4722 -1222 438 19 -191 -191 512 -414 -419 450 186 -231 -190 -328 -179 -166 -103 -394 351 -29 279 -448 -237 -149
4744 -149 -410 232 170 209 -122 344 -86 -256 119 -9 50 580 -143 -188 -743 488 267 -937 290 -19
4764 -19 291 -86 532 -321 265 309 12 287 -501 -390 -341 -51 -477 -7 -179 144 216 -189 -139 357 284 101
4786 101 137 285 18 49 -45 184 158 -38 149 36 39 -240 246 -5 88 -186 288 -159 101 -34 81 11 147
4809A47l63K73k72R7Q5K12l26J77O3K39n24J88pk5j98K9K57l09K14q8J02K02k09
4832c6J67n41N31Q05j074k15J98N95j482J210q7L27n19M41r8n55J70m70K07J10
4852c16l75P63j35Q4l12p3P37m57j79K72K89k35j06N2j13J86k00L60p6jk06K01
4874A60k49q1l5K95p6M3j92M69p10J006k47p10O66o66N68q9k28J45q1J09m2J00
4896A55l1Q8l44p17J006o31N40j81M79n21J12L35p61L77j07N31l0n76R0K34n29
4917d81J01K07l01O23j56L22l19p1J50k54L46m1j96K3O6J2j24j98J17m0K86K79
4939C51m93J39k6M56l5n80K9J47j4k32N0j96L53M37l78L51j26n05K28l1J81N0
4961A56O28j087J25J12R4Pk8N1j16J85k69L45j43q4n0J97j92M6M7m0k10M33Q6
$$ plain form
4809 147 -216 57 -215 -118 -33 179 -147 30 93 332 -192 -4 -11 -36 -234 -205 52 -257 -43 -131 -29 173 -36
4832 -36 131 -410 121 926 -148 -363 -165 430 -1052 158 71 398 -121 320 222 -333 -163 -633 -426 -316
4852 -316 -691 72 -63 21 -291 -364 373 -84 -263 9 298 63 -43 9 -104 82 -118 242 166 165 -41 160
4874 160 -89 -170 -205 90 14 57 -135 334 -376 630 383 -327 339 -327 241 152 -76 69 -12 97 55 155
4896 155 124 212 -132 -849 157 -474 66 -115 364 -157 -45 290 -471 -94 -201 330 300 -276 -186 48 -481
4917 -481 -380 -173 -474 149 -7 315 -4 -75 75 -179 167 126 -70 -47 19 31 -93 -291 -174 -214 72 351
4939 351 -142 -3 -29 427 392 -188 -159 -12 -26 -258 -208 -404 -51 386 8 359 233 -272 -44 -75 106 156
4961 156 784 -303 -178 -66 28 35 7 58 -58 127 -142 203 60 -24 -74 123 -69 -23 24 -16 -226 207 293
4984B93l14j67L00o06R07m37O57q17j01L63J14j4k51R6P1O5l96N06n9j92Q9j55
5006d8q5J48%OKo1J60p2q7K8j06n6PJ74j46K31J34j031J223k00n19N13l33J68
5030E0n8RL40q10N75q9K00l22K29l20K21M6o6Q8o68Q25l49Q5L6n9o9j4N5KK07
5055A44l00o8L41N8j97Q8j18R2pm26K09R20r86j82O19R3O20j202k00J007p61P45
5077D89q8k15M86l94N33m34J2k07K43j528Q97O95j011L92n13J235n41M09j051
5096e91j16R79L51j12p54J015q84q65P92J56k3J40k13L69m60K39m73O23m88N69
5116B54j03j83j7j08p27Q06J07M07q01J49l87Q2K07M19k42O28j59o98K29J64P6
5137A03l90L69L13q14L77J31j46J13l42O17o18M24j8r5k91J40R1P6o1L60m37q4
$$ plain form
4984 293 -21 -188 112 -494 413 -24 633 -184 -285 78 192 178 -73 23 94 159 -237 269 210 18 107 -48
5006 -48 -133 15 15 21 23 -38 122 50 -37 -9 -115 -171 -164 10 -136 95 229 -802 421 221 -298 215 -118 50
5030 50 -8 1 341 -469 106 17 217 -105 124 -196 25 71 5 93 -575 250 -99 -14 22 -37 -106 -120 -65 -63 144
5055 144 -156 -224 117 175 -22 66 -52 40 33 -393 -184 736 -250 -432 187 280 900 -302 -502 505 -256 489
5077 489 401 186 672 278 811 377 389 182 425 -1103 -206 489 -522 -130 -643 592 51 460 -591
5096 -591 -707 272 623 511 -243 772 -112 -977 -185 -29 -52 88 -125 244 -216 23 -450 173 -315 254
5116 254 151 -32 -49 -157 -884 -78 29 436 -365 -216 -603 -521 -314 105 -137 491 332 -366 -137 27 103
5137 103 -287 82 395 -419 -42 89 -57 56 -286 331 -287 137 119 24 -267 -127 -36 40 -21 339 -98 -182
5159a82J23L6J08j14r4K01k49J95j20K71k18O5J31l09J08J57o2k73J97L15k19
5180F7j61J77R8k08L5R2m2q7L33r7j34J37k75m8m4K62j40r8o5N93k22j17J3k2
5204D7P1p6j33j26J62mK08j73p5J5J81K9o5R9k13j51J36Q7j42J25%J65j88J41
5228A20J07l39O7J32j07J55j10j10J24j62J3o2L08j28j1L1L8k2j07O5O03m04l02
5251a01K90l92L28j45m5k53M56j19l9J34J54L10o96k07N51m62J09O94m85K99n64
5272a83J42q5N8J76q7L47o06KK39M44m78k38m52k5N07O39j78l67k90J504k91q46
5294f8L49j65l90j16K55m41Q43j93m88J99M26O9j35l46M73l18j10J54j70K40N4
5315A22J5k31j09K41n55Q00o18N58k89L5p2jL01l49J81j29L5n2K5J66L6k1J36
$$ plain form
5159 -182 -59 -23 85 -29 -123 78 -171 24 -96 175 -43 22 153 -156 -48 109 47 -226 -29 286 67
5180 67 -94 83 181 -27 8 100 58 -29 304 207 73 210 -65 -113 -157 105 -35 -133 -198 395 173 56 69 47
5204 47 118 42 -91 -217 -55 -59 149 -24 -99 -84 97 126 61 160 -53 -204 -68 19 -123 2 2 167 -21 120
5228 120 227 -112 -45 87 -20 135 25 -85 39 -123 -110 -172 136 8 -3 28 66 44 -63 2 605 201 -101
5251 -101 189 -203 125 -20 -65 -318 138 19 -20 114 268 578 -118 -325 226 -236 -127 567 82 381 -183
5272 -183 -41 -126 -68 108 21 368 -238 -236 3 447 -31 -269 -721 -746 -239 400 222 -145 -435 1069 778 -68
5294 -68 281 116 -274 -390 -135 -576 267 74 -414 -215 211 280 145 -201 272 -46 -156 -2 -172 68 122
5315 122 137 -94 -203 38 -517 283 -335 223 -66 -31 -103 -104 197 -152 29 -100 -65 -117 -92 74 110 89 225
5338B25Ol06K24k77L09j19O9r0Q9n7j86J83j54r4J96o5J86j49pO3P5m87N45k88
5362a09L95l22R3p9M8j30P1J6Q5l9n81O99l17J31j13Q3NJ76P0j14%j54L33k15
5386C2n0k2Q6J37m0k75J79j39J93K8m2n7j59L74k37n6J90j44p4J1L09j48r1oQ9
5411H8K6L4j040R55M5n95M07l66J03K73M13J63q19N66j73j97M3m7J43k10J70Q0
5433F2L8n5J42l09N9K13k79k8J17L53j76r0k48K22R1k88K36j57j6r5N4J97J26
5456A69l56k24M14l70M60l60r2N19J06l37j04J71K19l02R4j14j28p2J97J37j64
5477a37L71k14K7k63J49L4j9O2J46P5k62JL35j85K7r3j22M18n11j46L12K4J09
5500A38k65J36k69oK73N7q3j47J69j73M01k14j59J69l23J86L00k1N17j282R26
$$ plain form
5338 225 231 -75 149 -128 181 62 131 41 130 73 -113 70 -84 -178 18 -47 139 -10 -17 46 121 -366 179 -109
5362 -109 286 -36 57 -22 26 -104 -33 -17 68 29 -552 147 -170 -39 -152 -69 -64 112 182 68 68 -86 247 32
5386 32 -18 -40 46 183 143 -132 47 -92 101 129 87 30 -129 245 8 -48 142 -2 -76 -65 244 96 5 -1 88
5411 88 114 148 -892 63 108 -487 -80 -446 -343 -70 343 506 -313 253 80 -117 -74 -121 22 -188 -18 62
5433 62 100 45 187 -122 -63 150 -129 -157 -40 313 137 47 -201 21 112 -176 60 -97 -113 -208 -154 43 169
5456 169 -187 -411 3 -367 93 -267 -359 160 266 -71 -175 -4 215 -87 7 -107 -235 -307 -110 27 -137
5477 -137 234 20 47 -216 -67 -33 -52 10 156 231 -31 -30 305 120 147 54 -68 350 -161 -307 5 29 138
5500 138 -127 9 -260 -266 7 64 -19 -166 3 -170 231 17 -142 27 -296 -110 190 169 686 -596 330
5521C30q19j78N33j17N71J68k96r52M99P34o21M65m18M63p33m43J137n81J54k00
5541c04M92L0L12m09M0m47M86l03J15j14J81K99n4p70M71K04k38j81M38l55P6
5562c1K19L1j36M07n69j99j48J57q0L18K45k41J60p7l37Q94o21l04J18J98J26
5583A30m2P3m27L0P3J10j19L1J19J3J04L12p50M15K57m18n0P5K31k47J54L92n09
5606d3J83k81J17M5N8l1n96J075l43j81j9j18O3L12l03J02j26j5N23p94N32K1
5628A81k25J36r30J190k53J95J50k37o3m14JJ2L47K58J38p2p83J71L36N3j04k04
5650a17M1J3l97j63J223j626O36P31l57q8J15l9N39j107P81l83M58l23O2j25J63
5671C7k51k9M15N7l40Q0k33LQ0J75Q18j088r5k25L65M94k38r23J133O16p84k59
$$ plain form
5521 330 -489 -667 -134 -251 320 488 192 -760 -261 473 -148 317 -101 362 -371 -814 323 -258 -104 -304
5541 -304 188 218 530 121 161 -286 200 -103 12 -102 79 378 324 -446 25 229 -9 -190 248 -107 -31
5562 -31 188 219 83 490 -79 -278 -426 -269 -349 -31 214 -27 133 56 -281 613 -8 -312 -194 4 130
5583 130 88 161 -266 -236 -163 -53 -172 -141 -22 -9 95 407 -343 72 329 -89 -139 -64 167 -80 74 466 -43
5606 -43 140 -141 -24 21 79 48 -548 527 184 3 -16 -134 -71 241 -62 40 -86 -101 422 -372 160 181
5628 181 -44 92 -838 352 99 294 444 207 144 -270 -269 -257 90 348 486 414 -369 -198 138 191 87 -117
5650 -117 -76 -63 -460 -623 600 -1026 -390 341 -16 -104 11 -28 511 -596 185 -198 260 -63 -1 -126 37
5671 37 -214 -243 172 229 -111 -31 -264 -261 -181 -6 812 -276 -371 -596 -231 263 25 -898 235 851 67 -192
5693a92k16R70j619P91l25N43O45j353L44M84m04Q6M32n23R29j2o00L53l97o7
5713a31L69j86J19J67p10L98j05K66K43m25J57J49m86M96k95l38R5K26J26o5K62
5734C32o78K95J42j73N6m97P33k63q03Q37M69l64R5k07p2K05j67O68r37J07L1
5755a91J59k30K79o8J17j6L99p20K37M75p58M67p29J003q83M54m70K6L45L45k01
5776D0M85j35j21k75l86M70o98R70j557J679n03m81O87K92r56j28L61j06L97o2
5796b7j85K75M07p63L54l53j72Q2O82m1m39M68m76M29M50r20n5J69n07O47j58
5817a33m69N33j45M55k43P5l10R00n20j08R7k43L96j18j41m7l9j96J76k61K40
5838a01N35l93Jp6j76j17M04k2j24k8K57k48J09j80pL08j24p8K03n2J1k1k64p
$$ plain form
5693 -192 -408 562 -1057 -266 -591 -48 597 -756 -412 72 -332 -246 186 -337 592 580 -20 333 -64 -131
5713 -131 238 52 171 338 -372 26 -79 187 430 5 162 311 -175 321 26 -312 -217 9 135 70 332
5734 332 -346 -51 91 -82 -26 -523 210 -53 -856 -19 450 86 181 -26 -98 107 -60 608 -329 -222 -191
5755 -191 -32 -262 17 -51 66 50 449 -271 -34 441 -317 150 -579 424 -459 -5 -475 -449 -104 241 40
5776 40 525 390 269 -6 -392 78 -620 350 -1207 472 -31 -512 175 467 -489 -617 -256 -362 35 -27
5796 -27 -212 63 470 -293 61 -292 -464 -382 300 259 -180 288 -188 241 691 -229 -284 -115 -622 25 -133
5817 -133 -602 -69 -214 241 -2 73 -237 663 143 35 132 -111 285 167 26 -21 -60 -256 -80 -341 -101
5838 -101 434 41 42 -34 -210 -327 77 55 -69 -97 160 -88 21 -159 -166 142 18 -60 143 91 102 81 -183 -190
5862a90J12K81j31K7j67J52l80L46j78k3j06J26l5O6K80O8m13K47j03j24J81j37
5884a01J84J07j7k34K96r25K48J063m96j4R43p71k39R2o86N37J06K2k91R68j232
5905d40L50l25N39m40Q70k70k66L20K5o01k4K63n3J58k23K08j08N9l07L60o83
5926e88J036m78L11k96K57j05l7n3k27P6L50J54m77J91j86J3m6j68k4j90J059
5947E72q32M09J00l68p74J037O76n90q34K69M80n9Q65r19R1PJ48p53P41j26j59
5968a9l51J075p96l04M38J9m51j93M3Q93n32K8K57K94q60L16j67K28O1l98N62
5989A43J09l45J19oJ99j52P6L26o50J33K77l3l98M81O3j16K55n81K69l33M15l81
6011a30L24k31K9O3k50J10R1J19k18pJ89j89K46k56O7q1j38r2L67O3j76M72j46
$$ plain form
5862 -190 -78 203 72 99 -68 84 -296 50 -128 -151 -257 -131 -166 -100 180 248 -165 82 -21 -145 36 -101
5884 -101 83 190 173 -61 235 -690 -442 621 125 111 1054 283 44 136 -550 -13 93 115 -176 792 -440
5905 -440 -90 -415 124 -316 554 284 18 338 363 -238 -262 1 -52 106 -117 91 -17 42 -265 95 -588
5926 -588 448 -30 281 -15 242 137 100 47 -180 -104 246 400 -77 114 -72 -59 -105 -273 -297 -487 572
5947 572 -260 149 249 -119 -893 144 820 230 -604 -335 145 86 951 32 123 130 278 -475 266 140 -19
5968 -19 -370 705 -91 -395 43 62 -389 -582 -539 354 -178 -150 107 401 -459 -143 -310 -82 -21 -419 143
5989 143 252 -93 26 20 219 67 143 469 -181 -48 229 196 -202 279 342 226 481 -100 169 -164 251 -130
6011 -130 194 -37 -8 55 -195 -85 6 125 -93 -100 89 -100 146 -110 -43 -124 -262 -354 13 76 -100 372 226
6034B26m19R2J98l91N03N29n88o58N86J17m46M53l14l88M06Q4l1L02n3J0k22p2
6056g6M3j08l8J31R3l6n0j6J44J16l16K52n3lk11j63N37J46m72%L21k15m9j85
6080b08L74j13J36k42k4j60J04M85l74J98Jn81L06K7L59k00M12k18l57N9LJ05
6102I2j60J08pJ12p4L9k06KJ01K72m23J07k2L8K22k71J58l5k51J29J25j09m8o7
6126a68%K32k28k1J63k25N59k66l0k40l29J4K12J24P5m1K68j03K23k91k04n77
6148h53J183n07K70K40m8m19Q42r15j03P91n07R68j095o78J429p17j140J301k52
6167b10N57o7M7p77J9O97l65j8K94p3p9M99p17q5N99m80J93j0j36M99j15n19K57
6190A0m13Q36m31j75K15j24J94j15N7j4Jl68K53J74J14l37L41r6j02L0j63K42
$$ plain form
6034 226 -193 -101 97 -294 209 738 150 -508 78 195 -251 202 -112 -500 -94 -10 -41 261 208 218 -4 -76
6056 -76 -33 -141 -179 -48 45 9 -41 -57 87 203 -113 139 86 83 -128 -291 246 392 -80 -80 241 26 -23 -208
6080 -208 166 53 189 -53 -77 -237 -133 352 -22 176 177 -404 -98 -71 288 88 500 282 -75 -16 -13 92
6102 92 -68 40 33 145 71 110 -96 -94 7 279 -144 -37 -59 -21 201 -70 88 53 -198 -69 56 -53 -101 -168
6126 -168 -168 64 -164 -185 -22 -247 312 46 16 -224 -553 -539 -327 -203 -128 -169 99 -4 219 -72 -276 -853
6148 -853 330 -177 93 333 285 -134 708 -207 -310 481 -26 942 -153 -831 598 -119 -1259 42 -210
6167 -210 347 280 327 -450 -431 266 -99 -117 177 104 25 524 -193 -278 321 -159 34 24 -112 387 272 -247 10
6190 10 -403 433 2 -173 42 -82 112 -3 54 40 41 -327 -74 100 214 -123 218 122 20 50 -113 129
6212A29l19R6J7P2k2J34j53J65j28J69j56M0j80L17p0p1O8k40pJ27P6k69J40J3
6236e2K19j08n6L24k37J78l36L9K14r5k40J22J93l85M27m83M70J53m25K64m27
6257b41P26n29M14m95l07P71p1k76O87p63o3o05N81K71O60j043J53P28m43o79
6277e24k35P54m54J045n89P2k72Q18L14m11k57R63j696N44N57p91K59k69K89M62
6297E79m73J62K0L4o8j47n88N38Q5P75j079M36j45m64P89l70j88j39N90K12m37
6318A22o5R3l36J03qK63n45j9N07p11O87l27N41k24q6K19J67m56k1J92n94N37
6340C9j24k72N57l04J67R3l64K46j25K59r3j13J77j9k59K42M5j86J25k2n5O3k7
6363E0j7J8j49J50O9j83J31j94J66n1K3k3P5m66O28J98p23k68K50K8N42l94N34
$$ plain form
6212 129 -190 -94 -77 -5 -27 107 -46 119 -9 160 4 44 -136 181 111 40 108 -132 -139 -12 64 -205 -65 -52
6236 -52 167 59 3 327 90 268 -68 -29 185 90 -150 -28 165 -220 207 -276 194 347 -78 186 -241
6257 -241 485 -44 370 -125 -432 339 268 -8 679 -84 -147 -752 -171 100 760 -283 -130 598 155 -524
6277 -524 -759 -5 -459 586 -3 69 -203 615 929 518 261 1224 -472 72 629 -162 97 -172 117 579
6297 579 106 268 288 322 254 107 -481 57 142 917 -162 274 129 -335 454 84 -104 -243 347 559 122
6318 122 57 150 -186 -83 -91 172 -373 -392 115 -596 91 -236 305 81 -5 214 381 -75 -96 96 -498 39
6340 39 -85 -357 200 -104 63 156 -208 38 -87 172 79 -34 143 124 -135 107 152 -34 91 69 14 77 50
6363 50 33 51 -98 52 121 -62 69 -125 41 -10 13 -10 65 -401 227 425 -298 -566 -316 -288 254 -140 394
6386C94p44m76J016l24J84r6K86l29j28P2L64k80j3j39J56L8j17L41j66P1p3k65
6408b28K69L4j0j67j40L63k45J3K4P1P6P6o3L3o37K05O34J90j64r57R76m67j76
6431b90Q26O3j052Q92k98j62M19j068Q1K00J067j033M85M81j788M82M03K12j2
6450i2J12M8n98J118l81l15M2L04l83M19k63K00l99L7m1j44J05O5p6K86k9O65
6472F80m92o06N38k22O03k45n26R0L37j18P1m34O6P72o20o24J521j180k26R16
6492C01l11j89j18j0J22J47k32J02J84j9K52q2p68O2q2P84q49J072j71p1N14l95
6514B43l88l17P81Kl69K58m52l38L3J31J542j339M11j66N9l24K41k73M05l17Q2
6535i5N2J11m44J70K49P5n9N6Rq6p9R4j96K1L26k11J95k08O7J2J1Q4j87k22L03
$$ plain form
6386 394 -350 -826 190 -134 50 -46 240 -89 -217 -145 219 -61 -74 -213 -57 -19 -136 205 39 110 37 -228
6408 -228 41 75 65 -102 -242 121 -124 -111 -87 -16 60 136 73 106 -531 -326 308 498 334 -623 353 -114 -290
6431 -290 536 599 -453 439 141 -21 398 -670 -589 -389 678 -355 130 611 -1177 -695 -292 -80 -92
6450 -92 20 68 -530 588 207 -108 -66 238 -145 274 11 211 -188 -151 -192 -336 -231 -166 -242 44 15 680
6472 680 188 -418 120 -102 501 256 -270 -180 157 39 110 -324 -258 514 -106 -730 791 -389 -615 301
6492 301 -10 -199 -317 -327 -205 -58 -290 -188 -4 -23 229 147 -621 -559 -641 143 -706 366 195 124 638 243
6514 243 -145 -462 319 321 -48 210 -242 -580 -547 -416 1126 -213 198 32 91 -233 8 -265 140 -177 -95
6535 -95 -43 68 -376 -206 43 118 59 115 124 38 -41 53 -143 -122 204 -7 188 -20 47 59 70 154 -33 -255 48
6560D8n58J17n9Q17n74J90J09k25P2j83K32j86R8l3K82q5j86j00K17P1k66K67
6582F5P2l25J04J35P4k14p5J65j64K27q3K52m47j3J34M5L24j75j5p6j95M31k48
6605boQ5m8k42J95J18j83k72J43K28L48n43J55J26j18k36L65J53n32p4M30o19
6627e29K90M67l02O13J19o68Q32n08l38j21J24k96O83l06M30k46k72j83K16K01
6647B06k70m7P2N6j34K63j01j9K0j08M9K5P8k46o8L11j69M2O3l21N87m31M29m88
6671b01J33K79L01k17k5K4l38K35k63R6K6k71J07K51l43K41j84M0l6K20j00k2
6693d7l2n6j71O07Q3o95N48k42K03j36J19k02L42l99M8R9m8j7J77j86Q8k26o1
6716b04J49K69l90J34J88j70l97K29m28L15L08L57n90L94k18m81M22M92k27j49
$$ plain form
6560 48 -510 -393 -452 365 -209 -19 90 -135 -63 -246 -14 -200 -102 -135 147 62 -124 -224 -7 64 -202 65
6582 65 137 -188 -84 51 125 -89 -164 1 -163 64 -19 233 -214 -227 -93 -48 276 101 86 10 -185 246 -2
6605 -2 -8 77 29 -213 -18 100 -83 -355 -212 16 364 -179 -24 102 -16 -252 113 266 -266 -340 90 -529
6627 -529 -239 228 -74 539 658 -10 822 314 -24 -145 -21 -317 366 60 490 244 -28 -211 5 206
6647 206 -64 -111 -39 17 -117 146 45 26 46 -62 -13 12 90 -156 -224 87 -82 -40 23 -298 289 -142 287 -201
6671 -201 -68 211 512 295 270 294 -44 191 -72 24 50 -221 -114 137 -206 35 -149 -109 -145 75 -25 -47
6693 -47 -79 -135 -306 301 384 -311 237 -5 198 62 181 -21 321 -78 -30 69 21 4 181 -5 83 -143 -204
6716 -204 -55 214 -176 -42 146 -24 -421 -192 -620 -305 3 360 -230 164 -54 -535 -113 379 152 3
6736CJ59k59l53K65R18j556O43K89K26j075J70J55O81m35L9L82q56Q53l70m1j09
6757b71O8k88O96m25O0P4l57K83k55k3L55o67O03J50k12M02m8q0J86k60L2l6R3
6780H0k30k16K64q2J51K59j23k43L36k51n1N3j43L3K71k13lj85M03K2j31K0O3
6803H4Q0k4P2p7m9pK8m7k05P2J47j44m5J33J48j16r7P5K43n49N70o83P22p19K44
6828a44J22k17j04l19O63l36M70j244J017k3L93K06k96k13k4M59J31R3j480O7
6848g79J496j012L74n12N88k12K23k87L49p70P83j27m29L28M51l94r61L86O53
6867A48j56n72k03L44O81l64o21R31jr03P44k80k85k47J104j910K079p17k8k38
6887d94J046O1q26J10n74N99O3M4N8K35l23p00K93lJ55J26Q31J40o52J32J03M76
$$ plain form
6736 3 162 -97 -450 -185 733 -823 -180 109 335 -740 -570 -415 266 -169 -130 252 -604 249 -121 -162 -271
6757 -271 -203 -491 205 -220 -160 -86 -443 -160 -415 -438 -83 -750 -147 3 -209 193 145 65 251 -9 23 -13 80
6780 80 -150 -366 -102 -184 -33 226 103 -140 196 -55 -106 -53 -196 -163 108 -105 -108 -293 110 132 1 21 84
6803 84 164 140 212 135 86 79 107 60 -145 -73 74 -70 -115 18 166 50 -47 28 271 -278 292 -391 331 -388 -144
6828 -144 -22 -239 -343 -662 1 -335 135 -1109 -92 -115 278 484 188 -25 -49 410 541 634 -846 -779
6848 -779 717 -295 79 -433 155 -57 166 -121 228 -542 241 114 -315 13 464 70 -891 -505 148
6867 148 -8 -580 -783 -439 242 -122 -743 188 187 -716 28 -252 -537 -784 320 -1590 489 -228 -256 -494
6887 -494 552 613 -213 -103 -677 -78 -15 29 87 322 -1 -701 -408 -411 -256 -130 701 841 189 321 424 900
6909I00j397J51O55K33o40n11M64j79K75m71K83k71L24m20J53O23J71n81J50O0
6929b8L50m54J021j432N26j90l22J91O70N99j030J46N10j82j5Po37J49M4p85R44
6950H2k33P1M16k51l54J14K54k09O11o68M49j68p4J57k32J0J81k05O40m08K99
6971D82o89J88r0L46j49l64P56M0l54m68O83k038K909k080L12Q51n80J370j739
6990f14L17L6O28l12m75M79O33r03N6p93P28N22K20j155K2K69Q54k62lp55Q40
7011C32L67n04j85R58p25j45p31O56J42K48p84O3J28O13k10m30k24m13L7J009
7031B02k31M57P0o88L49l32M43n49J06m64l8N23O91k76k67L0l14N72l14k74O43
7052C39k06M3m40L11m54N06m1K0J31l70L98mL75q41L09P0j82K04M68j584N02O75
$$ plain form
6909 900 -497 -346 309 542 -98 -609 -145 -324 -49 -520 -237 -508 -184 -604 -451 172 343 -238 -88 -28
6929 -28 322 -132 889 -543 -17 -207 -529 -338 332 931 -99 47 557 375 360 367 -270 -121 -77 -862 82
6950 82 -151 -80 336 85 -269 -155 99 -110 501 -167 282 114 40 197 -35 -25 156 -49 591 183 482
6971 482 -207 -19 -109 237 88 -276 480 520 166 -302 381 -1657 1252 -828 -516 335 -245 1125 -614
6990 -614 -297 -261 367 55 -420 59 692 -211 -155 -948 -220 302 522 -633 -611 -342 512 250 247 -508 332
7011 332 699 195 10 968 243 98 -633 23 165 413 -371 -308 -180 433 223 -207 -431 -844 -807 202
7031 202 -29 428 498 -190 159 -173 270 -279 -173 -637 -675 -152 539 263 -4 26 -288 284 -30 -304 339
7052 339 133 176 -264 47 -407 99 58 78 209 -161 237 233 608 -233 76 146 -36 168 636 -948 -446 229
7074B29l02K98k99J09m6J01o52Q61j115P38m68J75O19j67l71n77K56J12O05K15
7094C21o18O1P53j96J90n65J47k36J270j257P59k2n75L11p44k55M23j35o9J278
7114H41j033l75J2L73K92J31l12j47j78mK85n01O00o2j11K33j155J335P6K49p80
7135b31K1J80J24m72N26n68M17N47l33j41k6k00M5k2M56J58n81Q1O44m26L00n2
7157D47n82Q3J074j634K66J032m79J5p50R18P88j635l15Q01K51j015P88O8o90
7176e69N09O79l39n44K19m7J294j077k80M6o94Q37J43m11p7J40O70k75k77L14
7196B61Q81j737J011o26J54J02k2l16o2P83q29M39kk35J75O35O4Ko89o3l05N21
7218A42M40l53j138J513m62L83r53n00J424m82J49J5n84J63J214r40J93n20K57
$$ plain form
7074 229 -73 225 -74 35 -11 90 -562 299 -816 -78 -546 -371 248 81 -290 -867 -611 -499 106 321
7094 321 -297 -236 517 321 511 -54 93 -143 1127 -130 629 607 32 343 -401 -656 -233 -368 -437 841
7114 841 -192 -567 -555 -182 110 241 -71 -218 -396 -400 -115 -616 -16 -78 -189 44 -1111 224 300 549 -231
7135 -231 -210 -30 94 -378 148 -420 -3 544 211 70 44 -156 -111 -133 323 481 -100 -19 625 199 499 447
7157 447 -135 -52 1022 -612 -346 686 207 222 -528 390 1178 -457 -772 29 280 -735 53 121 -569
7176 -569 -60 619 280 -264 -45 -92 1202 125 -155 -109 -803 34 177 -234 -311 -171 499 224 -53 261
7196 261 1142 -595 416 -210 -56 46 24 -292 -354 429 -400 39 37 -198 -23 612 676 678 -11 -74 -379 142
7218 142 582 229 -909 604 142 525 -428 -928 496 14 163 178 -406 -243 971 31 224 -296 -39
7237c9L24j019J198o99M26k69l51K98M38l3p3j62j02J18j10M39n77K55L88k84
7257A66n3j73J49k09N1k9j3J12M0m00l7N31n26L94o9n5j31Q8K09J38M3l10j91
7280b75L07j06O53m42k95q8Q52J48j274K50O16k07m99N32p07K55M36L64o75L02
7300A47J39j52k6O40p74J48K10k28j81J48m8K2l4K29j50lp2k4j26J15n1K24l26
7323a73N66m01j77m97R15j125Q19O23J10q67J1J197j91j044O04m96Q95l62k07
7342B00Q8o81O93j28K48p06P5j30Q34m8M1j71k71J48Q00n46p7J256j995K69N10
7363D09L03o70N88M09k62n63j80N9m17N26k30j18P62j152M30k91J296o23m20N25
7383C81j96N56q43N16j36n03J080o52o05P36n46N20m33K80j55n57Q66l1K4j50
$$ plain form
7237 -39 285 -734 464 -235 191 -78 -429 -131 307 274 201 39 -63 55 -55 384 -193 62 450 166
7257 166 113 -60 89 -120 -69 -98 -111 1 41 -359 -396 135 -391 3 -66 -121 -252 -164 45 183 226 -84 -275
7280 -275 32 -74 579 137 -158 -246 606 754 -520 -270 346 139 -360 172 -535 -280 156 520 -155 147
7300 147 286 134 108 748 -26 122 332 104 -77 71 23 45 11 240 90 87 15 -9 -135 -20 -71 153 -173
7323 -173 393 -8 -185 -682 233 -892 -73 550 660 -207 -196 1001 810 -234 370 -126 769 407 200
7342 200 288 -393 300 172 420 -286 -211 -341 493 445 486 315 44 192 992 446 369 1625 -370 -101 409
7363 409 712 42 630 1039 777 214 34 93 -324 202 -28 -146 616 -536 -106 -397 899 276 -144 381
7383 381 185 741 -102 414 278 -225 855 203 -402 334 -212 308 -125 155 0 -557 309 278 302 152
7403A52l47j65j13N02K95m32m2J18l2K87K82l46oj24k51K81J83k47K21k20N0k02
7425a56K03j40K64k73J001q27o06L54K96K34p0m98M34j98j12J16M29jn31L87l44
7446c8L5j10r5N20N47j352O76j67J05MJ75p74M55k6J71o76N06K3J03L78p74M72
7468A58j94j92N17m13J9k5L32J80l74J88k55l60O04k18J57j14L04l43k16L89L26
7489D70l21m21P89K0L4j080j50J169m3k29j06m33L09qj11m5M0l39J59k45P31l8
7511A52M2o74J83L46n42K15N28n97L63k06J47K88k46j52J26J81q6j41J41M2j27
7532a7j38K12N7O1p6m9j0q5J12K5Qk98J82j4N5J34q3Pl31L84j77J55R9O48q83
7557b2l42M11k10P7J31J48M0j06r2j22j70kJ04K86J67q5j46L83n62Q02q94J71
$$ plain form
7403 152 -195 -360 -473 29 324 -108 -150 -32 -64 223 505 159 153 29 -222 59 242 -5 216 -4 46 -156
7425 -156 47 -93 171 -102 899 72 -534 -180 116 350 280 -218 216 18 -94 22 451 450 -81 306 -38
7446 -38 -3 -113 -208 312 859 -493 183 16 121 125 300 -474 -19 -45 126 -550 -44 -21 82 460 -314 158
7468 158 -36 -228 289 -124 -105 -130 202 382 8 196 -59 -419 185 -33 124 10 314 -29 -245 144 470
7489 470 149 -272 517 537 571 -509 -659 510 467 238 132 -301 8 0 -111 -156 -116 -455 -296 -541 190 152
7511 152 194 -480 -297 49 -493 -278 250 -347 16 -190 -43 245 -1 -153 -27 154 68 -73 68 110 -17
7532 -17 -155 57 114 175 99 50 40 -45 67 92 100 -198 -16 -30 25 159 76 83 -248 136 -41 114 213 861 -22
7557 -22 -364 47 -163 -86 45 193 233 127 35 -87 -257 -259 -155 131 298 213 67 450 -112 690 -204 -33
7579c3J05n38M62m98O86N71n16O6J61l30Q96q74k88M95m05R2n51K15l88J32O45
7600A05K02l17M1k46M29j11m33O89j84m06k45N61R5n10R45j287M16K42L60j178
7620h32J410l39K09m76l11M28N1p3J13J9m06K10q4K39j57K9k48M73m54k18M10
7641gM16o01J97k4l22K33Q9K83l29J86N3o7k30j36k66P45j72m08J88K10l70P06
7663C74l90J40j25M1l21K57n3R9l0r1l6L90n49K14o5J50j20J59J32k94K20j32
7685c0J26l07K17L3j52J52N2j18r4K56R7n2n78J10L81k79N67j87n65K90o2k72
7707d15L81K07k29p2Q07p98m2K16n0J35M22K7m00m80L57n45M22J27l17L44J62
7728B59m04J38K07Q6p7j03j43j81K40M62k66l68K84m40M80k78J23j63o7k01j14
$$ plain form
7579 -33 72 -466 -4 -502 184 755 239 305 466 136 1032 158 -130 365 -40 52 -499 -284 -672 -540 105
7600 105 307 -10 31 -215 214 103 -330 359 175 -231 -476 85 180 -330 615 -672 -256 -14 346 -832
7620 -832 578 239 448 -28 -339 89 140 67 180 199 -207 3 -81 158 1 30 -218 255 -199 -417 -7
7641 -7 409 -192 5 -19 -341 -108 -19 264 -65 121 174 107 -123 -259 -525 220 48 -360 -172 38 -332 374
7663 374 -16 124 -1 40 -281 -24 -77 22 -8 -99 -135 255 -294 -80 -145 5 -115 44 176 -118 102 -30
7685 -30 96 -211 6 39 -113 39 91 -27 -121 135 232 180 -398 -288 93 -186 381 194 -371 -81 -143 -415
7707 -415 -34 173 -56 -128 679 -119 -161 55 5 140 562 589 189 -291 66 -479 -57 70 -247 97 259
7728 259 -145 -7 200 286 209 106 -37 -218 22 484 218 -150 134 -306 174 -104 19 -144 -211 -412 -526
7749e26Q74r66M70K29k51O51l71n21R62j82k73p18J875j175m99J39J03L54L35
7768E10p78N03j62r76J121j65L04l76o8K14L2o94O14J89k40k94K61j36M21k58
7788B2j81q7M97J61o59k65N77J89j89k73k28Q9L65K8l52L61J71o91R43n26K7q5
7810a06k6k2j70K57M68J40o12k62R06n03l55J83j88P97o13ml09L30J66k36n24
7831f83K35J045j84j18q99P62l01j73K73j44K68O2k3m9Rm9j29L74l23M1j32J22
7853a6J09K5k24J85j60j82K96p4O9k38L42J01k65k7L35r30M19J09J16K32j44k49
7875a71m60J94K35K30K96n62N55j56l71m38M66L00P8l5m34J86j9K46j46j28l40
7896d74K96o9J99j86J38J93m62K19J29J33j26J41Q2j18L3M55m19k16J71m6K97
$$ plain form
7749 -526 348 -618 -148 81 -170 481 110 -411 551 369 96 -622 1253 78 -421 -282 -179 175 510
7768 510 -268 235 73 -903 218 53 357 -19 -87 127 159 -535 79 268 28 -266 -5 -141 280 22
7788 22 -159 -246 251 412 -247 -512 65 254 65 -208 -436 -347 18 46 -306 55 226 -465 478 -48 -21 -106
7810 -106 -132 -154 -324 -67 401 541 -71 -333 573 70 -285 -102 -290 507 -106 -110 -419 -89 77 -159 -683
7831 -683 -448 597 413 295 -604 158 -143 -316 -43 -187 81 143 120 71 80 31 -98 276 -47 -6 -138 -16
7853 -16 93 118 -106 79 -81 -263 33 -41 28 -210 132 233 -32 -59 276 -654 -235 -126 -10 222 78 -171
7875 -171 -631 -437 -202 28 324 -238 317 161 -210 -648 -182 118 196 161 -273 -87 -106 140 -6 -134 -474
7896 -474 -178 -247 -48 -234 -96 97 -365 -146 -17 116 -10 131 213 95 128 583 164 -52 119 73 370
7917C70l14o5l8k67J46RK53r5r9Oj4R3L1Q4r5j78J0L73K0l84J32J55j15j70L52
7942B00j97L31j73k87m4J3J70J53k30J01n8P5P2m0Om8j16J7N0k80L40r1N0l5m43
7967d64N33j39n8K02k05K80m59K26K8n3j4k4K10J4J1q0m4L57k16J0L9k09Jk44
7991b98O81m30O8L4O1ln0L4k49J60r0j10K22k25K1K70r8k18L30M5J36k92k73J65
8015a09J16qL5j63M35k34q9K04o7j63q8lK05L9o1jk63M13r9k19K48l8J13k77K60
8040A86k58k18K36j6j16J66q0Nr2J79q1J53n7J43l05K3M6Q2J1j84J57j1J51j51
8064c1r3J73j86M0O6o5K86l23K9K00p1j33J27J0P5j33L8qO5o7P7K8j60K78j00
8089A22r9J18j30j13q9LM25k09k1lj71K12l2J33j39k78M15j31m1J30oQ1k86kK13
$$ plain form
7917 370 56 -9 -47 -314 -168 -159 94 -1 -100 -94 -108 -15 16 100 5 -173 -163 210 230 -154 -22 133 18 -152 200
7942 200 3 334 161 -126 -170 -157 13 166 -64 37 -21 54 126 86 92 44 -72 -55 -5 -285 55 -36 14 -21 -464
7967 -464 69 -70 -128 74 -131 149 -310 -84 -56 -109 -123 -147 63 77 88 8 -36 321 105 115 154 -55 -54 -298
7991 -298 383 -47 21 55 116 113 63 97 -152 8 -82 -192 30 -195 -174 96 -2 -220 110 155 291 -1 -274 -109
8015 -109 7 -1 34 -129 306 72 -17 187 120 -43 -131 -134 71 110 49 48 -215 198 99 -120 128 90 203 -74 186
8040 186 -72 -290 -54 -70 -186 -20 -100 -95 -187 -8 -89 64 7 150 -155 -132 -86 -4 7 -177 -20 -31 120 -31
8064 -31 -124 49 -137 -97 -31 -96 190 -133 -104 96 25 -108 19 29 104 -29 9 1 66 -1 76 104 -56 222 122
8089 122 23 141 11 -102 -191 -188 237 28 7 4 -167 45 13 146 7 -271 144 13 -28 102 96 177 -109 -111 102
8114A02k05j83K41K6Pr3Q5o3J27o4p2J21o0M9J80j83O4j07L2J54j65P7l43M50
8138A77k28o9K18K43l68n0o5J83N3l64L18O0k98Q4J18nJ90l17J75K1N9l20Q4R0
8162a1K60k93N0J57j25k04j3R6M0p9R3P2k67Q5n6K81o4N4P9k16R8l7N3j00M7J14
8188A14n9j44L73
$$ plain form
8114 102 -103 -286 -45 -19 -12 -105 -20 -83 44 -20 -92 29 -31 18 198 15 79 -28 4 158 -7 70 -273 177
8138 177 -51 -120 98 341 -27 -77 -142 41 94 -270 48 108 -190 -106 12 7 197 -120 55 76 135 -185 -101 -11
8162 -11 249 -44 6 163 38 -166 -179 -83 -43 -122 -29 43 -224 -139 -195 86 22 76 155 -61 37 0 53 -47 0 114
8188 114 55 -89 284
8191B84
$$ Imaginary data points
##PAGE= N=2
##DATA TABLE= (X++(I..I)), XYDATA
0@%%%%%%%%%%Qj6J6j7K5l3M0n3O7q0R4j12J32j55J83k15K51k89L32l85M43n04
32b68N73o50P35q30R35j049J172j308J459j622J799j996K211k442K696k975L277
49A717l609L978m382M828n327N882o507P215q021Q955j0051J1355j2939J4912
63H006j7448K0848k5665L3068m6042P5331k66163K9591L89281k04158k3328K10699
75A84020N2550k57071j01522M7378Q6094L9943j0589o5535Q7424P6251j70336
86c1393j66779J69965J38472j66506r0516K17133R3150j80766p5318J33270K0141
97F0853j10832l7506N2741O1021L8316n0386n5732P5379N9183j40964r8176J62544
109A6441J19647j29132n2355J33276o656j64580m0284O5365J8957J7996M4894
$$ plain form
0 0 0 0 0 0 0 0 0 0 0 0 8 -8 8 -9 16 -17 23 -30 37 -43 51 -61 71 -84 99 -116 135 -154 178 -207 236 -268
32 -268 305 -345 390 -440 495 -554 618 -690 769 -853 946 -1050 1161 -1281 1415 -1560 1717
49 1717 -1892 2086 -2296 2532 -2795 3087 -3420 3795 -4226 4729 -5322 6033 -6906 8006
63 8006 -9442 11406 -14259 18809 -27233 48098 -218065 -188474 200807 -3351 -26679 184020
75 184020 236570 -20501 -122023 -74645 11449 51392 40803 -24732 62692 138943 -31393
86 -31393 -198172 -28207 110265 -56241 -146757 70376 163526 -17240 -92558 40712 60853
97 60853 -49979 -87485 -34744 26277 64593 14207 -41525 33854 93037 -47927 -146103 16441
109 16441 136088 6956 -45399 87877 81221 -83359 -123643 -58278 -39321 -21325 23569
120B3569J3278K8963M2489p1185j10284M2841O8164q6928m8807J23307O5577q6681
132D303m0474N1810k255n6352p131L3425L8314M3889j1645o4615N805M0792o7340
145c1474p6781P6140J01367m1190o1931M8011L6002o1625m3078L4191M5148K3055
157D7835j5928m2163P023L3258n3240p5615N4721R5538l6300o3740O9489P2025
169I2903o3250o8382L3478L7473l4919m9205O140N6583L0489m1018l7274M9013
181A2031M4980p0949o7015P4933Q0374n6855n8915N8750M7007o6934o7547L3246
193c6894N7132q166l5649P999M9854J2985o0535l5939O0105M2375n9414l8733
205d4880O3680L5894p2921m8589N3769L9681l8434k2871M3672M3829j4877m6495
$$ plain form
120 23569 36847 65810 108299 37114 -73170 -30329 37835 -49093 -97900 25407 90984 4303
132 4303 -36171 15639 13384 -42968 -50099 -16674 21640 65529 53884 -10731 -4926 35866 -31474
145 -31474 -108255 -32115 69252 28062 -33869 14142 50144 -11481 -54559 -20368 24780 47835
157 47835 31907 -10256 -3233 30025 -23215 -98830 -44109 51429 15129 -48611 20878 92903
169 92903 29653 -38729 -5251 32222 -2697 -51902 -45762 10821 41310 292 -36982 12031
181 12031 57011 -13938 -80953 -6020 74354 17499 -41416 17334 64341 -2593 -70140 -36894
193 -36894 20238 12072 -23577 -15578 34276 47261 -13274 -49213 10892 53267 -6147 -44880
205 -44880 18800 54694 -18227 -66816 -13047 26634 -11800 -34671 9001 52830 37953 -8542
217h542p739L4441j645n3723j3656N9772K9308m9061k1158N1053J7570n1023k1716
230c6119L9537K6159k1973k0230J6138K1003j3862l3658n730L0678J0787l0587
242a7857m973M2411J2898l6530j3076K8932R633k7693j2186J9816J2682j1811
254B246j7705k440J7441P721j9300m222L2083J8231k3758j8473J5302P424k6214
267a1664j7864J5858J8771q36r282J086J5552M194k1281j2717K0651J7366j7474
280B360j6353K0591J6596k4695k3890J4451J9236r209j6092J0290K5547J284k4057
293c941p978K1566R517k6695j7129K7027J9319k7513k1620K3744K2101j9157j9640
306b0399K0140K6360r581k4964K751K0071l730k9904p189K9743J1898k5572q466
$$ plain form
217 -8542 -16281 18160 16515 -37208 -50864 8908 38216 -10845 -32003 19050 36620 -14403 -36119
230 -36119 3418 29577 7604 -12626 3512 24515 10653 -23005 -28735 1943 12730 -17857
242 -17857 -22830 19581 32479 -4051 -17127 11805 21438 -6255 -18441 1375 14057 2246
254 2246 -15459 -17899 -458 7263 -12037 -16259 15824 34055 10297 -8176 7126 14550 -11664
267 -11664 -29528 -13670 5101 4265 -5017 -3931 11621 15815 -5466 -18183 2468 19834 2360
280 2360 -13993 6598 23194 -1501 -25391 -10940 8296 -913 -17005 -6715 18832 20116 -3941
293 -3941 -11919 9647 19164 -7531 -24660 2367 21686 -5827 -27447 -3703 18398 -759 -20399
306 -20399 -259 26101 16520 -8444 -5693 14378 10648 -19256 -26445 3298 15196 -10376 -18842
319a8842L0329J4583k8386j7530K3963J6945k1314j7270J7577J9029j3458k3924
331a8298N324K3356l612k3868K347K8937N980k6049o765K5008P020k7317j0460
344a8397K0482J0393j7280j3079J5395J4925r536j4241P363J9460k518j8635j328
357f996J8783j543k2892l194J8096M072j4975k019J5840Q205j2502o588P880P524
371I691o377j1350J885J2596M78j3965k604J3496K068j3561j133J3049M563p845
385I91m393O497M563m510p554o99O283J038r367k515J1079O697j0230l140J0782
400E522M735q709o339N834M922n570q360J719P692M51p045k255J2052O922j1350
415B21o755J0791P115j2869q239R526P729q943q655O453R579l198p585m89J0975
$$ plain form
319 -18842 11487 26070 -2316 -19846 4117 21062 -252 -17522 55 19084 5626 -18298
331 -18298 -12974 10382 6770 -17098 -14751 14186 20166 -5883 -12648 12360 19380 -7937 -18397
344 -18397 2085 12478 -4802 -17881 -2486 12439 2903 -11338 -3975 15485 12967 -5668 -6996
357 -6996 11787 10244 -12648 -15842 2254 6326 -8649 -10668 5172 13377 875 -5713 2167 9691
371 9691 3314 -8036 -6151 6445 6923 -7042 -9646 3850 5918 -7643 -8776 4273 8836 991
385 991 -3402 3095 7658 3148 -4406 -5105 1178 2216 -7151 -9666 1413 8110 -2120 -5260 5522
400 5522 10257 1548 -4791 1043 5965 395 -7965 -6246 1446 1897 -5148 -7403 4649 11571 221
415 221 -6534 4257 11372 -1497 -9736 -210 7519 -1424 -10079 -3626 5953 2755 -4830 -5319 5656
430E656K975j0663m604J2033O568j4123q516J1426O907j3482p687J3032R893q009
444A406p100P375Q560n162j1042J624J0110L87j3324l429J4012L195j2785l375
458i548J5062N905j2319n927J0866N160r910o337O047P103n592q469K072J0636
472D749J04r360q42J0967J474j1862k096J2916J697j0361j531O593J615q571k985
487g493N768N841j557n059J677P016j609p080j912Q442Q43r279k438Q074R34n209
503c041k74N345L298m334j768R56K637K26m970p62M195N57o541o59O043K806m928
520a214j011M713P20l201k232K126K978R9m177k472L845J918n806k086O960L669
536D829m528l299N289K810m537k303J139K925j533m756q97N001K645l729k484
$$ plain form
430 5656 8631 -2032 -6636 5397 11965 -2158 -10674 752 7659 -5823 -13510 -478 9415 1406
444 1406 -5694 1681 10241 5079 -5963 -4339 5771 6158 -7166 -10595 3417 6612 -6173 -9548
458 -9548 5514 11419 -900 -6827 4039 9199 -711 -7048 -1001 6102 510 -7959 -5887 4749
472 4749 4853 -4507 -5349 5618 7092 -4770 -6866 6050 7747 -2614 -4145 2448 4063 -4508 -7493
487 -7493 -1725 4116 2559 -2500 -823 6193 4584 -2496 -4408 4034 4877 -4402 -6840 1234 2168 -3041
503 -3041 -3315 2030 5328 994 -774 182 2819 3045 -1925 -2687 1508 2065 -4476 -5135 908 3714 -1214
520 -1214 -2225 2488 3208 7 -2225 -99 2879 2978 -1199 -3671 174 2092 -3714 -5800 1160 4829
536 4829 301 -2998 2291 5101 564 -1739 -600 2325 792 -3964 -4861 140 2785 -944 -3428
551c428O043L224o829l795O665L188n513l212M298K144m779l859L683N105K89
566C224n160r23O333J163o747k318P964K668q423m014P222K090o880p59N579K779
582C798l452l545K994L951o67n194p1N266n00p174q68P102J641o349O0O991K5
599D008n874r46M529K408l976k527J683K417j602m828J424O213L84n607K38N014
615B958m8m913K25M849J38l992j638J986O20r92j650J375K869r9l302L72M445
632C203k97l445m97K992j162l719K39K998j52j69j17J02J842n25k253M56K227
649A723P49l223m96K074L99l039q29L946R54k831l40J166Q47k81j027q30L476
666B438j009k168j444J806K349l361j559L604J304k658k36J679J653j312k644
$$ plain form
551 -3428 2615 5839 -990 -4785 1880 5068 -445 -3657 641 2785 -1994 -5853 -2170 2935 3224
566 3224 -1936 -2859 3474 4637 -2110 -4428 3536 6204 -2219 -6233 989 3079 -3801 -4560 1019 3798
582 3798 346 -3199 -205 3746 3079 -2115 -2186 3080 2580 -4594 -5462 1640 3281 -3068 -3008 3983 4008
599 4008 -1866 -2812 1717 4125 149 -2378 -695 1722 120 -4708 -3284 2929 3313 -2294 -2056 2958
615 2958 2910 -2003 -1778 3071 3209 -783 -2421 -435 185 -807 -2457 -1082 1787 1688 -1614 -1242 3203
632 3203 2906 -539 -1036 1956 794 -2925 -2686 312 160 -9 -126 -24 1818 1293 -960 -504 1723
649 1723 2472 -751 -1247 827 1226 -1813 -2642 1304 2258 -573 -913 253 1100 819 -208 -1038 2438
666 2438 1429 -739 -2183 -377 1972 -1389 -2948 656 1960 -698 -934 745 2398 1086 -1558
681a558K0K506q89k040m69L369J069l192n58L613J087l887j191L181J551k783
697a71k380K236J582r88k563J386K735J7l584M74L256J94l322j71L156K51l539
714a431o10L048J178l473r58J923J690j342j286J244K690q95l408P22K284j272
730A04k053K22K488M70k418j0J873Q75k143j106K316J624k141j869R74J072Oj490
748a206n70K675P48k941P28J770l43q56J64K16P13j233o85M57O33l98j123L23
766i28J495k01l87j52J425M53j481q89L83O83j186n94J165Q90p52l66p1J045R22
785A454j998N01J009j64j273m12J018M6q36m42O86J154j75j109O13J199m98j592
803h19l5J455j45j101n59J502N74j370o41J148R70q10r54J010J169q31j456O55
$$ plain form
681 -1558 -1538 968 79 -1961 -2430 939 2008 -1184 -1742 1871 2958 -929 -2120 1061 2612 -171
697 -171 -2551 -315 1267 279 -2284 -898 1837 1854 -1730 -1256 2000 2194 -1128 -1299 1857 2108 -1431
714 -1431 -2041 1007 2185 -1288 -2246 -323 1367 25 -1261 -17 2673 1778 -1630 -908 1376 104
730 104 -1949 -1727 761 1231 -1187 -1197 676 1551 -592 -1698 618 2242 101 -1768 -794 278 284 -1206
748 -1206 -1776 899 1647 -1294 -566 1204 861 5 169 385 1098 -135 -820 -363 270 -128 -1251 -928
766 -928 567 366 -21 -173 1252 1705 224 -665 -282 401 -785 -1379 -214 676 -76 -442 -513 532 1454
785 1454 -544 -43 966 802 -471 -883 135 181 -655 -1097 -411 743 568 -541 72 1271 773 -819
803 -819 -854 601 456 -645 -1204 298 872 -498 -1139 9 979 169 -785 225 1394 563 -893 -238
821b38J211r41j308K74J657k13j177Q2J811n6j354n09J220O45j168j165J166Q93
839H30q53j308P59J484o95r29K92J576l95j456J67J021J22j647j20J360M39r35
857b88o80J060Q71q91r70J087J169r49j147P15P28q72o66P4R81J36q24K4P21O41
877I20r19k83O38K56l98q17N98N58o85n23K23R40m0p66L59M51R7q39j06J48N97
898D09n40l79M58K62j00m97L22N26l81k52R1K31J11k88K4j33N09n58j76Q4O97
919D20j81l41Q4M29R6q72J24M20M97r57k09L12O75n85m75N11L59n7n68L38O13
940F33m74o61J14O66M8q12k02J000j34m38p8N03M81p95j86L61O17l32q99K48P38
961C98l36q97N27J089m45p39K15N20J83o23l13L94L19l00p30O56J79Po11K50Q55
$$ plain form
821 -238 973 32 -1276 -1002 655 442 -735 -653 1158 1102 -252 -761 459 1104 -64 -1229 -63 830
839 830 -23 -1331 -572 912 217 -712 -420 1156 761 -695 -528 493 615 -1032 -1152 208 647 -288
857 -288 -968 92 963 72 -898 189 1358 409 -738 -23 705 -167 -833 -759 222 358 -466 -442 279 920
877 920 1 -282 356 612 214 -603 -5 553 -132 -655 -432 508 468 -298 61 512 609 -230 -336 -188 409
898 409 -131 -510 -52 210 110 -387 -65 461 80 -172 -81 150 261 -27 -3 -136 373 -185 -361 -277 420
919 420 239 -102 -18 411 507 -365 -241 179 676 -281 -490 -178 497 -88 -563 -52 307 250 -318 20 633
940 633 159 -502 -388 278 326 -486 -688 312 178 -260 -338 165 646 -149 -335 26 643 311 -588 -340 398
961 398 62 -835 -308 781 336 -403 -188 332 515 -108 -421 -27 292 -8 -738 -82 97 104 -507 -257 598
982E98m72n74M36N44j89o50L6M42k5p08J35M49K49l98l44P70P7m7n81LP82o88
1004a55o8nN96m45m30L06J06K72j67k66M63J01j73l18M53JK28q49j81K86J72K72
1026A99l4J60M89j041l62Q88q4K03k89J28O49r79m30J46q59J354l42P30K59j102
1046c17l5J87q27M12O72m8J09j96J90m06Q4K42O50r55K10l17N11m55j0O36m01
1067f4l00l2j042J718j00n31L6L03J77J55m91J42j67q78J100L05k13o11M58m7
1087h2j32l27Q81l09K05l90J24N7K05j40m25M17L87p00J12L52J36l2l50k2K3L36
1109C26l26J51N7J0k91k18L4L52j80j31M13J37m13j88L61J13o7k11q4J47R6k82
1131a94K97n4o1M2j15L83k13j71j14K61J56m13m4J1J65P6k31J51J8J14K24l98
$$ plain form
982 598 126 -448 -12 532 343 -307 -271 171 146 -562 -427 22 271 -127 -471 299 376 329 -252 -249 533 -155
1004 -155 -223 -228 368 -77 -507 -201 -95 177 10 -256 207 308 135 -183 270 271 499 -350 -531 -245 -73 199
1026 199 165 325 814 -227 -589 299 215 418 129 257 906 -73 -503 -357 -1216 138 -204 526 785 -317
1046 -317 -352 -165 -992 -580 92 44 153 -43 147 -259 -175 67 717 -238 -28 -345 166 -289 -299 337 -64
1067 -64 -364 -396 -1438 280 180 -351 -315 -12 165 320 -171 -29 -196 -1074 26 331 118 -493 -35 -82
1087 -82 -214 -541 340 31 236 -154 -30 27 232 92 -333 84 471 -229 -117 235 371 339 -11 -33 -10 326
1109 326 0 151 208 218 -73 -291 -257 95 -85 -216 197 334 -79 -267 94 207 140 -71 -155 -8 88 -194
1131 -194 103 49 -12 30 -85 298 85 -86 -200 61 217 -196 -240 -229 -64 12 -219 -68 -50 64 288 -110
1153a10J81j64j14O5k4J08n4jk71O13k1j18j13k93L17Ok90N57j68j87l7J51K25
1176B58l69q8L98n8j85J56J24n3M50r03J60K12Q70j004m8N2M15l48Q3l40K25M69
1198D76l67k68r9J42K86m14n24K79K77M00l54O03q65L21q0N74n74l41Q26m32m3
1219a77M0R4L89k39j83m84N28J33k71K22q83J190J33m69k03m92O13k8L72j06m53
1240b74N03n2l40L12J9m26M68J3q30J89J49j07M06K3J2%k56p2K86l6J15l56K51
1263co3K18K04J58o08m55R05p81J18J18J29L54p25J014j05l11k11J86m87M54K53
1284C62m59m62Q43j84l09K06o01R64l59J15K40j032M75j44m7K97j44J45k50L75
1304C1q5K85l67l3L35k31K63n80M56n99L59n9j92O13N59p22o1k8K84q1j60J54
$$ plain form
1153 -110 71 -93 -207 -142 -166 -58 -112 -113 -384 229 208 90 -23 -316 1 7 -283 274 106 -81 -118 33 258
1176 258 -111 -199 199 141 -44 112 236 183 633 -270 -110 102 972 -32 -80 -28 387 39 122 -218 7 476
1198 476 109 -159 -258 -116 170 -244 -768 -489 -212 188 -166 437 -428 -107 -187 387 -187 -528 298 -134 -177
1219 -177 -137 -43 346 107 -76 -560 -32 101 -170 52 -831 359 492 23 -180 -672 -59 -87 285 179 -274
1240 -274 229 177 -163 149 168 -258 210 223 -607 -418 -269 -376 30 53 65 65 -191 -263 23 -13 102 -254 -3
1263 -3 -66 152 356 514 -94 -549 356 -425 -307 -189 -60 294 -431 583 478 167 -44 142 -345 109 362
1284 362 -97 -559 284 100 -209 -3 -604 360 1 116 356 -676 -201 -345 -392 -95 -239 -94 -344 31
1304 31 -54 231 -136 -169 166 -65 198 -382 74 -525 -166 -225 -417 196 755 33 -28 -56 228 147 -13 141
1326A41K41k18m61J95M03l18k29O32m37K11j60n60J38J084m89J27p22K52l3L0
1346a73K74r3J54m84K1M95j6k32q4L35K10l21l45K22j05j25j59L26N40m26k26
1367b12L81r9Mk54J42k18N53j76q4j07J08p9o4qK78k34m43O95j93L37m56m8L63
1390A86M36o56mL23m05J47J4K86k14N8km69N68J57m46L7j81K29j44J10L28m63
1412a05k29N16P8k63J07j2k59K82l11j60M13J2j76O1J60O2n70J28L68O0l08p89
1434i35P04J107j182JL72L0Q4j04J98j48J52j59K60p17K54J62%j123J313p54K55
1455b30l15N36M0k99N70j76j78j07K00K58l56L09m28J83k11KL55j47l1l01L08
1476a8L96l26L54o97N45l96L60k99J19p0k30K73j11K77r42P09NL29l56K86l61
$$ plain form
1326 141 382 164 -297 -102 301 -17 -246 386 -51 160 0 -560 -422 662 173 300 -422 -170 -203 -173
1346 -173 101 8 162 -322 -301 194 178 -54 -138 197 407 86 -259 -37 -142 -267 -426 -100 440 14 -212
1367 -212 169 70 74 -180 -38 -256 297 121 37 -70 38 -41 -105 -113 165 -69 -512 183 -10 327 -129 -177 186
1390 186 622 -34 -38 285 -120 27 41 327 113 171 169 -300 268 425 -21 16 -165 64 -80 30 358 -105
1412 -105 -334 182 260 -3 104 92 -167 115 -196 -356 57 69 -107 -46 114 176 -394 -266 102 162 -146 -935
1434 -935 -231 876 -306 -305 67 97 181 77 275 127 279 120 380 -337 -83 79 79 -1044 269 -485 -230
1455 -230 -545 -9 31 -268 302 126 -52 -159 41 299 -57 252 -176 7 -204 -202 153 6 -25 -326 -18
1476 -18 378 52 406 -291 254 -142 218 -81 38 -32 -262 11 -100 177 -765 -56 -51 278 -78 208 -153
1497a53M44n12L61K34o40k14K13l26J250p99O97k52q62L44J23j0L62m44O41Qj372
1518i07M70N06l3r81R07M7n3K6J08j31J07K6J35k78J85m0P3oj03q7j65P12p53
1541b35j68L59q7J38K7Q8r4j22m3K73l05J47j63M36m16k78M85p9j71K36m8L91
1563C71p01N95m97j17N03R5m09M16j015N43O98k65Ok13N81p12M59k72L39p28L10
1584a3k6j3o0K53J7o18L09P29o85J81m00J48O1Q8P7r5K29n02N80m8j68J85l81
1607a52M65k29l97K68L0Pn15Q75n73R65n60K4j42K37rm53J51M04m5J37n39j33
1629a84Mj51k97K77J210j011n1j62N91l73P5R57r19l69j02J9P22j92r36M71M67
1650D6l21J71M08o11N50l97Mk2M7K47k70J15R2k22j0Q0K58p2JK62p32N90r6Pn66
$$ plain form
1497 -153 291 -221 140 374 -266 -480 -267 -593 657 -142 555 303 -559 -215 -92 -102 260 -184 457 465 -907
1518 -907 -437 69 36 -945 -38 9 -44 -18 90 -41 66 92 227 -51 134 94 167 161 58 -29 -194 518 -235
1541 -235 -403 -44 -131 7 34 122 28 -94 -137 136 -169 -22 -185 251 -165 -443 42 -37 -208 28 -20 371
1563 371 -330 265 -232 -349 154 249 -160 256 -759 -216 482 217 223 10 591 -121 338 66 405 -323 -13
1584 -13 -39 -52 -112 141 158 -460 -151 578 -107 74 -326 -178 -117 -29 48 -47 182 -320 260 212 44 229 -152
1607 -152 313 84 -313 -45 -15 -8 -523 352 -221 744 184 208 66 303 294 -159 -8 396 351 488 -51 -184
1629 -184 -180 -331 -628 -351 859 -152 -203 -365 226 -147 -72 885 -34 -403 -505 -486 236 44 -892 -421 46
1650 46 -275 -104 304 -307 243 -154 -150 -172 -125 122 -148 -33 59 -163 -173 -93 165 93 94 356 -376 214 118 125 -441
1675d41L73R1m45N40o51J90K46J49K99l50k27m52O36j5o95J027l74J12k61R3k7
1696a82J37N98k51O8p07K73p5k87J19J52N23j38k30k76M86r18R40j11m51K80P7
1717B7j13N2K70K8k75k0m8M6k52M16l64L62j50n3k19L60k18O0k84M04K96n88L75
1740A12q86M1J519p82J00J18n28M27n94N74n29L03J12M2N1k41M06j86j14K65j25
1761H5j27L4K44m10J34o2N1J4J47j5q5Lq4K10n9k12J45m1J3J18j60M9k07J36K02
1786A23k02p4L24j96P1j0P0j35M03q62O13M91j26n79J40k88J77J35j6o41P36l9
1808A15l29m14K47M99J53k73j23k79K91L06k39Qj36K80k6j57Q2o1j7j4M41l51
1830Cn99O56J15l89j02J26r7j35K25r2N4M53M09j300K28N56j44O7J68j43m62P31
$$ plain form
1675 -441 -68 23 -422 118 -533 -343 -97 52 351 1 -226 -678 -42 -57 -752 275 -99 13 -248 -155 -182
1696 -182 -45 553 302 370 -337 -64 -139 -426 -307 -155 368 230 0 -276 210 -708 232 121 -330 -50 27
1717 27 -86 -34 236 264 -11 -31 -79 -33 -285 131 -233 129 -21 -74 -293 67 -151 -91 -375 29 325 -263 112
1740 112 -774 -733 786 4 104 222 -306 121 -473 101 -428 -125 -13 29 80 -161 245 59 -55 210 85
1761 85 -42 -8 236 -174 -40 -102 -51 -37 110 95 10 13 -71 139 80 -132 13 -28 -15 103 -57 -8 -215 -79 123
1786 123 -79 -153 171 -25 46 36 106 -29 374 -488 125 616 490 -89 51 -237 -60 75 59 -582 154 115
1808 115 -214 -628 -381 118 271 -2 -125 -404 -113 193 -46 -38 -174 106 80 -77 5 -56 -73 -87 354 3
1830 3 -596 60 175 -214 -316 -190 -287 -422 -197 -289 -235 218 627 -673 -445 111 -33 34 202 59 -403 328
1852C28%j42K60l86J46k52j74M48l12K36J01l00l85L5K65J27j85N09k80j86M8
1873i9K19q3K60p84o1O42r19R89R6r43l88J642p20J94j27NJ05O5J43l52L23k11
1895dJ6j22J84k27N51m75J15j94K69L4j61K01j36k32L0j94N43r1l84L35J19O9
1917B46l67J96l15J94m1J05n4O2j7j77k8K91j79K9J23l57N82nm25J20n7K05l4
1940I7k92L10%l09J75r7j24L28n8L7k07J8NL61l27J74j18J04o2P1m7K93k81k03
1964a52M9K1L07L4m04M10j01o09K22K02l58M03j60J05%o1P2P9j63J69%J38k64
1987f1p6j10K71M7k40J98J3j39k3L45l01k37L31K38m44J61P61k19l58k1L52j26
2009C62p30O59l69K22M2m92k15k3J47K4P95r99M46k61K91j77L22r23P40K89m38
$$ plain form
1852 328 328 186 446 60 206 -46 -220 228 -84 152 253 -47 -432 -397 -132 -5 -190 319 39 -147 -99
1873 -99 120 37 297 -487 -548 94 -825 164 260 -683 -1071 571 -149 45 -82 -77 28 93 236 -116 207 -4
1895 -4 12 -110 74 -153 398 -77 38 -156 113 147 -14 187 51 -181 -151 -345 198 107 -277 58 177 246
1917 246 -121 75 -240 -46 -87 18 -36 26 9 -168 -196 95 -84 -55 68 -289 293 288 -137 -17 -74 131 97
1940 97 -195 115 115 -194 -19 -116 -240 88 30 67 -140 -122 -117 244 -83 91 -27 77 15 86 39 332 51 -152
1964 -152 -103 -82 225 259 -145 265 164 -445 -223 -21 -379 24 -136 -31 -31 -92 -20 59 -104 65 65 203 -61
1987 -61 -137 -247 24 71 -169 29 42 -97 -120 225 -76 -313 18 256 -188 -27 734 515 157 136 488 362
2009 362 -368 291 -78 144 186 -306 -521 -544 -397 -373 422 -577 -131 -392 -101 -278 44 -879 -139 150 -288
2030b88Q62j438Q10j97K99K06l89l18O15r85N69R7j00J96l67L82n07N24MN18k14
2051B79m81M7K32k52K12O9l80J53J46j18L3j44K40k46J29j0Q0K1J09k45j28L00
2073D6l0k24K69j81J62K67n79N74o60M64j4m1k40L74k24j04jK87l33K19k4m17
2095d10L05k22J104j008k52R83l93l46k9M73m28K47Q00j003j14M25J06j97j58
2114a17j00M32j86L6nj83K10k92L59o5L3j79p6L49k43J40r4o3k2j20P13j99m49
2137a21K03k24L39m54m7L26lj0j67N51m53j05N08k41l51Q8Q8nK39k17q5K24O1
2160A44l31L54j37J67k37q2K13j14J16p0j1M2K4J6l8Nm3p1Q8l5Q4j31L84k46l50
2185b59L12J65j42j33k99L91K9K2K24m10L83l22qm5R8j28l1J91l5J06k55L8k06
$$ plain form
2030 -288 574 -864 -54 -251 48 254 -135 -453 162 -823 -254 -157 -257 -61 -428 -46 -553 -29 -25 493 279
2051 279 -202 -155 77 -175 37 106 -274 -121 25 -93 -60 -204 36 -210 -81 -91 -11 10 119 -126 -254 46
2073 46 16 -208 61 -120 42 309 -270 304 -356 108 94 53 -187 187 -37 -141 -142 145 -188 31 7 -410
2095 -410 -105 -327 777 -231 -483 500 107 -239 -268 205 -223 24 824 -179 -293 132 238 41 -117
2114 -117 -217 215 29 65 60 -123 87 -205 154 89 122 -57 -133 216 -27 113 19 -44 -66 -186 527 328 -121
2137 -121 82 -142 197 -257 -304 22 19 9 -158 393 -60 -165 343 102 -249 -161 -73 -78 161 -56 -141 83 144
2160 144 -187 167 30 197 -40 -122 91 -23 93 23 12 54 78 94 56 61 18 -53 35 0 84 -47 337 91 -259
2185 -259 53 218 76 -57 -356 35 64 86 310 -100 283 -39 -47 -92 6 -122 -153 38 3 109 -146 -108 -314
2208c14J41n5N18m52J23K31Q5k65P3K5k2l8r6k68R22k73m19j09j67O37l88L5J33
2231E7K49k30O9Q1k50j27J07j44L39k23J66j26m43M67j08P5M2k4J37k91J92j95
2253a80J77q1K96m47L61p39J44O56n17J76l19o2K47M71m37L79k59R5j77L67j46
2274EK65L76q12N00m92J41K99nl30lL79p50R8P40q6j19j038P58N7j77M67m07j43
2297b77N44k6m80L51j11J93k15L85m32J2R4J79k91K40k95o7L60k11N0J69j93R6
2319G5m5K0k75J72J71Kl1o9J15l04J68l8M0p3q2n6J35K66l88K97O4k24r4K07l5
2344A8k11N11m41K29j26o7J59J05K28p52K37J26j86J65K55k10m8j08J49q1P4J53
2366A79l7k44K05m1M1j60M6P4j60N1K22j39j17K68k03j30L1j9P7J13qP6Q3j36
$$ plain form
2208 -314 -173 -228 290 -162 -39 192 277 12 85 110 88 50 -46 -314 608 335 -84 -193 -360 277 -111 -76 57
2231 57 306 76 145 226 -24 -151 -44 -188 151 -72 94 -32 -475 -8 -116 -41 1 -23 114 -177 15 -180
2253 -180 -3 -84 212 -235 126 -613 -469 187 -330 -154 -473 -535 -288 183 -254 125 -134 -39 -216 151 5
2274 5 270 646 -166 334 -158 -17 282 277 -53 -56 323 -427 -329 411 325 206 -832 -74 -17 -194 273 -134 -277
2297 -277 267 241 -239 112 1 194 -21 364 -68 -56 38 217 -74 166 -129 -196 164 -47 3 172 -21 75
2319 75 30 50 -225 -53 118 120 89 20 135 -169 -1 -39 1 -72 -154 -210 -75 191 -197 100 164 -60 -154 53 18
2344 18 -193 318 -123 106 -20 -87 72 177 405 -347 -110 16 -170 -5 250 40 -8 -116 33 -48 26 179
2366 179 142 -102 103 62 103 -57 -11 63 -97 -46 176 37 -80 188 -15 -145 -114 -133 -56 57 49 125 208 72
2390G2q5j52M70m49K59MP9j30n5j60N8J20p2Q1O98n89j42J37P5j88k02J93J54
2413A76k75Q9K2k54K70j96K10l48N26j87j70J74j2nq0j52J63J78m2j73P1k47J56
2436a06O9j06L70l53J60j87J38N3L38l07J32k62K06k40m0K58K25K38k79K7m53
2457a19L96J85n9j94j80l24M04l8J79o73M39P1L6k15Q8L35n12L3j74L22L31m39
2479a08K36l80M55l53L44m58K00qR1m1J28m2l04K6j88P12k57m24K29N09n18K00
2501D9L90o68K26J033r68j18N54m1M11n6r24L69l76J15O34k28p31k05L90J55n4
2522d3J04j0j42On7L2q5M46L77n52k22J46J00mj68j96L57k23J12K22l15m25M01
2545a39L89k24q7K34q3k72k44K47j28j20O73O18j692J190l52L42L9m22q9l9J31
$$ plain form
2390 72 -13 -165 305 -144 115 119 198 68 13 -147 -89 31 -41 40 738 149 7 144 219 31 -171 22 176
2413 176 -99 -10 12 -242 28 -168 42 -306 220 33 -137 37 25 20 -60 -212 -49 129 87 -86 -15 -262 -106
2436 -106 -37 -143 227 -126 34 -153 -15 38 376 69 201 -61 145 -95 -135 123 348 586 307 334 -119
2457 -119 277 462 403 209 29 -295 109 71 250 -423 16 87 123 -92 -4 331 -181 -148 -322 0 331 -108
2479 -108 128 -252 203 -150 194 -264 -64 -72 19 -22 106 64 -240 -214 -402 310 53 -371 -142 367 -151 49
2501 49 439 -229 -3 1030 62 -56 498 457 868 812 -112 257 -119 -4 630 402 -329 -534 -144 11 -43
2522 -43 61 51 -91 -85 -142 -110 -195 251 628 76 -146 0 100 96 -72 -268 89 -134 -22 200 -115 -540 -139
2545 -139 250 26 -61 173 90 -182 -426 -179 -307 -427 246 864 -828 362 10 352 391 -31 -120 -159 -28
2566b8q6R5R8O3j7k34J76j81J95k21K49l4l48K55K1j6j93L59j99j1K2rK21k44
2590f7K46l49J92j17J12m1n7O5o6k16L92r2QKR4k53j45J95L43j66k02k8Q1K74
2614B05k74o8N5n5K63N9m1k97N0l2K12j05O5J2R4k46l42L74J74j88j22L86k19
2637d0K17N0r6o6o4J78m4J06n84N14k39L1j4j3K79kk59M03l57O0L2o9J50k75K76
2662A74j24n3j55N00q73O70l72r0K11J57K26k74M0K43j06J5j34Q0k47R2OK0K30
2685B36k53j12j45L04k52O85J56k84n84L13m07K06K74k13M10o50K87np16M85j38
2706d03j71M63p43J324j87J8j152Q10j002J649L72j229q1O66m57j29Oo30J231
2725C55p73k40J045l94K02J71n36K54j61mM78o89q1O05M40p50K9N8j226M41R46
$$ plain form
2566 -28 -114 -19 79 142 125 -109 67 -114 81 -140 109 75 -273 -18 3 -13 -206 153 -46 -57 -35 -44 177 -67
2590 -67 179 -170 22 -95 17 -24 -81 -16 -82 -298 94 2 10 12 106 -147 -292 -97 246 80 -122 -150 -69 205
2614 205 -69 -137 -82 -137 126 185 144 -153 -103 -135 77 -28 37 49 143 -103 -445 -71 103 -85 -207 179 -40
2637 -40 177 227 131 65 1 179 135 241 -343 171 -68 -37 -51 -64 215 213 -46 357 0 60 92 23 173 -102 174
2662 174 50 -3 -158 342 -531 139 -233 -323 -112 45 271 -3 37 280 174 189 55 135 -112 -20 -14 6 236
2685 236 -17 -129 -274 30 -222 463 619 335 -249 64 -343 -137 137 -76 334 -316 -29 -34 -750 -265 -403
2706 -403 -574 -111 -854 470 283 301 -851 -41 -1043 606 978 -251 -332 334 -123 -252 -246 -876 355
2725 355 -418 -658 387 -7 195 366 -170 84 -77 -81 397 -292 -373 232 672 -78 -49 9 -1217 -776 170
2746A70l56N18o84J95j33K8O91o01P85m90L47j60L31k27m17k01n29O20J25N82
2766E94j038R56k65l24M78K9j62p35L41M41J73l71n8L96P4n07m44L96N98j29l62
2787H1Q8j54l7J56j17q7Mo6j01J55j31J84l2J49j66m01Q01l02m03N8O71j098O23
2810a25j28J036r82k35R76l78o09N18j94L16j77m95L80Q8O1l7r0LJ34l2k28K70
2832G2k26J59J55r9j14j96K91j02m36N27L96n86J83l02N11m35K99l60K88j01J06
2853C0j29J1L74m38k6M50m08O06o84k19K78L41J61q96J323o41j38k41J192j083
2873a37j97M88j73O45o92L98l14J43r21O9P04K35n83K38j06K07K45o6J13l97L85
2894B84k66J5l05K50L73j84k36N5j30J49J09j02r5K01o95P97o7j74K52l06J38
$$ plain form
2746 170 -186 332 -352 -157 -290 -262 429 -172 613 123 470 310 641 414 -3 -204 -733 -113 12 594
2766 594 -444 512 247 -77 401 430 268 -467 -126 315 488 117 59 455 529 22 -422 -26 572 443 81
2787 81 169 15 -22 134 17 -70 -66 -132 -233 -78 -209 -25 -57 92 -74 -475 326 24 -379 -321 350 -748 -125
2810 -125 -253 783 -199 -434 542 164 -445 73 -121 195 18 -477 -97 -9 52 15 -75 -72 62 30 -198 72
2832 72 -154 5 160 61 -53 -249 42 -60 -496 31 427 -159 24 -278 233 -202 97 -263 25 -76 30
2853 30 -99 -88 286 -152 -178 272 -136 470 -214 -433 -155 186 347 -549 774 133 -5 -246 946 -137
2873 -137 -334 154 -19 626 -66 332 18 161 -760 -691 13 248 -335 -97 -203 4 249 183 296 -101 284
2894 284 18 33 -272 -22 351 167 -69 -14 -144 5 114 12 -83 118 -577 220 153 -21 231 -75 63
2915F3j13JJ11j05O1L7k49R6K3KJ21j80j93O66k80m3J18l49L12J7J5n8K8j83k38
2940c20k0P6K08r8K25j73J22K2k30J79P7pl45J47K48R2j71J59k96K32k11K54k50
2963h0q5P4M57n04K38n89M30j7J01J80m08K38mn1n6J03j53J55k11O7J80k27NK61
2987A04j81L30k64q8M1J56j83L5OK34j69o0j00rJ6K25j00K8j70M0Q5r4J3J29r5
3012g1k61R9L45q3K4N2p6m9m0K05k2q9j0J04j3ll11K87l0J00k70J16Nk16K45L0
3038F8j19K11k50K02j3J46l98J11j79N43n64j82L75J71k17J40J33j56P3j20K45
3059B20n2j03j71K64j44o8J03N6q4J30J10m38K59J09o1p8j01k2J12k45J53j18
3081a69J61J32O8k56M8j32K51k02J38J76l79J73J03P9N3o9m06k17L87J94P4K47
$$ plain form
2915 63 -50 -49 62 -43 18 55 -194 -98 -75 -73 48 -132 -325 341 61 18 136 -213 99 116 131 73 101 -82 -320
2940 -320 -340 -264 -56 -154 71 -102 20 42 -188 -9 68 61 -284 -137 111 203 32 191 -105 127 -84 170 -80
2963 -80 -165 -91 366 -138 100 -489 -59 -76 25 205 -203 35 31 -20 -76 27 -126 29 -182 -115 65 -162 -157 104
2987 104 -77 253 -11 -99 -58 98 -85 -50 -44 190 21 -39 -139 -148 -132 93 -7 21 -149 -109 -24 -118 -105 24 -71
3012 -71 -332 -233 112 29 53 105 29 -20 -60 145 123 34 24 128 115 112 -199 88 58 158 -112 4 9 -207 38 68
3038 68 -51 160 -90 112 99 245 -153 -42 -221 322 -242 -424 -49 122 -95 45 178 22 95 -25 220
3059 220 168 65 -106 158 14 -54 49 105 21 151 261 -177 82 191 130 52 -49 -71 41 -204 -51 -169
3081 -169 -8 124 192 -64 -16 -148 103 -99 39 215 -164 9 112 191 244 175 -231 -448 -61 133 207 454
3103D54n10j55J394l61r81P2N5j5L1O5o2k44M11J4k03j93K45r7n7J80j11J00j69
3126a37K96k82m8j1K28L57o18r3N41m75L64j41K49n30R93l84j68J35k71k5J48
3147A28m9L8k33k7N9p8j71O04n36M90j82k86J99p0j2P0L54m75l37M67MJ28Q4l81
3171b12P0j23K94M0r2m5J18LNn4N1K28k15m62M26m26Q64k64l31J70J95r56P85
3194F9p09O13K18M55j185P71j45k2l02j42N24l86N71m93K71M72p96P56j235J054
3214C59n31J594j068q5L3p74J93L22L1O81j212J119o68RK30p8m84N08k90P55k54
3235C90l55J45m07K62K14l16M11J37r44M63J40J59K19r51J272r69J87n8n81J325
3255G43o52L54m83K10m96j31O94j46l77O29J01q91L62K07r0J01j45L03o35L71
$$ plain form
3103 454 -56 -211 1183 822 -159 -87 -32 -47 -16 49 -13 -257 154 168 -35 -228 17 -80 -137 43 -68 32 -137
3126 -137 159 -123 -171 -182 46 403 -215 -308 233 -242 122 -19 230 -300 693 309 141 276 5 -20 128
3147 128 79 117 -116 -143 -84 -162 -333 271 -265 225 43 -243 -44 -114 -126 -56 298 -177 -514 -47 -43 85 169 -212
3171 -212 -142 -265 29 69 -23 -68 50 53 58 4 55 283 68 -394 32 -394 470 206 -125 45 240 -716 69
3194 69 -640 -27 191 646 -539 232 87 65 -237 -379 145 -241 330 -163 108 580 -216 540 -695 359
3214 359 -172 1422 354 269 302 -472 -279 43 74 755 -457 662 -6 3 233 155 -329 179 -111 644 390
3235 390 35 180 -227 35 249 -67 344 481 -463 0 140 299 518 -433 839 -130 57 -1 -582 743
3255 743 91 445 -38 172 -324 -455 239 93 -284 345 446 -445 -83 124 34 135 -10 293 -342 29
3275B9LJ14k77m6K61j45J48q9k8j82L39R0l77P01n7q03Q68q22m93k13Q03P68j054
3298d62J160j11n97n4k78J108p75J044q14q08K21L84M10p63J68k70Q3P16J47j207
3318f98k81L27J033n24N50n79K7J23j58j65K95N46n40L60o29o63J398k88k94J61
3338Ap37N80K38j28N14J16j95J86o68L42J39m78Q2J94j55j19K13Q0l45K55m3l3
3360C9K07j35lm05J78l8j87L85R9l40K77n4k4j9j42K60k15L4k0J29Mj43M7m0J72
3385F6j18J5J54n4j81N13k81l12J88R7k9m7N9R6l2m70M37J78k05m0N3k44M56p9
3409B20k29p2L20j43n8J21Q8k20m7N2l6J09p9k98N0J66n9J28pm1m08K15J92Q0
3433D4K6m8J06K30n94K01mK94k54O5Qj04kl7Q7m2J09J44o9j91J87l09J77Kn8R8
$$ plain form
3275 29 32 146 -131 -177 84 -61 87 -2 -30 -212 127 217 -160 541 484 -319 549 -273 -766 -979 -176 592 -462
3298 -462 698 587 -10 -64 -342 766 -9 1035 221 -587 -366 18 428 -335 -167 -437 -354 362 509 -698
3318 -698 -979 -652 381 -143 407 -172 -145 -22 -180 -345 -50 496 -44 316 -313 -976 422 134 -160 1
3338 1 -736 -156 82 -46 468 584 389 575 -93 249 388 -90 -8 186 31 -88 125 205 -140 115 72 39
3360 39 246 111 108 -297 -119 -157 -344 41 140 -200 77 23 -1 -20 -162 98 -117 -83 -103 26 30 -113 -66 -106 66
3385 66 -52 -37 117 63 -118 395 114 -198 -10 87 58 11 70 166 134 -336 101 279 74 34 87 -157 299 220
3409 220 -9 -81 239 96 38 159 247 27 -20 32 -4 105 26 -272 -222 -56 -115 13 6 -35 -443 -228 -36 44
3433 44 70 22 128 358 -236 -35 -39 255 1 66 74 -30 -32 -69 18 -24 85 229 160 -31 156 -153 24 26 -32 66
3459F6J4j31K4Q1l8K02j94J03l37K52N3k95J35M5k77K70n4R8o1j8J6l1K41j32
3483C2k9q7M4l2p0J99m0j34M2N0K3K08k48K14J5k59M4NJ21k07J18K53l29j07p8
3508b52K23L9j06N6J72r2p0P0L3j12O2j00J41j52R0L35m14K64O1k48O7n4k5J58
3532A46j14J93j07l9l3J64k95J92k3r8M7L8O8m8k25J34J3j69J32Q1Rj37J75J13
3556B17k52M1q5J17o1J49j07P3j05j3M1N8j67r3K99j5j20O4k89N33k81j04L9M4
3580a7k29L24j95M5K7o8JL17m31M26n8k75J2J37R4k99Q8K18k59K16k9Q0j17m3
3604c5n9L5L4j61J72k28L74j38j51oJ4K42J12j85R1j24k03J71Q1J90k92j57J12
3627a11%J20j98L85Nm12m3K53J04j95n3R4P0q6K08j40p0J32j77m5J82j65m5J33
$$ plain form
3459 66 80 -51 -27 54 16 218 24 127 -210 42 95 -200 -65 -20 -297 -27 -81 17 -44 -62 -46 -77 164 32
3483 32 3 -84 -40 -72 -142 57 17 -117 -75 -25 -2 206 -42 172 187 -72 -28 -23 98 -109 9 262 -67 -174 -252
3508 -252 -29 10 -96 -40 132 40 -30 40 73 -39 23 -77 64 -88 2 337 -77 187 248 0 67 13 -12 146
3532 146 32 225 118 79 46 210 -85 107 84 -14 33 71 139 91 -134 0 13 -156 -24 57 66 -71 104 217
3556 217 -35 6 -79 38 -23 126 19 92 -13 -26 15 73 -94 -187 112 97 -23 41 -248 285 4 -100 -61 -17
3580 -17 -246 78 -117 -72 -45 -113 -112 205 -226 200 142 -133 -121 16 110 -189 -101 117 -142 74 45 125 8 -35
3604 -35 -94 -59 -25 -186 -14 -242 132 -6 -157 -163 -149 93 205 20 111 -13 -216 -45 36 226 -66 -223 -111
3627 -111 -111 9 -189 196 201 -211 -254 -1 103 -92 -145 -51 19 -67 141 1 -69 63 -114 -159 23 -142 -187 -54
3651e4p5J64K00l18N3L25k72j35M7j90J46j1n0N7K66j82k8J12j83J70L7Nk69O6
3675a19K55j35J77q9q5K32k69o0J01K44j86n1k01K28J5J79l70J2O8k2J76r9l3
3698c2J57L6m20L96k99j8K15J5p2Q2p1j86M24k63J15J43j62k48J76J25L3m14L04
3721C6j51R3l8J20j25J12J62k50J7m8M9k0J88j27n1oJ16j23M37q58J27o5J44O10
3745C49N9n19Q9j055N86M48J7K75l16J029r42k00o81N33N86l39P41j081N18j73
3765g6R2Q2j50j02K13n5R3j56P9J16n3n3P3k17l26K62j77L79M9p4J28l13L76j13
3789G7K1j79N2M1j59J06N2j81J20K17p7J5j95j08L83l64L31j05j69L40k47mJ70
3812A37j58k50L68p4r8J92J45l37J29Lp4j57J94K0K30r4j38j05j5jP7J07j06J54
$$ plain form
3651 -54 -129 35 235 -83 -30 295 23 -112 -65 -255 -109 -120 -170 -113 153 -29 -57 55 -128 42 79 84 -185 -119
3675 -119 136 1 178 89 4 236 -33 -93 8 252 66 15 -186 42 57 236 -134 -122 -54 -76 100 1 -32
3698 -32 125 161 -259 137 -162 -180 35 50 -22 60 -11 -197 227 -36 79 222 60 -188 -12 113 146 -268 36
3721 36 -115 -22 -60 60 -65 47 209 -41 -24 -72 -23 -43 145 18 -33 -39 77 -46 391 -467 -340 -405 -261 349
3745 349 408 -111 -22 -1077 -491 -43 -26 249 -67 962 20 -180 -861 -328 258 -81 660 -421 97 -76
3765 -76 16 98 -52 -154 59 4 97 -59 20 136 83 30 103 -114 -440 -178 -355 24 73 -1 127 -186 190 77
3789 77 98 -81 -29 12 -147 -41 11 -170 -50 167 90 105 -90 -198 185 -179 152 47 -122 218 -29 -33 137
3812 137 -21 -271 97 23 -75 117 262 -75 54 57 -17 -174 20 40 270 176 38 -67 -82 -83 -6 101 -5 149
3836A49n1j43N9qr8R6j32L43j47j28J32j59K19r9O7O19p27J64k68k5N6K0j8l91
3860d70O15k2m48L31k5L76j11k19j54L36l20j26K26M6J77l27K47j55J91o1m45
3881c38J89j10J0K71K88k97q3j69M60p95R28m94K72j05j69L44l10j85Q2J61k27
3902b77K88P27q86j68L45J31p89Q25j106J022L16j92j44K55j389J303k78k65K96
3921A4n59J106l85o46o65P12P96m71M30j893K224p95m43J519k562J095m85J585
3939E77j421R61K82n74k69p00P51J267j306J039j164j97P63N30J9j191J60O31
3957A58N14m65k96k01Q25r49Q42n36K40Q0j75p94L86J25N43m05K49J44O0l22K35
3978B58l4q95L16k53K6N59j25J89k8N8j91L84j86L7Ql62N02J2j54r94P98k69m33
$$ plain form
3836 149 98 -45 14 6 -92 4 -128 215 68 -60 72 -87 132 33 100 719 -8 156 -112 -137 -81 -61 -79 -470
3860 -470 145 123 -325 6 -19 357 246 27 -127 209 -111 -237 -11 35 212 -115 132 -23 168 107 -338
3881 -338 -149 -259 -249 22 310 13 -70 -239 221 -574 354 -140 132 27 -142 202 -108 -293 -211 -50 -277
3902 -277 11 738 -148 -316 29 160 -629 196 -910 112 428 236 92 347 -1042 261 -17 -282 14
3921 14 -545 561 176 -470 -1135 -423 373 -98 332 -1561 663 -132 -575 944 -1618 -523 -1008 577
3939 577 -844 117 399 -175 -444 -1144 -393 874 -432 607 -557 -754 9 539 558 -633 -473 158
3957 158 672 207 -89 -290 535 -414 428 -108 132 212 37 -757 -371 -246 297 -108 141 285 345 23 258
3978 258 224 -671 -355 -608 -582 -23 -148 41 13 71 -120 264 78 115 123 -239 263 275 121 -873 -75 -344 -777
4001g77O67N00j189j8R32K28R7J6k64r5oj82N6j47M20k26K60m01O8N7N8r7J29
4024H6k78L80m26n87O70J88M60n14L30m27O6l50M23j9J60m04L01Rk13j8K37q7
4046a3qj68K11nm2J7J72J9k75K38o6l72m43Q56k79o0K16p02N27M3P4J36J57k06
4070B7j74M2k4l5K93r6J15k47L1J44j7m2k04j2L61j81j22L46l23j41K07l2M7j62
4094a99K57j70J34l5K71l89P0J2p74L51J27R50l00j78n8k42P9p51Q77J39n26L98
4116D3Q4j92J45Q4j22n2N0L8j07O2N1l21M17j23N9j25J46j83K84m90n5M78l50
4139a79K16j11J93j64K49m85N50l50Q9P0k52L04J35k58j05r2N14j52m15j66J07
4160c02K39J48J31j62K71l07jP2j24L20m39K84o0k47K34j91J26j25J5R0K19n1
$$ plain form
4001 -777 -110 390 -799 -817 115 343 440 456 192 97 91 -91 -35 -182 238 12 272 -129 -61 -4 54 -43 86
4024 86 -192 188 -238 -825 -155 33 493 -21 309 -118 -52 -402 21 2 162 -242 59 68 -145 -163 74 -13
4046 -13 -21 -189 22 17 -25 -8 164 183 -92 146 80 -292 -735 121 -158 -218 -2 -704 -177 -134 -60 76 233 27
4070 27 -147 -105 -129 -164 129 33 148 -99 -68 76 59 17 -187 -199 162 -19 -141 205 -118 -259 -52 -84 -37 -199
4094 -199 58 -112 22 -13 258 -131 -61 -49 -823 -472 -345 605 305 127 69 -173 -94 -845 32 171 -355 43
4116 43 127 -65 80 164 42 -10 40 78 -29 33 84 -237 180 57 116 -9 137 -46 238 -252 -307 171 -179
4139 -179 37 -74 119 -45 204 -281 269 -81 8 78 -174 130 265 7 -98 -190 324 172 -243 -409 -302
4160 -302 -63 85 216 54 325 18 17 89 -35 285 -154 130 70 -177 57 -134 -8 -133 -118 -28 191 140
4182A40p1j1r0M3j85Kj07M97n7q5J73j70m2j00K30k21J13j34J65j95M26m14L54
4205B61j38K1l76J28j49L94l68N91j57r0l37j14J78J42K48r1J158k052R26N29
4225G04j859J043L16J79r1m05J11P9j18n2j98L96q1l7L2R6M9j54m4q94R41O59
4247F72k73K32o33l42K70J76O1M18l96p51Q42k23n52N44O3L55o36O18j43k17n24
4268d39J207n08k8j84j460K108n72l86J15J33N4j437P56k38q8Q18M73m07l04N46
4288A59q32O21K95m23Q51p68J77M82j017O48J07l10o7J23p05P54l47O37j109M93
4308b31M74q23O42K69k86k94N92j08l75l17N25j91j36J76M99m30J5j00k66J43
4328b22J6L95n8k27L60O1o5k84R0k88J54R3K46k82J47j89J78k22n6n0M96l19k00
$$ plain form
4182 140 69 58 -32 11 -174 -172 -279 218 161 76 249 79 37 -63 167 -54 59 -75 90 -105 321 -93 261
4205 261 123 144 -232 -104 -253 141 -227 364 207 117 -220 -334 -156 -14 234 143 1301 -751 175 704
4225 704 -1155 -112 204 383 292 -113 -2 77 -41 -93 -291 105 24 -13 19 115 164 10 -34 -928 13 672
4247 672 399 631 -2 -344 -74 102 163 581 185 -566 276 53 -499 45 108 463 -173 445 302 85 -439
4268 -439 768 260 232 48 -1412 696 124 -262 -147 -14 40 -1397 -641 -879 -967 -149 324 -83 -387 159
4288 159 -673 -52 243 -180 671 -97 80 562 -455 193 300 -10 -77 46 -659 95 -252 385 -724 -231
4308 -231 243 -580 62 331 45 -249 343 235 -140 -457 68 -123 -259 -83 416 -14 1 -99 -365 -222
4328 -222 -206 189 131 -96 264 325 260 -24 66 -222 -68 25 271 -11 136 -53 125 -97 -153 -203 293 -26 -226
4351b26M8J97j10K59k8n7m45M90j72P4O88j269j64J393o71J96n00M2O23k1k06
4372A41o0l51K65k3L90n35L27J15J7rn14K83l98J74J54P98k90m23l48R14p59J28
4394dK1LM42j161Q68J79r03K82P91p51k3K43J48r9J97K53m90J89o7r2l14K54J30
4417I6k04K6J91N09p97O62m11k21Q37j205M17Rj71O62l28Q47j099O51k52j53l15
4438b49N42L54l69p50N17L44K93q87k40J066p79J136j094k87K17k37O5J69Q83
4457F94o33M21K8p87m95N63Q3N35n14j62K61k55M03o6j90l5J86k36J68L86r0L9
4479C04PK4j71l39K60k97N72r29Q02n76R35n29k95O6P42k78N9j006K08J08l68
4500g01Q14P44j254P07q71M08j30M24k77k47N48J37k14j173N83o94O55M53P31
$$ plain form
4351 -226 -178 19 -91 168 140 83 -362 128 -44 30 718 -551 -715 678 7 203 -297 -255 368 347 141
4372 141 81 -270 -5 -28 362 -173 154 269 286 277 -237 46 -352 -178 -24 774 484 61 -287 627 -132 -4
4394 -4 17 20 462 -699 169 348 -555 -273 518 -233 -256 -13 135 36 233 486 -4 185 118 26 -288 -34 96
4417 96 -108 -82 109 618 -179 483 72 -149 688 -517 -100 -91 -262 400 72 919 -180 471 219 66 -249
4438 -249 293 647 278 -472 45 389 682 -205 -445 621 -158 978 -116 -403 -186 -423 -358 -189 694
4457 694 61 482 510 -277 -772 -209 -126 409 -105 -267 -6 -261 142 76 -114 -149 37 -199 -31 355 265 304
4479 304 311 335 164 -175 85 -212 360 -569 233 -343 592 63 -232 -166 576 298 357 -649 -441 -333 -701
4500 -701 113 857 -397 310 -561 -153 -283 141 -136 -383 165 302 88 -1085 -502 -1196 -541 -88 643
4519F43o70J30n52Q97p41K88M07K6o94N60j41j24j6N01n35l12N74K95j65k90Q2
4540A63o80R94o0k81N34p17l34M84J04j7n69K70j080J333J98l25L03n86O74j46
4560B62JN6L54m23k98L37p40L83l24k99M77K73k95p7Q23K72m75N55q61O07p81
4581a73Q6K59km81R86l79M94j143J26N03j60n0m85K73L35O4k08k7j7j58K37R7
4603A77l85K81j71J94m48K78J16j56K63k25Q9l11M80l11L6L8R3n17M48K9j18K28
4625A08n07J31O44j493J684l25k76N70K3jm99K6M0l2M9R6j90q2J44j79M29k65
4647I5k76L39j14K07m03k6K91j20n2l73N11J99o8j54ON17q82j56K62m10O81J25
4669A99m33j04K25K16q7l01k24O93K0L8l20M09o60K19j09N43l26m90J044o2j100
$$ plain form
4519 643 -27 103 -449 448 -293 -5 402 428 -266 294 153 29 13 514 -21 -333 241 536 371 81 163
4540 163 -517 477 417 136 670 -47 -381 103 207 190 -379 -109 -1189 144 342 17 320 -266 408 262
4560 262 263 319 673 250 -48 289 -451 -68 -392 -691 -214 59 -236 -313 510 782 307 862 1 608 -173
4581 -173 -87 172 170 -311 675 296 790 -353 -227 276 116 66 -419 -146 189 253 45 18 1 -157 80 177
4603 177 -208 73 -98 96 -352 -74 42 -114 149 -76 13 -298 182 -129 -93 -55 38 -479 -31 -2 -120 108
4625 108 -399 -268 376 -1117 567 242 -34 536 559 558 59 85 125 93 142 238 48 -34 110 -69 360 95
4647 95 -181 158 44 251 -152 -178 113 -7 -59 -432 79 278 210 56 62 579 -303 -459 -197 -607 74 199
4669 199 -234 -338 -113 103 16 -285 -509 184 204 242 -78 331 -329 -110 -219 324 -2 -492 552 490 -610
4690f10O17n55L08J59L49k63n25o56J745O56j364l08N35k12K15m18k53J902j054
4709B68J80n52o8K46J40K79j151nL07M11MJ2L25k55j21O10o65m38P62J80r38P53
4731B84l55m85n9K57J176q55L3K40n8K52l03L9Kk08K11m49L54m72m74J172l47
4752d5j16m89Q87m03r8p1K11L16q72Q47n75Q56j37Qj32K27k72j90r3J99l56p46
4774a044R12M75j020J038m0o78P79k48j64j1k08K75K03k08j36l34P78l71K85j53
4794A30k13J45N34n28J3O5l86K25q3J96k30N7k42M30j00n0K0J27k75J23j06N6
4816i2N2j6K67m83K69l11M21k14M5j63K57n0j48L36k23M6n90j0O14l90M77j117
4838a023l97J553n06O00k02P0k59J73J99k24j82j2J57K57j52o29Q52K14n17K09
$$ plain form
4690 -610 7 -548 -240 -81 268 5 -520 -1176 569 1225 -139 -447 88 -124 91 -327 -580 1322 268
4709 268 448 -104 -172 74 214 493 -658 -663 -356 55 59 71 396 141 20 630 -35 -473 289 469 -469 284
4731 284 -71 -556 -615 -358 818 -37 -4 236 178 430 127 166 168 -40 171 -278 76 -396 -870 302 -45
4752 -45 -161 -650 237 -166 -264 -335 -124 192 -680 167 -408 448 311 319 187 414 142 -48 -141 58 -298 -1044
4774 -1044 -132 343 -677 361 321 -357 422 174 10 -1 -209 66 269 61 -75 -409 369 -2 283 130
4794 130 -83 62 596 68 81 146 -240 -15 -98 98 -132 -75 -317 113 13 -37 -17 110 -165 -42 -148 -92
4816 -92 -40 -56 211 -272 -3 -314 107 -107 -62 -225 32 -18 -166 170 -53 -7 -597 -607 7 -383 94 -1023
4838 -1023 -1420 133 -373 227 25 95 -164 9 208 -16 -198 -210 -53 204 52 -577 275 489 -28 181
4858A81l88N34n37N99k40O6lk46Nk0J29j05J75J75j60k6k54J03o3J1J33j78M3
4881f6L6L03k72m46N74m4j56RQ4Q9n30K34J42j60M66r59J081n90J076p10n2O88
4903G97j041M14n59L11O7N61j214N02OL6J47n03N24pj09K85k82J02j52K04K83
4924C72o40M48q6l0J38j40J06j16j61K02j39K25n03J15L00n5k16R0K05M70n31
4945E4R4j89L17m25j52K37k65M33j50j76N9N6K57r1k61J7M77J4n6n29k79L98L9
4968a21J8K56j67J45l38K07j69L91l37L51k27K6l9K07l45J36M72n83rj40P5P31
4990E40q37L19j25J46M05m46J39j65P6J17j80J47L3k83K18j76J04j54K92k64J05
5011A1M3k56L16j45nP6k87J02P6R2K74k95j55l4K58j53K29L14l79J17k09M39p30
$$ plain form
4858 181 -207 327 -210 389 149 215 212 -34 -29 -49 80 -25 150 325 165 139 -115 -12 -75 -64 69 -109 -66
4881 -66 -30 273 1 -445 129 85 -71 -62 22 111 -419 -185 -43 -203 263 -696 385 -205 871 161 109 797
4903 797 -244 170 -389 -78 -11 550 -664 -162 -156 -120 27 -476 48 41 -68 217 -65 37 -115 89 372
4924 372 -268 180 94 64 202 62 168 52 -109 93 -46 179 -324 -209 91 36 -180 -90 115 585 54
4945 54 148 -41 276 -149 -301 -64 -329 104 -46 -222 -163 -107 150 59 -202 -185 292 306 250 -279 -558 -160 -121
4968 -121 -103 153 -14 131 -207 0 -169 222 -115 236 9 35 -4 203 -142 -6 466 -117 -126 -266 -191 540
4990 540 -297 22 -103 43 448 2 141 -24 52 169 -11 136 169 -114 104 -72 32 -122 170 -94 11
5011 11 54 -202 114 -31 -36 40 -247 -145 -69 23 297 2 -153 -187 71 -82 147 461 82 199 -10 429 -301
5034c01Q72n16j88K93l09K21k76M07l19N17l05l22M32k9m21K7M45j5j56K4J0l7
5056E4rQ9l40M12j71K43r7j64j11nK65k02j22J53L74p92M07m20L53l71M25K6j41
5079a44n70Q9J63N56k66%N69L64r85j38j86N96M58l59l53p91O48k40m14P12P57
5100D66o32K98j16n31L76L01j3j33k65J7J80J02k66j59J046p86r9K88k30l60L30
5121a86J62L41p15R4L0l82K68Q48m54K0L01K1j57K12o34L02P72j011mO30o4m96
5143a02N44n42K53L6j54P5r0j50J70O8k1J3k17J55l29P26l48l58N10m27N7O5J59
5166I3r6O2Jo4o6k13K58K77j56n0N0k78J0J09j39K12K58m31J7J66n5J35k53J40
5190a3Mk6J57j4m7j22J2K18k59q7K91J5j01k70M66q8l8P3j74J02R9j56j42K16
$$ plain form
5034 -301 571 55 -133 160 -149 72 -204 203 -116 401 96 -226 206 177 -244 -217 228 213 57 81 91 54
5056 54 45 134 -206 206 35 278 181 17 -94 -99 166 -36 -158 -5 369 -423 -16 -436 -83 -454 -29 -3 -144
5079 -144 -714 -625 -462 94 -172 -172 397 761 -224 -362 -548 48 506 147 -206 -997 -349 -589 -1003 -291 466
5100 466 -166 132 16 -515 -139 162 149 16 -249 -232 -52 50 -216 -375 671 -115 -214 74 -156 -516 -186
5121 -186 -24 317 -398 -304 -274 -656 -388 460 6 26 327 348 191 403 -231 71 843 -168 -172 458 394 -102
5143 -102 442 -100 153 189 35 110 20 -130 40 108 87 100 -117 38 -291 435 87 -271 239 -188 -131 -66 93
5166 93 -3 59 60 -4 -70 -283 -25 252 96 46 96 -182 -172 -63 -202 10 268 -163 -146 20 -35 100 -153 -13
5190 -13 -9 -35 122 108 61 -61 -49 169 -90 -177 114 129 28 -242 224 136 98 171 -3 99 198 42 -100 116
5214A16j01J33J22l57L22k34J25O3n25L31j17N8K42l30J67MJ12n8n5O0K06m66
5236a82J23K08m51K40J31p5K63m16K50M9j50R5r6K19p2qo1K1m53K50L64Q6j54
5259A81j65j87L83m07J35k14j0L50j59J89k33j31l74J159j083N22o20P13m11L80
5279A8J82N18j105n4L32n9K78k61J14k33o33Q83L28N6k21q6L87r05J14Q08q63
5300d02l09P43p16P80J98o46K07J85J64k36K96j82j98J90o4j68R8l45M50K0j1
5321E4l7J33n6Q7k01N8J76m02L30n9Q4j18l3l70M79J53k08M6Pl16J3J70p9O6j91
5346b14K84Q6m1j9k40j11L01kO4j63K3j28J36m1j15K05Q7L3m21L72k59K56J06
5369A99l30J23j28K08M32k96k75j49K86n5p6J11J29k24J22j15j48J48l0q1Q5J38
$$ plain form
5214 116 15 148 270 -87 235 1 126 189 -336 -5 -122 -64 178 -152 15 19 131 73 18 78 284 -182
5236 -182 -59 149 -302 -62 69 -6 257 -159 91 140 -10 85 -11 208 136 128 67 88 -365 -115 249 335 181
5259 181 16 -171 212 -195 -60 -274 -284 66 -93 96 -137 -268 -642 517 -566 -44 -664 49 -362 18
5279 18 200 718 -387 -441 -109 -168 110 -151 -37 -270 -903 -20 308 364 143 57 444 -461 -347 461 -402
5300 -402 -711 32 -684 96 294 -352 -145 40 204 -32 264 82 -116 74 10 -158 -60 -405 45 65 54
5321 54 17 150 94 181 -20 38 214 -188 142 83 167 49 16 -354 125 278 70 116 123 -193 -180 -10 -89 -23 -214
5346 -214 70 156 115 96 -144 -255 46 44 108 -55 -32 -160 -24 -65 -180 25 112 145 -276 96 -163 93 199
5369 199 -131 -8 -136 72 504 208 -67 -216 70 15 -61 50 179 -45 77 -38 -186 -38 -68 -149 -64 74
5391G4j44K07j3j74J99p3nj15k60L50l9j76p0P1j05L28O6j46J07l14L24m49n22
5414h79L84L7Q54o32J14k43m6J58K92N6pj49L53j90k11M15j77r7j8k09K83j4o2
5437A2J61k81J12q6N8Jm5K35r6k08J6J44j08MJ92O5j67K2j06j85n69L69P42n34
5461b52p3O56l86M03n02J80K36rl49o8j38K06r0K76m8j30M56l81o2L7K23l48K97
5484A34j0rl26J84j01O4rj31N0J10J43P4j84q2k84M93k87M16m78m22M52j92N45
5507A50m09K05J49j57l5Oj8K44j33K66o53l9J061j289J164j0o16L60o25K89Q08
5528G18k89k47J71O38n52r47L61l87N55M25m27l1L24j82l50J92N6R8j23P4j66
5549h9J43q5r8J42K79j03l11K44k99M42o05N99m15L86n65N3M34p27O56m38L32
$$ plain form
5391 74 -70 137 124 -50 149 76 71 -44 -304 46 7 -169 -239 -168 -273 55 121 -25 82 -232 92 -357 -879
5414 -879 -495 -458 396 -236 -122 -365 -411 -253 39 95 88 -61 292 102 -109 306 129 32 14 -195 88 74 12
5437 12 173 -108 4 -82 -24 -23 -68 167 71 -137 -121 23 -85 -81 111 176 9 31 -75 -260 -829 -460 282 -252
5461 -252 -325 331 -55 348 -154 26 262 253 -96 -164 -302 -96 -186 90 42 -88 368 -13 -75 -38 185 -163 134
5484 134 124 115 -211 -27 -128 -64 -73 -204 -154 -44 99 173 -11 -93 -377 116 -171 245 -233 -655 -203 -395 150
5507 150 -259 -54 95 -62 -97 -91 -109 135 2 268 -385 -424 637 -652 512 502 -114 246 -379 -90 718
5528 718 429 182 353 991 439 -508 -147 -534 21 446 19 -12 312 130 -220 -28 28 126 3 77 -89
5549 -89 54 -31 -129 13 292 189 -122 122 -177 265 -340 259 -156 230 -335 -282 152 -575 81 -357 -25
5570b5m37L33K7J37n03J22P42j22K36j43o90P24l14k17k49N07M96r04j24P42l4
5591C04m65L13l95M67k38J12J49l20r3k33L01K95j86Kk6j70L60k22N64n52k61
5612b94J40P2K60k87Q8K7N72o77K36l07J76k8n0K75j95Lk14N1Q29k72p59L81J18
5635A45M75r55q6L55L09m24K5M01j277P41L10KJ93o93L54J77K38n58M02p04k90
5656h60J272l29n00L48K68L50j77n78k24J527j177J3J81M05j45j389N03O33j03
5675A8J11r06J143m36J76J44q12J654j688R54m40N45r81O01P18j700J042r25R29
5694A47Q70l7j199R66j207k40J437k88q99J202r33jM95O2k54j43j20N61o46L89
5714A62m8n43N76P24q05j8P9k9k53j97K95k32L08n01L32R3L46M1k85K27m92L46
$$ plain form
5570 -25 -462 -129 -102 35 -468 -346 396 274 510 367 -323 401 87 -130 -379 128 624 -280 -404 338 304
5591 304 -161 152 -243 224 -14 98 247 -73 -166 -399 -98 197 11 13 -13 -183 177 -45 519 -33 -294
5612 -294 -154 -82 178 -109 -21 6 578 -99 137 -170 6 -22 -72 203 8 11 -203 -152 677 405 -354 27 145
5635 145 620 -335 -421 -66 243 -181 -156 245 -1032 -291 19 21 214 -479 -125 52 290 -268 134 -570 -860
5656 -860 412 83 -417 -69 199 549 372 -206 -430 1097 -80 -67 114 519 374 -1015 -512 121 18
5675 18 129 -777 366 -70 106 250 -562 1092 -596 358 -82 463 -518 83 801 -899 143 -782 147
5694 147 1017 980 -219 747 -460 -700 737 449 -450 752 -181 -182 313 375 121 -22 -142 419 -227 162
5714 162 114 -429 147 871 66 48 127 98 -155 -352 -57 -289 19 -482 -150 -57 289 330 45 272 -220 126
5736A26j61L99o74M95j228R97J89K62n53J90q43R62j34L1k6N5n9k32O20m27J82
5757A71Rj47K02Ok14J57k22k84M81N03k27r15N15l14O02j15n72n7l91j49L45M24
5779a92Q6PL29K03j117N3K21K90N31k31R4J30r33N9N80K32j23M12l40k03J88J99
5801D75k18k82J36l96M53J44m66N43r12M34j37M71j15m19j68K00M10O6l10k3K45
5822A31kk8O1l69K54Nl01L78j66J83K10l38j40N12k97Jn3J50m17J68l6J12N1M5
5846A14o7R1k65O4N7J83j57J19j31Q0l05J83k34J44L15p5r5j0k55K07J61l7k7
5869F0p5N0MJ22k59K08j12L41l71J41j36J98j92J65l06L70p49Q08l68N60J04J29
5891F92K53o81k4p25M22k22P09q09L36N6Q38p72J24k61J65l74N69k05n36N10j69
$$ plain form
5736 126 -35 364 -310 185 -1043 -46 143 405 -148 42 -801 161 27 58 32 87 28 -204 416 -11 171
5757 171 180 33 235 241 27 184 -38 -322 159 662 435 -480 35 -279 323 208 -364 -421 -812 -961 -616 -192
5779 -192 -106 -99 230 433 -684 -631 -410 -120 411 180 274 404 -529 -470 110 342 219 631 291 88 276 475
5801 475 257 -25 111 -285 168 312 -154 389 -523 -89 -226 245 130 -289 -457 -257 153 219 -91 -114 131
5822 131 129 101 162 -207 47 52 -249 129 -37 146 356 18 -122 390 93 94 41 191 -226 -58 -94 18 69 114
5846 114 47 138 -127 -63 -6 177 20 139 8 88 -217 -34 -268 -124 191 116 21 11 -244 -37 124 87 60
5869 60 -15 35 39 161 -98 110 -2 339 -32 109 -27 171 -21 144 -162 208 -541 267 -101 459 563 692
5891 692 945 264 240 -485 -63 -285 424 -385 -49 7 845 73 197 -64 101 -273 296 91 -445 65 -104
5912a04pJ73pj0M69n81M29q58Q09K42n08n70O26J70k98m98k7O35k31j90O28k54
$$ plain form
5912 -104 -111 62 55 45 514 -67 362 -496 313 555 47 -523 103 273 -25 -523 -550 85 -146 -336 292 38
$$ [...]
8191A77
##END NTUPLES=NMR FID
##END=
