##TITLE=1H_Ser DHA-TFA next day

 8 sc, 
 24.12.2024
##JCAMPDX= 6.0         $$ Bruker NMR JCAMP-DX V2.0
##DATA TYPE= NMR FID
##DATA CLASS= NTUPLES
##ORIGIN= UXNMR, Bruker Analytische Messtechnik GmbH
##OWNER= root
$$ XWIN-NMR		Version 3.5
$$ Tue Dec 24 16:20:07 2024 Russian Standard Time (UT+4h)  she@DPX200
##.OBSERVE FREQUENCY= 200.1315
##.OBSERVE NUCLEUS= ^1H
##.DELAY= (6, 6)
##.ACQUISITION MODE= SIMULTANEOUS
##.ACQUISITION SCHEME= undefined
##.AVERAGES= 8
##.DIGITISER RES= 18
##SPECTROMETER/DATA SYSTEM= spect
##.PULSE SEQUENCE= zg30
##.SOLVENT NAME= D2O
##.SHIFT REFERENCE= (INTERNAL, D2O, 0, 15.7039)
##AUDIT TRAIL= $$ (NUMBER, WHEN, WHO, WHERE, WHAT)
$$ ##TITLE= Audit trail, XWIN-NMR		Version 3.5
$$ ##JCAMPDX= 5.01
$$ ##ORIGIN= Bruker BioSpin GmbH
$$ ##OWNER= she
$$ F:/spectra/data/she/nmr/H-F/1/audita.txt
$$ ##AUDIT TRAIL=  $$ (NUMBER, WHEN, WHO, WHERE, WHAT)
(   1,<2024-12-24 16:17:57.35 +0400>,<she>,<DPX200>,
      <created by zg, POWCHK disabled, PULCHK disabled
       configuration hash MD5:
       00 E9 B6 7A A2 85 ED C7 34 08 36 98 17 FE 4E 26
       data hash MD5: 16K
       AA E0 71 51 3B 8A 27 4F 18 A8 87 3F 74 4B D6 1B>)
$$ ##END=
$$ 
$$ hash MD5
$$ 1C 9F 45 38 0F 94 5E DD 54 85 12 E1 FB 6C E5 A1
##$RELAX= 
##$RELAX= 
##$RELAX= 
##$RELAX= 
##$RELAX= 
##$RELAX= 
$$ Bruker specific parameters
$$ --------------------------
##$DU= <F:/spectra>
##$EXPNO= 1
##$NAME= <H-F>
##$PROCNO= 1
##$TYPE= <nmr>
##$USER= <she>
##$AMP= (0..31)
100 100 100 100 100 100 100 100 100 100 100 100 100 100 100 100 100 100 
100 100 100 100 100 100 100 100 100 100 100 100 100 100 
##$AQSEQ= 0
##$AQ_mod= 1
##$AUNM= <au_zg>
##$AUTOPOS= <>
##$BF1= 200.13
##$BF2= 200.13
##$BF3= 200.13
##$BF4= 200.13
##$BF5= 200.13
##$BF6= 200.13
##$BF7= 200.13
##$BF8= 200.13
##$BYTORDA= 1
##$CFDGTYP= 0
##$CFRGTYP= 5
##$CHEMSTR= <none>
##$CNST= (0..31)
1 1 145 1 1 1 1 1 1 1 1 1 1 1 1 1 1 1 1 1 1 1 1 1 1 1 1 1 1 1 1 1 
##$CPDPRG= <>
##$CPDPRG1= <>
##$CPDPRG2= <>
##$CPDPRG3= <>
##$CPDPRG4= <mlev>
##$CPDPRG5= <mlev>
##$CPDPRG6= <mlev>
##$CPDPRG7= <mlev>
##$CPDPRG8= <mlev>
##$CPDPRGB= <>
##$CPDPRGT= <>
##$D= (0..31)
0 1.2 0 0 0 0 0 0 0 0.06 0 0.03 0 0 0 0 0.0002 0 0 0 0 0 0 0 0 0 0 0 0 
0 0 0 
##$DATE= 1735042677
##$DBL= (0..7)
120 120 120 120 120 120 120 120 
##$DBP= (0..7)
150 150 150 150 150 150 150 150 
##$DBP07= 0
##$DBPNAM0= <>
##$DBPNAM1= <>
##$DBPNAM2= <>
##$DBPNAM3= <>
##$DBPNAM4= <>
##$DBPNAM5= <>
##$DBPNAM6= <>
##$DBPNAM7= <>
##$DBPOAL= (0..7)
0.5 0.5 0.5 0.5 0.5 0.5 0.5 0.5 
##$DBPOFFS= (0..7)
0 0 0 0 0 0 0 0 
##$DE= 6
##$DECBNUC= <off>
##$DECIM= 24
##$DECNUC= <off>
##$DECSTAT= 4
##$DIGMOD= 1
##$DIGTYP= 9
##$DL= (0..7)
0 120 120 120 120 120 120 120 
##$DP= (0..7)
150 150 150 150 150 150 150 150 
##$DP07= 0
##$DPNAME0= <>
##$DPNAME1= <>
##$DPNAME2= <>
##$DPNAME3= <>
##$DPNAME4= <>
##$DPNAME5= <>
##$DPNAME6= <>
##$DPNAME7= <>
##$DPOAL= (0..7)
0.5 0.5 0.5 0.5 0.5 0.5 0.5 0.5 
##$DPOFFS= (0..7)
0 0 0 0 0 0 0 0 
##$DQDMODE= 0
##$DR= 18
##$DS= 0
##$DSLIST= <SSSSSSSSSSSSSSS>
$$ [...]
##$SUBNAM2= <"">
##$SUBNAM3= <"">
##$SUBNAM4= <"">
##$SUBNAM5= <"">
##$SUBNAM6= <"">
##$SUBNAM7= <"">
##$SUBNAM8= <"">
##$SUBNAM9= <"">
##$SW= 24.0689530833862
##$SWIBOX= (0..15)
0 0 2 0 0 0 0 0 0 0 0 0 0 0 0 0 
##$SW_h= 4816.95568400771
##$TD= 16384
##$TD0= 1
##$TE= 0
##$TE2= 300
##$TE3= 300
##$TEG= 300
##$TL= (0..7)
0 120 120 120 120 120 120 120 
##$TP= (0..7)
150 150 150 150 150 150 150 150 
##$TP07= 0
##$TPNAME0= <>
##$TPNAME1= <>
##$TPNAME2= <>
##$TPNAME3= <>
##$TPNAME4= <>
##$TPNAME5= <>
##$TPNAME6= <>
##$TPNAME7= <>
##$TPOAL= (0..7)
0.5 0.5 0.5 0.5 0.5 0.5 0.5 0.5 
##$TPOFFS= (0..7)
0 0 0 0 0 0 0 0 
##$TUNHIN= 0
##$TUNHOUT= 0
##$TUNXOUT= 0
##$USERA1= <user>
##$USERA2= <user>
##$USERA3= <user>
##$USERA4= <user>
##$USERA5= <user>
##$V9= 5
##$VALIST= <valist>
##$VCLIST= <CCCCCCCCCCCCCCC>
##$VD= 0
##$VDLIST= <DDDDDDDDDDDDDDD>
##$VPLIST= <PPPPPPPPPPPPPPP>
##$VTLIST= <TTTTTTTTTTTTTTT>
##$WBST= 1024
##$WBSW= 4
##$XGAIN= (0..3)
0 0 0 0 
##$XL= 0
##$YL= 0
##$YMAX_a= 624977
##$YMIN_a= -412588
##$ZGOPTNS= <>
##$ZL1= 120
##$ZL2= 120
##$ZL3= 120
##$ZL4= 120
##$ABSF1= 10
##$ABSF2= 0
##$ABSG= 5
##$ABSL= 3
##$ALPHA= 0
##$AQORDER= 0
##$ASSFAC= 0
##$ASSFACI= 0
##$ASSFACX= 0
##$ASSWID= 0
##$AUNMP= <proc_1d>
##$AZFE= 0.1
##$AZFW= 0.1
##$BCFW= 1
##$BC_mod= 2
##$BYTORDP= 1
##$COROFFS= 0
##$CY= 11.3945322036743
##$DATMOD= 1
##$DC= 2
##$DFILT= <>
##$DTYPP= 0
##$F1P= 15.6554695791079
##$F2P= 12.8336369535428
##$FCOR= 0.5
##$FTSIZE= 0
##$FT_mod= 4
##$GAMMA= 1
##$GB= 0.15
##$INTBC= 1
##$INTSCL= 1
##$ISEN= 128
##$LB= 0.24
##$LEV0= 0
##$LPBIN= 0
##$MAXI= 10000
##$MC2= 0
##$MEAN= 0
##$ME_mod= 0
##$MI= 1.114404
##$NCOEF= 0
##$NC_proc= 0
##$NLEV= 6
##$NOISF1= 3.799351
##$NOISF2= 2.8
##$NSP= 1
##$NTH_PI= 0
##$NZP= 0
##$OFFSET= 15.70392
##$PC= 1
##$PHC0= -26734.32
##$PHC1= 15.98744
##$PH_mod= 1
##$PKNL= yes
##$PPARMOD= 0
##$PSCAL= 0
##$PSIGN= 0
##$REVERSE= no
##$SF= 200.130013532006
##$SI= 16384
##$SIGF1= 3
##$SIGF2= 2
##$SINO= 400
##$SIOLD= 16384
##$SREGLST= <1H.CDCl3>
##$SSB= 0
##$STSI= 0
##$STSR= 0
##$SW_p= 3612.71676300578
##$SYMM= 0
##$S_DEV= 0
##$TDeff= 0
##$TDoff= 0
##$TI= <>
##$TILT= no
##$TM1= 0
##$TM2= 0
##$TOPLEV= 0
##$USERP1= <user>
##$USERP2= <user>
##$USERP3= <user>
##$USERP4= <user>
##$USERP5= <user>
##$WDW= 1
##$XDIM= 8192
##$YMAX_p= 0
##$YMIN_p= 0
$$ End of Bruker specific parameters
$$ ---------------------------------
##NTUPLES= NMR FID
##VAR_NAME=  TIME,          FID/REAL,        FID/IMAG
##SYMBOL=    X,             R,               I
##VAR_TYPE=  INDEPENDENT,   DEPENDENT,       DEPENDENT
##VAR_FORM=  AFFN,          ASDF,            ASDF
##VAR_DIM=   8192,          8192,            8192
##UNITS=     SECONDS,       ARBITRARY UNITS, ARBITRARY UNITS
##FACTOR=    0.0002076,     1,               1
##FIRST=     0,             0,               0
##LAST=      1.7004516,     0,               0
##MIN=       0,             -412588,         0
##MAX=       1.7004516,     624977,          0
$$ Real data points
##PAGE= N=1
##DATA TABLE= (X++(R..R)), XYDATA
0@%%%%%%%%%%%Qj2J2j6J6j6K4l1L4l8M4n2O2p1Q0r2J05j18J33j52J72j93K16k41
35a26K68k99L32l70M11m56N05n58O16o81P54q37R31j038J160j303J472j672J919
54A028k236K651l218M058n453Q283k3045O2365N6915l4546O516O0114R2768M5349
68B71549p955l405N7683P4200M1906k446j2047K563K0317J6045J304j6757j5615
81D27342l721n837k2675k1554j5716k4450l8334m3134l9597k2857j9161m6116
93A24190o3192l3752j933j5304n4781p1755m7096n085N781l0582o4988m4150O735
106b95912K3634o382m1176m1266l439L2142K1059j8854k7900R542M5907M0724
118b61921R733p202O166L3492M1759K2233R904K5438L9923L3826K5463K6410L0403
$$ y = [0, 0, 0, 0, 0, 0, 0, 0, 0, 0, 0, 0, 8, -4, 8, -8, 8, -8, 16, -15, 19, -19, 25, -27, 35, -36, 44, -48, 57, -61, 72, -80, 92, -101, 115, -126, 142, -157, 175, -195, 216, -240, 265, -293, 323, -358, 396, -441, 490, -548, 612, -691, 781, -891, 1028, -1208, 1443, -1775, 2283, -3170, 5113, -17932, 44433, 101348, 66802, 73318, 133432, 226200, 271549, 263594, 260189, 317872, 392072, 433978, 431532, 419485, 422048, 442365, 458410, 459714, 442957, 427342, 423621, 417784, 395109, 373555, 357839, 333389, 295055, 251921, 212324, 189467, 170306, 124190, 60998, 27246, 25313, 10009, -44772, -116527, -163623, -168708, -162927, -193509, -258497, -302647, -295912, -272278, -278660, -319836, -361102, -364541, -332399, -311340, -330194, -358094, -348552, -302645, -261921, -252188, -259390, -253224, -219732, -177973, -155740, -145836, -120398, -80475, -46649, -21186, 5224, 35627]
131C5627L1003K2472J1416J5992L2003L1698J1841K234J6997L3723K7935R89k4683
144B49247k1992Q508K6837P429k1191k2412r68J2308l743l8170n2543k5812R201
157A26699Q953k2238m3584l2961r179l204k1347m0982l5690j0974p2j3731k6243
170a24553k2056j1107l745m711j1544j2030m875m000p829k192J0210J4105O937
183a77390q74R14J3775K3283J4145k547j068K0465L6773K7952N345k767J4578
196b7416L5458L2329O373j0913L201K9902L4722J4418m631k590J5244K4547R763
209A60407j1894j3329L021J4143R093n188j2913p067J253j279j0799j5934j4089
222I5425j0517j1186j2723r430n383p631j4847j9380j6217r425j0652j9602j9969
$$ y = [35627, 66630, 89102, 100518, 116510, 148513, 180211, 192052, 194286, 211283, 245006, 272941, 273930, 249247, 227255, 235763, 262600, 270029, 248838, 226426, 225458, 237766, 234023, 195853, 143310, 117498, 126699, 135652, 113414, 69830, 36869, 27690, 24486, 3139, -37843, -73533, -84507, -84579, -98310, -124553, -146609, -157716, -161461, -166172, -177716, -189746, -194621, -198621, -206450, -208642, -198432, -184327, -177390, -178264, -177350, -163575, -140292, -126147, -128694, -129762, -109297, -72524, -44572, -39227, -41994, -27416, 8042, 40371, 46744, 35831, 39032, 68934, 103656, 118074, 113443, 110853, 126097, 150644, 160407, 148513, 135184, 138205, 152348, 161441, 156253, 143340, 136273, 137526, 136247, 125448, 109514, 95425, 84908, 73722, 60999, 51569, 46186, 38555, 23708, 4328, -11889, -21314, -31966, -51568, -71537]
235g1537n977Q078N422j2175k5146j7529J395Q570k841j4418p748J1176J9087
248a03643O656j0906j1797N427K0090J6381J051m915N719J9027J9252Q810K201
261b6647O134J4215J5290Q014K348N866J1763J2163R462Q229Q069O760K037j805
275H1898J011O615O341r44o079j892O319O098m697j4008j2399k231L553m127j5569
290D9889j4700k686N313o65j4611k1090j2648n8N58r914j6108r638J293L790l888
305d5163j2027j0943k537J937j864o054l759J687N271N090L038J449J079k43j029
320f4068K163P870J0628Q295N032N760Q552Q104L088j864N92R798J5762J0990
334C0702J900j347L467R377Q169L09m575o8P383P839M66n513l999K594N818Q43
$$ y = [-71537, -77514, -69436, -64014, -76189, -101335, -118864, -117469, -108899, -111740, -126158, -133906, -122730, -103643, -96987, -107893, -119690, -114263, -94173, -77792, -76741, -81656, -75937, -56910, -37658, -28848, -26647, -20513, -6298, 8992, 17006, 19354, 25220, 36983, 49146, 58608, 66837, 74906, 81666, 83703, 81898, 82909, 89524, 95865, 94921, 88842, 86950, 93269, 99367, 94670, 80662, 68263, 66032, 69585, 65458, 49889, 35189, 32503, 37816, 37151, 22540, 1450, -11198, -11256, -10698, -20612, -36720, -46358, -45065, -41275, -45163, -57190, -68133, -70670, -68733, -70597, -76651, -80410, -78723, -73452, -68362, -65324, -63875, -62796, -63039, -64068, -61905, -54035, -43407, -35112, -30080, -24320, -15768, -7664, -4576, -6440, -5848, 3950, 19712, 30702, 32602, 31255, 34722, 44099, 52268, 52577, 48002, 47934, 55317, 63156, 63622, 58109, 54110, 56704, 62522, 63365]
350F3365o945q914m587o04j393m461n759l937j791k582n909q141p576o104n054
365a0392m028k793k611l531m472m373k687j566l382o302n141l39L733L427l17
380d4774k599J17L971L502p26l136J20O037Q626N668J791J284M334O739N052J093
396b901m0K474N743O911N544L441L221L841L289J194r30j250M35L001M218L474
412D1665J608p90k734l139k664k320j905j590j162n08n62k756n248n405l659k164
428F667k163l646m971l955k024j239k249k733k660k315k008k327l189l260j292
443c3364J140K084J697M57j129j086O27R18K07O89K174L335M294M024K117P45
459a1071J682K780K407J681J438K035M162N662M091J029J65J474J842R73j22k93
$$ y = [63365, 56420, 47506, 42919, 42315, 40922, 36461, 30702, 26765, 24974, 22392, 16483, 8342, 766, -5338, -10392, -14420, -17213, -19824, -23355, -27827, -32200, -34887, -36453, -39835, -46137, -51278, -51617, -47884, -44457, -44774, -47373, -47256, -43285, -39783, -40509, -43645, -43525, -37488, -28862, -23194, -21403, -20119, -15785, -9046, -3994, -2901, -2941, -467, 5276, 12187, 17731, 21172, 24393, 28234, 31523, 32717, 31787, 30537, 30972, 33973, 38191, 41665, 43273, 42483, 39749, 36610, 33946, 31626, 29721, 28131, 26969, 26461, 25899, 23143, 17895, 12490, 8831, 6667, 4504, 858, -4113, -8068, -10092, -11331, -13580, -16313, -18973, -21288, -23296, -25623, -28812, -32072, -33364, -32224, -30140, -28443, -27986, -29115, -30201, -29574, -28656, -28449, -27760, -25586, -22251, -17957, -13933, -11816, -11071, -9389, -6609, -4202, -2521, -1083, 952, 5114, 10776, 14867, 15896, 16061, 17535, 19377, 20350, 20228, 19935]
475A9935J456L506K922J04j333p14l37j088j899k489k125n48N18n10j337j196
491A4865j974l640l985l577k945j542o07r76q54l0j207l934m962l094n30Q73J72
508a7947j396j442J039K190l56l017j954J348L184K148r77j987J272N145M196
523h554N76q59O50K633K786O80j073P56M692N349K271q7j84P84J358P63o11K83
541A2213K430K595O15k04N19M32r18k433k401m01J653N66k390k330P06J971r66
558A1657m799n428k183K025J698k814m615j010K526J617k644n693m022P67K776
573a0142k19l519j915K197L619Q42k809l581o28K006J471l80K96K685L067J248
589e762n62p75N59J393N23J75K198M209K531p52j609R71L542K751j143l150k43
$$ y = [19935, 21391, 24897, 27819, 27923, 26590, 25876, 25539, 24451, 22552, 20063, 17938, 17390, 17908, 17398, 16061, 14865, 12891, 9251, 5266, 1689, -1256, -2798, -3405, -4381, -5235, -5265, -6472, -10406, -15368, -18462, -18992, -18119, -17947, -19343, -20785, -19746, -17556, -17912, -20929, -22883, -21535, -18351, -16203, -17180, -19167, -17895, -12750, -8554, -7978, -8837, -8187, -5554, -2768, -2088, -3161, -2405, 2287, 7636, 9907, 9820, 9636, 10420, 11778, 12541, 11930, 12213, 14643, 17238, 17853, 17649, 18168, 18600, 17682, 15249, 12848, 12447, 14100, 14666, 12276, 9946, 10652, 12623, 11657, 6858, 1430, -753, 1272, 2970, 156, -4459, -5469, -2943, -1326, -3970, -9663, -13685, -12918, -10142, -10361, -13880, -15795, -13598, -9979, -9137, -11946, -15527, -16155, -14149, -12678, -13058, -12762, -10077, -7010, -5762, -6324, -7099, -6540, -5147, -4624, -4449, -2251, 1958, 4489, 3737, 2128, 3099, 6641, 9392, 8249, 5099, 4856]
606D856M314M115p34l695j049L788M477p82n801m593J448M533J637l097l523L41
622F235L124O24m028n391k014J973J920r98k467j159P28J99j749k730j535q3n04
639g855j192j48J799J672q59k751j281J619J949j279l345q61M191N339P46l750
655f006k818K345N030J394l826l600K134O603M218j582l841r1M113L120j610l975
671A608j079L884M839Q71k292j520P11J285o28j848q57J170J189l81r64K58N89
688F835j047k603j583Q96J745q92l783k740J857M018N05m126m464j83L305J430
704h30l527m768j4N138M144j759n288k781K156L731J5l689k109K834M578J465
720g04k232k491J23K357J257j068q89J245K297J136J42M05R16K20j308j280Q96
$$ y = [4856, 9170, 13285, 12551, 8856, 7807, 11595, 16072, 15290, 9489, 4896, 6344, 10877, 12514, 9417, 5894, 6235, 9359, 9983, 5955, 564, -1450, 523, 2443, 1445, -1022, -2181, -1453, -1254, -3003, -5733, -7268, -7351, -7855, -9047, -9195, -7396, -5724, -6583, -9334, -10615, -8996, -7047, -8326, -11671, -12532, -8341, -3002, -2256, -6006, -8824, -6479, -1449, -55, -3881, -7481, -5347, 1256, 5474, 3892, 51, -40, 4073, 7193, 5583, 1608, 529, 4413, 9252, 10123, 7831, 6311, 7022, 8307, 7679, 5831, 4974, 6144, 7333, 6952, 5988, 6246, 6835, 5788, 3185, 1602, 2498, 4243, 3351, -432, -3172, -1315, 2703, 3208, -918, -5382, -5565, -2260, -830, -4357, -9125, -9139, -4001, 143, -1616, -6904, -9685, -7529, -3798, -3783, -7472, -9581, -6747, -2169, -704, -2936, -5427, -5304, -2947, -1690, -2758, -3647, -2402, -105, 1031, 1173, 1578, 2494, 2714, 1406, 126, 1022]
737A022K869J572j471j732J362L500J425k832m404q32L870L609j526m305j312
752H15L435M026p29n426m406J214M291J351l221l334O58L339J582k787m400j374
768d966K048J899o87j710m57Q43P07n33r91j63L76n42j184J96J870J289q19j493
786d317K91K552K156j608l915j255L416M425O10l050k001K272M335P20m095l854
802c318J280M982L004j626l335m27L115K593j356l655j588J954K595M30j488j081
818B079O20J157l45j547r56r6j23n08L9R67J046p11k155j411R91J489q21k913
836c198j671J986L554R46l088l351M19L267J394k688l585K0M010L593r53l731
852c076j649K014K929o5k708j673J710L197J213j433j616L04J612O25n93p88J99
$$ y = [1022, 3891, 5463, 3992, 2260, 3622, 7122, 8547, 5715, 1311, 479, 4349, 7958, 6432, 2127, 815, 4250, 8276, 7547, 2121, -2285, -1071, 3220, 4571, 1350, -1984, -1326, 2013, 3595, 808, -3592, -4966, -2918, -1019, -1706, -3416, -3873, -3030, -2323, -2856, -3847, -4010, -3634, -4176, -5360, -5164, -3294, -2005, -2824, -4317, -4026, -1474, 682, -926, -4841, -6096, -2680, 1745, 2355, -695, -2696, -424, 3911, 4631, 536, -3318, -2038, 2944, 5948, 4322, 987, 560, 3675, 6268, 4912, 1257, -331, 1623, 4218, 4648, 3160, 2079, 2699, 3856, 3511, 1964, 1008, 912, 789, 281, 320, 1287, 2333, 1622, -533, -1944, -953, 536, -285, -3198, -4869, -2883, 671, 1617, -1471, -4822, -4403, -1136, 258, -2430, -6015, -5995, -1985, 1608, 655, -3076, -4725, -2711, 218, 153, -2555, -4228, -2518, 679, 1892, 459, -1157, -853, 759, 1384, 791, 3, 202]
869B02O81L20N3Q68J164o4j323j228N28J467J73j695j431J478K989J091k330l448
887e05p80K405K116j155l268r42K772L084m86l535k696Q27K743O94k365k292O55
904b728K593J349j204k139q13Q53R02m62r45M2R49N80P8N3P9j15p47q51K53J674
924e99R59p57j177O33J988J284j276k646r25K141K822j1k227j122J746K502M37
941C772k495k679M34K814J581j317j914k67J675J599n19k125j228Q76J036l1q04
958D08n00K96P00J84m92m50l66o49q15J39J135Q01l70r34m64Q26Q04p62k135q67
978c511J528K301N42j578j559L43J968R46j703k150N5K076J864j73j598q20J165
995c04J733j66j745r99N78J348Q38j58n54j8N86R9l21l42j61j62m8N29P53L82
$$ y = [202, 883, 1203, 1256, 2124, 3288, 3224, 1901, 673, 1201, 2668, 2841, 1146, -285, 1193, 4182, 5273, 2943, -505, -1285, 1120, 3236, 2081, -1187, -2129, 643, 3727, 3241, -294, -2990, -2163, 580, 1274, -1091, -3383, -2728, -135, 1214, 10, -2129, -2942, -2089, -1187, -1649, -2594, -2552, -1603, -1023, -945, -892, -813, -928, -1675, -2526, -2273, -599, 360, -397, -1574, -941, 1047, 2331, 1055, -1591, -2516, -375, 2447, 2436, 209, -913, 833, 3335, 3772, 1277, -1402, -968, 1846, 3427, 2110, 196, -71, 1604, 3203, 2684, 559, -669, 207, 1243, 1212, 408, -92, 204, 904, 1088, 596, 146, -220, -869, -1684, -1545, -410, 391, 21, -913, -1377, -551, 253, -509, -2644, -3511, -1983, 318, 860, -718, -2277, -1934, 34, 980, -723, -2873, -2818, -742, 1122, 949, -649, -1469, -304, 1429, 1263, -482, -1481, -903, 445, 1283, 1125, 571, 553, 1139, 1238, 917, 575, 414, 252, 204, 733, 1486, 1868]
1015A868k37q60o54M29P96l27j326o59Q99J560O66j122j820l46J309R71j004j541
1033a398m39J290J586O7j580j193M35J222J66j003j033L6J057R91o1o71k66K28
1051e66J46k64k44k21J05M38N86M43K96k56p96n17L29O18K46l76l09M46J137N91
1071A832q04j300l76Q64R37j45r79l65P88J224K30j016j209m3P38M50l09p59n3
1090b95P19P69j10p36o43k26K32K59j81j96L7K42K49J64j08m74n70l10J99N22
1110d57L18k39k67K56M00K68m73q83l52N85Q38J44m65k57K60P22L17o04q21j39
1130h49N95N29P1l39r9M70N37J14m90o57k74L16L02K94Q2nO6J80Jl27m89l63K2
1153c13M56M81J3j84j52j2K4J9m07m48q9L72L74J63j81k57j9K30m9l82m98m3K94
$$ y = [1868, 1631, 771, 117, 546, 1342, 1015, -311, -970, -71, 1489, 2155, 1033, -787, -1133, 176, 1147, 143, -1398, -1837, -547, 1039, 1106, -474, -1667, -1232, -10, 156, -847, -1880, -1844, -787, 204, 143, -528, -794, -566, -420, -684, -928, -1149, -1044, -606, -20, 423, 719, 463, -333, -850, -521, 97, 343, -33, -342, 104, 1241, 1832, 1028, -272, -648, 216, 1153, 1008, 29, -336, 452, 1676, 1906, 890, -319, -362, 376, 826, 517, -242, -295, 424, 1193, 1083, 347, -296, -522, -290, -31, -212, -408, -371, -129, 120, 284, 176, -298, -868, -1178, -979, -457, -139, -378, -645, -389, 11, 279, -194, -1077, -1429, -844, -6, 138, -327, -584, -324, 398, 715, 111, -710, -849, -254, 275, 346, 7, -92, 378, 915, 1029, 539, -118, -392, -76, 226, 520, 602, 597, 663, 843, 844, 517, 28, -335, -313, 143, 624, 637, 453, 301, 289, 313, 332, -75, -523, -612, -240, 134, 297, 116, -141, -160, 70, 21, -361, -859, -902, -608]
1176f08M47K50j56j80m8K00o3k58k85j71K43M74M40j11k05m6N1M4r3l32k11K53
1198c65N97K70L4j92k07lJ78r3l46j11K23M10J87J4j01j77J5Kk05j79k0Q7Q6K15
1222C19J46L7j42j41k44j58L1j59l5J30L69K76l4l05m14j72J74N2j85p2J70M42
1244H5J98n6m67k32R5K43j09l10O7L04L74P4j33k98JJ49k5l16m5K82K79J74mj72
1268A58Q0N5j04l90o3K36K10J40j0PJ27J37l22l72j49J49K88n2j3j5K81K48k31
1291C95m97l18J65L43n7k29j8K63L48O4n48l77K04J80m2j89k66L15M71J89l11
1312H5l69N1J27j0k65j88K13M11L12j55k78k0J33j87j67j44K00L53K60j50j96
1333A6J48J96j45l54k18K17L79J54k46k30L05L56q5m76l80M3M33K43k70l47K86
$$ y = [-608, -161, 89, -67, -247, -295, -95, -158, -416, -701, -872, -629, -155, 285, 174, -31, -77, -26, 18, -75, -407, -618, -365, 232, 502, 536, 344, 137, 134, 312, 219, -127, -238, -15, 395, 582, 596, 495, 318, 333, 335, 130, -49, -69, 18, 104, 319, 465, 502, 360, 219, -25, -183, -152, -311, -346, -216, 153, 429, 395, 90, -324, -496, -322, -270, -455, -527, -357, 85, 283, 227, -240, -472, -377, -134, -243, -553, -486, -182, 192, 266, 133, -165, -164, -15, -40, -356, -401, -119, 160, 334, 330, 158, 238, 293, 189, -201, -264, -28, 182, 322, 312, 319, 446, 583, 261, -111, -260, -111, 177, 125, 112, 97, 378, 626, 395, -102, -420, -255, 88, 31, -198, -216, 47, 395, 459, -89, -466, -262, -82, -124, -313, -579, -264, 207, 396, 85, -284, -233, -106, -116, -381, -569, -356, 55, 367, 212, -66, -86, 47, -140, -307, -451, -251, 102, 362, 212, 16, 164, 360, 215, -139, -357, -140, 239, 393, 147, -83, 222, 578, 493, 17, -363, -320, 113, 356, 86, -261, 25]
1354B5M75K54m73n85j85L68L18j82k66K9M08L39j76m99k24J20J96m1k57P7M23
1375A44J78j41k61j28J17L2k24j88J27N13J23k54k16J25K41P5m00n12J57O11L27
1396D46k78l77O9M72J82k81o61j95L83O41j5l39j17J92L83m8n36l80J60M10J89
1417C00k12p0J02J99L3k91k56Q6J94j47k15J67L27J34j63k83j67K82J84k98m68
1438e62J03N60M16j68m76l24L41M54j56o04l15M23O54J77l78m80J15M51J03m66
1458a32l80R6L92L54r2k73p8K39N1k18j85L4J49O9l9J5K12J69j72l12j87K48K56
1481B16j53k89q5M39N24o9o28l61J49N15N5n30l12K14P13L02m07o62r8M39L06
1502B78k85l69k4L80M55l9m22k34J34J54j24q4o0J73J79k7q2O0Q4q7l03j33K30
$$ y = [25, 500, 754, 281, -304, -489, -121, 197, 15, -251, -222, 186, 525, 349, -150, -374, -254, -58, -99, -356, -279, 144, 322, 181, -80, -208, -91, -59, -283, -471, -344, 169, 292, 38, -178, -53, 188, 263, -137, -649, -492, 119, 446, 168, -209, -140, 332, 514, 233, -428, -623, -240, 401, 386, 47, -70, 122, 505, 457, -79, -459, -299, 111, 300, 88, 18, 120, 319, 352, 61, -195, -109, 85, -62, -277, -110, 217, 351, 188, -95, -262, 20, 204, -94, -562, -459, 101, 517, 349, -127, -451, -110, 344, 188, -416, -731, -308, 346, 523, 145, -335, -220, 231, 334, -132, -512, -416, -24, 330, 238, -35, -113, 126, 177, -41, -226, -192, -43, 26, -13, 2, 214, 383, 211, -101, -288, -40, 216, 63, -226, -311, 128, 652, 583, -45, -406, -257, 258, 313, -217, -529, -315, 398, 700, 293, -369, -467, -28, 278, -7, -376, -400, -20, 435, 396, -26, -260, -126, 28, -96, -180, -240, -67, 112, 85, 3, 63, 147, 60, -243, -376, -146]
1525a46K87K6k42j41K55L68L4n63l84R7N35K77k95m34Q7M87L57k95o10j91L07
1546a84N01%m37j68L35L41L5m18k72j4L01J15k03p8K14J12L1j27j01L4l1j36j76
1569c26J50K95J50k64k13J43K67K0k80m83L8N31M02j44n04o7L27L34j73n20l00
1590f17L16N37J38l19k86J32L06J25k33m23kK76K40o6q2j2O7P0n3j57j8N3p9p2
1614a59J22J88J76k05j89r5K01K18k63l28n6M38M16r7l95l02J75M00j5l97l46
1635e13J95N41K03k40l72q4L16K69k30m01k5K50K64L6j40j59JJ46l8j45NQ2j8
1658e7K2J31P6N1o8k65j22J70K21j25j80j15K87L55jl63l36J48L07R3k73k58O4
1681b38L89K66j20m14j67K23K09nk78j03J69L08O1k01j34j18P7J3K2l8%Q0Q0m2
$$ y = [-146, 141, 167, -75, -216, 39, 407, 441, -122, -506, -409, 126, 403, 108, -326, -239, 248, 605, 310, -300, -491, -184, 317, 317, -120, -288, 47, 388, 423, 5, -267, -281, 20, 135, -68, -146, 68, 180, 211, 84, -17, 17, -14, -150, -326, -176, 119, 269, 5, -208, -65, 202, 222, -58, -541, -503, 28, 430, 286, -218, -285, 42, 376, 203, -317, -617, -301, 236, 374, 55, -231, -99, 207, 332, 99, -324, -326, -50, 190, 124, 42, 30, 97, 167, 114, -43, -61, -8, -87, -159, -37, 151, 327, 122, -67, -162, 39, 257, -6, -334, -390, 48, 464, 367, -28, -330, -155, 245, 230, -167, -513, -318, 223, 426, 186, -186, -270, 46, 315, 85, -316, -341, -91, 173, 209, 69, -90, -89, 57, 19, -126, -121, -39, -57, -35, 96, 172, 223, 155, -110, -232, -62, 159, 34, -146, -261, 26, 381, 380, 17, -319, -171, 136, 229, -44, -302, -238, 151, 417, 297, -117, -284, -61, 148, 143, -135, -238, -69, 239, 300, 99, -35, -153, -76, -63, -41, -79, -79, 1, 81, 39]
1705C9L0N2r6j90l7P2K38J3j13j71J24K49Q2k83l13j2L41K23j14k69j9K04K77
1728C27r7l07k37J22K55M5r2j29J6K66N3j28j57j37J30OJ19q2M1M4olK2o3k8j22
1754a42k4J43J20O7j04r8l0J86N1j47k98QK74K45l9k45o1J30J08K2k38j92J2K77
1778B5K22j60j34j9J23J05m7k15l8M9J36M5k7j7qj9o0M9n7%k7l1R3J41M3j34j12
1805g4mO1J36o5j92q1K17K21K2k16j19L6J60N0j83j46O5J53J14L4j97j09Q5J57
1829A25j42k8r3M2J18J02j3Mr1m7o5M6oj6J6LM5P7M3m5j65m7K7J21Mr5j9J05J30
1858A36kj22j56m4J69N3J1j59J8J12J76q0j89J1OP6m5N9j05MJ67KNr5k2m3j7J29
1886E5m9ql8M6M6PL0q8o8nM7J2O6m5k3K8M2Mj05m7l3J62PJ7p2QM9Q4o7q2p0rP3
$$ y = [39, 69, 121, 25, -165, -202, -130, 108, 121, 8, -163, -39, 210, 292, 9, -304, -316, 25, 248, 134, -135, -154, 50, 327, 230, -77, -314, -192, 63, 108, 16, -113, -97, 169, 222, 94, -63, -200, -70, -64, 55, -27, 14, 58, 52, 49, 71, 8, -20, -142, -166, -23, 97, 164, 60, -38, -68, 118, 169, 22, -276, -268, 6, 251, 212, -33, -94, 36, 144, 166, -72, -264, -252, 25, 247, 87, -47, -66, 57, 162, 115, -100, -138, -89, 47, 92, 65, 48, 40, 21, -39, 10, -47, -47, -74, -105, -12, 129, 172, 38, -74, -78, -17, 119, 54, -138, -219, -2, 219, 241, 25, -94, -58, 102, 152, -31, -177, -112, 41, 155, 189, -8, -117, -32, 125, -17, -45, -138, -96, 22, 124, 111, 115, 24, -23, -88, -42, -48, -64, -48, -45, 0, 77, 120, 75, -90, -137, -110, 11, 15, -80, -99, 6, 136, 134, 12, -144, -188, -19, 34, 45, -114, -96, 16, 192, 112, -77, -66, -60, 16, -29, 30, -75, -71, 96, 98, 103, 8, -14, -57, -74, 55, 6, -2, -40, 6, 52, 59, 89, 1, -67, -72, -25, -13, 53, 8, -15, 13, 55, 59, -46, -93, -126, 36, 43, 60, -12, -4, 45, 129, 62, -20, -90, -99, -26]
1919b6K0J02j22O2l0M5jk6r5J1k4Q0rL6LN7m9L6J9j27q3J2R1L7J7K3l3JM0r2R5
1950G0j53K3J0J19ok0q4L0M8m1m0k0m8Q9P3mOk1j4q3P7l4n4l0L7M3R0O9r8j15
1980h1P8l5Opm4j7J35J04p4o0j9K7nk6l9j8Q5K3L1l5l6K6l2K0j3l1K4QJ2mK7k0
2012A0L5n9M4r2L9J9m6J2N8Q6n1p9k0k1M2k6L0oJ6L7J7l6Qr6M7K1k2k4N0M6K3
2043F2N1r3j7J1rk0j5pqJ02k3k6Pk4M5l7m3mM7QK8p0N4OK4q4K3q4K8Q7k6Jj6J20
2077I8p1O7j27j3K8K8K3r9J3R4N6m6q6J3%N2n2n3M2J27m2j6o2K5l2P0l7o6k1N9
2107b8P7N8j05m2N2J0n3o7MP5L1PMl8M0oj6n5j5O9j5L6qm3N4L1l2m8m9J1L8lL3
2140Go1L0P6Kp4n9K6O6ml9JK2M4O1n2j06L3L1M2m2m4k6P7Q4p6k6j8O5q0L3n4P2
$$ y = [-26, -6, 96, -26, 36, 6, 51, 50, 24, -71, -60, -84, -4, -13, 23, 26, 83, 34, 70, 89, -38, -121, -109, -18, 19, 36, 59, 26, 27, 67, -25, 70, -83, -60, -50, 69, 63, 43, -41, -11, 37, -4, -44, -64, -112, -23, 50, 46, 52, 31, 17, -66, 11, -23, -77, -107, -70, -27, 63, 132, 34, -81, -3, -38, -32, -39, -83, -100, 35, 139, 65, 5, -14, 13, 8, -18, -57, -75, 10, 33, 64, 29, -7, 19, -13, 7, -6, -37, -13, -5, 7, 3, 30, 10, 45, -14, 30, -62, -23, -4, -50, -38, 20, 106, 55, -24, -44, -65, -23, -49, -19, -25, -9, 28, 45, 9, 17, -79, -32, -11, -33, -57, -7, 39, 62, 113, 20, 3, 14, 5, -15, -30, -37, -45, 57, 34, 8, 15, -9, 36, -1, -44, -48, -1, 7, 35, -35, 19, 25, 49, -35, -12, -96, -68, 19, -7, -6, -22, 98, 27, 94, -33, -46, -18, 10, 33, -66, -53, 41, 97, 51, -35, -22, -22, 30, -22, -75, -33, 94, 52, 36, -26, -1, -33, 37, 0, -66, -87, -28, 49, 107, 2, -40, 12, 22, -31, -98, -94, -19, 12, 19, 23, -15, 25, 19, 3, -52, -67, 2, -13, 23, 15, -28, 26, 57, 25, -23, -72, -61, -23, -26, 7, -54, -24, 52, 54, -20, -79, -53, 13, 9, -30, -29, -7, 37, 98, 46, -60, -27, 4, 46, 4, -40, -66, 11, 95, 19, -7, -25, 40, -40, -7, -61, 11]
2172A1M9Ko8K6j5O0l9l1k4l3N5N5K0j51O2J05q4N2j34k4R7J23n8j30L2O3M1m6
2200A6j14M4M2K8j3K0k3kO7J4q2j8K3l1Lj9PM3K8k0k9LK7Lr0L8k6J13P9p9p2J7
2232cnJ06j23k6K8M5O0m2l0m0oQ2l7q2l9O9M7j9L4o6L9PK0o0%j0O2%j2m3R9Lm9
2265Il2RlO2ro5KO3N4m3q1MmR9l8k7n6O1Q0l2J1r9Q4j8k8M1q2J0P4L9n3n6J9J2
2299Gql9k2O4J1k4l7M2K3l6K1n5K0j4M0Po5N2J7K2N2k7j23J0J11mm9o3N7Q0mo7
2331ao2RM4K3K5m9k4pP7Km3N1p9K7K8k6J2j0K0j4jPoJn5J0L0NJ3m9JN8n6N5n1
2366c5o7M6O8J01q9o3L9L2L1Lj15J5L9O0K4r5l5M8K8L9j09k2j2Q9k4j3LJ8J7k2
2396alk7K1K7L3p0K4P7l5m7n1RJ17j07M0r3J2Q3O3l1l2n0L5P2o5k2k8J8M1NLj6
$$ y = [11, 60, 62, -6, 20, 5, 65, 26, -5, -29, -62, -7, 48, 68, -83, -21, 84, 0, 52, -82, -106, -9, 114, 56, -74, -42, 21, 62, 16, -98, -54, -12, 16, 3, 23, 0, -2, 65, 79, -3, -21, 2, -29, -26, -45, -38, 5, 33, 13, -16, -13, 14, 17, -73, -35, -61, 52, 131, 52, -20, -3, -8, 98, -25, -51, -23, 22, 82, 40, 10, -30, -36, 46, 9, -73, -112, -43, 4, -15, 19, -47, -8, -1, 19, -41, -41, -51, 11, 11, -1, -44, 55, 58, 9, -23, -14, -17, 45, 36, -29, -27, 36, 90, 47, -34, -30, -34, 65, 27, 0, -56, 5, 85, 53, 64, -35, 49, 31, 3, 44, -38, -28, 46, 85, 32, -24, -5, 7, -1, -40, -62, 2, 13, -11, -48, -6, 17, -19, 2, -53, -33, -47, -7, 0, -65, -13, 4, 26, 78, 51, -72, -62, 49, 45, -4, -67, -10, 70, 66, -1, -63, -54, -10, 13, 38, -11, -35, -42, 35, 37, -6, 45, -34, -7, 21, -5, 7, -3, 17, 3, 2, 9, 3, 4, -51, -41, -11, -6, 7, -42, -41, 17, -39, 16, -35, -102, -56, 12, 113, 24, -39, 0, 32, 63, 66, -49, -34, 5, 65, 89, -6, -41, 7, 35, 74, -35, -57, -69, 20, -4, -17, -14, 4, 21, -1, -4, -31, -10, 17, 50, -20, 4, 81, 46, -1, -52, -43, 74, -33, 7, -86, -74, 9, 72, 41, 9, -41, -6, 66, 1, -21, -49, -31, 10, 15, 18, 2]
2428BJ3k6nqK4j4J4O1m7L3j1k6j0J3j1L8j9m1L7k4L0QJ1o7K8j1J6Jn8R9m1L5l4
2461A0No5L6O2o7K6q6K0Q9L0k9r4ON7L3j6n3M4J1J4k2K5n4J6K6o1L8%pJ7O1n0
2493B2L7J3l4n6j5N1K6m7j5K3M9k7rom7J1QJ7kk4L5k3Q5lj46M2L0L4Rm6j4L3m7
2526c6K9N4p6oJ4J8N4k4K0k6J3n2L9mo5N6l5L9nMJ2l4L3JL5p4Ro8J03M1r5O3m0
2559cJ6JK7J5m2o1N5lro2L8M7m0nR7m9n3K5l5Q4m4l4M2m1M5j5pj5K6j2LL8j2K1
2593C8r6J04r8J6J3jO9k3J1Oj2n1O7k4ko3M7J5j7M6m1M7n3RnK5q8R8k5m0O1m2
2625ij7j5M5o4N0J5oN1l9pK9n8K0qK2L0o2l2P5k1M6l8J1ol8O1m4j9K2PlK0ok6
2659a4J8L0rk7j2qJ3Q6n6j2p9J22o9O2QJ1p3Jk3N5J1l1on7N9n0N8J0m9oL8K8J0
$$ y = [2, 15, -11, -16, -24, 0, -14, 0, 61, 14, 47, 36, 10, 0, 13, 2, 40, 21, -20, 17, -7, 23, 31, 42, -25, 3, -8, 8, 9, -49, 50, 9, 44, 10, 15, -50, -14, 48, -19, 7, -79, -59, 30, 60, 31, -63, -57, 0, 33, 17, -36, 8, 19, 33, 11, 36, -18, -2, 24, -37, 1, 1, -6, 11, 72, 22, 59, 72, 38, -18, -33, 18, 44, -3, -18, 5, 54, 27, 18, 12, -35, -24, -16, 1, -1, -25, 10, -13, 72, 69, -77, -35, -5, 29, 38, -8, -22, 11, -36, -7, 47, -29, -35, -21, -3, 51, 27, 47, 21, 34, -18, 21, 17, -48, 8, -27, 12, 7, 11, 23, -11, 22, 23, 58, -16, -7, -75, 28, 69, -26, 37, -3, 13, 14, 41, 56, 14, -47, 8, 5, -4, -66, -28, 19, -21, -26, 71, 22, -31, -6, -41, 43, -1, -35, 7, -34, 11, -4, -11, -26, 0, -12, -9, 29, 17, 38, -58, 46, -52, -36, -23, -24, 45, 22, 33, 39, 27, -24, 43, 19, 17, -46, 1, 16, -1, 45, 4, 51, -2, 7, 2, 27, -61, 37, 12, -28, 33, -9, -26, -41, 4, -60, -10, 5, -1, 50, 11, 4, 33, -25, -5, -13, 9, 39, -23, -55, 20, -1, 45, 7, 18, 12, -26, 35, -9, -28, -6, 1, -2, 18, 12, -14, 4, 34, 25, -2, -14, -22, -9, 77, 21, 9, -70, 52, -17, 45, 53, 64, -9, -8, -31, 24, 35, 4, -2, -59, 0, -50, 8, 18, -31, -37, 1, 29, 39]
2692C9n9K2n4L8n5P5J4J4l1L8o4QqJk5Q0m3MJ0NoKkm6M2nK6m5R3m0On6P8k1l1
2727Dm9M8j7R4r8J05n9J4p7N5Jn2rR1j6j3l0L0M1o0Qn4M1kl1L4l1M7o2O1l9k5
2759e0O7m4L6k6O6k6k3j5N4n2MK7oj0J9J4l9RK9J9o5qN2o1pO3j5j1pK5K2k7Oq7
2793f7R3o2JLM8l0QPJ2j5lK2l6L4j4J5l8N1k4m0L5rN1K3q7j6N7Rrm4K2R4j05L5
2827B1l1M1n0O3k7j3K0j5JJ0L5n3J1m5K9J4K2Jj5m9L3K3j5Nk8lJ5j5o7Q4m1%O0
2860B1ol9K0RL5l3j7k1N0p9O2k6N0o3N3L8m4N3j17M4qPj9O2l1M2n6N1m2J1kj8
2892a3J3J9j2nK7l3J5j7L6kk8k4O0k9J1qm3J06p5J7q5N0PK8l6J2j0j0K4Pn2M0
2924a0M7qk9l9%K5Ol8O6rj3M6m9L7K2rj5om6K6jjk3O5k3pJOk8j3K2K4N3r5J4Q
$$ y = [39, -20, 2, -52, -14, -69, 6, 20, 34, 3, 41, -23, -15, -23, -22, -47, 33, -10, -6, 4, 9, 3, 5, 3, -43, -1, -6, 20, -25, 68, 28, 34, -22, 56, 35, 4, -45, 3, -14, 80, -18, 87, 28, 42, -35, 20, 21, -31, -40, 51, 35, 22, -8, 22, 63, 3, 11, -43, -2, -4, -35, -1, -32, 15, -47, 14, -25, -50, 17, -27, 9, -17, 49, 23, 0, -15, 39, -13, -9, 18, 12, 2, 21, 35, -4, 5, 34, 53, -12, -20, 32, -29, -36, 27, 12, 1, -6, 19, 41, 14, 20, -67, 26, -36, -35, -32, 16, -14, -6, 1, 13, -2, -5, 17, -19, 15, 1, 16, -22, 29, 5, -35, 0, -9, 42, 65, -22, -38, 19, 28, 19, -25, -3, 91, -14, 21, -10, 31, -19, 44, 17, 4, 24, 9, 10, 20, 55, 2, 13, -32, -3, 11, 33, 34, 19, -30, 3, 26, 11, 16, -12, -15, 0, -15, -82, 2, -39, -39, 21, 15, -24, -4, 5, 40, 7, -10, -31, 19, -60, 2, -24, 26, -37, 16, 54, 10, 63, -54, -10, -18, -11, -30, 32, 1, 43, -13, 38, -4, 7, 5, -13, 0, 19, 7, 2, 29, -4, 11, -6, 30, 28, 0, -24, 36, 7, 18, 10, -33, 73, -2, 15, -70, -20, -13, 15, -21, -9, -19, -29, -5, 2, -50, -10, 37, 29, 0, -39, -39, -14, -8, -46, 20, 11, -2, 44, -5, 32, 54, 45, 30, 24, -22, 4, 3, 2, -21, 44, 21, 14, 15, 21, -7, -20, 2, 26, 79, -16, -2, 6]
2960FNKj5J8J1l0l2M0j3k6J5N4n7j9K4Qj4K6K9m4L6rj5k2O2n6k0M1K5m3K1J8k6
2993@N1lj0j6mJ3k1Mj7j3j2Q2p5Pm4Q9%j0k7k4L6m5L9kN5n7J8j6m4P6n2K5Nk4
3027a6l1R2r7P3J3j1o0P4j7J1k5j2j7J7j1R%jj0P8n0rOK9K5o5mK5Lmj2pK3k3j4
3062a8lM3j3M2n7K0Kl3K6k9l2M8K0j1k0M3m9Q1m1k8J4K1l7j3k6M5Qk6l8L7lJ3
3094a4Qj9J4k5M3nRL3j4OpRk3l1j3L8KpK5k9M2jlk3rK0m3L0j4mj6JM8mk7NJ1l3
3132b0O9m9j3j0j0M6kL2m0l6O0n6j9M5L8n0J3J1j3k9M5J8J3l2l6L4l6k0Q2k0q
3163Gk2L1k1pJ7qMk6L2m5Q1j4n3Lk1L7M3k2J7K6m0mJ1j7ko4O0l3J1k1j7L0oM9
3197A6l5J2J3nln0M9N2j00P8j5m9nL1l3K3J9m8j2Q2j8OjJ3n2N0Jj5L9k7rL8n9
$$ y = [6, 11, 13, -2, 16, 27, -3, -35, 5, -8, -34, -19, 35, -22, -41, -17, -9, -23, 3, 32, -12, 24, 15, 0, -22, 40, -16, -36, 5, 30, -13, 8, 26, 0, 51, 48, 38, 22, 18, 31, 10, 14, -3, -16, -28, 54, -21, -14, -58, 31, 31, 21, -6, -30, 6, -39, 0, -2, 53, -4, 14, -2, -46, 30, -22, 3, 8, -16, -47, 45, -52, 21, 34, 23, -37, 37, 20, 31, 6, -6, -23, -6, -17, -8, -8, -9, -19, 59, 9, 0, 6, 35, 60, -5, -9, 16, 19, 15, 3, -4, 19, -4, -18, -21, 22, 9, 51, -6, 14, 16, -17, 9, -20, -52, -4, 16, 5, -15, 28, -21, 60, 19, -9, 5, 26, -11, -24, -50, -5, 3, -23, -61, -24, -27, -14, -6, -25, -11, -36, 7, 2, 11, 44, 30, 36, 29, 38, 15, -16, -29, 9, 11, 4, 29, 0, 42, 41, 38, 15, 6, 26, -17, 13, -1, -5, -21, -20, 28, 24, -3, 2, 13, -20, 49, 0, -13, -23, -33, 13, 11, 43, 3, -33, 27, -29, -48, -3, 35, -15, -2, 9, -4, -33, 12, 30, 43, 11, -25, 9, -27, -47, 35, 15, 7, -15, 16, -5, -12, 5, -3, 1, -25, 7, -38, 43, 29, -24, -21, -42, -5, 38, 16, 33, 59, 19, 15, 26, 9, 7, -57, 3, -30, -19, -40, -57, -27, -33, 16, -19, -7, 6, 1, -2, -52, -3, 49, -51, 27, 12, -37, -42, -11, -44, -21, -2, -50, -62, 20, 2, 8, 7, 20, -32, 18, 19, 4, 43, 16, 7, 45, -14]
3230a4K7k3oK7Rl8j0m0L0K9J9knnM9n4l8R1p9OP4p0K2ql8M9rJ7k5J8q6J18m2m
3264a1M7Rn1j4N7m9K2q8J01l4J9j0RL8jJ4j11R8o8L6j4K8k5Pj0k9J1O4l4O5j3
3295F3r4K3pJ6K5j3kl5P3jq0L7j3j4J1j6M4k5m3oL4J9k5J2J9K3p5L2R0n6n3P4
3327C7l0p6L1L2ol2Q3J9o5L9k4Lj2kP9n8m3M7k3rO6o6L4J3j9o%kql5M6k9k9J07
3361F2r4M6Ro5NO8Oj00N5k9L0J2l7M0l1l0K1J0qLM2rJ1j9J7K0l7MPPjj0Om8M0
3396Ck2pQ8Kn6J1k7K8j7j4k9N9k9JJ0j6N4j06N9k7K8k7j7K0mL1Ll2MNJ7L1q7Q0
3430A7l9L8m4k2M0J4mN1k8rj4LM7k6K7n6rj5L8L7l3m7M7L8m0r0N4L3rL4L1q4L8
3463A8K9j00O5M1j6n3J5j0j9K7J9o7L5M4l1j5l1M0J9m4J9m2M7J8K0j1k1Qn2P2
$$ y = [-14, 13, -10, -16, 11, 20, -18, -28, -68, -38, -9, 10, 8, 3, -2, 47, -7, -45, 46, -33, -27, 47, -23, -1, -9, -47, 2, -7, 10, -15, 3, -83, 35, -7, -11, 36, 45, -6, -20, 37, -12, 10, -78, 23, -11, 8, -2, 7, 45, 44, 58, -53, 45, -23, 13, -1, 27, 2, 9, -1, -30, -19, 45, 11, 76, 63, -31, -8, -15, 1, 26, 13, 11, -24, 49, 48, -32, 5, -8, -22, -11, -27, 17, -8, -51, -57, -23, -4, -29, -17, 2, 25, -50, -18, 72, 16, -37, 37, 7, -69, -38, -6, -12, -44, 39, 58, -7, 32, 8, 11, -1, -3, 76, 18, -25, 22, -1, -10, 56, -10, 24, 37, 18, 12, 12, 10, 2, -33, 13, -16, -45, 62, -32, 14, 23, -42, -37, 31, 37, -63, -8, -37, -7, 5, -32, 8, -23, -53, -32, -22, -30, -27, 15, 6, 17, -2, 15, 35, -2, 2, 9, 16, 15, 5, 11, -37, 3, -19, -26, 62, 64, 8, 19, -8, 20, 3, -11, -40, 19, -10, -9, 1, -15, 39, -67, -8, -35, -7, -34, -51, -31, -35, -4, -1, -33, -29, -24, -7, 24, -63, 17, -22, 16, -28, -50, -10, 4, 0, 51, 23, 14, 0, 3, 50, 24, 51, -5, -14, -29, 9, 46, 13, -34, 13, 51, 11, -79, -25, 8, -1, 33, 64, -20, 18, 47, -53, 12, 53, 37, -16, -1, -11, -30, -3, 16, -51, -16, 28, -3, -18, -49, -9, 10, -34, -15, -57, -10, 8, 28, 17, -4, 4, -48, 24]
3493B4o2J9J4M0k8jmN4o4Q9p8KK2Ll1j1J01p9pjK0n2K4k9M8k9L6m1Q7q1L5j7J6
3526A9j4k1J6K8k2L3n2l4L8omo4J03n9K0J1JJ4J0l2L6l2mKO1l0n6P7j0L2m7K8
3558D2m1kL0m9JM0kL6jj5k3j9Mm6Q0p4K4N0p9M5k9K0oO2l2l2o0Q3p4L6L1Rm6j6
3592e3K0M2%j6K5k4M4o1J2M3l5J3Lkj0K1K6K4q9J4M5n3P7p8L2k8Q0m1k0rL0K1
3624E3k8l5k1M9K9p9P9l8j1J9j5L5j4j9m1R8o2m1PNK4m8R4n0NPl6L8Ql8PK4KL3
3658D0o3J2OK2M2q0L1RRm8m8M0O5l3Pk5N4m6M8l6rRp3J06o3M0K2m2l1N8o7N8J2
3691B6nJ5n3J5M7p7J4N2q7O4p2M7LQj9MlJ8J9j8j3K8k6J2J2j8L4k0j9M4J1q2L9
3724@j9M1m4L9kNqM1r8Q9p7L3l7M9KL6p9L6m9L5LJ7J2l3J6l7M0n5K4oK9rJ4mJ
$$ y = [24, -38, -19, -5, 35, 7, 6, 2, 56, -8, 81, 3, 5, 27, 30, -1, -12, 89, 10, 3, 2, 22, -30, -6, -35, 13, -16, 20, -21, 66, -15, 20, 3, 19, 5, -16, 0, 28, 6, 39, -13, -47, -9, -15, -19, -83, 20, -39, -19, -8, -7, 7, 17, -15, 21, -11, -15, -13, 48, 18, -38, 39, 29, 61, 14, 42, 1, -1, 29, -20, -19, 21, 19, 55, 54, 39, 16, -3, 1, -45, 35, -39, -15, 35, -44, 1, -28, -8, -14, 48, 16, -16, -76, 7, -67, -31, 0, 9, -37, -53, -33, 9, 9, -7, 18, -6, 38, -23, -11, 32, -3, 10, 13, 11, 1, 22, 48, 72, -17, -3, 42, -11, 66, -12, 20, -8, 72, 31, 11, 2, 32, 53, 25, -10, -31, 18, 47, -32, 47, 9, -2, 17, 2, 37, 23, 4, -37, 61, -1, -42, -35, -30, -6, -54, 40, -10, -5, 2, -34, 4, 12, -26, -19, 5, 7, 40, -23, -11, -5, 17, 59, -21, 10, 19, 28, -20, -68, -28, 37, 4, 11, -14, 40, -6, 42, 6, -3, 6, -67, 39, -24, 16, 38, -4, -35, 23, -44, 14, 26, 21, 36, -17, -2, 45, -32, -18, 34, -53, 11, -61, -14, -11, -3, -22, -18, -21, -3, 16, -2, -15, 13, -13, -1, 11, -7, 27, 7, -12, 32, 43, -39, 0, -19, 22, -22, 17, 15, 20, 12, 53, -45, 44, -33, 0, -37, 12, 14, 50, -29, 7, -42, -7, -4, 13, 25, -8, 8, -29, 11, -44, -20, -26, 3, -6, 8, 4, 5]
3759EJ0jj6K0o6MN0l9M6J6l8N5l2l3jL%J4l2MQ7l4j2m9M4%N6m4l8N5m0N9q3L2
3793BK8J7l8j6JL1omn7M2k1ok5K9M9Pm9j0J1J8k1ML1k5l2Q0q6O0PJ9k8n7J6O5
3827C6m4%J4l1k8M4K1n0M1Nj3L7J5k2Mo6PL1J1%qlJ2MK4l1NJ4l2L4J0l6K3j8l1
3862b1M5o2L3L6K6p5J2J2j4RKpJ2l9Q7o9L8qm5rL4Q5l0l5kl3N0p2L2K6m0k1J12
3895F9n7j0M7l1k2K3M2m1M8o3k6QL2Jn4L8QoK5m0K7roKrML5n6mlK9l5mO8m1j6
3931b7L3pm2M3K7k7m5j9Q3J4k7K8m1jKJ5l6Q7Mo9%QJ1qj7M7n0K5k7N5n9Jk4oM1
3966hl5N2k4K2l5Lj2Q2m7J8m3lj5P1p2mN5oJ1j6K5lLKk1j4M2n6Q7k7Qj7k2l1P8
4001D8p3P7m3L7m4J9m6O4j6l1J4j2L1k3k5J7L3l1K5q6P5j3N5k8jk9O8q7K6J0L3
$$ y = [5, 15, 14, -2, 18, -48, -44, 6, -33, 13, 29, -9, 46, 14, -19, -20, -17, -17, -3, -35, -31, 56, 22, 10, -39, 5, 5, 61, 17, -21, 34, -6, 53, -30, 2, 30, 47, 9, -7, -6, 25, 19, 15, -42, 0, -21, -27, -52, -23, 26, 33, -16, -26, -15, 3, -18, -14, 17, -8, -40, 40, -46, 14, 21, 40, 12, -45, -29, 36, -8, -8, 6, -25, -53, -9, 12, -38, 3, 8, -5, 32, 47, 25, 29, -37, -30, 1, 12, 12, 4, 1, 13, 17, 41, 10, 15, 29, -3, 31, 41, 5, 28, 10, -21, 24, -38, -5, 31, 57, -18, -6, 6, -8, 1, 3, -4, 8, -31, 56, -13, 25, 17, -28, -37, -3, 82, 52, 17, 15, -18, 32, -40, -8, 18, -22, -43, 69, 12, 2, 49, 18, -4, 19, 61, 20, 68, 5, -21, -13, 19, 20, -34, 4, 12, 6, 31, -9, 18, 9, 3, 5, -4, 0, 35, -21, -25, -28, 1, -34, -38, 30, -11, -27, 6, -1, -43, 0, 27, 0, -45, -64, 19, 33, 6, 34, -7, -8, -6, 9, -27, 60, 64, -5, -5, 3, 14, 6, -11, 36, -14, 11, -16, 39, -20, -19, -43, -49, -8, -43, 9, -15, 7, -28, -25, -37, 45, -2, 16, -27, -30, -45, 26, -46, -50, 5, -1, 10, -6, 19, 16, 19, 21, 0, -14, 28, -28, 59, 32, 40, 23, 1, -30, 48, -25, 52, 9, 46, 2, 21, -25, 39, 23, -8, 6, -6, 25, 2, -23, -6, 27, -4, 21, -65, 10, -3, 52, 24, 23, -6, 62, -25, 1, 11, 44]
4032D4o2L2l7m4K4K7j0j4K7k5j5N9qM5rm3K7j3Pm1L9jNl9nL6M7m6j6J8K2k4rK4
4066B2k5L4l6j0J4M2j2J5m6k5O7l9PK2J2l1Qo0RP1k9m2P3n6K4j9n2J08o9jP1m5
4098BM8m9nL4j8Kq1J44q4j5K7N7l3m4N3k4Kk0NJ0k3O3m4Qj0kJ5j8rJ6oP0q7ok4
4133d6Q6m4l9R5l1o0l5Q4o4m1R8l5K2j9J6K9o8P2p3N5O5j07MK4J5m2N1Qj9K3N
4164B9j6l4O7m3JL9l9j0NK4J7j4k8L2n8J5K4mk5K2rK6J0K6r4P3j7l6K2J1M3j08
4196d9N7Lpn3MN9Lj7pkNJOo2Q4l3K2ONk7J4j8J9K1J2k3pJ1p7L1kL0l9L0k7J4l0
4233d3J8K4J4l5L1pk6j9L8MJ0j4m1O2m4j4J9O3n3L3p7M5Qj1J7k6K9j2M9k1J8j15
4265g6P5l1M6j7L3o0J3J6KL1j3k2OK8k4j1m6N5K7j8k6K4l1l8O7J6k6K4k5K4p3
$$ y = [44, -18, 14, -23, -67, -43, -16, -26, -40, -13, -38, -53, 6, -2, 43, 34, -9, 18, 5, 12, -29, 10, 9, 14, -25, -30, 6, 53, 7, -9, 9, 31, 7, -2, 22, -3, 31, -5, -15, -1, 41, 29, 44, -2, -27, 40, 1, 8, 30, 42, 11, 19, -41, -32, 39, 10, -32, 41, -15, 9, -10, -62, 46, -23, -24, 47, 2, 50, 1, -4, 30, 12, 14, -67, 77, -7, -22, 5, 62, 29, -15, 38, 14, 16, -4, 1, 11, -12, 51, 7, 15, 5, 3, 18, 0, -9, 7, 1, 71, -16, -22, -46, 40, -4, -43, 52, 21, -39, -74, 10, -54, -95, 3, -32, -10, -29, -13, 16, -52, 20, -53, 2, 67, -40, -36, -12, 3, -39, 12, 20, 1, 24, 29, 13, -21, 46, 3, 4, 43, 4, -6, -1, 23, 40, 26, -2, 30, -28, -13, 11, 7, -18, 4, -5, 21, 31, 57, -37, 36, 19, -17, 5, 16, 59, -49, 8, 11, 4, -49, -45, 14, 17, 0, -7, -9, -4, -3, 3, -59, 25, -8, 14, 20, 25, -2, 12, -6, 13, 34, 46, 23, 16, 27, -50, -19, -21, 9, -30, 0, -27, -13, -43, -25, -1, 13, -22, 9, 2, -24, -43, -5, -1, 9, -5, -46, 16, -28, -42, -23, 40, -13, 20, -57, -12, -4, -15, 2, -24, 5, -7, 42, 21, 39, -76, -1, -32, 14, -3, 30, -30, -17, -1, 1, 32, 19, -3, 3, 31, 7, -4, -50, 5, 32, 14, -12, 12, -19, -57, 10, 26, 0, 24, -1, 23, -50]
4296e0O9k3M1n4%N8o1J7L4j6k8L1n7K0L6Km9j4L2O0q6M2l9N8o7L6J4%kj1M1m7
4328a3L6n0Rl0N5l6O4j14J19K5p4L9n4L5PJ5n2P8qm8l4P6k0n3K6m1J4M8k4j0m
4359a9nN4n8P2n4J7L3n1mM2m1Qj9K3l0L1J5k7K2l6J6k2N9Ol8J6k2K4J9j8j5k3
4391b5PL9n7N1n9N8m4O1o0M5M3l6ml6O8l1l9j3J4N8o9L7n6K9Qopm1K6MM6j0m0
4424c9M8l3RlJ1j9N0K3j0Lo7K9K1Qp6L5j6O6k8K3k1m6N4j3O5r7j1N4kN2m5m3J
4457a7m5O0Pj1L8m4l6O2%k5J9k1OL5L5p7N9p4L0J2J8j8K4j7o9J08n2m0K3NJ3m3
4489c5K3L5m2j4PJl2O6j8J6m6M2k1O4k9j3j6N2j13J46m1k8j2L5k8RJo8R3m8L5
4520B1K6q9K7prJ5J6K7n2k1LN4l5O1j9k9J9n4JML0K8k4K2K9j8MPj0Mrl9rM9J6
$$ y = [-50, 19, -4, 37, -17, -17, 41, -20, -3, 31, 15, -13, 18, -39, -19, 17, 19, -30, -44, -12, 48, -38, 4, -35, 23, -44, -8, 6, 6, 4, -7, 34, -13, 23, -27, -18, -48, 7, -29, 35, -79, 40, 65, -9, 30, -24, 11, 18, 33, -19, 59, 51, 3, -31, 45, 25, -28, -2, -43, -29, 19, -5, -15, -19, -24, 30, -28, 44, -10, 7, 40, -11, -15, 27, -14, -6, -25, -2, -32, -1, 14, -13, 9, -27, -11, -33, 26, 32, -6, 10, -12, 12, 31, 13, -2, -25, -18, 21, -36, 15, -44, 14, -30, 31, -29, 16, 59, 23, 19, -17, 51, 20, -19, -32, -18, 40, -29, 8, -48, -19, -11, -17, -24, -65, -39, -35, 11, 1, -39, 9, -24, -15, -18, -7, -26, 24, 47, 37, 40, -27, 2, 23, 31, -45, -10, -26, 40, 12, 35, 14, -32, 22, 9, 74, -23, -34, 20, 18, 70, 25, -18, -17, -62, -2, 5, -6, 32, -12, -48, 14, 14, -11, 8, -13, -7, 28, 63, -14, 45, -29, 1, 13, 31, 13, 37, 20, -49, 59, 7, -33, -10, -5, 8, -35, -12, 23, -19, -33, -26, -25, -57, 9, -9, 7, -39, 3, -18, 46, 17, 4, -12, 40, -73, 73, 32, 4, -8, 27, -1, 8, 9, -59, 34, -14, 21, 47, -42, -15, -22, -31, -16, 0, 27, -25, -46, -43, 11, -24, 37, 18, -11, 8, -46, -45, -41, -11, 17, -7, 15, 44, 26, 30, 37, 27, 31, 22, -17, -26, 23, 39]
4555C9k4LJ4n2nL4K2RLKm6lj5O6l6L6qm2k5O5o6J7RPj7L7rm1J7l6L9Ok5K7K7o1
4591c2J9qO5p4J5pN9m0M3o9j6N1l4N5m4l1L6J9j6L0j2OR%n5N6k8k6N5m2QK8k0
4624@J0J6k9O4o4J8kj2Ql7oM1l2L8J2l0lJ3m6RJ9J3m6J2M8j9K2j8kLL3l5J1l2
4658b3N2k1J4oN2p9k3L0N5n7m2K7K9l0O2j6k4k8K3j3O3k4m3K2j9K0L0j1l0N0j4
4689B6j7Mm2N2j1lrnk0P2m2n2J14n0k5M8n9%J6QmM3r5O5k3K9Mn8%O2k0J2j7j7
4723a4mN5on7P2l4J7K4l1k1l1L5K3m3k2K5K7K4q3L4j6L6kk7JJ8K9l6K4j9oj9o
4756c3N5n3M0J5mKjo5KK8O1o6J7K6k2pN4k8m5L9l9M7P2j03lO7j05M6M6j7K7j00
4788d7L6M0l7rpK8J8l0K4K2Oq2K8%LoL5qk7J1k6j3N7LJ1M5m7j8L1Ro9J7Nl3J8
$$ y = [39, 15, 18, 32, -20, -25, 9, 31, 40, 43, 45, -1, -4, -19, 47, 11, 47, 39, -3, -28, 37, -29, -12, -3, 4, -13, 24, 15, -26, -9, -45, -6, 0, -25, 2, 29, -32, -13, -21, 44, -30, -15, -22, 37, -3, 40, -29, -45, 6, -28, 27, -17, -48, -12, 7, -9, 21, 9, 15, 24, 24, -31, 25, -3, -29, 26, -16, -8, 20, 0, 10, 26, -3, 61, -3, 15, 13, 1, 9, -28, -34, 7, -25, 13, 25, -5, -8, 5, -41, -32, -13, 0, -46, -34, 14, -5, 17, -1, -3, 0, 33, -2, 9, -23, 29, 8, 22, 16, 68, -11, -34, -4, 51, -6, -48, -21, 8, -22, 40, 24, 0, -28, -5, -18, 45, 21, -22, 0, -19, 1, 31, 20, -10, 40, 26, 9, 13, -29, 23, 12, 9, 0, -5, -25, 47, 5, -47, 67, 17, -8, 40, -19, -19, -3, 5, 1, 44, -51, 14, -9, 20, 24, -34, -34, 28, 8, 20, 3, -14, -18, 37, 31, -26, 46, 12, 29, 53, 22, 1, -30, 5, 28, -15, -37, -12, 15, 39, -44, -10, -26, 10, 8, -19, -18, 0, 29, -7, 17, -2, -8, -27, -33, 22, -31, 9, 24, 20, 22, 21, -44, -42, -14, 47, -19, -2, 24, 2, -5, 49, 21, -24, 15, -24, 23, 95, -8, -11, 56, -49, -3, 43, 26, 53, -47, -11, 29, -8, -17, -24, 4, 22, -8, 16, 38, 44, -38, -10, -10, -7, -13, 22, 14, -13, -2, -28, -41, 16, 19, 30, 75, 28, 10, 41, 50, -19, -2, 3, -30, -12]
4823a2L8m6M8Qm4ROj6J5J8jj0rN5m7lk6M8l3%l1K8K4J6J8n5LQMj3k0L4l9O7Op8
4859c0J6K9k1K8k5Jm1L2K5l9N1l8l8M9O0m8nNrn4Q7k6K0j4l7M5k3L3l5M3k7J1
4891B5l2okJ4L5j2k6LJ2k9N6n0j2K4m2K6LO3l2j3Ln9Q6jn1L6l1Jl8O3J5l5k7j
4925c4Jj0RK1k5M9k0pmnM1j9j3NL5k8J9m0J8J%n3P4n7M1L2K0l3mKpk8K3m0O1j8
4961Gm8K7L4o0N9l1kO0r5R0j1l5L2j5p5R5l9nk9O0m7K7k2J0nL0J1q2L2J5%Kj9
4994b9M2j1K4No4M3l5L1J6q2P0M6j19M3O9n4j1K3MK8k5M2j4j2p8M7N6k8k6kK6
5025B5L9o7J8l2Nk9O3Jl6l7K7O7pm3k8K4L9pl4l5k2Q9pK7K4l2k2m5k0K5M3OL8
5058E7k8p1O5l5L4m8L2MK8k9J2j1K4k7M2Rl3o0O1j6m2J5nj7J2N6on3K0l2j1O9
$$ y = [-12, 26, -20, 28, 36, -8, 1, 7, -9, 6, 24, 23, 13, 4, 59, 12, 9, -17, 31, -2, -2, -33, -5, 19, 35, 53, -2, 1, 9, 13, 0, -20, 14, -25, 42, 48, -30, -14, 15, -6, 22, -3, -2, -43, -11, 14, -25, 26, -12, -50, -1, 59, 11, 6, 11, 2, -52, 35, 9, 29, 15, -22, 23, 0, 33, -2, 41, 14, 25, -7, -13, -15, -1, 34, 22, -4, -1, 11, -18, 38, -12, -24, 0, -42, -16, -13, 50, 18, 5, 8, -51, 35, 34, -17, 19, -12, -11, -49, 14, 29, -6, -33, -34, -33, -43, -34, -13, -38, 11, -9, -16, -20, -25, 16, -3, -16, -11, 24, -4, 15, -25, -7, -6, -6, -59, 15, -42, -1, 31, 51, 18, 14, 16, 9, -19, 4, -36, 25, 7, -41, -14, 20, -40, 19, -12, -14, 46, -49, 41, 30, -5, 27, 12, -63, 32, -7, -12, -41, 19, -28, -1, -23, -13, -18, 12, 23, -59, -27, -12, -12, -10, -29, 13, 2, 26, 31, -33, 10, -25, 6, 22, -60, 10, 56, -63, -20, 49, -5, -16, 7, 11, 39, 14, 56, 42, 30, -48, -1, 55, 27, 1, -1, 25, 64, -3, 15, -17, -12, -41, 22, 23, -13, -50, -23, 44, 37, -6, -34, -10, 29, 22, -12, -47, -69, 20, 13, 40, 64, 32, 10, -35, -55, -30, 13, 19, 57, 29, -42, 23, -12, 22, -26, 6, 10, 38, 9, 21, 10, 34, 7, 49, 58, 25, -35, 26, 10, -32, -17, -22, -39, -27, 29, 23, -30, -10, -42, -53, 16]
5090A6k3J6l4K4qJm1L4QM4m2l8J5J4K5J2l5K3j9K3m6NM6j0j1jO6o6JQL3k2RqM
5125B3k9L9oJk4j9QOJ0m4j5M4pl3N2k4j0L5k3j1L2k2L3k8j0J8jJ8lk6M1m9MK0
5159@J8l7J0j2N0m0J0O0j7o8J8K2m0J2j9N1k7JK9N9l5n9J5n2M8M9q5O5l8J9Ml9
5191b8O9o4M8m9Q9q7k2Q7q3R3n3j4J2k6J6J2O0o8j7K0J2j6j1k7P7o5L9o0NM6J2
5222GJjk4L6m0N2n8N5n9J18j11Q7p1k9J05r5L2k9K5o1O5pK2n2M6m9O2k8N6q3K7
5253anJ0J3m7J8J6J2j2m2K2lK0j0j8k2N7k6J8O6o2QmPK4m1j8qO3j9K8o3nM9l7
5287a2m2L6J7N0m2L8n1j9N8m0P2p5l3O1%Qm9L6j3J6J3j4K7o1K1J8N9q1K8K0j0
5318C6j27N9O2m1M3l9lLJk2L5J6l7N2q2O8qk5N8o0K2j1l3N8jRj7k9J9J6mK0p0
$$ y = [16, -7, 9, -25, -1, -9, -8, -49, -15, -7, 37, -5, -43, -28, -14, 11, 23, -12, 11, -8, 15, -31, -26, 20, 10, -1, -2, 64, -2, -1, 7, 40, 18, 27, 19, 23, -6, 33, 27, 28, 4, -15, -7, -1, 9, -35, -50, -6, -13, -46, 6, -18, -28, 7, -16, -27, 5, -17, 16, -12, -22, -4, -5, 13, 10, -16, 25, -24, -20, 0, 18, -19, -9, -21, 29, -11, -1, 59, 42, -26, -8, 14, -26, -14, -33, 18, -9, -8, 21, 80, 45, -14, 1, -51, -3, 46, -39, 26, -12, 7, 11, -28, 41, -23, 25, -24, 65, -22, -44, 43, -40, 53, 0, -14, -2, -28, -12, 0, 60, -8, -25, -5, 7, -9, -20, -47, 30, -35, 4, -56, -51, -5, 7, 8, 7, -17, 19, -21, 31, -27, 28, -31, 87, -24, 63, -8, -37, 68, -27, 5, -24, 1, -60, 5, -2, 20, -32, 14, -35, 27, -1, 55, -28, -1, -6, 4, 17, -30, -12, 4, 16, 4, -38, -16, -19, 1, -9, -27, -49, 8, -18, 0, 66, 4, 12, 8, 15, 39, -2, -20, -28, 35, 16, 44, -19, -24, 25, -12, -54, -18, -1, 49, 7, 45, -6, -25, 33, -7, 65, -10, -43, 18, 18, 26, -23, 13, 0, 16, 29, 15, 42, -19, 2, 20, 79, -2, 26, 46, 36, -91, -32, 30, -11, 32, -7, -10, -7, -6, -28, 7, 23, -14, 38, -44, 24, 16, -9, 49, -11, 11, 0, -33, 25, 24, 33, 16, -13, 6, 22, 18, 38, -32]
5351c2N6k0RQml2K0pK8o4K0K2k7M0l1NKKM9k8j1n0L9J5N0j1q6M4J4k6L3m1nK7
5385Hk8L5rl2nM8j7j4j3P7k1q6N8K6J4j7l6J5OK3o0L5j3k4K5J3mrj2L8jm%Oo1
5420c9j3R0m2K6l4m8K3N8k3K0l9L9Lk2K0J6n5L4jk2j8M1k2J6j1mj5M8n2J4J2K5
5452B5l1Q7m5j8J3Rp8M4jQk7N4l9K3l9M3p2M9M3p1L7o2J1K7N6j3l3J8pj6k1K3
5484cpK7pm1rRN3j8kk0M4l8J8oj3rK4qN6k7j1pl9R4k8n7L4l0O6m4L2lj2OJ7J1
5520E2o5k2O1n0J0k8O9j5m0N1j1mj0K6nJl0O4n7nm0N9m7K2QNk9J8k0J4P1o9L7
5553B1Qp7LP3rj7Km6J9J4QJ2M9r5K7l8L2%L6K6n8O7n3J1Jj5j8K3j0L5l1Pj7pO
5588a1KkK0n6M0L2m1M2k7nL1J2o9M2j4k2O3k5L7n2l6M3k9Lo2R2RoJ8j4l2K4n7
$$ y = [-32, 24, 4, 13, 21, 17, -15, 5, -2, 26, -38, -18, 4, -23, 17, -14, -9, -7, -5, 44, 16, 5, -45, -6, 9, 59, 48, -38, 6, 20, -6, 27, -14, -19, 8, -20, 15, 6, -26, -31, 17, 0, -14, -27, 50, 29, -57, 1, 27, 41, 24, -12, 3, 9, 32, -28, 7, -6, -30, -5, 8, 4, -5, -17, 21, 20, 16, 16, 22, -39, -52, 38, -4, 22, -12, -60, -37, 21, -2, 18, -21, 18, 21, -1, 19, 35, -20, 14, 13, -9, -27, 14, -8, 8, -3, -7, -22, 26, -26, -12, 0, 25, -6, 81, 36, 18, 31, 40, -38, 6, 5, 13, -14, 40, 1, 24, -15, 28, -44, 5, 48, -23, 14, -48, -37, -10, 46, 33, 0, 18, 11, -5, -26, -3, -10, 17, 10, -31, -40, -31, 22, 4, 2, -18, 26, -12, 6, 0, -13, -22, 2, -6, 50, 23, 12, 5, -34, 60, 32, -25, 9, -21, 45, 1, 33, 30, 18, 24, 41, 52, -13, -35, 26, -24, -14, -42, 27, 12, -28, 23, 12, 8, -2, 24, 19, 20, -10, 54, -3, -8, -48, 11, -36, -14, -6, -1, -30, -12, -32, -18, 53, -16, 21, 29, -48, -45, 28, 19, 2, 4, -42, -23, -9, -1, 11, 60, -35, -8, -46, -14, -14, 22, 48, -10, 57, 4, 15, 16, 1, -17, 6, -4, 31, 0, 7, -10, -17, -11, -9, -11, 9, -47, -7, 25, -16, 26, -1, -6, 25, 37, -32, 10, -4, -26, 37, 12, 49, -3, -39, 4, -25, -22, -84, 8, 17, 11, 29, 15, -17, 7, -50]
5621e0N6nk7K5lmk4N9mk6J2J6j7qj6mJ0K%J7j2j6P8j7j1n8J5mN4m0l7O6k3Lk0
5656a3k7M1m0M0K6m8K5n0N1j2J8m6P5l3l7JO0l5k5N9Rqj2k0nL9Mn3M5J2m6O4r3
5689c4K2K5o2Q6n5K1mMNmMm6L3j2L3j1j5Mjo0N6L1o1L1mk2J9N5k0L3n1mM2l0L1
5724C9m1Rj0oJ0L6j8j6k4M6l4M5Mm2L5kk6Qm1L1M7k3K2p3M3k2j7O0k5j0J4n0K6
5757eom3rJ1mQ8m3l4M4nk6K8j0OL5Nn2l6N9k7J2%K6m8J7J4J7j4J0K5j0po8O1k2
5792a1O1m3l0L1o%j5k4K9l6O0L8m6m9P3K4m5L5p0J0kK1pN4n1ok8O9k8m9M2km7
5825d8O5Mk0l4P7o3QN0l4Qj5L1J4o6J4ORnL3l1k1K3J0k6M5Rn2k1Pj4M3K7n0N3
5859C6n8jL5n0J6Q0j10N7j1k4M9J3q9L8mL0l0K9l0L2Pmn5K2Q2m6Jl9qJ2Mm5N3
$$ y = [-50, 6, 1, -26, -1, -4, -8, -32, 27, 23, -3, 9, 25, 8, 0, -16, -20, -10, -8, -8, 9, -3, -19, 59, 42, 31, -27, -12, -16, 38, -2, -39, 27, 4, 7, -13, -40, 1, -39, 1, 27, -21, 4, -46, 5, -7, 11, -35, 40, 7, -30, -29, 31, -4, -29, 30, 39, 31, 19, -1, -6, 33, 37, -16, 29, 41, -5, 59, -34, -12, 13, -49, 37, -18, 3, -1, 3, 8, 4, 8, -38, -5, -17, 16, 5, -10, -6, -7, -67, -11, 20, -41, -10, -14, -36, -17, 38, 18, 51, 0, -4, 38, 8, 39, -2, 7, -3, -9, 1, 37, 19, 3, -21, 25, -9, 36, 40, -2, 33, 31, 5, 13, -28, 3, 50, 27, 49, -24, 19, -3, -20, 40, 15, 5, 19, -31, -5, -11, -54, -63, -52, -56, 32, -11, -45, -1, -6, -32, -4, -14, -8, 27, 32, -20, -56, 3, -24, -12, -12, 14, -34, -17, -3, 14, 0, 10, 35, 25, 18, -50, 11, -11, 50, 7, -23, 8, 2, 2, -13, -37, -8, -44, 16, 54, 8, -41, 32, 56, 11, 46, -24, -14, -16, 5, -2, 52, 1, -5, -33, 36, 8, -41, 1, -1, -48, 17, 21, 1, -33, 44, -19, -11, 39, 5, 13, -2, 29, 43, -23, -9, -3, 6, 1, 34, 3, -18, 5, 15, -11, 34, 43, -9, -30, -23, -37, 6, 33, -17, 36, -22, -23, 12, -38, -22, 58, -52, 5, -6, -30, 19, 32, -57, -19, -23, 7, -23, 6, -24, 8, 15, 11, -44, -22, 60, 14, 15, -24, -32, -20, -16, -61, -8]
5892hmM5l0j4QoL5l8K2nnm6N9L8m6nj7L3J2l6k3J2K5PJ3m7L6k2j8M1n6P7k9K7
5926C5n1j1K9n9M9L1n2RK8n2J8K4k9N5m6m1J5J4J4M3m0N7n1j3j5N6K%k4POK5n4
5959b1lMM1K4m3J5L5m4K2l9okJ7K5j4j1l8L6J3Pj6K2k1J4k7k5M9k2j3J5L6Nn8
5992b3qJ9KrN0J2o8J2KK0j6qj7J0O2Ln0jpJO0l7M6l5j4JO0m2mj3J5j5n1N8o4K6
6028b3K7M0j3k3lQj6n8P2Jl2J7N7o3K6k2k4M4j6Kl4P4q5O2m8J2mRJ8m1J0M5lk6
6062a0K9k7J9pk3P1k1n4M2M4o1j9PJ0nJ7LL6mn7J8M6n5M6k0K2m8kk2Jm6J01%k8
6096CL3Qk8m0M1Rm5J5Kk9mJ5mK0M0n3L7M4n6N7p0m4L8O7m0M4k1L2k7p6J5J2ML6
6130C5q4L1K6K1l3l0K2J1l9K2J1K9j0j6pPPk0N8l3kj5oj7N8j0n2J4mK8M3l9k7
$$ y = [-8, -12, 33, 3, -11, -3, -9, 26, -12, 10, 5, 0, -46, 13, 51, 5, 0, -17, 16, 28, -8, -31, -19, 6, 13, 26, -21, 15, -7, -25, 16, -40, 37, 8, 35, -16, -27, 2, -57, -8, 23, -29, -20, 8, -44, -26, -2, -31, 24, -22, -63, -48, -34, -20, 23, -17, 40, -11, -24, -39, 17, 19, 19, -5, 2, 8, 33, -21, -24, -20, 21, 45, 2, 17, 52, 8, 30, -9, -15, -17, 0, 25, 11, 0, -38, -2, 11, 18, 2, 24, 3, 17, -10, -35, 14, -8, -21, -6, 30, 35, -23, -31, -12, -10, -19, 31, 43, -25, -13, -11, 9, -7, -15, -32, -22, 40, 43, -7, -8, -15, -14, 46, 9, 55, 20, 6, 7, 67, 25, 21, 8, 23, 8, -43, 15, -49, -23, 4, 44, 31, 8, 5, 13, -3, -61, 11, 12, -20, -3, 54, -9, 17, -5, -29, 15, -1, 1, -33, 41, -44, 18, -30, -18, -22, -13, 5, -36, -26, 19, 16, -10, 19, -8, 11, 4, -19, 52, 31, -23, 19, 63, 2, -17, -10, 0, -5, 12, 15, 51, 47, -10, 8, 54, -1, 45, 25, 47, -1, -3, -25, -24, -70, 31, 31, 3, 36, 44, 16, -24, 17, 26, -19, -4, -2, -31, -35, -20, -24, -4, 36, -17, 20, 64, 8, 65, -5, -49, -11, 56, 16, 60, 39, 71, 44, -32, -17, -5, -1, 35, -49, -18, 8, 29, -4, -34, -12, -1, -40, -18, -7, 22, 12, -4, -11, -4, 3, -17, 41, 8, 6, -9, -15, -32, 26, 16, -36, -22, -26, 2, 45, 6, -21]
6163b1M4Jj4J1o3P6n5m5P1j5M3n4pJ6L0l6Qk4L3lLlK2pl3M2m1L3L4o0N4n8L5k6
6197iQj1J7Mj4PJ2l7LK6J0mN8r2O3p0M9j4n7O1J1n7M5j1J4j4p2J25p6RN9k8j8
6230cmJ%k4Q2kn8L0o0J4K8kj6O7nk6qm2N4k9Q0n9m9J6nj4L7l5L1J5l8l4O8l6M0
6265A4JLl8j9M4j7k1PJ7Rj8l5M6j0K7n3O5k9M0n4L3K1m3LL2l7j3N7op2M8k6K9
6298Eoj3QoOML6l4ML2o0K%K3npk0Q3n3j4K4J8m0pj8K5mJ0MK6l9j3k9L4j9L2J5
6335Dn6L8L4m6N3n0j4M7l6kjJ8Lj6J6J2p1P9qL4k7N0o6k2K2m8J9L9J0Jq2N3qO4
6369D3o3JJ3o5J29p8ON1j5o3J6O5o8N4l2KpL1n1L4J3lk9L3j1%J7p4J08m0l3M4
6401B8j9k3j6L9rQK7m7M2l6J5mL0m9q6Q0K6k8L4k7L5n6L7N5q0j3K3pJ0M3m9lK6
$$ y = [-21, 23, 24, 10, 21, -42, 34, -21, -66, 5, -10, 33, -21, -28, -12, 18, -18, -10, -34, -1, -4, -1, -4, 18, 11, -22, 20, -21, 12, 46, -14, 40, -18, 17, -9, -1, -12, 5, 9, -5, 2, 14, -23, -20, 6, 16, 12, 70, -22, 41, -29, 20, 6, -51, 10, 21, -36, 9, -2, 12, -2, -74, 51, -25, -16, 43, 15, -3, -7, -6, -6, -30, 52, 50, -8, 22, -38, -24, 4, 2, -14, 53, 48, 22, 14, -28, 26, -3, 77, 18, -31, -15, -20, -34, 3, -32, -1, 14, -24, -58, 10, -26, 14, 15, 18, -20, -39, 5, -12, -33, -26, -9, 0, -18, -53, -7, -17, 10, -43, 22, -7, 33, -21, 12, 33, -10, -7, 25, -12, -25, 32, 26, -46, 2, -24, 5, -1, -14, -6, -12, -6, -2, 34, 0, 4, 36, -24, -22, -22, 1, -4, -11, -31, 52, -1, -15, 9, 27, -13, -20, -38, -13, -17, -7, -3, 23, -16, -29, -58, -24, -43, -11, 4, -52, -14, 20, -26, 27, -23, -37, 10, -26, -28, -29, -11, -8, -24, -8, 4, -67, 12, 4, 38, 11, 61, -5, -27, -5, -53, -34, 5, 15, 16, -66, -13, -21, 43, -20, -19, -6, -71, 58, -20, -14, 37, 22, -41, -25, 40, -28, 26, -6, -4, -11, 20, -31, 3, 16, 13, -16, 17, 6, 6, 23, -51, 57, 17, -16, 28, 9, -14, -30, 9, 0, 8, 35, -12, 30, -6, 9, 5, 35, -14, -100, -20, 6, -22, 12, -15, 20, -36, 1, 56, -24, -37, -14, -21, -11, 32, -17, -20, 6]
6434Fk6rj5K0M5n1O0j6k0j8M8l5%L8j7n8J5M2n2J5J4K4ol4ON1jl1LJ6k4J6J3L1
6468E0n1j3k6M6J5m2Q0q1Om5R4l6K0k7L7n5J7K3n0kO3onnk2MK7o7P9l0J6k5Pl5
6502c9O8o6J7l2P3jl4N6k2l9J3K4n5JK9j8K7L8k2Lk3J2KJ7pm9K6rj0K0l3PL1L9
6536D4m1rK0r4O5P0j12K9j1L5L7l0n2Q7l3rlm0L3M3j9n6L4J3L4l7M6l3k5M6j06
6567g4N0K4l1O2p6M1J1j6M8n0N4m7j3J5K8n7M3j9L8m8j0L0j1k2L3K4J2j4k9k5
6597b9Oj0L2J8r7R0k7K0J0pm6J9N4mj4J7m0Nl8M8lj1k0oMO1j5l7M9K9o4P0j2r8
6631d6Q0n0K8Prk7J0OLm7M1kJ7j0J2m3M9J2n8Pj2J2L9k4K0j1J3l2l7N4k1LK6L2
6665D2ol8p1O9%QJ9M8n5m5rJ6M2n1L5m3N9p9P3K6lk7n0QN8n8K0OL6m2K5k8K0J3
$$ y = [6, -20, -29, -44, -24, 21, -30, 30, 14, -6, -24, 24, -11, -11, 27, 10, -48, -33, 9, -43, -28, -14, 10, 4, -30, -24, 27, 26, -5, -2, 14, -10, 6, 19, 50, -1, -14, -40, 6, 21, -21, 59, -22, -16, -61, 33, -3, 17, -10, 27, -28, -11, 12, -38, -40, 23, 17, 12, 7, -15, -11, 16, -51, 28, -2, 14, -11, -4, -39, 29, -37, -20, -52, 21, 20, -14, 42, 20, -19, -6, 18, -37, -36, -7, -25, 2, 40, 18, 21, -2, 10, 12, 29, 22, -27, -1, -10, -20, 0, -33, -26, 5, 44, 3, -6, 14, -80, -15, 55, -57, -28, -39, -4, 33, 3, -49, 38, 5, -4, -7, -47, -14, 29, 10, -46, -12, 1, 35, -2, 44, 11, -14, 32, -74, -24, 0, -31, 31, -45, -4, 7, -9, 39, -11, 43, -4, -17, -2, 26, -31, 12, -7, 31, -17, -27, 3, -8, -30, 3, 27, 39, 25, -4, -29, -23, -33, -1, 17, -80, 10, -17, 3, 13, 6, -40, -21, 33, 29, 15, 32, -8, -3, -41, 7, 4, -7, -27, -33, -29, 32, 17, -20, 29, 58, -6, 64, 52, -46, 34, -16, 12, 19, 10, -17, -7, -1, 2, -45, -4, -6, 11, 1, 13, -30, 19, 31, -27, -20, -32, -20, 19, -5, 15, 4, 17, -15, -52, 2, -19, -16, 10, 42, 36, -2, -73, -4, -4, 4, 23, 71, 16, -29, -38, -22, 20, -31, 4, -39, 20, -59, 14, 40, 37, 10, -40, -32, 26, -32, -12, -6, 30, -12, 13, -15, 5, 18]
6699A8l3N3o9NO7j5J4m4k4k1N7n4RM6n1N4m1QqJK9m5N0j5k1K9L8n1M2jr4N2M0
6732B5o1K2MK8Omk8K1n5R0l1j0J8rO3q3L4J5om3m0K5O7n9N1m4%J2j1o8O4jk9M1
6766DL0k1j9mL3Lm1M5n1M5j2k3J2N6n0J8m6qN3l6KL9k9qj6M4K2k3k7N2k2m4K7
6799EL8j4l7K7j7M9m5l3N6m7k1rO2K3l9k3K3n4M2ok4O0Oqn8Q7p7RO1o2J9KJk3
6833b7P9l8rk6J5M0J4q9Q1q3O4j3N9m0j2pQj5nK6o0L2K2Pk9j6J8M5j1l5J5p4P3
6866Iljmj5m0R9J6n4K2o%j7m0M0k4jRL9J1n4NK7j1m0K9%k6LL8pj3kK7m2K9j5N7
6903D5r1P9m0J1k7J4M9m0J1l5P5m4RJ2K1q7N7%N8L2j41M0o4P1J1J0q4L1LP2o9
6934a1J1J7j5m4M8k7m3O3qnN6k4O3m2n1j0P4k7ll6pMj2N6l2N6l0l6L4l0l3O4l8
$$ y = [18, -15, 38, -31, -26, 41, 26, 40, -4, -28, -49, 8, -46, -37, 9, -42, 12, -29, -21, -29, -28, 1, -44, 6, -9, -30, -1, 37, -14, 28, 27, -67, -15, 25, -36, -14, -10, 18, 24, 20, -8, 13, -42, 48, 17, 7, 25, 16, 79, -4, 30, 45, 39, -4, -44, -19, 48, -11, 40, -4, -4, 8, -3, -71, -7, -8, -37, 4, 34, 13, -6, -10, 23, 26, -15, 30, -21, 24, 12, -11, 1, 57, 7, 25, -21, -29, 24, -12, -10, 29, 0, -8, -24, 20, 42, 19, -8, 44, 22, -22, 5, 43, 29, -8, 19, 2, 51, 6, -27, 29, -18, -39, -48, 14, 37, -2, -25, -2, -56, -14, -20, -44, 16, 22, 14, -44, 43, -34, -25, 36, -26, -7, -5, -4, -27, 52, 14, 5, -21, -6, 34, 48, -41, 40, -43, 21, 8, 67, 27, 15, 8, 16, 1, -4, 22, -38, -6, 16, 23, -6, -22, -4, 41, 30, -5, 10, -64, 9, 6, 5, 1, -14, -54, 45, 61, 7, 29, 23, 23, 6, -34, 6, -18, -19, -10, 29, 40, -14, -9, 18, 7, -33, -4, -4, -30, -27, 11, 4, -9, -11, 16, -26, 3, -12, 45, -46, 33, -7, 4, -23, -9, 40, 0, 11, -24, 51, 7, 16, 28, 49, -38, 19, 19, 77, 109, -32, 8, -56, 15, 26, 36, -48, -17, -14, 58, -11, 0, 17, 2, -42, 6, -21, -64, -1, -9, -14, 42, 18, 81, 39, -12, -22, 52, 25, 22, -14, -21, -17, -29, 27, -5, 51, 21, -15, 19, -11, -44, 20, -18]
6967a8M1m0P2k2m8K8k5L8m4j5J2K8m0K5RL6k8No2O2k8J7oK6q6M5Pk4ML3N0o3L0
7000A9lJ5n8P5l5mk8K6j8K8J1lk9J3k4N6j2N4o5k0M2n1j9N2J5n4M3L2m9o3O1K6
7032C3j8K4m1nk5j5K2K4Kk9J7nN3q4PP0k8K4m3N9o4J2k9N0K4n2NJ8j4Mm0N0KQ
7066A6l1M3K6l6L4k0l2Mk3J5P3m7km4L6QL1l2m9O7m5L4m7M5m1l6M6pL3nj7mj4
7099b1N3j4p4N2J4jK%k4K9l0L4rm9M7JJ2jo3N1rl5K4l6N0NqJ0l2J6K8J8o4O8l8
7134FL7m2k1M5k1K4j8KJ0m5L6K7n3J3NKk4l0QK4kM2mo1K9qJ2m1K5L8J5Mn2Q2n9
7169Ek8O2j8j5N1m1l7N0j35J07L1o8P5ro6L4k8M5J4l3k4J8pj6P4L2o1n6O1k2K
7200cnK5k9jJ7l6M7m4L8J0k4j9K6M4m8l8J1m4R9J8Om3j3O5p1J7J4m1J8N2o6JL7
$$ y = [-18, 23, -17, 55, 33, -15, 13, -12, 26, -18, -33, -21, 7, -33, -8, 1, 37, 9, 14, -48, 14, -14, 3, -3, 23, -63, -18, -11, -35, -31, 2, 52, -11, 19, 16, 31, -27, 48, 13, 9, -19, 7, -11, 17, 28, 25, -4, 9, -15, 41, 29, 83, 18, -2, 40, -11, -30, 22, 37, -17, 26, 58, 9, -54, 7, 33, 15, 39, -2, -7, -32, -47, -25, -1, 1, -28, -11, -16, 37, -47, -40, 30, 2, 26, -17, 42, -22, -10, -39, 11, 35, -17, -12, 6, -8, -4, -44, 6, 8, 16, -15, 28, 54, 18, 52, 32, 0, 4, -19, -4, 69, 22, 20, -24, 12, 20, 51, 19, -30, 37, -8, 26, -21, 24, -17, -53, -7, -14, 19, 14, -3, -7, -21, 32, 18, -56, -4, 10, 9, 11, 11, -13, 16, -14, 20, 11, -38, 9, 10, 22, 21, -42, 9, 0, -35, -11, -47, 3, 8, 0, 10, -22, -6, 22, 40, -24, 44, 6, 43, 1, -20, 25, 4, 28, 10, 12, 22, -23, 13, 40, -13, 0, 5, 7, -17, -47, -39, -15, -17, 25, 21, -40, -11, -19, -7, -48, -23, 15, 30, 34, -18, 64, 5, -23, 39, 21, 6, 57, 16, -21, 29, -106, 1, 32, -36, 39, 30, -36, -2, -30, 15, 29, -4, -28, -10, -17, -33, 41, 73, 12, -44, 17, -5, -3, -8, 17, -12, -13, 4, -32, 15, -29, 9, 19, -5, -24, 2, 46, -2, -40, -29, -73, 26, 44, 50, 7, -6, 59, -12, 5, 19, -22, -4, 48, -18, -17, 20]
7233B0Lj3k9m4L2J1J9RPJ4j8pL6l6N7j5q8K8K0l8nQ7m7l9KL8L1m6k4L0K3k9Rl
7267ej6J1%J6m3qL3K2j0QJ1r3M7k7RM8m8N3K5l1K7m1k0Nj2J06p5M3m8k1P5q9L3
7300a5K5l6j0k8P0j3O8o5k4J5lk1M7J0j4J2j2%kk0N4j09N7m7N7k8M8m6L1k6L1
7331FJ9l8l8K8J3Pj0M9m8j5P5o0M7kk2k8P3j01P4k3l7N8n8R1q7M1%l0M5Pk7j4
7363eM9o0J3L2j8ll1mJ8ok9J8L5rJ0m3K6O5n9L8p9NK6PqJ7m9K1K9L1j8m4j1M1
7397Ej4j2kJ8j4M0k7J6j8J7j7JO1n5J0K5ll7j4K2LK5k5M2n2LJ0Kj9J2%m2M8n9
7431e0M0o2P1o1R6nl4j8ojmM6L9l6jj8j6j7OL4J4k9J6M3o0L9k7j1M2n3oN9L1o4
7465ck4K9k7Q5n5k0L8m3Oj5k4M1J1l6L6J0k1%L9Lrk2L3K0o5K7o5K5PL1j5L7n9
$$ y = [20, 23, 10, -19, -63, -31, -20, -1, 8, 15, 29, 11, 4, 40, 4, 61, 46, -42, -14, 6, -32, -37, 50, 3, -36, -34, 4, 35, -11, -35, -5, 18, -11, -2, -5, -21, -10, -10, 6, -37, -45, -12, 10, 0, 8, 19, -74, -27, -54, -45, 3, -45, 8, 33, 2, 29, -12, -32, -27, -39, 67, -8, 35, -13, -34, 41, -48, -15, 10, -26, -36, -64, 6, -7, 61, -4, -28, -13, -16, -37, 10, 20, 6, 18, 6, 6, 4, -16, 38, -71, -14, -61, -4, -32, 16, -30, 1, -25, 6, 25, -13, -51, -23, -10, -3, -13, 36, -12, -27, 48, -12, 35, 33, 11, -17, 56, -45, 29, 6, -31, 27, -31, 60, -27, 14, 14, -16, 29, 36, 9, -5, 44, -16, -3, 29, 11, 8, -23, -27, -9, -15, -44, -26, 9, 0, 10, -33, -7, 58, -1, 37, -42, -37, -11, -4, -12, 5, -44, -23, 6, 37, 19, -25, -36, 5, -9, -21, -23, -5, -19, 21, -6, 10, -8, 9, -8, -7, 54, -1, 9, 34, 31, -6, -20, 2, 5, 30, 5, 47, -5, -2, 8, 10, -9, 3, 3, -39, 9, -50, -10, -72, -1, -62, 34, 29, -5, -23, -29, -30, -34, 12, 51, 15, 14, -4, -20, -37, -31, 3, 17, -12, 4, 47, -13, 26, -1, -12, 30, -23, -29, 30, 61, -3, -27, 2, -25, 60, 5, -15, 23, -20, -14, -29, -53, -12, -1, -37, -1, 9, -12, -12, 27, 30, 21, -1, 32, 52, -13, 14, -51, -26, -19, 12, -3, 34, -25]
7498b5M8po8nJ08o3J0l4kK1K2m7R0K7p0NL7J6l8J5j6p6L6J1k5K0OMK7Jk4n6M5
7531gN7n4J2rM0J9p7J8K6on5K0N1Jn1m6N5mlK4j3J4k8J6k6P5q0Qk7L5RK1k8M0
7565B7k4j0K5m2M5k5M7k5j4n9N9QMl8K7K6p5OQ5n7J4L1q1L9L2o9P4k3l5J9M5o1
7597b5k6M9j2J4pmpnK1l5j4K4K2Pj4Jj6K5K8k3Kj1J9K5k1k4rJ5mJ3o5P9k1LK1
7632B5l2j6O4Kln7K2j9K9k4L8j7ml0J9K1j6PJ3l1M1oJ0p7L4J4n4Q2l9n9N5j5l
7665b6J6Rm2j0Q8o3%OL4nlKn2L2M7r9P7l3K4oM1l1j0J4n0P2m4M3K2r2N5%Lp5M3
7700a3RNL2m6N1m4K1M0r1L2qj4j7K1j2P4q8M2Nr3R0qJ5pk4QOK9n5RN7%Rn4L9j3
7736GL8m9j2L1pj5K4K3q6J37q2J6j2q1P0K3j0Rm7J7oM2l5J3j1JkK8Kp1O4l0ML
$$ y = [-25, 23, 16, -52, -57, 51, -12, -2, -36, -38, -17, 5, -42, 48, 75, 5, 10, 47, 63, 25, 40, 24, -52, -16, -5, -30, -10, -4, 0, 27, 28, 4, -52, -7, 50, -4, 8, -1, 39, 58, -19, -1, 25, 19, -36, -16, 35, 36, -15, -61, -6, -10, -13, 11, -2, 12, -16, 0, -26, 49, -31, -23, -50, -15, -6, 15, -13, 27, 3, -7, 18, -24, 21, -4, 43, 18, 4, -55, 4, 12, 16, -22, 5, 31, -44, -38, 47, -10, 4, 35, -46, -7, 25, -44, 30, 7, -28, -9, 36, -25, -51, -2, -14, 0, -7, -11, -18, -23, -2, -37, -51, -27, -5, 2, -12, -11, -27, -2, 26, 3, 5, -6, 13, 38, 17, -7, -16, -1, -5, 8, -57, 22, 1, 4, 25, -7, -23, 41, 43, 40, -17, 5, -14, 15, -9, 29, 12, 8, -22, -3, 18, 2, 9, 22, -9, 32, 26, 36, -41, -7, 7, -47, 35, -4, -63, -8, -23, -26, -10, -1, -43, -53, 35, -28, -28, -22, 12, 7, 4, 6, -46, -14, 33, -66, 11, -22, 2, -4, 37, 6, -4, 10, -40, 32, -12, 31, 53, -39, 16, 16, 19, -56, -13, -4, 1, 33, -13, 38, -6, 15, 55, -36, -4, -12, -26, -43, -22, -34, 40, -48, -6, -1, -94, -4, -12, 3, -4, -28, -20, -14, 15, -40, -31, 26, 26, 35, -19, 20, 7, 45, -4, -16, 15, 8, -7, 17, 40, -46, 91, 9, 25, 13, -68, 2, 25, 15, 24, -23, -6, -12, 30, -5, 8, -3, -2, -4, 24, 26, -45, 19, -11, -7, -4]
7770dK3Ok8m0L7Kk8M2j24J10k9K9k6MJ3j7M8k5j8m4P9nLj2J6J7Mo4l5J24j10N5
7802CM2p5J4K4j1l4KL0J8m7J2O0J7r3P2l4j7j1rP1n6Qn4O0P1j05K3L7n3oK9oJ2
7835fj4J5J4k0o0Q0j8O7j20P9l4J2N7j8k2l2k9O7Lj6L5o5j7L9J7l1L5Nj4Kq9J2
7867f6M4%L9p2P6mLn2Qk2L1l4JLM1K4o3P7q1M2J6ml7j5K0N3Ro0J1j1K7m8N0lK0
7902B3kj1k3rM4jm7K8L1j9JJ1m1m%J1N6o0%k2K1l1M1%k7K6j7%N6pk0M5j18K5N4
7937A4m3nQ4Kk7o3K6m8L5j3N5j07N0J9Qjpoj3kqM2K4Nml4L5L4j08P8L4j9n2Rr
7972a5j7O0Nm7J7K9l3j7J7l5O0pj8l6M3j8j6j0O6l2l3J5L7%j5J6l1J2kK0n5M9
8004Im2qM4o2N4j4K7n9K3K5j7QK0l2L5l4J2J1MJ5q2P4J1k6%LJ1J1jn7L3kJ4k6
$$ y = [-4, 19, 25, -3, -43, -6, -4, -32, 10, -114, -4, -33, -4, -30, -26, -13, -30, 18, -7, -25, -69, 10, 5, 8, -4, 12, 29, 33, -31, -66, 58, -52, 3, 45, -30, -16, 8, -3, -37, -35, -5, 13, -34, -22, 38, 55, -38, 34, 0, -17, -28, -37, 34, -22, -14, -68, -8, 63, -42, -19, 18, -35, -41, -12, -18, -6, -20, -5, 9, -11, -71, 9, -9, 58, -62, 17, -17, -5, 52, 34, 12, -20, -49, 18, 21, 5, 40, -25, -42, -3, 14, -17, 18, 23, 9, 11, -78, -66, -22, -22, 17, -55, 21, 17, 20, -32, -24, -46, -15, -49, -48, -45, -4, 20, -43, 34, -47, -5, 11, 7, -30, -45, -25, 28, 37, -23, -12, -23, 4, -44, 6, 3, 23, 21, 10, -13, -22, 22, 21, -26, 2, 33, 14, 15, 26, -15, -19, -19, -8, 48, -12, -12, -34, -13, -44, -3, -3, -30, -4, -21, -21, 35, 28, 8, 53, -65, -40, 14, -29, -34, 50, 52, 25, -38, -12, -60, -25, -38, 17, -90, -40, -21, -13, -14, -21, -27, -40, -42, -50, -8, 16, 21, 17, -17, 18, 52, -56, 22, 56, 37, -15, -6, -15, -32, 28, 33, -14, 3, 32, -1, -18, -1, -36, 24, 17, -1, -37, 6, -12, -28, -38, 28, -4, -37, -22, 15, 15, 0, 16, -15, -3, -5, 15, -40, 9, -33, -41, 3, -59, -5, -19, 8, -51, -28, -3, -20, -12, 8, -24, 11, -23, -11, 0, 4, 19, -63, 11, 22, -4, -4, -1, 10, 21, 20, -37, -4, -6, 8, -18]
8038a8K6m6M3k4j1O5l2j4OL2n7K1Mj7NL2Rm2Ml2J19j11L9j6K7q4R9l5OqQj6L3
8071A5j8j1J1j6L0qQLN1r1O0m0J0M4k0k0k3J2Oj7L3K4o1K3n1O1jqLo6P9k0L3n6
8105b1LM6k9K7p6Rl9L4K1J6k4LLL9p6O9l4k8R8m6m7J9J0J1qj8K1loM6K4n9J2O
8139CLl1M2Mm0N0p0O7m2Lk5rM8J0Qm5mJ2Ok4J1L9rk3k4j0K5K6J1J9m8K7J1L2o6
8174a3k7J7M5m6m7L7R1l0K8n0j3M1J4p7L8K7J
$$ y = [-18, 8, -38, 5, -19, -30, 35, 3, -11, -5, 27, -30, -9, -5, -22, -17, 15, 24, -18, -14, -46, 73, -38, 1, -15, 12, -72, 27, -8, -2, -10, -2, -18, 15, -3, -14, -3, -19, 11, 3, 11, 14, 65, -26, 34, -6, 4, 48, 28, 8, -15, -3, 3, -14, 19, 43, -18, 5, -46, 15, 14, 6, 9, -57, 22, 2, 35, -21, -18, 28, -1, 26, -50, -41, -80, -46, -25, -9, -33, -30, -27, 12, -64, 5, -29, -57, 41, -5, -52, -33, -23, -12, -20, -38, -17, -20, -26, 20, 44, -15, -3, 3, 6, -25, 17, 21, -19, 31, -39, 28, -14, -11, -36, -45, 3, 13, 21, -24, -28, -16, -10, -34, -23, 16, 7, -16, -40, -50, -25, 1, 12, 31, -17, 10, 21, 53, -13, -40, -23, 22, -24, -71, -34, 57, 27, 55, 5, -8, 33, 47, -30, 8, 35, 36]
8191C6
$$ Imaginary data points
##PAGE= N=2
##DATA TABLE= (X++(I..I)), XYDATA
0@%%%qJ6j6J6j6K4l2M0n6P2q8J12j36J60j92K24k64L12l60M16m80N52o35P26q27
28d40R38j061J197j349J514j694J892k112K350k610K898l214L563l944M364m833
44b541N354n936O593p339Q192r175J0329j1704J3377j5468J8164k1791K6978l5064
58b0031M9566q3810L14217L65035j80225J3294k227N8791m5432n3394o3837K3715
70C75662J712k8780q5532o0016m4796j3955l5462m1317n9483m2156l3822k6011
82i3956m6473l7884l1150l0150m2062l2012k2906n475n374k2160l1513L166K8466
95c69483Q935k7572k4468J2631M8740M3145M363j7950J5237O2105O1371J8144
107a64802q944P596M8019O8148M2722K553L277M3896O7372M3057M504m727J6835
$$ y = [0, 0, 0, 0, -8, 8, -8, 8, -8, 16, -16, 24, -32, 40, -48, 64, -72, 88, -104, 120, -144, 168, -192, 224, -256, 296, -339, 387, -440, 498, -563, 634, -715, 799, -895, 997, -1115, 1235, -1375, 1523, -1691, 1872, -2072, 2292, -2541, 2813, -3123, 3470, -3869, 4323, -4852, 5477, -6227, 7150, -8318, 9846, -11945, 15033, -20031, 29535, -54275, 259942, 624977, 444752, 458046, 455819, 514610, 469178, 415784, 351947, 375662, 377374, 348594, 263062, 203046, 158250, 144295, 108833, 67516, 8033, -34123, -67945, -93956, -140429, -178313, -209463, -239613, -281675, -313687, -336593, -342068, -347442, -369602, -401115, -397949, -369483, -360548, -388120, -412588, -399957, -351217, -308072, -303709, -321659, -306422, -244317, -182946, -164802, -173746, -166150, -118131, -49983, -7261, -4708, -1431, 42465, 109837, 152894, 157398, 152671, 169506]
120A69506L9686L6891J0945k566J2922K4613J1319l142k784Q5k942j1195j8310
133B65028j2638j47m393k4431l0603j4200k894j6576m1635n2224l4655k785O651
146C4498j9647m5130l6403j0258l121k2646m6186m2355o022K3142J0325k4544
158a88347l5920j2998J2970J2911p288j8730m360K1450K6791Q048l735O312J9899
171a62997K2973J7900J0615J0779J8613K0540J6281J9612K7812K5627J4295P331
183D9381J1364K1529K4353J1771k337L085K2696K8944J0756j1946j3170O688K0519
196A83633P957j8336k6825n793J7226J1336j5366k9857j9691j061K231j5621l2478
209E7355k5199m480K792q415k2328k4608j4248n091q855j7647j8503j1597n516
$$ y = [169506, 209192, 246083, 257028, 254462, 267384, 291997, 303316, 300174, 297390, 297475, 294533, 283338, 265028, 252390, 252243, 247850, 223419, 192816, 178616, 175722, 159146, 117511, 65287, 30632, 27847, 34498, 14851, -30279, -66682, -76940, -80061, -102707, -148893, -191248, -197270, -174128, -163803, -188347, -224267, -237265, -224295, -211384, -218672, -237402, -241762, -220312, -193521, -185473, -189208, -182896, -162997, -140024, -122124, -111509, -100730, -82117, -61577, -45296, -25684, 2128, 27755, 42050, 49381, 60745, 82274, 106627, 118398, 116061, 119146, 141842, 170786, 181542, 169596, 156426, 163114, 183633, 191590, 173254, 146429, 140636, 157862, 169198, 153832, 123975, 104284, 103223, 105454, 89833, 57355, 32156, 27676, 30468, 22053, -275, -24883, -39131, -44222, -53077, -70724, -89227, -100824, -106340]
222a06340m682n942l026k4l019q332q653k050N425M727j225J287J4467K1921J2281
237h3185n225j0315M279K2719K3973Q672q27Q917K4484K4179O738p553j349J7408
251C2915K5972J4515k220m358Q576J8521J2301j491o476j92O907M880l821q280
265I7749l065K697N80m635o962p081q070j0917j1840p810k813m575j1526j3906
279G826q013j219m051j4246j8912j1464k49K576o016j4483r266L683P579j929
293f8184j3470j3157j4J1370Q495k935o045L387J2929J1045J224m389L41R878
307d9525J2594O829K612N906J1152J1828Q495M565K939L359L691M069P079J0610
321D6203R912M565M07Q09K907J538k927m859n94O911Q217m14r510r615k794J895
$$ y = [-106340, -111022, -116964, -119990, -120014, -123033, -131365, -140018, -142068, -136643, -131916, -133141, -131854, -117387, -95466, -83185, -88410, -98725, -94446, -71727, -47754, -39082, -39909, -30992, -6508, 17671, 24409, 16856, 15507, 32915, 58887, 73402, 71182, 66824, 75400, 93921, 106222, 104731, 98255, 98063, 104970, 109850, 106029, 97749, 94684, 97381, 97961, 93326, 86364, 79283, 71213, 60296, 48456, 40646, 37833, 33258, 21732, 7826, -187, -1406, -5457, -19703, -38615, -50079, -50328, -47752, -53768, -68251, -77517, -73834, -66255, -68184, -81654, -94811, -94825, -83455, -74960, -77895, -83940, -80553, -67624, -56579, -55355, -59744, -59403, -49525, -36931, -30102, -27490, -21584, -10432, 1396, 9891, 14456, 17395, 20754, 24445, 28514, 35593, 46203, 56115, 60680, 61087, 61896, 64803, 66341, 63414, 58555, 57961, 64872, 73089, 72675, 63165, 53550, 50756, 52651]
337E2651j609q968j1048m398J973l23q443j2063p491o82P6o074j2088j0398l345
352c2230O30j249m697m936k368l36j598m205m671k047Q96K158K498L061K570J456
368d5068R64J804L289M039K538R85L147P903R522O432K026O65L740O771N028Q80
384A4665J75M113Q752Q247K771j458p11K429L613Q45k681k424R19L253K430o78
400D4260l129l228k426l038m522n266m063j688K46l10k555m987o393o494n230
415h823l456k339j932j611j430j513j956l612m772l182m32R19L52r23j405K50
431c5865K448K532J046M16R73J581J908J782J645K123L988N497M977K931J445
446e73N30J342L028L405K434K583L659L859L235J878q8j027L19J460Q19j0j38
$$ y = [52651, 51042, 42074, 31026, 26628, 28601, 28278, 19835, 7772, 281, -401, -325, -6399, -18487, -28885, -32230, -31600, -32849, -37546, -42482, -44850, -45186, -46784, -50989, -55660, -57707, -56811, -54653, -52155, -49094, -46524, -45068, -44104, -42300, -39011, -34972, -32434, -31449, -28302, -20399, -10877, -4445, -2419, -1754, 1986, 8757, 13785, 14665, 14840, 18953, 27705, 35952, 38723, 37265, 36554, 38983, 42596, 43441, 40760, 38336, 39255, 42508, 44938, 44260, 41131, 37903, 35477, 32439, 27917, 22651, 18588, 16900, 17146, 16836, 14281, 9294, 2901, -3593, -8823, -12279, -14618, -16550, -18161, -19591, -21104, -23060, -26672, -31444, -34626, -35058, -34139, -33787, -34710, -36115, -35865, -33417, -30885, -29839, -29423, -28450, -26869, -24961, -23179, -21534, -19411, -15423, -9926, -4949, -2018, -573, -43, 1299, 4327, 7732, 10166, 12749, 16408, 20267, 23502, 25380, 25292, 24265, 24584, 26044, 26863, 26853, 26715]
463B6715N63J642J662j008l836l801j607r75j982k563k111n72L04j069m102m748
479B512l142k116k487k994k493j647k11K74j227k331k005j994k790k098n17O34
495b4632J579J924J033M43P09j05j825j412J509M033M083K410O62Q65K887L303
511b534O16j300Q87M107M446K190n01n53K787N216K731j540k163L42K205J489
527A8425n73j626N00L377K378j765l802k571q43l64r77j770j119P67K08k383k919
544D943j842j599k617l088j956O8J237l36k978k479N33J039k234m656k999J072
560a7892M045K298k192l092J210L916J509k646l680j38M407M860P76j951M81M076
576d013L910J39k732j584J953M318K698L62P63K707K211k92j602p96Q22J619P38
$$ y = [26715, 27278, 28920, 30582, 29574, 25738, 21937, 20330, 19355, 17373, 14810, 12699, 12127, 12431, 11362, 7260, 2512, -630, -2746, -5233, -8227, -10720, -12367, -12578, -12304, -13531, -15862, -17867, -19861, -22651, -24749, -25266, -24632, -23053, -21129, -20096, -19653, -18944, -19049, -20874, -22286, -20777, -16744, -12661, -10251, -9589, -8724, -5837, -2534, -1918, -3218, -2331, 1776, 6222, 8412, 7911, 7358, 10145, 15361, 18092, 16552, 14389, 14731, 16936, 18425, 17852, 16226, 16726, 20103, 22481, 20716, 16914, 14343, 13500, 13136, 12159, 10389, 9270, 10037, 10245, 7862, 4943, 3101, 1502, -1115, -4203, -6159, -6091, -4854, -5190, -8168, -10647, -10114, -9075, -11309, -15965, -18964, -17892, -13847, -11549, -13741, -16833, -15623, -11707, -10198, -12844, -16524, -16662, -12255, -7395, -6619, -8570, -8089, -4013, -103, 36, -2696, -4280, -2327, 1991, 4689, 5051, 5814, 8521, 10732, 10440, 8838, 8042, 8864, 10483, 11221]
593A1221J31J450K291K8k903k753M66K233L38l074l819K9L407J676l543m833j155
610A190K920J675l646o609l033L107M494l27m636l500R52K630q09m533l779P67
626a3137M076K477j326k234j50J517O93j223j405M10J956J386M69J238K306J492
642a455r08j807K79K938K355p30j758J364N052L941j350m593j590L513M338k30
658I359m299k222L775N903J254m610m705L51L694J365l448l988K01M089K903k032
674G590m535k358N98O77j259k099o72J201Q02j246j611l58K9j387k208n20J634
691e722J558j132k936r23L206L546q13m434k780K182M325J263l129k670K627N910
707G8K645l530m919n40M478M085l13l239m78M112M075l48l424k101J271K778J026
$$ y = [11221, 11352, 12802, 15093, 15121, 12218, 9465, 9931, 12164, 12502, 9428, 5609, 5638, 9045, 10721, 7178, 2345, 1190, 4110, 5785, 2139, -4470, -7503, -4396, 98, -229, -4865, -8365, -7413, -4783, -5592, -10125, -13904, -13137, -9061, -6584, -7910, -10144, -10294, -8777, -8084, -9307, -10712, -10302, -8346, -6960, -6491, -5253, -2947, -1455, -2363, -4170, -3891, -953, 1402, 672, -1086, 278, 5330, 9271, 7921, 3328, 1738, 5251, 9589, 9359, 5060, 2838, 6613, 12516, 13770, 9160, 4455, 4806, 8500, 9865, 6417, 2429, 2630, 6719, 9622, 7590, 3055, 697, 1295, 1972, 713, -1386, -2058, -857, -55, -1301, -2912, -3270, -3241, -4628, -6836, -7356, -5722, -4164, -5296, -8232, -9155, -5949, -2403, -3216, -7650, -10430, -8248, -3923, -2660, -5789, -8459, -5832, 78, 2723, -807, -5726, -6266, -1788, 2297, 1984, -1255, -1733, 2379, 6454, 6106, 2682, 581, 1852, 4630, 5656]
724E656j341p85J548J859J14j140o34n5n50j370q09J155K156K05k478k073J167
741B625K293p80m073l593Q04M265K168l151m423k50L777K297k860n612k270L468
757e315M627K84l963k475J920L401L34l420l245O70L673K298j001j565K35J560
773a982Q56n39o36L17R05K13k75Q56K077R97j218j126P41K313Q66k183l055N91
791b82M389L297j292l882j491K593L111j053m676k487K984M812J007l579l842
806c91K16L127J227k791l713l80K957K253q71k328j275P24Q51q80j672n73N67
823b952N32n1J83P79L26j124j850l99J601J537q49k115j11K995L070n97l496k197
841d718J890L607P61k928k305J875M526K132k477l930m98L099K688q93k760p11
$$ y = [5656, 4315, 3530, 5078, 6937, 7051, 5911, 5277, 5222, 4672, 3302, 2493, 3648, 5804, 6009, 3531, 1458, 2625, 4918, 4138, 65, -3528, -2724, 1541, 3709, 558, -3865, -4115, -338, 1959, -901, -6513, -8783, -5315, -688, -404, -4367, -6842, -4922, -1521, -1187, -4607, -7852, -7182, -3509, -1211, -2212, -3777, -3542, -1982, -1126, -1665, -2301, -1984, -1079, -866, -1141, -285, 1792, 2789, 1571, 445, 1186, 3499, 4365, 2182, -873, -282, 4107, 7404, 6112, 2230, 739, 3332, 6443, 5390, 714, -1773, 1211, 6023, 7030, 3451, -391, -175, 2952, 4179, 1388, -2325, -2705, 252, 2505, 1634, -694, -1969, -1245, -394, -1274, -2946, -3519, -2952, -2420, -2471, -2288, -1509, -1183, -2307, -4157, -4556, -2955, -1418, -2267, -4382, -4493, -1498, 1572, 975, -2521, -4718, -2828, 779, 1540, -1388, -3693, -1818, 2708, 4840, 2363, -1567, -2065, 1034, 3722, 2829, 69, -642]
857f42K650K737j15k370j757P51J647J52j101q85L43Q03J48l05J86K83q47j659
875A9r18Q60J299k15j696q43J652K117n04l360k719O45L061J602j857k844K34
892c467L162K021j868l757j309K208K978J85k478j440J668K806N27k062k021J28
908b719J735J164m13p52N52J203N03l55k47l6k69l49j47Q03J529N25j183j030
926E14P73J602J75j979k132K77K677K049j105k598p25J960J721r52k958j720J457
943i64K985P05k235k031L68J798Q39j363k135o29J451J305l82r08l17N20N87j11
961e17p07o11m5j0j30O55J208N52q05r44q7Q96N87q28j435J97K289J936m60k020
981b79j159R81J933L37j911j627J130K576J106j095j952m22J401J320p73j815
$$ y = [-642, 2008, 4745, 4630, 2260, 503, 1254, 2901, 3053, 1952, 1067, 1410, 2213, 2361, 2056, 2242, 2525, 1678, 19, -899, -39, 1260, 1045, -651, -1494, 158, 2275, 1771, -1589, -4308, -3663, -602, 1000, -857, -3701, -3467, -305, 1716, -152, -3909, -5218, -3010, -32, 153, -2325, -3765, -2097, 709, 1236, -826, -2847, -2719, -984, 180, -233, -985, -433, 770, 1273, 918, 671, 635, 366, 17, -130, 673, 2202, 2727, 1544, 514, 1287, 2889, 3064, 1085, -1047, -770, 1907, 3956, 2851, 253, -472, 1488, 3209, 2257, -701, -2421, -964, 2021, 2726, 491, -1540, -1172, 626, 1465, 102, -2033, -2662, -1211, 94, -288, -1196, -1513, -993, -406, -517, -1224, -1835, -1880, -1890, -2020, -1365, -157, 395, -410, -1354, -1441, -545, 42, -786, -2221, -2024, 265, 2201, 1741, -279, -1438, -457, 1476, 1813, -98, -1725, -595, 1981, 3087, 1992, 40, -382, 1019, 2339, 1566, -249]
997b49m83J237J441K99p86r55K1L44o4n47m28J09J46J13L53L92p8q09q93l21N48
1018f10O83m45j106m2J275J208k71j635j433L87J604P15j218j168L78J607J169
1035A098o37j769p55J076J369j32j081o12P47J271O28m15r53k30M59K66k13j92
1053g5J81L28N04M01k1k69m94o97k02O43P61j6m23k27M27P63j74j207j118K27
1073f88J186O53m67j035j09R34P44l87j381q48M07R93L24n93n46R8P91M17m99
1092fr75m06K68M84K56l2j25K08J86N7l3l24l21k34J58M72N97J64l43k19L03L37
1114D72p8n74n85K03Q69P19j39n56l09M42M91m3q15n62K28Q13M54k35m32q0L56
1135F39K80k97o52n01J82N11L36J68j77k57p8J6j83l54l19l5L09N31K54r4m64
$$ y = [-249, -732, 505, 1946, 2245, 1459, 504, 525, 869, 805, 258, -170, -61, 85, 198, 551, 943, 865, 56, -837, -1158, -610, 73, -372, -1478, -1520, -245, 963, 692, -943, -2376, -1989, -385, 330, -888, -2056, -1678, -71, 1098, 461, -1308, -2063, -987, 382, 250, -831, -1443, -696, 575, 1203, 788, -165, -395, 64, 330, 117, -75, 106, 434, 938, 1339, 1318, 1049, 555, -142, -344, 299, 1060, 1044, 621, 394, 821, 1584, 1410, 203, -915, -688, 498, 1151, 684, -351, -460, 474, 1218, 831, -550, -1398, -991, 2, 326, -267, -813, -715, 76, 493, -6, -981, -1387, -1119, -635, -379, -411, -536, -328, -142, -85, -118, -442, -763, -997, -839, -367, 230, 394, 51, -168, 135, 472, 394, -180, -765, -562, 307, 1026, 887, 331, 22, 464, 955, 912, 97, -465, -237, 576, 1030, 795, 363, 283, 639, 919, 622, -30, -531, -349, 162, 498, 666, 489, 232, 154, 170, -13, -367, -686, -721, -412, 119, 373, 279, -185]
1156a85j80n4M4o5k28k56K60N71L31l2m31k44M5K09k3l76j87K94M98M41k3l09
1178A00k66L9J59l3k72k7J73L56M68R4k98l74n3R9J04k07j13j4L99M49R0l39l39
1201A95j67J3O0l8j44JK99K60N9k48l35j24M3K2j83j38J52K63N7J17j3j92j89
1224b30k08n4o0J94J16K0J19L20P9l04m04k14NL71J44n7j8K97L07p2k87m26n3
1247d15K50L02p6j75J50L89J91j43l81k10Q1J52k2j84J32K84K54n5j95k08n5m
1269F2p6k78J42L20K61p8j49mm3p7j85l36L1L34K33n9j28j8J98j5k41m65j07M20
1293b58K95q5j56J2K76K04k31m77k45L42L00K3k56K9K93L97qn41l54J86K53L6
1315C5j75J4K24M08J46l93m23L7J22L1j42J9K76L13R0l14k44R9P0j63k65j4L64
$$ y = [-185, -365, -419, -375, -440, -668, -924, -664, -93, 238, 206, -225, -469, -424, -215, -238, -614, -801, -507, -9, 432, 409, 100, -166, -127, 32, -1, -273, -300, -127, 229, 697, 791, 493, 119, 66, 165, 269, 62, -51, -65, 334, 783, 873, 534, 195, 28, 41, 101, 63, -81, -80, 219, 479, 538, 290, -45, -169, -126, -104, -287, -425, -273, -10, 47, 164, 151, -41, -230, -438, -492, -552, -358, -242, -222, -103, 217, 296, -8, -412, -626, -621, -250, -106, -163, -181, 116, 423, 351, 64, -362, -415, -165, 137, 61, -114, 36, 425, 616, 473, 92, -118, -37, 115, 93, -91, 41, 325, 579, 524, 329, 121, 66, 62, -14, -292, -150, 170, 431, 353, 204, 200, 157, 80, -105, -441, -410, -76, 157, 98, -30, -48, 150, 135, -106, -571, -678, -258, 37, -48, -204, -192, 84, 288, 57, -420, -665, -323, -23, 0, -256, -227, 66, 463, 455, -86, -440, -254, -1, 35, -140, -126, 98, 506, 652, 259, -164, -127, -5, 26, -116, -97, 179, 492, 582, 268, 24, 123, 193, 30, -235, -249, 115]
1338A15L11Jl24j57J90K40k22n30j96L78M04J09l51k29K56L87o7n82m40J87N12
1359hK03j23m16J40M64J09l70m55j32L76K77j16q1O3L20R5k85k39n7J45L9r2k9
1382a72K30L29M4l92k05J61K09j1l84k21K53O64J74m46m22J41L87Q1m72m64N3
1403d63O08N24k36m95l4K71J99k61m50k14L78M20Q5l05p5Q4R4j40k69j11J72K10
1425hm8j33J52K54J6k82l04k9L34J85k96k68J90N72K34l87n59n5L93L82k74m88
1447d19j05O57N31j41n73k69J02M81Pm72j93K88M93R8k62k99n5K85J1k44j50J90
1469c9J62J01n2o2M9M2j71l36j4L23K17j76k67N0M89J82l05n77k44M36M55q3m57
1492b77j51L72N45j3n95n44J39N83K72l31l08O2M96K08k45m97j44K90K10p8j18
$$ y = [115, 426, 427, 103, -54, 136, 376, 154, -376, -572, -194, 210, 319, -32, -261, -5, 382, 315, -267, -707, -520, -8, 195, 72, -344, -204, 260, 369, -1, -456, -588, -212, 65, -51, -132, -69, 251, 346, 61, -178, -235, -90, -51, -143, -172, 58, 387, 431, 39, -166, -5, 204, 193, -191, -412, -159, 505, 679, 233, -189, -48, 339, 420, -52, -516, -463, 145, 669, 433, -62, -96, 175, 374, 113, -337, -551, -173, 247, 332, 27, -48, 36, 130, -10, -279, -390, -218, -8, -56, -189, -37, 217, 233, -49, -353, -382, -48, 137, -159, -427, -237, 335, 569, 182, -377, -432, -39, 343, 69, -419, -524, 133, 664, 523, -50, -319, -217, 264, 271, -201, -394, -106, 387, 485, 223, -76, -131, 154, 165, -79, -229, -39, 123, 224, 172, 110, 159, 201, 30, -306, -320, 3, 220, 44, -223, -173, 316, 498, 193, -384, -628, -192, 263, 180, -277, -428, -56, 489, 476, -119, -663, -524, 59, 331, 0, -308, -246, 250, 458, 213, -284, -428, -138, 72, -6, -124]
1513a24K4K14J53j42r5lK2j15k23J4L65J68j0k87r5K52L05k17n06j58K46N60R0
1536D38l99l72K00M94J45m71n86K9N86L76k05m07q6L51K97j78m32k52K43K64J19
1557A54j48j29J57J22n7j17r5J6On7o0J80K62m8k12k29K12J82p7l01k66K99N17
1580C11K17l17m83L8L62K20k57n13j08N62M49p9m14k90K28L39N8l88l54J56M03
1601A40J57j66j35j5O2N9j16r2kO4K3n0J59J50k2j94k38k5K67J07j99k58J34M45
1625B55J79k82m49j25L44L13q6m30j35L83M06L8l70l52N9L51J23k88k12O2L47
1646A31J70n0k18j77O4J21l2p0qM1R9M7j3L6lj38j69m6J80J58o8j80L6K31J97
1671C39r0m53k09K58L91J8k77k82K29L69J02l19l63l4L18J49p5j84p5J67K32P
$$ y = [-124, -100, 114, 267, 125, 30, 27, 49, -66, -289, -275, 90, 258, 248, -39, -134, 118, 423, 206, -300, -458, -212, 348, 438, 39, -333, -133, 361, 506, 35, -551, -522, 64, 440, 235, -172, -258, 93, 390, 212, -220, -472, -229, 35, 154, 6, -123, 34, 156, 99, -18, -113, -97, -91, -148, -208, -28, 234, 186, -26, -255, -43, 139, 62, -239, -505, -206, 311, 528, 211, -272, -234, 128, 348, 91, -422, -530, 32, 481, 402, -12, -302, -74, 265, 323, -65, -419, -263, 140, 297, 131, -4, -19, 43, 102, -14, -106, -108, -44, -21, -71, 88, 238, 216, 22, -216, -241, 26, 133, -66, -324, -190, 255, 434, 152, -297, -422, -78, 235, 149, -281, -416, -33, 373, 411, 41, -311, -252, 99, 222, -66, -278, -216, 131, 301, 251, 33, -144, -80, 41, 9, -61, -69, -28, 71, 118, 105, 141, 138, 0, -169, -215, -35, 123, 55, -125, -89, 142, 339, 249, -204, -413, -155, 236, 254, -23, -305, -76, 293, 395, 76, -287, -321, -3, 146, 71, -113, -188, -21, 211, 218]
1693B18l00j11J9J32P1n3RL6N4mm5Nm6o0j47rK78J23j7j88l6J20J78r7l12j22
1719c04J37L29J41k04k01j4K57J51k16l18m5K01L22Jk18j46Q7J69K9j75j80OJ13
1742g8J82K1p8m5O2j4p7k9R0j08r1Q7J35Q6J1j40r9L6J11j4j76j08Q7K91J57j41
1768A58k69r4K05J50q6k21j02J59K81N7j70k13M0J66L9j18j36J7O9J91L8j03j16
1791e8K9KL5k6m0L1J3K5R3N7k3j74r1P8J10k3m5q0j3J88J46j43j20j48Q3K14o3
1818E7j06k5P6J89O7j43j92p5J04J20K8j82n4R2J66O6j25j19k8j4L0J9R2m8l0
1843c5J01M9K3o0j37j30J01O9J19o0q3JJ32P8q2j92q8J18J28lj0j19N6J76Qj24
1869C6r7r1N5J03N5n9k3O1l3P0k0j18o5N8L6O7K0k7J1K5J9k5j7j29J0J6P4N4k5
$$ y = [218, -82, -193, -174, -42, 29, -24, -15, 21, 75, 71, 26, 31, -15, -75, -222, -231, 47, 170, 153, -35, -71, 49, 227, 130, -182, -304, -167, 162, 303, 99, -102, -116, 141, 292, 76, -242, -287, -86, 236, 237, 19, -127, -40, 129, 158, -17, -197, -191, -78, 104, 125, 47, 2, 64, 50, -27, -56, 34, -74, -165, -78, 57, 143, 154, 14, -85, -49, 62, 48, -128, -236, -149, 142, 299, 158, -111, -205, 0, 150, 64, -157, -259, -100, 181, 238, 68, -145, -105, 61, 100, -18, -154, -137, -68, 123, 161, 58, -58, -29, -27, 8, -18, -58, -27, -14, 11, 104, 161, 138, -36, -127, -49, 61, 38, -7, -87, -100, 88, 234, 91, -29, -177, -94, 120, 57, -49, -74, 2, 191, 258, 115, -77, -152, -48, 72, 100, -82, -136, -44, 122, 188, 63, -56, -84, -98, -68, -49, 43, -5, -35, 66, 115, 138, 78, -59, -189, -88, -19, 100, 40, -43, -42, 90, 168, 86, -106, -194, -76, 52, 49, 39, -80, -24, 152, 160, 36, -61, -152, -97, 6, 61, 2, -21, 40, 7, 77, 57, -61, -126, -68, -32, 35, 55, 28, 39, 64, 83, 58, 41, -88, -78, -62, 12, 66, 41]
1898D1l9RJ1M6j0j37qK2Q2M3J1l1o8O0N0p1j29N2J3Q4J5K7o7l7M4K9q7on4KJ28
1929B5M9K8pj13j0O0J3p9n2P9L4P2L5n4r0m0N4L6l9k7o4N4R3j4J7m0n8L1mJ2j4
1960a3m1N5K9%N2r4j6l1K7M6m9o1M7R3K7J5o2m1r3P1Nkl7M8J7P1lOj21J3K4K8
1992A0l4q9J17K6M7l7lo0Rm5K3J2L0l8M9j6m4J15l9n3k2J4QK5L4lm4M5J3j6p2
2023c8p3j6J21J0op1L3J37n2o8n1J4M5L6k5J7mJ4Q9r4j9l5j8J9k1j3J30j7Lk0
2053B7o6P1n4lj5m1N3R7J3m8m7M8lk7n2p9O2J02J3l6l3K3M4m6j3k2j09J08O5p
2083B5m9P8Om4Jj5m8O7L2k6l6K7MM2j6r5l9J7O7J1q2J12k5O9J8q9o1%O3k6J5q6
2115h3J31J5m0m2j0L8l3j0k1j2kJ33l2l6L1n7R9o4p0kQ8K1m1j2J6J5N3o5l3p8
$$ y = [41, 2, 11, 22, 68, 58, -79, -87, -65, 17, 60, 71, 40, -28, 32, 82, 11, -118, -66, -53, 31, 46, 73, 6, -31, 13, 42, -45, -51, -105, -103, 25, 74, 102, 95, -18, -28, 32, 45, -34, -86, -7, 27, 99, 134, 80, -10, -50, 4, 40, 1, -26, -90, -36, 57, 43, 60, 20, -38, -7, -11, 1, -13, -54, 1, 30, 30, 82, -12, -28, -59, -32, 14, -35, -96, -49, 44, 71, 86, 24, -17, -110, -39, -34, -36, -73, -25, -8, 63, 60, 66, -55, -42, -18, 10, -24, -113, 4, 30, 77, 40, 37, -23, -14, -59, -36, -24, 6, -32, 17, 1, -43, 72, 33, -20, -42, -28, -20, 5, 39, 36, -8, 37, 50, 34, -38, -111, -127, -6, 4, -2, -73, -40, 97, 45, -23, -74, -60, -15, 21, -4, 13, 9, 23, 112, 18, -1, -36, -54, -35, -56, -69, 61, 44, 47, 27, -39, 32, -22, -25, -40, -81, -28, 69, 82, 34, -13, 35, 32, 5, -47, -126, -64, 38, 51, 15, -18, 5, 49, 3, -10, -32, -141, -33, 32, 25, -24, 54, 60, 16, 17, 2, -46, 21, 53, 27, -9, 18, 22, 64, 48, -47, -86, -69, -2, 9, -73, 39, 14, 83, 101, 12, -49, -49, 14, -12, 3, -83, 48, 63, 23, -19, -29, 9, -24, -34, -55, -67, -69, 64, 32, -4, 27, -30, 69, 5, -65, -67, 21, 42, 1, -11, 5, 20, 73, 8, -25, -103]
2145a03M2N7N5m5l0K9N0k9k2p5L3R7j7o8m6Q8j4P4m4q9N3jM0l7k3O7J2M0q0l4
2175b0Olk2Pj7M9P4l9J3o5KO2l6l3r8Q6K6P8mq5l4J37k2j11qK9O1O3l3j01M4K7
2207C3L6j05NkJ8N7m6L0%PJ0p4JJ0L5J8o5m5N1J43o0m4m4n5K8P9m0m6K2M9O7n
2239F8j31RM5L3q0M5QKJ5P5n6l7K5q6Q1Ll7l6L2jL4pOK5n0k8J7J00o6j2N2r9J21
2272G0j1q8kl7M4N7j6m7ON5O2o9k0r3N2K1R9j33jN1M1l8K6j01N7j5L5J1k5N8o3
2303a4L8l0n9M0N4m4j3j8P4pJ1n5J4J6K8J6j13KK1R2m5q1J2L2R5j4j30L6kO2l
2334A5m0K0m2P9L1o1q5N7l6O9k6Oj9J03K6j54M1qJ7qm6P8j8O5K4o2p6O0j4L1p3
2365d6N7jN3mo8m9K9J08n1q2k2J5P2N8m2m1L9l2L9l8ll1K8Q0k0n0j5J6l2K6N%
$$ y = [-103, -61, -4, 51, 6, -24, 5, 55, 26, 4, -71, -38, 59, 42, -26, -72, 16, 2, 76, 32, -57, -4, -5, 35, -2, -25, 42, 54, 94, 14, -20, -14, -17, -39, -32, -49, 0, 74, 35, 48, -17, -15, 47, 11, -22, -120, -34, -8, 70, 66, -19, -53, 84, 62, -49, -57, -28, 33, 96, 63, -38, 6, 33, 69, -36, -31, -33, -15, 42, -4, 26, 26, 33, 43, -31, -30, -20, 15, 33, -32, -77, -26, 117, 57, 13, -31, -86, -58, 21, -19, -65, -43, 6, 73, 68, -63, -54, -9, 24, -56, -11, -3, -1, 14, 89, 33, -4, 21, -65, 16, 19, -18, -54, -22, -23, 11, 4, 10, 35, -15, -43, -26, 74, 8, -4, 48, -51, 70, 59, -29, -31, -68, -24, 33, 17, -30, -24, 31, 93, 24, 4, -89, -37, -16, 83, -50, -51, 0, 41, 3, 29, -72, -15, -30, 5, 16, -9, 49, -14, 24, -6, -65, -25, 29, -15, -28, -46, 28, 21, 32, -23, -9, 7, 35, 51, -62, -60, -39, 53, 8, -73, -61, -29, 66, 52, -78, -42, -44, 18, 15, -25, -5, -47, 32, 63, 2, -83, -26, -62, 7, -19, -13, -32, 71, 97, -57, -16, -24, -7, -15, -61, 17, -1, 64, 88, 26, -50, 10, -4, 27, -46, 11, 10, 63, 59, -9, -58, -29, 79, 28, -54, -76, -61, 11, 69, 27, -14, 25, -7, 32, -6, -9, -40, -12, 68, 48, -2, -17, -1, -33, -7, -2, -2]
2397bqJ9nMOk6J1J6o0J0k4J14p0rm7J19j0k7j8k4M7j2L5m8j8P2K6j0l3o0k2M5
2429iO8r8K1j8R5m2k6M9m3M0No1j0P2J6n1m7J1L0Rk7k6N1MK9m6j4QL7k2K8m2p9
2462h8Q0P0j5l1j6L8JJ2Jm6l2K6K4j8j1Nj6O2L2j05k2R1q1N9K0o1%J9K9PNjn9
2495b1J8J6rj3k9O9r5J16%m2k3nPN4r7K1k3RQ3j7k7J3o4P4K7L2p9Ol6O0k5L3p6
2528d3N8Ol6L6j3NmK1rjl9m8J3M8J2J7k4Kl0K9KJ9kk7j9J2N6Mj04JP5j3l1p4L7
2563f4N4j1R6p8k4nN2m8koL0OM8kp7K7K2qJ2j8l1M9m3L2llJ9J2k6k7JM8QKl5%
2599GK4l2k1k4L5lML9n6rO6kRk9rj9K2j8J4l6P6j8k7K1k1Nl7N1k1k3L8N0k9j0
2633A7k0J7M5r2K8K0k5K0m4K6K6K4k2j9Qk0L6L4n1k1K9L4o9L6m9M4m9KL9K1j0
$$ y = [-2, -10, 9, 4, 8, 14, -12, -1, 15, -45, -35, -59, 55, -15, -24, -71, 48, 38, 11, -7, -31, 16, 4, 39, -9, -27, 45, 71, 61, 28, -32, -54, -9, 59, -39, -18, -36, 59, 17, -9, 40, -3, 37, 42, -19, -29, 43, 59, 8, -39, -28, 2, 11, -16, -42, 9, 13, 42, -4, -18, -10, 27, 5, 33, -9, -88, -8, 62, 47, 16, 0, 38, 39, 51, 52, 6, -26, 0, 24, 6, -5, 0, -16, 46, 78, -27, -49, 42, -39, 20, 40, -21, -21, -2, 27, 34, 39, 38, -21, -3, 13, 4, -9, -38, 31, -64, 52, 52, 10, -13, -18, -11, 43, -54, -33, -56, -47, 36, 19, -8, 5, -59, 15, 42, 74, -5, 1, -35, 25, 0, 33, -43, 15, 21, -15, 21, 8, 13, 9, 30, 21, 20, -19, -67, -54, -6, 6, 23, -1, 1, -29, 0, 2, 21, 19, -8, -27, -15, 41, 45, -59, -58, 17, 4, -27, -101, -64, -10, -21, 75, -3, -27, -32, 20, -28, -30, -36, -6, 0, 48, 46, -31, -4, 18, 10, 22, 4, -27, 22, -21, 11, 8, 5, 24, 36, 10, -17, -16, 32, 40, 42, 7, 7, 31, -1, -22, -46, -11, -14, -10, 29, -27, -36, 30, 28, 37, 8, -1, -20, 2, -16, -2, -38, 38, 20, -7, 14, -7, -2, -39, 12, -9, -32, 6, 56, 27, 17, -3, 14, 59, -33, -5, 15, -10, 10, -34, -8, 18, 42, 20, 1, 9, -11, 25, 59, 8, -13, 16, 50, -19, 17, -32, 12, -37, -35, 4, 25, 15]
2664A5n0L1J4M3n1l3M3j1RpM8o0RJ9j4Oj6N0o6M7J6o8K8k2N9jn0k2L6J6k5j6l7
2697f0P4m3J1mN6l5J9m0MP3o8N4p6O6l9O2k8l8J6J7J0l3k2K1j9O6m5pl4K5N0q3
2729e0KR9p2N7l8L0k8jN1p8L5M2j6%Nl4Mlp6O4J9m5L9k4L0k3j4k2J2NJ9J7L8l3
2763A1M2ok3k8j6O7m0j5N7k5m3RK8k1J4j7J0j6M1k7K8ll4l1J6N9m1K9l9k9O5l
2795A9l4L2p2P7jm4l4N5Pl7L9k3L9l5oj6M0j2K5L0r2N5km3M3Jm5rM9qPj2Ok8L6
2830Gk3M7l5j0L8Jj6qMJ3m2M4j6oL0l1J6n6N8j1j6R6q6J3j5Ln6M4J3J1J4K4n1
2863bM4l3Opl8P8l7pL1l4mL3m5L4k8pN1l4K7l5j0M0j0lj0k8K4l4M1M2o4k2J02
2896F1Lo5J9J7k7j0J4J1r2J06k0J6lj8j5j0Jk1qN2l7M0l5l9J20o1Qk4P0kl1j7
$$ y = [15, -35, -4, 10, 53, 2, -31, 12, 1, 10, 3, 51, -9, 0, 19, 5, 11, -5, 45, -21, 26, 42, -26, 2, -20, 39, 38, -12, -34, 2, 18, -7, -23, -60, 14, -29, -18, -22, 34, -1, 18, -22, -18, 55, -13, 41, -35, 31, -8, 54, 26, -12, 4, 21, 31, -2, -24, -3, -22, 44, -1, -8, -42, -17, 33, -50, -48, 51, -21, 36, -2, 28, 0, -1, 50, -28, 7, 49, 33, 33, 38, 4, 8, 5, -71, -7, 12, -33, 6, -18, 12, -11, -25, -47, -35, -30, -11, 6, 44, 11, 53, 47, 24, -4, -20, 47, 7, -8, 49, 24, -19, -10, 18, -3, 11, -6, 4, -12, 29, 2, 30, 27, -7, -38, -22, 37, -4, 25, -14, -43, 22, 19, -15, 17, -55, 22, 21, -23, -57, -2, 5, -32, 7, -16, 23, -12, -18, -34, 6, -6, 19, 49, -43, 12, 10, -33, 10, 11, -34, -43, 6, -2, 5, -7, -1, -29, 7, -16, 31, -4, -14, 24, 25, 9, 1, 5, 18, -24, 20, 4, -2, 28, -3, 13, -43, 15, 4, -12, 84, -2, 11, -4, -1, -57, -13, 0, 11, 25, 49, -2, 42, 9, 15, 8, -30, 48, 11, 4, 35, 1, -3, 30, -15, 19, -9, -16, 35, 1, 28, -7, -17, 23, 13, 10, 0, -28, -4, -38, 3, 45, -19, -41, 61, 64, -1, 18, 35, 8, -2, 12, 23, -69, 37, 17, 33, 30, 12, -3, -13, -12, -33, -41, 11, -26, 14, -21, -60, 60, -1, 7, -17, 53, 51, 20, 3]
2928Cl9K1J0L9p6P9n3K6Ml1OK0Roq3N7J6M2k7Pk6j2J3k2OL2K1Km2j3k1J7Rk4N4
2963A8l5l1M2K5m3N5N4o2j9p0Q6j6oQj5K5QM3q2L7p2J13n2o4j4N7M0m7l6N3n7
2994e7N5m3L4K8Ojm6K2j2K1k3j4K4j4nPK7P8q6Ml2%L3n7L7l1J6k3N5k1K1K1Km7
3028b1kJ0L0K5l6KKO8q7j7K0Kj6L4l9LrL2L1p4L0J7l7K3qL8K6m6j6k4K3j1M3n
3062A1l8K0j9R0m2j2l6P9n0l0j3K5O1Kp6j1L0J9m6M5K4n7L4j3j7l9K9L0KN2pk3
3094B4Qo3K5m7k5L5M2K2k6J6k2L5n4L2Mj3JK2o0M1k3K4n1N3j8NM1k9n2O9k9J3
3126@K7q1P1m8N6nol2L9mj8l8P8l6J4nj9j6J7jM8k8oJ7pj0j4K9l1K7j4p8O3K0
3160Ij4n6P8L4q1L4Rk3N1o4k2O1l2Nl5P1n2m9Q2j3k7J5mj6L8k4J9J4m4N2L6l8
$$ y = [3, -36, -15, -5, 34, -42, 37, -16, 10, 14, -17, -11, 9, 18, 12, -71, -14, 2, 44, 17, 24, -2, -14, -1, -23, -17, 15, 36, 38, -4, -17, -38, -21, -12, -36, 18, -17, -48, -6, 19, -24, 31, 85, 23, 4, -66, 20, 4, -2, 6, -9, 16, 24, 67, -15, 22, -50, 63, 11, -53, -67, -10, 30, -17, -53, 0, -57, -2, -45, -11, 17, 23, 22, -24, -2, -14, 7, -16, -30, -6, -20, -25, -18, 9, 87, 1, 5, -27, -27, 6, -51, -14, -45, -29, -52, 3, -18, 3, 24, 26, -21, -23, -13, 17, 42, 6, 8, 10, 78, -9, -26, -6, -4, -20, 14, -25, -22, -31, 1, 32, -42, -12, 5, -32, -9, -17, 21, 47, 1, -15, -39, -16, -27, 16, 11, -27, -7, -26, 64, 22, 10, -26, 53, 3, -27, -40, -15, 46, 48, -28, -39, -9, 10, -36, 9, 33, -24, 10, -3, -20, -59, -30, 0, 2, 54, 47, 24, 32, -31, -6, -53, -78, -43, -1, 21, -5, 11, -11, 24, -30, 2, 6, -7, -6, 16, -44, -3, -26, -2, -53, 0, -18, -13, 28, -1, -53, 16, -13, 0, 27, -54, 17, -31, 25, 20, 14, -18, 21, 17, -1, -39, 39, 3, 17, 12, -7, -23, -6, -7, 41, 13, 7, 24, 17, 7, -7, 22, -9, 18, 4, -74, -11, 9, -5, -61, 17, 51, -30, 4, 13, -10, 41, -23, -45, 16, -16, -11, -46, 25, -27, -76, 6, -7, -34, -19, -23, -39, -1, -25, -6, 8, -36, 16, 52, 14]
3192A4l0K0qj4M3j0m7N0j5J5k2k8pN6mJ8j0Ol7K2j1j3OJ7l8O1o0J1kk3K7L8p3
3225d8O0Rk5Jn9J13m2l9Q0m2L2j3m8J2J1k2qM5l3K7J2M0o0j3n1L7L7l9J7rM4j5
3257A1k5P3p2Kk2L5j2n9K0M2J2Ko2N5K2l2l4M2K0n9M2k2l4N6k0M2k2o8J04r3N6
3288@k9K4K4j8qK5n2N5K2m8j02O4K0k2N8m0N4k3j6k5L6K3Oo3J7K8k1l0N9k5P%
3320@j0k8J9j9M0Knj9l5R0jm6j9K9qJ6k6QJ9n0RK6N4m0N1n1Pj2Qk6L3o1K3pN8
3355B9j0j09J02l5L6l2K1L1n3N9o5M7p7P2j0m5M6n5N5k7K7k4l3O3%o2P2%k0m3
3385d0J00n8k0k6Q7m0m1LJ5L9j2nj5jJ2J7k1rj8J7J1O7p1M7o5O3l4o5K9J7MMN
3418dK8m3L0kj2k7KJN6n7qQ3p8L9%l1NK7k2K4n0N9l5J9l1M0K4j09P3L0p2R7k4
$$ y = [14, -16, 4, -4, -18, 25, 15, -32, 18, 3, 18, -4, -32, -39, 17, 13, 31, 21, 27, -10, 12, 1, -12, -6, 11, -27, 34, -26, -15, -17, -40, -13, 25, -48, 12, 21, -4, -3, -62, 51, 9, -30, 50, 8, 40, 27, -21, -9, 2, -20, -28, 17, -16, 11, 23, 63, 3, -10, -61, -24, 13, -26, -9, -18, 26, 11, -14, 59, -13, -11, -33, 2, -10, -69, -49, -7, 5, 7, -55, 0, 22, -10, -44, -2, 18, -41, 1, -21, -55, 1, -19, 23, 1, -67, 37, -56, 0, -29, -5, 19, 1, -7, 18, -34, 21, 43, -5, -107, -43, -23, -45, 13, -27, 27, 4, -12, -37, -1, 22, 28, -35, -18, 10, -11, -41, 18, -7, 0, 0, -10, -38, -19, -38, 2, 4, -1, -20, -55, 35, 34, -12, -31, -2, -10, 6, -20, -12, 7, -43, -34, -8, 46, 6, 57, 6, 13, 1, 9, -17, 16, -45, -22, -29, 29, 19, -90, 12, -23, 13, -19, 2, 33, -20, 39, -26, 21, -56, 16, 6, -39, 7, -48, 7, -20, 7, -17, -50, 13, 13, -49, 23, 23, 3, -40, 60, 2, -18, -44, 43, 3, -38, -35, -20, 19, 7, 2, -13, -14, -2, 15, -6, -15, -33, -16, -5, 62, -9, 38, -27, 36, 2, -63, -34, -17, -13, -9, -4, 24, -19, 11, 9, -3, -30, -28, -27, 29, -28, -36, 47, -31, 8, 8, -23, -18, 9, -13, 11, -39, 20, -15, 4, -27, 13, 37, -72, 1, 31, -41, 56, 32]
3451C2l9L8l6ql7N1K5n3LL6m3O8k1m2J5J5qK0k2J4m9M3Mk0J9Ok6J1K3K4p6L7l2
3484b8qR2j8j1J7j4qpj8qjk0K1%nK9ojn8O8Rk8%K5l5J1J3m8J8O1n4N1k2j6Qk6
3520a7J2pJ4k2M8rl2mL4Kk7j5L0k1k2N8m5j9L7K8j3L1lMm7j9N9o0N1J8o8j5O0
3553B1L3m2k3K9m5M2n6mJ8J1M2J8k1j8J0m8ML1pk3O3n0J8Mj6K9qJ6p4R5r1K5Q5
3586F8j05J9K1m3N1J7k3m3P9n6L6L2p5L5l6K2l5M2M9o5%M6m5qJK6J0k3o2O0lk1
3618b9O1m0JJ6J2J6o9k7O7Oj6J4K1K2p3L0M6q2o7Q1L9k5k3K6m6M1qo2K4J8O7o7
3650b6P0j5j7o6P6j8L1o4N2m7L6j4K4Qlml6rK6K1m6pJ1L0Nk1LJ5ml6L6rj3K6K2
3685C7mn7O6j8l5jP1p0l4K1J7j9N5o1L3J6k2j1Nj9L9L4pj3k2J2kl2Q3q9O3k6k4
$$ y = [32, -7, 31, -5, -13, -50, 1, 26, -27, -24, 12, -31, 37, 16, -26, -11, 4, -4, 16, -6, 8, -41, 2, 6, -14, 5, 11, -15, -4, 19, 43, -33, 4, -28, -36, 56, 38, 27, 44, 30, 22, 15, -3, -11, -12, -32, -11, -11, -16, 13, 7, 6, -52, 16, 25, -3, -3, 22, -13, -2, 11, -37, -19, 42, -12, 39, 17, 1, 9, -17, -5, -12, 2, -20, 28, 19, -13, -17, 17, 19, -8, -23, 7, -14, -36, 22, -23, -42, -5, 23, 10, 41, 38, 42, -5, -24, 35, -25, 26, 44, -24, -39, 21, 54, 12, -11, 18, -27, 15, -41, -45, -27, -16, 26, 44, 23, 5, 15, -33, -29, 2, -5, -28, 35, -15, 3, 7, -9, 20, 12, 28, -46, 49, -42, -17, 68, -37, -18, 3, -40, 11, 28, 5, -38, 41, -15, 21, 53, -22, 13, -23, -1, -36, 6, 55, -10, -10, 36, -9, -17, -16, 10, 20, -3, -65, -5, -8, -29, 32, -8, -7, 9, 21, 37, -32, -59, 8, 14, -2, 12, 33, 55, -18, 12, 58, -24, -91, -10, 29, 4, -19, 7, -39, 2, -6, -68, -44, -26, 41, -26, 44, 29, 12, -54, 22, 4, 35, -29, 23, -24, 12, -2, 22, 30, 27, 23, -13, -22, 4, 25, -21, -28, -17, 13, 18, -3, 0, 15, 11, -25, 11, 2, -11, 15, 37, 33, -24, 42, 24, -11, -12, 59, -11, -45, -24, -7, -26, 29, -32, 1, 17, -5, -16, -11, -30, 9, 43, 36, 23, 1, 13, 11, -21, 62, -27, 36, 10, -14]
3718a4j2k1L4K6m8PO5j5q6R0j7oJ9j6l8K5J2j6J3l0LJ9Rmj8Nj9N8k3J0qj9O2q8
3752d1N2rLm1M6P5p4l0k0L2j4JQk4j4O7J6m1QO6r6j8j6N2J9Kok7M1mK2rq0M0J9
3787EK8k1n5N1k2L3Lm5ML9m0N7o8RRL5J5j2ol9k3O1k9M3K0l8j5J3j3k4N3m6k9
3820d7M8j8N3m3j6OJ7oK2l0k8O3m9jQ2p3%K2k4j2pP6k8L2m4l4J10p4m2P3n5M1
3852A4r3Q4lo3P4j5J9m6j0%P7k7LJKK8n3l1M4m2J5QM1o1J0L1J6%l2M7n2QK0L7
3886E1n2J5p5R5o4M4l7P3n1j0k2J8l6k8Q0j7J9J4J5k9m0N8j9J7M8k6o8K3Nk0K5
3917FL3j9j6n4J01m6K9m4J9k1KqM9l0Kj0J8J2o3P4l2L8k7r4P9K1j3lJ1j4l1Qk
3950b5O4m1K0Lk3k4Qj5N3Lj5Jn4N7j4Ok7N3n0J4K0pL2p9N2l9P1rp4K0L6l0kk2
$$ y = [-14, -26, -47, -13, 13, -35, -28, 37, 22, -64, 26, 9, 3, 22, 6, -32, -7, 5, -11, 2, -28, -25, -6, 3, -1, -19, -14, -33, 25, 2, 12, 4, -15, 47, -41, 11, 2, 5, -36, 10, 85, 11, -19, -39, -7, -21, -20, -12, -36, -50, 17, 33, -8, 0, 66, -30, -48, -64, -12, 7, 9, 3, -24, 17, 13, 35, 26, -54, -14, 5, 33, 12, -43, 8, -14, 19, 22, -23, -19, 20, -20, 37, -31, -22, -13, 22, 37, 25, 19, -20, -43, 18, -11, 32, 52, 14, -1, 12, -1, -25, 28, -18, -47, 1, -17, 36, -7, -23, -17, 0, -6, 16, -14, -42, 21, -28, -29, 53, -20, -20, 2, -22, -34, -41, 35, 7, 39, -5, -39, 71, -3, -45, 28, -27, 14, -79, 5, 2, -61, 13, -2, 17, -29, -39, -39, 38, 11, 14, 15, 17, 45, -8, -39, 5, -37, -22, -14, 27, -34, -24, 7, 23, 23, -9, 38, -14, -6, 14, 51, -1, 14, -61, 34, -30, 14, -23, 50, -1, -11, -33, -15, -51, -79, 1, -16, 3, 17, 32, 3, -37, 21, 2, 19, 67, 41, -27, -4, 1, -19, 6, 39, 20, 4, -50, 51, 5, 34, -10, 9, -12, -10, -18, 31, 1, 3, -7, 11, 23, -40, 34, 2, 40, 13, -81, -2, 19, 6, 3, 14, 0, -31, -23, -25, 39, -2, 18, 21, -2, -26, -18, -33, 20, 23, 8, 9, -45, 12, -2, 4, -23, 30, -20, -6, 14, 7, 39, -40, 12, -27, 44, 35, -39, -19, 17, -13, -15, -37]
3984c7P1K9q4M7k8Pm1M3j6Kk1L5K1Nm2jK2jKJ9m2N1k9k3k4L8n2Q0L3p4k4O6j7
4017A5Lk9P7p2rK0M5n5M7o5K2L4l5%PJ4k0j4RMm2N9l1O6m6RPKj5l6M8k7k1L6K1
4052B8o6M0L3k6k8K5%k6J6pNL7l4QN6n2l8M6m6RJ3k2k6N7L0o5O9k8Oj2K8lq0O5
4086A2Rrj9KqKM0j0l1K7J7l6J3jm2K7M3Jn1MQMj9M1rk9Oj6N2m4L4m0K3Nm0L8O0
4123F4o1Ok6L0k4M5n5J8K0Mol%j9lrJoN5n1O5l5Oj8j2K1n0P5J5o6NLL4kl3M2K1
4160E1l9k7L9J8j02P0J1j7k1O3k1q7J14j12M1l8O5J8r4R4k7Qj2l4N1L5n8j5K8
4189BM2m6L1o3J7K2Qm0N1J2j1k3m3Q1n9j3nM2j7l9N6QL2j9k0KM4m1J3k0mL7l1
4222FjJ8n3J8LkN9p3qN3j5PJ2l9J8l1J9LJ7J6K5p1M0RL0k4mj4l1KL0m9J6P2q5
$$ y = [-37, 34, 63, -21, 26, -2, 5, -36, 7, -9, -7, -28, 7, 28, 33, -9, -10, 12, 11, 13, 32, -10, 41, 12, -11, -35, 3, -49, 31, 64, -10, -34, 32, 15, 18, -11, 66, -6, -15, 5, 50, -5, 42, -23, -1, 33, -2, -2, 5, 19, -1, -15, -6, -2, -44, 15, -16, 50, 4, 13, 20, 22, 7, -29, 19, -8, -29, 7, 28, -38, 2, 35, 9, -19, 6, 6, -20, -4, -11, -6, 31, -3, 5, 61, 9, -29, 17, -29, -20, -7, -29, -55, 2, 32, -33, 36, 8, 14, 2, 30, 27, -53, 12, 21, 12, -7, -5, -13, -11, 29, 19, -12, 15, 32, -4, 9, 8, -34, -7, 36, 37, -14, -10, -2, 2, -17, 24, 15, -14, -8, -24, 28, -16, 18, -22, 1, 6, -34, 4, 64, 3, 9, -17, 13, -11, 34, -21, -3, 17, 21, 15, 12, 12, -7, -10, -19, -18, -24, 31, -20, 45, 10, 16, -2, -14, 7, -43, 32, 47, -19, -14, -11, 23, 21, -12, 30, 51, 12, -15, 24, 42, -60, 10, 21, 4, -17, 46, 25, -62, 52, -60, -19, -57, 8, 26, -68, 26, -1, 7, -5, -39, 12, 47, -11, -26, 2, 44, -2, 29, -34, -17, 5, 13, -27, 24, 36, 25, 2, -41, 40, -19, -32, -37, 5, -12, -51, 5, 13, 45, 26, 6, 8, 52, 11, 24, 4, 0, 37, 6, 5, 23, -30, -12, -9, -11, 48, -25, -33, 20, 5, 12, 24, -15, 3, -28, -9, -6, 11, 27, 52, -19, 21, 30, 60, 36, 32, 18, -13, -11, 19, -30, -14, 58, -27]
4257b7L2l9O8pm0NO1j7J4o7K0J3J6r3P1j2J5Nn5j6P7p6M2K3p4J15o9jk5L0l3P4
4289C0m5O0p1L2L7m1k9nJ7J7K8j9k6j0QRj1Qj7N7j7m9P4l4L3Mk7j6Pq0Q9J6J1
4322D0l0n7N8l9M9k3kl6J00p0mL0J5l1n1J3O8l4l3j4N7Rj1nJ9K6q7O3j1l9L0K0
4354B0l2LL8op0RM9j4k2lJNk8O4J7Or8L4ML3Pk0Kj7M6n6J9kRL1Mjj5k0K5j9K2
4391B5k0k0K7k4LJ9j9M5l7j2P4p7K6mN6q1L0j6J6j3Jjj8J4k9M3l9M2m7J6o1J02
4423B1NKj2l5L6k6j5M2j8J4p3J1R3o6L7Rj3o8Q2k3k2L7k8N6r7N5j1K6m6L3P%L
4456A6j7L6n7M0l9qkpO6k6L5lo0M6J1mo1L0rmO8n0JK8m7J5k5J7mK4m0P0j2m8J9
4491aj1L5j7k9M1m7M1l0rP5m7J8m6M7rN9o3j3J3rJJ%L1oLnK2j8J6k4k7J0MrM9
$$ y = [-27, 5, -34, 34, 27, -13, -8, 53, 36, 50, -17, 3, 16, 32, -61, 10, -2, 13, 18, -37, -53, 24, -52, -10, 13, -61, 54, -15, -16, -41, -11, -44, 30, -15, 45, -26, 6, 43, 2, -27, -32, -15, 2, 30, 11, -15, -25, -17, -8, -19, -11, -28, 29, 12, -37, 37, 3, 36, 40, 13, -3, 4, -76, 13, 29, 40, 10, -47, 11, -28, 21, -2, -4, -40, 60, -10, -14, 16, 31, 0, -51, -38, 30, -4, -37, -51, 6, 15, 4, -1, 18, 44, -43, 20, 9, -30, 0, 20, -12, -9, 29, 23, -47, -38, 11, -3, -25, -28, -27, -22, -50, 14, 31, 37, -61, -27, -23, 10, 17, -3, -1, -18, 28, -28, -9, -11, -2, 29, 33, 32, 17, -3, 22, 3, 25, 5, -15, 12, -12, -9, 10, -9, 36, -1, -13, 61, -16, 10, 6, 62, -19, 11, -5, 11, -2, -1, -2, -20, -6, -35, 8, -31, 11, -36, -20, -81, 21, 26, 28, 16, -19, 17, -9, -24, 18, 0, 14, -59, -48, 45, -21, 16, 25, 12, -56, 26, 3, -19, 18, -10, 46, -51, 4, -7, 19, -27, 6, 13, 13, 16, -1, 35, -22, 18, -21, -29, -31, -38, 28, 2, 37, 34, -26, 20, 31, 27, -34, -4, -13, -17, 51, 1, 2, 30, -17, -2, -27, -10, -14, 10, -30, 40, 28, -20, -1, -12, 23, 6, -23, 18, -29, 12, -18, -27, 48, 1, 19, -27, 20, 11, 70, 7, -6, 7, -2, -1, 0, 0, 31, 25, 28, 23, 45, 27, 43, 19, -8, 2, 6, -3, 46]
4527D6n6J4j1mK0J1Nn0N6o0J5M9k8m1L9M1l7rk0mK8J0Rl1M9o9lM0Kkj7n6R8k2
4561A2k1m4K0N0p7N0Qk6K3k0M1J0p4L9l2K1j4M6l6M9J2n0%L5J0n5L4%J4k4Jl4
4593c2qM9K7m1j0LKK4MJ5p0P9J1k5l9j3L6j9J9K5m5N3k0k6%p6O4OJ8Joj8KM5m5
4628a0k4L1k8J1L8K8k9k1K5pL7l6n9P4l4Nk7M2J3m4N6n1L1l2L6k3j7K2j8Pj3k8
4660d5M4k5j0K5KlJ2L6j9oO4j00qK4n0J01m9P7q5L8J5l5K5k2k1L1k9L0j0Mj3l7
4692c9L9n5P3Nm9K9k0M2j3o4O9j3J3Kll6N1Mp8Q9r0P0n9nN2n9ON3mOkJ3rj6lO3
4728F2j01lN9k1k6L3l6M4lOj2L2J9r1K8LLll7K4J2j5M2m3m2Q5Jk6K0Pm0j6j3M7
4762am6M9RK4l4l0J6j0J2K5j9LK1%j9j4O3m9l5K3J5K1K7k3Qr3J9L8K0J0m5L1q5
$$ y = [46, -10, 4, -7, -11, 9, 20, 25, -25, 31, -29, -14, 35, 7, -34, 5, 46, 9, 0, -20, -24, 4, 14, 23, -8, 41, -28, -31, 9, 11, 9, -8, -64, 34, 12, -9, -53, -33, 17, -60, -10, -2, -28, -5, -25, 16, 26, -48, -9, -41, -20, -34, 12, -24, 25, 37, -13, -13, 22, 32, -23, 11, 11, 25, 1, 2, -32, -40, 9, 36, -5, -15, -12, -10, 14, 18, 33, -37, 42, 53, 28, -11, -24, 12, -7, 12, 37, -8, 45, 25, -1, -1, -77, -13, -7, 11, 12, 6, -12, -10, 35, -10, -34, -3, -31, -20, 18, 46, 17, -4, 21, 14, 51, 15, -44, 30, -4, 1, -26, 16, 29, -15, 41, -10, 21, -11, 25, 2, -15, 7, -11, -4, -17, -45, -1, -26, -36, -11, -9, -12, 0, 36, 17, 11, 75, -25, -33, -9, -59, 42, -7, 70, -15, 23, 38, 3, 28, 6, -15, 16, -13, 17, 7, 11, -2, -39, 0, -55, 18, 23, -26, 3, -17, 25, 12, -52, 17, 4, 17, 19, 16, -20, 31, 35, -43, 46, -44, 26, -33, -38, 14, -45, -39, 14, 10, 16, 14, 27, 18, 2, -1, 62, -39, -42, 17, -4, -30, 3, -33, 11, 8, 14, 2, 34, 53, -38, -10, -7, -4, -7, -44, -20, -8, -23, 19, -24, -66, 19, 20, -6, 14, 21, -19, -35, -48, -1, -47, 2, 11, 35, 1, -29, -13, -23, -11, 14, -5, -2, 19, 19, 0, -14, 49, 0, -35, -12, 3, 24, 51, 28, 36, -57, -38, 0, 20, 30, -15, 16, -69]
4795f9M3N2j2l1K6NJ6n6N9m7L1o4N5l2N1Pl2n4N4l5N3j7Oj7NL7k6Pk6M2m5M8n5
4828b1j4L2nK1K6m7QLM9l9j5mlk2L1Km6O6n7j4M2K2Kq0P2Mk8J9L0J0n1J2Rk2L
4863eMJ0j4j1P9o2kJk9M5LJ4l7K5j3Lk6Rj7K7NL7k0l4J7kj2K5m8P5n0k0M0j8m
4898eJRK4k6j1L2jK1p1m4O5j8J6L6l0j6L3Nk7kJ5oK2n5qP1m3mL5J2l4k7M6Oo6
4933d5k5J02k6QK0l3l1O2rj0lJ5n8L7LO4o7k9P6j8m8Q2m7l5J7K5k6n4L8K5o3Q4
4965C1q1N7k5rJ9k3K8NMk9M3J1Ro9K8K1L7l8J3qMj1J5m0L4o0JP5k8j0kNLn6%J5
5001c1J2O7o6k9M1l2j5M0N9j2q5L7J5J2Kk7j2M5Qkm6J0pqL3K5q1lM9K5k6k4M2
5034A6J8j5l8J7n3N8N8K7m6m7P2q1K0nm1J9Kl2M9P3q0K7Jj5Lk8N9j7j17J07j9
$$ y = [-69, -26, 26, 14, -17, 9, 14, 30, -26, 33, -14, 17, -47, 8, -24, 27, 34, 2, -52, 2, -33, 20, 3, 9, -8, -3, 34, 8, 15, -11, 31, -14, 34, -21, -35, -3, -8, 13, 39, -8, 0, 3, 52, 13, -2, -6, -9, -31, 0, 2, -44, 22, -35, -49, -7, 15, 17, -63, 9, 13, -15, 4, 34, 44, -7, 5, 14, -8, -5, -1, 9, -5, -16, 63, 1, -1, 0, -29, 16, 19, 33, -4, 21, 8, 11, -15, -6, -23, 4, 9, 46, 26, -8, 9, 7, -5, 20, -28, 47, -3, -23, 17, -1, -5, -4, 5, 29, 3, -8, 24, 23, 44, -27, -71, -6, -24, -8, 28, -2, -18, 15, 20, -7, -9, 6, 0, 22, -33, -41, 30, -13, -17, 18, 30, -4, -31, 15, 21, -45, -70, 32, 6, 14, 34, 1, -30, 32, 23, 13, 10, 25, -33, 4, 7, 71, 4, -25, 51, 33, -15, 67, 20, -15, 2, 27, 1, -53, -15, 10, -53, 31, -50, 7, -18, -27, -8, -31, -3, 2, 6, -23, 20, 31, 40, -29, -1, 20, 57, 19, 32, 24, 28, 17, 32, -8, 26, -34, -33, 42, 14, 4, 2, 7, 10, -46, -46, -31, -19, 48, -18, -47, -6, -38, -53, -13, 46, 34, -51, -14, 1, 13, 15, -12, -24, 21, 29, 27, -19, -9, -16, -24, 9, 34, -47, -50, -1, 24, -2, -26, 16, 34, 19, -19, -2, -55, 3, 61, 88, 42, -5, 67, -14, 6, 1, -40, -21, -19, -51, -2, 71, -9, 18, 19, 4, 7, -21, 38, 21, -96, 11, -8]
5065hMM3m4L3k4jJ5l4mLQ2o7p4Q1k0j3O5l8OK6k%p4K4oK6J0J9rm3pP1j13M2K5
5100fJ5m3OL7m1mQ6m7j5K3Rqk3k0L8j3K0L9l6M0p9j2N3nk7K8J4m5J1PNpj7Q1k6
5135C8m4N7p7O5m3j8j1J3L7k7J3J8m6L3ok8P0o8j8M8l4L0L8q3j4J0NK7j5k7R4
5166C7l3jN2p1j1L3oL3o6oM6qL4q1L9l1M0L3j7k0MpL4k4J0k7j5N7l1J8M2n2j3
5199hJ8mnJL2p4M7Jm6M9J0r2R4k0O5o6k8J5mN5n7Rj1k2L8j8RNK5j9M6Jr3K1N3
5234B7n3j4M6K5k6J0j4j6j1M0J0K7r9O3O4r6k7L9Kk3L8K4l8k3l6M3j4L6k9L8j1
5265Bl0K0m1P0K6l1j1J1l3N3k0m7j2jN1J5J4m6l8N7N9n0K5o3pP6n1pJ6l2M7n0
5297b8j1J1P7k9p4Q1l0m2M1K3l7L6n6J2pJ2K1%J4j0klk0jj0M5k3K8j2lPLj7k4
$$ y = [-8, -4, 39, -5, 28, 4, 3, 18, -16, -20, -17, 65, -2, -76, 5, -15, -28, 37, -1, 5, 31, 29, 29, -45, -21, -27, -1, 9, 28, 19, -24, -31, 40, -73, -31, -6, 9, -34, -28, 9, -32, -36, 50, 3, -12, 11, 20, 12, -11, -31, 7, -6, 14, 53, 17, 57, -22, -34, 19, 14, -13, 15, 29, -16, -5, 2, 7, 0, -17, 64, 38, -6, 51, -26, 39, -4, -22, -33, -20, 17, -10, 3, 21, -25, 8, 2, -26, 44, -24, -42, 6, -28, 2, 40, -43, -57, -47, -42, -15, -30, -57, 37, 4, 3, 55, -16, -27, 6, 0, 33, -33, -39, 7, -1, 33, -48, -9, -40, 0, 33, 16, -4, 0, -7, 27, 3, 13, -14, -29, 28, -3, 15, 57, 5, -8, 10, 6, 1, 2, 34, -40, 7, 8, -38, 11, 21, -71, 23, 3, 68, 2, -26, -11, -15, 40, -17, -8, -19, -41, -3, -21, -12, -7, 18, -1, 45, 46, -47, -26, 27, -26, -40, 6, 31, 5, 15, 1, -15, -26, 14, 24, 51, -48, 15, 79, -17, -44, -5, -3, -26, 12, 36, -2, -25, -61, -18, -32, 4, -25, 13, 2, -28, -8, -49, 21, 47, 16, 5, 16, -17, 36, 16, -31, -43, -44, 7, 22, 36, -10, -48, 9, 68, 18, 43, -20, -27, 49, -2, -9, 7, -25, 22, -28, -39, -28, 49, 20, -54, 27, -3, -45, -4, 19, -18, 18, -38, -26, -33, -21, 0, 0, 14, 4, 2, -1, -21, -22, -32, 13, -10, 18, 6, 3, 10, 13, -4, -28]
5331b8L7JK0k4j6j5j2O8k3L0mm7mM3k6k0QL2kK1n3j2P3m5M6k4l7k5qO9n0M8lo0
5365d2O1l7L8n1ON5l2mK4K5j23J11m0l2J4M8Ql1K0J5l5j%K4Pm0j0jJ2M1K0k4k1
5398EK1k7K4n8j8N5j2M6p4N9%Om7JM0L7m8l2Q5l0qn0M0Pj0l8L7k5J9Mj3JNk4K5
5433CM7p7O9l9J9l8K4MMn1J7L6l4M0k8JN7o6J4M4J1p1M9l8lj3L8j3np7M9QJ0j2
5467b1K6lm1L9l1P7o1oj5L0N4n2joL8q3M8L6J4l5ml4K9j5J7M0l8M2q4L9N5l5l2
5500a3ML8n0MQ5p6N1n8K9k6LN2j2n3M9J8k9n3K7QM0m6MM5o6P9q3J4j1M3Ro1J4
5533b1PrmJ4K9l6O8o7MJL6k8qm9K4L0K1L4q7J8J2K0k9K0Ml%l0Q7n7L0L3j26N2
5567a0K9j3m3N5k5K9j3m1j2N8J5Ro4L7o0L1J5rL2j9M3k5j1K0j9L7p9K4L4Pn8K
$$ y = [-28, 9, 10, 30, 6, -10, -25, -37, 31, 8, 38, 34, -13, -17, 26, 0, -20, -12, 20, 18, 39, -14, -26, 47, 2, 48, 24, -13, -38, -46, 23, -27, 21, 18, -42, 19, -18, 20, -31, -25, 30, -2, -6, 18, 43, -80, 31, -9, -41, -27, 21, 29, -2, 18, 33, -2, -3, -3, 21, 28, -12, -22, -23, -11, 30, 50, 26, 5, 26, -1, 23, -35, -53, 2, -10, 36, -38, 21, 21, 27, -20, -19, 21, 58, 10, -22, 63, 33, 25, -25, 15, 22, 12, -26, 11, -14, 5, 9, -4, -3, 2, -22, 3, 50, -27, 42, 3, 22, -16, 8, 12, 16, -35, -18, 18, -16, 24, -4, -3, 54, -12, 2, 46, 57, -14, 35, -3, -6, -19, 19, 6, 1, -76, -27, -19, -9, -21, 5, 2, -39, 0, -31, 46, -15, -21, -36, -6, 48, -4, -5, -11, 27, -56, -8, 28, 42, 7, 3, -31, -2, -17, 0, 40, 2, 44, -40, -1, 54, 19, -13, -9, 29, -21, -17, 68, -8, 43, -15, 14, -12, -9, 43, 31, -22, 27, 45, 16, -37, -10, -2, 38, -8, -4, 41, -25, 54, -29, -15, -26, 17, 26, -35, -21, -14, -23, -27, -13, 16, -20, 48, -19, -15, -14, 22, -6, -14, -63, -39, -9, 12, 46, -41, -23, -11, 9, -20, 0, 4, 1, 1, -29, 58, 1, 31, 64, -62, -10, 19, 6, -37, 18, -7, 22, 9, -32, -44, 14, 29, 38, -26, 11, -49, -18, -3, -12, 20, 1, 44, 19, 8, 28, 9, 46, -33, -9, 25, 32, -26, -24]
5599b4K3j9N8k8m8K5l9M2j8M4L4r0L9%l3R1q1j8L5M8n2J4j8j4j0N5k3O4p3KN7
5630D3m4JJ6k2M7l0lNOlMKo6KO1K5j7j3j4J3l7J7L5mokjl5nM4l4J5L4k5mk4K9
5667A0m5P0l6K5m7M8m3K7J5mj1l0Lj4L9mN1n9K4ql6O1j08J18l4n3Q5q4L2NM0l5
5699Bnm3O3k2Ro4P1J3j9QrJ0k4j9OpJ5rJ1O7m1k6rK3O4r4L8KJ9N3j03L7j1jrK0
5735A6K8m0K0k7M3n6J0k4Qj2L8n7P4j1K5l4k2K9K8m2K9kj9k1O3l0Om1k1K3O3n8
5767a4oN8n8Jk1P6j24O1M0k0k3M4k3J7K0m4kK2Ol1L8j5j6oQ3o8l2O7l6l1O9n7
5799b5M9k3l7O7j6L8o3J4l5LO4m4KK7q4J11r9j1O5P9o6lL0l2jK1j2m4M0pl2N9
5831C5k3LqQrm7O9Rn2M3m1L1m6N9J3l5LJ2J3K6r3L1M5l7k0l7Q2k1Pl5oK3mk3L8
$$ y = [-24, -1, -20, 38, 10, -38, -13, -52, -10, -28, 16, 50, -40, -1, -1, -34, 57, -24, -42, -7, 41, -11, 3, -15, -29, -39, 16, -7, 57, -16, -14, 43, -1, 0, 16, -6, 41, 11, 8, 13, 19, 16, 20, 22, -44, -42, 19, 44, 27, 14, 0, 13, -24, -7, 28, 24, 18, 16, 15, -20, -25, 19, -15, 0, 34, 9, 5, -19, 10, -35, 35, -1, 24, -23, 25, -18, 9, 24, 20, 9, -21, -18, -32, 7, 3, 54, -5, 19, 11, -25, 36, -72, 46, 12, -41, 44, -40, -8, -3, 37, 2, -3, -46, 17, -5, 4, -60, 11, 24, 5, 13, 4, 14, -10, -29, -23, -30, -15, -24, -13, 54, 13, -13, -22, 1, 65, -29, 9, 11, 30, 83, -20, 17, 6, 5, -4, 16, 44, 4, 24, -3, 40, -16, -6, -30, -22, -34, 4, -53, 21, 10, 35, 1, -21, 8, 36, -6, 23, 21, 2, -19, 44, 14, 20, -21, -42, -19, 44, -14, -20, 38, -20, -19, -40, 36, -88, -27, 13, -7, -30, 14, -9, 8, 28, -16, -18, 4, 10, -21, 17, 2, -14, -20, 63, -5, -37, 30, -6, -37, 32, -25, 24, 1, -36, 31, 15, 53, -10, 4, -31, -28, 36, -8, -6, 21, -63, 48, -51, -62, 3, 82, 16, 13, 43, 11, 10, 31, 19, -25, 15, 8, -24, 35, 12, 15, 7, 15, 6, -41, 28, 37, -15, 28, -13, 18, -28, 31, 44, 9, 12, 24, 37, 63, -30, 1, 46, 9, -11, -48, 34, 13, 20, -15, -21, 2, -2, -25, 13]
5866A3j1J2J7o1N0m5O4l0j7QK4o5L1RN1n9N9k2l4L3kJ5o7N6m7Ql3O1m4L1q4M4
5898c5J4N6m7j6M0n7Q3o7O6ll9K6J0Qp6j8R8j9j9K1j6k2rK0j4nL7Ml9M0ll4K8
5931A3o0Q9l0rL8o3L4L2n7JO8k2q0M6pj7M2M5j4o7RM9l1K0m2J6Pr1J17l4L7n6
5963a7P0r0L8m4J6ORK6k9N3m4L9M5q2kM8m9L5m4k1M0m9J0P4l2k3j1j6P3l4K1J7
5995C3m2L2q5N0nO7o2rM3k8K7pk6mj3J02m7n7M1KJ1j4Kj9lO9o8Pl1LK1lN1j2l1
6030eK2nj3J0j8L1j0LM7o6pN5rk2j6k7N0l8M2o8P3m1M5J9o4J8k6L0k7j5J5K1O6
6063G0j15K7L7m1O0o3K8m5R7l6ml3M6k2J1l0N3m2Mrj9ML5K0p7L8k1L6J2k0O9j26
6095e6N8n2K3j6K2L4k4rJ9L2np6J6N3n2Rk1R1m8J3JRm2jQL0Pk6L8n7M0k3lK3L5
$$ y = [13, 2, 14, 31, -30, 20, -25, 39, 9, -8, 0, 24, -41, -10, -1, 50, -9, 50, 28, -6, 27, 25, 40, -27, 29, -18, -10, -43, 18, -26, 5, -79, -35, -21, 35, -12, -28, 12, -45, 38, -29, 37, 34, -5, 21, 31, 39, -37, -55, 43, 24, 5, 26, 10, -12, -21, -1, -15, -20, 17, 21, -18, 22, 19, -15, 13, -47, 42, 12, 3, 41, -22, 12, 44, -13, -12, 56, 34, -46, 0, -7, -24, 18, 63, 49, -18, -9, 40, 9, 29, -13, 3, 10, -81, 36, 2, 39, -17, 53, -37, 1, -43, -27, -21, -12, 14, -15, 38, -6, 33, 78, -4, -6, 42, -7, 28, -16, -37, 3, -46, -36, 38, 6, -17, -28, -44, 29, -5, 16, 33, -9, 23, -62, -12, -17, 50, -12, -21, 22, -6, 21, 14, -12, -16, -29, 73, 26, -31, 10, 12, 23, 9, 11, -8, -11, 58, -10, -3, -34, -31, -10, -13, 38, 26, -5, 17, 12, -1, 9, -9, 22, 12, 15, 62, -4, -11, 44, 35, 13, -3, -30, 20, -18, 24, -44, 29, -12, 33, 52, -12, 6, -20, 10, -17, -32, -17, 4, 70, -45, -18, 19, -22, 38, -25, 3, -42, 55, 19, 15, -18, 28, 6, 17, -13, 40, -2, 2, -7, -26, -22, 13, 33, -44, -6, -27, 9, 21, 1, 70, -56, 2, -50, -27, -43, -21, 13, -11, -20, -1, 31, 26, -50, -34, 19, -33, -24, -45, 46, -2, 11, 12, 21, -21, -22, -14, 16, 23, -3, 35, -22, 18, -5, -8, 15, 50]
6130E0m9j3l2j8j3N8L5o0L0L1m4jL8J3o0J8J2k8L3K7m2J4n3J3L0M0j9PjM1n2K6
6162C1Km6Qm6J6P7n4L3LoJ6l7J6m9PM3lK1n0k1O9l5k0K6K7p2K3M1l2J3K2pj1n5
$$ y = [50, 1, -12, -44, -62, -75, -17, 18, -42, -12, 19, -25, -26, 12, 25, -35, -17, -5, -33, 0, 27, -15, -1, -54, -41, -11, 29, 10, 17, 16, 57, 5, 31, 33, -13, -5, -51, -35, 42, -12, 21, 24, 18, 34, -3, 13, -36, -29, 14, 11, 32, -18, -39, 30, -5, -25, 1, 28, -44, -21, 20, -12, 1, 23, 16, 5, -50]
$$ [...]
8191E0
##END NTUPLES=NMR FID
##END=
