##TITLE=1H_Ser DHA-OX-Ac
 CDCl3
 8 sc, 
 2.4.2024
##JCAMPDX= 6.0         $$ Bruker NMR JCAMP-DX V2.0
##DATA TYPE= NMR FID
##DATA CLASS= NTUPLES
##ORIGIN= UXNMR, Bruker Analytische Messtechnik GmbH
##OWNER= root
$$ XWIN-NMR		Version 3.5
$$ Tue Apr  2 16:08:45 2024 Russian Standard Time (UT+4h)  she@DPX200
##.OBSERVE FREQUENCY= 200.1309
##.OBSERVE NUCLEUS= ^1H
##.DELAY= (6, 6)
##.ACQUISITION MODE= SIMULTANEOUS
##.ACQUISITION SCHEME= undefined
##.AVERAGES= 8
##.DIGITISER RES= 18
##SPECTROMETER/DATA SYSTEM= spect
##.PULSE SEQUENCE= zg30
##.SOLVENT NAME= MeOD
##.SHIFT REFERENCE= (INTERNAL, MeOD, 0, 15.7039)
##AUDIT TRAIL= $$ (NUMBER, WHEN, WHO, WHERE, WHAT)
$$ ##TITLE= Audit trail, XWIN-NMR		Version 3.5
$$ ##JCAMPDX= 5.01
$$ ##ORIGIN= Bruker BioSpin GmbH
$$ ##OWNER= she
$$ F:/spectra/data/she/nmr/H-F/1/audita.txt
$$ ##AUDIT TRAIL=  $$ (NUMBER, WHEN, WHO, WHERE, WHAT)
(   1,<2024-04-02 16:07:33.01 +0400>,<she>,<DPX200>,
      <created by zg, POWCHK disabled, PULCHK disabled
       configuration hash MD5:
       00 E9 B6 7A A2 85 ED C7 34 08 36 98 17 FE 4E 26
       data hash MD5: 16K
       AE 56 1B AA 6B 60 07 53 DD 50 AF 5F 97 4B D7 4F>)
$$ ##END=
$$ 
$$ hash MD5
$$ 28 D5 6C 84 FD C9 15 2A 94 7B F0 9F F5 47 F8 D3
##$RELAX= 
##$RELAX= 
##$RELAX= 
##$RELAX= 
##$RELAX= 
##$RELAX= 
$$ Bruker specific parameters
$$ --------------------------
##$DU= <F:/spectra>
##$EXPNO= 1
##$NAME= <H-F>
##$PROCNO= 1
##$TYPE= <nmr>
##$USER= <she>
##$AMP= (0..31)
100 100 100 100 100 100 100 100 100 100 100 100 100 100 100 100 100 100 
100 100 100 100 100 100 100 100 100 100 100 100 100 100 
##$AQSEQ= 0
##$AQ_mod= 1
##$AUNM= <au_zg>
##$AUTOPOS= <>
##$BF1= 200.13
##$BF2= 200.13
##$BF3= 200.13
##$BF4= 200.13
##$BF5= 200.13
##$BF6= 200.13
##$BF7= 200.13
##$BF8= 200.13
##$BYTORDA= 1
##$CFDGTYP= 0
##$CFRGTYP= 5
##$CHEMSTR= <none>
##$CNST= (0..31)
1 1 145 1 1 1 1 1 1 1 1 1 1 1 1 1 1 1 1 1 1 1 1 1 1 1 1 1 1 1 1 1 
##$CPDPRG= <>
##$CPDPRG1= <>
##$CPDPRG2= <>
##$CPDPRG3= <>
##$CPDPRG4= <mlev>
##$CPDPRG5= <mlev>
##$CPDPRG6= <mlev>
##$CPDPRG7= <mlev>
##$CPDPRG8= <mlev>
##$CPDPRGB= <>
##$CPDPRGT= <>
##$D= (0..31)
0 1.2 0 0 0 0 0 0 0 0.06 0 0.03 0 0 0 0 0.0002 0 0 0 0 0 0 0 0 0 0 0 0 
0 0 0 
##$DATE= 1712059652
##$DBL= (0..7)
120 120 120 120 120 120 120 120 
##$DBP= (0..7)
150 150 150 150 150 150 150 150 
##$DBP07= 0
##$DBPNAM0= <>
##$DBPNAM1= <>
##$DBPNAM2= <>
##$DBPNAM3= <>
##$DBPNAM4= <>
##$DBPNAM5= <>
##$DBPNAM6= <>
##$DBPNAM7= <>
##$DBPOAL= (0..7)
0.5 0.5 0.5 0.5 0.5 0.5 0.5 0.5 
##$DBPOFFS= (0..7)
0 0 0 0 0 0 0 0 
##$DE= 6
##$DECBNUC= <off>
##$DECIM= 32
##$DECNUC= <off>
##$DECSTAT= 4
##$DIGMOD= 1
##$DIGTYP= 9
##$DL= (0..7)
0 120 120 120 120 120 120 120 
##$DP= (0..7)
150 150 150 150 150 150 150 150 
##$DP07= 0
##$DPNAME0= <>
##$DPNAME1= <>
##$DPNAME2= <>
##$DPNAME3= <>
##$DPNAME4= <>
##$DPNAME5= <>
##$DPNAME6= <>
##$DPNAME7= <>
##$DPOAL= (0..7)
0.5 0.5 0.5 0.5 0.5 0.5 0.5 0.5 
##$DPOFFS= (0..7)
0 0 0 0 0 0 0 0 
##$DQDMODE= 0
##$DR= 18
##$DS= 0
##$DSLIST= <SSSSSSSSSSSSSSS>
$$ [...]
##$SUBNAM2= <"">
##$SUBNAM3= <"">
##$SUBNAM4= <"">
##$SUBNAM5= <"">
##$SUBNAM6= <"">
##$SUBNAM7= <"">
##$SUBNAM8= <"">
##$SUBNAM9= <"">
##$SW= 18.0517689322627
##$SWIBOX= (0..15)
0 0 2 0 0 0 0 0 0 0 0 0 0 0 0 0 
##$SW_h= 3612.71676300578
##$TD= 16384
##$TD0= 1
##$TE= 0
##$TE2= 300
##$TE3= 300
##$TEG= 300
##$TL= (0..7)
0 120 120 120 120 120 120 120 
##$TP= (0..7)
150 150 150 150 150 150 150 150 
##$TP07= 0
##$TPNAME0= <>
##$TPNAME1= <>
##$TPNAME2= <>
##$TPNAME3= <>
##$TPNAME4= <>
##$TPNAME5= <>
##$TPNAME6= <>
##$TPNAME7= <>
##$TPOAL= (0..7)
0.5 0.5 0.5 0.5 0.5 0.5 0.5 0.5 
##$TPOFFS= (0..7)
0 0 0 0 0 0 0 0 
##$TUNHIN= 0
##$TUNHOUT= 0
##$TUNXOUT= 0
##$USERA1= <user>
##$USERA2= <user>
##$USERA3= <user>
##$USERA4= <user>
##$USERA5= <user>
##$V9= 5
##$VALIST= <valist>
##$VCLIST= <CCCCCCCCCCCCCCC>
##$VD= 0
##$VDLIST= <DDDDDDDDDDDDDDD>
##$VPLIST= <PPPPPPPPPPPPPPP>
##$VTLIST= <TTTTTTTTTTTTTTT>
##$WBST= 1024
##$WBSW= 4
##$XGAIN= (0..3)
0 0 0 0 
##$XL= 0
##$YL= 0
##$YMAX_a= 498995
##$YMIN_a= -552288
##$ZGOPTNS= <>
##$ZL1= 120
##$ZL2= 120
##$ZL3= 120
##$ZL4= 120
##$ABSF1= 10
##$ABSF2= 0
##$ABSG= 5
##$ABSL= 3
##$ALPHA= 0
##$AQORDER= 0
##$ASSFAC= 0
##$ASSFACI= 0
##$ASSFACX= 0
##$ASSWID= 0
##$AUNMP= <proc_1d>
##$AZFE= 0.1
##$AZFW= 0.1
##$BCFW= 1
##$BC_mod= 2
##$BYTORDP= 1
##$COROFFS= 0
##$CY= 11.3945322036743
##$DATMOD= 1
##$DC= 2
##$DFILT= <>
##$DTYPP= 0
##$F1P= 15.7292609196834
##$F2P= 12.9074282941183
##$FCOR= 0.5
##$FTSIZE= 0
##$FT_mod= 4
##$GAMMA= 1
##$GB= 0.15
##$INTBC= 1
##$INTSCL= 1
##$ISEN= 128
##$LB= 0.24
##$LEV0= 0
##$LPBIN= 0
##$MAXI= 10000
##$MC2= 0
##$MEAN= 0
##$ME_mod= 0
##$MI= 1.114404
##$NCOEF= 0
##$NC_proc= 0
##$NLEV= 6
##$NOISF1= 3.799351
##$NOISF2= 2.8
##$NSP= 1
##$NTH_PI= 0
##$NZP= 0
##$OFFSET= 15.70392
##$PC= 1
##$PHC0= -25298.97
##$PHC1= 11.98731
##$PH_mod= 1
##$PKNL= yes
##$PPARMOD= 0
##$PSCAL= 0
##$PSIGN= 0
##$REVERSE= no
##$SF= 200.130013532006
##$SI= 16384
##$SIGF1= 3
##$SIGF2= 2
##$SINO= 400
##$SIOLD= 16384
##$SREGLST= <1H.CDCl3>
##$SSB= 0
##$STSI= 0
##$STSR= 0
##$SW_p= 3612.71676300578
##$SYMM= 0
##$S_DEV= 0
##$TDeff= 0
##$TDoff= 0
##$TI= <>
##$TILT= no
##$TM1= 0
##$TM2= 0
##$TOPLEV= 0
##$USERP1= <user>
##$USERP2= <user>
##$USERP3= <user>
##$USERP4= <user>
##$USERP5= <user>
##$WDW= 1
##$XDIM= 8192
##$YMAX_p= 0
##$YMIN_p= 0
$$ End of Bruker specific parameters
$$ ---------------------------------
##NTUPLES= NMR FID
##VAR_NAME=  TIME,          FID/REAL,        FID/IMAG
##SYMBOL=    X,             R,               I
##VAR_TYPE=  INDEPENDENT,   DEPENDENT,       DEPENDENT
##VAR_FORM=  AFFN,          ASDF,            ASDF
##VAR_DIM=   8192,          8192,            8192
##UNITS=     SECONDS,       ARBITRARY UNITS, ARBITRARY UNITS
##FACTOR=    0.0002768,     1,               1
##FIRST=     0,             0,               0
##LAST=      2.2672688,     0,               0
##MIN=       0,             -552288,         0
##MAX=       2.2672688,     498995,          0
$$ Real data points
##PAGE= N=1
##DATA TABLE= (X++(R..R)), XYDATA
0 0 0 0 0 0 0 0 0 0 0 0 0 0 0 0 0 0 0 0 0 0 3 -3 4 -5 5 -4 4 -5 5 -4 4 -4 4 -5 7 -7 4 -4 4 -3 1 0 -2 3 -5 6 -8 10 -13 13 -14 17
52 17 -16 17 -15 8 1 -17 34 -70 121 -201 327 -534 888 -1537 2870 -6069 16520 -106636 -552288 170312
72 170312 358801 -228383 -16464 106577 -162663 96754 153182 -222886 -7504 173369
82 173369 -90135 20293 42315 -206123 136306 262281 -293618 -149436 369939 8410
92 8410 -264723 114237 92437 -88623 96412 -18487 -168084 128452 123023 -157160 -28327
103 -28327 91848 -25622 42289 16528 -141747 81254 176953 -159850 -110850 178443 27739
114 27739 -102016 33368 -3114 -14293 116348 -44025 -150889 121005 108437 -137252 -20136
125 -20136 72928 -48982 35722 51583 -139101 3919 176237 -85601 -137368 107289 40183
136 40183 -57115 18153 -51199 -20929 130022 -26815 -139827 79335 83230 -81425 2093
147 2093 10426 -64105 75473 45595 -147391 -3128 139925 -50458 -89831 56821 4551
158 4551 -22383 48084 -56855 -64762 98874 20167 -105840 13387 55446 -25253 8981 -4152
170 -4152 -51286 62740 45697 -103051 -1728 84489 -43489 -26040 41593 -47585 -4781
181 -4781 85232 -57344 -75311 98245 24194 -87186 23357 31978 -29397 27954 2826 -48722
193 -48722 43124 38629 -55202 10049 37235 -35806 23014 26122 -66642 23338 74310 -62194
205 -62194 -36005 78031 -6059 -46767 38894 -2032 -30077 42464 -3559 -44767 30037 20573
217 20573 -25080 11325 7018 -14337 32099 8285 -44733 26679 40738 -41443 -9162 35916
229 35916 -15125 -11981 23086 -12059 -14454 26391 -3731 -21540 17661 2869 -11286 13739
241 13739 -6215 -14207 20460 4905 -24086 6937 19713 -14012 -7693 10414 -2486 -1027 -567
254 -567 -6576 3132 -1363 -9011 2148 3252 -10913 -2435 10351 -11651 -13750 11457 1459 -16303
268 -16303 -4403 8754 -2409 -12825 3572 9303 -5845 -4541 4762 3178 -5656 -2957 5310
281 5310 -1798 -7018 -2990 2266 470 -9753 -23 7367 -7944 -6765 5344 695 -5582 436
295 436 2292 -2357 2971 -1416 -3532 11655 -11 -10918 9864 7219 -13843 -1617 14430 -4987
309 -4987 -12521 9531 5465 -6976 -1083 5711 6521 -5788 -6646 11789 3145 -13922 4241 16994
323 16994 -8428 -10996 19930 7307 -13810 6724 14273 -3161 -6354 6089 9898 -4603 -6799
336 -6799 9259 7483 -11569 -3969 16884 -4062 -15762 13067 6440 -15062 2816 10825 -5668
349 -5668 -1975 7873 -2621 -685 7144 -4939 -447 7155 -5901 -1998 5127 -4334 -1902 5798
363 5798 -2703 -5756 5038 -2170 -6195 6154 -5818 -9701 9932 -1358 -16807 5315 13851
376 13851 -11555 -7512 15201 -2166 -10744 9123 461 -10437 3923 4316 -9075 -5431 4228
389 4228 99 -3330 -7639 -5228 11118 -2649 -19163 7896 10665 -15901 -2390 12291 -11361
402 -11361 -3765 20453 -12220 -18795 23997 4548 -23518 8096 12692 -9072 3950 4629 -12149
415 -12149 9312 13236 -18027 -1873 13160 -8583 2304 3271 -19194 13872 25313 -29576 -13248
428 -13248 42584 -3545 -29296 25722 5247 -23280 25349 7334 -36876 17135 33343 -27380
440 -27380 -13346 23718 -1015 2230 2552 -25396 16302 30103 -35413 -12765 37249 -11293 -13673
453 -13673 28549 -22593 -21311 55963 -4119 -59491 34622 39292 -36595 -4159 19578 -11632
465 -11632 15738 11226 -39314 7994 37552 -28646 -17020 19840 -13856 7107 21236 -43921
477 -43921 -9841 64264 -13175 -56526 32212 23148 -28690 13239 -2269 -31812 35871 20072
489 20072 -56994 1595 48060 -20368 -18315 14965 -19110 12501 32715 -49222 -21884 61123
501 61123 -6522 -48058 19203 7767 -13099 27990 -21997 -44082 58281 24874 -69953 9263
513 9263 45558 -26864 2991 17479 -44769 16843 58412 -54104 -41137 60866 4764 -36040
525 -36040 9576 -10938 2737 42973 -33321 -45023 56568 20505 -50735 13002 13911 -24451
537 -24451 35083 8190 -62998 26825 63889 -46883 -35617 48118 6850 -16542 11506 -21438
549 -21438 -869 48402 -20199 -45815 34438 22739 -26209 5134 -2747 -16352 44067 5953
561 5953 -65918 26121 61231 -42512 -24864 36375 -9190 703 29160 -43875 -19130 69764
573 69764 -10002 -60276 30123 23015 -20171 12955 -16352 -25962 53755 8959 -70645 18224
585 18224 48323 -33763 -3747 14425 -34847 26943 41785 -62239 -18758 69727 -9706 -42462
597 -42462 21608 -2719 -5262 33795 -30622 -37047 51701 11843 -48253 8607 16199 -16204 17628
610 17628 -2687 -40148 29725 33909 -47259 -11471 38166 -8590 -10739 9005 -19762 3779
622 3779 34727 -26675 -30433 38017 8692 -30823 9149 5085 -12994 19305 -1086 -34856 17182
635 17182 29526 -30110 -13457 22812 -3973 199 7627 -21892 6462 33652 -20148 -24665 29971
648 29971 7899 -20091 11881 -2727 -14404 27785 1745 -37825 15862 29509 -23663 -10094
660 -10094 16694 -7447 4436 13109 -24224 -1331 31694 -11085 -19127 16145 3086 -3256 12226
673 12226 -13132 -12304 30177 2996 -29701 12181 16583 -14723 3802 6417 -15395 8929 16620
686 16620 -21378 -7779 22970 -4314 -12037 8614 -3011 -979 11995 -9523 -9486 17379 2261
699 2261 -14137 7913 3535 -9710 10631 362 -16969 10610 9805 -18436 -1484 13368 -9860
712 -9860 -5644 8888 -8945 -4505 12753 -6917 -8928 11435 541 -7654 4357 -100 -3648
725 -3648 7585 -2693 -10253 9227 2775 -12046 5480 4702 -9641 3471 5608 -10364 0
738 0 10670 -7930 -7262 8680 -1334 -6222 3665 -762 -2890 3339 292 -3056 1642 2109 -665
753 -665 1891 -960 -1520 4627 -1257 -4855 4300 1472 -5673 688 3054 -3765 -1371 5194 -1807 -3540
769 -3540 4740 2220 -2806 551 4308 1486 -2690 1936 4571 -1701 -2146 4331 2764 -4477 845
784 845 6690 -2612 -3089 5404 1772 -4392 -294 5282 -1219 -5004 3135 2682 -4366 -1437 5100 516
800 516 -4586 3335 4535 -4115 -419 4815 -151 -3525 1522 3198 -3683 -2649 3255 540 -3856
815 -3856 -1293 4188 -1348 -5348 4462 3004 -6567 -258 5848 -3547 -5175 5377 2033 -6453 1246
830 1246 4761 -2988 -2770 2691 2701 -2883 -3435 3650 1306 -5448 -1151 4679 -3647 -6700 5459 866
846 866 -8807 2205 5171 -4603 -3023 4615 1359 -2711 797 1538 518 -736 -2374 2548 1054
861 1054 -4847 2646 3019 -6543 288 7345 -3780 -4953 7748 517 -7201 4300 1904 -5309 3440
876 3440 1538 -6081 1518 4845 -3375 -1068 4316 -927 1566 3042 -4412 1863 6253 -4014 -2763
891 -2763 4231 -1109 -2462 3690 -3312 -4603 8451 101 -9820 5461 7146 -5997 299 5647
905 5647 -3409 865 7026 -5391 -3612 9250 -714 -5592 2681 361 1324 4185 -5692 -2819 10442
920 10442 -1166 -10395 6714 3526 -8791 5687 1971 -12347 6336 11147 -13788 -5581 15119
933 15119 -2050 -9051 5470 -621 -978 7032 -7371 -6311 10817 -367 -9588 4364 -616 -6594
947 -6594 10158 -2475 -17603 12975 12724 -20259 -3186 15930 -5820 -5639 7713 -8554 -2313
960 -2313 16460 -8523 -14666 14624 4967 -9781 3357 -2436 -3539 14628 -4191 -20508 13017
973 13017 13065 -18538 -1682 8832 -9903 6784 8691 -21497 560 25513 -10975 -16916 15623
986 15623 3280 -6816 8009 -8035 -6191 20832 -2395 -19990 10648 9690 -9977 5233 -252
999 -252 -12947 16739 9818 -27208 2702 25272 -11393 -11514 11013 -3082 146 12004 -13950
1012 -13950 -8445 23621 -1462 -17913 10995 4486 -7622 11354 -4127 -17829 18765 12909
1024 12909 -27110 -1328 21962 -8726 -6692 5594 -8729 6515 14166 -19049 -7729 23625
1036 23625 -3232 -14900 10667 -2374 -5688 19144 -8242 -23216 22161 15835 -24582 -3571
1048 -3571 15416 -3747 657 1067 -14222 9441 15182 -18566 -7461 14853 -3228 -3506 6156
1061 6156 -12567 -1814 22798 -9480 -22885 18041 13105 -16136 -1736 4812 -3947 7641 958
1074 958 -17622 5316 16968 -12068 -10211 9468 -961 633 4941 -14169 -3391 21342 -4352
1087 -4352 -20754 10760 11175 -10042 2417 767 -8562 13758 6377 -21820 2895 20309 -10015
1100 -10015 -8272 10121 -5863 413 13551 -15725 -10007 23038 -1343 -18446 8075 4730 -6428
1113 -6428 8540 -4314 -12689 17996 6596 -20854 5910 12361 -10318 3435 4872 -14091 7809
1126 7809 16191 -18010 -6725 20275 -3525 -10089 7882 -3427 -2643 11289 -6650 -10178 11978
1139 11978 3555 -9909 4291 2522 -4377 8437 -1275 -11456 10362 8526 -13901 -1134 11753
1152 11753 -4986 -3047 6949 -6881 -2338 12183 -5445 -11529 8148 4941 -7499 -529 1871
1165 1871 -2018 3755 -820 -7346 5634 4458 -8135 1460 4268 -5544 3192 5787 -10323 -1393
1179 -1393 14200 -5166 -11963 8858 4042 -8171 876 1326 -3966 3040 1974 -5415 462 3474
1193 3474 -1773 1333 -1196 -4375 6095 2307 -9446 1211 8560 -4155 -4662 5627 -468 -3841
1207 -3841 4455 -203 -4626 3334 1722 -4362 -525 1580 -776 454 415 -2524 1451 3022 -3072
1222 -3072 -308 3310 -751 -61 799 -940 1331 2468 -2498 -922 5032 -2226 -4588 4527 1075
1237 1075 -4965 2254 3358 -4331 -1268 5216 -736 -3600 2147 1909 -1531 -1596 357 2587 -536 -3349
1253 -3349 2146 3336 -3219 -1575 5329 -257 -4449 3718 2118 -4984 215 3630 -1775 -3579 1497
1268 1497 1485 -2010 -521 861 917 -380 -811 1442 525 -1179 773 1078 -531 -558 617 -74 -1051 862
1286 862 -405 -1292 1020 -429 -1508 813 647 -1493 -1177 1421 -376 -2273 724 1153 -1102 -1420
1302 -1420 1257 1457 -2008 -715 2859 169 -2508 842 2878 -1565 -2336 2655 273 -3446 -84
1317 -84 2313 -1795 -2816 2128 1488 -2680 128 2466 -360 -1258 702 1699 -996 -1410 940 777 -1341
1334 -1341 -1004 1873 344 -2357 1529 2143 -2117 -391 2119 -857 -2360 1128 856 -1528 149 199
1350 199 -650 982 232 -369 635 529 98 1198 164 -1083 2117 1473 -2450 1096 2048 -1671 529
1367 529 1051 -2127 207 1967 -2147 -1307 3123 -566 -1545 2433 -1012 -1035 3196 -1748 -2859 2933
1383 2933 1090 -3298 884 2141 -2115 2122 1264 -3478 2168 3495 -4234 -694 2848 -2410 -1114
1398 -1114 2482 -3073 -1128 5570 -2440 -4653 4761 1451 -3362 1933 718 -2230 3208 1455 -5125
1413 -5125 1933 4849 -3350 -1292 2108 -1948 1287 1902 -5026 -526 5975 -2570 -4680 4182 243
1428 243 -2904 3599 -1856 -4842 5672 2331 -7493 487 6385 -2784 -1593 2307 -1972 3066 3419
1443 3419 -6692 -249 6484 -3870 -3670 4202 -2414 -2192 6718 -3882 -7468 9421 3551 -9924
1457 -9924 1531 5447 -3059 842 603 -5124 5335 5557 -8976 -111 8801 -4273 -2319 4841
1471 4841 -5573 -986 9488 -5202 -8831 9020 3976 -7949 843 1490 -1894 5228 -2840 -8540
1485 -8540 7882 6218 -10271 -111 8126 -4202 757 5742 -8383 -1134 12268 -4244 -10061
1498 -10061 6000 4542 -3366 -71 -2744 -449 8862 -3931 -10214 8013 4974 -8591 1714
1511 1714 2841 -6736 5253 6498 -11533 -1730 13262 -3408 -8321 4929 1501 -1158 2779 -5277
1525 -5277 -2460 9244 -1472 -8901 5262 3374 -5325 3375 -274 -7250 7567 4629 -12396 -201
1539 -201 11627 -3901 -5319 4962 -1921 -185 7212 -6007 -5975 10224 1660 -8898 2150 3818
1553 3818 -2815 2318 -1837 -6402 7532 3810 -11728 271 8332 -4035 -902 2661 -6601 2131
1567 2131 11008 -7932 -8681 11602 2637 -7886 1935 571 -1913 6010 -2364 -8064 6341 5745
1581 5745 -7546 -336 2817 -3094 4109 947 -9025 3558 9485 -7728 -5499 7389 241 -2408
1595 -2408 3684 -3808 -2557 9127 -1013 -8794 4530 5123 -4859 -620 1672 -2854 2930 2073 -7541
1610 -7541 742 6969 -4191 -3397 3424 -1336 406 4265 -5856 -3133 9979 -1080 -9094 5716
1624 5716 3420 -5791 2632 1942 -5856 3757 4851 -7853 -940 7117 -2749 -2382 1984 -2985 2349
1639 2349 3852 -7015 -1016 7315 -3352 -4275 5397 -1357 -3112 6674 -1885 -6470 6886 3137
1653 3137 -7244 548 4152 -2186 -245 269 -3036 2730 2199 -4110 476 2931 -2392 563 1848
1668 1848 -3507 681 4348 -3655 -3397 5143 1032 -3731 1602 1487 -1447 1158 610 -2617 1149 2955
1684 2955 -2254 -1908 1928 -250 -927 634 -1491 -569 1427 -1057 -1678 1329 486 -1104 998 -49
1700 -49 -1071 2786 637 -3706 1715 3033 -3100 -1676 3068 -634 -1854 2228 -48 -2190 1621
1715 1621 1162 -1223 -612 448 620 134 -1335 -101 2174 -381 -2172 2268 1959 -2366 456 1847
1731 1847 -1504 -879 2044 -76 -1701 1282 818 -1548 -417 -190 -127 -241 -970 -97 829 -440 -1178
1748 -1178 967 1084 -1540 694 1293 -1280 157 1110 -353 -575 813 -137 -301 1179 44 -429 997
1765 997 -447 -796 979 -368 -1212 558 560 -1334 -160 1242 -650 -160 1206 -148 -238 475 274 138
1783 138 -81 83 211 -98 -656 -123 875 -686 -654 942 -485 -1156 691 589 -727 -532 1196 -93
1801 -93 -1023 448 424 -271 -457 135 760 -761 -307 1143 416 -1096 347 1549 -907 -1014 1302 -138
1819 -138 -1593 273 567 -1040 -775 902 158 -892 96 206 121 -194 -270 971 481 -986 320 993
1837 993 -461 -603 1341 176 -1253 826 417 -1331 543 846 -333 -62 251 -327 342 649 -1309
1854 -1309 130 1869 -1103 -377 1460 31 -343 771 25 -667 802 404 -641 419 279 -620 619
1871 619 -1017 -1249 1601 92 -2354 330 1713 -1480 -738 1819 -866 -423 2124 -759 -1753 1483
1887 1483 890 -1245 -16 260 183 826 -946 -1426 2821 274 -2938 1402 1249 -2705 740 1737 -3186
1904 -3186 -420 3815 -2360 -2621 3054 362 -1812 794 -347 -370 1862 -966 -2157 2161 489 -2225
1920 -2225 1455 -112 -2270 2444 532 -4495 1472 3864 -3170 -1805 3015 -904 -1029 1761 -1958
1935 -1958 -965 3646 -708 -2760 2009 1669 -1147 308 -230 -1067 2778 420 -3937 1713 2742 -2426
1951 -2426 -494 1540 -1975 916 2857 -3804 -1898 5537 -655 -4440 2634 1572 -1509 1622 -540
1966 -540 -2168 3443 1271 -4194 888 2582 -1472 1200 11 -3484 3408 3483 -5704 -1032 5736 -1269
1982 -1269 -3137 2842 -765 -897 3872 -2175 -3684 4379 1761 -3884 437 1653 -984 1738 -157
1997 -157 -3809 3134 3858 -4263 -1597 3349 -377 -718 894 -2815 88 4760 -2851 -4563 4252 1453
2013 1453 -3638 885 753 -1749 2535 1136 -4821 939 4930 -2608 -2263 1717 -279 1157 556 -4462
2029 -4462 858 5097 -3049 -3480 3890 -321 -2575 3005 -1622 -3494 5073 809 -6608 1086 4375
2044 4375 -2360 -1197 1219 -1283 1942 1496 -4343 729 4182 -2363 -2098 2176 -1192 -609 2944 -3302
2060 -3302 -3177 5383 672 -5963 1527 3268 -2367 310 859 -2449 2221 3210 -3787 -1136 4835 -881
2076 -881 -2007 1319 -1504 474 3084 -3317 -2651 4902 691 -4083 1718 669 -1780 3379 -688
2091 -688 -4885 3995 3765 -4822 -748 3534 -1119 189 1410 -3066 1101 3971 -2999 -1450 3251
2106 3251 -515 -850 1470 -2336 -734 4137 -1594 -4106 3186 1729 -3019 752 1301 -1249 1504
2121 1504 956 -2686 485 2842 -1120 -1294 1522 -429 -336 778 -1388 -587 2312 -459 -2699 1161
2137 1161 1598 -1643 -170 692 -1574 1011 942 -2518 -4 2311 -1230 -1590 1660 -673 -667 1918 -1256
2154 -1256 -1940 2736 191 -2895 890 1440 -1756 -188 364 -1326 1005 675 -2192 492 1410 -1358
2170 -1358 524 596 -1785 722 2266 -2246 -1245 2710 -68 -1889 962 618 -761 765 11 -655
2186 -655 794 387 -952 125 291 -672 832 38 -1499 650 1423 -1248 -826 1565 543 -704 846
2203 846 548 -308 1181 72 -1276 711 752 -861 73 982 -674 60 984 -923 -179 1387 -484
2220 -484 -414 503 242 -384 433 -338 -557 1087 -36 -878 1215 381 -1125 912 469 -728 401 403 -699
2239 -699 197 702 -795 -250 362 -448 -243 193 -555 -99 153 -318 -15 290 -51 -264 270 -305 -260 476
2259 476 -734 -194 788 -606 -898 563 534 -788 -16 826 -379 -1020 571 449 -1043 -472 611 -147
2277 -147 -780 -74 608 -267 -833 468 1047 -803 -827 1186 17 -1312 202 927 -643 -851 1205 164
2295 164 -1571 101 603 -280 -863 507 772 -891 -162 970 429 -803 0 839 -266 -726 809
2312 809 288 -591 218 886 -257 -572 966 329 -625 278 309 -193 -161 167 -85 -177 194 8 123 24 75
2333 75 486 52 -497 993 652 -442 143 568 -296 -183 541 -446 -63 955 -456 -855 641 89 -665
2352 -665 241 374 -731 -52 248 -597 -43 429 -381 22 301 -395 510 202 -957 569 1100 -801 -567
2371 -567 979 -314 -913 839 -260 -843 986 316 -1315 -216 630 -908 -337 437 -187 593 180
2388 180 -731 484 735 -565 89 340 -794 -199 1183 -1210 -746 2109 -299 -1857 1149 704 -1569
2405 -1569 367 577 -951 149 1012 -1103 -845 919 221 228 -404 -756 1216 1184 -2124 -663 2605 -790
2423 -790 -1596 1607 -195 -1596 2015 408 -2494 883 1852 -1437 -1111 1150 388 366 -174 -1166 1718
2440 1718 1500 -2104 72 1978 -1021 -460 1903 -924 -1214 2562 27 -2616 1262 1772 -1098 -628
2456 -628 364 -122 926 -268 -1593 900 1795 -1608 -440 1525 -618 -270 1276 -1240 -976 2355
2472 2355 181 -2141 1078 1072 -823 392 -490 -1255 1999 246 -2954 293 2216 -1473 -988 1307
2488 1307 -970 -241 1842 -1444 -1490 2574 -178 -1785 520 85 -571 1526 -1197 -1713 2880 862
2504 862 -3393 302 1847 -1485 -78 767 -1816 211 2390 -2089 -1553 2367 -111 -1288 783 -755
2520 -755 -71 1859 -1381 -1866 2158 1043 -2204 494 1182 -1240 1153 398 -2442 1098 2040 -2377
2536 -2377 -1010 1929 -588 -228 1274 -1673 -149 3168 -1169 -2062 1954 1020 -1262 749 45 -996
2552 -996 1763 2 -2386 1438 1731 -1929 -8 809 -1345 909 1443 -2217 -371 2646 -690 -1799
2568 -1799 1237 382 -874 762 -368 -285 1917 456 -1787 751 1412 -935 188 308 -1382 874
2584 874 1127 -2132 -560 2369 -302 -1621 1064 347 -331 1064 -728 -1191 1714 393 -1739 722
2600 722 597 -645 406 348 -1812 1009 1562 -1945 -563 1458 -614 -774 463 -509 -71 1170 -1230
2617 -1230 -1200 1613 -246 -1039 721 -40 -624 1253 -201 -1522 801 1395 -1094 -694 854 -18 180
2634 180 -93 -1080 395 774 -842 -441 808 -343 -477 708 -563 -431 786 -175 -1335 262 1210
2651 1210 -469 -494 721 93 84 832 -531 -360 1062 -48 -854 529 594 -659 151 46 -454 559
2669 559 298 -771 785 742 -403 610 372 -698 670 1003 -1512 -230 1799 -364 -1006 1066 330
2686 330 -796 371 -15 -259 78 156 -229 184 -404 22 745 -550 -905 1330 99 -1357 565 1096
2704 1096 -842 -279 888 -241 -536 805 68 -457 -168 95 153 -47 -190 100 429 -620 -612 563 -66
2723 -66 -889 161 80 -674 -319 223 -121 -576 377 -183 -521 621 114 -495 -135 -119 -249 29 99 -255 -145
2744 -145 -40 -380 -120 494 57 9 -85 68 487 175 -177 301 87 -501 -107 531 -508 -161 866 55
2764 55 -721 335 469 -384 -384 279 -56 -330 151 194 -63 -447 213 173 -100 -51 675 192 -464 168 737 -203
2786 -203 -133 749 187 -659 175 499 -338 -322 602 407 -363 331 410 -181 -101 357 315 -317 -297 507 330 -537
2808 -537 -142 998 -115 -546 617 351 -461 193 437 -201 -581 661 117 -402 346 120 -43 -325 42
2827 42 576 -204 -416 114 168 -329 -216 896 -197 -440 428 -93 -689 321 316 -288 -159 311 -222 -329
2847 -329 57 -194 203 259 -456 -35 299 -314 -6 374 -173 -286 276 -17 -656 418 69 -504 175 31
2867 31 -439 252 40 -658 45 527 -909 -106 707 -323 -455 522 -546 -162 686 -129 -352 188 439
2886 439 -114 145 -275 0 684 -474 -761 880 65 -1090 99 585 -921 -24 805 -300 -226 716
2904 716 26 -585 -100 41 170 -151 -504 561 1026 -608 -780 1039 326 -953 764 139 -876 464
2922 464 834 -865 -354 1189 -141 -720 293 -243 160 545 -981 -348 1242 -417 -873 831 56
2939 56 -830 795 -71 -1235 715 1045 -993 -135 790 -288 -51 127 -597 176 1014 -1088 -551 1027
2957 1027 -595 -753 493 -132 -379 588 -598 -999 554 877 -713 -135 326 -311 318 8 -1193 562
2975 562 903 -864 -522 694 -7 -562 365 -735 -93 1272 -181 -1102 782 382 -1011 -37 225 -526
2993 -526 725 239 -1332 363 1301 -610 -415 445 -238 118 714 -851 -547 1459 -618 -1032 791
3010 791 451 -644 556 111 -843 1175 815 -1668 38 1466 -546 -195 457 -437 407 784 -754
3027 -754 -93 1495 -41 -722 765 -90 -515 1102 -751 -1073 1295 396 -1433 168 771 -703 156
3044 156 576 -876 562 882 -865 -201 901 -338 -303 504 -678 -44 1040 -813 -799 1596 19
3061 19 -1203 383 28 -593 493 191 -1189 43 1016 -1068 -213 545 -153 209 -68 -795 213 640
3079 640 -616 -564 806 -291 -548 557 -439 -731 1052 -102 -1132 376 697 -736 -597 227 -104
3096 -104 157 609 -501 13 750 -357 -309 234 139 -124 124 -340 -385 700 438 -990 80 730 -442
3115 -442 -402 140 -83 42 659 -444 -361 736 -287 -445 408 -269 -320 821 -189 -378 701 433 -1020
3134 -1020 137 547 -444 -64 -188 -436 414 19 -750 557 250 -301 144 589 -496 83 1416 -168
3152 -168 -474 1027 507 -842 -7 603 -190 52 3 234 254 -384 -84 587 -448 -665 588 189 -889
3171 -889 -7 988 -730 -812 922 432 -825 10 773 -185 -204 272 -11 -357 -36 583 10 -369 46 416
3191 416 -153 -656 248 536 -527 -403 740 -75 -380 168 168 -914 259 425 -302 -77 -41 -31 5 -100
3211 -100 79 325 -82 -324 508 315 -667 190 161 -145 -20 409 -68 -460 6 204 -309 181 125 112 -20
3232 -20 -265 -228 -58 178 -188 36 265 -227 -214 139 62 -335 -210 106 -52 -235 311 -100 -98 254 86 87 164
3255 164 10 239 124 -172 199 373 -265 -190 528 160 -487 100 313 -195 -90 265 6 -213 229 356
3275 356 -41 -152 127 583 -64 -604 704 -66 -367 107 431 -154 -461 611 -86 -269 167 195 46 -112
3295 -112 83 281 -142 -196 80 141 -169 -181 469 -193 -358 223 235 -328 33 128 -103 -319 245 155 -172 204
3317 204 48 -174 -131 -411 10 -39 -255 -328 69 -129 -109 106 142 -486 119 50 -242 213 168 144 -105 73 239
3340 239 24 -243 -315 38 299 -160 -258 320 -283 76 253 161 -93 236 233 -469 -134 228 -409 -53 -199 -204
3362 -204 12 322 -247 94 277 87 -229 -14 -79 -346 647 -357 -151 153 118 -495 81 210 157 228 231 -449
3384 -449 176 339 -352 -109 206 -146 42 72 -250 -9 782 -524 -332 456 200 -430 185 49 -67 -38
3404 -38 265 -384 85 663 -553 -215 285 -135 204 101 -419 104 258 -157 -119 727 56 -495 488 -387
3424 -387 -500 554 -119 -656 -114 415 -291 -167 -17 -325 503 124 -734 79 554 -636 -345 409 277
3443 277 -97 122 -93 -250 629 16 -416 381 1 -434 18 -259 -474 215 328 -669 -84 581 -340 -313
3463 -313 50 -341 -129 449 -112 -282 423 103 -594 241 -31 -126 652 -153 -616 777 327 -928 15 583
3483 583 -175 -254 290 -517 -6 657 -487 28 714 87 -241 190 -257 -27 560 -147 -472 624 201 -330
3503 -330 338 122 -93 268 65 -531 123 874 -438 -398 622 57 -263 4 -179 -141 599 22 -181 171
3523 171 139 -415 220 185 -202 524 -89 -765 176 453 -346 -404 525 -417 -264 616 -374 -583 702 26 -573
3544 -573 -14 368 123 182 -352 -174 748 65 -591 393 509 -577 96 246 -548 -88 776 -617 -950 899
3564 899 129 -556 164 -26 90 9 -323 -127 622 -53 -509 217 451 -189 283 185 -299 325 308 -312 -394
3585 -394 200 154 -261 -164 15 33 337 -257 -584 581 264 -349 13 458 23 454 450 -592 8 557 -200
3606 -200 -378 185 -141 86 150 -214 92 611 -163 -379 616 113 -183 216 -20 -209 191 399 -374 139
3626 139 197 -262 -350 445 56 167 18 -362 227 242 -419 -330 521 -38 -59 305 -270 -602 239 181 -532 25
3648 25 364 -380 -87 467 -41 9 42 -289 -25 354 -290 -25 222 58 -228 187 -105 -528 391 -267 -574
3669 -574 319 -93 -213 8 102 -267 -10 162 -26 -70 435 175 20 -164 -191 545 -259 -440 427 94 -335
3690 -335 -152 332 2 -143 213 6 -88 118 -91 -74 -242 -44 427 -177 -207 279 251 -301 -392 144 -17 -89
3712 -89 -49 277 -221 -152 -9 440 -399 93 289 57 -191 152 64 -12 244 -57 -17 -122 48 -216 410 -28
3734 -28 -47 267 -91 -121 127 213 -259 6 216 -116 -84 9 -92 -87 -138 -109 219 233 114 -104 -7 -106 7 352
3758 352 -149 -117 375 30 23 -169 56 -230 -25 29 -4 -174 -69 -173 98 -134 -104 22 -100 -80 -260 196
3780 196 186 -298 296 -33 -47 100 140 -141 -87 217 95 -58 -45 45 191 25 -328 150 -159 -111 -49 -144 -277
3803 -277 62 85 -236 -180 74 -363 -6 262 145 -160 86 -84 -382 134 109 -146 50 167 -16 340 -174
3824 -174 -44 2 90 -71 52 373 168 19 174 155 -88 187 -198 -403 59 195 -57 38 -118 -76 -24 -29 40
3847 40 230 418 -345 -158 432 17 -368 -64 6 -291 69 48 181 269 0 85 158 -69 193 231 -85 -220
3869 -220 170 552 -279 72 304 -13 -181 249 176 3 53 -49 22 -183 -131 32 124 -249 -23 544 -163 -341
3891 -341 402 3 -316 36 162 -231 100 551 -241 -339 68 -21 -112 -207 104 215 -266 -228 -26 203 149 -132
3913 -132 292 -40 -200 30 153 -272 -110 335 -236 -263 403 -251 -52 218 9 -104 336 -356 -381 223 -186
3934 -186 -161 -71 277 4 240 -130 1 174 -40 -282 303 70 -321 4 292 -144 197 342 13 -214 231
3955 231 256 -113 -91 -129 135 476 199 -273 173 351 -122 150 149 -399 298 102 -240 35 360 -101 -438 194
3977 194 129 -47 -18 -104 -143 175 203 -313 -103 218 -30 180 88 -334 165 220 -506 90 291 -13 -66 329 -204
4000 -204 119 211 -296 -114 300 -36 -329 139 69 -137 -17 -316 47 185 155 -547 -188 144 -100 12 -128
4021 -128 -308 159 305 -232 -358 368 -50 -130 143 -170 -71 383 250 -339 261 114 -226 -36 62 125 15
4042 15 -133 -153 411 -25 -210 -159 136 161 -45 161 -81 21 397 178 -301 269 238 -409 20 461 0 72
4064 72 64 -321 -3 83 -405 10 333 -68 135 -9 -211 -159 93 -36 -121 317 124 -447 360 -150 -125 341
4086 341 449 -144 -94 112 89 25 131 -195 308 133 -445 187 149 -287 -303 34 -167 -78 134 -185 -385 290
4108 290 379 -263 89 427 -27 -285 -36 -13 -90 -25 -426 -211 83 -208 -20 -7 -396 -92 281 109 -281 -9
4130 -9 145 -445 -185 -4 -230 13 -153 167 22 -51 -159 368 24 -289 135 74 -127 -26 366 -36 -328
4151 -328 -76 -34 146 -415 266 -114 -143 -424 26 369 58 -169 460 82 -165 42 188 -81 -367 244 108
4172 108 -227 -204 361 124 103 217 55 338 118 112 201 -53 -278 -1 15 -175 226 251 289 -168 252 15 -82
4195 -82 196 315 -214 -31 94 -129 -110 -192 92 -72 -16 -113 -57 101 -100 140 96 -90 49 64 -74 307 -128
4218 -128 -33 -101 -233 302 -50 -96 -216 15 -129 -47 63 -183 45 -358 -19 421 125 -119 191 -3 -359
4239 -359 8 -97 -394 -111 158 -39 10 -92 -132 62 83 -192 164 -44 -24 63 -71 22 102 151 -176 -326 93
4262 93 57 -172 -62 66 -3 -35 376 126 -127 -52 -64 234 -110 -182 155 -22 10 258 252 -424 -86 272 -133
4285 -133 -23 -20 76 -282 106 32 79 -41 -107 238 -211 -397 40 -146 -101 114 18 -65 -97 -59 51 23 1 137
4309 137 -250 -193 165 398 203 208 13 253 145 -168 133 124 249 -39 124 -136 -181 -137 362 -88 11 199 -127
4332 -127 -37 -8 107 -17 9 -471 24 324 42 58 364 -13 -125 105 322 -281 -145 -62 -72 -151 147 -154
4354 -154 -98 -468 113 177 -78 19 158 318 30 -86 -153 185 -379 72 230 74 89 15 -33 120 -27 -98 -28
4377 -28 -16 -34 33 -33 -336 -44 2 -307 -398 253 -335 -187 207 -72 -330 112 -1 -138 205 -123 -390 200
4399 200 -274 -175 1 -74 -171 -202 160 -68 46 -72 -204 22 95 -143 -46 309 -59 -61 46 -53 -203 -72 18
4422 18 195 -9 281 173 94 70 100 -124 -5 66 78 59 -205 5 240 146 -174 -38 82 -48 133 -195 -133
4445 -133 322 111 -102 57 269 36 -204 -53 -153 -80 95 -143 -64 457 64 315 176 -99 160 51 35
4466 35 133 63 101 -53 -53 -74 -9 -25 123 -260 -16 207 -68 28 -190 -107 97 -86 -254 55 132 -429 67 94
4490 94 63 -395 -72 62 22 57 -70 -177 25 -8 -75 -239 -83 -39 -84 -65 -152 -36 452 -256 -66 17 114 -178
4514 -178 232 64 43 437 69 -28 37 30 -91 -197 -10 80 454 -29 -405 129 566 -57 -102 188 -116 -106 71
4537 71 -158 -50 -100 89 112 203 220 -108 34 -86 -80 393 63 -186 109 250 -11 -195 -6 -281 -129 266
4559 266 -22 -295 -4 125 -140 -257 -230 26 64 -309 98 83 -6 -128 164 286 -269 -113 3 -10 -52 256
4581 256 145 -441 -121 290 18 20 132 -275 -72 -122 71 304 29 -301 -35 -221 -256 68 255 -198 -130 110
4603 110 -181 -184 -251 -11 111 -186 -390 -90 148 -216 70 199 -106 34 -41 -246 11 186 198 88 -187 80
4625 80 -130 -218 -96 -59 186 -146 -105 9 114 -202 -120 227 117 -75 119 113 -260 14 214 47 17 -80 -122
4648 -122 -205 70 111 -235 -2 -159 8 -109 163 34 -21 -255 246 42 30 38 212 282 -199 268 20 221
4670 221 26 151 62 139 260 224 -108 -179 -12 -45 67 -189 -98 340 54 -356 233 157 -227 -58 -185 -309
4692 -309 66 104 189 -81 44 24 -58 -13 -73 75 175 -242 53 352 -45 -32 33 -85 -252 -42 272 -8 198
4715 198 216 -158 204 135 -164 171 -4 16 -2 122 -143 -87 -182 -113 38 53 -19 -192 -97 -105 48 -119 -255 -53
4739 -53 -150 -180 170 108 -113 -189 75 -1 78 0 -9 -252 -22 51 -88 -22 30 122 -29 -117 95 244 5 -163 325
4764 325 19 -200 235 56 -31 38 15 12 90 72 33 259 -44 -24 190 57 -94 -83 191 -24 -71 122 -84 188
4788 188 153 -18 9 23 121 -55 -16 113 130 76 36 53 -22 -136 13 304 -4 -176 -149 -193 62 -227 -509 -30
4812 -30 117 -293 240 -149 190 151 30 -93 47 90 -130 -41 -141 -10 110 5 91 -367 -33 -142 1 267
4834 267 -8 -124 183 170 12 -119 59 -76 100 -197 -92 -252 179 65 -8 163 -47 143 -95 -105 8
4855 8 81 -143 -33 133 178 -182 10 293 109 -120 150 -403 -292 19 -50 32 78 210 175 255 158 77 -84 62
4879 62 -40 33 147 -58 -123 126 -83 -135 -127 32 -276 -7 138 -78 -30 -42 107 107 -28 24 59 154 118 57 88
4904 88 19 -88 15 -142 57 118 -182 49 -81 62 102 -371 -508 30 216 -468 106 -88 -158 -281 125 26
4926 26 -173 77 -34 128 -227 -107 -16 53 151 -43 150 -95 -125 -264 128 -5 -216 40 73 -78 -15 -107 -299
4949 -299 137 60 120 -16 -79 -92 186 -52 109 242 -163 -90 205 153 -134 -198 -24 -92 -235 52 -201 184 -1
4972 -1 -90 269 -289 -135 -62 0 194 -155 202 145 -198 2 -72 144 371 35 -38 -24 -61 -26 26 33 26 -270 29
4997 29 236 97 316 252 36 483 -11 245 -247 267 -87 191 155 23 -56 246 -218 -163 143 -150 -274 27
5019 27 -169 187 186 6 42 -26 230 -165 -106 -111 42 271 -72 -57 182 151 44 -91 -2 42 -8 200 -146 154
5043 154 -144 16 -195 -5 12 -332 71 307 -89 53 190 20 -12 -113 -91 158 135 -464 -59 144 -24
5064 -24 -38 238 -4 -79 -118 51 75 -143 4 -266 35 10 -203 113 -138 129 214 -71 -281 263 209 -96 -57
5087 -57 -100 444 -271 -386 20 -189 119 228 -186 9 16 50 -410 -45 -184 0 63 -63 -11 156 -157 54
5109 54 -122 151 -67 66 -90 -41 97 -69 -315 92 -196 -345 -122 55 167 -243 27 -63 81 191 58
5130 58 -201 129 305 271 160 -58 -7 215 205 -243 302 355 -53 -152 9 70 72 -32 -190 -91 126 241 -43
5153 -43 -22 -354 175 98 -6 130 128 -91 58 -6 9 -226 -8 125 -350 198 -334 -36 25 162 -87 -265 68
5176 68 87 51 -72 -10 -321 -164 -29 -61 -93 -188 -80 201 75 -81 -202 -202 -139 206 -86 -246 -147 13 68 -234
5200 -234 179 -64 139 -34 -49 -30 14 62 -198 24 79 -89 -119 -66 -32 -41 -41 189 -258 60 -53 162 -28 -165
5224 -165 250 -273 187 -115 247 67 -435 105 154 81 55 99 3 29 64 -55 164 216 131 89 198 136 -41 -53
5248 -53 165 49 212 83 -58 138 187 -133 -158 -13 162 -93 -177 13 -81 -93 57 38 230 -14 -137 3
5270 3 2 43 117 -31 -63 190 -345 -188 86 86 -78 -64 47 -300 -188 147 -186 -79 -28 35 31 99 -5 -294 170
5295 170 -180 70 123 -58 50 -38 48 69 -77 62 12 227 -25 106 136 113 84 -51 8 36 68 -159 0 98
5319 98 16 69 54 237 -14 50 11 -61 -83 -46 -8 154 -115 -50 -106 114 228 8 -154 129 51 294 25 -2 -86
5344 -86 235 -253 208 -141 -58 34 216 -116 52 -53 -68 195 31 156 24 11 -106 -142 184 30 -218 169
5366 169 11 36 -211 -115 -120 -95 -288 -228 -42 69 -176 -73 -267 65 68 95 94 226 -184 209 -9 -53 -222 -231 -7
5391 -7 -23 -201 203 117 -171 -107 -111 -5 -73 -100 -142 -41 152 -2 4 144 -83 71 30 185 -274 -78 -150 -41 143
5416 143 90 -31 -103 -112 38 -14 -71 89 -58 193 285 79 28 -149 207 -73 -145 147 -2 98 -57 111 178
5439 178 128 142 -64 45 82 -44 -32 296 136 -344 -108 -123 319 -57 303 56 -153 -76 -120 -176 -33 138 60
5462 60 17 212 22 155 116 -83 -100 97 -48 -247 -154 -63 50 112 -117 179 -18 -47 -77 136 186 -169 266
5485 266 13 154 -99 -115 63 115 -153 -31 75 212 -176 70 -123 117 -53 188 104 -174 0 205 146
5506 146 -57 30 -193 -215 -53 65 -116 29 -304 -199 99 -257 65 85 314 321 14 48 -91 -118 -109 10 -244
5529 -244 -179 -320 85 208 -433 5 -92 124 103 175 149 -148 24 -166 68 -193 -91 -16 64 99 161 266 187
5552 187 -165 255 -56 -487 -239 101 18 -93 257 -39 89 148 -102 261 10 -75 -240 -19 93 -32 19
5573 19 135 227 -226 224 -192 58 197 -195 178 -167 136 22 -13 182 99 -126 -37 160 264 172 174 57 12
5596 12 177 -60 -77 160 178 -32 106 201 242 -13 68 36 -91 49 -215 181 93 76 -182 -40 86 115 -129
5619 -129 137 -236 -53 89 -180 -149 -359 15 -223 -102 -176 -146 114 156 9 152 27 -119 -227 153 -150
5640 -150 -274 292 -216 -98 25 -211 42 59 219 -8 -29 -158 -97 -85 -4 -125 139 -7 -57 -211 -192 -35
5662 -35 103 -38 -138 -146 7 -102 -109 65 -182 33 173 -164 37 -11 -310 102 86 288 123 100 89 -90 10
5685 10 56 -211 226 66 189 -146 54 -91 -53 184 -85 -74 103 6 86 -127 -198 -55 28 -5 306 -203 90
5708 90 -157 23 -290 -131 14 -204 202 3 -342 169 -183 124 -188 6 -15 -88 -224 192 237 -188 183
5729 183 -89 -34 -283 48 -123 -109 167 45 -132 26 -35 -56 -110 54 86 -37 232 -160 301 162 13 -58
5751 -58 81 -195 -173 87 -36 66 74 -103 176 80 -144 -22 86 58 -68 -118 134 -71 139 124 -57 -186 176
5774 176 -109 5 -22 -117 83 -87 -219 -178 442 -114 -276 14 -27 41 142 22 -118 -187 57 -418 -213 164
5796 164 -165 -157 -168 -11 -360 54 168 -58 81 214 -76 94 -102 -228 -47 -194 120 76 -34 -209 42
5817 42 -11 214 63 34 -48 171 331 215 -151 -23 -77 -36 66 -123 171 78 -65 46 14 53 -150 22 -222
5840 -222 -16 96 195 245 289 -214 149 -42 48 -149 -268 97 -183 -29 88 -42 -227 109 -71 37 135 67
5862 67 -1 -73 -255 84 -220 26 95 125 -240 -209 -18 17 55 -24 143 -26 -86 4 -148 -145 -176 -118 82 90 9 -157
5888 -157 -40 112 -201 71 -154 2 46 119 82 -448 175 91 -91 -47 -15 -39 86 -312 102 62 -5 95 89 118
5912 118 145 106 -31 108 116 -21 -58 -76 -110 -12 -49 276 177 288 -66 -99 -96 7 136 -6 -155 -33 111 13 -153
5937 -153 -43 137 -243 59 51 -146 146 51 42 207 78 302 148 -133 181 -94 161 -15 -99 147 58 75 -27
5960 -27 47 -204 91 154 154 -106 -17 -4 6 255 -161 -1 -107 -143 -166 282 144 -214 -212 -60 -148 -17 14 8 111
5985 111 -63 -13 250 1 -149 78 -66 -132 148 150 -389 118 76 64 -159 100 22 -123 -31 -30 156 -164 -14
6008 -14 -63 -32 14 189 -138 43 157 -130 17 -9 35 -171 160 -252 23 280 -126 -141 -37 -41 -28 -45 -107 -75
6032 -75 12 118 195 73 63 29 -19 94 -142 254 -28 -102 2 -27 121 162 -426 50 -99 34 -144 -109 23
6055 23 43 -16 221 -185 42 -132 328 124 50 31 164 -57 -11 190 -168 19 -57 -165 117 31 53 19 70 35
6079 35 2 79 -61 126 15 29 63 -19 -37 157 -156 94 58 -209 101 -114 -136 -222 -451 36 -204 66 154 -40
6103 -40 51 36 -212 216 130 82 67 221 29 -245 -44 -109 -231 -353 158 247 41 11 -52 -54 -178 -71 131 85
6127 85 -181 79 -106 40 5 -85 -106 -47 63 -89 59 300 84 -128 219 -230 89 -148 11 31 293 -40
6149 -40 54 128 96 -108 178 235 -91 -72 110 89 8 65 -108 -33 81 -171 -269 119 -196 9 9 -51 -87 102 29
6174 29 62 -156 168 -21 172 55 166 -74 -156 -5 115 40 -22 342 373 95 -30 222 124 -92 75 190
6196 190 35 -151 -189 342 -84 -9 -30 117 -251 225 -220 2 -280 201 -83 -152 68 -21 -297 39 2 163
6218 163 17 -238 42 105 -377 -101 -41 -1 159 143 80 101 -280 -105 158 -49 -110 -10 58 81 156 -71 -7 -99
6242 -99 130 -134 -49 111 -50 -371 -75 65 -189 12 32 -430 84 -122 133 -88 101 142 29 -106 97
6263 97 -75 -246 -110 13 113 11 137 12 70 99 203 -41 78 137 28 -151 317 51 103 199 124 175 -64
6286 -64 285 36 -28 69 -211 135 -26 65 125 16 -126 -159 159 45 98 -95 -3 -38 -185 -134 75 27 259 -262
6310 -262 142 103 3 -59 -143 31 -43 -35 99 134 -222 -112 38 12 -187 -249 99 37 -268 51 171 95 -239 327
6334 327 -5 162 -147 -82 35 26 -141 -87 -54 -115 -221 207 -7 -101 198 -58 35 150 -103 324 -271 37 -160
6357 -160 95 81 73 101 -288 51 295 -214 -295 305 269 173 39 -48 -93 -31 190 89 -190 -217 130 55 180 -208
6381 -208 -123 -26 -145 -19 57 10 55 13 -106 -183 11 37 -45 -472 -135 -14 -105 111 12 74 -149 -134 -25 -61 -210
6406 -210 5 -22 246 -101 460 -53 54 -76 158 -151 -254 130 47 -68 140 37 207 40 -44 -36 -61 -3
6428 -3 -178 87 109 -127 188 -38 -91 -42 6 5 -98 -168 61 170 315 131 -67 190 3 214 -149 -107 -281
6451 -281 -59 -152 -110 259 -37 -62 239 -104 121 105 -30 -185 338 47 158 93 60 97 257 100 99 56 -42 5
6475 5 -35 -125 -179 -181 93 57 287 -56 27 33 -132 107 -162 -58 -173 44 30 72 122 -111 418 66 1 78 -118
6500 -118 -63 -148 -180 -178 97 111 -3 -84 205 287 -34 189 5 70 54 106 -90 215 -11 -14 153 48 130 -157 347
6525 347 -16 -12 198 106 60 323 -119 96 -50 -66 91 21 147 96 -43 -137 1 -85 -33 -30 34 -144 -47 68 80
6550 80 -181 -118 74 -200 -167 -134 129 23 -3 -61 -115 12 119 244 259 121 6 139 67 33 -86 -39 -197 -56
6574 -56 63 -105 -204 28 129 113 -22 -242 171 -231 -103 53 -204 33 -39 94 165 -59 44 -30 258 168
6596 168 -143 -44 178 -254 83 123 4 163 225 -86 6 382 177 101 -56 -164 -197 364 -245 49 -65 -198
6618 -198 -23 66 -55 196 -38 70 89 53 328 163 98 5 301 -117 -209 3 36 -6 36 -206 40 -27 317
6641 317 -335 129 -67 44 -50 -82 134 10 -39 -263 -87 -142 -49 -49 40 -180 245 -138 -153 -62 -46 44 -133 -1
6665 -1 -13 -19 59 126 -237 30 -10 -36 -188 86 28 154 -199 -167 392 -142 -213 125 -83 -89 -72 31 11 -50 235 -148
6691 -148 9 66 -24 -58 -89 219 -203 -102 -116 -211 15 143 -32 -78 85 102 -240 -5 -118 33 -93 -44 237
6714 237 170 -13 -295 -43 -75 24 122 -111 -40 108 -161 64 -31 40 -136 -29 -156 -123 28 -127 -24 275 145
6737 145 97 62 268 11 -81 -21 -155 19 -91 -137 31 -68 65 135 95 104 67 166 163 171 -138 72 69 4 -89 169 -133
6764 -133 156 -95 102 -373 31 -106 148 -113 -31 -42 -65 -3 -27 47 326 -160 84 177 147 -138 20 -39 -120
6787 -120 76 -30 -25 -190 232 39 -5 -91 25 155 -73 -23 -20 -50 -191 -17 -37 -242 -27 -131 274 -94 252
6810 252 73 -215 -48 134 30 53 128 -72 -5 229 -119 150 147 -253 123 -129 -303 -17 31 -112 -116 -82 72
6833 72 -168 247 117 -147 289 -104 -36 -117 9 -57 72 -286 -13 -17 -235 -37 -100 27 160 -34 91 54 93
6856 93 51 -4 35 -333 -124 -11 209 125 -116 121 39 -133 -18 -188 -128 -34 -199 33 -155 26 72 -50 -28
6879 -28 121 118 -46 162 127 220 -115 38 -122 198 187 -27 129 38 94 114 75 82 13 206 256 110 -152 101 -1
6904 -1 -195 242 -114 -133 30 -71 78 -187 89 -21 163 84 -98 -58 23 -34 -131 6 -74 250 -196 -221 58
6927 58 185 -1 -138 141 21 -114 -98 -92 -77 -109 161 75 -163 -158 -143 -99 -14 35 -91 142 113 93 -18 -121 16
6952 16 9 -141 78 -81 35 72 12 -68 289 -206 73 583 -87 233 -25 36 132 -29 227 107 87 124 253
6975 253 449 -213 -34 -289 7 -142 67 100 78 25 13 194 130 -99 -18 65 -55 -9 38 204 -216 221 -11
6998 -11 223 173 118 124 192 241 71 115 -14 78 -131 -92 -60 89 -260 -60 121 146 34 2 -24 0 -191 -127 -188 -156
7024 -156 11 82 -193 81 257 4 125 -11 -51 53 -176 -5 95 -87 -10 31 176 220 76 52 127 76 -95
7047 -95 160 -36 -167 -4 344 172 358 42 56 -60 -143 -92 -92 -190 56 235 -84 196 -172 -2 126 -25
7069 -25 -10 -246 -51 -308 159 -61 -107 97 170 144 251 -270 -48 -72 27 55 -98 -186 -77 202 167 -108 -168 -125
7093 -125 116 136 56 270 -112 -40 -56 -98 117 175 -45 -63 136 -50 29 9 2 184 -164 -282 -93 12 242 -80
7117 -80 0 -117 -56 10 26 -33 -156 47 -164 296 19 125 95 -117 70 -64 26 36 195 -11 -141 209 84
7140 84 -27 -341 -86 -141 -64 26 112 -4 -135 245 -92 108 -60 -109 9 17 39 -185 23 -61 11 239 61 -29
7164 -29 45 139 -140 136 101 -19 -40 -55 -49 240 93 99 -88 77 227 -44 -64 12 121 166 172 -59 -110 -206 -11 -96
7190 -96 -95 -117 99 -83 6 -118 -56 6 80 13 83 220 -177 48 -69 225 209 -273 174 121 -31 163 149 177 -37
7215 -37 291 -83 -137 -28 142 177 216 -61 -78 116 -98 -173 43 84 77 113 38 308 20 -340 -106 -12 222 -112
7239 -112 216 -266 -122 -109 -98 -21 -211 115 -79 -100 -134 -39 21 -141 -151 -195 59 0 -123 -225 -210 -160 198 9
7263 9 287 99 58 63 -308 145 32 416 107 -4 -287 98 142 -27 -49 119 164 -98 -57 -101 -122 163 -125 346
7287 346 32 -158 211 -104 -42 58 -221 72 -37 70 159 -215 113 124 -354 -46 182 -212 -1 32 -429
7308 -429 -168 27 48 -9 106 -97 60 -85 198 122 -66 -8 491 -299 -24 71 106 18 -235 -292 190 -132 -93
7331 -93 -73 -383 20 166 286 -294 9 21 113 107 11 -290 31 85 -95 28 88 -316 -28 -166 -13 208 76
7354 76 32 -184 69 12 25 -275 45 68 135 -49 -356 250 177 -41 -8 67 23 -95 -52 103 -108 -27 -59 -131 291
7379 291 -40 -92 212 41 21 151 -67 178 -175 31 12 -29 156 212 -166 -194 -84 -106 -68 -76 121 -195 -202 234
7403 234 -191 -123 -192 -264 -114 286 15 209 247 29 -71 167 -24 88 62 -81 -239 -82 -65 -149 96 -119
7425 -119 -71 39 -127 171 -144 92 84 14 119 -111 -132 277 -126 -50 -189 310 243 177 110 138 -180 22 156
7448 156 -48 128 81 175 -51 82 185 -34 -185 -99 -24 76 10 303 1 99 253 12 -183 201 -94 194
7470 194 -17 55 155 39 168 -129 107 53 250 100 119 194 -161 -20 -68 20 -30 111 -29 -157 -124 -269 28
7493 28 -199 -47 -358 -84 -111 -389 132 232 -287 126 -51 -7 -56 -12 26 -86 -33 65 205 45 -361 -77 53
7516 53 -54 -189 -81 -55 -220 5 84 -173 70 -255 -153 54 55 23 27 -263 83 -371 110 169 -59 31 267
7539 267 -76 119 -28 75 -5 -105 181 153 -86 33 -212 269 139 -2 202 -55 65 -160 314 -59 187
7560 187 90 238 160 120 -7 -261 -62 144 -292 -62 150 0 148 -178 -143 141 -5 -72 219 -90 9 77
7582 77 126 126 100 -237 -131 -43 154 -55 -143 -58 -184 -101 -14 186 -51 190 22 4 178 -175 -146 -145 -49 327 72
7607 72 -34 12 214 -215 -52 -75 -135 272 183 121 -155 124 -141 138 171 -121 59 -46 -230 -300 82 35 44 -80
7631 -80 78 -61 218 31 -65 -135 -100 -144 118 -348 233 200 -205 -125 -112 -34 -101 -228 34 2 -72 -96 139 25
7655 25 -31 90 -103 -115 -18 -12 -273 -72 -103 -227 -46 -155 -86 -79 -72 266 79 24 -107 -111 128 3 73 -30 -61 248
7681 248 126 -91 -146 16 66 110 101 27 35 -41 58 -142 -118 14 103 -34 -125 -67 44 16 -146 -116 86 58 58 -335
7707 -335 333 -111 49 2 -85 -188 20 -104 -194 102 -108 67 1 -86 34 135 201 -56 29 -4 100 -126 10
7730 10 -83 -8 103 17 66 -190 200 -137 297 158 -137 -159 -61 62 -153 2 77 171 -224 59 140 100 177 -163
7754 -163 -177 -82 -198 178 -141 -132 92 238 -115 -51 -8 -272 -6 -338 -210 -13 -118 -52 202 -14 66 -24 -123
7777 -123 -138 217 -123 -31 -217 49 46 230 -173 172 -154 -229 -243 -170 88 -117 -104 171 233 -271 42 -24 -111 -73
7801 -73 -8 -34 25 0 39 152 -20 -33 -207 -107 -73 133 -75 -152 34 -22 -87 166 20 71 -198 -254 72 -55
7825 -55 -70 -200 -113 159 -126 -207 83 276 55 -135 -90 137 -71 50 41 -129 -202 -6 -31 18 3 -291 -18 -172
7849 -172 -63 -166 -85 -58 -162 15 -17 -33 -17 280 -93 142 179 -1 60 50 -99 -179 -81 -187 65 120 -15 -19
7873 -19 -54 18 -211 69 296 -147 77 124 69 149 257 128 103 54 -48 -36 276 88 360 239 58 -89 12
7896 12 -119 -150 -96 -10 30 108 171 215 30 129 42 -23 32 -121 55 -126 -38 265 185 89 136 9 -31 -41 -88 -3 121
7923 121 -45 -112 -4 169 -134 66 -71 -21 -50 5 30 -33 -122 170 101 45 289 -16 183 -48 -7 -4 -168 270
7947 270 5 50 247 134 153 -95 -104 78 358 23 147 163 208 -112 -189 -72 -71 119 115 46 84 -90 -1 -12 121
7972 121 262 -83 -133 154 207 -12 148 -73 -11 42 208 34 153 -144 16 -25 103 96 145 160 -71 -148 97
7995 97 96 35 -176 -17 -27 -94 70 151 143 -184 166 -298 -316 299 89 363 -5 -3 162 -466 35 50 92 -59 119
8020 119 162 -12 -38 11 390 87 45 -9 -78 108 104 60 123 -389 -43 -52 214 50 -39 -8 351 297 71 -133 193
8045 193 -125 -189 -138 -135 -119 -104 136 -22 233 38 226 -164 42 109 -44 -141 156 35 -314 168 -23 108 -11
8068 -11 221 -31 79 2 -216 -90 -46 19 -120 -166 106 113 132 -242 -32 -309 15 180 -12 -93 145 -43 -98
8091 -98 -28 -95 73 -17 82 209 35 9 21 52 295 -22 133 68 -88 -58 -111 -284 -46 -300 7 -306 110 -67
8115 -67 -188 -81 135 119 115 154 -192 -36 -276 84 -142 -51 -2 122 -238 -51 -8 86 184 -18 -46 72 105 124
8139 124 88 -294 -76 21 209 30 -239 182 -47 17 -111 176 -7 7 127 -204 8 -89 -33 100 -24 -172
8161 -172 77 61 20 157 -240 54 -69 -275 -192 -79 84 173 -98 122 -21 -26 -183 -40 -289 145 43 -97
8183 -97 42 -10 38 -58 -172 39 -18 23
8191B3
$$ Imaginary data points
##PAGE= N=2
##DATA TABLE= (X++(I..I)), XYDATA
0 0 0 0 0 0 0 0 0 -8 8 -8 8 -9 16 -24 24 -32 40 -48 64 -72 88 -104 121 -145 174 -201 233 -269 313 -357
30 -357 409 -465 528 -596 675 -761 853 -956 1069 -1194 1327 -1475 1635 -1812 2004 -2215
46 -2215 2442 -2695 2968 -3269 3602 -3967 4375 -4825 5332 -5900 6551 -7296 8163 -9181
60 -9181 10405 -11906 13792 -16246 19585 -24412 32029 -45864 78932 -323621 -68876 498995
72 498995 -265856 -148714 177877 -75624 -19631 190093 -193744 -81388 211117 -50483
82 -50483 -95284 89772 -133871 38680 245802 -222933 -226557 351644 76876 -330124 64759
93 64759 190216 -117088 13681 41025 -146191 79652 158493 -156441 -74616 134328 -6081
104 -6081 -28466 32883 -99202 28582 173013 -123195 -148560 185139 73003 -143001 15346
115 15346 55458 -29746 66503 -9952 -144938 85067 138851 -139457 -64627 116452 -17255
126 -17255 -16634 64795 -86230 -24537 173106 -42349 -163020 109439 92290 -89667 -1535
137 -1535 7359 -24045 101725 5111 -140415 59978 121926 -86534 -39531 53234 -40997 31820
149 31820 60824 -120132 -28346 150129 -26924 -120609 59640 47822 -45607 27549 -15874
160 -15874 -63400 83321 45465 -109785 -2611 83226 -26544 -25248 12927 -38167 29451
171 29451 52131 -91382 -29419 98508 -27377 -61408 45913 -14862 -30177 69573 -28279
182 -28279 -89503 80068 49594 -102451 942 61364 -33041 -127 18921 -43802 20885
193 20885 48183 -54391 -16828 49731 -29520 -11833 33208 -52060 -6574 73274 -47961 -60646
205 -60646 73096 13362 -68000 26388 23857 -38713 26784 15425 -47880 20602 35729 -30361
217 -30361 -2748 18541 -14975 13791 15103 -39574 10615 48634 -34418 -23811 44303 -3125
229 -3125 -23288 22816 416 -19323 22321 7188 -24991 14611 15421 -14113 10501 6162 -12351
242 -12351 17964 13918 -20335 3249 25512 -9308 -13335 14768 2120 -5556 1874 -4304 2035
255 2035 3314 -6294 2559 7275 -5582 -2297 12178 -2912 -11301 14168 9710 -12733 -544 13436
269 13436 2230 -10193 3065 11368 -5471 -7319 4550 2799 -6237 -4605 4912 -321 -7296 -1356
283 -1356 2602 870 -7419 -2493 6865 -6357 -9454 5360 1701 -6936 -1810 3359 -3207 -1111 362
298 362 -5567 5470 1211 -14013 3385 7410 -14429 -6648 12051 -3749 -16239 5705 6874
311 6874 -10809 -4250 4433 2294 -6188 -7414 9168 5987 -12080 1685 16741 -5416 -14227 14928
325 14928 9156 -18603 -653 12924 -6650 -10166 3999 8449 -4289 -7400 7693 8041 -9427
338 -9427 -5964 14940 1201 -17186 9584 12556 -14273 282 15344 -2239 -4198 9740 2055
351 2055 -3042 7560 -744 -3783 7884 -2568 -4428 7028 -760 -2813 5940 508 -5267 5205
365 5205 3272 -5242 6026 2424 -7547 10136 6602 -12673 4881 16925 -7903 -11008 13989
378 13989 2499 -14561 5832 5371 -11233 2158 7457 -6854 -5179 6512 1434 -5686 -4605
391 -4605 -3628 6850 539 -17700 3980 15549 -12670 -6596 15720 -3764 -8540 17012 -4188
404 -4188 -21951 18190 10780 -27531 630 16643 -11801 -5962 6046 -10367 833 12881 -15977
417 -15977 -9617 16302 -5789 -7087 6569 -12973 3431 23097 -23137 -21780 37345 4809 -39039
430 -39039 15592 18265 -27892 11154 16542 -34260 5097 36388 -25162 -25281 26734 3814 -13072
443 -13072 3612 -15612 5564 31685 -26028 -21807 41230 2515 -26232 24094 -1562 -26800
455 -26800 42423 11140 -61372 21589 52467 -38711 -20761 30982 -5018 -1005 15259 -28798
467 -28798 -1880 43203 -18873 -28482 28087 797 -7962 20913 -25610 -17131 57587 -286 -62566
480 -62566 26530 44091 -31726 -1608 17533 -24365 20970 28796 -49389 -10259 54826 -14048
492 -14048 -36480 19987 -2508 -4412 29378 -31335 -29430 59774 8636 -57394 15903 29801
504 29801 -20007 11405 -2877 -41107 40534 36613 -69787 -9017 61002 -22132 -23478 25017
516 25017 -27196 -3257 55014 -38371 -55052 60966 21061 -54005 4592 11191 -8396 28416
528 28416 -18024 -48775 47122 35424 -57573 -2283 35768 -22117 11839 19772 -53143 8324
540 8324 66393 -40639 -53153 50043 19467 -35953 4905 -2335 -8759 38510 -9011 -50541
552 -50541 29761 35893 -33639 -7871 13960 -13544 23576 14770 -57939 10185 68404 -36287
564 -36287 -44333 44248 7519 -19407 22695 -22799 -27626 60360 5222 -70076 22808 43594
576 43594 -28950 -2045 5145 -21672 38082 21701 -64685 6269 65280 -27699 -25727 29840
588 29840 -17205 5968 43198 -46626 -32091 70664 4285 -59454 19117 20757 -16869 21957
600 21957 -11877 -39345 44447 26038 -54138 -216 34156 -15798 1296 9332 -31638 16537
612 16537 40457 -41068 -22914 46346 186 -25944 10943 -5776 -5138 28816 -16611 -36950
624 -36950 33123 19769 -38296 901 18360 -13793 7752 7397 -29288 8954 34333 -25795
636 -25795 -23162 27907 2778 -13515 7448 -12968 -2977 28808 -14321 -31736 26236 16515 -27825
649 -27825 2335 8999 -16648 15485 8955 -36135 6415 34739 -22340 -21089 21711 -189 -7187
662 -7187 12863 -15176 -8169 31247 -4711 -26601 15853 11848 -10742 5795 -4923 -14217 22686
675 22686 8262 -32449 5042 24462 -15206 -5974 12461 -10004 2013 18254 -14892 -11858
687 -11858 24878 2512 -17851 8934 5504 -5516 9471 -3706 -11687 14816 6903 -16703 3569
700 3569 10299 -9963 4449 6359 -15013 5672 14975 -15408 -5400 17355 -4085 -9687 10577
713 10577 -1728 -7257 12423 -821 -11564 10618 5481 -9773 2844 4419 -4155 4672 1611
726 1611 -10005 6079 7155 -11968 758 8300 -9656 -1502 7155 -7940 -3604 10620 -4669
739 -4669 -9766 9483 2846 -8146 3384 2237 -4009 2187 500 -4340 -232 1538 -2234 -1325 -767
754 -767 -2480 2176 -138 -5860 2355 2456 -5464 -553 3817 -2399 -2439 4420 -686 -4574 3787 2498
770 2498 -3607 -89 3846 594 -3481 345 4006 -2132 -3576 2670 1837 -4921 -1992 5408 -2349
785 -2349 -5468 4033 2162 -4904 -787 5103 242 -4703 2692 4360 -2972 -1439 5030 1738 -4309
800 -4309 1668 5507 -3252 -1975 5523 942 -3647 1316 3973 -2104 -2595 3723 1259 -3356 -771
815 -771 4039 485 -4446 3289 5327 -4837 -915 7247 -435 -4552 5128 4343 -6033 -288 5980
830 5980 -2875 -3905 2655 2372 -2478 -2842 3306 2402 -4374 -761 5181 -1228 -6349 4269 4112 -7845
846 -7845 275 7172 -4047 -4356 4638 1802 -3325 -18 2416 -34 -441 -1859 1004 1655 -4928 -213
862 -213 3534 -6147 -2940 6055 -3113 -7153 5443 2940 -8317 2258 4832 -4959 1342 3743 -4956
877 -4956 -271 5120 -3166 -3615 3210 -1272 -2616 1928 -3620 -1099 5909 -3320 -4686 4651 1117
892 1117 -3590 2900 -156 -5235 5632 2627 -10382 2966 9468 -5942 -2900 6947 -1259 -1716
906 -1716 6796 -2324 -4892 8782 1765 -7818 2367 2866 -1245 1874 -3659 -3923 8340 1733 -10864
921 -10864 4692 8231 -7767 2267 6826 -9189 2946 13054 -10720 -8275 15557 1713 -12700
934 -12700 4942 4722 -4087 5159 -2574 -7331 10425 3767 -10957 2701 5156 -6623 5316 2608
948 2608 -15175 7566 16450 -17589 -7961 19993 -1354 -11084 8139 -1316 -5771 13302 -3289
961 -3289 -17183 12154 9775 -14136 -793 3400 -4994 8445 422 -19195 8127 17756 -17384
974 -17384 -8148 15048 -5671 -2184 10041 -15360 -5016 24579 -6206 -22680 14781 10249 -13105
987 -13105 3815 -145 -8498 15307 1894 -22483 6536 14877 -12201 -2917 5259 -10933 8219
1000 8219 12742 -23521 -4071 27621 -7865 -18751 12766 3852 -6252 8878 -6946 -11611 20032
1013 20032 3508 -22799 7198 11773 -11110 4113 2305 -16028 11736 16652 -24139 -7135
1025 -7135 26414 -4468 -14987 9064 -1768 -57 13220 -12863 -11645 23180 3381 -19962
1037 -19962 8892 7615 -9308 12261 -150 -22851 16349 20622 -25051 -9473 21207 -1198
1049 -1198 -7747 3568 -8532 3531 16624 -14947 -12145 18552 1842 -9886 6121 -4181
1061 -4181 -4611 19072 -3377 -24185 14976 19029 -18627 -7275 11091 -2283 1701 3063 -13397
1074 -13397 1755 18118 -9490 -14382 11699 3894 -5687 3848 -7852 -5035 18883 -222 -21877
1087 -21877 8374 16596 -11510 -3851 6121 -7158 6300 8337 -19620 -2458 22227 -7411 -16005
1100 -16005 10713 556 -6508 10487 -8643 -13385 20362 3805 -22416 5726 12146 -8489
1112 -8489 2450 1805 -11839 11684 11038 -21115 -446 18093 -9301 -4529 9056 -9577 886
1125 886 16626 -13392 -12530 20275 1213 -16102 6812 3087 -6368 8380 -1997 -11382 10235
1138 10235 7718 -11466 1014 6818 -5244 3588 2423 -10847 6198 11183 -12905 -4729 13712
1151 13712 -2227 -7983 6599 -1810 -5396 9926 -1598 -12551 7787 9029 -7849 -1944 5926
1164 5926 -668 1819 1396 -5908 3467 6753 -7483 -1699 7211 -4147 -984 6485 -6820 -4057
1178 -4057 12819 -1822 -13966 7708 8171 -9671 -1517 4504 -3478 974 3039 -4666 -889 5172
1192 5172 -1267 -1087 1148 -3439 3586 3897 -8087 -831 9392 -3196 -7047 5285 1839 -5780
1206 -5780 2173 1445 -5104 1925 3264 -4187 -969 3250 -217 -365 988 -1570 277 3200 -2730
1221 -2730 -1870 3317 -605 -1712 1074 -179 70 1605 -1897 -2050 3507 -544 -5378 2931 2311 -5524
1237 -5524 411 4255 -3570 -2197 4789 463 -4507 2061 3132 -1654 -1200 955 2446 -289 -3375
1252 -3375 1297 3291 -2734 -2635 4534 647 -5415 2288 3826 -4197 -707 4812 -547 -3168 1930
1267 1930 2686 -1637 -1138 1442 708 -358 -686 1243 893 -1285 437 1553 -327 -582 418 265 -956
1284 -956 -104 22 -1351 657 221 -1303 642 1230 -724 -520 1631 661 -1430 884 2062 -739 -1483
1301 -1483 965 1318 -1690 -1348 2545 214 -2956 241 2241 -1089 -2297 2289 1443 -3416 -501 2823
1317 2823 -926 -3138 1501 1699 -3039 -862 2817 -224 -1733 343 1765 -583 -1206 1123 1093 -913
1333 -913 -1131 1153 401 -2825 39 1746 -2350 -1765 2025 -259 -2108 793 1732 -1205 -267 1327
1349 1327 -666 898 379 -1057 403 -234 -453 612 71 -1231 1100 1445 -2255 -13 2558 -1531
1365 -1531 -983 1404 -1745 -624 2269 -1151 -1938 3035 632 -2523 2141 749 -1901 2661 256
1380 256 -3381 2474 2290 -3198 22 2753 -1582 -352 1703 -3320 50 4057 -3733 -2086 3817
1395 3817 -716 -1802 2802 -665 -1978 4807 -614 -5771 3657 3170 -4394 660 2479 -1979 1687
1410 1687 2342 -3970 186 5392 -2852 -3479 2719 -1162 -1043 1522 -3440 -1035 5561 -940 -5286 4116
1426 4116 3047 -4287 2079 1175 -4281 3892 3836 -6953 -569 7033 -1799 -4161 2859 -657 -245 3414
1442 3414 -5101 -2446 7005 -1894 -5462 4429 661 -3579 4882 -957 -8210 6735 5813 -10590 -873
1457 -873 8099 -2743 -1679 2685 -2915 2246 6107 -7651 -3365 9436 -2487 -6378 4921 -2177
1471 -2177 -3611 8043 -2030 -9773 7431 6977 -9128 -1105 5582 -2162 2240 -228 -7491 5737
1485 5737 8207 -9603 -3226 9698 -2252 -3814 5725 -4937 -4091 11329 -1926 -11710 5400
1498 5400 7213 -5167 -1868 637 -658 5977 -1392 -10183 6156 8308 -9019 -1704 6582 -4713
1512 -4713 1297 7427 -8331 -4501 13249 -1218 -11485 4897 4749 -3644 1024 -2188 -2909 8002
1526 8002 541 -9787 3640 6699 -6063 66 3105 -5879 4353 6783 -10711 -2509 12879
1539 12879 -2156 -9117 4992 1764 -3466 5023 -3320 -7546 8654 4124 -10479 161 6668
1552 6668 -3236 -820 1030 -4832 4744 5859 -10254 -1813 10839 -2884 -4948 4284 -2835 -775
1566 -775 9505 -4983 -10307 10452 5688 -10229 129 4296 -2330 3037 59 -7515 4541 6845
1580 6845 -7698 -2783 5868 -1782 407 2554 -7212 1603 10028 -5975 -7470 8166 2814 -5708
1594 -5708 2075 -391 -4139 7103 836 -9722 2682 7439 -5427 -3027 3848 -1517 407 2780
1608 2780 -5795 -910 7931 -2595 -5507 4425 804 -1811 3730 -2726 -3884 8448 1571 -10007
1622 -10007 3817 6381 -6537 -391 4390 -4773 688 5844 -6311 -3152 8124 -1388 -5033 3113
1636 3113 -676 -243 3826 -4569 -2825 7684 -1311 -6743 4704 1535 -5040 4400 711 -6987 5004
1651 5004 5117 -7460 -1022 5786 -2160 -2135 1450 -1926 861 2998 -3866 -1159 3922 -1741 -1061 2549
1667 2549 -1975 -553 4507 -1526 -3629 4628 2011 -4708 363 2521 -2160 -328 994 -2247 182
1682 182 3123 -1794 -2623 2312 1039 -1309 385 -477 -651 1385 -52 -1731 1190 1343 -1213 332
1698 332 991 -1300 1664 787 -3383 492 3588 -2189 -2576 3088 401 -2832 1518 622 -2507 964
1714 964 1611 -1216 -764 983 511 164 -1001 174 1825 -41 -2427 1502 2187 -2728 -970 2235
1730 2235 -1204 -1447 1639 281 -2364 353 1241 -1585 -216 691 -76 -245 -531 -242 1062 22 -623
1747 -623 998 1421 -958 318 1826 -917 -527 1594 -321 -1135 754 217 -1152 189 114 -549 485
1764 485 61 -1103 989 328 -1239 517 1261 -658 -337 1202 -362 -1008 1026 -100 -628 455 586
1781 586 55 137 7 325 -54 -282 -322 532 -556 -1017 849 -227 -1279 335 978 -829 -430 1231
1799 1231 620 -946 943 965 -425 -560 297 575 -902 -972 745 106 -1071 76 1339 -594 -1234
1816 -1234 1319 445 -1514 205 1016 -945 -706 617 508 -961 -61 652 23 29 -378 855 568 -694
1834 -694 61 987 -275 -1040 633 387 -1470 298 649 -1275 -124 898 -656 -338 749 36 218
1851 218 687 -699 -388 1685 -421 -1075 1088 324 -1050 476 270 -465 485 464 -887 -152 349 -695
1869 -695 421 -286 -1314 1100 660 -2334 123 2481 -962 -1427 2160 203 -1364 1968 355 -1695
1885 -1695 1512 1307 -1514 -278 754 -264 220 -632 -1604 2014 841 -3004 638 2420 -1567 -241
1901 -241 2456 -1874 -1281 3876 -1002 -3402 3140 1403 -2846 545 883 -335 1129 -363 -2079 1813
1917 1813 1308 -2489 509 1226 -2243 1279 1629 -3590 351 3869 -2373 -2969 3172 494 -2063 1431
1933 1431 -480 -1727 2906 177 -3343 1264 2367 -1772 -378 797 -1400 1105 773 -3694 714
1948 714 3529 -2483 -2003 2013 -1204 -673 2505 -2837 -2754 5105 457 -5300 1912 2983 -2419 38
1964 38 546 -2312 1955 2058 -4203 -444 3546 -1822 -674 1131 -2833 1609 3788 -4430 -2124 5993
1980 5993 -342 -4482 2392 1474 -1943 2749 -385 -4187 3747 2625 -4112 -529 3225 -871 109
1995 109 504 -3268 1705 4128 -4229 -2686 4007 343 -2069 789 -1377 -171 4111 -1394 -4975
2010 -4975 3936 3260 -4285 141 2655 -1557 1108 1881 -3834 90 5126 -2193 -3605 2499 963
2025 963 -477 805 -2880 -405 5080 -1976 -4636 3378 1807 -3508 1909 721 -3358 3681 2858
2040 2858 -5686 228 5690 -2192 -2945 2247 -237 -203 1810 -3456 -1135 4456 -1894 -3833 2656 385
2056 385 -1435 2311 -1054 -3229 4552 2174 -6005 818 4882 -2173 -1365 1830 -2026 480 3552
2071 3552 -3457 -2519 4674 115 -3639 1239 191 -694 2380 -2139 -3601 4265 1430 -5326 570
2086 570 2578 -2392 1476 935 -4348 2455 4556 -4476 -2358 4250 -247 -1785 1328 -1821 -614
2101 -614 3524 -2239 -2941 3606 412 -2198 1281 -677 -987 3387 -287 -4694 2591 3255 -3459 -234
2117 -234 2343 -1061 722 1554 -2132 -196 3114 -709 -2066 1733 710 -769 609 -772 -899 1639
2133 1639 -49 -2894 789 2312 -1568 -790 1508 -581 210 1380 -1509 -584 2409 -549 -1740 1492
2149 1492 265 -1178 1292 -437 -2239 2365 981 -3032 462 2473 -1248 -1066 1085 -810 376
2164 376 965 -1838 -265 1823 -1420 -204 1160 -1446 117 2294 -1488 -1623 2704 686 -2701 432
2180 432 980 -1216 65 -73 -688 145 279 -1083 -200 950 -448 233 270 -1316 193 1200 -933
2197 -933 -974 1414 476 -1199 258 878 -485 366 259 -993 597 900 -894 -333 868 -653 -946
2214 -946 863 -581 -882 1507 -165 -1112 603 510 -433 538 229 -369 683 200 -999 431 666 -1316
2232 -1316 125 665 -819 84 724 -333 -56 965 -27 -554 704 -10 -175 420 -145 -276 685 456
2250 456 -174 61 330 95 293 153 -37 649 -316 -923 914 -144 -1034 324 469 -925 -618 858
2268 858 -618 -1217 551 579 -977 -243 964 316 -748 150 548 -257 -578 220 630 -867 -1012 1144
2286 1144 443 -1109 114 951 -472 -1432 677 315 -1647 -48 1139 -463 -958 622 834 -653
2302 -653 -72 799 -84 -636 -127 753 -144 -979 471 305 -1143 34 718 -204 -959 647 502 -1090
2320 -1090 -161 592 -223 -227 89 218 104 44 95 -122 191 23 90 302 -491 438 732 -520 -123 575 -130
2341 -130 -170 523 86 -412 693 102 -1037 833 630 -799 296 822 -194 163 757 -304 -126 654
2359 654 -277 -118 375 -361 414 204 -519 -67 1079 -626 -874 1099 234 -1258 926 371 -1258 587
2377 587 850 -992 -16 1137 109 -535 601 273 239 415 -839 -36 999 -518 -391 437 -541 -435
2395 -435 1369 -957 -1267 2056 207 -2203 591 1116 -1272 -152 900 -853 -414 1051 -668 -1070
2411 -1070 1027 260 -358 -121 -636 555 1144 -1973 -900 2450 -270 -2364 1545 777 -2167 1246
2427 1246 1078 -2535 181 2146 -993 -1520 924 570 -407 91 -808 1025 1292 -2068 -818 2284 -685
2444 -685 -1283 1396 -287 -1695 2042 697 -2917 775 2237 -1329 -1194 990 109 341 16 -1306
2460 -1306 672 2230 -1369 -1014 1894 129 -619 1457 -636 -809 1908 632 -2397 560 1798 -1051
2476 -1051 -249 21 -914 1331 1106 -2891 107 2952 -975 -1430 1855 27 -680 1807 -755 -1810
2492 -1810 2205 738 -2191 413 1239 -497 949 -188 -2026 2014 1702 -3426 -46 2848 -1297
2507 -1297 -996 1346 -1165 -262 2496 -1004 -2207 2339 759 -1771 711 163 -448 1528 -765 -2179
2523 -2179 2128 1638 -2630 -183 1414 -1329 -4 917 -2229 361 2450 -2053 -1672 2170 203 -1280
2539 -1280 903 -630 -1002 2269 -523 -2624 1609 1566 -1572 6 865 -957 832 349 -2391 294
2555 294 2074 -2077 -836 1535 -728 107 1564 -1270 -895 2984 -339 -2368 1361 1316 -1230 504
2571 504 54 -581 1145 402 -1788 95 1790 -764 -451 993 -789 255 1414 -1890 -824 2466
2587 2466 50 -1946 839 869 -920 545 99 -1417 1584 701 -1761 282 1288 -910 12 880
2603 880 -911 261 1591 -1950 -1224 2134 16 -1143 899 -111 -94 1446 -605 -1003 1546 548
2619 548 -1805 615 622 -908 904 374 -1545 493 1576 -1509 -960 1141 -87 -789 -7 -920 -152
2636 -152 557 -897 -685 810 59 -504 534 49 -528 639 205 -1008 93 977 -331 -934 445
2653 445 -91 -379 265 -387 -772 667 39 -1090 310 822 -808 -290 547 -431 -198 485 -822 240
2671 240 894 -612 -173 584 -288 210 539 -867 -797 1724 35 -1808 944 840 -972 212 488 -349
2689 -349 -78 350 -348 302 375 -271 903 -267 -790 1098 549 -1365 170 1263 -808 -855 1060 -134
2707 -134 -830 371 233 -491 280 122 46 -127 -175 224 325 -587 -381 674 93 -771 463 526 -458 -165
2727 -165 717 -188 -284 416 185 -456 553 68 -543 48 219 -159 -7 101 -233 259 136 61 -373 122
2747 122 88 222 18 176 208 -24 -128 80 211 -464 -152 406 -470 -470 683 133 -1157 160 513 -360
2767 -360 -424 526 -5 -486 194 351 -144 -547 -32 698 -405 -546 661 371 -472 275 276 -240 -650 660
2787 660 329 -855 132 493 -139 -647 599 502 -381 82 354 -241 -274 377 398 -256 -355 443 352 -194 69
2808 69 611 -117 -450 421 761 -669 -203 932 -294 -278 503 132 -142 170 655 -319 -22 403 341 80
2828 80 -311 208 511 -146 132 358 37 -53 305 441 -545 316 224 -376 -41 79 164 -382 140 44 -222 561
2850 561 -190 -156 561 -20 -241 254 -170 -418 237 211 -487 202 -22 -376 -149 218 -317 123 5 -861 302
2871 302 600 -508 -481 773 -409 -520 538 -304 -598 521 177 -643 265 456 -286 31 -364 59 386
2890 386 -589 -1160 804 503 -1093 11 745 -612 -362 894 -223 -843 631 257 -616 66 504 -43
2908 -43 -197 -538 163 1014 -346 -788 822 502 -990 320 662 -413 246 1132 -610 -645 1004 103
2926 103 -777 -105 184 -232 373 -551 -186 1030 -114 -749 478 674 -522 174 907 -785 120 1045
2944 1045 -976 -385 1048 -100 -675 157 -197 -125 970 -789 -793 1207 -26 -826 633 507 -282 450
2962 450 121 -1021 488 979 -949 -237 518 -187 141 321 -970 313 1414 -754 -791 851 556 -912
2980 -912 53 55 -588 921 -16 -1603 489 785 -582 -260 363 -374 329 385 -1200 -84 1372 -613
2998 -613 -750 736 211 -470 447 -310 -407 1203 90 -1749 562 671 -969 312 405 -975 671 1051
3016 1051 -1301 -69 1646 -440 -769 877 -502 -245 749 -660 -715 1009 -86 -1046 219 187 -677
3033 -677 605 -354 -1219 1154 927 -1454 35 1368 -276 -294 405 -571 101 1097 -496 -643 970 -81
3051 -81 -279 449 7 -165 859 -427 -982 1088 342 -1402 161 729 -530 191 674 -751 -51 1079
3069 1079 -535 -528 896 148 11 225 -374 -20 872 -401 -615 809 241 -485 141 236 -611 679 263
3088 263 -1179 323 1103 -327 -756 465 429 -538 -42 -286 -297 464 -116 -851 105 370 -192 26 -149
3107 -149 -647 456 270 -1090 -37 748 -349 -305 288 -240 -67 482 -349 -445 836 129 -647 523 46
3126 46 -452 434 -128 -882 314 669 -1158 -147 538 -86 -254 145 -335 196 95 -591 29 504 -635
3145 -635 -193 719 -422 -376 1137 -73 -924 826 742 -808 -200 616 -69 -203 166 82 -203 -196 81 619
3165 619 178 -581 651 225 -599 -135 822 -224 -725 804 579 -808 -235 790 -155 -337 252 267 -420
3184 -420 -229 244 132 -391 -289 442 33 -557 197 782 -246 -655 691 572 -438 405 277 -608 97
3203 97 457 -294 -174 30 286 -274 -381 17 315 -85 -483 -24 48 -452 -250 371 -369 -155 119 154 -376
3224 -376 200 88 -225 -188 178 -82 -129 -58 122 -143 87 11 -112 383 -324 -298 60 -34 -173 -161 -147 -145 -328
3247 -328 200 33 -165 -32 103 225 -109 -149 229 16 -37 253 245 -50 -241 337 287 -149 -213 191 -556 -356
3269 -356 504 -13 -110 -12 205 -213 -278 -5 508 221 -387 536 433 -217 159 639 -308 -233 324 115 -337
3290 -337 177 339 82 150 335 332 67 -181 162 124 -214 98 352 356 -286 192 392 -146 -190 446 109 -125
3312 -125 396 65 -376 139 268 63 -203 -291 32 212 -271 -227 67 36 -143 128 295 -255 94 344 -362
3333 -362 41 171 -193 -326 77 268 -201 4 -215 -177 282 -93 -144 202 50 -176 -75 8 -277 -267 116
3354 116 -147 -70 275 -236 -125 189 10 -29 110 -119 -66 273 -258 -192 29 31 -223 321 -60 -230 319 211
3376 211 -383 -111 200 21 -136 337 -164 -233 354 -199 -326 357 142 -201 106 -60 -215 383 -179 -344
3396 -344 410 292 -611 113 267 -192 182 430 -399 140 680 34 -170 276 0 131 208 -168 316 586
3416 586 -226 -328 837 159 -590 43 232 -502 530 24 -585 -91 626 -383 -410 465 65 -9 175 -325
3436 -325 68 603 -577 -290 394 -61 -230 199 -103 -442 460 140 -1007 116 226 -236 -137 22 -378
3455 -378 329 448 -592 -210 801 -382 -650 249 54 10 316 55 -293 293 -87 -571 9 145 -527
3474 -527 270 -22 -799 310 517 -1007 -204 885 -178 -342 195 -301 -109 437 -287 -382 469 40 -478
3493 -478 317 -214 -236 564 -73 -550 584 376 -585 -119 513 -269 287 180 -464 226 744 -362 -603 566
3513 566 -56 -265 99 -303 -394 131 117 -583 492 490 -366 -258 65 -199 -56 48 -776 27 828 -324 -486
3534 -486 751 -15 -436 531 76 -608 412 220 -474 -34 467 -218 -105 -118 -2 555 117 -562 172 736
3554 736 -474 -221 620 -432 -148 574 -419 -712 579 429 -1078 59 376 62 72 -87 -2 571 130
3573 130 -348 99 348 -549 274 107 -382 -152 484 -248 -788 441 407 -594 -73 336 -359 372 -249 -249
3593 -249 240 233 -454 45 245 -88 3 283 -461 27 689 -326 -593 94 262 -272 82 -127 -193 519 -31
3614 -31 -696 383 172 -313 154 288 -158 91 479 -262 -95 354 -188 -133 226 125 85 -118 -341 11 479
3635 479 91 -574 569 204 -398 432 -73 -447 327 375 -335 -49 502 -97 -128 38 -59 -175 29 -101 177
3656 177 566 -45 -220 -84 -176 -15 -11 -203 -243 253 211 -264 276 131 -42 -61 398 -200 125 117 -26 -213 108
3679 108 150 80 -248 -82 182 -18 -365 137 235 -270 36 306 22 -149 -300 13 -215 -356 165 140 -442
3700 -442 -85 300 -31 -237 280 108 -43 -122 406 -29 -46 -8 106 255 -85 207 153 -237 -372 89 -45
3721 -45 -118 150 6 255 -160 -30 70 -80 -11 179 91 -36 -90 110 311 16 26 117 -177 95 306 -10
3743 -10 -244 -24 -210 -199 59 54 -211 69 -123 14 94 2 -311 92 21 -206 219 253 -172 293 184 96 -200
3766 -200 9 31 -164 -27 -113 -153 -23 0 -182 37 -160 253 14 152 -118 254 233 -190 -77 199 -37 -27
3788 -27 281 -68 -249 39 -115 -6 -82 -318 149 162 -217 -77 10 -123 -136 80 -80 -100 -8 7 -93 224 -73
3811 -73 -54 51 -28 -71 210 55 -69 144 -65 -21 -145 323 99 -121 -181 -127 -226 316 -183 -72 -29 28 -3 88
3835 88 -103 -208 132 -96 51 163 -116 74 176 -20 -154 36 291 -244 -212 -14 -36 -323 219 83 -85
3856 -85 -40 80 -78 35 9 -248 51 -119 -65 85 20 -76 257 497 -110 18 389 -111 -223 274 -48 -161
3878 -161 -80 211 -81 -168 233 257 57 -200 201 82 -127 -300 300 117 -404 -91 285 -80 -32 250 110
3899 110 -275 152 257 -433 290 303 127 -60 -82 -174 190 233 -432 14 269 -22 177 456 -84 -58 205 -194
3921 -194 -413 173 -226 -457 -72 -95 -439 120 -119 -503 294 248 -22 -231 49 -109 -71 75 -224 265 409
3942 409 -631 -5 312 -232 -122 300 -478 -155 428 33 -140 268 274 -175 86 -56 -104 214 -217 -390 80
3963 80 331 -182 -97 115 -156 146 46 -379 -182 488 -96 -28 253 145 -244 197 -214 -122 303 11 -418
3984 -418 49 467 -373 -98 35 -382 70 402 -319 -30 556 103 -253 98 9 -101 313 -38 -151 528
4004 528 169 -364 61 238 -198 37 -105 -162 83 463 -106 -241 164 -171 -29 -226 -232 200 318 -458 156
4025 156 194 -204 -88 186 -5 -448 38 174 -227 -59 128 -118 -409 217 112 -32 33 -256 171 143 -162
4046 -162 -296 227 103 -76 20 149 -199 141 39 -569 125 245 -491 -301 0 -195 -297 127 -87 -134 -71
4067 -71 -84 -79 -175 236 -172 251 -331 61 227 -34 -315 338 208 -346 210 40 -197 98 307 -397 -264 319
4089 319 -40 -248 127 -157 15 -40 -293 -153 356 -360 155 428 -93 -13 385 75 -388 131 233 -387 -331
4110 -331 433 -188 -165 -147 137 127 86 -230 -50 465 -151 100 -26 -208 121 460 214 -296 220 421 -113
4131 -113 30 328 -147 -249 -225 -187 32 -468 -117 -168 154 -26 -316 138 -159 -162 349 50 -275 19 306 59
4153 59 -159 6 -95 112 -304 -126 18 -53 -234 138 -106 -83 -66 182 185 -86 255 -33 -535 -85 295 -291
4175 -291 -286 -120 137 51 -198 75 19 10 -72 171 93 -178 97 -82 -12 -188 134 234 -245 124 67 -215 -308 -131
4199 -131 73 83 15 -71 12 -320 138 185 -45 125 -165 316 -122 119 165 76 -231 -62 129 -54 -150 -51 202
4222 202 -201 -79 142 -16 257 74 -1 -210 -91 140 138 -55 -88 89 167 26 258 194 -40 -48 10 -17 -25 148
4246 148 21 -7 -80 -188 150 84 -183 -66 -64 -163 -16 140 177 -189 207 -30 -174 51 185 125 -147 387 71
4269 71 -118 -181 -168 -145 -104 -178 69 121 -270 -148 68 -118 -50 20 -275 -64 113 79 -357 118 -119 -69 108 64
4293 64 78 -76 81 228 145 -84 -383 83 360 -355 -160 -31 -119 -160 190 43 -315 106 131 -233 -230 233 160
4316 160 -180 17 68 66 -105 -91 131 200 -178 -87 86 -21 94 53 -30 -12 127 -45 51 107 -53 -142 329 -71
4340 -71 -274 228 -43 -176 126 221 165 -59 46 -118 126 -24 352 126 -156 -48 4 -191 -13 -38 72 -230
4362 -230 -116 257 195 -77 -4 306 -260 -272 -75 -5 -91 105 130 109 -24 152 -218 -157 -53 85 111 -332 108
4385 108 -109 107 -29 -146 -119 -70 10 -61 -115 -51 43 -1 -235 -31 -80 -127 29 4 -169 -66 -164 190 -2 -132
4409 -132 -104 -162 -65 -211 287 -14 -324 284 255 -221 -99 25 9 -51 90 -58 -36 302 -9 117 139 -219 32
4432 32 31 -101 110 167 -199 -348 143 179 -61 -188 -3 19 370 333 -198 -31 534 30 -21 293 49 17 370
4455 370 -97 41 327 15 131 320 -59 168 195 218 14 172 420 -244 151 18 -64 26 234 -202 -47
4476 -47 -14 -291 -169 -27 -50 -115 -126 -263 6 -103 -60 16 104 282 85 105 -12 114 246 149 -315 107 380
4499 380 -41 -141 351 95 -62 -87 -148 -259 144 -234 -161 -15 110 -338 -53 100 -30 75 8 -411 -74
4520 -74 256 -247 8 -217 -10 39 -29 -53 -159 250 4 -301 -51 -112 -57 52 -22 -223 29 160 -132 -16
4542 -16 72 48 268 -99 38 289 97 -113 -51 145 -207 -26 43 -30 -104 74 254 -465 -87 205 115 -235 19
4565 19 88 -7 -209 -2 82 252 -194 -62 181 -169 60 364 -3 176 429 -213 -447 -93 280 -87 45
4586 45 119 -38 286 86 -169 101 -308 -236 -112 277 -198 -231 16 135 -296 -74 -7 -160 28 19 -251 -50
4608 -50 -144 209 150 -131 219 285 162 -275 81 178 -12 55 249 -349 -134 267 17 -33 -116 115 117 -165 69
4631 69 -142 178 27 -37 202 32 -348 -35 2 -315 86 135 -229 63 87 346 -319 -149 -130 -190 136 101 66
4654 66 114 -10 323 -66 218 85 -45 100 -316 -21 61 -250 -198 162 73 -321 -225 149 -102 212 56 22
4676 22 347 183 72 92 -110 164 194 21 -424 16 306 -370 -206 221 -174 105 62 35 37 107 43 -167 44
4699 44 8 9 -7 -67 -277 160 -214 -25 14 7 -102 -23 61 -47 27 149 100 -186 -43 -131 24 -213 7 155 81
4724 81 -40 -249 108 2 -36 26 -58 32 211 -217 -80 -99 -132 -209 23 35 39 -93 -170 -137 -302 126 -271 -354 43
4749 43 225 -263 150 51 23 -254 282 7 -266 122 84 -59 144 61 -114 -64 -19 -160 41 -618 -173 266
4771 266 54 -34 -111 90 -184 -59 29 65 67 39 -47 96 11 73 99 -64 16 -7 93 276 13 107 76 28 186
4796 186 22 -97 -223 48 96 189 269 26 7 -71 227 -83 -72 -89 28 205 -27 203 121 -131 42 -157 301
4819 301 333 -16 154 158 -9 -233 -202 131 -173 -90 186 77 -164 178 303 -174 72 -33 63 3 -163 414
4841 414 46 -273 114 25 43 -133 -155 -175 -109 -333 -82 294 -343 117 22 43 -119 107 -143 -17 -136 -198 -42
4864 -42 20 -97 -244 123 -66 -79 -2 2 35 49 -169 82 -25 -123 -207 147 -61 -117 -103 249 58 302 301 -49 96
4889 96 9 91 -223 -76 232 49 319 138 -573 146 -236 -226 -19 196 -103 8 18 -46 106 213 143 -167
4911 -167 161 -199 -169 -113 141 304 229 23 -49 258 430 -433 350 -73 -64 -32 240 -47 -147 -74 -87 5 107
4934 107 120 72 190 -98 2 156 -278 -42 297 73 14 180 107 -6 244 238 -121 62 239 120 180 -131
4956 -131 -116 209 42 -47 -69 182 -38 -348 -17 274 111 119 -144 -225 86 12 -215 -105 185 60 112 93 -172
4979 -172 45 109 -40 -141 -152 -23 -115 -143 67 -171 167 12 -33 321 223 -12 140 -20 103 95 -54 -125 210
5002 210 228 -382 82 198 -28 328 318 -60 39 228 -241 -330 -98 71 -118 -123 18 -337 126 -124 -96 142
5024 142 194 -168 366 140 15 35 -158 64 -116 234 3 -153 110 93 -28 150 -204 -57 71 -201 -47
5045 -47 142 18 -66 -170 38 41 193 130 -368 234 96 250 -16 57 -44 -135 -114 81 8 97 -47 -212 170
5068 170 102 -48 -216 129 -6 81 -9 -1 92 142 -143 79 99 164 15 -22 50 -127 -17 213 -55 18 235 208
5092 208 -221 -269 99 69 114 -126 3 -155 22 -32 4 -90 59 305 25 -220 29 195 62 -77 -179 95
5114 95 -101 -151 196 159 -109 -241 -131 350 -220 -128 255 -298 -163 127 3 -37 -74 -109 35 -2 -108 -102 35
5137 35 6 -105 136 159 43 -143 259 -74 47 342 70 115 71 103 71 -210 -178 -28 72 -225 -100 306 35
5160 35 -125 -106 226 27 -18 309 -90 2 216 48 -30 23 51 73 338 35 -248 248 90 168 29 -106 -168
5183 -168 26 -154 -331 75 -33 111 242 -84 -227 -28 10 -43 -180 -244 5 132 -72 72 195 23 -139
5204 -139 -151 279 66 -51 4 194 20 34 -315 45 -2 -147 -52 -63 -221 38 -126 81 -234 -247 -78 -266
5226 -266 63 -70 69 -189 281 -121 -33 -92 -159 -218 -9 81 -87 74 -60 198 98 -18 319 -12 -50 -206
5248 -206 12 12 111 26 137 172 -33 0 -68 156 60 169 -72 -129 88 192 -110 61 -94 29 -255 67 162
5271 162 108 -139 -86 -19 70 65 -191 138 -84 153 377 -213 12 99 -200 20 196 -75 -62 72 -26 187 -210
5294 -210 -149 84 123 -207 23 271 13 -15 -147 -369 -111 -32 -215 -83 -94 -30 116 47 -69 3 -58 128 242
5317 242 141 18 -119 103 -49 -102 158 -101 -103 -13 86 125 -179 -116 -58 185 -267 -37 -159 -26 -9 -207 -228
5340 -228 293 -77 -40 -10 33 93 19 21 -210 -27 -146 -205 -30 58 182 -225 -40 385 -93 -72 -28 47 122 -162
5364 -162 84 -56 -49 -12 26 -288 -141 111 -169 -73 148 35 -28 244 -203 8 89 73 132 53 -93 -205 -22
5387 -22 -60 -132 97 -205 -269 116 246 50 -4 247 109 -286 183 -14 -127 186 -246 158 -114 53 259 2
5409 2 -199 -41 175 -15 -99 11 190 39 90 33 -242 191 14 -42 -108 70 73 -116 103 -59 77 20 -164
5432 -164 -113 59 -108 91 -120 48 -177 413 -290 -174 -65 -22 -67 -532 94 -213 -150 -70 82 22 -132 -59
5454 -59 -216 -38 -24 5 10 -34 144 -14 -12 45 39 -188 -68 -110 -21 233 203 338 0 229 143 48 -24 89 37 120
5480 120 -130 -20 163 -61 -156 -19 -60 -273 -223 -49 107 -168 -41 148 -99 288 181 -115 83 321 6
5501 6 -287 -47 -34 79 146 87 -202 98 191 -177 84 85 -137 -83 262 -164 -82 34 -179 206 201 113 -138 153
5525 153 0 -31 125 122 -27 -47 97 -96 108 188 119 -76 93 -245 36 -97 -159 329 195 3 274 -161
5547 -161 135 -11 -93 -20 -66 -84 -96 28 53 -21 -360 -66 352 4 -216 -87 20 52 101 -183 -45 -75 -250
5570 -250 -65 2 -15 -55 31 -46 177 -90 -100 288 24 -33 -78 -76 -128 -134 127 97 229 -263 20 38 266 -6 69
5595 69 -185 -361 138 112 -25 0 21 125 -169 424 2 -339 51 -37 175 -37 158 328 -125 40 58 31
5617 31 -240 17 -76 -286 24 63 120 -35 7 20 238 136 185 -48 83 -186 95 -227 -152 -164 85 -89 -82 175
5641 175 -51 -87 -147 298 -387 -46 -39 -135 -130 15 -55 74 -78 -134 -8 -60 139 207 -78 -64 -17 164 233 -226 75
5666 75 177 223 6 -134 -5 82 -62 -52 2 -81 -238 -110 98 -82 139 -194 -37 -8 90 -154 -186 216 -278
5689 -278 163 -89 -110 -117 -146 90 -31 83 -31 -217 -27 316 -171 126 -162 -30 20 101 -312 -72 -10 136
5711 136 -54 47 36 11 182 -140 192 199 -16 33 44 54 -150 -182 -80 -64 -29 302 98 -30 -7 -50 54 67
5735 67 178 -39 -79 -27 -137 54 34 -136 153 16 27 218 192 -72 -63 -318 -26 -258 189 -271 -74 236 179
5758 179 267 99 211 -97 18 204 -74 44 116 131 265 121 -47 -267 102 127 86 -126 -44 -196 -68 17
5780 17 158 126 -98 -65 31 -168 72 180 111 -102 -49 -145 -144 335 -135 -3 18 109 91 136 45 -29 101 -153 -78
5805 -78 63 76 -115 -95 -96 -74 -250 -247 171 -108 -102 142 -66 15 22 -72 239 35 47 63 -35 -140 -137 -134 -146 0 28 -78
5833 -78 -185 50 -78 72 -104 -203 -161 133 148 -36 -43 68 -96 245 70 -133 -25 69 12 -100 105 11 101
5856 101 222 82 314 -8 225 203 -205 -266 -90 255 221 -115 -175 -90 -110 232 -23 -113 68 213 157 1 183
5879 183 -25 42 191 164 111 31 -174 -25 -7 -46 29 266 -228 76 -74 137 -170 -86 -15 -173 -99 -87 111 -4
5903 -4 112 -207 -139 -250 -168 99 -14 -129 -65 -6 24 224 286 214 107 107 65 46 113 8 176 27 61 77 -252
5928 -252 -202 -44 -52 1 -194 -81 -307 -5 -49 110 45 -93 149 -143 2 120 147 -73 -248 -83 69 40 -40
5951 -40 26 -33 51 -138 79 153 -371 -24 0 -3 -200 -120 239 -195 -102 23 -260 -24 52 -42 240 30 -51 292
5975 292 -52 -29 207 273 76 -217 130 73 -65 -457 -15 39 61 287 -115 -202 131 -9 -15 -198 -13 -107 -177
5998 -177 160 -132 272 -115 55 60 175 -65 75 3 -70 90 188 -15 -31 -18 -112 122 -261 -99 -117 121 -138
6021 -138 -8 -24 -256 -255 216 106 3 38 -89 72 -10 -56 -123 165 57 -207 5 -235 227 219 -114 -173 202
6044 202 3 -211 -29 -72 -45 -24 -176 -76 61 -44 224 12 145 -248 70 -38 271 189 232 190 -50 -120
6066 -120 -212 150 84 127 69 25 -84 -87 61 161 132 -74 -27 175 357 -239 122 110 23 111 64 -2 -249 -195 -6
6091 -6 -50 -71 61 -21 -77 -8 -49 -105 -47 -214 -169 -59 162 -113 62 -148 -215 -138 116 -53 -54 256 280 -103 103
6116 103 169 -228 -86 -240 96 122 -9 45 -17 140 173 -92 30 7 263 -176 -174 -226 42 -20 -2 22 236 -25
6140 -25 -339 242 136 -360 -13 -203 -29 -100 188 -27 161 24 -117 262 49 47 -164 77 -184 -146 -123 202
6162 202 -242 127 120 -196 199 109 -373 182 179 118 -115 -170 -140 -220 34 -107 176 -69 -163 156 108 -226 -241 -22
6186 -22 111 218 52 182 -242 22 230 73 24 -40 165 231 149 63 -112 344 -16 10 -69 -281 3 210 245
6209 245 -69 -80 -82 121 -174 120 139 151 13 -337 -34 175 -391 190 -124 -95 -98 -321 -297 135 -135 47 215
6232 215 -56 28 42 264 3 129 250 19 83 -153 -102 -145 116 25 59 -70 -101 -27 66 -17 7 78 -206 -138 -48
6257 -48 163 -148 -63 312 101 19 -190 -7 -66 84 17 154 93 -18 -62 -59 -156 -26 -190 118 -177 71 120 -32
6281 -32 -60 -100 -126 -107 -115 -378 -19 -229 284 202 35 -149 -43 -55 157 -119 -44 -53 -80 53 17 199 62 191 -87
6306 -87 -35 -96 -27 -308 53 -64 142 109 149 116 234 349 -177 -21 -98 99 33 7 -56 155 155 104 -112 -39 -251
6331 -251 253 287 166 -87 -55 94 189 -80 292 115 24 -131 255 72 -130 -157 178 -96 -183 243 -142 168
6353 168 -94 197 -194 -127 -222 117 -233 82 -110 -36 -160 39 -150 -4 -104 -119 77 -199 35 -24 138 224
6375 224 -107 54 45 86 -14 -25 70 -76 -56 24 38 103 -21 226 -124 -104 168 -64 -68 -152 35 -160 -113 115 -8
6400 -8 65 11 206 217 118 -66 54 28 240 194 -20 119 15 236 -12 -15 -148 186 -97 -28 -72 50 -46 106
6424 106 -103 7 52 -150 107 38 -85 226 300 187 -11 -31 -126 133 -61 -1 -16 153 109 -129 172 -143 -38
6447 -38 122 -137 -171 129 138 114 120 -92 15 -91 -67 -29 -79 -228 167 -121 102 -164 16 147 -101 -16 -19 240
6471 240 -135 110 -40 105 -17 -13 65 26 -72 -176 -108 255 -25 -246 225 -74 -153 23 21 12 58 64 55 33 136 -75
6497 -75 -19 -271 200 33 87 -68 -43 258 -71 -85 -20 -320 -44 0 -162 -249 -158 -57 -251 70 55 219 -4
6520 -4 -69 -206 27 61 -242 -72 152 -19 -73 -21 -134 -198 -80 322 -11 244 252 -109 309 -117 -48 -82 21 110
6544 110 -254 -88 -262 201 26 -91 84 -46 46 -84 214 30 196 -32 2 21 220 -3 19 200 141 129
6566 129 81 18 -49 257 139 145 -185 114 33 -16 41 191 -69 96 38 219 184 -435 49 37 -177 -128 51 -125
6590 -125 -65 -126 -55 27 -162 -60 65 -84 43 -29 -175 -340 33 -229 187 148 -113 -62 59 166 -15 88
6612 88 18 -33 58 -192 -45 -87 148 284 64 47 5 157 131 42 55 -113 -156 182 -195 47 218 -185 34 4
6636 4 -48 -187 28 86 -55 266 -291 -98 -389 131 -105 -67 72 -204 191 83 44 6 -42 -163 -30 -101 -8
6659 -8 -10 -244 -135 -60 55 164 -46 11 180 -279 114 37 71 66 144 102 39 -172 -18 -198 31 -178 273 44
6683 44 163 -137 207 292 8 -16 -118 287 -91 253 22 -250 -99 95 -35 -110 -51 103 -123 -147 -55 -142 116
6706 116 -190 -239 114 291 -99 -41 -337 148 -116 -139 186 -194 48 -32 106 -19 -77 243 -231 75 114 -327
6728 -327 -29 -31 -142 -137 17 227 -213 -82 -71 82 64 175 69 212 90 100 -168 279 -23 29 163 -176 -53
6751 -53 -332 69 -60 -111 -93 -115 258 -116 -99 164 55 -24 -179 -96 121 174 81 98 6 -36 -35 27 -36 -52 77 138
6777 138 -49 -288 8 83 -152 -78 -68 -98 -390 -90 125 65 179 297 90 27 -87 -74 -211 34 189 75
6799 75 139 90 92 75 -221 -182 158 119 59 -37 54 -79 74 -111 49 -35 -132 -71 -119 0 -12 -117 -232 78 -69
6824 -69 -26 88 64 -142 103 34 193 -29 197 38 -155 100 41 32 -70 147 18 -5 -59 -132 63 191 28
6847 28 -36 -173 -88 -118 170 -21 33 -178 -211 -7 -86 204 82 159 -272 -174 -43 140 -94 56 142 120 12 181
6871 181 44 179 -247 26 128 187 -83 80 106 -152 101 -144 -74 -21 -30 79 -185 -69 126 -247 1 -138
6893 -138 -48 154 186 101 -54 -127 19 169 232 -221 -182 245 -23 136 70 122 392 130 -96 123 -122 82 -81
6916 -81 -24 -2 -57 128 -40 -108 4 213 268 137 -15 184 54 92 -35 -47 104 31 -15 125 -144 108 -77
6939 -77 -68 -9 -121 -138 -63 72 -38 -311 29 -126 -123 163 72 -244 -178 -1 30 -175 46 9 -157 -193 -284 132 -32
6964 -32 -55 85 75 -318 -337 75 -98 63 -28 96 -145 84 244 -166 -242 91 -31 -93 198 -289 -146 137
6986 137 -307 -191 194 327 14 259 40 -127 -118 162 244 -84 146 333 -57 55 177 -135 -207 9 214
7007 214 215 -119 -295 113 96 -40 -78 -494 69 -157 -62 -192 142 -196 92 -187 42 -173 -290 143 56 211
7029 211 10 -22 45 -69 -39 -47 -72 -79 88 300 -78 -218 154 -28 20 -165 -28 -38 -84 21 -71 173 -40 -57
7053 -57 -72 -195 -263 -5 221 113 -43 31 -222 -44 -23 66 -105 78 76 77 51 -102 -55 90 105 25 -11 25 -245
7078 -245 -273 -18 -46 -98 30 62 94 99 141 64 -161 63 158 175 106 -42 38 -2 18 -136 137 -114 -11 235 62
7103 62 -164 89 85 -93 44 129 23 -46 -144 60 14 -121 215 170 -61 -195 -117 126 -5 97 287 27 306
7126 306 64 -97 -40 76 -10 164 -131 -88 -145 -84 46 -150 -38 184 0 162 -54 180 -172 -19 76 -41
7148 -41 -140 -99 20 27 36 102 -44 -168 124 16 304 -17 30 294 -104 232 -198 -49 181 -76 70 -276 159
7171 159 -196 -251 23 -43 213 78 95 14 -271 191 34 110 -9 -78 -45 69 68 -51 171 -82 218 -172 80
7194 80 -54 79 48 -4 3 -41 127 -245 76 -29 247 57 78 -21 4 -64 56 -38 -87 251 -171 -91 -102 -2 -227
7219 -227 -13 -157 25 -34 -57 -241 -289 80 -193 -19 -201 33 -186 157 -8 -150 -141 32 50 -96 181 32
7241 32 112 -64 131 -131 -38 105 -116 65 120 104 61 -103 -75 -67 -22 130 21 9 -77 -151 -28 -89 -66 106 -35
7266 -35 31 81 -30 -41 66 -91 237 222 202 -48 80 -193 122 152 160 0 -123 -68 -177 -113 -145 -142 40 -131 83
7291 83 65 95 -103 68 -160 -137 293 -67 174 -317 73 -46 22 52 196 21 -217 -131 -104 -170 69 111 71 35
7315 35 43 -237 58 -71 7 381 100 -167 17 -181 -91 57 59 -181 -72 225 -370 -2 -3 -101 -145 -25 67 197
7339 197 79 -102 -4 -126 -83 -49 199 -85 149 5 85 12 51 -38 105 237 -1 58 -19 153 -37 -25 -93 -68
7363 -68 97 316 -286 116 -32 -124 -55 100 122 226 96 122 242 -200 258 -53 176 21 -185 -248 92 3
7385 3 264 -66 -78 -90 -235 10 -13 -44 15 -226 -151 39 -178 -263 16 73 73 97 108 285 51 -125 -161 -41 183
7410 183 124 61 173 65 -44 36 192 -111 -76 -77 174 -151 -113 21 5 117 154 -14 167 87 101 162 -240 -133
7434 -133 97 62 35 56 44 2 -244 -133 -154 133 -28 72 62 -6 265 -30 9 -56 62 -126 115 121 -52 10
7458 10 -43 244 -131 -87 -23 -84 212 -45 -292 110 -172 -170 55 38 -316 -30 104 11 69 -163 55 59 -33 122
7482 122 110 250 73 -102 159 -187 200 -183 -208 5 63 -6 -206 33 -40 -55 -54 91 -61 -263 -42 117 218
7505 218 -1 -134 181 7 81 -24 142 51 305 -150 -94 109 -68 85 152 -16 69 47 20 -39 -65 7 -40 -29
7529 -29 -44 -145 -187 63 187 127 -1 11 76 -35 -39 119 -192 -76 81 70 79 -10 86 16 -312 -71 53 -162 -192
7554 -192 -4 206 85 -47 -134 47 -101 -149 -216 29 -182 60 -89 143 15 -70 20 -105 -76 -101 99 -27
7576 -27 -231 80 98 -158 -240 -5 112 -14 284 47 195 -182 -132 198 192 57 -16 161 -191 -40 28 -121 -91
7599 -91 -60 64 -50 84 84 151 -242 -61 114 -178 100 -38 -173 49 89 194 -290 103 144 135 -39 101 -135
7622 -135 -30 223 -190 23 -139 137 -212 25 -125 294 -69 -179 -8 -116 108 89 -291 -38 -60 -233 301
7643 301 -16 -92 128 168 -144 -208 105 192 -50 -141 -65 206 135 -199 -298 -137 31 -136 -53 -17 -70 -48 59 237
7667 237 95 11 60 32 -57 10 75 112 -95 -319 -95 97 -112 33 58 173 -4 125 179 -279 230 0 238
7690 238 -1 143 -127 135 29 -126 -243 220 -195 -364 271 -335 -37 48 106 -15 158 36 78 108 -26
7711 -26 -284 -46 147 46 -202 -90 52 -146 17 -45 263 -41 167 -117 15 -126 150 214 -71 179 -117
7732 -117 -29 -156 104 113 -12 -6 154 -75 152 192 -17 53 -10 -235 -81 -73 193 1 -180 -136 30 -96 22 -222
7756 -222 -120 25 109 -178 66 -162 149 303 -160 -122 -249 113 104 -112 -136 -172 92 -212 112 -189 -102 181
7778 181 16 18 -345 5 204 -91 68 279 195 176 -103 -139 181 48 -57 63 31 -11 12 20 -70 -96 -28 -211
7802 -211 -144 111 -102 263 -67 -150 -61 -109 63 -73 159 -73 28 306 222 306 34 -65 189 -9 118 111 184
7825 184 134 -107 10 -163 -117 133 146 -26 170 4 -144 135 -196 -116 16 4 27 -42 -175 -179 -296 -190 22
7848 22 -5 190 168 -20 -109 60 241 -126 28 80 38 144 143 -70 -85 -19 58 29 -151 13 0 67 15 -44 157
7873 157 6 77 -107 148 15 128 36 -181 -163 39 90 96 -41 -247 84 120 -115 -86 105 78 -137 -71 302
7896 302 -24 -143 -390 -62 19 119 -73 77 -106 22 144 -135 59 98 102 259 -4 33 -108 24 7 70
7918 70 -414 143 -80 38 -26 -55 200 108 72 131 -50 -32 132 11 -326 -91 81 -11 78 -96 131 123 285 -6
7942 -6 0 280 62 229 91 22 -40 -82 11 -139 -178 154 27 -172 113 -58 130 -177 93 217 -135 138 -112
7965 -112 47 64 -238 -115 184 -1 -32 -256 201 3 -7 -85 182 126 -345 -183 19 -51 58 -141 169 -30
7987 -30 -98 217 147 -40 19 6 -31 -180 69 34 96 164 78 35 58 225 -52 -57 -23 102 2 23 33 193 107 -98
8013 -98 -110 -288 166 -109 7 -150 -93 -37 -235 181 -1 284 -14 -91 -235 -120 94 84 -9 -296 -54 28 132
8036 132 52 178 165 -55 22 -232 68 253 150 113 -51 -110 20 78 59 139 101 -66 106 -96 135 194 80
8059 80 166 109 -19 36 35 -195 159 -69 35 -54 -142 83 19 -231 200 65 11 -88 -122 43 331 -156 127 -84
8083 -84 -468 133 -34 -235 -196 -226 -12 -64 258 146 43 -22 -194 -231 -147 -131 -108 -58 -210 8 129 -352 12
8106 12 53 57 222 58 107 270 22 71 197 -30 153 -344 258 -231 143 -43 63 277 23 56 189 186 -213
8129 -213 251 25 -18 133 -16 -128 -111 -10 93 -194 20 57 -194 -247 -172 329 -116 -114 265 -75 58 -73
8151 -73 99 -106 79 123 204 127 57 56 58 169 65 144 -18 124 177 34 310 40 125 99 -122 207 -34 -57 55
8176 55 -55 198 229 3 58 159 35 -219 90 -4 -134 143 -11 -200 97
8191I7
##END NTUPLES=NMR FID
##END=
