##TITLE=1H_Ser DHA-N
 200.13MHz, CDCl3,
 8 sc
 
 30.1.2025
##JCAMPDX= 6.0         $$ Bruker NMR JCAMP-DX V2.0
##DATA TYPE= NMR FID
##DATA CLASS= NTUPLES
##ORIGIN= UXNMR, Bruker Analytische Messtechnik GmbH
##OWNER= pz
$$ XWIN-NMR		Version 3.5
$$ Thu Jan 30 17:12:46 2025 Russian Standard Time (UT+4h)  she@DPX200
##.OBSERVE FREQUENCY= 200.1313
##.OBSERVE NUCLEUS= ^1H
##.DELAY= (6, 6)
##.ACQUISITION MODE= SIMULTANEOUS
##.ACQUISITION SCHEME= undefined
##.AVERAGES= 8
##.DIGITISER RES= 18
##SPECTROMETER/DATA SYSTEM= spect
##.PULSE SEQUENCE= zg30
##.SOLVENT NAME= D2O
##.SHIFT REFERENCE= (INTERNAL, D2O, 0, 14.3821)
##AUDIT TRAIL= $$ (NUMBER, WHEN, WHO, WHERE, WHAT)
$$ ##TITLE= Audit trail, XWIN-NMR		Version 3.5
$$ ##JCAMPDX= 5.01
$$ ##ORIGIN= Bruker BioSpin GmbH
$$ ##OWNER= she
$$ F:/spectra/data/she/nmr/H-C/1/audita.txt
$$ ##AUDIT TRAIL=  $$ (NUMBER, WHEN, WHO, WHERE, WHAT)
(   1,<2025-01-30 17:11:29.04 +0400>,<she>,<DPX200>,
      <created by zg, POWCHK disabled, PULCHK disabled
       configuration hash MD5:
       00 E9 B6 7A A2 85 ED C7 34 08 36 98 17 FE 4E 26
       data hash MD5: 16K
       F7 4A E0 03 F3 A0 7F F6 13 29 62 6B E4 DA D9 29>)
$$ ##END=
$$ 
$$ hash MD5
$$ A3 8E 71 6E D3 F6 AC ED FF 66 94 CB B4 E5 42 6F
##$RELAX= 
##$RELAX= 
##$RELAX= 
##$RELAX= 
##$RELAX= 
##$RELAX= 
$$ Bruker specific parameters
$$ --------------------------
##$DU= <F:/spectra>
##$EXPNO= 1
##$NAME= <H-C>
##$PROCNO= 1
##$TYPE= <nmr>
##$USER= <she>
##$AMP= (0..31)
100 100 100 100 100 100 100 100 100 100 100 100 100 100 100 100 100 100 
100 100 100 100 100 100 100 100 100 100 100 100 100 100 
##$AQSEQ= 0
##$AQ_mod= 1
##$AUNM= <au_zg>
##$AUTOPOS= <>
##$BF1= 200.13
##$BF2= 200.13
##$BF3= 200.13
##$BF4= 200.13
##$BF5= 200.13
##$BF6= 200.13
##$BF7= 200.13
##$BF8= 200.13
##$BYTORDA= 1
##$CFDGTYP= 0
##$CFRGTYP= 5
##$CHEMSTR= <none>
##$CNST= (0..31)
1 1 145 1 1 1 1 1 1 1 1 1 1 1 1 1 1 1 1 1 1 1 1 1 1 1 1 1 1 1 1 1 
##$CPDPRG= <>
##$CPDPRG1= <>
##$CPDPRG2= <>
##$CPDPRG3= <>
##$CPDPRG4= <mlev>
##$CPDPRG5= <mlev>
##$CPDPRG6= <mlev>
##$CPDPRG7= <mlev>
##$CPDPRG8= <mlev>
##$CPDPRGB= <>
##$CPDPRGT= <>
##$D= (0..31)
0 0.7 0 0 0 0 0 0 0 0 0 0.03 0 0 0 0 0 0 0 0 0 0 0 0 0 0 0 0 0 0 0 0 
##$DATE= 1738242688
##$DBL= (0..7)
120 120 120 120 120 120 120 120 
##$DBP= (0..7)
150 150 150 150 150 150 150 150 
##$DBP07= 0
##$DBPNAM0= <>
##$DBPNAM1= <>
##$DBPNAM2= <>
##$DBPNAM3= <>
##$DBPNAM4= <>
##$DBPNAM5= <>
##$DBPNAM6= <>
##$DBPNAM7= <>
##$DBPOAL= (0..7)
0.5 0.5 0.5 0.5 0.5 0.5 0.5 0.5 
##$DBPOFFS= (0..7)
0 0 0 0 0 0 0 0 
##$DE= 6
##$DECBNUC= <off>
##$DECIM= 32
##$DECNUC= <off>
##$DECSTAT= 4
##$DIGMOD= 1
##$DIGTYP= 9
##$DL= (0..7)
0 120 120 120 120 120 120 120 
##$DP= (0..7)
150 150 150 150 150 150 150 150 
##$DP07= 0
##$DPNAME0= <>
##$DPNAME1= <>
##$DPNAME2= <>
##$DPNAME3= <>
##$DPNAME4= <>
##$DPNAME5= <>
##$DPNAME6= <>
##$DPNAME7= <>
##$DPOAL= (0..7)
0.5 0.5 0.5 0.5 0.5 0.5 0.5 0.5 
##$DPOFFS= (0..7)
0 0 0 0 0 0 0 0 
##$DQDMODE= 0
##$DR= 18
##$DS= 0
##$DSLIST= <SSSSSSSSSSSSSSS>
$$ [...]
##$SUBNAM0= <"">
##$SUBNAM1= <"">
##$SUBNAM2= <"">
##$SUBNAM3= <"">
##$SUBNAM4= <"">
##$SUBNAM5= <"">
##$SUBNAM6= <"">
##$SUBNAM7= <"">
##$SUBNAM8= <"">
##$SUBNAM9= <"">
##$SW= 18.0517328524113
##$SWIBOX= (0..15)
0 0 2 0 0 0 0 0 0 0 0 0 0 0 0 0 
##$SW_h= 3612.71676300578
##$TD= 16384
##$TD0= 1
##$TE= 0
##$TE2= 300
##$TE3= 300
##$TEG= 300
##$TL= (0..7)
0 120 120 120 120 120 120 120 
##$TP= (0..7)
150 150 150 150 150 150 150 150 
##$TP07= 0
##$TPNAME0= <>
##$TPNAME1= <>
##$TPNAME2= <>
##$TPNAME3= <>
##$TPNAME4= <>
##$TPNAME5= <>
##$TPNAME6= <>
##$TPNAME7= <>
##$TPOAL= (0..7)
0.5 0.5 0.5 0.5 0.5 0.5 0.5 0.5 
##$TPOFFS= (0..7)
0 0 0 0 0 0 0 0 
##$TUNHIN= 0
##$TUNHOUT= 0
##$TUNXOUT= 0
##$USERA1= <user>
##$USERA2= <user>
##$USERA3= <user>
##$USERA4= <user>
##$USERA5= <user>
##$V9= 5
##$VALIST= <valist>
##$VCLIST= <CCCCCCCCCCCCCCC>
##$VD= 0
##$VDLIST= <DDDDDDDDDDDDDDD>
##$VPLIST= <PPPPPPPPPPPPPPP>
##$VTLIST= <TTTTTTTTTTTTTTT>
##$WBST= 1024
##$WBSW= 4
##$XGAIN= (0..3)
0 0 0 0 
##$XL= 0
##$YL= 0
##$YMAX_a= 208974
##$YMIN_a= -203507
##$ZGOPTNS= <>
##$ZL1= 120
##$ZL2= 120
##$ZL3= 120
##$ZL4= 120
##$ABSF1= 10
##$ABSF2= 0
##$ABSG= 5
##$ABSL= 3
##$ALPHA= 0
##$AQORDER= 0
##$ASSFAC= 0
##$ASSFACI= 0
##$ASSFACX= 0
##$ASSWID= 0
##$AUNMP= <proc_1d>
##$AZFE= 0.1
##$AZFW= 0.1
##$BCFW= 1
##$BC_mod= 2
##$BYTORDP= 1
##$COROFFS= 0
##$CY= -3
##$DATMOD= 1
##$DC= 2
##$DFILT= <>
##$DTYPP= 0
##$F1P= 0
##$F2P= 0
##$FCOR= 0.5
##$FTSIZE= 0
##$FT_mod= 4
##$GAMMA= 1
##$GB= 0.15
##$INTBC= 1
##$INTSCL= 1
##$ISEN= 128
##$LB= 0.25
##$LEV0= 0
##$LPBIN= 0
##$MAXI= 10000
##$MC2= 0
##$MEAN= 0
##$ME_mod= 0
##$MI= 1.114404
##$NCOEF= 0
##$NC_proc= 0
##$NLEV= 6
##$NOISF1= 3.799351
##$NOISF2= 2.8
##$NSP= 1
##$NTH_PI= 0
##$NZP= 0
##$OFFSET= 14.38212
##$PC= 1
##$PHC0= 245.3673
##$PHC1= 20.39223
##$PH_mod= 1
##$PKNL= yes
##$PPARMOD= 0
##$PSCAL= 0
##$PSIGN= 0
##$REVERSE= no
##$SF= 200.129724274929
##$SI= 16384
##$SIGF1= 3
##$SIGF2= 2
##$SINO= 400
##$SIOLD= 16384
##$SREGLST= <1H.CDCl3>
##$SSB= 0
##$STSI= 0
##$STSR= 0
##$SW_p= 3205.1282051282
##$SYMM= 0
##$S_DEV= 0
##$TDeff= 0
##$TDoff= 0
##$TI= <>
##$TILT= no
##$TM1= 0
##$TM2= 0
##$TOPLEV= 0
##$USERP1= <user>
##$USERP2= <user>
##$USERP3= <user>
##$USERP4= <user>
##$USERP5= <user>
##$WDW= 1
##$XDIM= 8192
##$YMAX_p= 0
##$YMIN_p= 0
$$ End of Bruker specific parameters
$$ ---------------------------------
##NTUPLES= NMR FID
##VAR_NAME=  TIME,          FID/REAL,        FID/IMAG
##SYMBOL=    X,             R,               I
##VAR_TYPE=  INDEPENDENT,   DEPENDENT,       DEPENDENT
##VAR_FORM=  AFFN,          ASDF,            ASDF
##VAR_DIM=   8192,          8192,            8192
##UNITS=     SECONDS,       ARBITRARY UNITS, ARBITRARY UNITS
##FACTOR=    0.0002768,     1,               1
##FIRST=     0,             0,               0
##LAST=      2.2672688,     0,               0
##MIN=       0,             -203507,         0
##MAX=       2.2672688,     208974,          0
$$ Real data points
##PAGE= N=1
##DATA TABLE= (X++(R..R)), XYDATA
0 0 0 0 0 0 0 0 0 0 0 0 0 0 0 0 0 0 0 0 0 -5 8 -8 8 -8 8 -8 13 -16 16 -20 24 -24 29 -32 37 -40 45 -49 57 -62 69
41 69 -77 85 -94 104 -116 128 -140 156 -169 187 -207 229 -253 277 -308 344 -386 432 -492 560 -645
62 -645 762 -913 1131 -1463 2033 -3204 6584 -38848 -169378 -177604 -180108 -192509 -131363 -19647
76 -19647 53235 120944 193483 204215 151165 100712 34215 -68513 -143100 -166276 -181566 -165017
88 -165017 -88290 2313 70372 130306 174666 173777 127054 66095 -4469 -84586 -141971 -158055
100 -158055 -150521 -114825 -44901 30594 89963 139812 167955 141447 76129 22491 -32182 -110721
112 -110721 -158139 -145078 -116430 -76045 -2779 68730 109340 136477 144400 105359 44263 -5599
124 -5599 -62501 -121937 -135657 -112980 -90865 -44799 28899 80933 104721 122687 115356 67630
136 67630 10961 -34944 -82665 -116540 -110396 -86275 -56123 761 61892 88060 98310 108594
148 108594 87365 29286 -23878 -57284 -90453 -112336 -97208 -60975 -22198 28578 76520 95785
160 95785 97381 88028 52687 -367 -42885 -70810 -94648 -99024 -69809 -30824 4751 49112 86794
173 86794 93350 81014 59988 21836 -26318 -62238 -82059 -90834 -76869 -39674 -3874 26793
185 26793 66912 91326 79668 57523 37496 422 -45887 -72782 -79112 -76846 -56889 -18118
197 -18118 17814 47772 77476 84126 62905 40001 12742 -30036 -64727 -74408 -72975 -64260 -33710
210 -33710 8959 39366 61661 80486 76923 50847 21938 -12091 -49937 -71453 -74141 -69016 -49204
223 -49204 -9325 29146 50089 65689 77363 63200 29872 -510 -29470 -58235 -71395 -67070
235 -67070 -52569 -25765 12131 43321 59364 68887 70069 45407 8958 -18203 -44628 -69369
247 -69369 -73910 -58634 -36863 -9012 26910 55796 66969 68389 58823 30426 -3239 -29114 -55073
260 -55073 -72179 -64812 -44797 -24829 4584 41209 62768 63350 57557 43979 12728 -20264 -43104
273 -43104 -61041 -66893 -51963 -30415 -7021 23933 53177 63517 58949 50235 29859 -4520 -33603
286 -33603 -49799 -62573 -63303 -43743 -17678 6558 33844 55680 61099 53502 39440 14557 -16758
299 -16758 -38817 -50634 -59912 -53871 -28117 -2004 18643 41258 58147 57186 42754 22783 -2164
312 -2164 -29280 -46552 -55012 -56733 -41711 -13641 9496 29258 50113 59314 49808 31694 12762
325 12762 -12463 -37656 -49525 -50612 -46257 -29114 -3437 18146 35863 49417 49416 37422 21115
338 21115 890 -23928 -42694 -45842 -42728 -35901 -15626 11040 29206 41141 47764 43029 27453
351 27453 8275 -13086 -34563 -45412 -44471 -38201 -26257 -2736 21535 34486 41978 45590 35319
364 35319 15904 -2598 -20441 -36856 -43733 -38723 -28248 -13261 8076 26977 35595 40197 37757
377 37757 21870 2776 -11796 -26511 -39805 -40914 -29597 -16257 -2430 16867 32531 37799
389 37799 37769 29465 11777 -4985 -18730 -33096 -40668 -34148 -20708 -8707 6689 25549 35709
402 35709 34332 30787 20293 1665 -14294 -25794 -34791 -36126 -26793 -12764 1450 17101 31196
415 31196 34824 30765 24959 11107 -8490 -21651 -28457 -33231 -31676 -20134 -4314 9786 22087
428 22087 31042 31701 25319 16605 1226 -15615 -24580 -28263 -30271 -24413 -9660 5752 16358 25610
442 25610 31938 28195 17993 6943 -7262 -22162 -28915 -29220 -27109 -17144 -785 11914 21262 30091
456 30091 31891 22383 10902 1546 -13212 -26879 -29356 -25642 -20877 -9541 5305 16557 24638
469 24638 29005 25110 14018 4504 -5652 -20194 -28262 -25837 -20810 -14283 -824 12797 21664 26427
483 26427 27073 20263 8724 -2371 -13077 -23673 -28176 -24515 -17545 -8508 4819 17216 23365 25622
497 25622 24276 16428 2711 -9250 -16748 -23813 -26299 -20241 -10062 -37 11213 20279 23621 22684
511 22684 18829 8162 -5223 -13658 -19655 -25640 -24296 -14487 -4533 5090 17001 23718 23483 20948
525 20948 13965 2023 -9620 -15946 -21506 -23921 -18279 -8971 -1105 9095 19346 22093 20006 16198
539 16198 8279 -3622 -13471 -19104 -21808 -20025 -12252 -3606 5544 15719 21422 20757 16935 11017 1691
554 1691 -9683 -17460 -20608 -20553 -16723 -8394 1377 9899 17632 21397 19079 13162 6612 -2638 -12719
569 -12719 -18335 -18617 -16566 -12356 -3016 6892 12303 16851 19818 15672 7384 440 -7097 -15199 -18474
584 -18474 -17633 -13937 -6736 3501 10632 14775 18967 18570 10456 2985 -3081 -10976 -16859 -17599 -15028
599 -15028 -10029 -2065 6481 12114 15716 17932 14574 6152 -477 -6828 -14365 -17477 -15268 -10992 -4960
614 -4960 2599 10078 14130 15650 14598 9911 2632 -4419 -10966 -15763 -15726 -12753 -8557 -1615 6750 12604
630 12604 14801 13970 12142 6723 -1565 -8107 -12096 -14580 -13550 -9574 -4399 2158 9602 14203 14323
645 14323 12274 9125 1877 -6393 -10735 -13347 -15055 -12124 -5394 543 6130 12203 14804 12896 9620
660 9620 5145 -1744 -8121 -10945 -13675 -13394 -7919 -2286 2887 8193 12981 13092 9983 6179 915 -5401
676 -5401 -10147 -12234 -12666 -9754 -3934 1339 6168 10738 13584 11839 7874 3607 -1952 -8486 -12057
691 -12057 -12196 -11393 -7772 -1582 4480 8397 11624 12279 10148 5220 327 -5021 -9763 -11037 -10315 -8555
707 -8555 -4532 2261 7043 9231 11074 10785 7019 1739 -3278 -7997 -10685 -10989 -9170 -6242 -713 4933
723 4933 8265 10151 11275 9361 4299 -309 -4560 -8732 -11089 -10080 -7236 -3995 1607 6554 9077
738 9077 10162 9667 5768 1259 -2857 -6357 -9758 -10410 -7671 -4510 -607 4340 8777 9978 9701 7468
754 7468 3574 -1159 -5429 -8879 -10441 -9128 -5784 -2669 966 6375 9542 9247 8004 5748 1363
769 1363 -3142 -6240 -8506 -9233 -7606 -3760 -162 3994 7339 8811 7999 6605 3191 -1870 -5494 -7630
785 -7630 -8335 -8848 -5467 -941 2796 5562 8915 8952 7412 4728 812 -4087 -6674 -8296 -8806 -7287
801 -7287 -3423 836 4124 6386 8657 7861 5100 2532 -1130 -5311 -7146 -7654 -7023 -4658 -1077 2598
817 2598 5050 7473 7962 6397 3038 461 -3258 -6882 -7645 -6937 -5743 -3196 906 4063 6814 7670
833 7670 7100 4787 1637 -1367 -4902 -7640 -7066 -5990 -4581 -1148 2975 5415 6915 6830 5742 3080
849 3080 -429 -3183 -5726 -7395 -6580 -4953 -2599 1122 4258 5805 6855 6603 4463 1285 -1638 -3880
865 -3880 -6329 -6898 -5704 -3194 -513 2557 4937 6114 6262 5024 2389 -891 -3153 -5185 -6349 -6444
881 -6444 -3799 -1244 1099 3712 5633 6252 5457 3622 657 -2484 -4431 -5757 -6246 -5051 -2637 -333
897 -333 2245 4998 5886 5481 4163 2789 -461 -3501 -4933 -5109 -5179 -3757 -839 1427 3531 5578 5551
914 5551 4419 2875 664 -2424 -4640 -5028 -5050 -4584 -2381 662 2591 4568 5825 5375 3639 1788
930 1788 -700 -3357 -4980 -5171 -4886 -3438 -1112 1827 3306 4918 5584 4192 2074 370 -1926 -3785
946 -3785 -4639 -4748 -3511 -1481 872 2956 4246 4952 4815 2839 970 -801 -3300 -5013 -4899 -3831
962 -3831 -2592 -639 1555 3549 4358 4721 4166 2060 -57 -1771 -3920 -4883 -4139 -2915 -1633 474
978 474 2937 4153 3935 3955 2714 602 -1561 -3019 -4135 -4489 -3684 -1893 -317 2110 4160 4151 4110 3600
996 3600 2109 -775 -2276 -3371 -4462 -4071 -2962 -1396 655 2556 3597 4303 3490 2446 627 -1398
1012 -1398 -2535 -3633 -4042 -3211 -1408 239 1655 3214 4086 3636 2421 1169 -269 -2296 -3594 -3955
1028 -3955 -3489 -2270 -788 882 2249 3928 4121 3141 1750 885 -1083 -3093 -3668 -3668 -3101 -1323 371
1045 371 1510 2861 3595 3515 2280 1220 -344 -2343 -3565 -3293 -2933 -2451 -339 1457 2336 3188 3663
1062 3663 2904 1507 89 -1201 -2701 -3276 -3170 -2721 -1355 696 1943 2684 3377 3430 2183 508 -858
1079 -858 -2365 -2922 -3372 -2792 -1781 -425 1232 2448 3190 3270 2938 1252 -203 -1526 -2514 -3405 -3370 -2121
1097 -2121 -1016 474 1977 2757 3125 2575 2040 684 -798 -1777 -2547 -2996 -1952 -1216 -454 876 2456
1114 2456 2767 2320 2244 1016 -436 -1420 -2582 -3122 -2832 -1859 -787 173 1939 2716 2659 2445 1832 598
1132 598 -987 -1950 -2326 -2755 -2262 -1355 -142 964 2109 2685 2303 2190 777 -800 -1600 -1975 -2700 -2523
1150 -2523 -1293 -469 798 1703 2401 2646 2281 1165 173 -949 -2036 -2434 -2564 -2439 -1112 220 1432
1167 1432 1827 2725 2719 1541 854 -97 -1440 -1936 -2170 -1891 -1559 -284 487 1448 1890 2228 1626 625 -140
1186 -140 -949 -2275 -2320 -1859 -1828 -936 388 1854 2178 2267 2478 1432 257 -519 -1320 -2311 -1990 -1899 -1578 -141
1206 -141 893 1564 1956 1932 1828 1034 -284 -979 -1955 -1956 -1801 -1115 -442 454 1307 1665 1723 1920 1135 -233
1226 -233 -952 -1124 -2188 -2308 -1667 -832 -297 755 1703 1953 1975 1462 619 -262 -932 -1407 -2141 -1922 -1085 -486
1246 -486 195 986 1795 1684 1427 930 341 -1008 -1417 -1513 -1714 -1255 -755 131 777 1679 1737 1642 1411 567 -103
1267 -103 -1194 -1688 -1503 -1705 -1277 -362 573 929 1402 1604 1170 843 297 -677 -1274 -1544 -1766 -1516 -491
1286 -491 319 1040 1319 1948 1744 1108 463 -271 -941 -1673 -1633 -1642 -955 -307 647 937 1198 1573 1425 697 172
1307 172 -511 -1425 -1789 -1565 -861 -454 355 569 1027 1164 1404 822 166 -139 -985 -1443 -1415 -1254 -553 -325
1327 -325 570 998 1567 1502 1197 718 190 -367 -1225 -1483 -1354 -970 -361 -9 862 1311 1124 1258 624 175
1347 175 -580 -975 -1429 -1420 -993 -365 18 590 1026 1031 905 863 443 -204 -934 -724 -1418 -1098 -551 -152 342 909
1369 909 962 1520 889 1159 236 -440 -954 -976 -1146 -646 -68 291 456 1001 1450 1046 746 264 -7 -825 -989
1390 -989 -1011 -1232 -561 -418 446 879 1224 1146 791 465 291 -425 -1104 -1083 -792 -876 -307 324 671 998 716
1411 716 999 461 513 -88 -619 -968 -690 -1021 -705 -162 607 843 968 1210 751 705 -267 -561 -1162 -1331 -1109
1432 -1109 -792 -353 304 903 494 933 841 329 126 -144 -511 -861 -796 -642 -364 -77 388 653 908 870 819
1453 819 7 -55 -622 -619 -775 -853 -706 -276 151 801 1154 778 1083 177 209 -200 -594 -886 -1019 -607 -527 74
1475 74 425 753 924 884 786 236 -235 -650 -595 -848 -836 -627 -106 192 565 1006 1012 492 510 45 -215 -584 -636
1498 -636 -606 -755 -339 -62 202 689 653 798 514 92 -56 -713 -616 -681 -785 -453 -78 75 483 741 941
1519 941 706 462 -14 -324 -727 -808 -632 -712 -210 -10 550 709 919 834 625 -22 -248 -479 -655 -744 -647 -297
1541 -297 -132 523 526 570 779 787 455 -3 -624 -506 -706 -452 -357 -168 292 373 453 596 513 514 -219 -128 -340 -413
1565 -413 -761 -495 -226 -479 436 617 684 637 653 262 -20 -160 -502 -602 -662 -453 -94 -10 590 492 568 359
1587 359 364 370 -330 -205 -530 -876 -608 -368 -198 439 711 563 567 490 53 31 -569 -166 -781 -563 -289 -296 115
1610 115 247 450 242 207 134 -39 -176 -587 -685 -367 -13 -75 106 275 741 676 497 262 311 173 -629 -797
1632 -797 -678 -506 -545 -145 50 259 611 602 457 528 187 -237 -70 -340 -124 -579 -137 138 356 229 399
1653 399 669 456 106 -159 -607 -436 -665 -464 -167 -297 122 138 538 671 157 51 81 -42 -371 -627 -168
1674 -168 -445 -295 145 24 153 415 398 -20 -249 -231 -384 -392 -242 -186 -381 -229 130 281 464 370 444 139
1696 139 -73 -148 -300 -422 -372 -376 -488 50 -64 550 377 527 275 -151 -386 -183 -361 -576 -71 -347 364
1717 364 262 22 57 367 337 82 3 -205 -36 -499 -392 -139 6 289 409 397 -39 76 148 -166 -413 -28
1739 -28 -256 -223 -139 -334 99 199 412 147 122 101 123 12 -339 -648 -483 -243 -427 -135 77 261 317 235 143
1762 143 244 223 96 -281 -97 -371 -46 -221 31 311 247 398 338 78 -215 -26 -193 -528 30 -190 -125
1783 -125 177 297 142 551 241 291 -108 179 -177 -312 -329 -272 -77 -213 80 390 450 247 132 264 -84
1804 -84 93 -216 35 -472 -135 45 0 77 699 23 3 210 286 -259 -348 -406 -386 -563 -425 43 -35 151 319
1827 319 229 251 91 -301 -352 -475 -257 -341 -39 73 95 361 -93 412 197 -11 214 -211 -31 -218 -347 -332
1849 -332 -76 -82 -167 98 112 400 220 245 -20 -50 -295 -157 -94 -356 -232 -190 125 330 247 375 212 51 -158
1872 -158 -198 -264 -289 -249 -220 -109 -14 175 256 247 8 236 -121 -30 -302 -418 -203 -148 -378 113 -67 218 282 176
1896 176 178 12 -137 -309 -317 -121 -490 -262 265 -81 159 418 400 210 -21 -14 -111 -99 -172 -114 54 -52 158 219
1920 219 115 250 238 -85 -22 121 -147 -202 99 -290 -79 147 28 251 234 31 276 201 -77 241 -273 -320
1942 -320 -245 -68 -241 -88 160 110 237 1 366 -79 -86 -41 -168 -148 -118 -62 -81 101 314 190 -19 185 -194
1965 -194 163 87 278 -172 -164 -115 49 39 60 310 297 160 115 80 40 -634 -140 -128 -189 200 183 27 -81 326
1989 326 133 565 80 20 -419 2 -180 -325 -106 -160 -55 316 47 -54 448 196 -90 -310 -155 -185 -169
2010 -169 60 -151 21 -106 344 105 224 204 -132 -166 -281 -117 -36 -9 51 83 205 58 72 215 212 140 -206
2033 -206 -45 -247 -112 -67 -49 -148 -166 156 419 107 218 59 -252 -60 41 -182 -92 196 -3 10 43 76 293
2056 293 117 320 180 155 8 -160 -192 -59 -114 13 -92 12 -102 182 -27 135 23 -162 -278 -85 10
2077 10 -27 50 32 -50 146 -18 -114 317 330 -117 149 -20 -107 -269 -187 -44 270 -104 203 210 -82 9 40 -85
2101 -85 -206 -321 32 -42 -219 -126 157 -13 201 222 -158 -123 -61 286 239 9 -190 -140 -141 33 113 -27 323 -44
2125 -44 18 210 4 -40 -265 -49 84 -6 41 271 -75 -31 151 124 -119 363 -224 24 -213 -189 29 -211 52
2148 52 293 320 -61 50 -120 -91 -42 46 30 -132 -311 -173 108 278 121 262 332 -256 -175 59 -114 -26 115
2171 115 59 -131 -187 20 -13 341 203 32 99 215 -243 79 -94 12 62 109 155 7 130 54 77 -156 123
2194 123 193 -104 112 182 -220 -13 -83 224 179 213 104 91 -52 -192 104 -180 -213 -319 133 -204 -158 -7 45
2217 45 -15 -114 216 140 144 191 -174 -291 18 -218 27 -38 -203 -7 50 62 -90 80 81 0 -46 52 -73 262 59
2242 59 -23 52 -114 270 44 153 80 -199 -128 -199 59 -14 -86 92 151 -29 -286 120 87 209 -72 -377 -186
2265 -186 26 27 58 125 -168 44 -4 260 136 -69 -216 138 -131 -16 18 -37 -330 -142 -77 324 120 -145 -64
2288 -64 -250 -149 160 -155 -182 -149 -103 -194 -98 -77 -46 -74 91 312 -160 -179 -105 88 97 1 -1 222 -79 41 -134
2313 -134 48 299 -96 -16 54 -95 6 114 180 55 35 -307 140 -45 -13 35 -241 -9 -148 234 -40 -49 136
2336 136 15 80 293 87 -159 253 146 52 -91 50 196 -71 -159 -359 -362 332 242 -31 -78 -53 -35 86 165
2359 165 0 101 35 43 -188 -18 -51 272 231 87 72 -186 63 -151 43 107 316 135 196 234 300 328 -190 24
2383 24 -184 -20 127 135 -212 155 56 127 122 -23 -5 -79 -23 158 60 258 -155 -241 -174 88 -148 12 65 148 -77
2408 -77 129 -284 -150 -204 -116 -150 175 169 27 -95 184 140 38 31 364 -28 -305 -96 182 25 -42 -161 139
2431 139 156 -32 45 214 80 72 24 141 -206 204 -50 54 150 14 29 -211 -158 -99 31 140 -218 -31 150
2454 150 134 -17 -197 26 171 132 177 138 -118 -69 229 206 -139 -146 148 36 218 144 47 -111 15 -45 -355 2
2478 2 148 219 -52 62 -34 92 114 -32 -64 32 21 -150 -26 -58 140 -112 -20 271 179 -34 -55 21 349 401 -67
2503 -67 119 -53 92 -94 -53 32 114 -71 -59 -57 -127 -44 6 201 -146 -5 54 -64 161 139 16 -77 -63 322 29
2528 29 97 142 196 99 333 -179 79 -68 -101 208 131 148 97 66 -154 -21 -9 52 -21 62 62 289 100 -129 104
2553 104 -88 -16 18 249 -100 36 231 69 -153 -4 -148 34 10 -49 35 7 38 100 -450 -25 -48 138 -1
2576 -1 -84 30 153 5 -171 -62 47 267 -14 84 -178 16 -119 94 -296 233 -117 -258 -57 41 -202 -168
2598 -168 34 96 -126 102 260 -81 41 44 -231 -98 -38 134 -137 -253 -12 127 7 129 -230 -111 132
2619 132 -101 311 -149 13 -395 -22 -145 208 -91 -72 -151 -303 -217 -149 -169 -350 -81 193 13 203 -7 43
2641 43 41 -18 220 72 142 -245 -192 -329 179 71 -152 185 7 -310 8 130 115 80 317 103 -181 80 -94
2664 -94 95 -31 139 151 -457 -80 65 -192 229 34 4 105 96 -152 162 63 132 -325 87 -84 -216 44
2686 44 -230 248 381 58 -253 -20 -220 177 241 86 65 162 322 -164 67 176 -227 83 202 139 177 103
2708 103 270 14 -259 12 202 -122 126 -52 -151 -143 215 38 -56 157 -23 -86 154 72 13 -100 170 134 -174
2731 -174 -79 -35 -51 -61 -34 -2 258 -26 129 -124 71 73 -157 -20 -155 -151 -245 87 54 69 -145 -4 167 86 42
2756 42 -176 -212 -203 122 34 -159 78 111 132 211 254 59 108 -117 -176 143 33 -244 107 134 -18 206 -144 -118
2780 -118 -182 109 -64 8 97 93 15 -43 -85 189 5 -124 85 50 160 130 237 -62 25 169 -206 47 -35 323
2804 323 70 -136 184 213 48 80 -60 108 77 18 -24 -259 -43 -53 -56 -116 170 -55 -58 -16 -17 45 148 95 -144
2829 -144 143 -274 145 38 -75 204 -119 320 -32 105 -58 -148 283 190 74 -102 -168 -140 125 -6 1 87
2851 87 118 -159 32 -86 186 -353 38 273 76 -44 -212 67 376 -270 -199 -162 -142 -48 -103 -147 69 -72 -226
2874 -226 76 207 376 24 -25 -261 26 35 -59 299 92 -114 -91 -16 123 -230 327 5 -51 245 -11 -104 67
2897 67 14 99 67 63 74 10 -242 12 0 291 -186 -128 -86 -85 -113 -64 59 -86 -235 -384 50 13 106 227 -51 -72
2923 -72 -18 57 191 34 28 -74 -28 86 -173 36 17 -36 8 194 -237 40 229 150 -114 115 -120 -185 230 -68
2947 -68 -52 299 172 -148 30 236 -66 -121 8 169 -67 -280 -91 -68 147 22 -110 133 -97 134 -40
2968 -40 -29 146 133 158 -135 55 69 -44 57 50 118 148 28 -83 187 -214 14 76 -182 -105 236 -148 -52 128
2992 128 -313 5 24 -65 208 96 135 112 85 -128 -120 41 -22 -128 12 98 166 27 72 -48 120 2 29 -208
3016 -208 -186 -59 35 -110 -154 9 22 -51 -48 9 -93 -167 -139 20 -131 17 125 -62 90 141 14 3 14 187
3040 187 -60 37 132 63 -178 138 27 28 -39 241 -325 -232 190 -51 162 -51 208 58 159 27 -56 -64 291
3063 291 -85 -126 25 27 -145 284 149 -11 2 -225 -182 -2 167 -19 44 -86 -150 77 -215 23 53 -212 -89
3086 -89 -4 -149 -113 -126 73 172 -6 7 70 158 21 -215 -72 -97 -44 -63 486 -9 53 173 -122 272 327 246 -58
3111 -58 -175 -224 -305 24 -18 260 249 208 188 215 122 -40 142 93 148 -120 22 -14 -12 120 238 -12 -201 62 11
3136 11 58 -9 169 -34 -103 81 139 50 133 -210 -68 16 255 48 97 151 -151 -5 181 -107 -138 -58 142 -63
3160 -63 -19 49 -182 -123 -236 -96 -197 -40 128 66 -298 52 69 -18 129 -39 -20 -56 30 69 123 -152 -155 -21 42
3185 42 75 -77 119 -147 329 -56 16 52 98 368 -25 17 -188 -135 -391 117 112 131 126 57 151 85 -26 -55 -150 -97
3211 -97 0 -231 239 51 -107 247 93 115 -60 57 -15 81 40 224 -89 -5 -42 -23 81 68 45 127 -21 -64
3235 -64 -49 118 297 74 -8 -213 -90 -17 93 38 -41 -160 -85 183 234 -123 -370 253 -7 -193 -102 -245 45
3258 45 -153 -50 -46 -136 -7 -40 96 -60 -168 153 161 38 -29 -175 -47 -168 192 89 118 -104 -139 148 191 165
3282 165 35 -39 50 -169 -155 -29 -92 74 -232 -139 126 -61 -110 -53 37 -360 -110 -313 -135 14 -189 33 -72
3305 -72 -18 132 -116 40 35 70 74 -65 -233 49 -213 -48 182 51 127 91 98 -181 -72 378 253 46 -264 -5
3329 -5 154 5 205 -208 165 -204 -220 222 -234 -46 -66 -28 -51 -220 -79 33 -112 206 7 -23 -161 -20
3351 -20 -19 93 -328 74 25 140 62 -58 -49 37 63 80 40 224 180 211 -7 -133 -118 13 -28 39 -57 -321 -347 142
3377 142 17 86 -41 150 -118 17 193 5 -58 50 -219 -164 -62 -39 111 -122 -288 -82 -94 -214 77 53
3399 53 -78 -11 172 -283 -209 -196 21 -143 -114 -208 42 46 -252 230 20 -79 280 99 93 13 67 150 -89 -229 -91
3424 -91 -179 -111 -234 -1 239 -53 72 -103 -215 -19 -221 -69 -141 109 130 -242 229 -247 219 109 151 -20
3446 -20 33 273 -21 63 -72 275 -54 -140 -70 -171 -12 55 -23 29 -54 -127 -52 -94 66 28 -238 123 34 -156 85
3471 85 35 -100 27 32 -307 -59 228 206 -66 25 151 106 100 119 -7 95 122 -105 61 -45 -55 38 58 -289 103
3496 103 -23 121 -8 106 142 260 29 -120 95 -53 -81 121 90 -179 38 -73 171 69 -146 96 -250
3517 -250 -25 -233 376 80 183 88 38 164 200 -100 -332 -146 138 153 -317 153 -178 1 -190 -31 -204
3538 -204 -168 -227 40 52 91 -159 25 -90 -57 77 -182 -37 -301 -217 -295 -18 20 -138 192 -51 152 92 -7
3561 -7 233 -43 35 59 -179 148 -15 -15 -137 -55 60 156 -111 -83 -147 -122 -4 -27 134 -247 198 119 -174 -224 -259
3586 -259 -133 -154 43 -76 -93 60 73 278 -173 88 116 31 213 173 -17 108 164 14 3 170 326 1 118
3609 118 32 -21 100 -19 -11 41 -20 -143 34 160 -191 -238 -113 -52 92 275 -86 73 -22 -249 19 438 -25
3632 -25 -61 65 -28 48 -195 360 -46 -87 -170 10 40 -133 -103 117 68 -160 11 -106 115 58 19 -26 -59 -100 310
3657 310 160 -140 172 54 -66 13 -129 59 -213 237 -270 -365 125 46 -40 26 102 164 9 -48 -354 -154 63
3680 63 -238 69 -138 444 -161 -99 -66 -19 109 121 -18 144 -219 -20 153 70 -186 -54 -26 -144 381 50
3702 50 209 26 84 141 -85 166 314 101 263 -103 76 -376 -49 33 28 -161 -207 200 -195 -16 241 109
3724 109 57 103 85 -46 -101 -341 -87 0 214 -113 -273 183 12 19 -60 53 70 -46 65 -111 -135 -196 -62 70
3748 70 -131 -90 159 -59 -121 159 180 163 -161 35 -259 167 -137 143 -156 65 23 -212 36 -109 -47 -168
3770 -168 -25 78 -70 -3 61 -118 -12 -216 104 -19 145 167 52 -90 31 219 -194 -174 88 138 -183 50
3792 50 -52 -168 -195 65 -23 25 86 18 22 22 -81 16 -88 72 98 -105 -72 -9 -296 -52 13 249 -234 -68 148
3817 148 83 -175 -251 7 127 -118 8 158 -143 141 33 244 147 -9 -241 -121 168 -42 164 -309 195
3838 195 253 117 -45 -149 28 -50 -110 98 69 -301 160 -58 244 -56 -190 365 -182 44 11 238 59 183
3860 183 197 153 168 -314 128 260 -309 36 -74 142 157 174 -208 169 93 -135 -179 19 107 383 30 -216 267
3883 267 108 -134 -194 -138 -127 23 -128 107 -359 60 9 -195 73 -109 -39 -13 119 -129 41 -298 -112 11
3905 11 271 162 -68 -23 -180 -207 26 14 -207 48 85 -184 158 155 -7 -3 61 27 -25 -7 225 50 115 52 136
3930 136 -29 282 91 -69 -83 -96 -261 35 -125 178 58 136 -141 181 -30 53 -110 -12 113 206 77 184
3952 184 -19 -166 -37 -196 -244 75 -28 9 1 -204 -74 -103 161 -108 -183 -99 250 -135 37 287 152 30
3974 30 167 174 -5 19 -29 67 38 -13 -106 278 76 139 -20 -235 -107 59 206 -5 -2 100 114 -77 109 -89
3998 -89 55 -195 137 39 139 209 -281 -37 -89 263 22 -62 157 2 217 -233 -33 77 99 -62 62 5
4020 5 48 -41 -194 -180 -131 101 73 256 147 -238 143 130 101 -147 -57 -77 -46 44 -208 130 -221 33 -85 -39 -90
4045 -90 -145 91 -31 61 27 -21 -162 -32 47 -223 145 32 -46 25 72 172 -83 -255 -205 11 -195 -58 297
4068 297 -246 50 -256 -1 -202 57 10 6 -159 31 279 215 -128 -129 3 -135 -74 104 84 109 -110 43 137
4091 137 -4 -124 -218 73 26 -97 -187 -157 -84 -166 48 70 27 111 -138 78 -510 -17 -50 8 74 21 -69 -129 -215
4116 -215 -152 -40 -105 53 -231 82 322 -8 -66 104 18 -304 -75 -84 113 1 136 109 -51 -108 -94 6 238
4139 238 -20 -231 -3 -83 -23 125 -44 51 -248 113 166 -70 -61 66 159 -194 16 145 -27 133 160 -265 1
4162 1 -188 26 -43 -150 139 11 337 -145 46 -207 169 -145 -113 77 148 28 110 -80 -196 -132 -5 -51 -94
4185 -94 -139 160 -170 -161 -18 14 123 -54 6 39 346 50 -25 -44 88 130 178 130 37 406 86 2 11 29 -309 -16
4211 -16 45 -11 104 171 88 24 -201 -6 -83 -139 20 225 -43 -117 -105 96 -6 -161 -2 126 -220 -289 -54 -34
4235 -34 -83 -20 64 127 55 -4 -53 -73 174 46 -21 -142 56 -180 2 -8 -51 76 -197 10 74 184 25 2 -95
4260 -95 -97 111 -133 123 40 -145 -130 -153 200 -151 153 64 -45 -129 299 -47 -57 -53 -70 -141 330 -175 -144 -18 117
4285 117 -47 204 100 83 -99 304 52 120 5 -122 -285 70 223 68 -169 58 -179 -181 -84 135 242 -93
4307 -93 -111 144 -242 46 15 211 96 -114 172 92 5 139 5 -139 -11 40 124 -109 -5 -60 155 113 43
4330 43 99 68 -96 258 18 -82 154 -202 127 -410 159 11 -27 -20 9 -188 -127 87 -165 -66 -87 93 -137
4353 -137 158 80 -91 -58 -193 -16 191 41 -51 -62 -117 -3 -41 30 -14 -67 140 51 62 -20 -25 142 -186 -174 -246
4378 -246 149 19 -110 -222 -160 -54 -15 15 250 -160 -32 -65 126 136 -411 -197 -314 -217 140 137 64 136 43 -47
4402 -47 151 -180 -234 165 -91 158 209 49 54 98 30 -78 -34 -66 -255 172 -9 -33 -46 -56 89 127 241 -161
4426 -161 -9 64 -37 -93 33 -27 -115 -389 90 143 -250 30 238 168 16 -111 142 -200 -71 80 167 156 -95
4449 -95 164 -135 -202 -216 -56 72 234 1 -11 171 63 57 -159 -178 -30 -36 131 -115 -97 -52 -87 -166 -154 46 85
4474 85 90 146 225 106 66 2 -96 -207 -33 185 130 -3 -101 99 120 -31 -93 -96 -8 136 -69 121 -112 -239 28
4499 28 -4 217 266 46 -199 94 -199 -22 254 132 -47 3 -209 -78 -112 -125 142 -49 46 -61 161 -211
4521 -211 -77 -240 -158 53 -229 202 -32 -268 -71 166 -44 51 -133 126 292 116 41 -97 -148 14 -223
4542 -223 92 -238 215 29 -186 -115 -1 95 -9 -109 -116 280 32 -100 -64 -181 -120 -129 153 213 226 80 29 -29
4566 -29 209 125 -132 -259 -124 110 -94 -4 12 -93 102 99 -166 -47 203 30 -131 214 -177 11 -76 23 15
4589 15 40 -97 89 -169 -72 165 16 -95 -156 -473 58 19 119 3 -175 -108 220 97 173 52 100 -39 170
4612 170 78 -23 243 -21 180 59 38 -313 -56 170 -13 -153 -155 140 178 91 -15 -22 -33 169 -140 23 102
4635 102 -5 293 -149 46 -317 62 -208 36 137 116 195 129 -143 -157 -51 -104 200 -163 -79 111 -104 -147
4657 -147 -141 33 261 0 -79 -219 156 96 203 45 58 77 -24 109 -119 -49 95 141 -23 -186 -2 112 -21
4680 -21 158 -264 123 -37 17 45 -102 -124 -31 15 -287 122 -147 -28 -95 -201 -151 -74 -77 -129 -77 -29 -4 140 -117
4705 -117 51 -74 143 -36 339 -70 -205 -109 81 -173 240 150 144 -110 120 82 -187 -176 -223 -209 33 -479 106
4728 106 -45 -71 -63 265 -57 -309 22 -278 -158 -131 151 -127 353 -88 160 262 -130 -53 53 15 197 211
4750 211 -16 54 150 -4 -101 -133 -115 138 -59 -30 54 -180 356 32 -11 -167 74 -32 214 142 150 -219 -56 12
4774 12 -114 144 -301 -41 -72 -154 -149 199 -159 -99 -100 143 17 -164 236 147 -25 85 119 -35 54 -185 80 -101
4798 -101 110 190 -9 -196 -11 -235 -28 -39 200 -27 -43 315 -115 -19 133 23 -6 -190 91 -297 118 69
4820 69 -49 136 -186 156 49 338 -78 -333 -8 -49 -178 -127 2 293 -312 28 68 190 109 -4 -100 -269
4842 -269 34 224 -180 -16 122 -107 -67 317 12 -215 -125 9 -115 47 0 79 -317 45 42 -71 -35 -77 206
4865 206 -26 270 -295 -147 78 106 223 -7 144 41 -150 -47 -282 74 154 -68 -3 192 35 82 145 -316
4887 -316 -67 -39 -58 -135 94 56 -122 -103 84 -131 138 -39 -63 85 268 -116 -142 -122 -15 68 80 -57 187
4910 187 -84 58 -193 -43 87 0 182 37 -153 -2 56 56 139 47 43 275 -48 -33 8 -316 -17 -5 -215 -63
4934 -63 -185 -371 -70 21 255 -149 137 -129 69 34 116 13 -147 101 -168 -19 63 106 47 -190 269 76
4956 76 109 75 325 339 -168 -66 138 -56 -294 51 -22 76 10 -33 75 -52 -213 -32 124 101 -219 -168 -222 -247
4980 -247 -56 -56 -106 -34 -114 5 -19 -28 63 162 33 -17 -317 -134 169 -24 160 -126 32 136 -38 -203 164 9
5004 9 -228 84 -277 -131 -219 -173 37 210 -138 171 216 -158 122 -49 -22 16 -190 -17 23 318 -22 -50 -16
5027 -16 -218 141 -83 169 25 34 57 62 293 -85 -63 127 -167 39 64 151 -267 94 170 -39 46 154 -47 -35
5051 -35 90 57 -31 139 -181 68 -34 271 -190 16 262 108 -34 -57 310 -12 95 164 89 96 16 -91 -202
5074 -202 -90 240 281 196 237 28 -122 -146 -88 -187 97 -75 -44 -219 -108 103 -39 122 37 105 -108 -50 -25 197
5098 197 -95 -175 158 117 -59 336 -69 201 85 -73 -211 -159 114 -63 82 89 39 55 -60 -150 64 22 -13
5121 -13 -36 -17 100 2 -160 -113 98 -16 -227 -61 47 -72 -221 111 -88 -4 9 145 13 -199 -86 -69 82
5144 82 138 -235 -56 -97 -49 192 65 30 -118 -274 192 -86 20 27 11 249 41 79 30 -56 155 77 -176 -117
5168 -117 -139 -63 -28 94 153 -194 39 77 -164 -94 49 149 -30 -47 -47 -103 -40 -162 -136 52 -223 288 -73 63
5192 63 -44 9 41 -83 44 153 -8 32 -236 -223 58 -78 98 146 -205 -45 -81 -155 76 -144 -72 127 85
5215 85 189 96 153 -59 -297 87 -106 -29 23 -139 70 20 -122 282 50 -64 31 143 55 -46 75 435 32
5238 32 80 -162 -161 -231 147 142 75 332 20 -89 -229 -166 49 23 31 -94 154 -201 305 -49 -78 182 81 -28
5262 -28 143 -229 -204 155 304 -159 170 37 154 189 -217 138 -129 -37 137 43 -31 67 -198 -108 -211 -141 -148 -20
5286 -20 -93 259 329 -21 285 -16 14 132 -212 90 232 97 -133 -58 58 -203 -80 -110 146 -44 11 193
5308 193 155 -70 -33 -155 100 -276 -8 -338 -74 -77 -199 -200 -59 -104 29 59 87 -218 181 139 -101 178 -47
5331 -47 -249 -212 146 150 -130 -312 135 -119 -161 -101 -8 234 195 -131 -276 -89 90 -149 70 -253 -116 -46 -5
5354 -5 92 99 -78 -232 -132 118 120 -41 396 98 -117 83 -232 66 -81 113 -127 -131 131 -325 190 97 36 -149
5378 -149 48 -81 225 115 181 20 172 -20 125 -173 -48 142 -126 437 -10 -152 97 44 49 41 -222 -194
5400 -194 115 -27 -141 -111 -86 -185 -128 -18 -21 -261 67 127 46 -17 34 40 -208 -7 -196 11 -160 49 -118 -182
5424 -182 74 -25 -60 -313 176 -35 251 27 -273 37 -49 -44 -171 141 -34 -10 -147 21 95 10 -157 131 -272
5447 -272 -216 161 -173 -19 114 -56 192 -99 105 -11 -272 -76 19 140 18 155 -12 -66 -44 8 1 -20 -140
5470 -140 156 -292 139 -93 165 -292 214 -163 93 314 -38 -147 -267 -21 -104 22 -13 180 85 116 300
5491 300 100 -150 -47 -242 23 -34 138 -176 189 -17 -28 -58 298 -226 32 -225 -31 -23 182 113 368 -105
5513 -105 -247 -156 -239 -20 0 -189 -28 -28 312 -31 -325 46 -96 146 -27 200 6 139 -103 -204 -175 -21
5535 -21 -422 -155 97 -154 209 83 -79 -24 -212 118 -14 186 69 185 249 -131 199 203 -339 -71 21 -24
5557 -24 -34 -209 -130 -71 346 223 88 -29 175 289 -30 98 -286 -72 -195 -63 -54 110 92 -49 -238 180
5579 180 -41 -139 -3 -294 -234 -5 262 -32 216 194 -71 20 -93 -242 -66 -224 -157 14 -148 -26 -207 -271
5601 -271 67 -26 133 12 -46 226 -82 -4 -64 49 -90 82 52 -182 -85 22 50 -56 -24 -58 132 -180 8
5624 8 142 231 -239 171 97 -70 191 210 335 16 161 69 178 164 32 -114 221 13 -92 258 -309 366
5646 366 136 -41 17 33 253 127 -23 44 -105 12 59 109 -179 144 115 33 -59 -230 -98 -181 321 -280 168
5669 168 -141 -191 26 65 145 -180 -23 72 -57 -51 -292 -89 61 -154 221 -140 69 309 -66 436 245 125
5691 125 -38 156 -87 21 -10 -182 27 -3 131 -55 -307 -146 8 142 193 -169 -161 111 146 -150 -73 -324
5713 -324 201 -160 -58 -20 45 -198 120 276 198 373 -104 5 203 -47 58 -61 180 102 -115 77 -100
5734 -100 108 10 401 141 -245 151 53 -303 222 97 -67 48 102 -256 -117 -186 -128 -167 -53 -284 209 143
5756 143 68 -191 -48 90 183 -166 96 167 -14 -77 -26 48 138 60 -17 -219 -272 25 106 -150 -106 314 -73 216
5780 216 -79 -6 -84 -336 29 52 54 -61 90 -55 77 -87 30 111 -117 79 -9 -202 -277 -97 -173 59 130
5803 130 94 35 -122 26 184 166 246 -75 121 -205 277 104 -139 22 -274 152 -187 -334 251 -146 10
5824 10 53 69 53 -184 120 -3 34 -110 44 -190 210 -77 114 -98 -250 -87 -412 -174 -20 112 -244 -8
5846 -8 98 69 157 32 -104 57 -105 74 -1 104 -271 -97 151 41 -199 -184 -40 278 -155 1 -79 -137 235
5869 235 -21 208 102 132 -225 119 86 154 1 -132 69 40 226 176 111 -124 -79 -188 36 -17 30 8 43 -50
5893 -50 48 -254 72 194 164 -261 163 -334 57 -67 33 90 -24 -150 -54 -112 3 72 253 247 -190 -111 -24 -63
5917 -63 174 116 64 73 -52 156 309 -92 26 -72 -38 141 16 -109 -39 262 99 -64 -52 101 194 46 -14 66
5941 66 90 -167 119 158 -35 187 89 -112 36 234 -126 143 -27 91 20 -249 7 -6 195 -56 -121 -34 -10
5964 -10 -48 -41 249 182 -99 -11 18 70 40 265 3 -26 288 -32 263 98 -73 -15 7 33 154 36 156 -114
5988 -114 -140 58 57 14 70 -149 265 109 -132 -93 -108 39 82 -3 33 35 -32 14 -20 26 -33 -86 324 104 21 18 39
6015 39 -214 -331 -77 -56 95 124 -39 -46 -56 96 155 139 -171 -126 115 -26 144 290 29 -171 111 180 182 254
6039 254 466 -93 -14 -207 -346 -105 212 -197 -151 -215 -157 117 53 246 149 -190 -205 -264 -166 -186 90 -88 -97 -23
6063 -23 17 -129 148 232 -158 147 -65 -229 -71 -405 71 144 150 -213 -54 -51 229 -52 -93 299 80 -137 -75
6086 -75 -349 68 42 29 -346 -116 230 -38 170 156 -82 -1 92 -106 167 -145 122 -321 -197 -30 218 -202
6108 -202 9 157 -13 63 104 -43 158 -173 -312 172 -44 -152 -83 -11 10 -148 -76 148 -193 108 32 -137
6130 -137 53 -41 8 116 10 -116 1 -240 35 110 -114 -304 -56 15 95 299 208 111 -93 -158 48 36 36 158
6154 158 -80 234 80 -55 -40 13 168 153 16 -46 204 172 32 7 222 -102 68 -37 262 -25 149 -12
6176 -12 41 -205 -11 -93 -121 -156 120 267 -16 -8 -79 -35 -113 72 109 -13 71 217 -23 -294 305 212 70 -62
6200 -62 19 -34 139 115 -122 251 47 318 -42 41 -66 -47 -64 147 40 -208 -241 -47 44 79 156 -180 -183 41
6224 41 23 67 56 26 -365 110 -229 -155 -116 136 160 99 268 136 147 -1 67 79 88 24 148 124 127 38 -58 -244 103
6251 103 41 69 -89 -66 232 -52 163 -122 22 -124 272 62 -244 -120 -49 -104 -156 255 -170 -25 -198 -48
6273 -48 16 25 -65 -81 152 25 86 73 -9 46 211 -424 -257 307 73 -91 -58 -47 -148 -207 58 -6 -180 -142 230
6298 230 -294 35 225 -64 -142 120 41 -86 -93 130 -3 -19 13 56 -104 -163 -51 -163 -43 117 83 -79 84
6321 84 21 -46 -160 167 -44 63 -79 230 -92 29 -160 -178 -7 -44 -66 108 -260 268 -32 43 236 264 16
6344 16 206 221 -1 -189 71 -14 104 102 -4 -117 -106 85 -47 84 130 77 72 -90 -43 -10 -86 -87 87 112 218
6369 218 -138 173 83 -82 -1 -10 42 -326 94 163 -25 89 -91 -134 -115 -21 -241 -210 -5 62 173 -95 -55 -95
6393 -95 237 109 -127 39 -52 -49 -131 130 197 297 -162 -123 119 -283 123 78 154 -232 -148 -338 94 88 113 -102
6417 -102 -140 3 -23 -52 -25 -119 97 44 118 88 -190 -83 34 219 82 -148 -155 1 165 63 4 29 105 -46
6441 -46 78 -194 68 -178 105 -148 -13 -216 -208 -134 -143 -152 -195 -144 -98 -197 -7 -55 -86 1 -185 -223 -209 -237 105 -77
6467 -77 -210 -135 -42 204 22 151 -49 145 -13 -374 185 -119 -7 36 -17 205 -6 -319 51 62 87 106 -116
6490 -116 43 -6 157 -217 6 106 -212 67 5 88 254 -136 6 -245 98 274 -219 54 116 111 -297 -80
6512 -80 57 -144 -199 -1 34 52 30 192 -69 77 -89 -64 26 -67 -159 -420 59 -42 -149 -39 39 -121 212
6535 212 -211 -315 64 143 -10 -127 137 -23 36 -92 113 260 -5 -66 -107 -95 60 -317 6 -231 51 -44
6557 -44 61 -161 1 -134 87 -38 -62 30 -103 10 51 -229 -71 -195 -219 -103 136 66 28 107 -132 -131 -127 95
6581 95 -87 -114 86 -67 138 91 42 -15 -15 93 -230 155 23 -61 253 274 -104 -11 -38 35 124 -90 9 -70 -94
6606 -94 -150 -53 110 -71 -96 247 63 123 30 141 -45 160 62 -76 248 236 219 120 56 -79 30 -60 88 -13
6630 -13 -1 -203 -212 4 271 -201 -40 123 4 -83 -71 34 -202 -323 220 205 89 -206 -146 -96 -108 -103 -9 -93 -455
6655 -455 -136 -113 161 -148 -87 118 141 -38 -43 79 -94 76 56 -158 183 74 57 85 -109 156 79 62 22 86
6679 86 -7 93 -19 242 16 -40 -8 -151 -86 -34 357 66 -263 -179 65 45 15 -30 203 111 112 -16 254 -196
6703 -196 151 268 25 90 -201 146 101 -259 42 25 78 226 -331 94 98 -26 -67 -110 -146 21 -29 39 114 -72
6727 -72 47 -143 157 170 67 199 160 -5 130 43 59 8 73 116 -203 16 200 -234 -6 -23 -136 28 -20
6750 -20 38 74 13 -29 -143 -15 -339 -47 -83 -105 88 49 -97 -267 173 -271 -129 47 -35 -117 -31 285 -12 -51
6774 -51 128 -217 -167 -122 13 -124 167 71 164 0 -101 -19 -265 -173 89 -84 -135 137 -67 -153 256 221 -152
6797 -152 9 -44 312 100 20 110 -87 -162 -140 2 -3 132 -179 -196 304 -43 -1 -149 -176 -307 102 53 -48 58
6821 58 -253 152 84 -116 121 -23 109 83 93 -121 -442 99 236 1 -87 -240 111 165 58 -199 -146 -141 -104
6844 -104 81 143 -101 121 23 -96 79 -291 157 -25 264 -31 -51 34 -253 -11 65 38 -90 190 66 72 109
6867 109 173 167 -17 255 2 -186 183 73 85 -16 21 -74 152 -148 -55 -47 189 -129 -162 -21 -31 73 -29 140
6891 140 66 -24 -38 -86 43 -60 -93 -138 -80 -119 -349 -125 30 174 182 42 222 -98 96 28 -211 185 -125 214
6915 214 -160 -153 58 163 -192 144 215 -69 0 -154 156 -80 142 119 -84 -40 -152 -47 53 -173 92 -161
6937 -161 73 -266 143 -72 -102 -30 -71 -20 33 114 211 226 248 -75 18 132 59 150 -96 -201 60 33 -40 211 -16
6962 -16 117 -131 -79 -85 268 -75 -145 -6 189 3 135 -103 -99 -92 -175 168 90 -15 -32 -220 74 -46 -166 24
6986 24 31 113 75 50 162 1 133 -247 -65 209 -311 -223 -100 -137 -109 -201 -52 55 -47 -63 14 86 424 -126
7010 -126 -60 149 56 -65 -112 -173 103 177 -99 107 -250 -216 16 91 -186 -98 86 -1 -163 86 33 24 85 -45
7034 -45 -195 8 -40 113 -81 70 -65 87 152 142 -115 84 -16 285 -107 -17 38 -139 173 -87 -60 159
7056 159 -154 23 -93 -92 110 164 -74 -126 -109 -23 -131 272 -45 -54 -132 129 -125 26 -109 181 4 -131 258
7079 258 -18 -154 274 90 -94 192 32 -162 86 183 -60 81 -191 -134 92 -55 219 -8 22 150 -228
7100 -228 -69 21 -27 -43 143 93 -122 140 -67 -162 175 147 -136 171 -339 112 68 -246 159 -74 207 -88
7122 -88 272 -330 77 131 -185 -9 -12 50 -278 241 53 54 -1 34 -3 -168 205 -265 -196 207 108 -182 -63 -59 74
7147 74 -85 -168 40 -32 87 -12 70 -15 -335 -27 -82 -174 -52 136 82 -112 277 -83 -148 -359 278 69 -84
7170 -84 96 155 17 261 -107 -72 -73 29 -159 38 125 39 19 -44 42 -37 30 -63 227 3 -46 -189 47 -88 -86
7195 -86 -106 41 -119 151 -45 -80 -29 -4 45 -252 144 85 -34 -189 -127 -11 132 114 -21 -67 -286 135 -81
7218 -81 61 2 -176 59 -120 -399 -164 -100 -4 196 -109 -99 -219 4 -51 -19 -85 66 -43 80 76 -353 68
7241 68 113 -37 52 -95 -25 283 3 52 27 6 -187 141 1 185 107 -40 174 300 -19 -102 83 -104 -400
7264 -400 -255 -166 -75 257 -33 16 21 -109 -131 83 -18 92 -6 122 -244 170 -27 204 -118 -13 92 -248
7286 -248 102 53 280 190 -25 53 46 189 -126 -378 -255 96 67 -164 87 -38 42 -267 143 -44 -68 125 -218
7309 -218 -58 59 -101 -18 -81 -6 123 -30 -20 -66 -60 228 88 -18 132 12 -65 159 -53 -135 24 -64 -236
7332 -236 65 244 -76 -30 5 281 60 -65 -82 8 77 36 -78 181 -171 45 40 -171 -34 -38 -319 -95 -58 -130
7356 -130 -13 -99 -52 71 210 199 -86 18 47 60 -132 124 -174 -181 70 -75 -90 -9 104 275 357 -60 24 -107
7380 -107 -287 -201 152 138 -3 -267 102 93 61 43 -68 99 -7 255 -54 -129 95 -188 -1 -56 -282 97 128
7403 128 140 -41 -121 -249 117 -33 55 -37 -67 16 330 133 5 168 160 254 254 72 -180 125 -76 59 275 60
7427 60 24 -245 -197 -125 -218 94 0 -91 148 155 7 66 -42 303 -173 -11 -55 71 116 -137 30 -162 1 8 157
7452 157 122 -39 -68 -157 51 -27 -161 -99 -136 -328 -289 44 -97 89 78 149 96 90 95 -70 119 173 -316 26 223
7477 223 -7 -33 -22 -140 277 55 -120 -38 206 -15 -45 113 -41 -157 300 9 -286 352 -142 115 10
7498 10 -287 66 151 86 74 75 -220 49 -69 -143 13 -112 -93 -59 -208 238 208 -164 37 71 137 -30 -187 -80
7522 -80 -14 -108 -239 292 -143 79 167 -104 265 243 -96 -97 -68 -48 61 99 -9 36 29 219 270 -13 -39 -211 -61
7547 -61 250 21 -154 -14 -113 -25 -32 -50 -200 102 -177 -205 -100 -298 -146 243 -41 -128 70 156 27 -294 -129
7570 -129 -212 -157 175 -110 -167 99 -127 -45 -86 -20 -255 192 -21 -144 -159 -127 -30 6 222 45 66 137 -63 -99
7594 -99 -112 -58 85 134 54 167 -123 93 -97 81 72 78 -157 480 78 -126 168 -217 75 73 -129 -169 273 -180
7618 -180 -3 -109 105 163 -35 -233 -41 -169 2 -12 180 43 190 133 -80 203 46 -65 243 12 160
7639 160 -148 -290 -118 102 77 24 -167 -109 -164 2 45 -157 -208 39 -161 -20 -80 -231 -103 -110 -38 60 -13 -36
7663 -36 -3 -67 8 49 -101 199 48 22 -23 -25 219 37 -127 -16 51 -71 150 211 38 -236 -25 3 77 -81
7687 -81 -6 -34 87 -258 24 -80 148 -14 29 71 -194 41 -282 -95 -31 25 258 10 114 -85 93 -17
7709 -17 -298 46 -4 -13 1 36 257 272 66 -126 58 -381 109 67 -148 27 -243 48 113 261 248 -29 -56 249
7733 249 -224 236 87 -5 -79 27 -32 249 -185 -47 -19 0 70 67 70 178 -153 151 96 63 6 -44 67 161 74
7758 74 -69 -44 8 -44 -295 194 26 288 304 -141 22 -160 44 99 61 222 148 -115 -114 -39 -196 199 113 -72
7782 -72 -102 -140 2 76 -120 180 52 -54 -65 -137 -16 -69 13 150 -146 218 7 9 -51 20 97 124 -229 -137 -12
7807 -12 107 146 45 2 65 134 20 130 -3 121 198 -109 35 53 -43 211 -212 -161 -99 -223 152 -57 146
7830 146 -32 -174 -134 -117 62 -144 92 -94 -32 193 175 -2 -137 126 -9 221 -81 -328 -61 -199 -62
7851 -62 -300 238 193 143 146 139 13 104 193 -33 -126 201 134 -221 61 -143 89 -207 -15 14 -75 103 -192 -136 122
7876 122 -29 26 -30 -121 34 123 -54 -95 35 11 10 -67 251 -92 -185 -152 17 26 39 172 -91 -143 319 -25 -45
7901 -45 3 -63 -135 -16 40 138 -100 -23 247 -311 -419 201 48 175 104 44 -80 165 -189 133 -110 23 236
7924 236 97 155 -23 141 -184 93 361 20 5 -138 -39 79 -261 83 -49 -130 -309 5 -235 46 -44 20
7946 20 -36 73 -94 -132 -74 -16 -10 -66 11 144 106 166 -101 320 74 -10 1 -92 -193 33 -30 284 19 -270 -62
7971 -62 -125 -603 221 152 -27 151 58 -299 -78 -52 -138 -186 -188 130 -103 106 -27 97 -95 -83 241 -48 -190
7994 -190 315 -65 209 64 155 12 78 56 -39 -77 28 -145 151 155 62 84 166 29 8 171 -73 3 67 -138
8018 -138 147 -64 -193 -225 65 -56 194 -178 165 121 116 300 -128 -96 -47 7 101 10 25 108 40 120 10 -4 47
8043 47 116 262 -218 -125 -239 -226 59 109 139 74 166 -122 -18 -139 -92 -148 -75 66 -203 -95 -193 -42 -93 -3 -257
8068 -257 -78 -49 -18 157 231 70 -90 -6 -165 49 163 -42 -101 -9 14 227 -151 -22 238 35 -161 222
8090 222 58 37 -59 -76 -67 -248 -46 7 -46 -25 -46 -123 -86 165 57 185 -123 274 -219 138 -19 -93 123 84
8114 84 -232 -31 -147 -38 153 101 -88 95 147 -130 -33 -142 80 245 29 -155 110 -97 -44 101 124 119 -58
8137 -58 -85 334 -230 64 194 61 362 51 54 7 -83 2 -11 -3 -141 -67 281 -137 -113 207 206 -152 293 134 -58
8162 -58 144 133 -51 125 63 73 -42 20 69 231 -147 105 -160 -280 -50 217 -11 -13 275 199 -173 -121 -161 -266
8186 -266 120 -41 27 -26 -10
8191a0
$$ Imaginary data points
##PAGE= N=2
##DATA TABLE= (X++(I..I)), XYDATA
0 0 0 0 0 0 0 0 0 0 0 0 0 -8 8 -8 8 -8 14 -16 16 -24 24 -32 40 -41 49 -59 68 -80 91 -105 121 -137 156 -177
34 -177 201 -225 252 -284 316 -353 392 -436 484 -535 592 -655 722 -796 876 -967 1065 -1173
52 -1173 1291 -1427 1576 -1745 1938 -2158 2415 -2718 3083 -3529 4096 -4833 5847 -7327 9711
67 9711 -14193 25644 -125525 -203507 -54190 -26870 76955 169607 208974 178927 164690 89038
79 89038 -17699 -100515 -138239 -187450 -184312 -123577 -52796 9436 101240 166063 175917 150234
91 150234 112874 41333 -46873 -116509 -152090 -169221 -148771 -87407 -13671 53114 119502 160496
103 160496 158303 128953 81820 2750 -83327 -128036 -138139 -149397 -127168 -48439 27748 76647
115 76647 124827 150674 126756 82826 35223 -32915 -98077 -122202 -124803 -119714 -74396 -1435
127 -1435 48408 86689 128203 131270 91871 49677 2805 -60823 -108758 -118444 -110517 -88355 -34659
140 -34659 24944 63902 99358 122543 100495 56583 23358 -20317 -78876 -110154 -101023 -81563
152 -81563 -56307 -6646 48468 80463 98510 102231 73525 28638 -10796 -52608 -91319 -101399
164 -101399 -83221 -58224 -24309 26531 69658 86000 91486 84981 48193 265 -36832 -68140
176 -68140 -91916 -89868 -64657 -32055 6879 51066 77127 79527 77436 61330 15521 -28778 -51220
189 -51220 -71162 -87015 -74420 -39030 -4009 29795 65272 82849 77411 64803 36025 -10820
201 -10820 -45821 -64010 -80581 -81478 -52659 -16597 13278 46434 76148 80278 64306 45358 14027
214 14027 -28878 -58262 -71463 -77364 -63089 -30054 2494 32772 64658 80764 69148 47190
226 47190 25500 -8574 -49174 -69520 -71478 -66680 -46430 -12343 20376 48412 70461 75449 58449
239 58449 34368 9330 -25911 -59676 -69354 -64430 -55368 -29958 7280 37014 55736 68599 66723
252 66723 44109 14809 -12523 -42901 -65722 -67460 -58289 -42158 -8701 27439 48236 62379
264 62379 71726 60594 29395 -1792 -26161 -52796 -69982 -65528 -49620 -27372 6051 35929
276 35929 52595 62794 64082 44829 13548 -12244 -34120 -56853 -64660 -51643 -33286 -11523
288 -11523 20014 46293 55965 57515 50838 28021 -1501 -26330 -46743 -61627 -59051 -41569 -22350
301 -22350 1779 34276 55362 57581 53446 42767 17938 -12984 -36289 -51407 -58665 -51334 -32385
314 -32385 -11434 14680 41893 53471 50634 44561 29505 1175 -25494 -40829 -49753 -52021 -38766
327 -38766 -15843 5008 26405 46212 51835 45313 33593 13485 -12405 -32485 -44157 -51054 -46728
340 -46728 -26867 -4056 13549 32855 49706 49607 37414 22664 2641 -20596 -37076 -45384 -46171
353 -46171 -35444 -14248 6140 21845 39030 48520 40850 25287 10585 -9450 -30918 -41502
365 -41502 -42455 -37822 -24300 -2894 17008 30652 41461 43683 32355 17052 379 -19995 -36194
378 -36194 -38993 -35925 -30169 -14606 7793 23921 32136 37791 36597 23519 6715 -9915 -27023
391 -27023 -36703 -35407 -30956 -20913 -1201 18522 29569 33895 37079 29597 11669 -4286 -17660
404 -17660 -31896 -37738 -32375 -23629 -10662 7583 23697 31733 33983 31929 19464 2476 -10863
417 -10863 -23045 -34043 -34419 -24274 -13651 -1144 14981 28426 32710 30181 23196 9892 -5594
430 -5594 -18086 -28069 -34307 -28812 -16714 -6128 6819 22209 31616 30816 24885 16844 2564 -13240
444 -13240 -23131 -28835 -31232 -23611 -10051 1520 14287 26721 30529 25985 19475 8966 -7803
457 -7803 -21145 -25237 -28407 -27996 -16229 -427 10681 20730 28958 28901 22623 13656 252 -14768
471 -14768 -23088 -26090 -27938 -23036 -8553 4712 13778 22852 28527 25089 16550 6736 -6022 -18290
485 -18290 -24189 -24497 -22496 -14912 -1404 10840 18511 25117 26308 19858 9509 -1149 -12429 -23318
499 -23318 -27912 -23755 -17300 -8734 4851 17133 23251 25837 23569 15447 4386 -6080 -16674 -24883
513 -24883 -25022 -19412 -13424 -3837 10077 19366 21983 23037 18998 8453 -2062 -10724 -19734 -23971
527 -23971 -19760 -13862 -6698 4353 15667 20426 21587 21392 13352 1726 -7147 -15213 -22477 -23764
541 -23764 -18520 -10310 -504 10135 18057 21335 21436 17587 7295 -3082 -10358 -17021 -21865 -19854
555 -19854 -13172 -4685 4222 12734 19118 20257 17360 11471 1575 -8498 -14610 -18640 -20175 -16166 -7170
570 -7170 1540 8596 16211 20858 18139 12916 7613 -2047 -12235 -16875 -18014 -17587 -12471 -3560 4781
585 4781 12081 17992 18640 14181 9397 2431 -8031 -14988 -15992 -16199 -13907 -6664 1958 8934 14685
600 14685 18137 16016 11024 5338 -2847 -11877 -16240 -15727 -15568 -10670 -2038 5949 11393 15613 16648
615 16648 13296 7166 430 -6401 -12593 -15557 -15231 -12120 -5544 2130 8258 12953 15832 14750 9070
630 9070 2342 -3618 -9274 -14555 -15586 -12200 -7655 -1336 5394 10881 14211 15234 12732 6047 -795
645 -795 -6142 -11876 -15840 -13950 -8793 -4379 1924 9331 12832 13403 12363 8625 1464 -5061 -9172 -12878
661 -12878 -13911 -10683 -6143 -1192 5946 12040 13071 12675 10529 4802 -2010 -7508 -10867 -13060 -12419
676 -12419 -8401 -3090 2347 8400 11554 11662 10604 7520 1487 -4570 -8793 -11272 -12220 -9904 -4690
691 -4690 845 5668 10607 12497 11085 7981 3430 -2624 -7713 -11066 -11910 -11255 -6676 -1250 2855 7576
707 7576 11807 12772 9596 5533 1428 -4174 -9231 -11525 -10834 -8575 -4512 798 5237 8694 11391 9736
723 9736 6399 2663 -1887 -7001 -10053 -9890 -8868 -6060 -1035 4473 7899 10281 10955 8540 4199 -336
739 -336 -5144 -9316 -10443 -9922 -7890 -4194 1624 6251 8453 9974 10002 6920 1912 -2233 -6315 -9305
755 -9305 -9470 -8340 -5608 -578 4221 7476 8582 9172 8087 3464 -1126 -4104 -7491 -9632 -8677 -6057
771 -6057 -2763 1354 5828 8631 9163 8619 5895 1187 -2618 -5833 -9151 -9626 -7249 -4367 -992 2998
787 2998 7250 8943 7890 6363 3467 -884 -4690 -7038 -8958 -7675 -4890 -2021 1565 5438 8484
802 8484 8206 6575 4716 1064 -3620 -6237 -7848 -8307 -6788 -3039 204 3445 6539 8061 7452 5958
818 5958 3042 -745 -4762 -6570 -7562 -7880 -5001 -1147 2086 4871 7023 7939 6265 3630 427 -3130
834 -3130 -5879 -7051 -7199 -6165 -2490 1174 3504 5741 7791 7245 4752 1984 -1030 -4504 -6767 -6775
850 -6775 -6246 -4301 -890 2716 4625 6542 6767 5334 2772 285 -2639 -5409 -6638 -5602 -4553 -2819
866 -2819 982 4088 5300 6721 6236 4205 1184 -1209 -4363 -6471 -6321 -5324 -3623 -1062 2616 4825
882 4825 5469 5806 5281 2662 -234 -2884 -4946 -5841 -5801 -4210 -1636 1099 4190 5681 5429 5361 3596
899 3596 660 -2130 -3844 -5452 -6426 -4875 -2773 -212 1957 4591 5995 5653 4569 2683 -448 -2834
915 -2834 -4381 -5799 -5639 -3378 -1087 364 3032 5212 5160 4525 2975 568 -2012 -3940 -4939 -5265 -4123
932 -4123 -1795 171 2293 4636 5472 4678 3512 1915 -804 -3242 -4741 -5167 -5060 -3263 -1053 1072
948 1072 3288 4732 5112 4465 2911 663 -2103 -3567 -4027 -3996 -3746 -2074 293 2630 3507 4219 4340
965 4340 3336 831 -941 -3209 -4494 -4449 -3932 -2997 -671 1951 3090 4239 5069 4152 2008 95 -1462
982 -1462 -3651 -4527 -3974 -3226 -1703 446 2113 3756 4275 4154 2758 578 -830 -2361 -4255 -4517 -3145
999 -3145 -1982 -207 1798 3196 4142 3987 3137 1473 -533 -1957 -3493 -4345 -3755 -2629 -1536 421
1015 421 2573 3578 3774 3394 2767 872 -1249 -2523 -3469 -3909 -3045 -1901 -178 1313 3013 3177 3475
1032 3475 3101 1486 -608 -2318 -2982 -3558 -3921 -2456 -616 690 2606 3459 3543 3111 2094 370 -1534
1049 -1534 -2656 -2990 -3820 -3201 -1501 -127 1102 2765 3467 3179 2231 1013 -312 -1939 -2745 -3291 -2913
1066 -2913 -2194 -413 628 1964 3532 3790 2505 1672 555 -1221 -2810 -3199 -3385 -2723 -1507 191
1082 191 1520 2443 3275 3072 2065 936 -310 -2109 -2635 -2941 -2812 -2113 -534 1294 2206 2830 3076 2466
1100 2466 1032 -347 -1595 -2586 -3090 -2754 -2152 -986 405 1697 2329 2875 2864 1919 470 -569 -1490
1117 -1490 -2612 -2609 -2513 -1305 -355 960 2106 2435 2752 2498 802 -171 -1094 -2399 -3107 -2382 -1438 -837 432
1136 432 1946 2472 2542 2492 1688 408 -712 -1868 -2889 -3025 -2104 -1343 -403 1024 2131 2316 2199 1865
1154 1865 891 -238 -1456 -1916 -2288 -2200 -1251 -917 495 1614 2405 2301 1995 904 72 -1143 -2047 -2176
1172 -2176 -2496 -1833 -925 235 1289 1704 2490 2347 1493 904 -354 -1804 -2125 -2280 -2214 -1448 -155 498
1190 498 1210 2103 2706 1710 923 46 -770 -1509 -2006 -1821 -1679 -680 161 1065 1759 2452 2070 1153 262 -60
1210 -60 -1701 -2277 -2234 -1661 -1398 -377 931 1361 2064 2265 1562 932 75 -980 -1498 -2055 -1580 -1580 -911 637
1230 637 1198 1710 1770 1704 1500 262 -737 -1384 -1790 -1830 -1430 -569 -409 708 1798 1588 2001 1474 456 -66
1250 -66 -974 -1679 -2071 -2041 -1297 -692 126 1230 1733 2001 1563 1162 210 -840 -1273 -1687 -1869 -1547 -756 -53
1270 -53 782 1305 1719 1812 1520 255 -575 -1010 -1438 -1773 -1494 -964 -209 180 921 1852 1624 1331 922 281
1290 281 -655 -1180 -1546 -1735 -1283 -640 -208 670 1274 1532 1507 955 853 -204 -1284 -1455 -1414 -1166 -1117 -408
1310 -408 598 1064 1437 1476 1213 773 94 -691 -1138 -1392 -1124 -1405 -667 142 589 1423 1363 1414 977 421 -416
1331 -416 -913 -1517 -989 -1161 -919 -5 421 1027 1109 1291 1363 553 -127 -456 -1049 -1257 -1193 -813 -687 260 869
1352 869 1062 1364 1119 890 204 -484 -569 -1147 -1349 -988 -773 -35 303 1310 1019 1112 919 72 -57 -564
1372 -564 -1035 -1394 -1052 -755 -301 194 846 1147 1160 1405 731 96 -412 -900 -1085 -1108 -664 -600 10 363 1026
1393 1026 1003 849 976 331 -175 -656 -662 -1217 -962 -842 -69 321 662 1076 1214 1068 468 198 -581 -1031 -1242
1414 -1242 -1123 -912 -313 139 406 1029 1261 1061 662 264 -171 -789 -1141 -695 -691 -457 101 545 809 746 1095
1435 1095 539 391 132 -367 -669 -963 -770 -863 -244 263 589 797 982 937 399 293 -140 -417 -821 -843 -905
1456 -905 -652 -46 496 715 943 858 791 282 102 -390 -958 -794 -1106 -767 -257 345 717 691 1069 589 353
1477 353 -23 -235 -419 -611 -1057 -541 -571 -188 104 626 803 795 788 285 -282 -615 -662 -883 -823 -470 -338 10
1499 10 733 898 1017 537 133 55 -215 -509 -649 -1138 -567 -228 -96 325 799 584 625 311 593 34 -427
1520 -427 -467 -673 -1010 -569 -195 308 435 782 858 638 270 29 -458 -575 -631 -594 -449 -322 -23 328 850
1541 850 670 544 344 431 -183 -521 -685 -629 -566 -369 -99 177 131 898 654 508 87 197 -262 -467 -672
1562 -672 -716 -499 -303 298 541 627 636 658 329 118 -15 -372 -894 -723 -456 -386 -193 362 281 431 682 323
1584 323 420 37 -120 -509 -803 -502 -331 -610 270 391 403 294 577 393 35 64 -450 -578 -495 -271 -396
1605 -396 63 240 535 495 674 562 368 -177 -649 -392 -518 -719 -436 -180 272 593 526 504 443 416 -56 -483
1627 -483 -522 -361 -550 -597 -235 -124 105 266 313 420 332 240 -59 -651 -360 -467 -526 -546 38 237 469 731
1649 731 772 262 163 -31 80 -235 -490 -470 -627 -245 56 213 361 514 586 196 251 -83 -180 -498 -372 -268
1671 -268 -212 -240 122 247 333 611 509 176 -172 -69 -383 -610 -143 -229 -73 187 267 274 506 482 213 -52 36
1694 36 -13 -300 -370 -307 -85 94 33 195 356 405 204 103 5 -236 -356 -628 -144 -101 -362 132 342 442 483
1717 483 378 202 225 -311 -347 -550 -427 -496 -206 -167 293 423 225 631 339 216 97 -169 -151 -405 -372 -138
1739 -138 -9 203 133 323 450 437 474 -21 -516 -604 -490 -537 -130 73 -19 406 194 206 335 247 255 -79 -52 -504
1763 -504 -171 -163 -187 -182 57 172 333 390 126 96 104 -229 -453 -251 -246 -248 -83 278 193 527 221 -2 103 219 255
1788 255 -120 -365 -357 -498 -224 -220 32 233 50 267 287 184 -65 -12 -295 -371 -89 -168 -199 -111 -48 89 484 330
1812 330 238 -39 -27 -43 -392 -151 -333 -172 -214 23 90 251 426 40 218 145 -143 -375 -248 -298 -147 101
1834 101 -202 236 123 216 472 166 -35 -121 -66 -263 -203 -73 -61 141 46 267 36 197 142 233 194 -213 -238
1857 -238 -164 -366 -79 -119 -95 84 485 28 348 199 85 -81 37 -212 -133 165 -64 -76 307 -77 346 300
1879 300 -165 -3 143 -210 -164 -241 -420 -208 -62 -4 40 162 149 240 232 84 55 -38 -393 -589 -92 -332 -38
1902 -38 193 133 323 70 56 -134 -220 -136 -526 -247 -320 37 55 -11 349 248 112 206 164 196 -330 -143 -68 -123
1926 -123 21 -235 64 35 128 -24 -63 211 -506 13 -217 -258 -80 -9 -368 -138 81 171 227 270 94 -145 12
1949 12 91 -14 -363 -139 -156 116 227 187 -77 408 357 -11 380 -339 -75 13 -49 -140 -200 52 19 -5 -193 -39
1973 -39 451 194 95 -308 -11 -349 -143 61 -184 -109 -52 78 299 -7 118 97 -417 -285 13 -82 -197 13
1995 13 91 327 156 146 102 -334 -127 -43 -200 -41 -411 -1 -117 -340 158 276 113 -87 -62 193 -32 -103
2017 -103 -310 -33 -163 -265 -60 -159 224 153 196 215 121 -162 -90 37 -158 -376 -362 -23 -4 29 56 118 230 36
2041 36 110 191 -148 70 -2 -117 -138 -79 123 136 334 184 441 -10 -247 105 108 -391 121 68 -210 236 -98
2064 -98 111 137 107 -76 -7 -150 -271 -105 21 -148 -124 -21 -190 -74 340 48 173 71 -185 231 4 -146
2086 -146 -286 -166 -78 -293 -212 90 23 -4 352 255 -228 -42 65 35 -219 14 -22 -44 316 -119 -59 -117 -189 -63
2110 -63 -160 -89 86 20 -210 -81 -147 -136 -124 240 159 -9 265 193 -96 -60 101 -92 -98 -271 -23 59 243 128
2134 128 -87 -149 -53 -92 -170 -194 -271 66 -199 282 -33 195 482 190 -63 162 -301 -185 -157 -4 -262 -377
2156 -377 163 357 75 -149 70 24 -30 141 -173 63 -25 -222 -341 28 136 36 -128 283 71 57 235
2177 235 -40 119 -310 -271 -41 20 -227 62 72 -52 179 242 128 29 48 90 -52 -170 25 202 -86 -117 218
2200 218 150 153 213 87 -188 18 -110 44 -81 -44 -66 27 42 -258 -97 98 -42 -181 -143 91 -40 -120 -50 -308
2224 -308 -84 15 106 67 90 2 -42 -430 -122 -60 -201 -261 -128 4 -52 -325 304 111 -240 -130 -102 89 -15
2247 -15 -66 107 19 -253 265 198 254 127 -128 65 -136 136 15 -54 1 4 18 90 -141 93 -76 220 135 65
2271 65 98 -105 121 -294 21 24 102 121 16 118 137 110 126 76 -105 -84 -125 -144 467 4 -87 -152 -35 0 130
2296 130 191 115 111 105 66 -179 -214 -233 -8 16 -23 -43 -306 210 -153 -6 321 -34 -300 -129 -103 144 195 53 103
2321 103 -177 9 -226 -6 360 41 -202 -85 -199 170 309 -4 104 317 157 56 22 51 -240 -38 -85
2342 -85 89 213 -4 174 93 39 19 -147 -58 -187 191 105 -9 -49 13 -142 248 -157 55 95 -31 260 -88
2365 -88 -66 -86 -169 -221 -5 -138 -167 16 -298 -12 104 43 181 7 70 38 43 114 -418 -52 111 125 78 34 -32
2390 -32 -16 163 -168 -64 -28 46 -169 302 -187 154 74 -6 230 40 85 -90 -64 -391 -7 -22 59 280 76
2413 76 -40 -12 13 -131 -62 -25 -332 213 224 -78 156 -104 219 68 163 52 -18 60 -7 -46 -47 -10 170 -135 -82
2438 -82 -60 -83 29 58 -103 223 55 -3 16 133 97 -23 -131 -8 -23 -210 -19 -114 223 -8 -140 71 19
2461 19 71 -110 256 -261 -163 82 77 -16 164 349 470 -140 106 40 -278 3 -69 106 -102 75 27 -199 9
2484 9 71 91 -23 3 75 -227 -91 224 156 94 105 -144 -28 -137 -156 -160 187 -259 -23 130 -17 38 157 153 -44
2509 -44 66 -36 161 -62 381 135 -358 326 -15 29 -227 -70 143 136 275 174 -2 152 -111 98 88 145
2531 145 -140 -245 -75 -106 -248 115 -42 -104 56 -164 -59 -172 73 -73 -194 -77 -336 -82 175 -50 229
2552 229 -145 -11 -86 44 18 -49 -3 120 28 -172 96 -3 92 -121 -149 -33 -58 -117 -153 109 -248 355 -218 208
2576 208 -62 93 88 36 88 60 -93 64 -63 -73 -100 -301 -89 -294 70 -75 264 -29 -92 11 16 -143 124
2599 124 106 5 -88 -274 -12 -308 80 30 159 -89 238 -87 -327 99 203 121 176 -132 -218 -120 -55 -63 311
2622 311 244 -32 200 6 -10 192 -84 187 26 -15 32 106 181 108 -326 110 -260 -50 97 63 -68 -45 98
2645 98 183 124 -157 -111 56 225 -54 -151 -62 170 -43 -1 -144 -177 -43 174 226 -45 72 -137 213 -96 25
2668 25 181 -26 -115 -115 120 288 111 24 218 -130 -5 -263 -138 -77 313 140 -56 11 150 18 28 4 -113
2691 -113 -85 12 96 100 -63 -18 0 -65 125 83 -25 -11 -80 -149 158 244 -162 218 4 -48 451 -133 213 81 173
2716 173 -37 258 -7 -231 185 -212 13 208 8 -73 -5 36 -27 -77 -152 90 176 39 176 -83 -39 -25 201
2739 201 -35 284 -130 98 89 -57 87 -17 -331 -24 -24 124 105 61 -47 -83 -59 -90 36 -150 -202 -30 -169
2762 -169 -136 -256 -37 123 43 188 -50 74 151 350 -5 -111 117 -3 -154 -67 -288 321 183 -11 40 -189
2784 -189 -95 -133 126 27 -134 23 -52 223 -3 -90 3 -155 -16 206 -97 173 -230 -295 -16 127 -396 290
2806 290 -90 -178 -143 73 137 -115 -70 38 -30 -24 -88 143 225 150 19 118 80 89 -117 -1 13 -96 286 -66 -265
2831 -265 55 -135 21 16 213 39 82 -118 -40 -30 129 196 -369 16 309 114 89 -13 204 -182 26 -30 197
2854 197 22 54 -68 -48 5 46 -23 286 -20 -81 227 274 35 -105 -275 295 141 -75 0 -91 21 134 112
2877 112 -6 -59 -144 107 75 161 -52 -237 -180 115 15 -8 190 54 -61 83 71 89 -58 32 -189 84 -264
2900 -264 -142 183 153 -14 -220 -120 -144 -209 -122 115 153 203 -89 -35 6 -42 2 -56 -15 -79 -211 -8 139 206 29
2925 29 156 -92 49 87 6 -31 -123 -110 -51 146 -70 134 35 260 -185 23 175 40 -49 -5 29 -200 -164 -212
2949 -212 101 -46 92 -79 -98 -80 -203 -36 -114 73 173 -56 77 88 87 197 68 -285 -144 -58 166 -181
2971 -181 -33 -165 41 177 31 -113 51 -174 -75 -40 -204 -91 -110 12 -155 -218 -36 62 225 -52 -190 337
2993 337 12 -205 -83 -69 59 -98 135 53 -22 35 338 -295 -184 169 -88 62 61 -10 -255 36 41 -97 140
3016 140 -134 -129 -104 -10 -45 -43 60 95 112 135 -85 -61 23 12 122 -298 109 59 6 490 -206 45 57 -56 -61 -189
3042 -189 -281 -82 186 109 116 -218 -241 -39 -86 -87 11 -193 -30 -77 -78 -102 41 -197 -84 -93 -162 -59 52 124 25 -36
3068 -36 -255 -382 131 26 91 -86 153 109 193 -28 -240 137 143 323 67 223 -164 -107 -175 -85 -215 302 3
3091 3 224 -35 -108 -34 -36 52 -116 61 -54 68 -89 -143 -21 -100 -115 -150 129 -132 34 -194 -218 -82 51 1
3115 1 213 -229 84 -84 -138 80 195 42 -61 11 71 -54 -69 -185 143 149 -215 -111 -5 81 85 -2 -24 48 79
3140 79 -9 -142 -266 -56 89 -178 203 137 200 69 -33 -234 -86 37 -65 31 -165 59 188 188 -73 142
3162 142 -110 70 38 47 106 5 -191 71 -125 -90 -16 129 150 -49 102 -109 -92 63 -94 -147 189 129 -63
3185 -63 276 66 257 -253 -202 12 195 9 68 -72 -28 -141 -163 191 -60 -135 -231 -6 -121 -107 18 -104 27
3208 27 134 166 57 -33 -195 62 14 1 -115 90 26 325 215 165 100 33 -93 70 -57 -48 192 -182 111 80
3232 80 -22 -209 58 -162 177 204 90 -108 -31 -46 84 -8 344 269 -208 -202 95 17 177 -86 70 184 120
3255 120 104 268 28 -316 -174 -30 -79 95 -289 134 -217 49 101 -479 16 26 430 -140 248 293 74 -11
3277 -11 -141 -55 -59 172 123 -135 -38 78 104 -296 -129 57 90 -418 -14 5 262 -173 60 -93 -93 -121 -316 -109
3301 -109 31 220 160 52 -87 -69 -127 -20 -132 -53 219 58 144 -141 97 -307 126 -143 283 111 220 8
3323 8 -260 -134 270 -79 110 156 49 -97 309 126 -34 -39 175 178 -97 5 -20 258 -87 114 106 -255 -85
3346 -85 7 -22 197 -213 -39 250 65 -40 -73 -31 51 -5 -86 -1 156 -71 169 -296 94 6 87 -88 121 -83
3370 -83 163 -30 99 117 -81 -10 4 9 117 -121 -57 26 99 125 263 146 169 70 -131 139 -94 -339 113 -27
3394 -27 -126 254 -494 80 -46 -103 50 315 -245 56 45 135 38 -178 32 76 -200 73 373 48 -277 98
3416 98 146 89 -138 -94 36 -100 -23 149 131 -73 56 -242 19 53 -104 -114 -223 -36 359 -34 -219 -183 0
3439 0 -108 197 -171 -136 6 58 -94 -41 -21 115 -44 -14 -46 -27 -14 341 -44 -66 55 -101 -139 -149 -109 -200 168
3464 168 197 92 115 134 9 20 78 117 106 191 -186 -197 -68 -25 6 -32 25 258 49 11 187 3 -18 -149 94
3489 94 61 16 305 45 -104 117 94 43 -182 -203 52 -277 74 -11 -120 7 213 14 -43 226 57 165 107
3512 107 302 59 -97 -35 -236 -27 26 -121 4 14 -107 -374 320 -201 -69 -73 -227 18 -101 -552 -68 0
3534 0 29 24 -22 123 12 -124 -147 -249 -257 -67 -13 28 -304 124 31 -177 -74 139 319 -35 161 -297 59 215
3558 215 154 -201 70 131 -166 -19 -144 -201 115 205 25 172 188 190 193 9 -228 -279 21 -121 -87 244 216 47
3582 47 107 40 -295 -61 -24 59 142 -324 -262 -42 -83 105 52 276 -311 -212 217 162 206 98 -160 -231 -26 36 -306
3607 -306 99 -209 -30 -209 115 2 -37 42 108 -26 -88 -76 -128 -176 -198 133 97 -118 -232 145 25 -38 -125 -219
3631 -219 -43 -38 27 52 85 145 -80 -62 127 128 110 -278 -212 95 -423 -216 106 -221 -64 90 -39 23 -210 272
3655 272 197 116 137 0 -26 211 33 172 -95 132 -106 130 200 -67 -16 28 150 2 -96 -270 89 67 125
3678 125 -305 110 -92 -27 -21 -194 -175 45 329 -54 -188 -100 46 17 -24 186 260 -146 68 -165 87 496 34
3701 34 218 -36 294 -78 -10 284 24 104 -80 265 215 -19 -101 435 0 -124 139 138 -8 85 68 -127 69
3724 69 -278 115 272 -203 59 159 -184 -129 -203 211 -253 -78 22 284 -3 128 103 62 34 126 16 113 -169
3747 -169 168 -178 -77 150 121 26 75 -137 -223 7 -36 66 -193 21 -187 49 287 -170 -198 -221 78 45 -303
3770 -303 -10 72 11 94 -60 113 86 -171 17 189 -91 -71 -164 -202 60 -183 -15 -242 -64 -34 -89 -51 -84 -35
3794 -35 121 196 6 -92 199 91 125 156 252 -98 1 -136 145 -2 -88 -102 206 -205 -315 -43 -92 78 231
3817 231 289 -40 192 -153 261 -122 -55 38 -112 -198 -168 12 78 7 161 44 -174 -185 257 -203 -109 14 14 250
3841 250 -272 2 -12 -240 -156 -68 187 -105 51 -241 -193 -274 -108 -53 -454 -180 15 6 27 154 -91 59 67 -103
3865 -103 -206 -51 -126 272 34 -144 -13 -270 -120 194 111 138 -107 -1 28 -313 -214 -16 -88 92 90 169 -46
3888 -46 -205 39 76 -164 212 140 4 17 -218 -22 -73 -247 -167 -52 -97 -21 144 -43 196 -39 59 74 84 -126
3912 -126 -93 -44 -165 202 -48 -52 -29 -223 -64 -137 -93 -21 -66 49 27 -356 103 -223 -25 95 -252 154 359
3935 359 -153 -60 225 73 64 -4 6 -186 -127 1 -32 16 -167 35 -94 54 264 92 -429 37 -22 -273 -27
3958 -27 -62 -270 -333 -275 143 -107 -50 -9 -183 165 -67 -127 -33 -39 89 -120 2 -254 -116 101 108 -333 -125 -206
3982 -206 89 56 37 -124 -59 -18 -17 -46 -206 -174 -66 136 -38 -149 95 -22 -57 148 29 -97 268 -10 11
4005 11 59 -216 107 -234 122 -29 -139 65 214 -204 -24 135 -15 169 156 53 158 -2 -340 17 79
4026 79 131 4 -23 -5 -102 -160 12 -140 -286 153 -273 244 -300 -9 140 -120 -8 -168 -232 -81 -3 8 64
4049 64 -219 -61 -162 -6 89 -39 176 33 -16 -81 -1 223 -61 -362 -123 175 77 -34 49 -100 -22 -47 110
4072 110 -18 -178 -23 -78 76 109 23 -5 67 75 -97 -192 195 -43 -26 -14 -178 81 90 -258 -247 -3 -192 98
4096 98 -89 24 106 -42 -111 147 -150 -195 -52 -102 136 -215 -159 266 -62 -9 -277 -72 -274 -21 7 17 50
4119 50 33 95 45 85 -116 -17 -180 -328 -162 16 -58 -79 -208 19 -153 298 -259 -27 -231 166 -184 297 -41
4142 -41 209 222 -155 -49 100 -208 -3 103 -24 28 305 -105 190 210 164 146 36 35 245 9 3 76 111 -144
4166 -144 -126 -46 -88 70 -181 -101 65 -56 -28 -77 260 -225 -40 68 -151 21 12 210 -198 21 -11 157 -139
4189 -139 -117 75 -54 -64 -208 49 61 -187 -79 68 52 167 -76 -276 109 85 -63 -223 -205 -291 4 359
4211 359 -207 146 -148 -120 69 105 139 5 69 1 160 -83 -158 -82 -40 108 107 88 318 -58 64 271 -97 151
4235 151 186 193 -98 29 43 -137 -26 75 -38 -131 148 77 192 -277 86 229 64 48 264 78 68 39 139
4258 139 123 28 43 -150 155 117 -310 165 136 198 118 -56 23 -140 -79 182 120 -23 48 175 -126 238 -171 124
4282 124 14 2 80 -195 135 -126 356 202 150 46 78 69 265 -95 198 -306 -98 -52 82 -234 156 -135
4304 -135 -44 -9 161 8 -94 -78 38 -80 -88 208 -46 271 -132 -29 225 -299 -54 -101 63 -135 125 -356
4326 -356 27 -66 -2 98 -323 176 -228 -125 -192 -137 -160 -121 103 97 -9 -185 62 218 -13 231 -10 32 63
4349 63 245 84 -58 138 -6 4 5 296 19 -34 -68 -69 -182 88 17 94 9 -132 -121 -190 -95 8 88 -154 -238
4374 -238 -186 -125 41 -93 -30 8 -76 126 -243 -183 -253 28 -57 1 87 90 -263 -82 4 191 117 -70 201 -9 -26
4399 -26 -113 -152 191 -199 61 -166 -53 124 356 207 54 9 163 347 25 33 58 155 32 125 -328 117 46
4422 46 -29 94 78 123 -140 34 68 -120 -42 -43 223 62 -13 2 8 -35 11 85 -131 130 208 -65 -56 -121 -282 -32
4448 -32 359 5 -62 -57 135 69 57 133 -5 -300 181 32 -261 -192 48 -85 -196 -22 -28 -162 -70 80 -37 273
4472 273 -277 -302 141 134 -56 249 -175 -39 -231 166 129 49 45 -71 70 177 176 -1 -129 -112 -147 -191 71 -143
4496 -143 -8 -38 -166 95 339 -131 126 44 8 96 118 -302 210 96 44 83 -177 69 -69 31 -171 104
4518 104 -305 258 162 -301 -18 244 -47 233 36 4 -94 -15 -32 31 -37 -91 -79 -112 138 -154 272 -230 -112
4541 -112 150 -102 192 5 84 48 188 -111 -34 -77 169 -102 195 -35 -5 -126 -54 105 -39 -86 -146 -150 -109 -41
4565 -41 -6 373 72 -62 90 -79 -31 15 -6 110 74 -16 315 -335 -88 134 292 31 -305 -52 -26 269 -5
4588 -5 -17 -15 -235 -103 -58 -10 117 158 128 108 122 122 -221 97 76 -186 -38 64 61 -379 -145 80 27 -68 166 -94
4614 -94 59 37 146 1 -97 -22 89 -57 13 237 26 73 68 -44 77 -24 44 44 157 177 7 40 423 201
4638 201 21 -35 -157 49 37 14 50 56 -351 -206 62 -73 112 -253 57 149 192 40 16 36 122 -234 -87 -366
4662 -366 187 246 -383 97 -107 79 -7 -62 13 -238 -115 -4 22 156 138 -93 -243 108 1 -27 -105 -68 258
4685 258 -153 -96 38 169 28 268 60 -174 65 -109 48 130 129 125 151 332 -108 21 213 72 383 15
4707 15 -14 -195 -51 -152 -104 -78 -88 241 188 -85 83 227 57 52 -244 -137 107 -103 -111 120 13 -67 -25 102
4731 102 153 -18 2 259 -14 -32 -119 -76 262 306 39 23 -142 -67 12 -71 -34 44 -52 -120 -77 -205 -108 69 82 27
4757 27 -86 -53 103 -92 117 83 -118 -19 -75 -5 200 174 10 68 300 88 296 -220 105 -284 250 -108 -16
4780 -16 31 -18 -371 85 50 -171 -100 207 240 -154 -64 67 53 -51 23 -207 -131 -50 -12 -22 263 -91 254 -11
4804 -11 75 -122 37 -186 179 31 91 -189 70 -244 26 39 -158 -33 358 122 -217 43 381 57 -192
4825 -192 -28 253 118 -15 -162 -159 103 -34 -229 -234 -138 182 -10 163 -17 -81 -33 219 -114 78 27 172 -166
4848 -166 -68 207 77 236 -77 -248 121 -96 18 37 -288 -46 52 -41 9 -407 -214 132 190 33 52 -98
4870 -98 -343 112 -4 80 74 -70 145 -111 -197 -209 -41 26 -73 129 321 -231 89 -93 -15 -107 40 -8 -89 32
4894 32 -135 -163 -178 -35 87 17 7 35 -101 161 -74 -385 -113 245 176 41 -199 84 15 -384 85 135 -53
4917 -53 -10 -3 25 -20 352 -121 0 -300 -67 -91 97 196 -14 -4 290 141 -153 169 83 -258 290 -34 -215
4940 -215 142 -124 -8 -184 -138 -97 -8 -183 105 19 105 -151 -281 -117 189 33 -218 -83 -79 -124 -14 77 27
4963 27 144 -87 248 -38 38 -167 68 -174 4 236 223 188 -129 31 -29 73 15 -253 -43 36 74 128 -130
4986 -130 -79 312 -37 -52 31 138 88 -105 124 196 -263 70 50 -132 -69 -142 27 213 61 -344 -227 -40 -109
5009 -109 -15 194 -84 -89 -146 -94 36 -196 -234 22 10 -65 124 398 -89 79 -10 20 -164 85 126 -241 69 -21
5033 -21 -157 -70 -129 -12 102 150 -17 -156 4 47 95 26 -102 -235 -138 153 133 -42 18 149 -142 -12 -47 -139
5057 -139 -120 -304 -24 -37 347 -220 -234 -247 -26 -31 30 -33 27 -10 41 -372 -438 -16 182 -152 127 205 61 -61
5081 -61 155 -179 36 165 127 236 81 101 -133 -191 -292 103 23 297 43 -9 -251 64 -110 166 47 -106
5103 -106 -115 18 -136 30 -20 7 129 20 278 41 -91 78 16 -163 -269 -130 -33 -176 -261 -428 -75 246
5125 246 30 -53 199 70 -277 -250 -32 57 37 -174 -398 -161 186 -422 46 -395 -63 145 -246 365 87
5146 87 77 -68 -96 -61 -198 132 -41 80 227 -45 77 -24 85 -106 234 6 35 189 -41 -232 0 -51
5168 -51 -128 234 -61 65 -109 136 -33 197 -54 -292 186 -108 164 303 -60 23 32 -126 79 -3 256 -22
5190 -22 7 86 -56 -70 70 275 95 117 38 -132 -129 101 51 -2 0 -47 50 124 -34 -21 -75 -10 -205 57 132 69 91
5217 91 -309 48 -212 256 -106 329 -127 183 178 69 -273 -199 -235 116 -226 -25 365 -117 -169 -68 -28 -84 -164
5240 -164 -49 212 150 54 -109 -65 167 308 72 210 112 -161 29 42 103 -184 -152 114 108 -29 -135 25 -1
5263 -1 -118 -152 -90 -330 -119 82 29 38 -182 -27 96 -159 -168 -158 112 101 -102 -84 165 -152 -81 -205 36 -247
5287 -247 -7 52 206 156 72 -103 -68 -208 -5 188 -68 103 -48 -83 -248 40 -1 193 159 -137 -306 -51
5309 -51 -95 123 67 -101 -6 -164 328 45 -14 -257 -49 202 226 34 -88 215 21 31 236 2 -127 16
5331 16 119 49 -26 -75 -114 120 -13 10 115 -36 -185 -4 180 108 -50 262 258 2 -63 142 23 -98 -62 317
5355 317 -103 -204 -306 -23 113 -100 -40 -6 89 63 28 -49 61 117 33 208 63 51 -191 -25 166 -233 -53
5378 -53 40 -51 44 156 16 -285 -188 -55 -146 -134 -110 127 -138 148 -70 255 111 154 120 0 71 59 -165 -417
5402 -417 146 59 -159 -352 261 -193 -2 -123 131 25 -230 138 -53 169 36 -103 -35 87 -207 -163 95
5423 95 -19 107 254 133 -112 -74 83 141 -77 -153 -37 -134 323 192 -113 140 212 -474 176 -48 -21 -172
5445 -172 30 59 69 -87 -16 19 43 226 145 69 -132 44 -103 58 114 148 -5 -55 25 -77 42 -183 -198 -21
5469 -21 55 254 66 -28 70 85 117 -66 86 94 -195 -108 69 -39 27 -335 41 -70 189 16 -113 -159 -149 52
5493 52 -11 203 183 7 -71 77 -182 -137 -393 -148 24 -210 -308 -49 -263 94 -297 -91 28 -83 5 -32 130
5516 130 56 27 -125 -190 113 -160 -30 181 -258 158 -36 41 -90 177 147 -102 -43 266 -44 94 22 254
5538 254 -37 68 -235 -16 -89 94 34 -42 293 -64 218 -327 48 -64 142 122 -67 -35 -124 -85 -25 111 -120
5561 -120 280 60 232 -293 -163 114 -37 309 131 -420 99 -6 -108 24 95 99 168 -259 245 171 -165 -75
5583 -75 123 108 -146 217 68 9 -131 258 152 -238 -42 -349 -149 -85 10 81 28 -108 -91 -12 54 187 -192
5606 -192 -67 -2 160 8 -19 101 -47 264 -65 -310 104 -200 168 89 -46 15 -21 -180 -200 116 68 283
5628 283 182 4 -112 40 -61 -179 100 -131 -73 -53 -16 105 -25 96 -34 -79 -106 95 64 -95 106 123
5650 123 -61 -90 -48 -273 212 -70 82 163 176 -105 -40 -77 -165 -105 -184 108 -136 -123 -49 -92 86 68 -139 -69 -52
5675 -52 -17 -91 -262 -26 128 -10 -15 64 99 229 119 -55 235 -134 142 -268 -52 44 -29 -46 230 71 -133
5698 -133 153 -273 158 40 -170 -151 -21 -48 32 -39 -6 115 93 177 -106 -162 -274 -35 -123 -159 -174 -33 -242 -17
5722 -17 44 -143 253 -76 -77 -235 -15 98 -122 -1 129 -197 -18 245 313 -48 42 70 -199 90 -69 -414
5744 -414 94 -53 -85 -10 -25 -168 -139 264 183 132 212 -178 -263 17 -13 -176 -217 95 -157 7 5 -13 -46 41 144
5769 144 -53 -137 147 44 59 -98 -76 131 109 -2 169 70 202 213 -246 -134 73 103 -247 78 82 14 138
5792 138 215 116 -31 -46 157 66 28 -167 -180 25 -58 45 195 10 274 271 -150 352 4 65 -56 -83 -79 -126 129
5817 129 158 237 152 99 38 76 -255 94 -66 -158 -182 -134 -58 83 228 294 226 -67 133 26 -70 -162 -92 205 216
5842 216 -24 -145 -91 -164 -21 -162 48 155 8 -172 -121 200 208 5 156 -59 -186 -193 -62 109 43 91 267
5865 267 -97 -22 175 -127 -84 -22 -31 -27 -34 -199 -122 74 250 54 45 -92 -221 -304 3 -189 52 -22 -3 -209 179
5890 179 10 -195 78 -18 125 -75 -86 -206 -73 -107 -201 -67 -67 148 -38 -30 155 95 -15 -24 68 62 170 -44 -213
5915 -213 -48 73 -190 42 -175 -57 86 136 -70 -133 245 125 -144 -139 85 -91 -207 -196 33 218 -5 132
5937 132 12 56 64 -310 124 176 69 83 -156 61 -436 -111 104 101 -280 118 -152 -235 41 -66 93 206 39
5960 39 66 17 235 -46 62 16 22 57 -54 -6 1 18 -215 -119 -17 134 -126 90 -122 178 477 201 -37 -147
5984 -147 76 -76 154 9 60 109 134 -80 131 193 -26 284 -120 33 54 89 184 33 -138 -146 59 168 275
6007 275 -304 -45 -224 -25 126 163 267 20 -125 29 -65 12 -219 46 95 -105 14 -91 60 21 -170 55
6029 55 203 -158 -90 35 186 -44 -49 147 234 125 -96 21 -49 108 -20 -7 229 182 -106 90 124 256 -66
6052 -66 229 60 -2 -72 384 -113 33 36 341 66 136 -240 -111 79 0 -228 -211 120 57 15 175 135 56 -115
6076 -115 99 324 -52 95 134 -2 -119 52 326 166 22 183 116 166 -98 -279 94 -23 187 107 135 124
6098 124 -105 129 290 45 -3 -128 -282 -238 78 218 14 73 57 -19 -95 -206 -112 164 255 -82 -180 113 128
6121 128 106 45 258 -82 -163 64 157 216 -7 46 -186 -47 6 2 -101 113 152 8 -170 161 39 49 236 0
6145 0 -200 -11 89 260 -126 48 -173 -216 -75 131 102 220 -136 6 4 39 150 -82 145 -38 -89 -46 -12
6168 -12 49 -203 -89 -77 -230 -141 -151 119 201 114 43 162 298 18 -101 -125 136 -201 34 -132 176 -178 254
6191 254 -98 110 -186 -209 -111 291 356 -192 112 38 98 164 25 3 29 -157 -31 289 118 -93 238 133 5
6214 5 -49 -48 188 63 -73 -91 3 91 14 -130 299 118 193 -113 77 -256 -37 -36 -83 -195 188 95 -141 -31 -63
6239 -63 142 -104 -102 89 47 41 125 65 -107 108 90 -33 88 -284 3 -212 193 53 -66 102 212 61 -219
6262 -219 33 -97 28 -174 -6 -150 -248 215 14 -270 -215 17 -87 -29 116 -95 42 47 7 156 -70 -125
6284 -125 44 71 223 37 -73 7 63 1 293 -175 -151 -121 -47 -214 106 230 245 231 -154 167 -46 -8 -63 19
6308 19 255 32 -221 -256 -111 31 -134 261 -94 -63 242 50 -41 231 -152 -140 -45 -198 -142 68 -10 207 -36
6331 -36 -320 -41 -62 355 -54 -89 -98 233 47 168 272 -224 -241 -74 -121 -49 -169 37 -24 78 -125 26 -115
6354 -115 53 -32 -146 -34 -151 20 143 -345 -71 -215 142 -81 -87 162 -258 -154 -212 29 -92 -23 -116 24
6376 24 164 -91 111 -262 -166 49 -260 -27 -163 5 -253 202 161 108 48 -121 -121 76 -248 -26 13 -41 -204
6399 -204 75 -37 136 -39 233 234 -159 -17 -173 14 -105 127 -39 -97 151 175 -1 222 44 -192 -206 -119
6421 -119 -73 120 -266 239 273 -21 49 151 -199 49 -137 25 -136 -186 -120 179 116 -164 -95 -72 -20 -72 24 67
6445 67 49 -143 31 130 194 -103 -120 18 -290 234 63 -74 -65 -257 54 -146 182 -86 -89 15 -90 207 -15
6468 -15 -92 -121 -139 92 26 25 -114 -124 187 102 11 -323 33 135 -116 -34 13 156 172 50 150 -29 -61 -1 -35
6493 -35 -106 167 0 -174 -76 -99 120 -170 -63 160 237 296 -108 -97 -319 101 -83 -92 104 -129 73 -60 283
6516 283 -83 6 -30 -110 -28 69 -25 130 253 -67 245 -66 -136 -184 135 -113 -127 -222 11 -123 -166 -185 5 -164
6540 -164 116 33 -264 -184 -133 56 -145 20 -233 -139 -100 -150 91 -1 117 114 108 -221 -101 -50 -148 -148 11 28 17 102
6566 102 -16 -125 171 12 -77 133 -250 222 -20 127 -135 58 246 113 219 102 -68 -135 97 313 272
6587 272 103 196 -11 194 26 58 -134 275 -97 -133 -126 291 194 -133 78 226 121 187 -27 38 -57 108 -117
6610 -117 -262 206 129 5 -84 -196 104 -406 -107 38 -121 97 114 -65 -100 42 90 5 -50 114 -7 -65 -23
6633 -23 16 218 66 64 17 -336 -296 33 -62 147 120 255 -171 131 -4 -180 129 -136 -83 -189 44 -73 -30
6656 -30 182 17 -164 -213 -24 -104 51 162 -246 28 -67 70 254 -153 -215 -118 -118 80 159 4 -125 121 -45
6679 -45 200 -2 -57 -77 59 84 198 -10 -72 379 32 81 27 -15 158 17 -65 54 153 98 -132 9 30 -116
6703 -116 -40 -53 -244 33 -53 -113 88 -130 4 -3 154 34 142 143 -26 -93 -71 -56 304 80 -8 -234 58 -126
6727 -126 -182 77 -11 99 2 318 -4 24 -249 -14 123 -36 -1 -142 -63 152 -28 -79 171 88 116 -98 -155
6750 -155 45 -206 11 -72 -208 -4 147 -58 -184 183 -99 197 144 -55 42 27 101 34 0 8 -18 -48 -140 161
6774 161 245 6 -101 -90 359 -41 19 86 -256 -40 147 98 -45 19 20 22 165 -126 69 -97 126 6 18 -226
6798 -226 19 -216 -160 -146 115 -2 -250 -89 -36 22 32 -185 -4 -291 -283 -9 130 98 95 -219 104 269 117
6821 117 -102 114 -127 -79 -59 -180 -237 -45 84 88 -233 61 -8 -23 134 100 27 -159 223 -38 255 -87 19
6844 19 -41 -170 114 -162 -97 184 -69 169 -157 253 -85 28 -214 27 -117 -50 178 62 -21 -69 283 -210
6866 -210 -121 -20 221 -348 -1 4 62 -299 88 169 109 -14 -253 -101 -5 -183 -38 12 164 237 -138 -76 -19 162
6890 162 281 17 -16 263 24 79 483 -34 81 16 -13 155 145 187 87 -152 131 117 -224 103 -1 83 -229
6913 -229 -180 14 -131 142 76 -116 209 66 5 87 -83 192 -330 18 -53 325 -62 -101 43 -17 -140 166
6935 166 -88 -35 156 -342 179 -67 -74 -234 75 222 -121 -130 -129 5 232 -181 10 294 -91 138 -62 -63 -80
6958 -80 44 -68 13 37 -188 98 -113 85 227 -1 -20 -35 128 244 -25 -4 -86 -162 -56 138 250 -147 -4
6981 -4 147 95 -68 19 -10 -178 97 -1 -61 -28 -176 -1 15 171 356 272 -107 -38 -148 136 -86 -96 135 -98
7005 -98 -118 20 -59 196 181 -140 67 64 145 89 93 81 -136 -329 83 119 123 225 -163 -88 144 74 7 144 345 -119
7031 -119 64 152 102 -216 100 27 139 97 44 -176 106 -169 -7 -152 -121 83 -128 270 51 13 7 48 120 46
7055 46 365 -154 91 24 29 -221 -271 89 -58 -98 -35 -233 38 -54 -112 42 9 342 -76 -92 39 -46 -11 99
7079 99 26 3 259 -18 50 2 0 -54 231 22 184 -160 -9 40 133 27 -10 -29 132 -83 -128 181 36 -65
7103 -65 293 -9 92 126 -62 43 -12 -58 -79 -252 288 179 93 -216 -1 -55 -35 -173 -51 273 43 -117 -189
7126 -189 -156 43 8 -98 -239 25 -155 272 -114 44 -45 33 424 11 2 -250 -7 74 -3 79 168 52 87 -88
7150 -88 -36 -177 282 -171 99 10 55 77 120 -138 -95 -144 -119 -285 -45 25 60 -47 89 172 -88 -1 72 78 -96
7175 -96 -208 -37 226 -161 -38 113 -153 -42 -17 -19 -290 15 106 152 223 -142 -173 173 100 -59 45 -183 -297
7198 -297 -264 -258 4 62 17 116 85 -168 36 -2 -92 158 -134 -63 -321 115 -204 50 193 -65 -201 -32 -77 -92
7222 -92 28 -30 -188 193 -22 81 -22 20 99 220 -157 69 -186 73 -214 114 99 81 78 -191 29 -93 -268
7245 -268 -122 0 -433 -32 20 10 152 -63 82 321 -98 97 172 -168 21 134 152 170 -192 85 -18 219
7267 219 69 77 16 -10 21 -131 -6 -239 -231 -260 -141 -249 -141 150 254 -75 -14 109 -35 130 -165 -189 130
7290 130 -198 -53 -168 101 77 4 82 -196 -106 39 -64 75 77 -53 -26 67 87 -13 5 38 14 -83 -175 -30 -19
7315 -19 134 -14 61 223 -115 -83 -50 -108 -134 162 -11 -212 -205 -12 122 73 62 -94 122 31 -34 313 -203 -128
7339 -128 155 361 167 -176 -107 -72 128 -87 80 -9 41 -104 110 76 -285 -95 114 20 33 73 -225 380 -180
7362 -180 71 5 174 -5 -116 33 -81 -9 3 17 -133 45 91 4 -6 -137 104 151 15 51 -77 -36 23 107
7386 107 124 -53 -63 27 195 -103 -140 124 -89 237 -218 -164 -18 77 18 101 -218 -285 -103 120 1 -88 -119 71
7410 71 232 142 -323 123 -87 72 -122 -56 -236 -43 -264 -214 -22 76 -186 281 86 -47 22 -89 -99 -144 139
7433 139 214 -106 63 -94 -54 11 -257 -90 101 367 70 -89 70 257 -99 -442 -128 -124 33 22 -391 -21
7455 -21 -96 168 35 -117 -91 185 95 -121 2 -6 10 -24 -268 244 -54 -182 -246 -110 34 -167 155 -210 -135
7478 -135 104 374 -50 -137 -250 -240 122 25 -81 -262 -46 -69 70 70 -49 15 -299 231 -121 -6 203 23
7500 23 -51 -43 11 -23 183 -182 -109 -143 -104 -137 -252 91 -60 -7 -157 -366 -122 -235 -114 104 21 102 -48 23 -171
7525 -171 65 188 -270 211 34 48 -23 -131 194 98 38 -120 -3 17 -31 157 79 133 241 118 -129 71 224
7548 224 31 -101 84 6 58 40 -41 -29 83 -218 164 63 176 78 118 -36 -106 90 -45 35 48 78 140 -169
7572 -169 87 37 -21 -144 -15 72 -89 -62 149 73 -38 327 301 291 172 29 -44 -95 -147 -34 2 -43 -54 30 166
7597 166 34 100 7 134 -41 91 73 143 -140 -157 -209 -53 154 -209 -45 -128 143 66 -84 114 -104 60 -26
7620 -26 138 243 11 -102 7 -24 60 -102 -13 140 -197 35 -15 213 37 -75 154 -133 -134 -33 12 -49 -172
7643 -172 -20 -36 -70 -134 -29 21 -42 -102 -172 304 -24 177 44 -25 -107 -355 4 -99 258 -83 110 295 -113
7666 -113 -57 -242 -99 -184 288 -36 185 33 -84 44 189 309 -76 -221 71 123 88 192 -126 212 -71
7687 -71 -15 145 -150 -124 123 127 127 9 171 35 -108 56 50 -7 -6 -150 45 82 94 -60 247 -68 -28 399 202
7712 202 392 -95 24 -87 -119 -175 -84 60 -228 -103 69 -45 -5 58 -123 252 -248 -1 181 129 -109 2
7734 2 112 -51 41 111 -108 -112 -60 -162 -151 -68 129 56 87 99 -61 -114 -66 226 -84 50 -349 -127 -141 95 -181
7759 -181 -21 74 -56 -65 -39 27 -362 -104 24 36 -28 71 267 -12 111 -89 -196 -417 75 -65 194 58 -81
7782 -81 -225 -8 -147 85 150 120 -79 -136 -190 -116 153 -87 43 90 -6 -136 -134 -207 100 12 -179 -50 -34 98
7806 98 -57 -177 -297 55 53 -85 -191 -142 30 44 -46 -128 219 25 -87 -86 -90 -209 163 71 209 -24 -169 -171 -273
7831 -273 -169 103 -259 -86 -72 -187 -14 49 -141 -36 -19 143 -184 77 -154 112 45 -69 -172 129 255
7852 255 -163 -39 37 28 262 -17 -113 9 -74 81 116 -384 -83 1 -200 -382 -301 177 149 208 -65 165 -8
7875 -8 36 -25 70 -180 157 263 -90 -160 -136 166 -36 -163 230 131 5 -79 -136 -47 -178 -87 34 -29 -5 -61 -90
7900 -90 123 155 -229 -111 111 88 53 28 131 264 277 297 -8 154 -17 349 67 -156 -124 -86 -220 38 -102
7923 -102 -6 -81 -241 62 -50 53 -247 -126 -273 13 309 -82 -72 415 -57 -57 -242 121 99 -308 59 16
7945 16 -37 44 -64 -66 64 -47 176 57 -174 -31 -30 -61 -19 57 106 34 130 -53 -70 -157 10 -190 -66 36 132
7970 132 -124 -18 -87 -178 45 -19 -47 -189 14 46 -164 0 77 346 -100 -161 -134 -193 0 -299 -56 -83 -120 -161
7994 -161 -42 -165 71 95 -193 139 43 96 50 -3 -192 141 149 -223 -118 -200 -157 -147 -213 208 -104 -153 -164 56
8018 56 23 241 -58 42 -262 -56 3 4 -24 79 72 73 101 80 47 -108 165 -182 133 -27 67 0 213 6 -93
8043 -93 102 131 398 -139 160 -17 31 57 42 147 205 -148 2 -144 502 -82 18 201 -14 -338 -181 -94
8065 -94 -25 57 -217 -86 -101 -44 42 151 -33 24 -76 -160 19 3 -166 -42 -76 111 17 202 -37 -48 206 2
8089 2 -96 201 107 -123 -132 296 -9 -178 65 -188 204 -60 -94 -37 -16 -127 33 97 33 -131 274 -165 -135 119
8113 119 -78 57 49 -286 305 -132 -47 -286 -16 167 142 4 253 17 -90 -9 22 176 -121 29 204 -541
8135 -541 -216 135 -94 -120 -52 243 -154 -52 122 9 14 -47 63 -25 102 -180 -65 30 -56 120 -39 338 1
8158 1 10 -20 24 -77 47 140 -191 -180 -282 128 114 156 -16 8 -2 -150 108 -218 24 22 122 -8 -56 -176 -2
8183 -2 -53 51 29 -99 -184 -172 -5 -14
8191a4
##END NTUPLES=NMR FID
##END=
