##TITLE=1H_Ser DHA-N-oxim
 CDCl3+DMSO
 8 sc, 
 20.2.2024
##JCAMPDX= 6.0         $$ Bruker NMR JCAMP-DX V2.0
##DATA TYPE= NMR FID
##DATA CLASS= NTUPLES
##ORIGIN= UXNMR, Bruker Analytische Messtechnik GmbH
##OWNER= root
$$ XWIN-NMR		Version 3.5
$$ Tue Feb 20 14:08:37 2024 Russian Standard Time (UT+4h)  she@DPX200
##.OBSERVE FREQUENCY= 200.1313
##.OBSERVE NUCLEUS= ^1H
##.DELAY= (6, 6)
##.ACQUISITION MODE= SIMULTANEOUS
##.ACQUISITION SCHEME= undefined
##.AVERAGES= 8
##.DIGITISER RES= 18
##SPECTROMETER/DATA SYSTEM= spect
##.PULSE SEQUENCE= zg30
##.SOLVENT NAME= CDCl3
##.SHIFT REFERENCE= (INTERNAL, CDCl3, 0, 15.7039)
##AUDIT TRAIL= $$ (NUMBER, WHEN, WHO, WHERE, WHAT)
$$ ##TITLE= Audit trail, XWIN-NMR		Version 3.5
$$ ##JCAMPDX= 5.01
$$ ##ORIGIN= Bruker BioSpin GmbH
$$ ##OWNER= she
$$ F:/spectra/data/she/nmr/H-F/1/audita.txt
$$ ##AUDIT TRAIL=  $$ (NUMBER, WHEN, WHO, WHERE, WHAT)
(   1,<2024-02-20 14:07:00.03 +0400>,<she>,<DPX200>,
      <created by zg, POWCHK disabled, PULCHK disabled
       configuration hash MD5:
       00 E9 B6 7A A2 85 ED C7 34 08 36 98 17 FE 4E 26
       data hash MD5: 16K
       9E F2 24 17 B3 D0 2B F3 8C DB 1C 8F 83 69 10 D3>)
$$ ##END=
$$ 
$$ hash MD5
$$ 0F 8C 36 C3 BE F4 57 6E 35 71 08 B7 98 EB 7A 71
##$RELAX= 
##$RELAX= 
##$RELAX= 
##$RELAX= 
##$RELAX= 
##$RELAX= 
$$ Bruker specific parameters
$$ --------------------------
##$DU= <F:/spectra>
##$EXPNO= 1
##$NAME= <H-F>
##$PROCNO= 1
##$TYPE= <nmr>
##$USER= <she>
##$AMP= (0..31)
100 100 100 100 100 100 100 100 100 100 100 100 100 100 100 100 100 100 
100 100 100 100 100 100 100 100 100 100 100 100 100 100 
##$AQSEQ= 0
##$AQ_mod= 1
##$AUNM= <au_zg>
##$AUTOPOS= <>
##$BF1= 200.13
##$BF2= 200.13
##$BF3= 200.13
##$BF4= 200.13
##$BF5= 200.13
##$BF6= 200.13
##$BF7= 200.13
##$BF8= 200.13
##$BYTORDA= 1
##$CFDGTYP= 0
##$CFRGTYP= 5
##$CHEMSTR= <none>
##$CNST= (0..31)
1 1 145 1 1 1 1 1 1 1 1 1 1 1 1 1 1 1 1 1 1 1 1 1 1 1 1 1 1 1 1 1 
##$CPDPRG= <>
##$CPDPRG1= <>
##$CPDPRG2= <>
##$CPDPRG3= <>
##$CPDPRG4= <mlev>
##$CPDPRG5= <mlev>
##$CPDPRG6= <mlev>
##$CPDPRG7= <mlev>
##$CPDPRG8= <mlev>
##$CPDPRGB= <>
##$CPDPRGT= <>
##$D= (0..31)
0 1.2 0 0 0 0 0 0 0 0.06 0 0.03 0 0 0 0 0.0002 0 0 0 0 0 0 0 0 0 0 0 0 
0 0 0 
##$DATE= 1708423619
##$DBL= (0..7)
120 120 120 120 120 120 120 120 
##$DBP= (0..7)
150 150 150 150 150 150 150 150 
##$DBP07= 0
##$DBPNAM0= <>
##$DBPNAM1= <>
##$DBPNAM2= <>
##$DBPNAM3= <>
##$DBPNAM4= <>
##$DBPNAM5= <>
##$DBPNAM6= <>
##$DBPNAM7= <>
##$DBPOAL= (0..7)
0.5 0.5 0.5 0.5 0.5 0.5 0.5 0.5 
##$DBPOFFS= (0..7)
0 0 0 0 0 0 0 0 
##$DE= 6
##$DECBNUC= <off>
##$DECIM= 32
##$DECNUC= <off>
##$DECSTAT= 4
##$DIGMOD= 1
##$DIGTYP= 9
##$DL= (0..7)
0 120 120 120 120 120 120 120 
##$DP= (0..7)
150 150 150 150 150 150 150 150 
##$DP07= 0
##$DPNAME0= <>
##$DPNAME1= <>
##$DPNAME2= <>
##$DPNAME3= <>
##$DPNAME4= <>
##$DPNAME5= <>
##$DPNAME6= <>
##$DPNAME7= <>
##$DPOAL= (0..7)
0.5 0.5 0.5 0.5 0.5 0.5 0.5 0.5 
##$DPOFFS= (0..7)
0 0 0 0 0 0 0 0 
##$DQDMODE= 0
##$DR= 18
##$DS= 0
$$ [...]
##$SUBNAM2= <"">
##$SUBNAM3= <"">
##$SUBNAM4= <"">
##$SUBNAM5= <"">
##$SUBNAM6= <"">
##$SUBNAM7= <"">
##$SUBNAM8= <"">
##$SUBNAM9= <"">
##$SW= 18.0517328524113
##$SWIBOX= (0..15)
0 0 2 0 0 0 0 0 0 0 0 0 0 0 0 0 
##$SW_h= 3612.71676300578
##$TD= 16384
##$TD0= 1
##$TE= 0
##$TE2= 300
##$TE3= 300
##$TEG= 300
##$TL= (0..7)
0 120 120 120 120 120 120 120 
##$TP= (0..7)
150 150 150 150 150 150 150 150 
##$TP07= 0
##$TPNAME0= <>
##$TPNAME1= <>
##$TPNAME2= <>
##$TPNAME3= <>
##$TPNAME4= <>
##$TPNAME5= <>
##$TPNAME6= <>
##$TPNAME7= <>
##$TPOAL= (0..7)
0.5 0.5 0.5 0.5 0.5 0.5 0.5 0.5 
##$TPOFFS= (0..7)
0 0 0 0 0 0 0 0 
##$TUNHIN= 0
##$TUNHOUT= 0
##$TUNXOUT= 0
##$USERA1= <user>
##$USERA2= <user>
##$USERA3= <user>
##$USERA4= <user>
##$USERA5= <user>
##$V9= 5
##$VALIST= <valist>
##$VCLIST= <CCCCCCCCCCCCCCC>
##$VD= 0
##$VDLIST= <DDDDDDDDDDDDDDD>
##$VPLIST= <PPPPPPPPPPPPPPP>
##$VTLIST= <TTTTTTTTTTTTTTT>
##$WBST= 1024
##$WBSW= 4
##$XGAIN= (0..3)
0 0 0 0 
##$XL= 0
##$YL= 0
##$YMAX_a= 224799
##$YMIN_a= -235803
##$ZGOPTNS= <>
##$ZL1= 120
##$ZL2= 120
##$ZL3= 120
##$ZL4= 120
##$ABSF1= 10
##$ABSF2= 0
##$ABSG= 5
##$ABSL= 3
##$ALPHA= 0
##$AQORDER= 0
##$ASSFAC= 0
##$ASSFACI= 0
##$ASSFACX= 0
##$ASSWID= 0
##$AUNMP= <proc_1d>
##$AZFE= 0.1
##$AZFW= 0.1
##$BCFW= 1
##$BC_mod= 2
##$BYTORDP= 1
##$COROFFS= 0
##$CY= 11.3945322036743
##$DATMOD= 1
##$DC= 2
##$DFILT= <>
##$DTYPP= 0
##$F1P= 15.7292609196834
##$F2P= 12.9074282941183
##$FCOR= 0.5
##$FTSIZE= 0
##$FT_mod= 4
##$GAMMA= 1
##$GB= 0.15
##$INTBC= 1
##$INTSCL= 1
##$ISEN= 128
##$LB= 0.24
##$LEV0= 0
##$LPBIN= 0
##$MAXI= 10000
##$MC2= 0
##$MEAN= 0
##$ME_mod= 0
##$MI= 1.114404
##$NCOEF= 0
##$NC_proc= 0
##$NLEV= 6
##$NOISF1= 3.799351
##$NOISF2= 2.8
##$NSP= 1
##$NTH_PI= 0
##$NZP= 0
##$OFFSET= 15.70392
##$PC= 1
##$PHC0= -24971.4
##$PHC1= 30.85264
##$PH_mod= 1
##$PKNL= yes
##$PPARMOD= 0
##$PSCAL= 0
##$PSIGN= 0
##$REVERSE= no
##$SF= 200.130013532006
##$SI= 16384
##$SIGF1= 3
##$SIGF2= 2
##$SINO= 400
##$SIOLD= 16384
##$SREGLST= <1H.CDCl3>
##$SSB= 0
##$STSI= 0
##$STSR= 0
##$SW_p= 3612.71676300578
##$SYMM= 0
##$S_DEV= 0
##$TDeff= 0
##$TDoff= 0
##$TI= <>
##$TILT= no
##$TM1= 0
##$TM2= 0
##$TOPLEV= 0
##$USERP1= <user>
##$USERP2= <user>
##$USERP3= <user>
##$USERP4= <user>
##$USERP5= <user>
##$WDW= 1
##$XDIM= 8192
##$YMAX_p= 0
##$YMIN_p= 0
$$ End of Bruker specific parameters
$$ ---------------------------------
##NTUPLES= NMR FID
##VAR_NAME=  TIME,          FID/REAL,        FID/IMAG
##SYMBOL=    X,             R,               I
##VAR_TYPE=  INDEPENDENT,   DEPENDENT,       DEPENDENT
##VAR_FORM=  AFFN,          ASDF,            ASDF
##VAR_DIM=   8192,          8192,            8192
##UNITS=     SECONDS,       ARBITRARY UNITS, ARBITRARY UNITS
##FACTOR=    0.0002768,     1,               1
##FIRST=     0,             0,               0
##LAST=      2.2672688,     0,               0
##MIN=       0,             -235803,         0
##MAX=       2.2672688,     224799,          0
$$ Real data points
##PAGE= N=1
##DATA TABLE= (X++(R..R)), XYDATA
0@%%%%%%%%%%%%%%%qJ6j6J6k1K9l2L7m5N2o0O9p9R0j04J20j38J59j79K03k29K54
37A34k85L21l59L98m42M92n45O02o65P34q11Q95r86J085j195J317j453J605j775
56i33J970k194K454k760L127l574M137m872N871p316R609j3822K4103r8818j52785
71b35803J26249J92517J16642j43227j95597K4443K07276J11716r4081j96186
81h6051p9285R7251J53166M829j43392r2287O6965J45388Q1880q8085j46701j7962
93a04284J19913Q5972n6361j05022k7040O1408J02882K9881q2740q3464O631P4492
105B2268M2377n7428r2152j9011Q4346Q1638j7169n6677j9847K9226N8776J3762
117G0109n9357o1898K115N3452K9038j8999l4753k1393L5309N7403o020n8383
$$ y = [0, 0, 0, 0, 0, 0, 0, 0, 0, 0, 0, 0, 0, 0, 0, 0, -8, 8, -8, 8, -13, 16, -16, 21, -24, 28, -32, 37, -42, 48, -56, 64, -74, 85, -94, 109, -120, 134, -151, 170, -189, 209, -233, 259, -286, 316, -349, 385, -426, 469, -517, 568, -627, 690, -763, 842, -933, 1037, -1157, 1297, -1463, 1664, -1910, 2227, -2645, 3226, -4090, 5519, -8303, 15800, -83018, -235803, -109554, 82963, 199605, 56378, -139219, -114776, 92500, 204216, 110135, -86051, -165336, -68085, 85081, 89910, -53482, -145769, -78804, 66584, 148464, 60379, -86322, -104284, 15629, 101601, 45240, -59782, -86822, -25414, 77468, 107349, 24609, -58855, -52224, 22268, 64645, 7217, -84935, -103946, -19600, 62038, 44869, -11808, -31655, -2429, 56347, 70109, 10752, -51146, -49031, 4421, 33459, 14460, -20293, -41686, -6377, 51026, 45006, -13377]
129a3377l7239K2343M1845K053k4477k1576M977L9242K9690o349k9824k3334J6101
142G5K3586p677k8829k6989P566L2404J6734r952k4121K082L1224J1017j5405
155A1715k1174q165P657Q359J0347j723k0032L583K7768J3926j4473k4426l252
168i890O852O55m245j5617o761J6912J7228Q955k158m990K562J184J750n240j8042
183a0845r964N325J6680R106j2083l09J6071M812p260j2746q471p147n053R705
197a2179M588k240P840J1011J2777N359r797j1014r784j614l89j0944l497Q292
211a1591J2552R973k018J887J288j0501n403o01n303p954j236J6336J3805n85
225A0649K768K137N03m515j1718q012p555l396N798K416N434Q428M807L930P05
$$ y = [-13377, -50616, -28273, 13572, 15625, -8852, -30428, -25451, 13791, 43481, 37132, 7308, -16026, 75, 23661, 15984, -12845, -39834, -32268, 136, 16870, 6918, -17203, -15121, 16103, 27120, 11715, -9459, -17624, -9967, -1608, 8739, 7016, -13016, -9433, 18335, 32261, 17788, -6638, -9890, -3038, -2383, -6628, -22245, -29006, -12094, 5134, 14089, 11931, 6941, 9503, 10687, 12437, 7197, -10845, -20809, -15484, 1196, 10302, -1781, -2090, 13981, 18793, 11533, -1213, -9684, -16831, -21884, -12179, -7591, -9831, -1991, 9020, 21797, 27156, 17359, 6345, -3439, -5053, -5442, -16386, -19883, -11591, 961, 10934, 8916, 10803, 12091, 1590, -3813, -4414, -9717, -17671, -18907, -2571, 11234, 10649, 13417, 15554, 16057, 11542, -176, -8188, -15743, -19139, -13341, -10925, -5491, 2937, 7744, 11674, 12379]
240A2379l19o629j4108p6O659k925j662M328J0192M102n090M48k136q735n553
255i125l143J389n61J19J0580P157L564L500l023k102j354l508n657q218L128
270g254M514m122K741N884J693k422l156M419j848q187J100M683K931L23K34P379
286H912J170l017Q37m515l928k495m341j400j537L076L578k001O144N873k310
301D046q74J245L186l556p252L161J734l740j68K846L643k217m016L403k555m271
317e385p64j688J560J233K654M580J528N949L831m748j592j851m484o122n065
332a0364L890N90l472N339O717J847j931r83K979m868n936J505M70J580L999M028
348E390M916j40K80j478p780l790l952o669j930K023O634M087J484R183M469m174
$$ y = [12379, 12060, 5431, -8677, -8753, -2094, -5019, -6681, -2353, 7839, 11941, 6851, 7299, 5163, -3572, -9125, -12268, -10879, -11440, -11321, -741, 6416, 9980, 13480, 10457, 8355, 7001, 3493, -2164, -10382, -7254, -2740, -6862, -4121, 1763, 3456, 1034, -2122, 2297, 449, -7738, -6638, -1955, 976, 1299, 1533, 8912, 10082, 7065, 7902, 3387, -541, -3036, -7377, -8777, -10314, -7238, -3660, -5661, 483, 6356, 4046, 3172, 4417, 7603, 4047, -3205, -44, 1690, -2050, -2218, 628, 4271, 2054, -1962, 1441, -1114, -5385, -6149, -7837, -6277, -5044, -2390, 2190, 3718, 9667, 13498, 8750, 7158, 5307, 823, -5299, -10364, -6474, -5884, -9356, -4017, 2700, 4547, 2616, 1633, 4612, -256, -6192, -4687, -4217, -2637, 1362, 5390, 10306, 10166, 10446, 8968, 1188, -2602, -6554, -13223, -15153, -13130, -6496, -2409, -925, 8258, 12727, 8553]
364H553l444k083j749o272l215N896K073L69M964L482J216m016m873l498p158
379i755k728M2l58N237P303O756L272k75L627k314q685k496k148l403k691K405
395f211Q185M81j032M346n66l883n267k776K08l187J526N825K328M456M618J673
411A0724m85l805p32m998o845J201L22k773J438M566M228k360j320L895k235m166
427c345k61J156J726j160L198N684j204m0J614k179l191l832j396k623l092L531
443e414O58j866M105L990J480r95L23L910k662l022J997L57j370j668J730K263
459C816m142r70K550k949k442j051j80k46r48M385K076k14M496K730j45q2p57
476E927O70n061m101J516k308k633J019L032K102k978J101L755l505k103J693
$$ y = [8553, 5109, 3026, 1277, -4995, -8210, -2314, -241, 128, 5092, 8574, 9790, 5774, 901, -2597, -9755, -12483, -12441, -12799, -7562, -259, 6497, 9769, 9494, 13121, 10807, 2122, -374, -2522, -5925, -8616, -6211, 1974, 2455, 1423, 5769, 5203, 1320, -3947, -6723, -6515, -9702, -8176, -2351, -23, 4433, 9051, 10724, 10239, 6434, 5702, 704, -6141, -4940, -4618, -7391, -5953, -1387, 2841, 481, -839, 3056, 821, -3345, -3606, -2450, -724, -1884, 1314, 6998, 5794, 5754, 7368, 5189, 1998, -1834, -3230, -5853, -8945, -5414, -4756, -6622, -2517, 1473, 2953, 1958, 2281, 6191, 3529, 507, 2504, 2861, 1491, -177, 1553, 3816, -326, -1296, 1254, -1695, -4137, -5188, -5368, -5614, -6562, -2177, -101, -315, 4181, 6911, 6766, 6684, 5927, 6597, 1536, -2565, -1049, -3357, -5990, -4971, -1939, 163, -2815, -1714, 2041, -1464, -3567, -1874]
491a874m52L42M41M430L064m59K992O66l887k616l439k802m534k777M180Q79J50
508e696N898M423Q43j575L94J02o181k064K307j102J186L129M226J665k956L68
524D967k357o124l425k379p61L44K895Q007L342J779N068l48m877l807l072k771
540c519m839Q18M819L46L108M118J757j099m670j761k067n596J82K184K712L364
556a43M379N533j08k152P64m839o499k276j836j018m53L948N718P16J633L461
572F828j350k917l486n23q83l671K559L690N85K054K567J466k170l378q5m216
588b930m486J052K35O61K399L275M187l72N79K371k773l006k071q78j210k517
604e484K785L082j420K097K693n69j577j584N33k701l102K267k28K68L051K072
$$ y = [-1874, -2326, -1984, -1543, 2887, 5951, 5492, 8484, 9150, 5263, 2647, -792, -3594, -8128, -10905, -6725, -5846, -5696, 202, 4625, 5468, 3893, 4287, 4389, -1792, -3856, -1549, -2651, -1465, 1664, 5890, 7555, 4599, 4967, 2610, -3514, -6939, -9318, -10079, -9735, -6840, 1167, 4509, 6288, 11356, 11008, 6131, 2324, -748, -3519, -8358, -7540, -2721, -2375, 733, 4851, 6608, 5509, 839, -922, -2989, -8585, -8403, -6219, -3507, -143, 4236, 9769, 9661, 7509, 8273, 3434, -3065, -5341, -7177, -8195, -8648, -4700, 1018, 1734, 3367, 6828, 5478, 2561, -925, -1448, -2331, -6002, -3443, 247, 832, 2886, 5453, 6919, 4749, 1371, 1286, -2930, -7416, -6364, -6129, -5468, -3069, 206, 4393, 4021, 4600, 6971, 4198, 1192, -879, -1757, -2967, -5484, -2699, 383, -1037, 1060, 3753, 3184, 1607, 23, 556, -2145, -5247, -2980, -3208, -2940, 111, 2183]
620B183K772m10M57R47m121l020p20j848j682r92K646K900m68L752L523j262j354
637C303j174j427k803k578K061L28J20L611J710J452o44q83j45n073l308P2j675
654g053L66K967M085L133M11L501R40m171j991k054l098k261q96L245J228R92
670f56L998P50j517j609j491j206l652q28L188O66K201M187K420M99j485m22j706
687C337n743j663o31j626J185J442L366J577m01K797q80l159j62o65J69p26J234
704e49L865o05Q16J724j945k379k109j186j319l190J793K279K5K349K087J573
720C229l15q90J240j952k419J469P19n36J91L32J324k189j111N98k756j439K96
737d209Q00Q03K91L235K406n11J278N70j441j385j424O66j675k046J974L84j634
$$ y = [2183, 4955, 4545, 5002, 5949, 1828, -1192, -1912, -3760, -5442, -6434, -3788, -888, -1356, 2396, 5919, 4657, 3303, 2129, 702, -2101, -4679, -2618, -2290, -2170, 1441, 3151, 4603, 3959, 3076, 2931, -2142, -5450, -5378, -7053, -6687, -3720, 365, 3498, 3909, 7410, 8350, 4179, 2188, 134, -2964, -5225, -6121, -2876, -1648, -656, 3342, 4092, 2575, 966, -525, -1731, -5383, -6211, -3023, -2357, -156, 4031, 6451, 6950, 5465, 5043, 3337, -2406, -4069, -4700, -6326, -5141, -3699, -333, 1244, 843, 3640, 2760, -399, -561, -1226, -1057, -1783, -549, 3316, 2711, 3527, 5251, 3306, 927, -1182, -2368, -3687, -6877, -5084, -2805, -2780, -431, 1656, 3229, 2914, 2024, 3264, 1312, -1107, 362, 1081, 545, 736, 1068, 2392, 203, -908, -310, -3066, -4505, -4209, -3409, -2606, -2315, 920, 3326, 2815, 4093, 4663, 3222, 1837, 413, 1079, -596, -2642, -668, -284, -1918]
754a918Q35K29lj486k64K069k048L9K975Q58Q37J79J794N74k149L88k58l010j194
773a553q21k73j200r60K673M72n40K351R80l8l2M52J283k271n49J870r16R3P69
792A790M97m6k131K56n36l369j015N70n11O5J456L358J903J15L093r5j715j706
810A979j109j018k808l58K128k59Q57K446J94n66j649k68j559l293N85J901P48
827b049J933K557K878N95r25J496k914m787j458j455j042m56J766L520Q14J209
843A682K230j285j600j729m91q79k351K366K872M03K538J831pj874k325j080l374
860c073l760J034P85O13K236K519L432m09O2J576l020k516j48r26l79n11K767
877B82K227r32Q88N13k113j862j510k81j397j524L090J659N06K321K355N14j351
$$ y = [-1918, -1083, -854, -857, -2343, -2607, -538, -2586, -2547, 428, 1286, 2123, 2302, 4096, 4670, 2521, 2909, 2651, -359, -1553, -2374, -2647, -3847, -4807, -2134, -1662, -2202, 149, 1129, 1091, 1059, 1511, 2794, 523, -26, 1844, 928, 1021, 1790, 2287, 2241, 110, 366, -170, -3539, -4554, -3984, -4495, -4430, -2974, 384, 2287, 2402, 5495, 5400, 3685, 1979, 870, -148, -2956, -3314, -1186, -1445, -588, 1858, 2052, 1486, -163, -431, -1990, -5283, -4698, -2797, -2049, -116, 2441, 5319, 5914, 4989, 6485, 3571, -1216, -2674, -4129, -5171, -5627, -3861, -341, 473, 1682, 3912, 2627, 1027, -702, -1193, -2072, -4423, -2057, 815, 1218, 3756, 5587, 5580, 3706, 1381, 301, -3073, -6833, -5799, -5014, -4401, -2165, 354, 3786, 3377, 3439, 5015, 1995, -521, -669, -1595, -1974, -2485, 282, 2509, 1577, 2465, 2978, 865, -997, -2507, -2788, -4185, -5709, -2619, -960, -454, 1867, 4222, 4736, 3385]
894C385n68K50l041k213P01n45k13K1J782J222j372R00Q43j714o49K3M8k79j50
913a569K599Q22o62J759L09o12j558p78J52k960j465J721p31j4J428J782J230
930A453q60J581J000k522j29pp44p17n33J726M69r57J757L83j606q39m37n06j834
949c322j66K609qM39K551J184R8l38l08p30l095j029K38j205Q0J002K405M34m19
968D20J843r0k527m07k92l42r58Q52K892n9L87K308n14j809j546j082j312k531
986d767M76K218m25J850K276J407qj289Q05j547k996P08K20m97P54J712J560p34
1004A723n39R19k121k479q9n52lJ02K230K584j62R79J516r70j743j346l50j115
1022a416k283J930Q60l16J283R23M51r88q06O97j527j374J627K89M16J131J439
$$ y = [3385, 2817, 3067, 26, -2187, -1486, -2031, -2244, -2223, -441, 781, -591, 309, 1152, -562, -1211, -1188, -1140, -1419, -1569, 1030, 1852, 1190, 2949, 3258, 2646, 1088, 310, 462, -2498, -3963, -2242, -2973, -2987, -1559, 223, 1453, 593, 2174, 3174, 652, 523, 516, -228, -945, -1478, 248, 717, -240, 1517, 1900, 294, -545, -982, -1488, -3322, -3488, -879, -887, -448, 2103, 3287, 3385, 3047, 2739, 2009, -1086, -2115, -1877, -3082, -3002, -2000, 405, 839, 420, 2263, 2173, -354, -761, -1053, -1395, -2353, -1501, 1391, 1332, 1719, 4027, 3513, 1704, 158, -924, -2236, -4767, -4291, -2073, -2498, -648, 1628, 3035, 3027, 1738, 2543, 996, -2000, -1292, -1072, -1569, -815, 897, 2457, 1723, 1184, 2103, -18, -2497, -2586, -3138, -3141, -3039, -809, 1775, 1613, 2592, 4108, 3138, 1395, 49, -301, -1416, -3699, -1769, -909, -1225, 58, 981, 1432, 444, -362, 335, -1192, -2566, -939, -650, -234, 897, 2336]
1039B336J126k009m2M18j889j468l85l74j72k80J911J023n49J263O04j09m90n03
1057D11Q32j401k65J447p50K2J67O89k4k056J66O22j935j70Q93j71l06L83K386
1076I40L90r13J613P28j172j14m40n4j350p54J329j266o15Q50L90L10r01K05R77
1095A53j519qJ305n71N89Q96J147L79j190J465n98j881m76r50q28q07J97J346
1113a351q2M80J785N4m9k48O7k61j365M90J613r71P32J310J00o90j298l85j175
1132a244j876L35L76q7R25J248J937j6n1J248p52j357m83k71k70o86J231J271
1150A478j315L92P31j581q20j229m8k18o51K061J702K62J403J135L06j173j404
1167A031L83j705j527O89n18J80O81R07P71j514R0L94j336k21k18Q71Q83M25K006
$$ y = [2336, 3462, 1453, 1411, 1829, -60, -1528, -1913, -2287, -2459, -2739, -828, 195, -354, 909, 1513, 1404, 914, 411, 1243, -158, -423, 1024, 274, 296, 463, 1152, 1128, -928, -762, -140, -2075, -2245, -1352, -1523, -1829, -1446, 940, 1330, 417, 2030, 2758, 1586, 1472, 1032, 978, -372, -1126, 203, -1063, -1678, -828, -438, -128, -1029, -824, 153, -1366, -1374, -69, -640, -51, 845, 1992, 2371, 1181, 2646, 2048, 167, -309, -1259, -2087, -2894, -2697, -1351, -1433, -953, 832, 886, 837, 589, 656, 395, -970, -480, 1133, 162, 894, 2204, 2304, 1614, 316, -69, -1244, -3120, -2785, -2409, -2496, -1571, -323, 1614, 1598, 1547, 2795, 2043, 686, 203, -68, -338, -1024, 207, 1478, 163, 555, 1286, -295, -1115, -2344, -2392, -2610, -3261, -1200, 502, 764, 2167, 3302, 3608, 2435, 1031, 1414, -291, -1818, -1129, -1647, -1467, -786, 121, 892, -622, -532, -138, -1474, -1695, -1913, -1042, -159, 266, 2272]
1186B272J000j009O24n13j642j282j088L8j266r6J923N9J66J373O02j70r34K75
1204C32J4j267N63R42J40O65M6R00n21j782jl80j896j05j22P29l57O78K261o7
1224G72J42R26j16l45q92J85j47j022k02J013p20K6M75O98n15j243Q46l33j547
1243a999N94Q55j74J30Q51J625j24j56J110p84j309p38o71l39j589P91Q12m61
1261a576R24J343K88m5k61J28p20j477P94J08j57Q09J032R83l22n91M41j625j657
1280a581o0j006q3L37J215J752J63J030R93o26n71r62n94j118r32R78J050q02
1298h17J685O19L16p83j007j64j222j166M84L45M59J095J573J402p93L35J64k224
1316C01q53o15l58j73k44J517Q98k30R08L44q01o81p10L97j040r4J475K58L38
$$ y = [2272, 3272, 2263, 2887, 2374, 732, -550, -1638, -1600, -2866, -2962, -1039, -980, -814, 559, 1161, 991, 57, 332, 346, -921, -358, 584, 724, 1389, 1435, 2335, 1814, 32, 31, -349, -2245, -2350, -2472, -1743, -2100, -1422, 839, 772, 914, 1840, 1724, 1379, 487, 672, 525, -497, -699, 314, -406, -380, 95, 793, 278, -965, -119, -452, -1999, -1405, -550, -724, -594, 257, 1882, 1758, 1602, 2712, 1928, 619, -119, -790, -1129, -2718, -1927, -1115, -1576, -652, 691, 979, 934, 673, 801, 81, -1396, -602, -494, -651, 158, 1190, 2173, 1851, 1260, 1701, 76, -1581, -1641, -2647, -2730, -2393, -1178, 574, 737, 1767, 2760, 2134, 1563, 601, 7, -1111, -2043, -1065, -15, -817, 868, 1487, 1803, 1020, 13, -151, -1373, -2539, -2055, -1710, -1251, -156, 1417, 2819, 2026, 2361, 2525, 301, -552, -1167, -1525, -1698, -1942, -425, 473, 243, 1151, 1495, 694, 13, -697, -300, -1340, -1434, 41, 299, 637]
1335F37P02L75Mj177k80J58j921j86M70j87M56N00J205K04m44Q09J20j175m7p8
1355A45j10m74j2J116n18l79P13j62n96m49K96O7o27J03J236m62M8P25N93k02
1375A051n81Q43j68j652L38l4m05n02j73J158n35j80J013qk63qO15J17p84M25
1395B67O52p30J23P55l43m46m43M41o97j086M56O5J8j00N54J136m50L27J009k91
1415A217q79L74k78k54o47L01M33n84J06O54p08o36J20j9l74m30Q93J280n78R27
1435I18M89J63k30m05J67j267q05O70m06l24J48O16O36p72K11L17r78p7O08J63
1455a58q9K1J489O15m64M96n92r50r18o10L30j041k36J389M48m3N71J54m8m97
1475a33j4M73j019L47P36K61M64j2L87r4j188k20n78j150k65K89N13k3M33J658
$$ y = [637, 1339, 1714, 1718, 541, 261, 419, -1502, -1688, -1218, -1405, -949, -449, 756, 960, 516, 1325, 1445, 270, 223, 145, 35, -439, -451, 665, 147, -232, 481, 319, -277, -726, -430, -363, -990, -887, 349, -113, -65, 660, 1253, 1051, 470, 1313, 1145, -507, -169, -203, -608, -1110, -1283, -125, -660, -840, 173, 165, -98, -106, 509, 626, -158, 267, 919, 189, 312, 1067, 724, 278, -165, 276, -421, -1507, -1051, -986, -968, -1068, -514, 622, 172, 499, 1508, 1217, 338, 712, 434, 180, -467, -166, 267, -317, -211, 443, -265, -901, -781, -800, -1174, -1604, -711, 569, -9, 918, 1407, 1570, 1340, 935, 1102, -165, -970, -300, -706, -1030, -882, -266, 370, -402, -191, 126, -852, -929, -321, -158, -247, -226, 1263, 1878, 1414, 1910, 1318, 368, -550, -1160, -830, -1871, -2107, -718, -270, -313, 258, 412, 364, -133, -147, 326, -693, -346, 390, 651, 1115, 1103, 1490, 1396, 208, -12, -590, -1740, -2005, -1716, -1203, -1226, -793, 865]
1495H65o2K88Q7J01q89l55k7M15n69J62N95J66n61Jj34n21j127M65n9n31P56O74
1517b60O35O6O30O65k59p49M48q25o84p6k36L80n71L08M52m25n7N44k22m97k49
1538i82Q05J25m73R80M81j71J76K62J07o59n00P4p05p09O1p4K16j07K70J154k74
1559E7N34M65m57j97N2n6l18l32N47L53o40N57j24j99m89k21R6j016m39O94M43
1580f90L31N53R59P35q23K24M6r47n28j38k69l90J37O66J97m34Q61kq56k64k04
1601h36J57m62K37J198K15N34O99k7l2r87m69k86j384k43L43J40O11M69N47K56
1621F80m25M72k77j164L44R0j5O3N09R92K0m31K20l53r45o37r0j37p52Q34P82
1642b20n4N17N53K49O9n30q6n04p13M49R9l7K89J42N92r07q3O71p34r02L69J62
$$ y = [865, 803, 1091, 1178, 1279, 390, 35, 8, 423, -146, 16, 611, 777, 216, 217, 83, -438, -1565, -1100, -1159, -1690, -934, -260, 375, 441, 1071, 1736, 1477, 728, 1176, 351, -333, -409, -645, -265, -836, -528, -76, -501, -558, -14, -236, -733, -982, -177, -52, -525, 455, 936, 765, 941, 1203, 1310, 651, 151, 225, -480, -1189, -1128, -1202, -986, -1093, -823, 331, 57, 591, 1056, 599, 402, 454, 398, 80, -252, 295, 648, 8, 565, 441, 242, -247, -468, -372, -1388, -1827, -1133, -690, -359, 194, 1153, 1888, 1065, 1289, 1335, 388, -140, -278, -547, -937, -800, -134, 63, -371, 490, 488, -368, -632, -836, -679, -1141, -904, 294, 509, 1043, 1742, 1715, 1683, 696, 227, -59, -1443, -1686, -1343, -1203, -592, -123, 424, 680, 255, 727, 450, -714, -370, -280, -295, -232, 277, 1269, 1289, 858, 1078, 725, -220, -857, -947, -1084, -1836, -1002, -220, -274, 243, 796, 1045, 1114, 584, 498, -6, -719, -270, -171, -208, 81, 223, 815, -92, -175, 496, -238, -1140, -771, -609]
1664f09K61q5N61R96n64J47M67k88p86L3m29j05n69O48L8l12L62K61Q5j70O5M88
1686D95o19q9O10k06l5j93N20K66o64j0N04o42l91j92L88k47l52K64J81n8O64
1707A94L27J80o9JM5p48m09M87o60o5N86K60O0l99O4M60n22k99M23m71K73m24
1729g06Q82L48k29L77L66l54k93r2o41o44r2M31j3%Q44J35K87p06O09K05j238
1750e24L11M28k07j32J00Q41k46l62K60k93n70j99k16j89R7M12O46Q9L10L51j85
1771G22m16j79K55l38m99M06N54l06l48K78J55o89l35J6J29n58P01L38J92M92
1791E70J69N53o98k76Q9k67k39r7j42P9p7L10M54r39J14L21l79j53n1P43K17o14
1813c13R36P05k89j62j76n1o33l53k25j61j42L70r5K98J29J41L64n99L00J21l07
$$ y = [-609, -348, -433, 128, 1124, 560, 707, 1174, 886, 100, 133, -296, -401, -970, -322, -284, -596, -234, 27, 112, -58, 7, 495, -124, -213, 397, 191, 156, -37, 483, 749, 85, 75, 579, -63, -454, -646, -258, -505, -857, -593, -412, -470, 194, 521, 701, 632, 633, 678, -70, -479, 8, -652, -717, -131, 129, 189, -210, -146, 314, -208, -507, -84, -555, -282, -706, 176, 524, 295, 672, 1038, 684, 391, 299, -342, -986, -1078, -647, -660, -660, 184, 319, 606, -100, 509, 714, -524, -213, 215, 8, -124, -24, 817, 571, 209, 469, 176, -394, -593, -809, -998, -901, -489, 157, 246, 556, 907, 722, 306, 127, 382, 44, -455, -49, 505, 199, -149, 129, 284, -405, -740, -724, -595, -1153, -452, -114, 78, 570, 739, 1292, 594, 318, 407, 140, -99, -196, -338, -259, -336, -26, 428, -511, -397, -76, -455, -608, -659, 84, 301, -313, 623, 1328, 1039, 877, 701, 650, 17, -336, -561, -722, -864, -494, -589, -291, -162, -21, 343, -256, 44, 165, -142]
1834a42o9K33L40O0k72P39j38q14k0R4l06p30n9P65n04J47N28J19J62L87L54j10
1856G64m08J57J00n61l44N32l57L0r5N01j28q61L72K82n22n89L05P06j31j51J041
1877F43L81j17K88m97K21m76o17k20n33M1K18JJ57K57M56k91k85O26j49m55R6
1898b55N5M14p3LR08m7m71k1r4p87m06l86J59l49L13P86O1O28N18j0l79l22L34
1921E79o18m00L16RJ55l56J056J77p00l39j19l61m37L03l12O09m5Q24P53k39J29
1942I84K33l80m67l47m08j04l62M20L35k55N71R4P9n08j63L76l68l44M22L58L29
1963D95K4K52N08l49n28j37j81o60o2K1p6o8L45M24k22M17J93k43k3R2K49p36
1985b65L16J64L03n79L71K89k18m99k49M56m66m27O1L16K06l8K63N18j47K78J27
$$ y = [-142, -211, 22, 362, 422, 150, 889, 751, -63, -83, 11, -295, -1025, -1084, -319, -823, -676, -148, -29, 133, 520, 874, 764, 356, 513, 613, 52, -292, 240, -117, -87, -182, 319, 191, -670, -298, -16, -538, -1127, -822, -116, -247, -398, 643, 1024, 907, 1195, 698, 919, 443, -174, -394, -927, -886, -668, -667, -510, -253, 203, -88, -373, 253, 104, -351, -255, -200, 214, 141, 144, 1052, 1005, 534, 513, 419, -368, -774, -1160, -1001, -1350, -1037, -251, -190, 438, 956, 946, 567, 245, 579, -39, -439, -123, -114, 41, -315, 741, 918, 218, -121, -240, -601, -1038, -735, -1047, -438, -483, 341, 1094, 855, 984, 1217, 837, 370, 23, -385, -489, -851, -431, -96, -351, 220, 314, 393, -115, -278, 98, -270, -614, -192, 166, 495, 519, 771, 1279, 930, 402, 265, 84, -576, -638, -617, -693, -761, -416, 8, -214, 203, 396, 153, 130, 222, 471, -265, 51, 215, 518, -61, 310, 599, 381, -118, -367, 89, -377, -804, -743, -427, -221, -259, 4, 522, 375, 653, 780]
2006G80n59K18N2m04M6m31N34p64J48L60m3j80M5J28J42m89J17L88m34K06M73
2027C33J8J0L7J40k32n56J62k46k67R5M9M17l71L17M41n7p6l4k55K40m05LN30
2050B93l03J46P0L43k56p45L27j19l26K58p1j12N05L09N3j46J75R1j69m02j4J30
2072C7j74l18M04M85p01L42J30k90m40J21L19r7l9L35J80K32j06K03l75l02p4
2093a28K5j74k00L19j3j97K22M92k14q22M13K93l37L4J11M85J13k23M61J01m97
2114B64j05k99j24j45j60K63P1j54N40J91j49J39J11l69k32K27M0m42M35K50q9
2135B63j59k13K78j16p09J50J84k19J39K9N12QQ5M46k04k62J89J6m05k82K49L8
2157A7m05K06K59n67M50m6J00j74m1J86J04o04O13L52K5k28PM10k16m20K96n08
$$ y = [780, 221, 439, 491, 87, 133, -298, 236, -528, -380, -20, -63, -243, -198, -70, 72, -417, -300, 88, -346, -140, 333, 351, 361, 398, 538, 306, -250, -88, -334, -601, -506, -457, -40, -411, -94, 347, 290, 214, 180, -75, 165, -240, -237, 293, -10, 136, 206, 549, 293, -452, -125, -244, -570, -312, -383, -495, 10, 319, 372, 226, 401, 492, 323, -79, -93, 37, -137, -455, -51, 434, -267, 75, 205, -85, -525, -404, -85, -182, -221, 114, 294, 526, 420, 623, 248, -54, -128, -103, -277, -477, -158, -171, -368, -146, 346, 132, -690, -277, 16, -321, -287, -176, 309, 422, 199, 660, 761, 264, 159, -140, -264, -409, -569, -306, -235, -389, 151, 342, 193, 332, 443, 74, -158, 69, 109, -333, 102, 352, 263, 104, -109, 169, 53, -656, -506, -322, -541, -402, -373, 139, 147, 232, 678, 474, 212, 401, 417, 12, -270, -21, 17, -388, -182, 77, -490, -40, -86, 14, -160, -201, -15, 89, -515, 98, 450, 475, 247, 254, 664, 448, 28, 324, -184]
2179a84l36q5J12k4k80M12O28o78M26O46J18n04r0J80k91j60K12L17l82K32k73
2200dM66k70n16J48o63p4J92J53K20L44J36M91j25K73O4k96o50J23j29j05k81
2221e03N07j32j37J98K98k56m82k1K19k01k74P21N34R5P1L8L46m13m34K52r32
2242e06J29Km00J79j41O95L28k44O6r0l6q8p1K23k81J55P16k54L14P6m27p5q21
2265e51K8J19m98J61N44j57L92O4L7N40m84J99j14m30L97Q0j41k58p0N00k66l64
2287b72L49l05J48n08j3L05j54K90N50j45J22K37J02m15N0J44k98n06J38K27m73
2308d27k5q6N82k48j5K67o1j25J67o4J14j17R5K64J44l07K36q7j48m02L28l92
2330c07l04J24J53k29L50K13P3R7L2K49n0k89J06k88P6l65N42K36m97K28K56o05
$$ y = [-184, -520, -605, -493, -517, -797, -385, 243, -435, -9, 637, 755, 251, 161, 341, 50, -110, 102, 419, 37, 269, -4, 462, 192, -324, -176, -839, -913, -721, -568, -348, -4, 132, 623, 498, 771, 835, 539, -111, 12, -117, -222, -503, 4, -128, -265, -67, 231, -25, -507, -528, -309, -510, -784, -63, 471, 566, 637, 675, 1021, 608, 174, 426, -506, -377, -375, -775, -596, -737, -42, 286, 42, 108, 18, -18, -106, -177, 46, -235, -80, 636, 382, 696, 772, 345, 270, -551, -523, -404, -902, -741, -197, -354, 38, 102, 139, 679, 195, 394, 280, -150, 247, 327, 186, -72, -142, 358, 92, -272, 77, -228, -80, -588, -601, -296, -450, -160, 390, 245, 367, 604, 706, 291, 341, 485, 187, -319, -181, 46, -427, -452, -538, 44, -204, -219, 48, -13, -138, 29, -35, 79, -38, 57, 321, 465, 158, 394, 307, 159, -243, 85, -307, -611, -487, -334, -563, -213, 0, 73, 170, 202, 451, 401, 112, 218, -70, 6, -359, 183, 419, -78, 150, 406, -199]
2352a99mj84k36N06m83M16J11r4M06L27q7k13r2J50j42n99L36j4o2N5J93P0j52
2375Ij78L91o46J22m3O13k69Q6M80l17J60k01L06m33p1k51J46k72O3M79k40q4
2397a50K09K31l11j23J38L51m63J83L05j02ml8J07q0m93l7L4J76l33J69K23J5
2419Gk14N50l8m54N30m52n4PnM11l67K74K11k36k54k9J56l38k32K44M45l06L47
2442B03J71n1j42n7J11l55l74N34k84K35q9K22P3l36l5N63n66n5L53n0k9l9P7
2465H0J02j60J69K06j59P5p5j94l08K9P4j45k8M43Mj07J59P1J13l30J31J43j56
2488A37k55J35J54j49j52J00J77j56J3j06k3N0j87K51q7j78K72J71O3J84k9J42
2510E27m41k01K37m55J71o5K9J69n8M17l71r9K06n3o4j18K1K8K52m2M38N1k66
$$ y = [-199, -203, -387, -623, -117, -600, -184, -73, -167, 239, 566, 479, 266, 174, 324, 182, -417, -81, -95, -157, -102, 91, 161, 9, -169, 222, -424, -302, -345, 268, -1, 85, 565, 248, 408, 207, 513, 80, 9, -242, -96, -368, -305, 174, -66, -150, 59, 290, -21, -144, -6, 345, -118, 65, 370, 268, 264, 226, 333, 253, -240, -277, -243, -67, -400, -231, -8, 7, -207, 343, 305, -149, 381, -71, -125, -118, -123, 288, -79, 195, 406, 170, -84, -113, 43, -295, -527, -283, 162, -144, 203, 374, 323, 181, 124, 235, -120, -494, 40, -244, -9, -98, 124, 197, -139, -174, 389, -177, -232, 121, 71, 42, 3, 80, 182, 22, 191, 397, 238, 313, 238, 44, -264, -235, -161, -306, -334, 109, 113, 6, 165, 236, 349, 19, 150, 293, 137, -118, 17, 171, 22, -130, -30, 147, -9, 4, -102, -125, -75, -262, -11, -98, -276, -4, 167, 230, 414, 385, 527, 86, -115, 122, -333, -162, -227, -198, -29, -87, 330, -41, -140, 66, 13, -51, -169, -148, -120, 132, 90, 528, 579, 313]
2533C13j4q5j90k33l66K36m95N13J5J69J23L02K38p4l19L35l76l91K84J9K94k75
2555B3K15J61k12l70k7j89k21K6L2K00M9O98J69j22r1M98k44m33l55L66k16l89
2577d32L58LL3j53K2J76k44m77O62j69k36K76L27O8QM39j34o2r0O9k44m23q1J24
2601a80n9k2O6l3M7m2M20J40k77j6L28n17K13N4L74l44r5K60j3m43M5M5m03K17
2625b35k54L23j03k96O99L0j56K62J0L07p8j90o4j29j60M03n35mJ23j82K36l60
2647c53k60K25K4l5K32J02J69OM04J24o30N39j2k74m65K88j77l32k79N39R3k18
2669b90M16j60J71k59L28j27l25Q5K52J16J46j37Q2mm83L81j08n23j61K03q5J86
2691b96N2L63q9m6K89J31l31J20p8K5q1o6K48j86J64k92J06J5l59Kl0j33K14K29
$$ y = [313, 299, 214, 24, -209, -575, -339, -834, -321, -306, -137, -14, 288, 526, 452, 133, 468, 92, -299, -15, 4, 298, 23, 238, 399, 187, -183, -210, -399, -620, -594, -562, -362, -313, 385, 554, 432, 341, 839, 595, 162, -193, 173, -43, -432, -74, -71, -38, -191, -169, 7, -237, -714, -52, -221, -457, -181, 146, 214, 222, 661, 527, 465, 375, 444, 200, -223, -304, -180, -239, -261, -195, -228, -181, -223, 197, 337, 60, 44, 372, -145, 68, 122, 496, 152, 57, 317, 304, -139, -94, -49, -452, -235, -489, -166, -269, -565, 134, 164, 8, 270, 280, 587, 509, 319, 255, 126, -34, 369, -166, -170, -47, -229, 7, -353, -613, -388, -364, -399, -167, -65, 104, 110, 514, 638, 8, 547, 535, 261, -204, 84, -93, -425, -704, -165, -72, -290, 126, -34, 137, -122, 206, 79, -246, -161, 91, 207, 353, 216, 298, 294, -189, 192, 84, -439, -600, -397, -482, -296, -244, 119, 30, -16, 273, 404, 73, 193, 115, 140, 59, -7, 241, 55, 219, -73, 33, 48, -311, -309, -339, -472, -258, -29]
2715b9Q7K00k27K78j43J04J3j79j44K29o4K76l55J37p9k89k02L78j82l01J71L76
2737E5r0K37K21L4j52l60P0R2n8j81K36k16j41J25M0p1k52L26n2l21K42L17p8
2760B3j87N08J26j15l33J43J40j99k87P4p8K06j61K32l7k92K92P2j06O7j15n1
2782g8K84k83M08k96JJ8O6j15k01Q8K16o81N19j12n5K87l19L19j87JM55l01j06
2805g2K71j02J6j82p0N4k37Q2L79p9m5j01K13J26l06J59N6m15K17J43J28l36p2
2828a73L91j61l83J91N6m25J52o7M18r6P2N55k35k9J13l65J87k19j05J67l47O6
2850b37N65k24j57J71j52P9l69Q3k17K5L80M5K52K1K18L29p97K72j5n81r6J94
2872b11j7j92P8K63J79k73R3J73j06k4k33K09J21j24L86N8k86J10Q5k33o2j85
$$ y = [-29, 58, 258, 31, 309, 166, 270, 283, 104, -40, 189, 125, 401, 46, 183, 104, -185, -387, -9, -191, -492, -321, 55, -35, 202, 423, 457, 305, -55, 15, 107, 49, -132, 104, -112, -253, -128, -88, -159, -411, -85, -137, -458, -216, 101, 23, -164, 344, 470, 355, 22, 165, 305, 106, -181, -107, -185, 21, -140, 92, 55, -237, 55, 127, 21, 88, -27, -78, 206, -77, 331, 35, 36, 54, 120, 5, -196, -108, 108, -573, -54, -166, -221, 66, -253, 66, -121, -120, 335, 34, -72, 199, 97, 113, -69, -139, -85, -322, -240, 139, 60, 15, -86, 127, 253, -53, 106, 162, -253, -36, 107, 235, -101, -173, 218, 57, -326, -135, -79, -504, -352, -419, -1, -97, -25, 530, 295, 266, 379, 14, 201, -18, -123, 44, -303, -237, 328, 104, -53, 118, -34, 45, -324, -241, -458, -433, -53, -8, 244, 265, 483, 812, 15, 287, 272, -309, -405, -211, -228, -420, -342, -79, 100, -173, -80, 93, -13, -37, -270, -61, 60, -64, 322, 380, 94, 204, 289, 56, -6, -191]
2894a91j39k95K29J03J70k19J26L53J59j04J54j87j58P2r0J80j77k6K24L6k44
2915b4J88k46Q3m69L7L74k77L01j02L56J88k60J83K7l36J90K13n20J08k27M5J
2937a67l7k7M0K7L30j41j64j9K71j03j68J09J15K44p0kJ28N7o99L65k06k01J67
2960a51k67L38j91j2L98J17pK46k70R3j90O8Q4j79K65j97k06J91m5k2l62mL5k93
2984e61J19K00J31j62M91J6R8j9q8n0p1m02K20m0J24k96JJ15J01J85l70K6J00
3007a32m5K06N8j44L42J12l11L00M0l32K37l96j3J5l79N20l60K3n9M07R8l33J21
3030b5J68p4K15N3r3n1m2J81M5m06LK44l46P7P0j00k20p8L76p9j65K39K91p2l57
3055a46K71K00k02j92K24j37P7l10O0K29o86K75J22j73M65r8L7J16k42M86k78
$$ y = [-191, -330, -625, -396, -293, -123, -342, -216, 137, 296, 192, 346, 159, 1, 73, -17, 163, -14, -40, 184, 220, -24, 164, -82, 1, -468, -431, -57, -334, -33, -135, 221, 409, 149, 332, 359, 23, 213, 426, -94, 14, -213, -168, -167, -204, -231, -191, -164, 166, 25, -139, -158, 113, 10, -158, -49, 66, 310, 240, 238, 366, 423, -276, 89, -117, -318, -151, -418, -80, -271, -283, 115, 232, 225, 471, 201, 294, 104, 172, 256, 77, 342, 145, -61, 130, 85, 63, -299, -303, -268, -561, -442, -242, -111, -273, 218, 234, 332, 313, 225, 175, 104, -298, -78, -118, 6, -290, -289, -174, -73, 112, -258, -232, -132, -177, 29, 87, -57, 285, 397, 86, 386, 426, 94, 331, -65, -78, -63, -442, 78, -282, -259, -318, 89, 187, -146, -25, 143, 69, 284, 337, 244, 193, 151, 332, 377, -29, -26, 218, -128, -51, 19, -81, -301, -379, -3, -82, -247, -8, 283, 211, -146, 125, 325, 123, -69, 155, 18, 95, -215, -155, 74, -612, -337, -215, -388, 77, -21, 16, 132, -110, 376, 98]
3076I8nL40l90k41K21J03K4Q2k93J15l30K03l67L37L43o27M57j79n5K28j10M51
3098D05n55K68O4k91J32K8Q2k12J19r8r6k00J97M12m44m1M4J08K93n22K72L22
3120B87l03K55L1l16J14j54q7n0R9K64k80q9O2J87L0k47L30K64l09j43K14j10
3142D9j46J45O8j61j0K67J90l72p6R0r1j89l9L94K3k85M75k59Q2m6Q0L4j44l40
3166b61K13j49J68j03J71Q3m55O88q7k86p4j18n5K36J65k16J00j16L60j3l85K30
3188I6j86r3k85O4O93l90J5R6J50n7K25R5r9l71k47K63q3O8J13J62J0l11J07k7
3212Hkl2J7k16J30j5O1J01L67j85j4J45j87L5j94j57j09J89k23K36k00J90n7J89
3236G7J16M2l92Q9K75k55N4j82M13K3j22L56m87j70J07j31l42k4K72K91l92J91
$$ y = [98, 93, 433, 43, -198, 23, 126, 150, 232, -61, 54, -276, -73, -440, -103, 240, -387, 70, -109, -164, 64, -46, 405, -150, 118, 182, -109, 23, 51, 133, -79, 40, -58, -154, -354, -157, 255, -189, -230, -186, -78, 215, -307, -35, 287, -16, 239, 270, -46, 68, -86, -173, -223, -124, 140, -140, -229, -167, 20, 50, -197, 133, 397, 88, -55, 159, 49, -97, 48, 116, -45, -55, 212, 402, 30, -46, 44, -47, -236, -275, 119, 142, -143, 332, 73, 155, 109, 189, 223, 79, -261, -48, -197, -29, -132, 39, 122, -333, 355, 268, -18, -92, -210, -265, -29, 136, -80, 20, -96, 264, 251, -134, 96, -90, -183, -468, -404, 289, -101, -86, 10, 160, 103, 328, 423, 324, -47, -294, -31, -114, -46, 67, 229, 239, -72, 35, 8, 6, -26, -9, -225, -95, -110, -49, 52, 419, 234, 220, 365, 178, 213, 19, -138, -247, -58, -281, -45, -245, -55, -112, 77, 193, 235, -157, -68, 207, -48, 6, -176, 237, 260, 138, 494, 7, -163, -56, -187, -529, -553, -281, 10, -382, -191]
3258a91K73n9J34N3J95j82j81j7J3m6J2k63K43k9N5J7k21L5R6j21J62k44N4K12
3282@J12K36Q9o7P0r9j32l92J80o2j35l29N09j95j9MK52L14o45K03K46k58J62
3305D4k68J97J32O2K22j59K6l2k13Rk74J2J28j17J66L06l69K39J45J12j8m37P6
3328a1J82k8O4N4k92J23k66J34Q8m12PK38k75K38k57O60n37L19M75j35N1l37O2
3351A45j26jj24K87n46J37L55k65m1k3R9J00j80R1K36j90oJ79M5j59m4N62l47
3374A84m35L67k30j13J30j33L8j54J81K84j95r7J13J19j77L00K89j46k60K58j00
3395B23j63m3k10J20k9o4J47o3k58M15l0j50J41k1L48l18M8K73l02J1n1J35K39
3418C98p29K42k2M7P3r3j42r6O5K93J41j62K33j67K28j27N2K07m84J04M8q7o9
$$ y = [-191, 82, 23, 157, 210, 405, 223, 42, 25, 38, -8, 4, -259, -16, -45, 10, 27, -194, -159, -63, -184, -22, -266, -212, 0, 112, 348, 437, 370, 440, 341, 209, -183, -3, -65, -200, -529, -20, -215, -234, -230, 22, 336, -309, -106, 140, -118, 44, -224, -27, 105, 167, 389, 230, 256, 224, 11, 20, -254, -242, -114, -231, -65, 241, -128, 111, 256, 368, 350, -87, -11, 171, 143, 207, 261, -31, 92, -174, -40, 48, -364, -357, -119, -394, -156, -413, 247, -290, 29, 504, 369, 420, 83, 145, 19, 18, -106, 181, -365, -228, 127, -138, -179, -202, -103, -3, -183, -92, 144, -46, -52, 127, 172, 13, -31, 531, 184, -251, 116, -114, -227, -97, -230, -192, -346, -165, 119, -76, -173, -60, 59, -118, 182, 471, 325, 65, 323, 223, 60, 17, -193, -73, -102, -166, -19, -82, -340, 75, 45, -105, 36, 15, 363, 45, 93, 366, 64, 75, 24, 159, 398, -331, -89, -111, -64, 9, -84, -226, -322, -257, 36, 177, 15, 248, 81, 309, 182, 234, 441, -43, 61, 109, 22, -47]
3441d7j2J26Kk38J0P6l79K31M32k40J12KRq2O3J67m9j90m2N9nj75J02M2r4m0K87
3468A27n6k40L62L6j90j70K67r2J74k70M6k9N6j12L58m77Q4J08mj57m1J80J55
3491A15j6k47O52l78R7j30j71p4J45n1J41j04m9K06l4K22m61K08j81l3j82N8j16
3514c83O06pL9j87k03J60o2j95J30k7N3j19K00r2NJ68J00j0K1k42K00l4k44M71
3538C48l7l52j7J65K32m78J21L5p2M9K1m93L86L06k97L99l55K70j4o3J40l14J
3561a9Q7k32R7j59K1N51n21L6J28l02M28l16LM33j78L0j74J44L60k87K86k79j54
3584a7k85K46k00J42n3j11R9J54K35n9m8L15k51k97K22j78K63l57j68L91l9n5
3606e1k12K21n2q1M1P9K00n39L54O9p1J49J12J77k76N8j7k40j1j19L16l11K28
$$ y = [-47, -59, 67, 69, -169, -159, -83, -462, -231, 201, -39, 73, 75, 84, 2, 65, 232, 183, -7, -49, 10, 5, -170, -68, -26, -120, -160, 127, 71, -169, 193, 229, 39, -131, 136, 44, 218, -52, -6, -35, 21, -91, 267, -210, -126, -18, -22, -179, -220, -40, 115, 99, -148, 504, 126, 223, 93, -78, -152, -7, -58, 83, -21, -70, 136, 102, 324, -137, 71, -110, -143, -325, -267, -383, 223, 216, 255, 68, -135, 25, -37, -232, -102, -129, -76, -195, 5, -87, -82, 86, 186, 176, 197, -45, 155, 121, -123, 348, 311, -41, -58, 107, 339, -139, -18, 17, -55, -6, 15, -478, -92, 214, -83, 316, -39, 231, 217, 154, 294, -20, -19, 68, -164, -67, -226, -205, 346, -175, -139, -11, -313, 115, -201, -198, 235, 57, 87, -87, 57, 417, 130, 416, 137, -17, -302, -56, -256, -114, -167, -278, -179, -25, 210, 151, 103, 418, 167, -130, 92, -86, 177, -180, -348, 43, 4, -51, -263, -42, -94, -175, -134, -55, 145, -394, -40, 29, -42, 107, 219, 396, 120, 178, 161, -79, -90, -209, 107, -204, 24]
3629B4q9k05K92O3J57k21o6k68M64l03R4n3K22j06j49L45k74j31L7J49j55r3J99
3652f7L01l93L82o4jk98K19kk66K59J12K61n33J02o7L54j91J05j73J8l42L69j88
3675a03k26K42O5p8J75J94r1p0r3M03j44k18j05j10K97j49l03J87n3r7J73j73
3697b77K97k00J63J70l67N46j73j32J97L8o7j99l2P7k51Q1K48j12q7j92L68j49
3719e3j06R2J27j49K33p3j24J63k00L02j40J99k50j23J92k19l7J37k59n7J77M8
3741a20J09M6j43J07o9M02k82J00j11K46l57L7j42R9J51l6p2J72j20j68p5L85
3763A59p3m2k58K94Q7r0NK4J78l53p7J31J47q4Q9k71J28mM9j62j1K08%J25j27
3788G2m6j11J09J64l32J25j35QJ61J19%nk52J22J82l39J03K32l22K30k46L69J71
$$ y = [24, -65, -270, 22, 85, 242, 21, -45, -313, 151, -152, -58, -111, 111, 5, -144, 201, -73, -204, -167, -18, -173, -266, -67, 234, -159, 223, 159, 158, -140, 79, 77, -189, 70, 182, 443, -90, 12, -55, 299, 108, 213, 40, 58, -284, 85, -103, -329, -87, -22, -100, 75, 269, 178, 108, 15, 418, 274, 56, -49, -159, 138, -11, -314, -127, -180, -277, -104, -277, 20, -180, -17, 153, -214, 332, 159, 27, 224, 262, 195, -4, -36, 41, -210, -129, 119, 7, -80, -272, 96, -53, -159, -67, 60, -89, 144, 71, -53, 110, -90, 212, 72, 271, 21, -102, 90, -129, -166, -29, -288, -345, -168, -120, -11, 35, -108, -1, -70, 332, 50, 150, 39, 285, -72, -35, -177, -78, 73, 37, -35, 137, 17, -151, -226, 159, 86, 44, -214, 80, 167, 77, 82, 106, 284, -69, -146, -15, 132, 48, 137, -134, -6, -10, 39, -123, -134, 74, 74, 199, 72, 26, -85, 24, 188, -144, -19, -154, -146, 15, 134, 134, 129, -123, -1, 181, -158, -55, 177, -145, 85, -161, 208, 379]
3811C79l72K99o0k12K6o5K58n60R2K58r9n2K4R3J70j81k29L34j35p5K18N7l03
3834a35K94q5K29j69Q8k82l19N06l7j67O5j45J94K7J20mr0j20k5m3P7RJ17j08
3858clJ5J9Q5j90j11L63j62n5j20J5L02o2k24J66j66L1K10n1k28J96J43l46P8
3882i8J64j50j00K2J64R3p4J91j7j38M3J8M9J26m15J45Q9j25L3m5N2ro6K76m52
3907b24j41L60j25RQ9R5J18J39k80N3n2j04j42M6q9J88J32j97N3K80J4j39k02
3930a19L29k27K7r6K1J40j81K68K29n13l6J36j7j4l46K30M3m8L13J09L0j46K36
3953C68l68J87k03j28R2p1P4m6N2R9Q3j1k15L18m15N6P0J9R4N4k9N1J40p0r3P4
3979A82j08n0j34K38l58J30J75k16M27L0l35m2K11l34K38J08l71J84K15l75J24
$$ y = [379, 7, 306, 246, 34, 60, -5, 253, -307, -215, 43, -56, -108, -84, 9, 179, -2, -231, 103, -32, -107, 111, 168, -135, 159, 74, 303, 134, 222, -60, -379, 127, 90, -77, -12, -157, 37, 64, 184, 180, 90, -30, -55, -98, -21, -12, 105, -3, -6, 9, 28, 113, -77, -188, 175, 13, -42, -162, -147, 155, 93, -131, 35, -131, -100, 110, 59, -169, 27, 170, -176, -98, 66, -84, -184, -162, 2, 95, 21, 212, 195, 57, 100, 118, 167, 293, -122, 23, 112, -13, 20, -25, 27, 18, -48, 228, -224, -365, -5, -130, -121, -32, 63, 181, 320, 40, 93, 41, -63, -205, -159, -248, -60, 72, -125, -72, 208, 222, 83, -119, 210, -17, 10, -86, -65, 75, -106, 162, 391, -122, -158, -22, -39, -53, -399, -169, -126, -174, 139, 248, 278, 132, 368, 0, 187, -16, -144, -52, -123, -49, -95, -43, 56, 139, 128, -87, 231, -184, -128, -58, -39, 55, 109, 80, 131, 271, 201, 108, 182, 74, 24, -110, 128, -230, -100, 75, -141, 286, 316, -19, -61, 150, -184, 54, 162, -209, -25, 190, -185, -61]
4000f1L41k70O3j64Q9K7l30K91O9j61k10L36K53n1j75kJ49j39M2J79n08K10M2
4023B0O3O6k31l3R6j16K6P0Q6k19P4Nj1J31p6K62j70Qm0J46k52Q8O6k69j77M53
4049F6l12j16J33K28o8N5j37K05J9J16j9r1l5R1J3o1j50j17K34k63K27kj94J63
4073a5l6k0Q1R8l8q5J3j29J00N05k66m27O1L81p4n0j66k38Q3K67n7j08R6J80l69
4098b13J21R0J71k41j59J31J35j15J06O6M6l12KP3l6QL7L9J95p5K1m59L54J48
4122A33k57L21j29j69J98j05L60K0l05J10j95J43j02j00J16k29K01q6nJ02J8M1
4144H1j66M26j3l87R1p2J18K0j71k03O3K23p7L11o9j23q4j79Q5K28L2m6j89K53
4168A52k00o0N1l2j21J06J9l1l6J95l9j1LN1j92QK59j07o0n8K03M3o8j79L14k08
$$ y = [-61, 280, 10, 73, -91, -2, 25, -305, -14, 55, -106, -316, 20, 273, 222, 47, 45, 194, 55, 97, 276, -232, -22, 20, 83, 149, -82, -115, -19, -135, -109, -39, 47, -172, -98, -93, -104, 27, -49, 213, 43, 51, 11, 157, -95, -7, 59, -210, -387, 66, -246, -362, -229, -1, -69, -14, -151, 54, 73, 189, 170, 79, 44, 135, 148, 87, -63, -180, 54, -209, 18, 16, -178, -15, -51, -71, 10, 108, 70, -15, -2, -131, -31, 474, 208, -219, -158, 223, 149, 99, -67, -305, -222, 45, -12, -120, -24, 156, -213, -92, -2, 169, -72, -231, -100, 35, -80, 26, 92, 138, -174, -172, -99, -135, -127, -90, -51, 144, 69, 90, -369, -15, 133, -124, 197, 68, -101, 97, -8, 352, 372, 67, 177, -18, 125, 23, -77, 39, -190, 11, -75, -80, 22, 40, 81, -85, 341, 328, -59, 32, -40, 78, 98, -73, -276, -213, 10, -67, 244, 175, 52, -32, -211, -126, 102, 134, 88, -101, 152, -48, -108, -57, -89, -210, -104, -85, -116, -152, 43, 4, -7, -4, 47, -145, -137, 122, 15, -45, -103, 100, 143, 75, -104, 210, 2]
4194BJ4ql3Q4m16O21l99J43J08Lj19N9j48L96m75L71j17j15J12k54J61J7n3j60
4218b06J11j10L94Oq5J43k02J81k20j41K11j2j04J9K38j29Mj15K28j88P0J29O9
4241B91l53J22j37rJ43kj01J41j13j11J42r4n2m6J81j36J63r9MJ10n9k33M9K61
4265F2j9q2k1j7l04L53RJ95r1j53Q9j21J01j18J77j39j6J76j01P3k52J61P2J21
4289A55j09j97J03J2J37lj26K20m75L82q4j91K24j29J62L2l24K99k87K97j46Q7
4311C9k90L0K63l52N04m56K52m4J9m0K70j69J27k01N1j79K89N8k18K64q0k74J01
4334c6J64j47K42l81K44M3k36J70j35j30M7J70J29j33KJ44M5k09j68J01L8pkp7
4358a22R7J99m52J46K96k76M27l03j07Q7n9K13m77L00k7k28K79n6k1J27l2l8M6
$$ y = [2, 16, 8, -25, 59, -357, 264, -135, 8, 116, 119, 0, 59, -89, 307, -168, 203, 86, -29, 83, -171, -10, 7, -46, -206, -95, -205, 189, 195, 110, 253, 51, 232, 12, -129, 82, 70, -34, -15, 223, 94, 98, -17, 211, 23, 93, 222, 291, -62, 60, -77, -86, 57, 55, -46, 95, -18, -129, 13, -81, -133, -179, 2, -134, 29, -70, -66, 44, -15, -248, -199, 62, 43, -39, -60, -77, -381, -28, -19, 176, 85, -68, 21, -100, 1, -117, 60, -79, -95, 81, -20, 53, -199, -38, 34, 155, 46, -151, -48, -36, 101, 98, -28, 192, -283, 99, 15, -176, 48, -81, 81, 113, -211, 88, -199, 98, -48, 39, -251, -221, 42, -310, 194, -262, -10, -54, -35, -75, 195, 26, 153, -48, 3, -176, 113, 171, -47, 217, 137, -137, -36, 128, -19, 223, -158, 86, 129, -107, 63, -72, -202, -155, 15, 144, 11, 13, 157, 202, -7, -175, -74, -36, -43, -45, -122, -25, 174, -278, -132, 164, -112, 315, 12, -95, -8, -67, 146, -331, -31, -58, -286, -7, -63, -84, 43, 11, -27, 19]
4381A9r1M03j93p4Q1j16J4j20J93j61K70k87K41k01P8o9O5Kj09P1k70L01j48J3
4405h8J9J01j66n6K03m1K31k57k6J9R9J08k39R9q3j40K15N6q3j05J56p6L50l27
4429c1n1P9P6L00m09L3Q5j27N8j65J95j96J88N9N1m05L57l2n9P8k45M02k38J14
4453A17l1J5k91J19J02o0K31j2q9j42j5L6j51L13k14L02p5l19o7K28j54M08l11
4476f0K9p9L26k27J64j72J76r5J30k18j36M4L5K90m99L24p9L4j12o4M7K31j69
4499h0QKJ30K0J01k9k26J42j22J92j14oJ40k94J17j03K96l5k09j45K09p9m6pJ33
4524eN5N5k52K07l34N03n63J60L12j88K04j45L2k3N9m3m1K60k50L1J28l02p2K45
4548C3K72l21k9K5m0J35j88J44R6k00K14r2k3j31K83p8o2o9K5K4M5R9l87K25N4
$$ y = [19, -72, 331, 138, 64, 145, 29, 43, -77, 116, -45, 225, -62, 179, -22, 56, -13, 52, 54, -55, 16, -254, 47, -101, -88, -69, 32, -134, -190, 13, -28, 203, -54, -80, -61, 38, 146, -93, 6, -77, -217, -2, 54, -29, -134, 22, -54, 296, -31, -82, -3, 73, 373, -36, -3, 82, -45, 13, -152, 43, -153, 35, 94, 145, -260, 97, 65, 6, 84, -161, 241, 3, 117, 86, 101, -190, -71, 31, -29, 202, 190, 101, -41, -56, -20, -171, 142, -72, 230, 155, -164, -231, -3, -157, 251, -60, -31, -110, 216, -11, 153, -19, 157, 62, 192, -26, -162, -118, -83, 207, -292, 32, -47, -13, -125, -189, -142, 89, -80, -72, -70, 60, 80, 181, 152, -74, 68, -54, 138, 24, 18, 158, -136, -19, -122, 174, 139, -70, -215, -6, -85, -131, -138, -5, 50, 105, -147, 60, -274, 229, -334, -174, 138, -50, 154, 9, 41, 18, 77, 34, -7, 253, 3, 34, 162, -140, -212, 33, 305, -16, -45, -20, -60, 75, -113, 31, 127, -73, 141, 49, 26, -105, 178, 100, 38, -31, -6, 18, 63, 162, -225, 0, 54]
4573E4j15J63j89O7M5O2RL76n34j13K87j78p8K00q4K8j7q2l1k2M2r8L8J4K50j60
4599f6J58J22l04m7R1P4m9p7J37P4o4j51J83j91J89k33J90J53j28O8k55K54j24
4622Dk75K91l03M80k80K6k1J11K11k56J18j84J59p3q8P0r9Jl3K73m35M69k15k93
4646c42J24K52j3j64K51K3k15r4K80j63j40J84K49l44M06l61p6K97l31J52rP7
4668D3J14j52J69n8q6nJ35j90p8k2L5K18l16J69N9l5m9k12J71NMJ27j28j56K24
4693a4j06J95k80R9k7m2J76L7r1n5N8m7J05J78j68r0J97p2q6J62j05q8j09J5J78
4718B0J76j22j27O9p6J74k39N5J43k14K33m9L7o3J20p0K5n2J20p8L1or0q9l1O9
4744c4p2RK21J09l55K37j09j37K1J76m47N53r4J73k25J04P9l06m7j71K60o6r1
$$ y = [54, -61, 102, -87, -20, 25, 87, 96, 472, -62, -175, 112, -66, -144, 56, -28, 0, -17, -99, -130, -152, -110, -208, -170, -156, 94, -66, 92, 214, -90, -137, -46, 28, -21, -98, 39, 113, 49, -102, 81, -110, 79, -154, 36, 189, 61, 129, -126, 128, 4, -271, 20, -283, 197, -83, -57, -78, 33, 244, -12, 106, -78, 81, 8, -80, -10, -109, -108, -141, 132, -303, 166, -49, -342, -218, 34, 21, -143, 108, 131, -84, -178, 102, -61, -201, -17, 232, -112, 294, -67, -143, 154, -177, -25, -34, 43, 157, 5, 174, 116, 30, 25, 160, -30, -108, -130, -95, 123, -193, -24, 35, 0, -49, -261, -90, -85, -81, 46, -82, -238, -14, -120, 75, -205, -106, -133, -175, 1, 38, -53, -108, -50, -97, 8, 186, 18, -72, 125, 53, -33, 129, 24, -64, -173, -158, 20, 196, 74, -53, 16, -60, 114, -125, -70, 73, -141, 92, 43, 80, 17, 137, 67, 92, 40, 160, 82, 113, 107, 17, -72, -103, -34, -106, -97, 124, 233, -122, 115, 6, -131, -110, 66, -381, 172, 78, 251, 26, 130, 209, -97, -144, -315, -55, -121, -212]
4767b12J47J60K97k63m0m8o4R3k44R3P2R7j33j0R9%J39m07Q4J14K1l6K2R0j01
4792c0K7K07m15K67J64k39K7J36k76J22Q8Ok17K8J59j40K48k18N9m5j17J00K17
4815A58j43j04K96k96P2K37k41J09k62K23j14K79k07o3j27K07j34J62nK7r9J49
4837A24j65Q9j73J88p5k38M33k16JP2J15j57K15l19o0K07L0j44J73J5p6J43k08
4860b6K3J15j67O6k1k6K67k46M3j33J83j46P8J0j6j93K02r3L7o9O0p3r0L27k6
4885H6m4J66k67M2J14q4J5k93L08m26N38j48j86R2M8J03J8M0m64N57O7m37j4M03
4909B34j11j14n2lL13k12m2J07j16JQ6k30J73J39j00J54j07q2O7j71J16p1O8j08
4933f1J00kQ3J68k45k5P3j37M5R9k19K93j19j79K59j86j9K38l14K29l25J96J04
$$ y = [-212, -65, 95, 392, 129, 89, 41, -23, 70, -174, -81, -9, 88, -45, -55, 44, 44, 183, -224, -140, -26, -5, -41, -19, 71, -30, -3, 204, -211, 56, 220, -19, 8, 144, -132, -10, 78, 84, -133, -105, 54, -86, 162, -56, 3, -42, -159, -59, 158, 15, -89, 207, -89, -17, 220, -21, 88, -174, 49, -65, 214, 7, -56, -183, 24, -110, 52, 47, 74, -25, 124, -41, 48, -125, 63, -12, -250, 183, -33, -32, 40, 155, -2, 213, -106, -166, 41, 71, -73, 100, 115, 39, 182, -26, -3, 112, -55, 11, -10, -36, 231, -15, 28, -105, 78, -68, 10, 20, 4, -189, 13, -80, -43, -112, -52, -125, -215, 112, 86, 42, 208, -59, -17, 97, 13, 28, -265, 43, -383, 155, 7, -179, -87, -39, 64, 82, 122, -342, 215, 282, -155, -169, 234, 123, 9, -43, -46, 267, 55, 13, 120, 4, 5, 91, -139, 34, 173, 73, 227, 120, 38, 105, -66, 50, -21, 47, -61, 39, 37, 120, 288, 43, 18, 91, -46, -1, 98, -121, 172, 53, -126, 133, -53, -72, 166, -148, 81, -244, -48, 56]
4956E6o8J16j29l5L58k00J83l11N0j10J72J1k41nr7K31J79N9k41L00m15J67j5
4979A5K41l36J08j94J08K3P0k24m3L21k87J1J36J04j66K50j78n1K20n6l0N2k1
5002G3o8R1l23J69%j2J88J38l59K23ql34O5J90J52j15j68R0j65K23k84K81pO4
5026A04j71M4l4J54J0m4k42M8K15R6m9k31M9J15R1r4p7j12M9J60n9J19k00J39
5050H0j14N8j55J95j17k9J82k31J50k14K89r6j81J12J77J6j40j45k8K49Mm0Q2
5073A04J40l67l6K30r2m0j02K97j18j43K5J10J51k16QL7q7m1L97l51N7j95J76
5096e6m2J68P6m12J92K31j18j4n4Q8j65O7K08k10O6m4K40l50L32l33K04J17l23
5119a32K9n1jr7M04k15N39m13k42K45j96K14Q9k1k64J66j9J50k02L3p4K14k42
$$ y = [56, -12, 104, -25, -60, 298, 98, 281, -30, 20, -90, 82, 93, -148, -153, -250, -19, 160, 219, -22, 278, -137, 30, 15, 256, -80, 28, -166, -58, -35, 35, -189, -232, 89, -198, -187, -51, 53, -113, 137, -41, -92, 128, 72, 42, 94, 73, 5, 96, -227, -58, -58, -70, 118, 256, -103, 120, 112, -222, -157, 33, 185, 70, -98, -8, -173, 50, -234, 47, 40, 104, -67, -23, -57, 97, 107, 63, -179, -131, 84, 180, 131, -100, -51, 64, 155, 61, -16, -128, -79, 81, 22, 141, -59, 80, -34, 24, -131, 64, -53, -82, 100, -131, 19, -195, 94, -2, -183, -71, 106, 122, -18, -163, -191, 58, 62, 22, 104, 244, -123, -159, 71, -21, -61, -163, 134, 16, -127, -102, 8, 159, -57, -49, -12, -99, -140, 257, -94, -37, -232, -56, -98, 70, 146, -266, -74, 157, 39, 25, -29, 59, -106, -39, 169, -41, 25, -19, 221, -129, 203, -130, 74, 191, -132, -103, -154, -155, -252, 152, -63, 476, 63, -179, 66, -130, 84, 173, 152, -112, 54, 35, 185, -17, 16, -58, 156, -86]
5142h6j31O4M0J19J93p5m0j85J8J84K3j99J8J93j9m9J62l68J4J72M0k42R7J45
5166H8j44K4J45j78L0J97k57J85k3l50J80L27k48K30k63R6J42j31J39q2k03J27
5188C1J2n1o3j71J01p4Q1J25j46K30M01o94K58J30k73R7L61m38J07kj3j48P1q0
5212a48J91r3J67L2k52K46l98K47n7pnJ30k8j75K61q9J5J29o6p2M3k25K53k34
5236a35J01K63m02K77k53K53P9j52j4O3J60M8r7j85r1J66j5k04Q6J1R5j85J99
5259F8J3rj2m9J4j65l3K22J27k08J16J86p9j37j79K06j03j7K48l83K36l6R6p0
5283E2k60m8J55L37l76J49Mn1p8K70M5k52J47k17Qo8j6J91j57L29k46m8J62k13
5307a81J21r8K28l50M94j23k18L7J10O9l32J50K30j75j6J19j59o8L59j00o1N0
$$ y = [-86, -217, -153, -113, 6, 199, 124, 84, -101, -83, 101, 124, -75, -57, 136, 117, 68, 230, -138, -124, 48, 88, -154, -57, 88, -56, -32, 113, -65, -35, 162, -95, 90, 67, -283, -103, 224, -24, 206, -57, 39, 181, 50, 189, 107, -96, 31, 43, -8, -71, -242, -141, -215, -134, -9, -155, 75, 476, -218, 40, 170, -103, -6, 355, -83, 24, 22, 9, -139, -68, -148, 43, -50, 117, 149, -103, 143, -255, -8, -65, -72, -77, 53, 25, -150, 111, 22, 37, 166, 100, 28, 71, -154, 99, -135, -34, 229, -173, 104, -149, 104, 183, 31, 17, 80, 240, 288, 191, 6, -85, 81, 66, -138, -52, -41, 54, -131, 68, 81, 72, 60, 11, 25, -140, -173, 49, 176, -32, 84, 270, 191, 54, -125, 81, -22, -39, 209, -174, 62, 26, 122, 52, -208, -256, -101, 236, -140, 9, 13, -38, -116, 154, 199, -53, 94, -123, -115, -183, -199, -8, -165, 164, -82, -130, 32, -181, -60, -158, 70, -280, 214, 91, -127, -90, 20, 89, -243, -93, 137, -38, -54, 65, -94, -162, 197, 97, 36, 86]
5329H6j13K77j80j52J08J13k25l2J84r4P5j15M5j47M02j09l73j76M35J57k04N9
5351B1P4K8l3K29k88M1MP2k34j29K58M6J39l75N2l8J62Q3q4N5j10J15k14k1K23
5376G6q7J15R8k18j88L09j04k69Q6Q1L47k61M7R0k89K84Jj63J35J83k95Pk7K37
5400A95k97J6L13p4o5k12L76l65J49p6j26L93k62M5O6k26Q0N9M3k11j74L25M2
5423A4q2R3j4Q4j02j09O2n6Q1J30p7Q4j74J34j25o2J72k13k6J74J14k62j17J63
5447a14Q4%K15j85J32k40J00J30j03k3j65L27j23l6K0N7J3j54l8R6K02l12J65
5470D8J56p7j90l9ML11o4l08K64j83J47j13K34k63L9K23j90Q7k29K39om3j42O5
5494c0N3O7M8K4p3n6O4l44L91L1j71J82j13rj05O2n7j61K96k8K73k60l10K74j58
$$ y = [86, -27, 250, 70, -82, 26, 139, -86, -118, 66, -28, 47, -68, -23, -170, 232, 123, -250, -426, 9, 166, -38, 21, 95, 123, 90, 319, 31, 72, 76, 148, -86, -215, 43, 89, 228, -147, -95, -133, 29, 112, 28, 83, -27, 88, -126, -147, 76, -11, 104, 202, -16, -204, 105, 1, -268, -182, -101, 246, -15, 32, 122, -167, 117, 118, -45, 90, 273, -22, -15, -42, 195, -102, -86, 227, 153, 88, -124, 252, -113, 36, -40, -166, 227, -35, 10, 76, -150, -70, -11, 32, -179, -353, -28, 14, -68, 25, 11, 95, -7, -116, -54, -110, -29, 101, 24, 108, -66, 68, -57, -119, 53, -160, -186, -12, 102, -160, -277, -114, -30, -30, 185, 0, 132, -108, -8, 122, 19, -4, -169, 158, 35, -1, 19, 76, 89, -65, -103, -7, 195, -117, 48, 204, 127, -63, -102, -98, 213, 149, -159, 105, -78, 69, -44, 190, -73, -34, 189, -1, 86, -143, 96, 90, 47, -95, -30, 23, 90, 138, 162, 89, 33, 97, -247, 144, 175, 4, 186, 73, 64, -41, 21, -36, -197, 99, 71, 344, 84, -226, 48, -110]
5519a10J30m4j99P1J61k06J80qp2L1OJ31k67J01J66k70L30k74J88O1n4P7p8K45
5543B96k33j10n4J20K7k00K10p0j52K62k24J38J62K00j70N3k57j4Q8L1j73J84
5565A14l5o3K2j63J82r2j2J60q1j56n2L1J94RJ42q3r9k74J55j33K51q6Pq3R2K9
5591b4K36k66R4p4L3Q6m5P0j22j5P2Mmj44R9K30j61j28j63J47N9j8j1o9k2j48
5617b84J81K69j26l4K56l85R8K89k89PPN4P6j04J48j66R3mj65Q7R0k6j60J46j22
5642f4j2J48j8L0j53J85j92r9K97o7j52K28l1k94L16J3o3K32m34K32j59J1J2Q8
5666E4l1J92j80k11J82j5P3j44k37P19k81r7k2k77QK32j46M49P4l43K13m7j85
5689b0o0k20K27M6n8J58J67l06K87m5k45K20p2q8J5kN9M2j12O6J08k4on7k9j31
$$ y = [-110, 20, -24, -223, -152, 9, -197, -17, -25, -97, -66, -60, 71, -196, -95, 71, -199, 131, -143, 45, 106, 52, 129, 51, 296, 63, -47, -101, 19, 46, -154, 56, -14, -166, 96, -128, 10, 172, 372, 202, 255, -2, -16, 72, 103, -70, 114, 79, 16, 38, -125, 57, -35, -47, 113, 32, -124, -176, -145, 49, 58, 200, 117, 18, -256, -101, -234, 17, -69, -62, -145, -53, -24, 212, -54, 40, -34, -1, 85, 40, 110, -12, -27, 45, 49, 45, -99, 0, 230, 69, -59, -222, -75, -16, -34, -45, -114, -136, -284, -103, 166, 40, 6, 262, -123, -25, 264, -25, -18, -11, 43, 119, 15, 163, -3, 90, 86, -79, 8, 98, 72, -88, 58, -64, -76, 72, 54, 84, -69, 116, -76, -175, 122, 55, -97, 131, 100, -194, 122, 135, 72, 304, -130, 102, -57, -46, -34, 54, 23, 215, 35, -176, 6, -9, 64, -80, -317, 402, 121, 24, 2, -275, -267, -35, -181, 268, 342, -1, 212, 165, -20, -80, -300, -73, -27, -85, 73, 240, -66, 221, 176, -69, 151, 79, -9, 6, 4, 63, 105, -7, 59, 167, 143, 137, 80, 51, -80]
5715h0J81N3k29L3j08kJ77j7M2M7O4k18M7j9J06k08J04o2J27K4O8j04n4L14k41
5740D5O6l54L48L9m88K17o2J68j36K14K15k02j19J17K6q9Rk28K66J39j74j90J24
5763d9O3J10q5j30m1K2J68k72L12m8j57J03K39j44j46o7K08m6j09o3K63j96R9
5786C4O9k41L2J53k07J48m07L75o1Mm3j3R4LP9k55K49m7J23Pj28j8k22M67p1l51
5812b27K49J52k35q2J83m0k38K17k4J24j85j14K46n7J51j5r5J76k09o2Q6n0j7
5835f6J43P9j2K1J07j31l00Q2K42q8k4m0r6K25j16k2P4o3M5L3k45P5m0J0P8K37
5861B08j12k40k10K26k8L7J37j06r9K76k12J7J16L4Rm0PK66m05L01j55k29J01
5884a01o8J30R0L1O5P1r0j7J7r2L5N6j13k32K15J40k08J15J06l11J73q4Q4k1n5
$$ y = [-80, 101, 154, -75, -42, -150, -152, 25, 8, 50, 97, 161, -57, -10, -29, 77, -131, -27, -89, 38, 62, 130, 26, -28, 286, 45, 111, -243, 105, 144, -344, -127, -189, -21, -157, 57, 272, 70, -49, 68, 94, 5, 14, -214, 52, 191, 17, -173, -49, 14, 124, 39, -91, -132, -110, 58, -214, 98, 50, -107, -4, 235, 91, -55, -122, 86, 40, -69, -132, 131, -65, 34, 103, -138, -106, 47, -160, -12, -419, -44, -105, -101, -144, -157, -63, -60, 19, -236, 13, -34, 89, 96, -32, -50, -272, 195, 124, -227, 22, 174, -61, -143, 40, 0, -238, -21, -45, 79, -106, -220, 26, -31, 120, 105, 10, 186, -23, -85, 1, -49, -66, 77, 156, 144, 165, 272, 141, -159, -77, 165, 77, 53, 13, -83, 142, 26, 4, 78, 15, 60, 93, -152, -77, -117, -107, -29, 208, 96, -144, -354, -128, -156, -119, 18, -88, -187, 89, -123, -106, 10, 44, 53, 13, 20, 286, -119, 182, 27, -202, -101, -169, -39, 51, 82, 147, 218, 128, 111, 128, 36, 71, 127, 14, -218, -3, 137, -71, 44, 150, -161, 12, -72, 12, -9, -64]
5909f4K71J2J02k94K41j11J57l90j28J78J62j8j00j64M37m63J78K09k39J44j80
5930f0j13J7K40j33pj47M16m81N09l61J02K09l58K24k3j3l3k31J92r1K8K02K26
5953C14l93K87j22j04o2J65J1L8j04n2N1o9KJ20jk22M8m7n7K16n7o3J55j61K51
5978A44l24K64P4J0k31P5kn8m3K08l2l21O3R9P5N4k66O3N2J00l93L17L26l91K80
6003A43j56K90k99Q8m9J6J16k6k0j02k27K55m1L4M8k9J33j04m6j48k3N3m0P8m5
6028a01L23j57k22J5L31rl02O7j56J53K12m0k76L65j98l8J29j9j00j80K17j48
6050a34K27r3j24M31m14J44j26o1L08j50jj72Q7J69J07j93p0K23j79L2k42L25
6072I4J72m70K15K6k06K70k42K08j80K07l32K12j55M45M1k14K08l60K2k2R6m4
$$ y = [-64, 207, 219, 321, 27, 268, 157, 314, -76, -204, -26, 136, 118, 18, -146, 291, -172, 6, 215, -24, 120, -60, -173, -156, 84, -49, -56, -203, 213, -268, 241, -120, -18, 191, -167, 57, 34, 21, -12, -243, -51, -142, -114, 88, 314, -79, 208, 86, -18, -80, 85, 96, 134, 30, -22, 29, -40, -38, 82, 81, -141, -93, -140, -197, 19, -38, -101, 54, -107, 144, -180, 84, 158, 168, -63, 12, 10, -48, -91, 117, 85, -236, -173, -74, 1, 55, -211, -148, -96, 4, -389, -72, 254, -137, 143, -13, 277, -22, 66, 17, 33, 149, 123, 103, 1, -226, 29, -12, 22, 70, 41, 174, 70, 24, -124, -147, -94, -134, -56, -101, 222, 65, -157, -142, 189, 180, -122, -55, -211, -58, 154, 114, -162, 203, 5, -33, 96, 77, -23, -203, 14, -134, 93, 0, -124, 307, -107, 37, -89, -150, 158, 8, 7, -165, -78, 91, 198, 5, -65, 158, -21, 11, -231, 94, 266, -204, 11, 37, -169, 101, -141, 67, -113, 94, -238, -26, -181, 264, 305, 91, 299, -61, -39, -61, 35, -9]
6094iJ18m1k55Q9PJ27k59P4L6p5J41M14j71j80L21n38k3n6J17k6J06Q1J6l7o9
6119i2L29k98o9L55j41j46o8L61j8k28R3j13j59K40q6j49L40j29mK3r6J93J4j43
6143IN7j57J48q5l2n1o8J51N9j55J38P8k38K10p9j4N0r9m8J37J94N2l33R7M9J08
6169A78j33l7K85j87l59K72N4k59J68J33k38J82j55L65n42L87m21O09j40o1k81
6190a80Q5L5j85L15N7k18jK29j82K2J18mj53k08K66K2j10Q0K83k04L8rl60L69
6214A05k22M8M13n69K26J48jj13J15l4n9j37O4j01q5K32j61M12k36Q6j47J29M7
6237A60k55J59qr9J10j60J54q4K1j64K02m9Q9j61J61k81L50j32j07l4K81j51j33
6260a31K17o8kk23K33j44L10j64J10q0r8M3qJ17j67J79j82j19J78n3j45M8m9L81
$$ y = [-9, 109, 68, -187, -98, -91, 36, -223, -149, -113, -188, -47, 367, 196, 16, 337, -201, -224, -280, -163, -189, -83, -2, 14, -23, -92, 237, -61, -130, 225, 84, -62, -130, 231, 213, -15, 78, -35, -194, 46, -40, -189, 151, 22, 18, 41, -55, 138, 152, 9, 66, -91, 57, -28, -60, -111, -179, -28, 31, -124, 14, 92, -146, 64, -15, -29, 21, -78, -126, 11, 205, 257, -76, 21, 70, 178, 45, 8, 293, 106, -253, 19, 73, -186, -18, 115, -123, 59, -96, 269, -273, 114, -307, 302, 162, 101, -180, -95, -60, -245, 70, 127, -91, -92, 137, -45, -23, 95, 91, -62, -270, -4, 18, -92, -12, 271, 67, 105, 96, -264, 105, -117, -69, 344, -225, 1, 149, 148, 35, 150, 116, 57, -80, -16, -117, -202, 30, -131, 281, 45, 131, -16, 113, 160, -95, 64, 56, -43, 67, -93, 61, -23, -2, -166, 36, -13, 76, -85, 76, -205, 145, 13, -94, -128, 153, 2, -131, 86, 18, 16, -207, 26, -118, 192, 28, 138, 58, -40, 3, -5, 112, -55, 124, -58, -177, 1, -52, -197, -149, -198, 183]
6284A83j79K29k35j3J17m5lK8M0j87K13r3K1k19k0L54k71M3M8k46J52P6n5J23
6308F1m2K96l07J50K4l03J12K03j82j33J2N0J0n4J97Nl64M79k87P2j78J12K55
6331A88j71j61L10P6k69J7n1j84J53J87j81M9l13L99l9j10o1p4J53K64p3k79J46
6354b4J01j51K43m34k0Q3L08l6m6k65L14k56K08j9M4l2k50j6M76k16j33Q6kJ87
6378A50j59NJ07k77J38N3J56j08l79J37J83j70K4p4J62j20q1J76K41l21p0L2J68
6401b7r4J06n5J09r1k19N3J90p0J23J3r5J3n0j91Q8L10o5Oj05L19j81Q5m66L03
6426Im2k65N06j27m0J13k44J4J6K57j27J21k93rK96pk93j08J38J75k26L90L7l29
6450c8j17r1K64j43J59j43J24j48J95o8p0J0J05J3J93j88j21l7J98k52q7K30O
$$ y = [183, 4, 233, -2, -15, 102, 57, 54, 82, 122, -65, 148, 55, 76, -143, -163, 191, -80, -37, 11, -235, -83, -7, -62, 61, 19, 315, 8, 158, 182, -121, -9, 194, 12, -121, -109, -59, -49, -103, 94, 99, -265, 214, -73, -1, -179, -67, 188, 17, -144, 166, 242, -27, -10, -61, -245, -92, 95, -86, -37, -350, 49, 10, -100, -161, -235, -82, 182, 109, -170, -24, 77, -74, 169, -265, -285, -202, 106, 70, 24, -241, 73, -183, 25, 6, 50, 18, -232, -248, 228, 12, -121, -35, -37, 150, -9, -4, 103, -174, -36, 17, 173, 65, -314, -177, 6, -164, -140, -214, -52, -172, -253, -77, 164, -157, -227, -195, -27, -121, -15, -70, 39, -52, -271, -218, -28, -98, 25, 38, -57, -44, -94, -285, -197, 113, 48, 54, -51, 268, 87, 172, -294, 9, -33, -298, 208, 81, 41, 154, -90, -76, -60, 197, 70, 191, -102, -111, 185, 178, -115, -223, -85, 90, -136, 254, 291, -38, -155, -246, 18, -125, 34, -109, 15, -133, 62, -6, -76, -66, 39, 52, 245, 57, -64, -101, 97, -155, -242, -12, -6]
6473fL37k44k2q8j6M6K50k80q3r3K15l6r2M0J38J32j98J82J15j46j30K84k72k02
6497a69L18J7p5r7k43L54j26J39j93J82o3k02M6J8P3K9q9Q3k93M45L1l18N9q9
6521a63K4K23l28L02K0k14J55Mj04N5j1L17k96R8l3j11m0M19k66M1j58J64j16
6544a8R0k17J16k3k48J93K80j06l2N0N1p7j06m0J37k28J46K31l1L3p6j5k05J87
6568I2j83J23j15r1L07k45l8L77j15j76r3K84q0J39j99J33j57P4nj83q3K32p4
6591g6J14j65J30J0l8N4j45p0J10l8K82J46j76j00j72K51L2M0j08p8j18o0J42
6614c3n3m8JM49l39K36j68o2q9K38j98N2J75L3n0o6K49m68J44k2J69P1k57j56
6638a92R3k8J00O7K39L4k13R9j67R7p7J54j12R0l81J28K95m01J95J1j07M2L58
$$ y = [-6, 331, 87, 65, -23, -39, 7, 257, -23, -106, -199, 16, -20, -112, -72, 66, 198, 0, 182, 297, 151, 21, 305, 33, -169, 149, 166, 91, -6, -249, 105, -21, 118, -75, 107, 44, -158, -112, -94, -21, 8, -81, 2, -291, 154, 185, -133, -74, -163, -139, 84, -244, 58, 78, -136, 19, 23, -81, -26, -37, 280, -16, 82, 49, -62, -102, 317, 51, 92, -66, 98, -18, 72, -145, -29, -52, -300, -107, 173, 67, 35, 85, 136, 59, -47, -87, 50, -178, -32, 199, 168, 201, 125, 110, -95, 92, -91, 32, -83, -174, 133, -112, -150, 227, 112, -64, -157, 127, 47, 186, -13, 120, -37, 37, 32, -151, -234, -2, -76, 38, -127, 3, 13, -25, 29, -116, -186, -76, -114, 168, 314, 138, 38, -134, 117, 149, 189, 81, 3, -115, -175, -33, -86, -134, -133, 316, -23, 213, 45, -17, -106, 132, -66, -14, 161, 194, 144, 78, 327, -141, 3, -19, 150, 221, -36, -192, -99, -127, -27, 40, 279, 313, 100, 199, 32, 129, 52, 206, 94, 184, -197, -69, 226, -175, 20, 31, -76, -34, 324]
6661C24k23j59J23O4l06N4L97j37k95J01l01L17J02k41M12k59N7j47N05m91P9
6682b4J94j84K2L44r0j03r5N0j63j3K70j08j29O1k43K85k06k45J65J88m0J98k47
6705a13Q3L2R3j16J44j92J08Q4N4j86KP6n5R6L8k35k1R1J74j19m4J39k27K04j03
6730GJ42k5r0q4K57l45J62j1J19j60l3r5J24R4M4q5j20J62lN3J91k91k7j44K21
6755F3k54P0J92j40R1m7j6N9K02j09j89J5J5K02j77R8m3L56m18J23m5j49O3j7
6779e5j47J53J0N9J07m3j2k76K80j11J49p2J9j46L75l62M9L19l25j28L53k22j9
6802d5q1l0M09l20K55o5k08k4L4L7K53j42j89J68l5n2kJ08L0j94R3L09l82k90
6826c63L95J13n5j90O3M1N7j38K57j67q5J6J14j89J53k02L18k97J92L2j88J39
$$ y = [324, 101, -58, 65, 129, -177, -123, 274, 137, -158, -57, -358, -41, 61, -180, 232, -27, 30, -117, 388, -103, -24, 170, -14, 8, 352, 262, 159, 64, 114, -49, -62, 208, 100, -29, 32, -211, 74, -132, -377, -212, -24, -64, 134, -113, -30, 2, 95, -21, 123, -69, 39, 123, 177, -9, -7, 69, 14, 110, 148, -87, -108, -17, 157, 38, -6, 133, -94, 110, 7, 149, 124, 34, -50, 207, -138, 24, 13, 132, -28, -61, -156, -32, 62, 106, 21, -99, 63, 60, 113, 304, 13, -14, -158, 63, -191, -121, 71, -69, 22, -25, -41, 18, 220, 111, -78, -63, -48, 154, -23, 75, 32, 388, -30, 93, 48, -101, -38, -55, -202, -49, -39, 20, 127, 84, 72, -204, 76, -35, 114, 42, 61, -85, 290, -72, -23, 296, -29, -157, 196, -26, -45, -126, -156, 253, -67, 188, 123, -85, -109, -75, -38, 215, 73, -116, 52, 17, -35, -37, 71, 101, -93, 0, 309, -73, -363, 32, 145, 90, -100, -37, 4, 61, -77, 180, 13, -72, -56, 58, -131, 22, -180, 138, -159, 33, 65, -123, 16]
6848A6M2J28j86M0J3J87K06n38j68M3L02q8k68M42j08k13J20lp5K19M8j38j4r4
6872h7K47K8j55p1O6R0M1j17Mj5J19k47J15m9n0j2l03M22n2jn5J6J17k02K23R
6898H1j75O8Q6RR8l66K41O0j2j43R2r4J70k04R7p2K34j47j99J28J05q9k40L15
6922D3k49J10K74l3j19K8k01j79K74rJ06j48j1o5L93k37j42J49k15L74k66J37
6944A4k07L21j23Q0k56K31O8k76OJ00K45k79K56j82J28l1k0k4J4k04L85n03N7
6967b00J40m3j0L18m02l0L80p6QK58N5l22P8j36k02J00J59n9J5k61M22j70k77
6990b55J65r9K1J6j5P7o4J17K80m1k15K06j98P9l3l01J94n9QM8P5Qp4M7J9L9L9
7017H4M9j62m5l4J24J46k23R1J72j19j94K9L49l70n8R4J60l72K38q4K34j38j47
$$ y = [16, 58, 186, 0, 40, 53, 240, 446, -92, -260, -217, 85, -3, -271, 171, 63, -150, -30, -33, -108, 111, 159, 21, 7, -87, 160, 188, 33, -38, 28, 118, 159, 42, 46, 31, 150, -97, 18, -31, -81, -93, -396, 26, -26, -27, -82, -66, 51, -151, 72, 81, -94, -26, 60, 69, 167, -199, 42, 102, 90, -53, 39, -55, 115, -89, 8, -64, 170, 23, -176, -48, 57, -32, -272, 43, -206, -96, 178, 145, 26, 54, -147, -326, -52, -61, 45, -103, -114, -179, 214, -23, -165, -16, -231, 143, -123, 14, -193, 128, 5, 85, -171, 60, 128, -148, -142, -42, 203, -76, 180, -2, 126, 95, 75, 51, 65, -139, 246, -257, -200, -60, -103, -113, 205, -197, -227, 153, 77, 85, 343, 398, 76, 154, 18, -184, -84, 75, 16, 31, -230, 192, 22, -255, -90, -189, -168, -152, -167, -90, -154, -37, 243, 202, -13, 193, -5, 74, 41, -260, -66, -125, -117, -69, 6, 14, -60, -13, 6, 45, 84, 133, -29, -74, -108, 16, 162, -61, 30, 202, 83, -111, -82, 267, -103, -161, -67, 93, -279, -41, -125, 109, -29, -176]
7040a76J81kj8k3L8n3lj0j70L28r1j4J33j77J96j61L30o9l08o8M1K39j63R4o1
7065A3q5K84k23J53Kl57K43K0j78O1m7o0J23l1J20o7J6l10L49R4k40O3J89l69
7089b37M62k6k50L13m71K28K29j21J71l54K60k69O2j48L21k53M57l57J63o2j18
7110@k37J28L6P1n0l0J28j58L27j46j00Np5J88m7kK13j6Q7k67N5n7j68K76o0k3
7136G8k3o5j50J95L0k8J04k6j03l7p8k10L42J8m1J94Rk41R3j22K47r2o4O5o5l5
7162eR3Kn2J65k22N0k6N9k29K73j56N1J03o1q0p5j36J41J77%l04R9M02n41K14
7187e8p9NK5K36j35N5L9l0J25j87j78J51J81j92n1K2J26J66n2j79j79J89n7J62
7211A05j73L19k48p6j6K18k3j72J70o6k63K67J76j01kj72K33p7J46l32K09r4K27
$$ y = [-176, 5, 3, -15, -38, 0, -53, -56, -66, -236, 92, 1, -13, 120, -57, 139, -22, 308, 239, -69, -137, -96, 143, -20, 74, 13, -72, 212, -11, 142, 144, -213, 30, 50, -128, -67, -114, -174, -51, -82, 38, -29, -13, -323, 26, 120, -120, -57, 132, -237, 225, 199, -51, 262, -209, 19, 248, 127, 298, -56, 204, -65, -3, -151, 170, -83, 374, 17, 180, 118, 0, -237, -109, -73, -2, -52, -82, 46, -112, 215, 69, -31, -26, -101, 87, 40, 38, 251, 235, 322, 55, 110, 53, -115, 161, 101, 78, 55, -10, -160, 35, 65, 37, 141, 115, 12, -25, -103, -313, 29, 47, 6, 200, 209, -32, 61, -61, 186, 94, 30, 95, 30, -5, 88, 90, 38, 203, -19, 31, 5, 64, -165, 108, -48, 3, 106, 45, -35, -110, -246, -105, 72, 72, -232, -133, 269, -272, -58, -137, -132, -107, 129, -6, 49, 88, 58, 183, -4, -182, -31, 150, -42, -93, -71, 55, 221, 169, -10, -189, 0, -57, 105, -68, 251, 3, -73, -89, 129, 106, -66, 104, 38, -225, 42, 218, 117, 115, -57, 176, 99, 245, -87, 122, 28, 255]
7234B55j89l81J98o9J42j32J71J75l26L0L6J72k6j88j1L6Q2J10n9N2n8j22J56
7257E4q0l7k79J02K80M3k96K35k86K10Nk69L51K17p9j01j82J7K09j05L3n7oj13
7281a34J49j05J68M6o2l2N2k75N57k29J6l90L87R2k43lJ73j65j00N9n9J08on1
7305d7R4k44N15k92j80K20j8M5k60J45J7m8R5Q5r3K7q1r9j60K89k18J89j3k9J27
7330F6j06R3k78M01m3m15L49j43K58r3j51M1j57L1P3M8qk7k5r2J54p1K46l0k60
7355a39J00J50j87KN1R9J90m07L07k02o7J18M5j76KL16l90M12m12J15M02k43J27
7378B13j70l14L44R7o5J25l76K45q3J20l20J30j87N23k92J50l2j86p8R5k9m8j03
7401b41L75k71P9J26k56J74J00M0l02K75K06r2l81J13K06k20m8Q9J87j36L37m15
$$ y = [255, 66, -315, -117, -186, -44, -176, -5, 170, -156, -126, -90, 82, 56, -132, -143, -107, -25, 85, 26, 78, 20, -102, 54, -26, -63, -342, -240, 40, 83, -213, 22, -264, -54, -49, -318, 33, 250, 171, 70, -112, -95, 114, 9, 42, -15, -21, -134, 15, -90, 78, 124, 62, 30, 82, -193, 364, 135, 151, -239, 148, 240, -3, -6, 167, 2, -98, -39, -98, 10, 4, -47, 47, -197, 318, 26, -154, 66, 48, 93, -167, -22, -5, -53, 42, 127, 34, 61, -20, -119, -279, 10, -208, -19, -32, -61, 66, -40, 53, -225, 176, 133, -282, 67, -76, 182, 89, -62, -21, -178, -147, -74, -26, -34, -61, -86, -178, -24, -95, 151, 121, -139, -39, 111, -76, -74, -23, 76, 266, -141, 166, -36, -103, 15, 60, -116, -114, 202, -188, 224, -188, -73, 329, 86, 213, 43, -271, 73, 170, 105, 230, -146, 99, 16, 136, -184, -54, -241, 282, -10, 140, 108, -78, -156, -61, -90, -138, -241, 134, -137, -58, 68, -188, -14, 86, 126, -176, 99, 305, 213, -168, -55, 151, -69, -117, -28, 159, 23, 360, -55]
7423e5J10j06Q5n7J42p0k09K40l39J27K60J1l62O3K66N9r8Q1j93q2K95k09P1j42
7447a12K15j53j37K60j55k33J26O8J81N1k18L8j0j56K10MK04k30J59N3l43L54
7469A76j63p1J69l02J25M6pJ49k10J10m7O7k06J83J8k62M61O8m04j56L37k59k2
7492b00K60M2k27J50j25j3J67j98K45j53Q7Q5k40LJ14J8r7J35Ol50J63K63k89
7515a54K15j4r5J37p6q9P3rJ12k07J83k3J94l05J86j73K8K56k76J66p8o2j50L55
7539A94k32N4J9L19n85M64m24o7L77n8l9R1j74Pl9K32m34J40K17q1N2K8P8j49
7563a0O2L5Q9L1j81l6L77n34K69jj18j05r4J19J41L2q8L5j69K41r6Jj1k01J25
7588h7K12j96Q6p4j54R8k4k8J03j85K77j47j22J5M8J52K55j8l56K10l0k10J42
$$ y = [-55, 55, -51, 34, -23, 119, 49, -160, 80, -259, -132, 128, 139, -223, -160, 106, 165, 67, 148, -45, -127, 168, -41, 30, -112, 103, -50, -187, 73, -82, -315, -189, -121, 60, 111, -107, -69, -79, -235, -25, -21, 183, -47, 112, 165, -178, 176, 13, -58, 111, -191, -66, -20, -27, 122, -88, 22, -25, 42, -164, 19, 37, -225, 236, 304, -100, -256, 81, -178, -200, 60, 102, -125, 25, -100, -113, 54, -144, 101, -52, 35, 120, -120, -117, -3, 15, -82, 53, 59, -291, -128, 135, -154, 61, 47, -48, 89, 13, -76, -3, -12, 100, -107, 76, 53, 247, -58, 128, -45, -17, 239, -37, 129, 51, -11, -161, 194, -38, 16, 35, 354, -231, 233, -191, -258, 119, 61, 22, 113, -61, -54, -93, 139, -295, -155, 62, -19, 33, 61, 139, -10, 52, 87, 176, 207, 26, -10, 367, -167, 102, 101, -17, -122, -216, -97, 44, 76, -12, 23, -146, 95, -1, 0, -11, -212, -87, 125, -71, 15, -59, -213, -115, -139, -167, -64, -249, 28, -119, -241, -226, -178, -26, 229, 211, -145, 65, 35, -175, -33]
7611c3J35j92P1l6L9P3r4J95k4k39m2j16J41L29r5j23K2k1k08K61J40j35l4J65
7635A79k80K70j96P1J61J00l36J65l5j16M5K77l11p8J88k4N0j16j72K85J82k18
7657I1k4k40J37n2J36j98J85j24L3k6K8K59k9q1N5jL3k46J11K8r9L4j01O1M2J62
7683A74p4Q7l55K15q2M3J91j38k08K02j87N7J72O5l79J19k24M20j29k7n1m7L83
7706B27n0k03o3J80k11K49k76K82O2L9j61K0k03J58j46q1J14J28k38L59J3o8p8
7729E3k55K87J03J66k04R6m54J18J75l6j12l6K42o5j37M76m89l2P1m1k8K82k3
7752A57j22M9J0L9m8J01k22O3j08K53l35k4J94l16K75j4L00m05K01j55j4L5M4
7775d2Q9L6J11k26k2k7J02n2o4q0K40j94J02j19K27k13J03R2rN6k00J69j89jn3
$$ y = [-33, 102, -90, -19, -55, -16, 57, -37, 158, 134, -105, -147, -263, -122, 207, 112, -11, 11, -10, -218, 43, 183, 48, 14, 179, -101, 169, -27, 44, 205, 305, -31, 134, 99, -17, 28, 305, -6, -84, 104, 80, 130, 14, -158, 127, 309, 91, 67, -173, -36, -88, 48, -150, 35, -89, -56, -82, -54, 205, 176, 95, 150, 149, 182, -64, 47, 75, -24, 10, -91, -30, 12, 174, 100, 187, -168, 47, -35, 8, 199, 61, -147, 55, -132, -75, 97, 162, -217, -98, -322, 98, -31, -58, -109, -156, 227, 177, -26, -89, 91, -120, 129, -147, 135, 197, 236, 75, 95, -108, 50, -96, -177, -63, 65, -173, 186, 199, 131, 53, -202, 85, 188, 354, 150, 246, -208, -90, 85, 49, -63, -99, 143, 78, -59, 417, -72, -104, -33, -74, -102, 180, 157, 35, 84, 94, 133, 85, 186, -36, 27, -81, 172, -163, -187, 7, -309, -34, -48, 252, -153, 48, -107, -121, -86, -42, 47, 83, 194, -32, -54, -81, 21, -31, -95, -175, 65, -129, -27, -146, 81, -132, -29, 63, 54, 110, -90, 79, -110, -111, -164]
7800a64L9J20K72K0l32J11j8Q0q5k7j62J82L3k79L80l7j93q3J83Jq5J02O5p2j10
7825e9J33j97P0J17lj13R1J09o4R4J97j62j85j72l6L62k27l49M52q1nj40J66K0
7849A8k53L11j19M0K1m2j25O8J97k25M2J21K30l85K20j62J78l30K06q4j41K32
7871A8j7Q3j42L17l74m3J26J17j89P9r0L77j45J33l93K38k88j6Q1J95j91L65l42
7894a01J98j70J88j34M7K06k60Q9j66K24k80j9J30J04p6j0r1j33K16K34l43O8
7916g9P4OJ43k20J19k1J52l42m4J03J23J39k45J21J20j26J08j04J1j13Kj62K16
7939a9K29k65p2j22R1m8J59K90j62j06j27J38J93k6j39p6J5k40K95O6K11j63m2
7962H0j81J76j64J2n5K04k75J3Q6J72P4k23R0J15j50k07K96L5j07j60K27j6RQ9
$$ y = [-164, -125, -5, 267, 287, -45, 66, 48, 128, 43, 16, -146, 36, 69, -210, 170, 133, -60, -143, 40, 41, -44, 58, 123, 51, -59, 74, -123, -53, 64, 61, -52, 39, 148, 84, 178, 375, 213, 28, -144, -180, 182, -45, -394, 58, -23, -28, -168, -2, 18, -235, 76, -43, -3, 18, -24, -149, -81, 116, -109, -67, 54, 284, -101, 119, -43, 135, -195, 11, -73, -214, 18, 1, 84, -58, 259, -115, -158, -32, 85, -104, -25, -115, 262, 117, 250, -143, 95, -193, -209, -128, 67, -124, 241, -101, 97, -73, 115, -19, 28, 234, -26, 63, -103, 121, -159, -178, -48, 56, -20, -30, -121, -254, -38, 196, -147, -79, -5, 1, 144, -76, 43, 22, 174, -168, -212, -109, 14, 153, -92, 29, 149, 23, 131, 27, 38, -75, -73, -235, -19, 210, -55, -127, -249, -158, -206, -47, 243, 81, -25, -152, -14, 179, 153, 14, -62, -47, -287, 8, 74, 285, 122, 80, -101, 75, -89, -77, -132, 72, -203, -190, -104, 68, 142, -81, 9, 124, -26, -233, 63, 98, -9, -169, 58, 42, 51, 140]
7986A40j83l25J88J30j4J08J26l15r4K87n4P5J12j46j95j2Q6J87j73j96K80j77
8008a65K35J05J21m58o0M73j89j0k04J76j73K38L9k27L50l60J54J15j1o8k5L86
8030D42p42K40j11K37k69P0L9J15lk42L82j09M4k22K74r6r0L6n3R7J07j23k39
8053b16O9K14j82k6J55Q6J4j04k53J77q1J15rJ5o2P8O4k44J37J72k19J82q2K28
8077B28k70j01J83K5NR4j98J59l59L06Jp3jM1j6J28j10N1j2N9j89K78j18l3L5
8102A13j10k3j62M87k27K00k45K0k22L16k03M5M6L8j16j71L80l37J63k26P0J43
8124b1J50K4j97p2J13J28k29K16j85N3lm2n6L22m00K79N4n7j62J9j27J5N5J34
8148A1j31J44n5O1J10l41K62P7j3k32K75l41K77l09L09J43l31J24R5K1K4j17L6
$$ y = [140, -43, -368, -180, -50, -64, 44, 170, -145, -239, 48, -6, 69, 181, 35, -160, -172, -86, 101, -72, -268, 12, -165, 70, 175, 296, -162, -222, 251, 62, 52, -152, 24, -149, 89, 128, -99, 251, -109, 45, 160, 149, 81, 56, 442, -300, -60, -171, 66, -203, -133, -94, 21, 18, -224, 158, 49, 93, -129, 145, 49, -41, -5, -58, 39, 146, 23, -216, -147, 67, -115, -141, 14, 100, 114, 10, -243, -66, -147, -32, -41, -26, -88, -10, 54, -190, -53, 119, -100, 82, 0, 228, -42, -143, 40, 65, 70, 164, -34, 125, -234, 72, 73, 0, -1, 40, 24, 152, 42, 93, 81, 140, -49, 229, 111, 78, 113, 3, -20, -182, 305, 78, 278, 33, 53, -169, 147, -56, -11, 35, 73, -43, -214, 166, -171, -8, -234, -164, -21, 129, 153, -44, -116, -3, 125, -104, 112, -73, -20, -23, -65, -121, 201, -199, 80, 134, 77, -85, -66, -193, -178, -123, 11, -120, 24, -31, 30, 140, -201, 61, 138, 125, -107, 168, -173, 104, -205, 104, 247, -84, 40, 135, 156, 180, 63, 99]
8171I9j06J00R2l49J18M7n3O0k0J68j9J45j90j9p1j29R2O5l9J31
$$ y = [99, -7, 93, 185, -164, -46, 1, -52, 8, -12, 156, 137, 282, 92, 73, 2, -127, -35, 30, -9, 122]
8191A22
$$ Imaginary data points
##PAGE= N=2
##DATA TABLE= (X++(I..I)), XYDATA
0@%%%%%%%%%%%qJ6j6J6k3L1l2M0n6O4p2Q8j04J20j44J69j93K24k57K95l37L85
33B06m38M94n57O24o98P84q78R76j085J205j336J479j634J806j992K195k419K665
51A397k936L235l566L937m358M833n372N996o728P601q662R980j1672J3941j7154
66i528K2094l0752N0301j77343L6883L33144q9162j97571r7381J24966J51936
77A17587P0558j38825j90863k0643J76863J19144m4531j56626n4161J10854J45210
88A34567l150j45410j23615M0092J16865N7569p5130j04911J3332J14983Q2580
99A07772j5300r1188n9792L2573Q5614J8354r4164p9953L3775Q2416M4511l3759
111C0859o7658j8698N1666O0913j7510p6826k7338L6326N0085K2193k6259l9003
$$ y = [0, 0, 0, 0, 0, 0, 0, 0, 0, 0, 0, 0, -8, 8, -8, 8, -15, 16, -16, 24, -32, 32, -40, 48, -56, 64, -80, 89, -104, 120, -137, 158, -179, 206, -232, 262, -295, 329, -369, 415, -463, 513, -572, 633, -703, 776, -858, 948, -1044, 1151, -1268, 1397, -1539, 1696, -1870, 2067, -2291, 2542, -2830, 3166, -3562, 4039, -4623, 5357, -6315, 7626, -9528, 12566, -18186, 32115, -145228, -108345, 224799, 135637, -61934, -159315, -34349, 117587, 188145, 49320, -141543, -162186, 14677, 133821, 89290, -67336, -121497, -10643, 134567, 131417, -13993, -137608, -97516, 19349, 76918, 1788, -103123, -89791, 25192, 107772, 92472, 1284, -58508, -25935, 59679, 78033, -16131, -96084, -62309, 20107, 64618, 30859, -36799, -55497, -3831, 57082, 39572, -37254, -64592, -28266, 21819, 44012, 17753, -21250]
123b1250k449M7131M1659l0656o1001k0346L0632M1887j0834m3718j2498K2468
135a8975L4001J5732j5297k7591j1041K9026K8127j7806k9765j0932J4849L0293
147B0621O011k3705k3353Q572L0558R86k3588j6130l757J4105J3822n86p110r499
161a3053Q419K4431R211j6533k3523K231J8714j551j2179q959k330J4327J3417
174A2622j194j0570r436N839L694l344j338j0490l113J3905J6492M040j4114k918
188G5J5109P76j1804j1870m518K559J59O954N962o102J568P252M314l141j3871
203f578o374J765M078Q177j260j000J0757R421K22j1850p642j87j0501n000O663
218i309l63j610N585J4871Q943r070n635r9l207k831o253j255N174L923R233L024
$$ y = [-21250, -23699, 23432, 65091, 34435, -26566, -46912, -16280, 25607, 14773, -28945, -41443, -18975, 15026, 30758, 15461, -12130, -23171, 5855, 33982, 16176, -13589, -24521, -9672, 20621, 26632, 2927, -20426, -11854, 18704, 19690, -3898, -20028, -23785, -9680, 4142, 3556, -3554, -13053, -4634, 19797, 29008, 12475, -11048, -8817, 9897, 8346, -3833, -12792, -15122, -795, 12622, 11428, 858, -8578, -2739, 955, -2389, -3727, -14217, -17330, -3425, 13067, 17107, 2993, 75, 15184, 15960, 4156, -7714, -12232, -9673, -9514, -2560, 3402, -2700, -1132, 6120, 10434, 7293, -6578, -12952, -11187, -7109, 1068, -192, -1192, 9565, 18986, 19208, 7358, -284, -471, -10972, -15972, -9309, -9672, -11282, -5697, 9174, 18117, 9047, 3412, 3313, 106, -2725, -8978, -10233, -5059, -1136, 8097, 11121]
234A1121j740J274m712o251n323n868l281n543O897J6080K800j14O088O480j414
249A6494j1598m828j715q337j435L280M420L608J027O256K660n322l537o731l568
264i326J853j34R96K146Q041J0534k140o85K267m828q347p373q97o36p787L557
280a2759R064L728J957N28N452Q10o091o05j951l683J632l1J443K348K480K371
296F693l514o86J506p554n091L18J631k99l217O448Q797k19J900L976K416m193
312H912p261R7k485p585r4Q84J052L485J710L508N36J109J064o723k358J360j234
329d023J53J497O986N167l508K061L631n478p871o210k29l471n708N475O300L895
345a333O535L935K511j563m093j796o279k890Q03j720K189N369N242J776m136
$$ y = [11121, 9381, 10655, 5943, -308, -5631, -11499, -14780, -20323, -13426, 2654, 5454, 5340, 11428, 17908, 16494, 4896, 68, -1647, -9984, -11419, -8139, -3719, -111, 916, 7172, 9832, 4510, 973, -5758, -9326, -7473, -7607, -6611, -4465, 3576, 14110, 11970, 11285, 13552, 8724, 377, -6996, -7893, -8529, -16316, -12759, -3695, 33, 1990, 2518, 7970, 8780, 2689, 2084, 133, -3550, -1918, -1949, -506, 1842, 4322, 6693, 3179, 2493, 3999, -3555, -8646, -8328, -6697, -6996, -10213, -3765, 5032, 4813, 6713, 10689, 13105, 8912, 1651, 1748, -737, -8322, -8416, -7532, -6480, -2995, -1285, 2223, 2759, 3868, 4932, -1791, -4149, -2789, -4023, -3870, -2373, 4613, 9780, 6272, 8333, 11964, 6486, -1385, -7595, -7824, -11295, -17003, -11528, -5228, -1333, 5202, 9137, 11648, 10085, 5992, 4196, -2083, -4973, -4170, -5890, -3701, 1668, 6910, 8686, 4550]
360D550O67j112j0209o146l30J224M61K527J1172O201M21M399N87l553o732o962
376b835k174m429o19M814J981M510M853O24j977n100j607k196p802J018N427K476
392c036L670O281P707j2n910l76l596q124m894k541K177P15J791O688K148P55
408C443K312k152l029l574r74O6k081M892N569n14K553L253K98n127o631J46l381
425d931o103J08L174K583J973K780O774m22j782K243k239k868k176m85Q74j218
441a715L331K310l142J067J607k778l645k878J153j491l237M392L844J182K569
456B569L579M190k274k783K268l690n099k107j225r45q89K712K839j773K744K480
472B596k292j063p95O04j070k391N516K891j143L501L095j48m877l654J21n807
$$ y = [4550, 5217, 4105, -6104, -12250, -12580, -11356, -10895, -8368, 2804, 9005, 9426, 13825, 14412, 10859, 4127, -2835, -5009, -9438, -10057, -5243, -3262, 1248, 6101, 6725, 4748, -352, -1959, -4155, -11957, -10939, -5512, -3036, 634, 6915, 14622, 14610, 8700, 8324, 4728, -3396, -8290, -10831, -8654, -7939, -6148, 540, 2688, 3443, 5755, 3603, 574, -3000, -3974, -3908, -5989, -1097, 4472, 3958, 6511, 9764, 10062, 4935, -1696, -1550, -4931, -11034, -10926, -7752, -5169, -3196, -416, 6358, 5936, 4154, 6397, 4158, 1290, -886, -1371, -497, -1715, 1616, 3926, 784, 1851, 3458, 680, -2965, -5843, -4690, -6181, -9418, -5026, -1182, 0, 2569, 6148, 10338, 8064, 5281, 7549, 3859, -1240, -3347, -4572, -5517, -6406, -3694, -855, -2628, 116, 2596, 304, -759, -1554, -950, -2020, -4411, 1105, 3996, 2853, 6354, 9449, 9301, 4424, 770, 891, -4916]
488d916n779J292j73J273K983N285M914NJ895J518m501k371k099j806n02m42M952
505A528K114j572L071J004l669n260k533l67m722j111O586K971L183N407L570
520A0200J080l604k439j800o111l527K03l08J783K209N109J629k764J853j387
535B126n916j679p9J672k49K929O978Q07m0K431j724m012n260k966k75l675R17
552h015M714J458K643J903K334p32l771R40j141m165J431K342N58J035J438L030
568F002k610l139J116k753l571j220R21K199q33K754M685o53j14J583p08k039
584A620k687J043m71l101K975J971j431N30L37L13k222j725K516j858j272J634
600a828J426J489l02J813K386k883j268J650k126j608n36O13k77j746K280J301
$$ y = [-4916, -10695, -9403, -9576, -8303, -5320, -35, 4879, 4884, 6779, 8297, 3796, 1425, -674, -2480, -2982, -3424, 1528, 3642, 2070, 5141, 6145, 2476, -2784, -5317, -5684, -10406, -11517, -4931, -1960, 1223, 6630, 10200, 11280, 7676, 5237, 3437, -2674, -6201, -5998, -6306, -4523, -2314, 2795, 4424, 1660, 3513, 2126, -3790, -5469, -5548, -3876, -4125, -1196, 5782, 6589, 6549, 8980, 7256, 3244, -2016, -4982, -5257, -8932, -8015, -3301, -1843, 800, 2703, 5037, 4305, 534, 1474, 333, -3832, -2401, -59, 499, 1534, 2972, 6002, 3392, 253, 1369, -1384, -4955, -6175, -5254, -3055, -3888, -1134, 3551, 2898, 2784, 4367, 3659, 1620, -1067, -24, -495, -3596, -621, 1350, -81, 449, 786, 1099, -1123, -2848, -332, -2190, -3462, -1828, -402, 1087, 785, 2598, 4984, 2101, 833, 2483, 357, -1251, -1787, -1174, -1451, -3197, -917, 384]
616C84j665J392O58L79j230r48J998j146j542K407M17l76r4J119J568k888j7J192
634A608l468k116N94L27K59J65L845J917j212J996M92j849j515j857K71k044j815
651d402L279J052m1J934R19l75l084p21n6l614k70K371J357K293J980L787J472
668G881k530p17j897m998k669r48M17r6J166N097J947J13J588p65k737k849j179
685c176K64j992K133M802J458J957J663k58k266m830k009k633m310P86K068K779
701c564K503L021M641j67j988N45l134l461j345O7J113l40K563L735o49l03l3
718C204k704l007l231k18O5j209M326M286J742K121J717N09k376k936n66l534
734a811l350P95P07P05M44K513K289j310q10N74j967r87j05J204P59n22L397K525
$$ y = [384, -1281, 111, 769, 1148, -82, -1030, 968, -178, -1720, 687, 1104, 728, 634, 1753, 3321, 433, 416, 1608, -1860, -3976, -3382, -3055, -2796, -2631, 1214, 3131, 1919, 3915, 4407, 2558, 1043, -814, -543, -2587, -4402, -1123, -71, -112, 1822, 2741, 2366, -718, -1439, -1495, -5109, -5379, -3008, -1651, 642, 2622, 6409, 7881, 5351, 4634, 2737, -2261, -4930, -5878, -5461, -5557, -4391, 706, 2653, 2766, 4354, 3589, 852, -1997, -3176, -2912, -4904, -2771, 2031, 3489, 5446, 7109, 6851, 4585, -245, -2254, -4887, -9197, -8411, -6343, -3564, -1061, 1960, 6601, 6434, 4446, 4991, 1857, -1604, -2949, -2882, -1769, -2109, 454, 4189, 3540, 3237, 3204, 500, -2507, -5738, -5956, -5891, -7100, -2774, 1512, 3254, 5375, 7092, 7601, 5225, 2289, 1723, -1811, -5161, -4366, -3659, -2954, -2510, 3, 2292, 982, 172, 746, -1221, -2208, -2313, -1109, -350, -872, 2525, 5050]
752E050r88O46o6j634k685k639m41k441j778K692R67N81K015J966K200o66P05
769C484P07k397j560j76j72l26q75K306R96j887J008J84k233j549j085J37j584
786e022o59L986J200J389L176J828J75j268j190m72m131k217M75p63N4N76K633
803b30J598j021J344l54k974o76RQj78J194M179J108J87J875r03k018k695k182
821a729j279l022r5K816M31J431K430J803M20j463J83p80l501K81J250K87R96
838D59J629K374n13k043K98k644l074j039o3L24n03K697M010L30O63J600p67j635
856B103k078K84j064j935J952J736m21M23M34J11j894k209Q41j233j947K125J179
873a593J599P85J972K474j758p76M08k566j615l81M18o05j106K040J158j478Q66
$$ y = [5050, 4062, 4708, 4642, 3008, 323, -2316, -2757, -5198, -6976, -4284, -3317, -2736, -721, 1245, 3445, 2779, 3484, 4191, 1794, 234, 58, -114, -440, -1315, 991, 1987, 100, 1108, 1292, -941, -2490, -3575, -3438, -5022, -5681, -1695, -495, 894, 4070, 5898, 6073, 4805, 3615, 3143, -988, -3205, -2730, -3493, -3439, -2863, -230, 1368, 347, 1691, 1337, -1637, -2313, -2304, -2296, -2474, -1280, 2899, 4007, 4194, 6069, 5166, 3148, 453, -1729, -3008, -6030, -6125, -3309, -2878, -1447, 983, 2786, 3206, 1743, 1926, 1146, -2355, -2074, -824, -537, 459, 2088, 4462, 3949, 1906, 2204, -440, -3514, -4553, -4616, -4292, -4795, -2098, 1912, 2242, 2905, 4505, 3738, 2103, 25, 309, -755, -2690, -738, 998, 577, 1000, 1434, 1545, -349, -2558, -1717, -2950, -4897, -2772, -1593, 6, 791, 2763, 5237, 3479, 2703, 3111, 545, -1070, -1451, -1033, -1638, -2744, -704, 454, -1024, -158]
890a58K75o72o20o37J478l83n36K710J194l32J87J76L09k535r95O90k295q15Q30
909b129J80N35m78K038R56j481J112Q73q67m57j24J343j093j203K125k39j445
926c54R41J34o21j467l30J053j682n64K388j0L36Q64J145J295j544N55J15k116
944A38j076n5l06o88m75K480j1o75J730M4j069p87J32N66j746M87K552j38N13
963A616Q64M40n31k085n68o64k678L5R97J87R42J090K841K39j203J498r63k559
981e02n61k81M08k39M62K712m86j57M85r22j678k152%K24j027J729K340J001J066
1000B422J465O15j849k269K63j716k345J037M73Q53Q37R85J560j507j069N31j569
1017a283j051K3Q77J231O4J980J902r53k23j64j649j778k123P51n22n95K247J222
$$ y = [-158, 117, -555, -1175, -1812, -334, -717, -1253, 1457, 2651, 2319, 2506, 2682, 2991, 456, -539, 151, -2144, -2959, -2129, -1949, -1414, -1892, 146, 1102, -379, 733, 1606, 739, 282, 158, 1501, 408, -795, 1330, 1091, -354, 587, 721, 100, -1367, -1697, -644, -2326, -2890, -502, -512, -176, 688, 1833, 3128, 1584, 2139, 2254, 138, -938, -993, -1299, -1987, -2462, 18, 7, -668, 1062, 1106, 37, -750, -618, -52, -1798, -1311, 1241, 1103, 1616, 2480, 2920, 2389, 304, -264, -928, -3606, -3571, -2574, -2387, -1445, -355, 2486, 2725, 1522, 3020, 2057, -502, -1063, -1344, -936, -1175, -713, 1999, 1513, 1356, 1841, 919, -759, -2911, -2911, -2687, -3714, -1985, 355, 1356, 2422, 3887, 4502, 2653, 384, 647, -1069, -3414, -2377, -1904, -1051, -214, 771, 2331, 824, -245, 286, -1283, -2334, -2311, -1434, -203, -139, 1841, 3743, 2790, 2567, 2403, 754, -1024, -3147, -2396, -2918, -3513, -1266, -44]
1035d4L34J107M82K77j745j046J118j281o58J182Q92M83MJ009L21k260l89o82
1053h96j396r23L0J232O18J76K499Q46n77J015k87n30j561r82J048j378n28J453
1071a41j72j2k15J018j42j752M47K67j415M65Q04R20P91P8J714J42q74O41p21
1090A843j446j485p48K13j301k42K220Q3K27J527L76K72j264L52n4j737P57M30
1108B3K09O61P89J035l63j391j40j015k525q29k5P06QJ480K924O7P61J230m50
1127C155j320j440o23m59j484P24J554k07P20O73M85j166k211J90r35j332O62
1144c014J079J522J444J683J985q81r59K49j896k387j251l50j00k45J928J584
1160C91l71P66M17n65r43q93K78j94m13J881J331O7J178K59k57j933j365j68k112
$$ y = [-44, 290, 1397, 1879, 2156, 411, -635, 483, -798, -1456, -274, 618, 1101, 1105, 2114, 2435, 175, -214, -896, -2292, -3215, -3185, -1953, -1335, -1159, 1340, 2186, 1609, 2624, 2337, 1807, 246, -736, 312, -1066, -1594, -141, -313, -325, -540, 478, 336, -1416, -969, -702, -2117, -1652, -848, 72, 863, 941, 2655, 2797, 1923, 2564, 1843, 397, -1088, -1836, -1623, -2924, -3166, -946, -863, -636, 891, 1267, 1539, 275, 627, 573, -1164, -407, 23, 232, 893, 1682, 2717, 2354, 963, 823, -192, -2717, -3546, -3571, -2865, -2857, -1377, 1547, 1614, 2375, 3605, 3155, 1835, 395, -228, -687, -2171, -1447, 107, -100, 620, 1293, 1778, 612, -1599, -1409, -2344, -3676, -3014, -1935, -413, 1031, 2714, 4699, 3818, 2859, 3108, 1212, -1175, -2426, -2776, -2876, -3121, -1193, 391, 20, 786, 1203, 638, -305, -1198, -920, -1114, -1527, 354, 1685, 1752, 2930, 3189, 2932, 999, -366, -534, -2646]
1179b646p13L3L53Q51J082J752R01j008J001J93j109n28m03P69k17m71J458K04
1197A502j158N14m13r12j204k64O29j027K35J430M70O87P33Q09J56j221M03L57
1215A726j385l09r8j77o85l8N60o6j272J219J76n84L77J92O15n69M96J034m36
1234G76k28O35K38o9j067L02j36j686Q3J18n81J31L39J179jm49J600K19j237K64
1254D30Q5k10n14R6J109q42L2P15l77q95o82K40mj313N36J384m88P00J052M71
1274A525k23o21P80r06j126L51J2j51R1N81O05j071m43Q90j465n57M44J81P01
1293d02j16J359J283p72K06J03o49j174o92N8k85p09J297O22l43P30J14j09j113
1312e92m89Q71j161MJ321Q09L69N6P67K39j689l79j20j886j35L9Q63L64K65J642
$$ y = [-2646, -3359, -3326, -2973, -2122, -1040, 712, 1613, 605, 1606, 1799, 690, 162, -241, 528, 311, -160, 1298, 1502, 344, 858, 445, -467, -1671, -1935, -1306, -2333, -2098, -668, -198, 489, 1222, 2031, 2187, 966, 1369, 1726, 341, 32, -66, -243, -928, -966, -406, -472, -1744, -525, -349, -933, -556, -364, 251, -318, 178, 1212, 776, 548, 1183, 1421, 1352, 285, 587, 451, -1235, -1152, -1034, -1615, -1484, -1145, 34, 33, -416, 1184, 1403, 166, 430, 515, 305, -209, -113, 996, 154, 186, 901, 524, -371, -1053, -813, -817, -2130, -1594, -210, -698, 2, 1054, 1525, 1302, 681, 1461, 555, -571, -220, -208, -359, -268, 313, 918, -153, -596, 294, -1171, -1728, -1284, -1103, -402, -518, 841, 2124, 1352, 1558, 1661, 1012, -162, -854, -796, -1081, -1790, -493, 129, -214, 516, 630, 521, -592, -1081, -210, -1371, -1367, -46, 763, 1132, 1188, 1955, 2194, 505, 126, 6, -1880, -2015, -1976, -1113, -749, -484, 1158]
1332A158M71p53K27k76p25j021N7P42p00K86J694j38M59m80l93l20j577m67M86
1351a270r01Q66R08Q63K54N57Q63l88j107q2n54r34m81K60N13k97K66J553n20
1370C69o60O60m27k15r87N60P96q30M13J700k13M1j26L45m18j553O35j016j076
1389b002J60O25K25R6O85J378k24k75N91k48q09m13J32M7p64M07J150m33N2K84
1409F64o8o46r24K11o67m61M98Q02P54L24R05R27k47p96J56j202r86o68J02Oj44
1430a460P57J302m89M69L43o01o39p36N93k78k88J023J055J28M07M03p5j286j121
1449d93L36j661p99N30O78L97M23J819P15j031J06K18j132n55j67N23j81j98J511
1468A039N6m77M9m89o25q53n78M59n50J34J623N88O12M43K87K4q82l46K59j224
$$ y = [1158, 1629, 876, 1103, 827, 102, -919, -862, -120, -820, -534, 1160, 1022, 1481, 1001, 608, 288, -1289, -1756, -1270, -2171, -1305, -397, 466, 720, 1277, 2140, 1752, 645, 563, 9, -925, -1406, -1146, -633, -930, -664, 889, 369, -291, 369, -58, -273, -1260, -700, 96, -734, -321, 1379, 1166, 1207, 1081, 1426, 1008, -545, 90, -926, -2002, -1842, -1217, -992, -896, -211, 1167, 943, 668, 1259, 1011, 202, -211, -79, -32, -796, -389, 761, 328, 380, 664, 596, -50, -974, -763, -1430, -1891, -1393, -591, 163, 487, 1392, 2319, 2072, 1276, 1432, 230, -756, -1424, -1322, -1316, -1460, -703, 599, 110, 579, 922, 321, -318, -1054, -461, -739, -1027, -4, 1051, 1179, 1586, 1989, 1914, 628, -493, -157, -1818, -2617, -2087, -1409, -1012, -589, 1230, 1945, 914, 1020, 1238, 106, -449, -616, -93, -274, -472, 1039, 1095, 618, 667, 178, -447, -1300, -1878, -1419, -1969, -1835, -212, 376, 988, 1431, 1718, 1742, 860, 514, 773, -451]
1488d51j29K95J69k02k14P04k02l89q5j31o62J89M90N21Q2M84J157l43k20K47
1508A310J5q46p30J15j96o56oM14k36Q0J26M65k53l38Q84j25J95J28M00K87l49
1529F84j11N93o45m07K35o48n37m1J82J48j055P37P20l53L03O43M23K2n58P23
1549A058k94p62M57k04k1m99NK07n53j15M76l27p11O79q8K23J0R40P29m02M18
1570A226K20m08o03m84J23m29j178O78K66k25M01J93J08o1k98L39m72j65O57O31
1590E19J94J75K61K33o57o2j58j201p62L06K42n7j53J418l71o9P40L23n63n60
1610b02M8L89k72P8Q72j72K61m38n5k07r80l41k86l77N55P46K02M03K24P42k33
1631I57p54J48j33p18O2L65J53l26J89J077p82o37M06m56k72l96L21K63J30O63
$$ y = [-451, -580, -285, -116, -318, -532, 172, -30, -419, -504, -635, -1297, -1108, -618, -97, -15, 469, 1626, 1283, 1063, 1310, 1325, 479, -251, -136, -332, -988, -994, -580, -816, -736, -610, -145, -398, -736, 148, 23, 218, 346, 746, 1033, 684, 573, 1166, 521, 114, 349, -299, -836, -877, -695, -547, -1602, -865, -145, -498, -195, 448, 871, 893, 335, 1058, 764, 2, 459, 255, 234, -265, -260, -53, -606, -721, -245, -572, -1283, -604, -692, -469, -459, 481, 1210, 808, 1226, 1446, 1038, 435, -49, 74, -355, -1533, -855, -589, -814, -413, -220, -112, -173, -471, -132, -604, -769, -112, 519, 713, 888, 1149, 1382, 725, 663, 505, -696, -1458, -1152, -910, -967, -1120, 298, -73, -142, 598, 921, 358, -202, -154, 235, -37, 41, 913, 741, 1002, 564, 509, 302, -678, -1019, -1305, -1682, -1127, -381, -179, 224, 448, 1190, 957, 203, 351, 218, -500, -438, -73, 80, -246, -57, 1020, 238, -399, 7, -449, -721, -1117, -796, -533, -403, 260]
1651B60O67j09K59J24m85n28p26N10o13j47K17O34P2n14L97M07m15m29K54l62
1671e27p7K73M66O14l60M84K2o30O7p7m86m54k78M19j55m13J199L95n06k8L65
1692C13N02p89j15P31o85j91K90K15K64n61J31L76p29J28j06j47k78M3N32k09
1712b85o4Q81J68m52O71o5k39o45j28K32o04k77L17K40K17M3O3O75q89L8K31l16
1734a88j62l9L78K38j04Q53j40l47L43m34q58n74p8K35k73K44J173K37j48L65
1754G21O80n49r89J76Jp31M36j11K73K66J88K00q7o26L75p38q36L19L21M48K70
1775GN15Q96j20j63k0k78r56n77j43L84q05L96P68O7K30K34l8j20r01K61L0j77
1797e10K86N85J17K03K02L91q56m13R6n53p78k05N59K33k47M35Q08k28mL84k75
$$ y = [260, 927, 818, 1077, 1201, 716, 188, -538, -28, -641, -788, -571, 63, 135, -379, 18, 425, 10, -419, -165, -527, -604, -331, 135, 749, 389, 873, 895, 265, 332, 255, -231, -685, -963, -544, -699, -1112, 87, 482, -24, -52, 313, 815, 26, -89, 642, -43, -234, 56, 271, 535, -26, 105, 481, -248, -120, -226, -373, -651, -608, -76, -285, -349, 532, 700, 248, 919, 854, 615, -30, -158, 74, -530, -807, -490, -250, -33, 10, 73, 748, -141, -103, 128, -188, -350, -389, -11, 227, 123, 976, 836, 489, 832, 398, -460, -1034, -1112, -877, -1150, -906, 267, 504, 356, 721, 1401, 852, -137, 39, 40, -691, -255, -366, -93, 173, 361, 561, 474, -152, 223, -515, -1351, -1032, -711, -263, 7, 522, 1418, 1298, 1135, 1115, 837, -119, -696, -839, -455, -1260, -864, -96, -29, 201, 435, 397, 277, -624, -363, -333, -510, -224, 361, 478, 681, 883, 1274, 418, 5, 101, -452, -1230, -1435, -876, -643, -890, -455, 353, 125, 121, 505, 230]
1818B30Qk55L10k4j38L07j39k54K65j95k55l76j71K24k60l39N57N11j35J47N95
1839F13N58p11K27O10n68p25j11N9r1o80M46J10p7L22k94J45j11k0M99m73J1O42
1861C81k73q7O14K99j88m59lM51r92m81k97N06k47m12Q66L22j62N33P4J05o2l66
1883A22J80O4j97J83k08j3J90R3m24r10L75j67l94J21L97J28L25k2R86K02n91
1904D40L87q5k76nn34J79j83l12P75m99l48K35j24k47k54L05K02j91N29P29k75
1925D48K20P2L5m03l92L46m37j74Nq3K97M9l69L7j37OJ97j57L07oM36L64n00P83
1949I44J56o56k8k32m86r9m91O14J8m14L63M71j55j00K54j10l89M1L85J54K7K86
1971E53L15m90Qk74j7o65K69k5p34L61K73K71J68k25O95J92l21k49K79k32k29
$$ y = [230, 238, -17, 293, 269, 131, 438, 299, 45, 310, 115, -140, -516, -687, -463, -723, -1062, -505, 6, -129, 18, 613, 1171, 460, 687, 1297, 729, 4, -107, -48, -139, -819, -373, -263, -340, -18, -312, -167, -278, -298, 201, -272, -261, 381, 108, 21, 635, 934, 746, 287, 284, 735, -257, -738, -1035, -529, -776, -1188, -322, 0, -162, 371, 445, 550, 488, 122, 302, 366, 169, 352, 144, 131, 321, 414, -10, -920, -545, -712, -1106, -985, -588, -460, -135, -157, 829, 1031, 440, 827, 742, 466, 461, -73, 106, -77, -389, 386, -113, -461, -226, -350, -597, -851, -546, -344, -535, -6, 723, 448, 668, 740, 775, 372, -20, 326, -111, -285, -280, -363, -66, -17, -386, -349, -486, -480, -283, -440, -133, -139, 297, 661, 161, 944, 1100, 444, 416, 184, -302, -401, -892, -278, -260, -674, -311, 160, 5, -95, 159, 49, -340, -299, 86, 240, 267, 553, 868, 378, 386, 112, 95, -570, -301, -326, -1060, -699, -426, -155, 13, -212, 483, 675, 354, 105, 384, 152, -77]
1992g7q6L66j60M7L78m30K01l31j28j8k68r5M16m23N39K62M47k38j17N77k74m23
2014A65R9k3l68j39o3K89l78k15P49M0j46j66o4L74l54m4K60j54K28R9J07K3J04
2037D23j1j09l34l1m13l91L24R7M12j23O6Q94J47p08J71j43m02k93P3L11k17K87
2059C0N9P8J42o0j27k49k37k46J38m97O86K46N25J04l1N21q03o45M50r8p64j19
2081h97O24J79r6K64M34J38l44L7n59Q4k48K27p2lQ08j48m2oK04l13n22n08K31
2104e28k05j36M24M62Q7J01mM61m31q3K0l04K9k73L90qj53N27Jl07K25m46k01
2127c52j91J07M61n3q2N33K5j17r2M13j34o83n3L07k02l38J07K42Rj97K47J49
2149A06L6j46O3L1O1R0J6k34L5O02o45j00M76k91k26k78Q1J06m11j56P37m42L55
$$ y = [-77, -163, 203, 43, 90, 468, 38, 239, -92, -220, -238, -506, -601, -185, -608, -69, 193, 640, 402, 285, 862, 588, 165, 264, 241, -127, -266, -329, -40, -418, -633, 116, 156, 10, -156, -220, 154, -200, -244, 16, -138, 90, 189, 296, 319, 423, 412, 303, -31, -62, -475, -866, -542, -445, -33, -156, -90, 804, 951, 243, 414, 271, -131, -424, -351, -40, -257, 30, 89, 167, 309, 249, 122, -127, -364, -610, -472, -969, -283, -37, 488, 592, 561, 1082, 279, -366, 84, -14, -778, -897, -273, -94, -190, 74, 508, 646, 302, 339, -220, -136, -384, -157, -229, -232, 576, 428, 386, 380, 584, 271, -251, -759, -528, -733, -869, -445, 17, 104, 205, 201, 662, 231, 148, 168, -136, -107, -380, 10, 2, -151, 376, 377, 70, 295, -151, -352, -543, -436, 25, -28, -110, 423, 448, 331, 239, 652, 518, -165, -218, 89, -113, -451, -344, -102, -93, -290, -43, 106, 142, -4, 59, 90, 151, 241, 257, 23, 58, 660, 15, -85, 391, 100, -126, -404, -323, -217, -628, -784, -47, -489, -134]
2172a34M18oL67j09Q8j62k66j84k58L47l76J1M50n73K01L48k33l88lK83o8l50
2194e97M14M35Q0p0L26J22q4n63L5nm30j12K93o2q9R2M72o84K27N29o82K5L90
2217F2R5j7j82O43L80o01j68K25o16k17j2rJ56n81N00K35P1p7J21R3o5kL96j95
2241B35p7J71O4J85k85J89j20l83j29k75l83J98K97K47l34L6P43K6p7k97L48j01
2263B78M1l16O26n92J33K33m46k43K6J5n8m46l2N82l12N52L73m4j76K08K39j91
2285D50m79j3J33k25j00q6M30l16k39J83J18m40J19Q3K63l1M32K49l46K22M88
2306H95o90o1j91N04n43l41M62l03j49M8K69J7l68J68L81l63K4M71j45l0k5J14
2328A44M84q18L07N07l85o26L8M58k41o87L52K30k16L74M56j73j81K56J51k52
$$ y = [-134, 284, 278, 645, 536, 624, 462, 196, 12, -246, 101, -275, -264, 186, -387, -186, 162, -71, -459, -462, -179, -247, -597, -183, 252, 332, 262, 588, 710, 626, 63, 98, 93, -337, -449, -156, -218, -307, -215, 257, -427, -200, 329, -353, -328, 62, 157, 140, -42, 601, 981, 380, 212, 437, -179, -396, -408, -417, -261, -842, -342, -107, -36, -113, 8, 101, 36, 34, 430, 235, 158, 329, 393, 578, 293, 482, 362, -21, -150, -425, -808, -610, -313, -66, -400, -364, 379, 405, 328, 31, 379, 278, 319, 3, 629, 37, 170, 403, -43, -286, -260, -245, -303, -749, -781, -199, -511, 41, 414, 370, 194, 402, 641, 450, -29, -42, 91, -134, -234, -320, 110, -206, -445, -262, -144, -584, -465, -382, -119, -150, 282, 531, 185, 407, 895, 205, 144, -47, 457, -86, -427, 35, -268, -417, -369, -100, -83, -451, -283, 98, -265, -241, 230, 85, 55, 30, 144, 628, -190, 117, 624, 239, -387, -349, 109, -132, -819, -467, -237, -453, -79, 377, 204, 23, 279, 430, 178]
2348A78j72N20o37p2l3J74J26n9R0J84n64R9P5l63k67M30K19o7L33N52j52j65
2370D29K0k34K0n19J1O1k29j75M89L8K19j26L60j58j26p2j04j42j57N47o7K09
2392B94k0L64m1o05K55m08k18k29O6M04k03P5N20J88n9J7j36Lm34j04m7l29M78
2415a69J66p9K64k11L62l82k95J97j48j10r8K78L08J44K4N09k33m86J38Jm42l6
2437b98K05K94n20K43L28j30J07j47K70j97k78K58L7m65L48K09J6j84j80L19k62
2458b7j63P1l9p6l02J87M23l56K82M95m18K10Rk92J55k53J66k58l66L51M4m6K54
2481E1r5K03k9k86K91j63l5k09L65j92J6N14K2q3j40L29o38k85k12L56j16l18
2503f54L97J81J09Q3p2L24j08m39N67k70k65L48M0l30L71K07k13n65R9Q9m15l2
$$ y = [178, 6, 526, -111, -183, -216, -42, 84, 25, 115, 299, -265, -166, -91, -454, -721, -291, -72, -139, 194, 746, 594, 429, 449, 215, 235, -284, -273, -212, -441, -616, -127, -89, 130, 4, 364, 206, 80, 8, -96, -238, -395, 152, 85, 294, 274, 638, 597, -8, 247, -161, -379, -608, -542, -138, -341, -266, 254, 442, 383, 400, 264, 267, -167, -271, -318, -647, -169, -3, -82, 182, -29, 333, -49, -344, -147, -295, -405, -503, -225, 83, 227, 251, 760, 527, 41, 179, 180, -262, -298, -93, 201, -319, -76, 252, 122, 229, 82, 352, 155, -123, 135, 172, -293, 55, 264, 280, 96, -84, 235, -27, -190, -119, -158, -234, -536, -349, 74, -282, 0, 495, 77, 287, 296, 4, 159, -94, 72, -186, -552, -201, -157, -203, 51, -44, 159, 130, -156, 135, -28, -63, -272, 93, -99, -83, 431, 453, 370, 230, 559, -79, -364, -576, -220, -336, -654, -257, -76, 33, 116, 44, 368, 260, -179, 388, 118, -147, 201, 241, -89, 282, 489, 276, -289, -190, -101, -516, -548]
2525e48J63j85N42m67O54K72j80Lj58K51m50J98J19j36k01J36J35j36r9J01k21
2546b07l82J64K86n0l0M55k59K90K03j35%l15K02K2l76M2J21m1Lj82J41o64M9
2569f63N13J29k13K75M1J90l36L48L79n65J07j12J20j88o30N54k81J21J58k80
2589c33O8j13L46p8kj49O76j8o6J7K24n9l02J83p0o92J15j8r3J9j50L38J89l27
2613b95L90K87n04Q7J03M32k63k87M05l3l08J12l5j72j15n2L23p41J05L04N9j74
2635c72K76M74k59nJ56J7l9M4P3P2l83k26O4p7k91J62K48j55k46K70K41m92K86
2658a62K32l00K66L39o1Ko6J97J32o13Oj34j34j45J15j1r3K97J82k0K12q8J06
2681B59j30j81R4J92m84M77r9R3p9k3n5j66j29J02k05j21J18K08M74k18K98K30
$$ y = [-548, -385, -570, -28, -495, 159, 431, 251, 254, 96, 347, -103, 95, 214, 78, -123, 13, 148, 12, -87, 14, -207, -589, -425, -139, -189, -219, 236, -23, 267, 470, 335, 335, 20, 222, 244, -132, -90, 31, -10, -7, -189, -48, -712, -663, -150, -21, -234, 41, 82, 272, -64, 284, 663, 98, 205, 93, 213, 25, -605, -51, -332, -211, -53, -333, -265, -378, -32, -110, -112, -261, 415, 397, 331, 348, 572, 513, 211, 394, 324, -368, -253, -271, -364, -345, -495, -157, 32, -295, 95, 382, -122, -35, 68, 500, 237, -50, 355, 322, 14, 126, 91, -81, -196, -248, 75, -666, -561, -257, -198, -372, -96, 378, 119, 114, 270, 287, 248, 292, 365, 437, 54, -172, -108, -185, -476, -314, -66, -221, -467, -197, 44, -448, -162, 70, -230, 36, 375, 314, 316, 250, 447, 579, -34, -28, -162, -296, -441, -326, -337, -430, -133, 49, 29, 241, 153, 259, 129, -52, 42, 234, -250, 227, 128, 221, 142, 119, 64, -102, -231, -129, -334, -455, -337, -129, 345, 127, 425, 655]
2703F55k34k65K88l40k16k29K52M0j51J86R1l1lo8L5k39k36L01J19l4L85K29p6
2726D59K1k70J64j83m80M66m72m6q9K12n4N2L09Q0l05PJ18Q2l48j52N64j43J01
2749I3P6J46j26n9j1j86k25R3R3j70M4J97j63K0K89J8J91n38N44p8j0k73o6K33
2773A32R6p38M88R7l68L45j25K4q6m9J96rj39J12J74O3r7N8k43J32R6k62q9OK23
2798C7N5r9l08N39K27k78O5k60m2J06j12j5L3k30M17J11r3k17P3n7j11j25J90
2821i4k90K53K08r6L10j08K75k4n49K20Q3m63J03q0K10k47M96J54l86j42K59n0
2843D2r7l7%P9n3L10j1l8Q0k14K78k85k48O6N0m61K83K33k88K83N0L16k64j06
2867c2J58L6l11K18L2L15m19K09J39n09J1K75m44Q4J18r4J94l82N18L3j21k68
$$ y = [655, 421, 156, 444, 104, -112, -341, -89, -49, -200, -14, 77, 46, 43, -25, 10, -229, -465, -164, -45, -79, 306, 535, 459, 480, 210, 374, 191, -289, 177, -295, -341, -430, -218, -272, -220, 89, 169, -136, -129, -11, 71, -277, -429, 135, -8, 93, 169, 315, 189, 130, 119, -67, -292, -199, -106, -276, -232, -35, -198, -178, 111, 129, 320, -218, 326, 248, 238, -35, -101, 132, 228, -510, -22, 75, -293, 52, -73, -49, -135, -184, 12, 3, -136, -24, 150, 213, 116, 174, -69, 63, 159, -103, -192, -186, 37, 92, -7, -315, 224, 451, 173, 238, -22, -64, 42, -70, -85, -52, -282, 135, 246, 153, -64, 9, -48, -159, -284, -94, -384, -131, 77, -19, 291, 183, 458, 434, -115, 105, 188, -275, -172, -252, -42, -289, 207, 361, -25, -167, 92, 42, -55, -92, -92, -13, -66, 244, 233, 195, 275, 61, 339, 54, -194, -128, -78, -539, -256, -23, -311, -28, 22, 338, 74, -32, 126, 162, -149, 69, 101, 416, -3, 206, 345, -164, -153, 122, -322, -238, -120, -214, -20, -402, 116, 149, 28, -240]
2889b40L63P7j19p0K84k43M3j56n7P2m1k64L87k78N6K47j65Q8j15M49L2j75J76
2912C51j00j53j03K1L79k47kJ74m41Q1K01k0k00l17K56P5k18L39Q5l2K83k02k33
2935b3J29q3K72m01o5Q6P4l06J73j14K10j74n6K93j99J38J93L0J6oO3K93o78K19
2959H4rJ01k23m04N69l20l58M05j16M1K49Q8J13l6j0J80l44J61j4r3n7j46J40
2982An7k4J08J38m44r%k26J80N9J12R7k68O27J64k14J55j91K88p07j49K35k45
3005c70J21p4J60n7q3K28M8M6j00k8L4r4J33K32o4mL46j02l37K6M5j2o82K40j24
3030d72L8J89N61l09N5P4O9Pl72M4J24l4M2J29K42j78j48O3o3k40j16O2k45J23
3054c55P6J76j01K16L32j14j76J4j51L39m13K9K00l24K01k4K49l50J34J1j3J4
$$ y = [-240, 123, 200, 81, 11, 295, 52, 95, -61, -118, -46, -87, -351, 36, -242, -186, 61, -104, -16, -131, 318, 350, 175, 351, 251, 98, -5, 16, 395, 148, 146, 320, -121, -40, 161, 141, -59, -376, -120, -45, -263, 76, 161, 129, 412, 210, -23, 106, 23, 295, -106, -171, -85, -11, -317, -144, -258, -48, -222, -278, 15, -184, -46, 147, 177, 193, 187, 250, 543, -135, 84, 75, 176, -47, -451, 118, -202, -560, -155, -271, -230, 19, 107, 220, 184, 174, 354, 10, 171, 157, 64, 7, -139, 1, -56, -80, 28, 166, -278, -287, -287, -513, -333, -274, -162, -65, -333, 294, 458, 244, 399, 208, 496, -211, -360, -125, -370, -249, -323, -163, -220, -303, -75, -27, 19, -81, -109, -75, -169, -36, 196, 132, 128, 474, 372, 35, 61, 106, 94, -588, -348, -472, -434, -245, 316, 7, 62, 136, 205, 212, -160, -116, 8, -26, 16, 145, 387, 209, 61, 124, 61, -179, -295, -233, -478, -355, -279, -103, -204, 12, 344, 230, 54, 68, -83, 256, -157, -128, 72, -252, -51, -75, 174, -176, -42, -31, -44, -30]
3076c0l1n7J23k98M60O3k33J82L89l98r9J01k11O2j37J41l3l71m4M23L1j12L80
3099C01k12k9pj25L33m40k20N51J14j39k13K04j74l3L45l36k48O3o2L38j96j15
3121c00N91k73K87p7l4j31r8J70j62k33K26L8J20p4q7K35j95j95J7J07j15J60
3143b3N6L02j87P4J63m28R0J51R4o02j45M32j83K6K98j13m2J39q6J76l23J49O8
3166H6j59p0L10k38NJ51Q1N8l22j7L91m42R6R3N5j25K09jL9k13J29M5r5k41J21
3191e4L76l27k76J55K01j16L2o3J78j87J18J23j9n5K63j48J32k83l1m5j17J66
3213B3r0n9k25O5J93Q1k24N20l73m4M80k35Jk31J84O1k74Q3Q2J64j25j32o2N5
3237h2j01K02r3o1J24Q1J33j58L1p1J75j52K55P3m79P8L12n8l24K3J3j22K6O5
$$ y = [-30, -61, -118, 5, -293, 167, 230, -3, 179, 568, 170, 71, 172, -39, 23, -114, 27, -6, -377, -421, 2, 33, -79, 301, 89, 60, 53, -72, 261, -179, -399, 152, 266, 127, -86, 118, -56, -89, 256, -80, -328, -265, -327, 11, -185, -300, 291, 18, 305, 228, 194, 63, -35, 135, -27, -260, -34, 4, 124, 50, -37, 198, 3, -192, -175, -68, -183, -23, 33, 335, 148, 222, 385, -43, 47, 198, 292, -310, -455, -23, -206, -180, 118, 5, -37, 102, 16, 192, -131, 18, 86, -73, -143, 167, -71, -66, 85, 166, 224, -98, -115, 276, -166, -70, 23, 78, -47, 162, 161, 200, -13, 116, 161, 66, -175, -54, 322, -5, -281, -126, 75, -41, -9, -72, 106, -81, 37, 160, 141, 86, 349, 201, 333, 50, 19, -26, -143, 23, -67, -126, -351, -286, -93, -12, -236, 284, -89, -133, 347, 112, 113, -118, 66, 127, -147, -64, 18, 182, 57, -75, -137, -82, -183, 19, -74, -135, -11, 70, 203, 45, 76, 5, 180, 28, 283, 356, -123, -45, 267, 209, -115, -92, -79, -201, -175, -110]
3261a10K2q5L0J70J03n8P2J21l6p2o2J88j86k77N24m85M5r3k68K25JJ61L25m39
3285a84K57Q8j35K63k97J55P4j30P7j7j91Qqj2k95r1L02j51j43O77j93K69m85
3308a62M89R1n98J30K91l10p4J04j1K79k35O2m02k38J30L54l37K55k1M70j33P7
3330B11K36k56J59j30k53N1l48M19q3k8q3R0q1K63n16J53k6M9J34K18j81o3J12
3353D7N45m29J07J87k17k90J3j37J03j71m9J32k67N70j5j13p5K29M5k72M7K32
3375B22j19J99j55K25l13K04k82O0l34M1K05o5kq5J86J72r4J23L6l90Q1K35r2
3398E8j90j82N82l0j23o0k57L28j71j98J84j35J35j26J35p3k1N21m69L77l5J93
3420D43k10j51K4j30j84j98L48j22j99K99N42m86k30K14j43J52k16M36k34K19
$$ y = [-110, -88, -173, -143, 27, 130, 72, 144, 265, 229, 157, 95, 283, 97, -180, 344, -141, -96, -189, -457, -232, -231, -70, 255, -184, 73, 161, 26, 289, -8, 147, 221, 91, 168, 151, -40, -32, -40, -52, -347, -438, -136, -287, -430, 247, 54, 323, -162, 327, 418, -180, -50, 241, -69, -143, -39, -50, 229, -6, 56, -346, -584, -454, -100, -437, -182, -203, 267, 134, 211, 447, 191, 350, 220, -33, 18, -330, 89, 6, -22, -105, -15, -96, 167, -349, -196, -222, -173, -39, 179, -2, -65, 47, 592, 163, 270, 457, 240, -50, -37, -174, -71, -242, -291, -159, -426, 144, 129, 16, -59, 170, 215, -57, -10, 222, 103, 302, 147, 372, 59, 263, -19, 41, -293, -252, -47, -112, -114, -199, -13, 159, 65, 188, 224, -166, -85, 150, 58, -132, -314, 268, 238, 115, 55, -202, 126, -45, -243, -59, -194, -59, -185, -50, -123, -144, 377, -92, 285, 250, 443, 233, 82, 106, -24, -208, -406, -58, -180, -379, -80, 462, -24, -254, -40, -183, -31, -247, 189, -45, 174]
3440A74K16l02K0J57j40r6j19j87J72j45l50M30Q7P1J69m9J31k32K18l16J7J1
3462f3L4J15r2L4K53j41l14%K43j77k92Q7L0Q5K32J04j15Q6m8L8Q2k81L23j53
3486G0q2R8l77L66j70K45l0lk25N59k50j44j72L1K82j45l1K63k9m60K66P1k5j74
$$ y = [174, 390, 88, 108, 265, 125, 29, -90, -277, -105, -250, -600, -170, -83, -12, 157, 108, 239, 7, 225, -91, -74, -63, -29, 86, -6, 28, 281, 140, -174, -174, 69, -108, -400, -313, -283, -198, 34, 138, 23, 109, 61, 99, 181, -100, 223, 70, -12, 86, -291, 75, -95, 150, 120, 117, -108, 451, 201, 57, -115, -84, 198, 53, 22, 285, 256, -204, 62, 133, 108, -66]
$$ [...]
8191A86
##END NTUPLES=NMR FID
##END=
