##TITLE=1H_Ser DHA-N-Me
 CDCl3
 8 sc, 
 12.2.2024
##JCAMPDX= 6.0         $$ Bruker NMR JCAMP-DX V2.0
##DATA TYPE= NMR FID
##DATA CLASS= NTUPLES
##ORIGIN= UXNMR, Bruker Analytische Messtechnik GmbH
##OWNER= root
$$ XWIN-NMR		Version 3.5
$$ Mon Feb 12 15:42:26 2024 Russian Standard Time (UT+4h)  she@DPX200
##.OBSERVE FREQUENCY= 200.1313
##.OBSERVE NUCLEUS= ^1H
##.DELAY= (6, 6)
##.ACQUISITION MODE= SIMULTANEOUS
##.ACQUISITION SCHEME= undefined
##.AVERAGES= 8
##.DIGITISER RES= 18
##SPECTROMETER/DATA SYSTEM= spect
##.PULSE SEQUENCE= zg30
##.SOLVENT NAME= CDCl3
##.SHIFT REFERENCE= (INTERNAL, CDCl3, 0, 15.7039)
##AUDIT TRAIL= $$ (NUMBER, WHEN, WHO, WHERE, WHAT)
$$ ##TITLE= Audit trail, XWIN-NMR		Version 3.5
$$ ##JCAMPDX= 5.01
$$ ##ORIGIN= Bruker BioSpin GmbH
$$ ##OWNER= she
$$ F:/spectra/data/she/nmr/H-F/1/audita.txt
$$ ##AUDIT TRAIL=  $$ (NUMBER, WHEN, WHO, WHERE, WHAT)
(   1,<2024-02-12 15:41:14.26 +0400>,<she>,<DPX200>,
      <created by zg, POWCHK disabled, PULCHK disabled
       configuration hash MD5:
       00 E9 B6 7A A2 85 ED C7 34 08 36 98 17 FE 4E 26
       data hash MD5: 16K
       1C 05 FB 1B 9C 94 6D 4E BC 60 B7 99 7F 52 0B 25>)
$$ ##END=
$$ 
$$ hash MD5
$$ 78 20 9B 92 21 D1 0E 68 2C F8 25 40 B0 CD E5 14
##$RELAX= 
##$RELAX= 
##$RELAX= 
##$RELAX= 
##$RELAX= 
##$RELAX= 
$$ Bruker specific parameters
$$ --------------------------
##$DU= <F:/spectra>
##$EXPNO= 1
##$NAME= <H-F>
##$PROCNO= 1
##$TYPE= <nmr>
##$USER= <she>
##$AMP= (0..31)
100 100 100 100 100 100 100 100 100 100 100 100 100 100 100 100 100 100 
100 100 100 100 100 100 100 100 100 100 100 100 100 100 
##$AQSEQ= 0
##$AQ_mod= 1
##$AUNM= <au_zg>
##$AUTOPOS= <>
##$BF1= 200.13
##$BF2= 200.13
##$BF3= 200.13
##$BF4= 200.13
##$BF5= 200.13
##$BF6= 200.13
##$BF7= 200.13
##$BF8= 200.13
##$BYTORDA= 1
##$CFDGTYP= 0
##$CFRGTYP= 5
##$CHEMSTR= <none>
##$CNST= (0..31)
1 1 145 1 1 1 1 1 1 1 1 1 1 1 1 1 1 1 1 1 1 1 1 1 1 1 1 1 1 1 1 1 
##$CPDPRG= <>
##$CPDPRG1= <>
##$CPDPRG2= <>
##$CPDPRG3= <>
##$CPDPRG4= <mlev>
##$CPDPRG5= <mlev>
##$CPDPRG6= <mlev>
##$CPDPRG7= <mlev>
##$CPDPRG8= <mlev>
##$CPDPRGB= <>
##$CPDPRGT= <>
##$D= (0..31)
0 1.2 0 0 0 0 0 0 0 0.06 0 0.03 0 0 0 0 0.0002 0 0 0 0 0 0 0 0 0 0 0 0 
0 0 0 
##$DATE= 1707738073
##$DBL= (0..7)
120 120 120 120 120 120 120 120 
##$DBP= (0..7)
150 150 150 150 150 150 150 150 
##$DBP07= 0
##$DBPNAM0= <>
##$DBPNAM1= <>
##$DBPNAM2= <>
##$DBPNAM3= <>
##$DBPNAM4= <>
##$DBPNAM5= <>
##$DBPNAM6= <>
##$DBPNAM7= <>
##$DBPOAL= (0..7)
0.5 0.5 0.5 0.5 0.5 0.5 0.5 0.5 
##$DBPOFFS= (0..7)
0 0 0 0 0 0 0 0 
##$DE= 6
##$DECBNUC= <off>
##$DECIM= 32
##$DECNUC= <off>
##$DECSTAT= 4
##$DIGMOD= 1
##$DIGTYP= 9
##$DL= (0..7)
0 120 120 120 120 120 120 120 
##$DP= (0..7)
150 150 150 150 150 150 150 150 
##$DP07= 0
##$DPNAME0= <>
##$DPNAME1= <>
##$DPNAME2= <>
##$DPNAME3= <>
##$DPNAME4= <>
##$DPNAME5= <>
##$DPNAME6= <>
##$DPNAME7= <>
##$DPOAL= (0..7)
0.5 0.5 0.5 0.5 0.5 0.5 0.5 0.5 
##$DPOFFS= (0..7)
0 0 0 0 0 0 0 0 
##$DQDMODE= 0
##$DR= 18
##$DS= 0
##$DSLIST= <SSSSSSSSSSSSSSS>
$$ [...]
##$SUBNAM2= <"">
##$SUBNAM3= <"">
##$SUBNAM4= <"">
##$SUBNAM5= <"">
##$SUBNAM6= <"">
##$SUBNAM7= <"">
##$SUBNAM8= <"">
##$SUBNAM9= <"">
##$SW= 18.0517328524113
##$SWIBOX= (0..15)
0 0 2 0 0 0 0 0 0 0 0 0 0 0 0 0 
##$SW_h= 3612.71676300578
##$TD= 16384
##$TD0= 1
##$TE= 0
##$TE2= 300
##$TE3= 300
##$TEG= 300
##$TL= (0..7)
0 120 120 120 120 120 120 120 
##$TP= (0..7)
150 150 150 150 150 150 150 150 
##$TP07= 0
##$TPNAME0= <>
##$TPNAME1= <>
##$TPNAME2= <>
##$TPNAME3= <>
##$TPNAME4= <>
##$TPNAME5= <>
##$TPNAME6= <>
##$TPNAME7= <>
##$TPOAL= (0..7)
0.5 0.5 0.5 0.5 0.5 0.5 0.5 0.5 
##$TPOFFS= (0..7)
0 0 0 0 0 0 0 0 
##$TUNHIN= 0
##$TUNHOUT= 0
##$TUNXOUT= 0
##$USERA1= <user>
##$USERA2= <user>
##$USERA3= <user>
##$USERA4= <user>
##$USERA5= <user>
##$V9= 5
##$VALIST= <valist>
##$VCLIST= <CCCCCCCCCCCCCCC>
##$VD= 0
##$VDLIST= <DDDDDDDDDDDDDDD>
##$VPLIST= <PPPPPPPPPPPPPPP>
##$VTLIST= <TTTTTTTTTTTTTTT>
##$WBST= 1024
##$WBSW= 4
##$XGAIN= (0..3)
0 0 0 0 
##$XL= 0
##$YL= 0
##$YMAX_a= 119020
##$YMIN_a= -164227
##$ZGOPTNS= <>
##$ZL1= 120
##$ZL2= 120
##$ZL3= 120
##$ZL4= 120
##$ABSF1= 10
##$ABSF2= 0
##$ABSG= 5
##$ABSL= 3
##$ALPHA= 0
##$AQORDER= 0
##$ASSFAC= 0
##$ASSFACI= 0
##$ASSFACX= 0
##$ASSWID= 0
##$AUNMP= <proc_1d>
##$AZFE= 0.1
##$AZFW= 0.1
##$BCFW= 1
##$BC_mod= 2
##$BYTORDP= 1
##$COROFFS= 0
##$CY= 11.3945322036743
##$DATMOD= 1
##$DC= 2
##$DFILT= <>
##$DTYPP= 0
##$F1P= 15.7292609196834
##$F2P= 12.9074282941183
##$FCOR= 0.5
##$FTSIZE= 0
##$FT_mod= 4
##$GAMMA= 1
##$GB= 0.15
##$INTBC= 1
##$INTSCL= 1
##$ISEN= 128
##$LB= 0.24
##$LEV0= 0
##$LPBIN= 0
##$MAXI= 10000
##$MC2= 0
##$MEAN= 0
##$ME_mod= 0
##$MI= 1.114404
##$NCOEF= 0
##$NC_proc= 0
##$NLEV= 6
##$NOISF1= 3.799351
##$NOISF2= 2.8
##$NSP= 1
##$NTH_PI= 0
##$NZP= 0
##$OFFSET= 15.70392
##$PC= 1
##$PHC0= -24942.41
##$PHC1= 4.252696
##$PH_mod= 1
##$PKNL= yes
##$PPARMOD= 0
##$PSCAL= 0
##$PSIGN= 0
##$REVERSE= no
##$SF= 200.130013532006
##$SI= 16384
##$SIGF1= 3
##$SIGF2= 2
##$SINO= 400
##$SIOLD= 16384
##$SREGLST= <1H.CDCl3>
##$SSB= 0
##$STSI= 0
##$STSR= 0
##$SW_p= 3612.71676300578
##$SYMM= 0
##$S_DEV= 0
##$TDeff= 0
##$TDoff= 0
##$TI= <>
##$TILT= no
##$TM1= 0
##$TM2= 0
##$TOPLEV= 0
##$USERP1= <user>
##$USERP2= <user>
##$USERP3= <user>
##$USERP4= <user>
##$USERP5= <user>
##$WDW= 1
##$XDIM= 8192
##$YMAX_p= 0
##$YMIN_p= 0
$$ End of Bruker specific parameters
$$ ---------------------------------
##NTUPLES= NMR FID
##VAR_NAME=  TIME,          FID/REAL,        FID/IMAG
##SYMBOL=    X,             R,               I
##VAR_TYPE=  INDEPENDENT,   DEPENDENT,       DEPENDENT
##VAR_FORM=  AFFN,          ASDF,            ASDF
##VAR_DIM=   8192,          8192,            8192
##UNITS=     SECONDS,       ARBITRARY UNITS, ARBITRARY UNITS
##FACTOR=    0.0002768,     1,               1
##FIRST=     0,             0,               0
##LAST=      2.2672688,     0,               0
##MIN=       0,             -164227,         0
##MAX=       2.2672688,     119020,          0
$$ Real data points
##PAGE= N=1
##DATA TABLE= (X++(R..R)), XYDATA
0@%%%%%%%%%%%%%%%%%%%%%lQj3J6j6J6j6J6k0K8l2L2l6M3m7N2n9O6p4Q2r3J02
43E2j10J22j36J51j66J82j98K18k44K68k95L29l64M04m54N10n75O57p59Q90j061
64e79J303j675K299l529O872l3005j26510r403Q4157J06875L6754n4585n7663
77d8689J0704P3782Q3223k542q7711q8971l2680M5885P2068Q528m9178n2441m647
90g2669O8107P7010J5152m0796o4413k5931L6077L7540k632m3256n6572j980N8221
103a6142O2204K7359k9131n3363j3902K3276L1914O765m6443n4829j3072K6185
115d9179N2831L6516r591k0390o857J2727K7890N82l1277l3732k5056M519K3802
128a7215O532j751j171M615K7618K3671r10j5424k7201j7059N358J532l447n166
$$ y = [0, 0, 0, 0, 0, 0, 0, 0, 0, 0, 0, 0, 0, 0, 0, 0, 0, 0, 0, 0, 0, 0, -3, 5, -8, 8, -8, 8, -8, 8, -12, 16, -16, 16, -20, 23, -24, 28, -31, 35, -39, 43, -50, 52, -58, 64, -72, 79, -87, 95, -103, 115, -129, 139, -156, 173, -191, 213, -241, 269, -306, 351, -408, 482, -579, 724, -951, 1348, -2181, 4691, -28314, -154824, -164227, -80070, 26805, 63559, 8974, -48689, -37985, 35797, 119020, 116478, 28767, -60204, -92884, -46999, 25069, 33597, -15581, -68022, -72669, -4562, 72448, 87600, 46804, -17609, -43540, -7463, 30077, 27445, -15811, -72383, -74363, -16142, 46062, 73421, 44290, -9073, -22975, 301, 32215, 38980, -7463, -62292, -75364, -49179, 3652, 40168, 30577, 10187, 3330, 16057, 43947, 44529, 13252, -20480, -45536, -41017, -17215, -10683, -12434, -13605, -8990, 18628, 42299, 41389, 25965, -1236, -18295, -12937, -11405, -14852, -20018]
142b0018q387J2746K7372J7120P391j1004j9107l898k421m048o818j8135p684
155c6891J3023J5943K0144J0903m995J396M014j051m293k2858k5310p425L950
168c3450J8873J9421J108L43L996N871J3374j38j8062j9194j7892l533J0919N138
182a3226L817M891K391J4238J2056j128m513j0870r572J568m690r226o059n763
196b6086J0261J9974R812L694n496r300N114O029k691r817k1687j2870P377J4318
210a1368J7290R165n383Q11O691N135J966j5051k3063j1573k220Q441R941k140
224a1358K18R598J4697J9421M298j7403j8312j3449o15J0444k158j1880r263J75
238b5587K1246K7371R334n569j8307j5744L462N749k761j0006j7092l035J8388
$$ y = [-20018, -28405, -15659, 11713, 28833, 36224, 25220, 6113, 2215, -206, -4254, -11072, -29207, -36891, -23868, -7925, 12219, 23122, 18127, 19523, 23537, 22486, 18193, -4665, -29975, -37400, -33450, -14577, 4844, 5952, 6295, 10291, 16162, 29536, 29398, 11336, -7858, -25750, -29283, -18364, -13226, -9409, -4518, -2127, 12111, 24167, 23039, 18526, 7656, -1916, -348, -5038, -14264, -20323, -26086, -15825, 4149, 13961, 17655, 12159, 2859, 7973, 14002, 11311, 1494, -20193, -33063, -25686, -11368, 5922, 15087, 9704, 10515, 17206, 22341, 24307, 9256, -13807, -25380, -27600, -19159, -9218, -11358, -11140, -1542, 13155, 32576, 36874, 19471, 1159, -12290, -12905, -2461, -4619, -16499, -25762, -25587, -4341, 23030, 32364, 26795, 8488, -7256, -3794, 1955, -806, -10812, -27904, -30939, -12551]
251a2551K0706J6362L41j3485m551K762K171j951j8264j9887k582R618J9347J4077
265A2113m321o050N58P515J4471M72j8055j8176j3466K379J5662O235j508l793
279e964j789J3069J6222L261n694j6119j4015Q24K979L73k356p963J780J3025
293b367J1519R029k186j0362j912K245J007j671j4210j3467K87Q301J6332J2813
307A5358k980m324k472P17O636l731j4203j1958r130M469J4913Q888N488K402
321A0073j87O102L473o310q797j3076p955M323K264O64P07j743Q440J4305O937
336A9220P65r837j3882k365J617J851K04r084m512P132J1051J3124M348q607p672
351C353m641j283L299n175q984k418K315J0252J1393R90j376n44j99N160j309
$$ y = [-12551, 8155, 24517, 24858, 11373, 6822, 9584, 11755, 9804, -8460, -28347, -30929, -21311, -1964, 12113, 7792, 1742, 2300, 9815, 24286, 24758, 6703, -11473, -24939, -22560, -6898, -663, -2171, -5964, -7753, 5316, 21538, 24799, 19105, 2986, -11029, -10205, -7226, -6853, -9209, -17172, -15392, -2367, 9152, 18181, 15995, 5633, 3721, 5966, 6973, 5302, -8908, -22375, -22088, -13787, 2545, 15358, 12378, 8054, 5582, 6299, 12935, 9204, -4999, -16957, -26087, -21618, -6705, 2183, 7671, 10073, 9886, 15988, 19461, 13151, 4354, -8722, -16677, -12354, -10090, -9426, -8719, -10462, -2022, 12283, 19220, 19985, 10148, -3734, -6099, -4482, -2631, -2427, -11511, -16023, -8891, 2160, 15284, 19632, 11025, 3353, -1288, -2571, 728, -4447, -13431, -15849, -13534, -3282, 8111, 9101, 7725, 7181, 6982, 12142, 10833]
366A0833j0828r998p348J854J1806M471m64j758j954R066J0827J018n447j2722
380f44j1222L78K436J454R47l467L873J1162P551M593l427q509k403n95l072l706
396d651j0138n300O890J0019J0962M425o071k140K854L154J532r729j5570o712
410b0475J507J1560J3264J773j753k6J901P393L19j1609j1987r112L28R791L393
425c733j864j570J972J2384J3606N66q336j4265r238N775O382n33o691j1529j229
440a8303J3759J4193Q489l966j3548m981L992N403K345j0143j3066j945P109J4056
454C394R422m423o315j459M442Q464j257j3073j2507n557O028J2894L288m945
468a604m546M49J3703J3559n84j1659j7023j0392O119R484L877l285q875P49J2806
$$ y = [10833, 5, -9993, -17341, -15487, -3681, 790, 326, -1432, -3386, 5680, 16507, 17525, 12078, -644, -11866, -11488, -9052, -7598, -6651, -10118, -6245, 4917, 12468, 17061, 13634, 5125, 2722, 2127, -945, -4651, -14789, -20089, -13199, -3180, 7782, 12207, 6136, 3996, 6850, 10004, 11536, 1807, -13763, -20475, -18968, -7408, 5856, 7629, 5876, 5850, 7751, 15144, 15463, 3854, -8133, -17245, -16917, -7126, -3733, -5597, -7167, -5195, 7189, 20795, 21361, 13025, -1240, -10478, -4703, 1679, 1146, -5545, -17074, -18303, -4544, 9649, 18138, 14172, 624, -4357, -365, 5038, 7383, -2760, -15826, -17771, -10662, 3394, 12816, 8393, 2078, 619, 5061, 13525, 12268, -805, -13312, -18869, -12841, 53, 3341, -1604, -6150, -5701, 8002, 21561, 20977, 9318, -7705, -18097, -11978, -2494, 1383, -1902, -10777, -10028, 2778]
483B778J1688O405o825j4630n740J400M046J010r286r033L273J0533J4880P540
497A8039p096p755l120L014O684l914j3687j0363j870J1651J6893M911m849p959
511E79m805O954P941k770r165j2627m728R423J0234N272j290o407J240Q418N272
526A3541p07r449j2307j438M092M095N81p331l469P252J0667J0148Qj1269p666
541c252r39M407N655l972j1056m924K585J1327J1702L0o054n607j609O051K073
556F417o702p764o465K310J0661N429L63k601j922O645P729q28p981j2932q595
571a6236M809P928M470o85o322L19J0252Q665M363p078j3937o665J208M865M575
586E31m331o432J570P093J1388O554n003p547m888j135L978j214q027n294o17
$$ y = [2778, 14466, 20871, 14046, -584, -6324, -4924, -878, 132, -9154, -18187, -14914, -4381, 10499, 18039, 10943, 3188, 68, 3082, 9766, 5852, -7835, -18198, -20068, -8417, 8476, 13387, 8538, 579, -4226, 2728, 10669, 7899, -1266, -13893, -18621, -9198, 1036, 6308, 5018, -1389, -149, 8269, 13541, 12834, 3385, -8922, -10360, -6268, -2173, -1592, -8923, -12392, -5140, 5527, 15675, 15683, 4414, -3252, -4191, 216, 5871, 1899, -9157, -14081, -11496, -169, 11533, 11563, 5509, -98, -1707, 4344, 6417, -285, -8049, -14514, -12204, -1543, 3886, 4249, 1648, -274, 6371, 14100, 13272, 5291, -7641, -16236, -11427, -3499, 971, 286, -6036, -5717, 4535, 13200, 17563, 10485, -3452, -10117, -8909, -4044, 531, -3800, -10232, -8662, -1569, 9819, 16373, 11370, 3823, -1065, -2200, 1778, 564, -7463, -12757, -13374]
601a3374P489J2448L338k715n347m356M335N820j530n501r241m541N801P187M949
616D762N33m839p42M914K760Q72n144r635k481J132K897L441k457j307M362O132
632E200O720J503p264n976k600K18K967k719p223l223J128R158J1094K466k702
647H747n762m739K192L021k687m459o271j235P151O779L901Q18m615L05K921m79
663E588k668p335p374J619M959N083K968m231j568N037N913N335l015j0662q033
678h384k111M175P339o6m467j726J583Q391Q476j665p225p924m797M065L871n64
694a029k520l860J988P329M835J164l260n499J263L745R2k645p236n376L602O224
710a183N401J447n273k532K645L601L339l013q933m223N79M388O241j61k224M97
$$ y = [-13374, -5885, 6563, 9901, 7186, 1839, -2517, 1818, 7638, 6108, 607, -8634, -13175, -7374, -187, 4762, 5295, 456, -286, 4628, 7388, 8260, 3116, -6519, -9000, -7868, -4971, -1530, -3987, -5294, -932, 5200, 11920, 13423, 6159, 183, -2417, -2199, 768, -1951, -9174, -12397, -11269, -2111, 8983, 11449, 8747, 2985, -1754, 438, 3459, 772, -3687, -9958, -11193, -4042, 2737, 6638, 7456, 2841, 3146, 6067, 5588, 2920, -4415, -11789, -10170, -5211, -128, 2840, -1391, -2959, 2078, 7991, 13326, 10311, -351, -8384, -10495, -6320, 1019, 953, -3514, -5240, -3657, 4734, 13210, 11545, 4320, -3604, -8401, -4336, -465, -1029, -3549, -7409, -5421, 1908, 6743, 7907, 4647, -852, 411, 4156, 4248, 1603, -5633, -11009, -7407, -1183, 4218, 5665, 392, -2140, 505, 4106, 7445, 4432, -4501, -8724, -8145, -3757, 2484, 2323, 99, 596]
726E96J433N135K305m749n814m021j464L891J26l322q49Q68O104Q540J750k721
742G808m839m794J331J456k051l225m173o00P249O131L281j63m969k128R99p15
758E98o80l967m283K086L852L486K349k145p55L269K282J915l093p760m525qK715
775d664N150m41l177p5K111O081N209k326n163n942l647K802K811l56l94k120
791d141J437N003K881J103j252l529l4K77k394k133l713k025M264L123K858J583
807C308k470L92L288J547j19m206o994k166J161L353M154j79j320J933J261K582
823E525Q68m779m007k534n45K384j77j215J596K714M731M653k123l590l203k120
839a822K634K87m193l746k690K646Q714M445L45l114m736R48L728K02k291n869
$$ y = [596, 2029, 7164, 9469, 4720, -1094, -5115, -6579, -2688, -2562, -5884, -6733, -5865, 239, 8779, 10529, 7808, 2969, -1825, -494, 962, -1089, -4314, -8487, -9087, -1838, 4293, 7574, 7411, 2442, 314, 1313, 598, -82, -4049, -8332, -6246, -2394, 1092, 3441, 1296, 541, 3810, 6092, 8007, 4914, -2846, -7371, -7379, -4664, 486, 45, -3132, -3207, -1096, 4985, 10194, 7868, 2705, -3237, -6884, -4082, -1271, -1627, -2021, -4141, -2704, 2299, 5180, 6283, 5031, 1502, 1468, 1745, -649, -2782, -6495, -8520, -4256, -1133, 1725, 3308, 838, 1230, 4518, 6065, 5946, 1740, -5254, -7420, -6259, -2906, 1248, 1069, -251, 1682, 2943, 5525, 6393, 1614, -2393, -4927, -5472, -3088, -3265, -4480, -2884, -170, 4561, 9214, 7091, 3501, 298, -1822, 812, 1099, -3094, -6840, -9530, -6884, 1830, 6275, 6620, 3506, -1230, -282, 3446, 3648, 1357, -4512]
855d512m304L414N443M132O70m592k329L534L545J669l866q229l052K650N152
870f75M640k912n570j97L260Q088M985n434p160n151J44O184L267l320m324l088
886g263L034Q576L734j172m986m900J089L475n65k421n128k031N520N750K824
901E536r90m977o76M438K931R0n664q693j624L484O083M393k173m199M68K874
917A301M933J505o362n673k838J240N500K063j747j029K72L972M611j399m414
932A935m580k853L032K465k046k325k219K068P414M442o8l662n779l1L980J825
948C598p23n265n613J225M507N000L034l337l510O88J854K626p77n575l428j98
964e894K798N184K65k719q87R71M507L664k864n022m899j600M193L267j426k000
$$ y = [-4512, -8816, -5402, 41, 4173, 4843, 251, -2078, 1456, 5001, 6670, 2804, -5425, -8477, -5827, -675, 3965, 1053, -4517, -4714, -1454, 6634, 11619, 6185, -975, -6126, -5982, 202, 3469, 149, -4175, -7263, -4229, 4347, 8081, 6909, 1923, -2977, -1888, 1587, 1022, -1399, -6527, -8558, -3038, 2712, 5536, 4546, -431, -1107, 3331, 6262, 6352, 688, -8005, -9629, -6145, -62, 4331, 2158, -2041, -1573, 1301, 6234, 7739, 1377, -4296, -7134, -5894, -394, 1669, -78, -1107, -835, 3137, 7748, 6349, 1935, -2645, -5498, -2466, -1, -2047, -4372, -6591, -4523, 2891, 7333, 7265, 3603, -2176, -2207, 1773, 3598, 2875, -2390, -8003, -6778, -2271, 2729, 5763, 2426, -1084, -396, 1458, 4084, 3307, -2268, -5696, -5894, -3096, 2088, 2353, -366, -1253, -282, 4225, 7889, 5025, 3, -4896, -6496, -2303, 964, -462, -2462]
980b462k826J770O889L981J9m011o151j104K673J119N28l802k874K728M480M339
996E296J756l896l115K66N40J214k261n601j612K271M610N221j100l707j111R58
1012b71M773K910l995n626m280o01N840L668k24j839k854J587N147J252j989m592
1028a094m583J076L387J369L00k642p80M313L610J436k221n590j901K268K507
1043A455J333l725n398k76L216N278L951k361m403q77J367M059J489m254m696
1058c842k323J350N942K007j232j667j301K337L599j251l767l770k651L801L680
1073I12K19j377k900L81N359L823N58l243o572k050J966K807J651k404l826Q41
1089c855L819M478K858l383m338k249l91K646O74k761j334J35K561M864P80j972
$$ y = [-2462, -5288, -3518, 3371, 7352, 7371, 3360, -2791, -3895, -1222, -103, 425, -3377, -6251, -3523, 957, 5296, 7052, 3156, 41, 307, 847, 2061, -200, -5801, -7413, -5142, -532, 4689, 3589, -118, -1229, -271, 4502, 7412, 3417, -2209, -6489, -7090, -1250, 2418, 2194, 355, -2499, -912, 4235, 5487, 3498, -1094, -5677, -4601, -1214, 155, 455, -2187, -2967, 1346, 4956, 6392, 4171, -1419, -3320, -1052, 1455, 2788, -937, -6335, -6611, -3395, 1883, 5834, 3473, -930, -1807, -440, 3619, 5108, 854, -3842, -6165, -4815, 1127, 3134, 1902, 235, -1066, 1271, 4870, 3619, -148, -3918, -6569, -2768, 912, 1131, -246, -3146, -2765, 2594, 6417, 6975, 3732, -2840, -4890, -2924, -117, 1534, -870, -4696, -3855, -36, 4442, 7300, 3917, -421, -2670, -3061, -415, 259, -2502, -3836, -3701, -1140, 3724, 4504, 2532]
1105B532j502j632J927K482k349l382l416j168M504M035N53j035l176r5L700K094
1121D072J41l311m952q46K423K431K551j231k589J161J772K062J63l628k790k4
1137b595P62K183p04l274n24J777M064M302j166l138k358o64K985K029k801m114
1153c236l644Q14N987L989J82k085l692J46L965J169j074m197m406J002M024K675
1169A619J581k584k197K312K555K235j855n926k952O78K911L201o12l554o30K152
1185a066M066L903k544m334l222p75L387K320j136k020j941J052L908K309l96
1200C511j826k567O9J697m17j288k517j625L157K556J014M13k492l57K788Q87
1216C003J7k031l866p80J699J488J865j146j903J146J112J414P67k489j553k93
$$ y = [2532, 1030, -602, 1325, 3807, 1458, -1924, -5340, -6508, -2004, 2031, 2584, 1549, -1627, -1722, 1978, 4072, 4213, 902, -4050, -4896, -2473, -42, 2509, 1278, -1311, -150, 1622, 3684, 3847, 219, -2571, -2595, -1833, 350, -354, -3628, -4152, -2375, 1689, 5991, 4825, 1687, -671, -1335, 1650, 3679, 878, -3236, -6880, -6066, -79, 3910, 4092, 2007, -1685, -1539, 2426, 3595, 2521, -1676, -6082, -5080, -1056, 1619, 3200, 616, -1581, 731, 3286, 5521, 3666, -2260, -5212, -4534, -1623, 1578, 966, -2588, -3218, -1066, 3000, 6903, 4359, 25, -3197, -3972, -585, 1735, 599, -1421, -3362, -2310, 1598, 3907, 3511, 1685, -882, -813, 884, 467, -821, -3338, -4963, -1806, 750, 1764, 2177, -315, -672, 2116, 3003, 3020, 989, -2877, -3657, -1958, -470, 1395, 249, -1654, -508, 604, 2018, 2785, 296, -1257, -1550]
1232a550J41P65r2j600R07J577J961K071j591k123l40m28J388o6l388k038m10
1249d816J823M268K118q13j205j649N48K199m73j192k245k482J482J933Q52J085
1265A433n29n99J735j63o36j269k817J21J374O39P77p63r96K025J727J704J29
1282C892l310k319k16O05K083K03k443j026K94J832K860M22j440r40j678J104
1298g7J083j558j261q02r0K807K017l99k89j760N70K203K13j199k891k899Q01
1315c531K314J503Q49j752j743J902K610J643l5l697k309k6P29K304l26k048J04
1332a509J063J947K340j358k641j131j128K126J004j912j883m78J325M171K192
1347D128p78j659k415K42K213L92j153l084k684J124K955J852J333j561j446J169
$$ y = [-1550, -1409, -644, -736, -2336, -1429, 148, 2109, 4180, 2589, 466, 126, -302, 1086, 1020, -2368, -4406, -4816, -2993, 1275, 3393, 2580, 1375, -274, 274, 2473, 2000, 808, -1437, -3919, -2437, -504, 348, 1433, 904, 305, 2040, 1877, 1241, -28, -2845, -2724, -1350, -711, 66, -697, -1693, 332, 2059, 3763, 3892, 582, -1737, -1953, -1348, 735, 938, -1505, -2531, -2237, -405, 2455, 2877, 1437, 497, -1181, -77, 1006, -552, -1813, -2615, -2705, 102, 2119, 1720, 1431, -329, 241, 2444, 2657, 1458, -1433, -4332, -3531, -1217, 286, 1135, -617, -2360, -458, 2152, 3795, 3760, 63, -2246, -2272, -1543, 761, 435, -1613, -1509, -446, 1501, 3841, 2483, -158, -1289, -2417, -291, 713, -1199, -3082, -3560, -2235, 1936, 4128, 3350, 1691, -724, -482, 1731, 2123, 970, -2114, -4798, -3674, -719, 1133, 2466, 905, -541, 628]
1363F28Q28K73q81k685n66R09J041J465q56j306J135J400J464K59k855k238l74
1380b359R93K203P13k828j465J1K098L733P43j961j697j609P61K207q07j114j763
1397b141j204K373K212P61k71j488o55J352L49p63j666k235M00K086J369J104
1413A583j394j550J807J580J439k38l281k707l46J140K531O64j848o97k9J648
1429C02K540l23j817j537j884J464J671n23k20o45mK555J241k57j293k122l76
1446a228J544L40m80j789j970P90K584K227J013j752j952M52P92J596k34k981
1462a048j429j77J397K543L41j384p35l1R33J782j138k305r82R7K094J395j234
1479A19j064j042R16L785J297j170k373k888K96K306R19l59k429k208J664K929
$$ y = [628, 1456, 1729, 848, -1837, -2403, -1494, -453, 1012, 156, -1150, -15, 1385, 2849, 3108, 253, -1985, -2359, -1366, 837, 1550, -1278, -2743, -2732, -634, 3099, 3842, 1881, 184, -1425, -664, 1543, 736, -378, -2141, -3345, -972, 1240, 2001, 1730, 242, -413, 939, 1288, 525, -1141, -3376, -2976, -890, 479, 1583, 189, -1361, 446, 2026, 3465, 3227, -54, -2761, -3107, -1967, 564, 1228, -620, -1317, -1346, 302, 2842, 2519, 702, -835, -2719, -1255, 416, -107, -327, -972, -976, 1579, 2820, 2563, 1270, -852, -1228, 316, 656, 176, -1613, -3583, -2793, -209, 2018, 3031, 1279, -673, -221, 571, 2167, 1933, -1048, -2477, -2654, -1257, 1286, 1627, 243, -492, -523, 410, 2192, 1054, -1251, -2233, -2136, -42, 1353, 119, -945, -1987, -1071, 2714, 4011, 2841, 468, -2420, -2124, 182, 1101, 742, -1687, -3895, -2231, 698]
1495F98K154M97k724k337O66J059J362l56k945r79J171K181K200n46k284k81Q83
1512D19J611P83k567l130p76R22L363J493j527j533j233J592L937R48k335l072
1528a105k747J528K644J215n08k317q21J847J923J100q34k794j244J208J000P54
1544H49j159k499L17K353K148J581j825k283n92J131J702O69k868k615k87J149
1560b229L306J302j629j131p80Q84K421j85j215k013j323J399J878O17q53r99
1576e50o84K219J096j20j248k508k20J137R70M92j349j549Q91J843K010R89j898
1593A521k541j16J73J543Q12j953q32k98P09K638P99j453q12q74J42J334o88j047
1611i43o61m15J658J592J02o95j023M1J748M28o64j322k071r9J682R43P84r38
$$ y = [698, 2852, 3349, 625, -1712, -1046, 13, 1375, 1019, -1926, -2905, -1734, 447, 2647, 2101, -183, -464, 419, 2030, 2813, 246, -2884, -3660, -2738, 625, 2118, 591, -942, -2175, -583, 3354, 4302, 1967, -1105, -3852, -2324, 320, 1535, 1027, -1290, -2111, -264, 1659, 2759, 1925, -869, -2113, -905, 95, 849, -310, -2809, -2492, -139, 2009, 3590, 1765, -518, -1110, 21, 1723, 2392, -476, -3091, -3378, -2229, 1077, 2379, 750, -381, -1161, -277, 2144, 1959, 744, -1269, -2592, -1193, 685, 1302, 449, -550, -1234, 985, 2081, 1961, 713, -1795, -2015, -878, 92, 584, -765, -2314, -1423, 420, 2430, 3419, 1521, -1020, -1136, -963, 580, 1392, -561, -1393, -1691, -982, 1656, 2455, 1002, 190, -684, -542, 792, 104, -943, -1604, -2019, -361, 1231, 1333, 638, -385, -344, 1404, 1832, 1168, -154, -2225, -2324, -642, 301, 1085, 147]
1629A47j485P29O71J185Q69j462j511j77K1R45O60j202K27K54N92J314p80r10
1647H7l29q4M72l7j371o78K70P66K029N65j068k73n19K26J686l23j235j286j022
1666b124R86J022R7N72o70j78J352L3l89p03j537J35J166M93l01m76j040J468
1684i4J695P22j77k328j179M63Q43O49j94j922p36R35J108J768K77j292n28l78
1702c68L11Q02q26q45m59j9J741R79l10o41l33q2J543n23j277n81r78L66J631
1721A31K37N9r27p01J551Q61M10J96j605j159J88Q0O71L90j080K05L23K56R82
1740A068n61r01N86m34K45q0p47k88O25M68J220l0o30k63k47J58P51n10j052o11
1760a233p89P61J278%O11k07l86P57qk46p4r08m92L44p7N24J36k43Q67M70k75
$$ y = [147, -1338, -609, 62, 1247, 2116, 654, -857, -1034, -1013, -68, 592, -610, -383, -129, 463, 1777, 997, 87, -242, -326, 146, 109, -1262, -1940, -1670, -904, 1125, 1690, 622, 349, -170, 56, 1742, 1419, 184, -1102, -2124, -1138, -116, -19, 553, -117, -295, 1057, 1090, 701, -2, -1539, -1404, -238, 255, -46, -522, -1562, -94, 1601, 2323, 2146, -182, -1361, -898, -55, 594, 400, -1522, -2258, -1323, -215, 1553, 1830, 538, 10, -368, -57, 745, -81, -926, -1385, -1404, 337, 1316, 1006, 365, 32, -50, 1493, 970, -307, -888, -1866, -1500, 131, 368, 427, -500, -1201, 350, 1211, 1621, 1817, 212, -947, -759, -679, -8, 382, -698, -493, -170, 86, 1068, 507, -394, 192, -242, 3, -77, -824, -1112, -487, -19, 1201, 1171, 541, 278, 31, 189, 940, 430, -622, -1233, -2022, -1261, 17, 17, 628, 421, 35, 792, 784, 538, 464, -444, -936, -592, -669, -145, -9, -252, 615, 1085, 810]
1781H10P8j059n01K5M7L60L78j057J12K84P35J303j4j037o3q27K66O72o19l57
1801d64j84n84R06N94J79J66k68l28N52l21q14J19p73Q37Q68j44k19m01j38J366
1821I49O73P1q98j634o34L45J197N25o60j172J11R40P72P83n12j083o1J9M00L33
1841D64j024l93L33O25J301K18j690m82Q7N66J266j040j370j009J37J577J813
1858A379J8o80j276n00K011R89j93j392j984k39J229R90N63q16j065N74N98R48
1876A154J07j306j369M33M97R64J94j421j66L09J248J493m43j509j062m05J043
1893b39J515r95j289o91k11J928J596m47n73j131k32J434O60n37q00j425K96J502
1911C61M28K89r94r07N62J175L47j9k255j032J057P43J232l7j757k91L21J512
$$ y = [810, 888, -171, -672, -647, -600, -240, 138, -919, -807, -523, 212, 1515, 1501, 464, 401, -426, -160, 512, -107, -464, -648, -1232, -326, 268, 447, 613, 345, 17, 569, 248, -566, -447, -1220, -383, 485, 341, 122, -279, -417, 949, 1622, 1693, 795, -839, -1473, -1128, 69, 594, -66, -1238, -1127, -187, 585, 1368, 856, -227, -288, -269, 131, 464, -560, -953, -620, 5, 1306, 1524, -166, -648, -561, 5, 1271, 231, -1139, -2148, -2011, -434, 1379, 1397, 717, -559, -1059, 952, 1941, 1748, 356, -1628, -1867, -638, 352, 915, 99, -966, -392, 206, 1154, 1261, -45, -1414, -981, -484, 480, 674, -747, -913, -604, 644, 2137, 1694, 185, -877, -1282, -239, 1276, 281, -1008, -1699, -1910, 18, 1614, 1167, 594, -537, -769, 665, 1325, 788, -12, -1437, -1141, 361, 789, 1078, 84, -823, -261, 914, 1261, 1242, -1013, -2045, -988, -245, 987, 950, -807, -1098, -777, 735]
1929G35J635p82j668j073k23J303J131q08r89p68L32J833R52q06j067o88K3J704
1947G76K76o79j266j103J276K050O37j90k118j242R17J603R24r17k523j116R54
1964a741J828J598l8k158p34M88J368J588j028j356j328P8J155J464m53j020p06
1981i95N45J518O00j309j025r51O48J562N05p15j479m77J113J839Q44j202j443
1998d22r34P88J206N28o37j697o33Q96J054J065m37j163j91L7Q61O39r51j111
2016a102K30K5J521K80r39n62J46P27J400k41j612q47o95Q20J413p1o45r38j99
2035a289J330J299K1l76j518m68J100L67l8o57q14N87R21K09L29q89q71L51M54
2054D8L65q4r80o74P51M65J093M01j255l94P1N54J027o54j202l57l10L95J211
$$ y = [735, 2370, 1588, -80, -1153, -1376, -73, 1058, 250, -739, -1507, -1175, 658, 1610, 804, -263, -951, -928, 776, 1052, 373, -893, -1996, -720, 1330, 1967, 1777, -341, -1583, -666, 937, 1861, 944, -1579, -2695, -1741, 87, 1685, 1647, -511, -1245, -757, 611, 2199, 1171, -185, -1513, -1435, -280, 1184, 731, -289, -995, -450, 1068, 1668, 359, -666, -1617, -969, 593, 1098, 383, -1096, -1573, -460, 1379, 2223, 1021, -422, -1356, -568, 638, 1166, 529, -1168, -1801, -905, 149, 1214, 777, -386, -577, -540, 321, 960, 9, -1102, -872, -847, 674, 954, 15, -547, -401, 326, 1726, 1485, -127, -974, -1669, -849, 564, 493, -152, -1090, -1289, 41, 1340, 1361, 985, -533, -1001, 99, 466, 428, -229, -1043, -456, 465, 674, 1003, 114, -757, -406, 48, 413, 329, -651, -1325, -574, -109, 984, 1385, 130, -264, -193, 361, 1388, 734, -468, -825, -1135, -740, 471]
2073D71m57j04R1l98P96K48m94j52k14k19Q05k32m91j21j54R41O65J21l70j150
2093d18m03N33P59Oj41j506l39P53Q76Q67j14q99k24L60L8P79o36p11m36L65M84
2114gP51o15l70k3J33Q20l4q81k21r85N21J560j7n49q05k94J191J260L5n89j562
2135f81o88N67Q62O59l44j377k13P15R68Q61n53j154m65J16P79N58m40o78k43
2154g51N22J095N08j001m83m25J22J009j53m47p66n21M59J309Q8j1n28o74N14
2173a34P18J42N3j297q6M10Q9L28l6n15o0K79K85M45p43k54N5pJ57K77n62k86
2195g42N00O44M52J73r83j22K57n08L95K42p65O9m68N77O43k97N19l68l64J66
2215B0J17K1k86j71j8K99j86K17L02jJ59J32k05k76p51j63L19n1N16j55j02M1
$$ y = [471, 14, -90, 1, -397, 399, 647, 153, 1, -213, -432, 373, 141, -350, -471, -625, 316, 981, 1102, 732, -418, -821, -288, 471, 477, 336, -1170, -1509, -756, 120, 987, 873, -26, -250, 110, 148, 927, 291, -420, -856, -491, -7, 744, 129, -241, -264, -131, 689, 655, -226, -447, -1432, -911, 649, 632, 83, -722, -1016, 175, 1435, 1470, 881, -681, -1369, -802, 60, 719, 375, -1002, -1215, -500, 468, 1329, 776, -378, -843, -727, 52, 610, 170, -508, -751, -229, 866, 1374, 373, -110, -535, -413, 596, 443, -4, -770, -1291, -832, 477, 565, 554, 26, -648, -134, 584, 726, 779, -518, -604, -194, -105, 223, 187, -328, -388, -109, 176, 621, -122, -376, -321, -328, -171, 106, -456, -742, -242, 402, 854, 1027, 44, -78, 179, -329, 66, 308, -457, -388, -856, -279, 364, 67, 586, 218, -146, 20, 137, 158, -128, -299, -317, -18, -204, 13, 315, 314, 473, 605, 400, 124, -627, -790, -471, -522, -6, -161, -263, -222]
2237b22M01L3N07k26l91j23l77j40O99j32J12q5j23K85O3l44Q3K59k78K61n28
2258b66k61J65j44P00j0R0k62J5o9O89M8l36k74n29l55N64J83p5P2n40N78L84
2280C67q0L10o56l20L53k09K61qm11N3N50Q6O16n06o84K2K4J37M38l05q33j53
2302i48L33P29L54qk3p76j0R21J7n95l44n20O25O19N0k92l43l17P57O83o22m81
2324a91o74r9Q69P04J0l87j074J67R27Q70K04r81j017Q3M11L54M86o64p53J19
2344f36K66Q91N0n15k23PQ2Q01m31q96r9K74N43P01k51n51m69j81P45P51l47o75
2366a63q18N5Q65P16n2n32p47K90O95N82J02p27o38o2J21M59K29q36q8N66KN72
2388E91M0r79r1j58O59N86o78m92k67M64J026N15m15p79m72j30P88M04m22k97
$$ y = [-222, 179, 212, 719, 493, 102, -21, -398, -538, 161, 29, 141, 56, -67, 218, 281, -63, 20, 279, 1, 262, -266, -527, -362, -506, 194, 184, 274, 12, 27, -42, 647, 695, 359, 85, -444, -799, -235, -52, -127, -55, -595, -17, 367, 287, 597, -59, -379, -26, -235, 26, 18, -393, -340, 210, 296, 912, 406, -278, -256, -232, -95, 343, 38, -795, -948, -615, 114, 468, 460, 437, -339, -349, 572, 589, -6, -350, -870, -245, 374, 424, 132, -211, -528, 229, 912, 290, -191, -865, -964, -95, 609, 619, 232, -842, -675, 252, 1122, 1326, 345, -672, -589, -178, 176, 662, -2, -755, -636, -370, 521, 571, 56, -167, -160, -78, 723, 292, -604, -703, -429, 114, 815, 564, 13, -456, -637, 108, 859, 512, -163, -981, -926, -61, 655, 603, 71, -676, -386, 309, 891, 993, 266, -372, -434, -313, 146, 375, -461, -549, 17, 19, 591, 631, -348, -439, -597, 62, 648, -30, -522, -789, -325, 701, 1216, 801, 22, -450, -580, 208, 612, 190, -107]
2408a07p79K55O16N42J01m47n75J59K91L28j57p08k90P83K15K68p2o76j54M71
2428F4K46M10l43j018j22K25O95P62p64p34k72K00P99O36m9n69l16k45P23K76
2448F04m20l19o51K67O16K62J99q20l19N29O51k04k87p61j73O32N55L39j00p81
2468a81l42R36J80J39k53j366K13J1O16M61m55J6l88L36M49K54o38k72m5o8P81
2489C84l31m58J34j60N13O51l28l98m46k20O30O53l95k44r31J67Q49N45K1k40
2509C96o20j82L29M59P4l13o32P0J65L97K20p32K04O9K24L84m8r18j06K27L26
2530gM20n1m35j39j04P47O15k86m12r00j64N30O35k16k84n85J3O50Q4M66m23l63
2552b09K24K6J60K02m55m43J86J59M53L79m15l84J48k59O86l71p60J56l4N38O01
$$ y = [-107, -886, -631, -15, 527, 628, 181, -394, -235, 56, 384, 227, -481, -771, 12, 227, 495, 423, -253, -407, 64, 310, 720, 377, -641, -763, -538, 157, 919, 155, -579, -851, -651, 148, 784, 735, 166, -150, -395, 328, 604, 184, -135, -786, -519, 97, 359, 558, -262, -581, -52, 599, 395, 108, -653, -826, -194, 361, 700, 600, -181, -523, 413, 593, 732, 479, -887, -674, -663, -47, 414, -41, -25, -413, -77, 372, 626, -12, -284, -329, -397, 384, 53, -405, -271, -431, 82, 733, 405, 7, -439, -659, -29, 624, 229, -15, -946, -779, 70, 615, 636, 396, -224, -406, -77, 382, 456, 143, -489, -419, -254, 143, 363, -369, -165, -96, 128, 512, 464, -454, -560, -333, -7, 413, 362, -73, -212, -316, 431, 1046, 760, 348, -552, -716, -186, 449, 233, -51, -636, -623, 27, 111, 577, 154, -209, 15, 41, 201, 403, -52, -495, -309, -150, 303, 682, 267, -117, 31, -228, 458, 87, -673, -517, -551, -13, 588]
2573E88Nk94m83j65N75L63k04o9o16k96M77J63M46l98l44r0L56p6L48j33o08J34
2595c21K84K32Q6p12J64J09L07L50j76k54m24o7O75Q3m7n04n60L13J3O72j63j09
2617d9n8j01M82K75m11n2n35L1L94N9qJ00m79L10L85J96j59o31n12L85K21L57
2639B00j86l39o9L79M67R4K49r81j16M1L9O50l08n57M74k08M20K66o54m8K73j26
2661d0K69j66m24J42N2J7Q45l66l74Q1j86L13L29m65Pl94qK00L2J33L70o86r9
2684d18K96n9M61L2l00J08P3k92Q2l6j24K92k71K86l12m0K40R4kq0k39m0J95o3
2708a17J08M61k72j46Q1O3P3j63K2j18k92Q3J73j69k41L54K00J87Q9l77j65M7
2730a19k1J83M6k64k05J60K78M03K0j71m45k01J75k0KJ94q0l47M73k01L04J93
$$ y = [588, 593, 299, -184, -349, 226, 589, 385, 316, -300, -596, -119, 44, 490, 92, -252, -342, 14, -62, 286, 153, -455, -321, -37, 195, 281, -431, -267, -158, 149, 499, 323, 69, -355, -422, 253, 336, 289, -215, -775, -462, -449, 223, 60, -49, -107, -208, 274, 549, 138, 86, -449, -418, -24, 35, 27, 127, -352, -42, 343, 539, 380, -251, -763, -378, -157, 200, 14, -325, -394, -15, 452, 546, 795, -186, -302, -261, -222, 428, 120, -437, 37, -171, 249, 515, -139, -187, 86, -40, 229, 63, -361, -219, -167, -150, 695, 329, -45, 36, -150, 163, 492, 27, 34, -360, -368, -168, -136, -3, 367, -319, -418, -122, -181, 280, 312, 12, 120, 193, -99, -17, -53, -177, 115, -156, 130, -182, -222, 18, 112, 110, 30, -209, -249, -54, -117, -9, 452, 180, 34, 115, 178, 251, 88, 110, -8, -300, -217, -44, -213, -454, -100, 100, 287, 376, -1, -166, -119, -140, 43, 89, -175, -380, -220, 58, 461, 481, 310, -135, -336, -161, -181, -179, 15, -65, -412, 61, -140, 164, 357]
2752C57n71o0L17J17K8j16l87J81K92j60K97k28k02K95k93R7Q6nk52j41L2P63
2774D47n68M03k01l22J42L82k47K59k78l41L64Q7o8j53l70o9N75Q6J33j35l24
2795a98K32O7K65j18l89l53M05K43K77J00m59n22L73o8M02J5m59m56R1K09N81
2816B38p7j93q0r0M48l2l02j06n0M1L45K58l21j13l92N92K44m6l66l92j67J44
2838d17O54j08K28m47l55L32K85L96M5n57m63J29K37L23o5l85L9J68N1K09l14
2859a5m01L00k15N99Mo0l90k99M70L25j73j18k98j17J18O70k20Lk52k26N7K71
2881C3k49M7l5j36N72j00J66j05j60J05J86k68L0k44l25N01j6K18L62p67K90l11
2903b06L82o2j5l43qo3J11N68k3K45m86l70K25L80k89q2j33o0J94O2K29k20m55
$$ y = [357, -214, -274, 43, 160, 188, 72, -315, -134, 158, -2, 295, 67, -135, 160, -133, -36, 50, 45, -207, -348, -316, 447, -121, 282, 81, -241, -99, 283, 36, 295, 17, -324, 40, 127, 59, -94, -464, -533, 42, 128, 261, 126, -198, 34, 101, 366, 248, -141, -494, -89, 154, 431, 531, 72, -450, -77, -145, 257, 272, -187, -643, -552, -343, 238, 161, -32, -112, -202, 246, 214, -88, -194, -244, -203, 142, 400, 79, -34, -426, 166, 410, 364, -2, -394, -561, -417, 237, 129, 357, -90, -445, -113, 172, 568, 613, 56, -407, -278, -41, 282, 217, -168, -129, 39, 90, 299, -15, -416, -116, -331, 268, 272, 212, -178, -477, -7, 318, 145, 27, -271, -388, -270, 400, 180, 183, -69, -295, -238, 33, -216, -169, -204, -340, 232, 132, 298, 193, 33, 138, 324, 56, 86, -158, -483, 18, 2, 220, 582, -185, 105, -206, 176, 114, 99, -244, -252, -315, -204, 364, 341, 586, 100, -270, -45, 335, 46, -36, -169, -229, -35, 27, 256, 36, -419]
2926d19J68N95k92R9j20k13J24J79K19K45m65n38K46P9N05L85q30k13j87O0M68
2947I5N6Nm04j30N6N86n8j8j32m72M06K58j19Q6p8m11J46K41m1o4l74J40M13J48
2971C35K9l35k97p0J28M75O6j61j56j60J35L11K14n79nk09k5M42Ll02K42k86N6
2994a49N58m36p2M8k50M08M0j02k33j41K77L86L83m41j07o03K56M42nk31m2l58
3016c72K61K16j30K68k85k63J59j39L79K57l03r0J36o3M07o74K0R1L6L8K83l12
3038h0k14J02M2K09k2K23k93l00p9P71j68j02K28j89k03J11j08L31l26m45J00
3059d12L22K03K10m29J53J13j05J15J68o69R9P3L6M00m5k90j7j55K13M42n18J3
3081h0m26j37N65J12j78M26m35J36Q6J93k14O5k81k2K68K14l76N3J4J09Pj78J47
$$ y = [-419, -251, 344, 52, 151, 31, -182, -58, 121, 340, 585, 120, -418, -172, -93, 412, 797, -33, -246, -433, -373, 95, 151, 156, -248, -378, -322, 264, 206, 188, 56, -416, -10, 248, 129, 215, 137, -274, -128, 113, 72, 8, -366, -226, 187, 335, 364, 29, -268, -338, -210, 265, 331, 170, 14, -146, -11, 300, 514, -65, -70, -279, -304, 138, 141, -161, 81, -205, -149, 409, -27, -99, -51, -301, 107, 147, 45, -188, -329, -52, 334, 717, 276, 169, -434, -178, 264, 259, 28, -14, -372, -111, 105, -25, 243, -42, -305, -146, -285, 94, 351, 48, -42, 94, 31, 438, -236, -216, -125, -89, -51, 232, -80, -294, -192, -150, 59, 37, 260, -33, -333, -412, 359, 191, 89, 317, 128, -75, 36, -72, 259, -67, -512, -412, -90, 113, 323, -106, 47, 160, 55, 170, 338, -331, -232, -159, -123, 277, 232, -58, -75, -230, -17, 425, -93, -80, -506, -643, -78, 34, -144, 282, -153, -17, 69, 262, 48, 113, -168, -190, 78, 292, -84, -31, -17, 92, 99, -79, 68]
3104F8m99J94n5J58Q3J25k21K73rk14J44p1n1J60l16M81O4l29K39l75r1J58J31
3127D7r8J82j72Q2J8l4J2j34j04L63m8k34J21k50J20L07l00J36N1j14k8K9kk3
3151g3Q1j73K9J78J28L90m13j60J25m40K85L1MM2q7J46o5k69K99J04k48P3J93
3174A80k23J79m7l26M41q3k6K8l60L40l9Rj34j07L39j37j14l0K9M0nOp0j00K67
3199E7J18k21Q9R0k75R3k0J85j04q7J06j36K7L33j84M6j10n5j00J04j94L93k01
3222d6r2M39m35K15j3k2l4k0m22M43k20o9L84J3q3K74k10p3L57l84L4K2j94L8
3246i8J79j69K30J30l6q6o0N1k36r2P6J81m3j2q4L9J43k80K01J33p8J9j34l18
3270c44K45Q3L4R9N7l17j05J84O9K96m89R9J91n5j81J55k23L83j39j8J29j84L0
$$ y = [68, -431, -237, -292, -134, -51, 74, -147, 126, 117, -97, 47, -24, -75, 85, -231, 250, 314, -15, 224, -151, -242, -84, 47, -51, 131, -41, 41, 59, 25, 37, -97, -201, 162, 114, -120, 1, -249, -129, 178, -122, 14, 65, -49, -77, -48, -50, -73, 8, -165, -136, 42, 170, 560, 147, -13, 112, -328, -43, -12, -8, 34, -53, 93, 28, -241, 58, 162, -86, -13, 180, -43, 136, 89, -237, 204, 121, 95, 123, -237, 103, 64, 73, -61, -168, 171, 34, -80, -110, -81, -41, -46, -40, -110, -210, 57, 175, -46, 43, 133, -142, -49, -69, 116, 12, -75, 31, -105, -78, 255, 71, 117, 7, -48, -148, -44, -238, 155, -46, -138, 301, -134, 81, 68, 46, 12, -8, -430, 13, -207, -276, 108, 121, 38, 312, 102, 29, 386, 2, 36, 58, -136, -98, 81, -88, 142, 272, 236, 150, 90, 141, -95, -187, -111, 70, 27, 15, -69, -30, 113, -167, 34, 167, 89, 108, -26, -344, -99, -16, 18, 117, 174, -143, -248, -64, 5, 301, -188, -89, 102, 47, -134, 21, -202, 181, 42, 24, 153, -31, -1]
3293aJ76qm7J24k91R8j2k61K78P9j13N0p4J48N6R7q5j36k93j20K00nK14l7j88
3318a51J21J04j26M2n7J12k61LK85K1k61L88k64O2K46j29k73J05j23K82j65k26
3340b65K90k42J09O9K57l12J13k03M5k23L37J98j88j09J50j64J42J92o49O11l00
3361a42o6o3M11j82j6m5j26K61K37n94M08k62L74k39q7L30r8k30p0L85j97J57
3383A46j54j68P7N9j40N59n19j07L05k85K02J65j78O0k50M4N03l71K65J3l11J52
3405F7K63l15j59q9J26L17J38j91k56j76K99m3m5J41m65JM64o6Q0j52K44j42Q5
3428A26l5K6k7p7N3k54M4J03q1j88j1L52K69k15l26o8L04j61J54K73l86J97p9
3451gj96J79K24j82k22L8M2J39j4L19l12k61J47J10j63j1J86n9R4P2N0j03j71
$$ y = [-1, 175, 167, 120, 244, -47, 51, 39, -222, 56, 135, 22, 72, -2, 146, 202, 299, 214, 78, -215, -335, -135, -140, 74, 37, -151, -30, 74, -52, -10, -67, 45, -216, -213, 72, 93, -168, 220, -44, 18, 264, 135, -138, -33, -156, 126, -39, -265, 25, -217, -108, -39, 218, -94, 19, -184, -139, -362, -25, 173, -15, -124, 26, -138, 4, 196, -453, 158, -142, -208, -271, 140, -42, -58, -103, -229, 32, 269, -325, 83, -179, 195, -44, -131, 199, 101, -129, -199, 186, -11, 146, -8, -176, -99, -40, -180, 379, -140, -247, 58, -227, -25, 140, -38, 22, -228, -184, 319, -52, 213, 226, -85, 67, 330, 15, -144, -233, -107, 210, 348, 157, -99, -275, 24, -19, -64, 77, -388, -387, 77, 11, 91, -61, 183, 41, 126, 91, 117, 90, 13, 66, -188, -144, -41, -122, -310, -321, 31, 300, 85, -241, -309, -5, -166, -12, 261, -125, 72, -7, -203, -24, 200, 18, -204, -166, -124, 15, 1, 320, 8, -253, -106, 4, -159, -170, 16, -43, 51, 123, 173, 70, -101]
3474a01j79L60j27J65j86l5P0L07m01L00k16l23N15k49K58j80l2J73j51j74J16
3495i0J78J07M1k40J32p5P5k0j01j16J90K11k91J13l09K10mj82N24n1l7k39J56
3518A82J06q6k78J38j07j33L6K89j36q5l1J84Kj8j18K18j46L3n4m5j28K79j67
3541f5k6J20j37K4M3r9N8j82J38K16j51k11K60j21P8J35k35K40k74J27L49j78
3563A09j71K02l1N0J6j64q8p2j34L82j70K13L2r5l10M24l46J14j18j09J20L30
3585A84q8P9k7q4J42k74NK07j41k41J89j01M39k93k28nJ11J92k89J41J97l01K64
3608G8M1l7q3K49k04j72J67k32K17j77o5J56L50k42J56J2k16l9J71o8o4J19l03
3631a86K63k51L35k30j55L70n42M72p7J97l25R5j03Q2J66j21L67n07o6R2J84j82
$$ y = [-101, -280, 80, -47, 118, -68, -103, -33, 274, -127, 173, -43, -366, 149, -100, 158, -22, -54, 119, -32, -206, -90, 88, 195, 236, -4, 128, 53, 128, 108, 7, -109, 81, 292, 1, 114, -195, 15, 11, -171, 353, 302, 265, 26, 182, 288, 202, -76, 62, -45, -178, -142, 147, 11, -74, -105, 79, 81, 63, -55, 163, 17, 50, -4, -49, -177, 102, -65, -91, 29, -108, -84, -41, -140, -82, -264, -126, 90, -61, -272, -12, -133, -55, 80, -155, 85, -189, -62, 287, 109, -62, 140, 109, 159, 175, 11, -77, -149, -283, 99, -71, 142, 174, 79, -231, 193, -153, -39, -157, -266, -146, 184, 96, 175, 148, 64, 206, -68, -63, 144, 3, -238, -49, -150, 289, -4, -232, -237, -126, 66, -223, -82, 115, -186, 78, 119, 82, -1, 248, 44, -128, 39, -193, 24, -153, -218, -62, 288, 46, 202, 214, -2, -41, 130, 62, -2, 117, -186, 77, -174, 161, -69, -224, 146, -396, 76, -1, 196, -129, -34, -137, -55, 111, -10, 357, -150, -216, -124, 60, -122]
3653a22K47l37J77L35k15p1K1l78K50J0J8j23K01j15M5K70o3J16l63j9M0m7L85
3676B62p1k47L8J3J07K83mo59J54J13L3j3m7k4P3j91L16J39k61j97n0Q3L31k72
3700i1K14j30m96N83K4O2N4l82j16J77K76k87K52j46j19J98K6Q3l77K09K00k55
3722d1k6N8j72k2J16J83j81J36k33K72j96K38K1j00K09j05k93M3L27M5j93q2l5
3745c1Pk71M5K00J68j96J06o5l6J39k09K2J50k8O3J11m13J36K8J10k9o5J62j88
3769h4k02L05K7m3k0k9r9M03j9l29N2Q1j1J6j17j13L57j16m6R4k22J16l2R8J63
3794B30m78Q5K44l72L88J02j96j23K4K5o0J42J22n2k3o5J37k18m0M9m7Jk6o5K74
3819E8j9K74l21j10J6N6r4J40n1J8J32k7P1n8rk14P1o7L5J15k66M2J85M8J10n5
$$ y = [-122, 125, -212, -35, 300, 85, 14, 35, -343, -93, -83, -65, -188, 13, -102, -57, 213, 150, 266, -97, -116, -76, -123, 262, 191, -56, -18, -5, 102, 385, 381, -278, -124, -11, 22, 9, -38, -62, 11, -180, 136, 275, 14, -183, -233, -150, 181, -91, 123, -7, -503, 80, 104, 166, 220, -162, -278, -101, 175, -112, 140, -6, -125, 73, 99, 182, -195, 14, 214, -41, -67, -9, -181, -203, -87, 96, -85, 51, -182, 90, -106, 132, 153, 53, 262, 157, -136, -93, 234, 279, 86, 4, -31, -24, -295, -250, -50, 118, -78, 28, -37, -73, 66, -143, -121, 29, 1, 64, 175, -238, -102, -74, 36, 7, -58, 104, -84, -286, 19, 46, 3, -17, -46, -145, 258, 239, -90, -38, 43, 32, 48, -69, -182, 175, 59, 13, 107, -115, 1, -31, 67, 230, -248, -163, 81, -291, 97, 199, 3, -120, -96, -71, -131, 11, 133, 81, 58, -7, 130, -88, -128, -79, -126, -125, -151, -216, 58, 39, 313, -8, -118, -102, -46, -140, 0, -51, -33, 99, 72, 143, 85, 76, -138, -67, -134, -99, 16, -250, -208, -23, 25, 135, 80]
3845H0J02j78R7r1K90l23J32j09OJ83J43l56m1Rnj59j15L74k07N3K17j21j21k
3869a42L0j22J83J72j50k8r3J97Q4l21J19NK1J6n3k0N0l4J24K9j31N2o9K1n2J42
3895C0N4n3k41Q2K96m13L13K78l82j92R0j8J45J0o1J43j36o6P2J0j67o1J90K76
3919A99j86P1l58K45K48j17m9r9P7o9M5q3J8p4J21K07j11P3j44mr3o1J05P5J40
3944A76k95R5j7K26j54jJ25k42J64j8j23J62k62KK30L35l00o6j04K59k65Q9L0
3967D6O0j82Q1k26M89j00pl49M0q7K24J58k08Q5k2J68m8l0L4p2j18q8J2J49J05
3992A14jl15M33j12J56m31N0j3p5J71J98j79J93k32NP6J12j71J10l29L09k23K83
4015A29j70j23R1n7N63k95M0m83L43k24M14p5m6j12l4K14o3K0k35k7o9L09j85
$$ y = [80, 182, 4, 101, 10, 300, -23, 109, 0, 6, 189, 332, -24, -65, -56, -61, -220, -335, 39, -168, -115, 102, -19, -140, -142, -112, -234, -51, 121, -29, -57, -150, 47, 131, -190, -71, -66, -45, -29, -82, -102, -52, -86, 38, 67, -64, -12, -81, -60, -112, 30, 84, 31, -210, -128, 168, -245, 68, 346, -36, -228, -138, -156, -11, -1, -62, 81, -55, -121, -49, -39, -206, -267, -77, 199, 13, 84, -274, -29, 219, 102, 53, -46, 31, -38, 7, -76, -58, -132, -11, 196, 85, 158, 14, 10, -83, -144, -39, 36, 176, -119, -24, -41, 185, 31, 30, 155, -87, 77, 59, -64, 98, -164, -162, 68, 403, 103, 37, -67, 192, -73, 16, 46, 106, -76, 5, -221, 268, 168, 161, -188, -148, -235, -11, 147, -61, 24, 2, 170, 122, 92, 126, 54, -64, -152, -140, 9, 114, 113, -202, 231, 119, 275, -156, -106, -119, -194, -23, 175, -4, 189, -43, -38, 38, 150, -21, 89, -240, 69, -154, 129, -41, -164, -73, -130, 433, 138, 178, -305, 38, -186, 228, 153, 107, -5, -39, 175, 112, 132, -103, -130, -199, 110, -75]
4038g5J44K8j10p7p8l7K99j53k38L83J14p1j13J00k44N7J66l8k3j4k32K64Pj38
4062g9J83J52m84K6R9J64J51l43K44l74K78J73k28K35k98J28J66k72K86m27j2
4083b32K60j71L46j55m1o9J63l48M53j07l37K53l04L85j4K11j13l39J95j26K04
4104A14K27n67k7j6R2L64k1j35k76R7J24J41l4j03n0J1N0K07q3k05Q6L6q9J66
4128A09j92q3N0K4J47n0L19j56k77K48l4P0k50ln8K30l01Q5K66j86L3L3k34K6
4152a84K0J28J04o2O2j13j1j02J35k74O41k13j12o5r6J0r4M82j99r9J8R4O0m4
4176H6j57J9n9k2J85k4J97p0j00j4L5N4j54N8k19q0M72o7l31J57l1j78K36J39
4200A32l66Q9K22M9o8n8QJ0j88M53k30j70J61j2l28M38L60j63m16k7J47m0Q9p3
$$ y = [-75, 69, 97, -13, -90, -168, -205, 94, -59, -297, 86, 200, 129, 16, 116, -128, -71, 95, 57, 34, 20, -212, 52, 59, -79, 104, 256, -228, -202, -103, 61, 212, -131, 113, -261, 17, 190, -38, 197, -101, 27, 193, -79, 207, -220, -232, 28, -143, 203, 48, 7, -62, 101, -247, 206, 99, -238, 15, -289, 96, 82, 293, 180, -159, 36, -90, 114, 341, -226, -253, -269, -177, 187, 166, 31, -245, -148, -24, 117, 83, -20, -70, -59, -9, 198, 115, -90, -4, 32, -57, 109, -83, -166, -116, -92, 55, 5, 324, 168, -109, 139, 105, 175, -75, -78, -136, 94, -207, -122, 144, -42, -9, 24, -210, -184, -164, -36, 68, 6, 68, -45, -56, -158, -23, -297, 344, 131, 19, -46, -142, -132, -226, 256, 57, -42, -24, 70, 130, 86, -71, -52, -111, -133, 52, 28, 225, 155, 55, 41, 76, 130, -24, 34, -185, -265, 207, 140, -191, -34, -65, -243, -7, 132, -234, -145, 77, 126, 58, 0, 8, 18, -170, 283, 53, -117, 44, 32, -296, 142, 502, 339, -77, -104, 43, 3, 92, 19]
4224A9M1k7r9J43K2j59j26J16K34k53J65O9m56J2L21J16j55J06j98R6p2j45K28
4247bL7l7J46m8JRN0j18r8m2p0M18k50J7j4j25J20O5m0O7r2K80k17k68K67J3l18
4274b49N14k84j31L65m41L8J67J83j81M3m8m0j9O2J75l38J60j34j46M19q6K29
4296B58m22pOJ93j90J60n6j15K31l9l4J9R6j13L1l5n5P3R0k42K41J26k14M9r6
4321d5q9q1L69o7k48k39L33J5J33m6j62K90m59M44k56L18k11M3Kk8L08m55M0J12
4345B1j56Q5m7Q8j72o3N17j54k70K43r8j96L08N4m7K4j82j73J98L0J3N9j2k11
4369a41L46k15J62r5m8R1Q3k00J50k05j83K96p6J71j14k17J45o5J97K74m52M8
4391d8k63N02j11M2p6j21J26j31K05j84L06j54k03q0J3K36K00l67k8K42j3m1K56
$$ y = [19, 60, 33, -66, 77, 99, -60, -186, -70, 164, -89, 76, 145, -311, -299, 22, 138, -17, 89, -109, -13, -85, -230, -2, 35, -2, 144, 96, 97, 106, 156, 38, -60, -102, -172, 246, -4, 13, -1, -126, -6, 59, 19, 86, -6, 274, 57, -211, 56, 69, -249, 265, -19, -150, 215, -226, -188, -21, 162, -19, 24, -24, -64, -83, -21, 154, -184, -24, -158, -304, 115, 29, 258, -164, -171, -165, 28, -162, -2, -58, -173, 58, 19, -15, 4, 100, -13, 18, -17, -72, 1, 91, -151, 90, 216, 2, 51, -45, -134, -215, 154, 87, -161, -400, -67, -52, 81, 35, -127, 163, -296, 148, -108, 210, -1, 42, 44, 16, 324, -131, -91, 21, -135, -50, -97, -9, -181, -244, 273, 119, -151, 92, -6, -202, 106, 160, 113, 137, -45, -218, -20, 10, 23, 82, 70, -141, 205, -10, 152, 57, 9, 100, 183, -17, 133, -72, -255, 41, -35, 136, 22, -195, -50, -115, 82, 356, -96, -48, -311, 191, 80, 122, 46, -75, 51, -80, 125, -59, 247, 93, -110, -190, -177, 59, 259, -108, -136, 106, 93, 52, 308]
4414C08k37k4j10J44o7J36j39k72o0N51j69L1nj88K66k58K52j72j47J74m8Q3J96
4437B45j00k63j58L24n2L51n16M1r1J26K65j31k86J27J76j23k4J95k98L08k28
4458a12K14k70K51j96j73K2J09o6L06j06q2J34o4j21J00K80j70k98P0J82K10r9
4480A21l18k4K22K00J39j24m34K27K7P8R6k84J26k0r4J32J44l74J5R4O3k7M99
4503D84k41l70k4J74l0N9k4p5J57k43K08p2m0l1J33k48J97j70K56k40Q2n8K49
4526A33P7n00L15J22k67K50j05j48Q5j86M72l6l10J76J35j27R4j13j36l5j66J63
4548a07J65j0o7Q8l58J23K13J17J58k77lJ13k24K57J17k52l68L80j53K47j12l24
4570b77K89J05J47j12m8m01P7K96mM9j23j08k22J40J36j79J07K48j64J4J57J24
$$ y = [308, 71, 47, -63, 81, 14, 150, 11, -261, -321, 230, 61, 92, 87, -101, 165, -93, 159, -13, -160, 14, -34, 49, 245, 145, -118, -276, 48, -4, 347, -169, -128, -219, -93, 172, 41, -245, -118, 58, -65, -89, 106, -192, 116, -112, 102, -168, 83, -113, -286, -264, -155, -221, 85, -21, -103, 31, -33, -154, -54, 226, 56, -242, -172, 10, 220, 121, -197, -221, 1, 201, 340, 216, -218, 9, 36, 114, 210, -74, 52, 32, -62, 70, 214, -160, -145, -51, 12, -15, 484, 243, -127, -151, 23, -7, 52, 28, -47, 110, -133, 75, 3, -37, -68, 65, -183, 14, -156, 100, -140, -58, -116, 133, 210, -290, 25, 147, -120, 130, 25, -123, -38, -224, 248, 212, -98, 78, 213, 86, 180, 67, -69, -104, -270, -107, 58, 48, -19, 69, -289, -166, 47, 164, 322, 45, 42, 155, -69, 188, 305, 53, -315, 65, -88, 159, 47, -277, 12, 117, 264, 152, 104, -297, -220, 76, 72, 121, -2, -110, -332, -192, -56, -235, -128, 120, -44, -30, 127, 251]
4592B51j17J11l18J21j8o9J75j65j36L4R1J69N1n47K34PM77r7k33J3R2j89K52
4615A89o9k15n8q4J74k8k5r7M40k29j07M9K43L9m02J64J82j24K31k91L5j33J88
4638G2N3k85P3K33k92n1K81K0J54k46J69l52M46m03K35k0j58O8L03j45k5k2k73
4661a65K1L01q1M1m6J20q1k30K65k17K46j34j3K42j99k22P4Mn9J7J96o3k96L44
4685F5J70k83Q0j97j9K69q0Q3j12np6j03N09J00l80l62K26R0J78L0j68m0nr2J46
4710B4P5p0o4k10L60k37J46l1Q4l49K47J31J43k97L7J76l60L98q4k48pl41M98
4733B1J42j43n7m6kJ91k5lJ0j02J01n5J1J81k91J47j83k9N7N2On9O5J17l8k8N5
4760I5k13O8k57N04k82J37j78P3j02K48N1j67K70k40R3j40J89J02j85j52J99K4
$$ y = [251, 134, 245, -73, 48, 30, -39, 136, -29, -165, -131, -40, 129, 180, -367, -133, -126, 351, 254, 21, 34, 126, -63, 189, 120, -95, -153, -237, -63, -91, -116, -213, 227, -2, -109, -60, 183, 222, -180, -16, 166, 42, 273, -18, 17, -116, 72, 125, -160, -87, 146, -146, -197, 84, 104, 258, 12, 181, -171, 275, -128, 107, 87, -71, -3, 300, 155, 130, 108, -165, -144, 157, 76, 117, 71, 191, 110, -120, 145, -72, 174, 40, 27, 269, 70, -152, -78, -74, -133, -116, 80, 17, -279, 65, 235, -48, 32, -165, -184, 85, 5, 88, -24, -29, -105, -208, 301, 401, 21, -341, -115, -25, 153, 183, 15, -25, -30, -122, 24, 99, 29, -35, -245, 115, -122, 24, -7, 77, -272, -25, 106, 249, -48, -11, 165, -195, 203, 119, -129, -136, -477, 21, 163, 20, -37, -83, -85, 106, 81, 78, 88, -14, 87, 32, 43, 224, -67, 80, -103, -132, -75, -23, -17, -76, -11, 106, 68, 40, 95, -118, -50, -307, 197, -85, 52, -126, -53, -155, 93, 144, -23, 247, 7, 100, -40, 149, 251, 66, -86, 113, 137]
4782A37J19l67J8J14j03J68Q4j27k17J3L71l06Q4j08j68K80J5Q9K1k07j4J72k09
4805a41K50k88n2J29K60j04K60k62j59o8K10p8J35k31J3M9p0J51N0K09m02q3J30
4828i2J44J52k83J72k75JM03j16j40r2j12J27L23k5k16j43Q4p5J87k42K13j31
4850a36K09r0K17N3l19J81k06j93L65K40k70k21o2K50j23K36m41K63q8N0K99k82
4872f8J23n2J5P8o9N3J06k40N7p9J81j54Q5k19J53L3J17r4j07j8j35J70K40Oj76
4897Fj00O4J33r0R2q6J3k63K36R7N0o3l03L21M7m5K38l91j02J05O1J55J42m7k19
4922E1rm0J43j28J06l8m26M62j68J25k14q6L96j31Q6k52J99j79RL32j91M4l37
4945b46L27j71L79k82P7k5J14k04lo8M8O6J28k65j1L90l28Q0k35J17J26J66k33
$$ y = [137, 256, -111, -93, 21, -82, 86, 170, 43, -174, -161, 210, -96, -12, -120, -288, -8, 7, 96, 117, -90, -104, 68, -141, 109, -179, -231, -102, 158, 54, 314, 52, -107, -175, 35, -43, 92, -139, -126, -77, -147, 4, 54, 263, -139, -222, -92, 52, 204, -79, 93, -182, -181, 222, 106, -34, -126, -238, -111, 212, 187, -29, -172, -88, -163, 24, -218, -5, -136, 73, -17, 200, 253, -66, 115, -91, -284, 81, 321, 51, -170, -232, 18, -105, 131, -310, -47, -135, -85, 214, -68, 55, 3, 18, 96, 27, 80, 186, -54, 3, -76, 105, -49, 36, -183, -30, 3, 120, 26, -81, -99, -234, -64, 176, 182, 6, -94, -30, 103, 13, 105, 19, 32, -231, 5, 102, 152, 89, -214, 107, 154, 109, 347, -44, -146, -41, 20, 175, 317, 270, 51, 42, 2, 145, 17, 123, 85, -341, 121, -47, 78, -136, -222, 174, 43, 129, -123, 76, -103, -94, 238, 47, 91, -246, 81, -90, 289, 7, 84, 59, 173, -31, -34, -102, -54, 12, 140, -125, -136, 254, -74, 6, -229, -112, 14, 180, -53]
4968e3m3O6L1l0J72N7j92J07j56K56O0Mk80k48J26J29J58j45k53P4K74mp8J0k88
4993b46K19j97K63Rj32m0K06mQ5m40K55Nj39J40KR7o5k8j09L62K5k94k34J99Q6
5018B5j15K45j24j01M6q2k2L19k92j49O5K21M4J15j51j12K80L0l34L46J8m29J95
5041C8j54L24m9p8l7j97k2K26J62p1k17j07N1J13L53l89n0J48N9j47m8J24J00
5064A32k00J24L15k53K23m17Q4r4J74j85L15j3l69K35j59M15k95j17m8J17P0J17
5086A71m45M12j28m5K31l73M31l26j02N9M3J65Kp9k02nP4K49j01l8J15l81J24
5109a49k5J32j17K44J5Lr6nO3j86lJ6N0k5J6K47q6k10J80K2j80l49M31K86k91
5134a7J50m45N95j07k12K0Nk44J55K7L96k28j62R5j04L77k28M3j2J24j49j63J47
$$ y = [-53, -96, -30, 1, -29, 143, 200, 8, 115, -41, 215, 275, 279, -1, -249, -123, 6, 164, 19, -234, -160, 114, 110, 32, 42, -246, -27, -224, 39, 48, -84, -124, 82, 78, 163, -277, -22, -17, -156, -16, -14, 83, 18, -10, -119, 243, 268, -26, -260, -61, 25, -90, 155, 31, -70, -24, -106, -128, 191, -101, -250, -185, 36, 80, 195, 44, -68, 212, 242, -92, 254, 272, -157, 38, -116, 208, 159, 81, 44, -153, -175, 51, 213, 142, -75, -182, -131, -18, 335, -54, -104, 44, 103, -44, -92, 32, 132, -68, 56, 371, 118, 341, -76, 8, -86, 88, -97, 218, 205, -164, 71, -88, 327, 32, -85, -133, -16, 54, 171, -274, 138, 10, -35, 196, -177, 254, -72, -174, -115, -72, 93, 95, 16, -186, -191, -117, 132, 31, -7, 108, -273, -149, -174, -42, -159, 85, 100, 103, 7, 2, 65, -121, -124, -108, -58, -83, -67, 180, 94, -116, 64, 86, -94, -443, -12, 274, -17, 133, -312, 283, 176, -36, -16, -11, -255, -100, -73, 323, 95, -67, 28, -76, 301, 73, 116, 104, 228, 79, -84, 63]
5157F3r7j93K07L3O3p4N6j39j73J52L26j11j37PJ32jl25M43q0j45k4J91j51r6
5181g3J96j84r8p4L04j96j72J04K67m8J91k79j49K43m1j7P8r8K26j50j2j45L76
5204B49k25J21j95O3n6P2j15K0k53P7P2Q0K88jj82J7M8J49k78j3J49j73m8L62
5228B28j78n5kk10K90J64J63m17k19J77K09j9L7p9l86K13J92q4l2k4K21k32p4
5251a17L05l9k16j01M29l15K15j05k07J44l09J91K15j83p9L49j13j28J11l37K24
5272f6q5q2K57RJ16q0j52O1L6j55L15j19l12L25k9L7l9j84J3J96k4M2J78m34j91
5297c67L90K5r0J26j63j02M3M38r5k44J39k57K3L91l74J15j31J09j69N29j14k11
5319A1qj16J02J66j78o1L27k56k30N4J57j35J53j65K96K72j08j77k88J75m1J28
$$ y = [63, -34, -227, -20, 13, 76, 2, 58, -81, -254, -102, 224, 113, -24, -17, 115, 114, -211, 232, 152, 7, -17, 174, 23, -73, 123, -61, -159, -233, 71, -125, -297, -193, 74, 26, 217, -62, -211, 32, -9, -26, 52, -46, 180, 30, 18, -127, 249, 24, 145, -50, 13, -43, 29, -86, -66, -319, -242, -170, -90, 198, 197, 15, 32, 80, 229, -49, -62, 87, -86, -134, 228, 50, -5, -7, -217, 73, 237, 400, -17, -236, -59, 150, 131, 168, 89, -297, -84, 108, 24, -8, -32, 189, -43, -117, 188, 149, -67, -168, 261, -54, 161, 56, -151, -7, -316, -125, 90, -93, -172, 177, 64, -64, 47, -290, -66, -151, -233, 24, 33, 149, 69, -83, -22, 14, -141, 174, 55, -257, 68, 39, 76, 37, -147, -134, 62, 38, 80, 258, -176, -367, 23, 48, -42, 84, -79, -181, -138, 300, 205, -39, 100, -157, -134, 257, -117, -2, -133, -24, -193, 336, 222, 11, 3, -113, -11, 155, -23, -84, 243, -13, -243, -189, -32, -167, -14, -179, 117, 389, 281, 104, -184, -9, -50, 78]
5341G8rK2j58k8L3K09r8q4N0j35J03K20k66N3p9J35m32L93J57k31k46L02J58m3
5365A04o5k13K01l7k86L10K68k85l1m30M02R6K51l71J61j88J40Q2j00Pq8m4N0
5388f6K29J60l74r9l4M42l31J91l06N6M3J53o3K36j98P9p1KN5J4k06k19L59N3
5412A05k30L06k17j04m0L8J60j77J71j87M02K1J0l24Q7L5oj05nR4q3j71R4L81
5436B55l45J8P4j76LJ41M00k72l29m7K45K15j80p9K14j88j9K23j97O0O2k07L93
5459B64j69k74J15p8k06M96kk25q6P3r3K61k0j98J15j01J06n2P8j67K08L3r0J32
5483A20j38J17j19j8pKR6Rj08m3o3K58o0p3O9k95L34p9j79L69l11rN4K49j33j04
5509f2J9J22L1j63P4k41J23J50l29J20J83L31k92j62J37j49J46j60J97j96N2p4
$$ y = [78, 69, 91, -67, -95, -62, 147, 49, -35, 15, -120, -17, 203, -63, -10, -89, 46, -386, 7, 164, -67, -313, -11, 147, 104, 39, -174, 27, -10, -296, 14, 282, -3, -34, -464, -62, 34, 285, -86, 75, -113, 27, 109, 9, 16, -72, -116, -66, 163, 323, -51, -150, -184, 258, -73, 118, -188, -132, -89, 64, 1, 237, 39, 118, 47, 49, 104, 118, -88, -307, 52, 105, -125, 181, -36, -140, -180, -142, 18, -159, 12, -175, 227, 248, 258, -66, 21, 56, 50, -55, -60, 34, -49, -220, -126, 255, -90, -72, 2, -174, -171, -30, 370, 98, -231, -278, -33, 182, 2, -77, 137, -51, -70, 153, -44, 16, 78, -129, 264, 95, -179, -64, -142, -348, 148, 146, -79, -165, -92, -185, 76, 56, -142, -27, -128, -22, -74, 4, -163, 45, 78, -12, 120, -18, 99, -20, -38, -45, -43, 53, 62, -46, -89, -152, 106, 46, -27, 42, -253, 81, 2, -177, 192, -119, -128, -74, 175, 42, -62, -43, 79, 110, -53, 21, -220, -97, 53, -276, -156, 27, 358, 66, -96, 41, -108, 38, -122, 75, -121, -69, -143]
5531a43m4P8k1k02R8J99J65p6p9L9N7q6K63j63j04j27K60J47l98l8L38q0q8J00
5555I5J53o2K2l81K38k2K35l36L5m6R1K41k80Q7k34L9OK61q4p1j52K18lk23J34
5580c9J66k15j1J58j16L81m61l9R2k07L11m1O0j40k27J25K55K7p2j08J5%K94k97
5604h9J04j16K65j25K5q3K91k45J9j17J47J29k84j14L08j10q6K12j75J61j92n
5626h0K23m0k27R8Qm0M61l33j08K08j84J13K24m52j18L24k02K37k17M9j11J01
5648f6O5N3M6J9n9q4p7L15j02Qj31q3J7L88k14J6R5l76K87N2j11M6p2q5j9R6K02
5675B26q1k32mk23M59K06m21j5q3K96J45j45k2j23j93N30n02K06j39L3L0R3J86
5698B27m47K25k25L63j71J48j05k58J03J40j67J1Q0q5J46l8J27j42l1J29J6R2
$$ y = [-143, -187, -109, -130, -332, -234, -35, 130, 54, -25, 14, 71, -15, 248, 85, -19, -146, 114, 261, -137, -175, 163, 83, -5, 95, 248, 186, 208, -173, 65, 43, 278, -58, -23, -69, 22, 263, -17, 70, -164, -125, -119, 142, 58, -13, -165, 53, 50, -173, -39, 127, -88, -99, 59, -57, 324, -137, -176, -84, -291, 20, -21, 39, -101, -328, -203, 52, 79, 7, -101, -86, -86, 208, -89, 15, -101, 164, 39, 64, -19, 272, 27, 46, -71, 76, 205, -79, -193, 115, 5, -81, 131, -44, 117, -75, -80, 143, 103, -124, -26, -18, -58, 403, 70, -38, 170, -14, 99, 323, -129, -247, 77, -125, 112, -105, -56, -167, -66, -1, 52, 98, 117, 58, -26, -103, 212, 110, 118, -13, -96, -79, 309, 95, 111, 206, -170, 117, 169, 58, 104, 32, -53, -72, 24, 226, 145, -87, -91, -314, 145, 351, -70, -85, -168, 128, 273, 128, 106, -17, -210, 320, -182, 24, -115, -82, -52, 41, 227, -220, 5, -220, 143, -28, 120, 15, -243, -140, 0, -167, -156, -76, -161, -15, -53, 74, -68, -99, 30, 46, 138]
5720A38j23oL9j09l8r4J66K97j72j91K0J95l23J01J86l08J10K9J67P7j14r6mO2
5744Ik32P0N9N4m3pK60n1j46P0j95k5N57n57K51J23l11m5J57R2k75J38J11q4L13
5769B93K1k33M9l17L68o7L45n83K38l19r2K28J24k5o3j49L9K36J29j63r9R9M4
5792A03j92K45j38n2K1K2n9k6j36j7K05l1J19L2j85J13j67M4J84n2j02L7J81j26
5816B3o4k5R7p8q6P2J87j80J53j41n2K2L51r3j31j13n2K1K3n8K00p2j94K84Mm1
5842E7m6J16l33K56N0J13l35J23j00j08L43q3j73J58l12K3L83j30n0m9n7J71L2
5865D9Ll03K22q0Q3J62r7R5O3m10K20K88k53J08m03QJ05Q6Q3l00N0J44K48j41
5889C0Q3M9j98j8J67n9q5k75K47K10l35J02N4r6P0O2%J56j39J69m26K55R7K0m9
$$ y = [138, 15, 9, 48, -61, -99, -193, -27, 270, 98, -93, -73, 122, -201, -100, 86, -222, -112, -83, 84, 161, 47, -49, -53, 9, -223, -153, -94, -40, -83, -90, 170, 119, -27, 43, -152, -177, 380, -177, 74, 197, -114, -159, -2, 90, -185, -47, 64, -20, 293, 314, 81, 130, -187, 181, 114, 459, -124, 114, -205, -297, -69, 55, 30, -33, -182, -143, 93, 222, 59, -40, 59, 103, -89, 156, 18, -34, -13, 9, -50, -76, -212, -229, -24, -55, 64, 96, -89, 24, -143, -99, 85, 33, -69, -32, 149, 23, -41, -66, 31, -47, -133, -61, 126, -54, 99, -42, -94, -72, 279, 186, 55, -58, -110, -89, -66, -124, 76, 4, -190, 94, 98, 57, 11, 127, -206, 50, 100, 213, -122, 1, -99, -207, 136, 53, -120, 38, -274, -251, 132, 2, -48, -97, -154, 17, 49, 52, -251, -29, -109, -26, 136, 39, 134, 197, -213, 7, 295, 42, 150, -253, -245, -140, -54, 29, -271, -221, -77, 171, 30, 113, 162, -36, -54, 113, 54, -31, -306, -59, 151, -184, -82, -28, -124, -54, 8, 8, 164, 25, 194, -232, 23, 120, 140, 91]
5914I1l56K58J56j4P8mj00j50l0J37K7K7o1j41M1j01N04m07r2n5L79J76j98j58
5938Gm5L3K6J38m4k03J29j52Q2J36k71K17j65K46j17L83l32K03l06J95m23L00
5960C7J3j5J02j1j16K11m9k43j87K28M0R2J72k29k2o5K9J28k36P3J01q3R2PJ37
5985B06k51M1k00J80J65j67r2K05j10k56N37kj91r2K26m78K56K4%Rm3qj9K94k24
6010A0j07L3J39p0j29L4N5j3M04k95N4j09mjq1K16k13J64j76N7k55K56J11l06
6034b26L06p6j33J69J43k66J90q5M8l23L6j3K77N0Q3K7k29J88k36j32K67J3p5
6057Cl2O0j7PL6j51l06M65k68J07L08j73Kj55J95Pl57L31l18K37J1qk91J28J14
6082f5J24k59K72J8k17K48k44K33r6r8k5K73o2k44J36L3k9l1P9J61j55J27k17
$$ y = [91, -265, -7, 149, 135, 213, 209, 109, -41, -71, 66, 93, 120, 59, -82, -41, -142, 362, -45, -137, -192, 187, 363, 165, 7, -38, -5, 21, 159, 115, -88, 41, -111, -29, 107, -164, 53, -112, 134, 17, 400, 68, 271, -35, 160, -263, 37, 50, 35, 137, 126, 10, 221, 172, -71, -258, -30, 10, 102, 274, 45, 23, -42, -13, 115, -121, -48, 53, -30, 62, 69, 206, -45, -4, -204, -24, 141, -26, -118, 87, -23, -279, 258, 256, 65, -27, 199, -279, -23, 1, 1, 10, -33, -41, -60, 234, 10, -97, -64, 75, 5, -124, -90, -35, -48, 356, 61, 115, 6, 2, 1, -80, 136, -77, 87, -89, -32, -287, -31, 80, -226, 80, 4, -129, 40, 183, -83, 107, 22, 70, -253, -217, -230, 47, 97, 180, 207, -22, 166, -70, -202, 65, 78, 3, -29, 31, 14, 21, 57, -94, -400, 65, -203, -96, 212, 39, 41, -114, 81, 88, -269, 62, -256, -19, -8, -16, -307, -179, -65, 59, -200, 72, 90, -127, 121, -123, 110, 14, -84, -109, 164, 102, -142, -6, 27, -2, -33, 46, 207, 52, 179, -38]
6105c8j15K14p0K24k66l23L73n0K52j58l2j02J31j3J30j90P1k0n5P4J40l2r2P4
6129A27N8k79q0K37j43OK3J46q6L09o8j58j61L04l24J95k73OQ4R9m5o1Qk49L61
6154C6k99K94P0j87k93K25L13k28J45j30K46k37J98J37l57j10l1J29M9J90k72
6175a12K22j65K3N6O9r9j17J10J1j05K28J31j59j56J24o8K98k37j35q0J37j8M3
6198AJ51k11l6Q8J64l8M2j73K05l45L7K28j87j7Q2l4J4K14k89J86k02Q0P8M9J04
6223A91j67j3j68K50M7o4j30j67Q6M16j94K2k46oJ64M9K26l59R6mj7j0J41M7l5
6248A55j71M5J16ol22K40j00J47r8J65l6j3j17k20J61P5jj7o2J9J79k79Q7k0q0
6273a53J90PM2Mk89J26R1M5o6k4r3n3M76j14m3j17PL3k2j48L99l56l04M10p7J44
$$ y = [-38, -153, 61, -9, 215, -51, -374, -1, -51, 201, 43, 11, -91, 40, 27, 157, -33, 38, 18, -37, 37, 177, 145, 53, 127, 185, -94, -174, 63, -80, -74, -51, 95, 9, 318, 250, 92, -69, 235, -89, 106, -167, -161, -77, 22, -23, -84, -76, -325, 36, -263, 31, 101, -86, -379, -154, 159, -69, 76, -54, 192, -45, 153, 290, -67, -177, -208, -79, -30, 160, -112, 110, -55, -32, 24, 93, -6, -123, -13, -2, -107, 121, 252, 93, -63, 61, -7, 291, 54, -81, -161, -24, -42, 1, 152, -59, -95, -7, 157, 119, 161, -12, 193, -152, -115, 113, -74, -91, -9, -43, -29, 185, -104, 82, -120, -40, 38, 87, 191, 24, 11, -157, 93, 140, 76, -54, -221, -135, 281, 87, 109, -137, -143, 21, 70, 296, -63, 33, 29, 12, 2, 143, 190, 155, -16, 29, 145, 139, -183, 57, -43, 104, 6, 171, 135, 122, 5, -215, -54, 21, 20, 3, -59, -40, 139, -140, -53, -73, -153, 37, 44, 86, 90, -199, -73, 18, 63, -3, -27, -120, -173, 303, 189, 146, 29, 36, 69, 47, -101, 298, -58, -362, 48, -29, 115]
6299A15j36j29j9L52l29O7J17o1o8J07m0m6J6J97j51P4k6P7R6l00Jm5J99r9m2
6324g3R9j23j1K20J51j39k51K04P9l15M40l41J19m6L5K6j20j12L40j90r0K62P3
6347B37j82L1l04O2J72N6J97l84J4J54K34m66q5J24Q9m6j24J79J84j24n5k5l0
6370i2K83n7k84J60O6j13L11m55J3J93j68N53m12K2l0J24l17L56j06k41J35l0
6392h9J86k54j3K79N1k41R3q9Q7J9J28l18K76K11m70j7K19j49K62k2J08j19L7
6415A75j52j76K07M4j71K28k16J41j9J29j89j59L18J7j8j51K85k52k3j18K1l3
6437a12j19J89J10j53L44k75J11ql8q0L06k55k6m5J56q2J59j83j59K3J16N8j23
6460h6J18j11K05j92J23Q5j77Q6k33J69J64l7L0j61J60r5J46p0o1j74P2P0J0j70
$$ y = [115, -21, -150, -169, 183, -146, -79, 38, -23, -91, 16, -24, -70, -54, 143, -8, 66, 40, 117, 213, -87, -86, -131, 68, -31, -73, 26, -97, -108, 112, 263, 124, -127, 77, 156, -159, 281, -60, 59, 13, 48, 74, -46, -158, 182, -8, -98, 164, 237, 55, 86, -218, -156, 16, 72, 269, -115, -101, 53, 287, -179, -264, -140, -51, -97, -221, -42, 142, 18, -37, -62, -92, 191, 134, -150, 10, 76, -37, 274, -181, -168, 25, -143, 410, -2, 20, -10, 114, -203, 153, 47, -194, -59, -89, 97, -157, -170, 109, 160, -81, 12, -77, 10, 29, 157, -161, 115, 326, -144, -161, 58, -91, 171, 149, 257, 138, 175, 23, -153, 54, 98, -73, 155, -61, 80, 61, 190, 1, -158, 160, 177, 159, 8, 293, 41, 18, -100, -79, -112, -231, -42, 68, -85, 259, -16, 95, 87, 49, -31, 275, 20, -6, -51, 105, 23, 182, -1, -160, -137, -21, 37, -86, 32, -79, 126, -66, 57, 142, -35, 51, -182, -13, 151, 114, 144, -17, 143, 48, 194, 124, 63, -111, -39, 31, 41, -129]
6484a29k1L36k27p0J13JP7k00n9K14J30j40M0m9Q5k70L99k24k50K16K22j61q1
6507d8J26Q6j99L34r9j96M0o6k1J69l28K91j6m2l11L08j36K79k39M7k16K39j94
6530a92M59j74j18N4k16M35k93j63K45O7j67M4j44O7J32K53k68K2k29J90j16j3
6552a25J96j9k3J21j69m6j31K21P1k36K4k30M38r7Q0j24m0Q2J64k15J97j86J38
6575I1M5j3p0K1j88M5j55mL16Oq5j12J1K02j00J23K1q4m6m5K41n7m76K45O6rJ28
6602A17J96q9j43Q1n5J18l24J59R4l20J16L3J20j05r7J73J7M5l7k15J73O1J65
6625B83n0k06j4Q9j03J82l23J79j08J9j77L09M9J0m29q0L64k06L43r5j50J18j02
6648i8KL12j69k42J1J69L2k07L36j24J36M1j12m4M9J5k81K4J19k9jJ32j14J75
$$ y = [-129, -150, 186, -41, -111, 2, 3, 80, -120, -179, 35, 165, 25, 65, 16, 101, -169, 230, 6, -244, -28, 194, 33, -48, 78, 164, -35, 299, 200, 4, 44, -22, -43, 126, -202, 89, 73, 31, -280, 28, -108, 171, -68, -21, -237, 2, -192, 267, 93, -25, 29, -187, 248, -45, -208, 37, 104, -63, -19, -163, -96, 36, 289, 21, 43, -186, 4, -112, -125, 71, 52, 29, 150, -19, -65, -196, 25, 96, -140, -116, -346, 92, -5, 75, -49, -89, -7, 157, -58, 139, -47, 91, 136, 123, 53, 74, -114, -69, -224, -228, 88, 94, 9, -103, -92, 110, 10, 133, 154, 70, 24, -21, 220, 163, -313, -68, -2, -11, 117, 313, 224, 81, 162, 107, 225, -99, 60, 154, -166, -50, -17, 103, -2, -99, 74, 91, 136, 99, -116, 57, 118, 283, 233, 27, 13, 102, -1, 181, -142, 37, -71, -52, -229, 80, 129, 139, -290, -370, -6, -212, 131, 36, -114, 4, -98, -96, 216, 47, -195, -184, -15, 17, -190, 146, 22, 158, 199, 87, 43, 92, 107, -174, -150, -31, -60, -61, 71, -43, 132]
6672A32m4N2j57J46j65r8O6K1L0J48qK7j37n9J1j90L44J81k91q4K2p2K56j47J92
6697A76j86M1k66K07J57k05J58l1J5n6J91p1j23j0Qj77R0P6J78k30J33k32L45
6720A88q5L1k65J15J5j04L07k05%j55n5Q4k1K84r5k46K89jL3j94j53J32j08K05
6744dJ61r2k04K56j7k04L72L5m65J90n4j08N3K37k02Mo1k3L19j49J07k42K46k47
6768i2l9K98O8j09l67J07N9J19j73K19J08p8o8m2J2nJ22j47J70m8r5J42l54J12
6792h1qk6K14j05P1K04j45Q1k25K1j64M05l16J66m7j52JQ6J77o3Nk07J08j76L16
6817A40o5j19o3J66M7R8J09l09J53j51j58K20O0J6k07K25l14K45k4Ml24L28N0
6840A27L8j55j29K32q0J13Q9m29J00N8j60L13O1j2j28k45M43k02K5p2k48J66L2
$$ y = [132, 88, 140, -17, 129, -36, -134, -68, -47, -17, 131, 123, 150, 13, -46, -35, -225, 119, 300, 9, -75, -53, -125, 131, -16, 176, -10, 31, -235, -28, 129, -76, 82, 51, 66, 10, 201, 130, 7, -3, 5, -172, -82, -6, 172, -58, 75, -157, 188, 103, 134, -131, -16, -1, -105, 202, -3, -3, -158, -213, -129, -150, 134, 39, -207, 82, 81, 114, -80, -233, -101, -209, -4, 157, 65, -139, 117, 100, -104, 268, 303, -162, 28, -26, -134, -81, 156, -46, -42, -103, -126, 193, 44, 151, -91, 155, -92, -131, 167, 235, 126, -241, -134, -75, 44, -129, 90, 198, 120, 52, 10, 22, 17, 139, -8, 162, 114, 19, 161, -193, -81, -89, -115, 99, -6, 65, 269, 124, 205, -20, 1, -163, 242, -74, 92, 45, -107, -106, -20, 157, 94, 99, -108, 0, -176, 140, 75, -44, -107, 59, 106, 204, 313, 4, 157, 6, -152, 68, 128, 144, -63, 162, -152, 93, 69, 73, -251, 77, 127, 165, 10, -119, 113, 33, 146, 235, -194, -94, -36, -196, 117, 178, 166, 38, -207, 236, 34, 59, -13, -261, -95, -63]
6863f3q3K42K39k88Q2j25N4j60Lm8Q3K23k06N2k4L8Q3o0N7j91O4J12j12j19K5
6888a22j53L91m4J88l79Q1O7o2m4J72k58M03k26j29Q6N3kn2J3r6l4q9K31N4j07
6913e8k3OK92j76R0k08j34L08o9oJ78j82N7M5j52J68k82J1q0M51k57j47K55p8
6937IJ61j13r0R5j8R1j57J3j16M01j28j27j22M05j81j73N0q2RK6l3n8J89%l6J5
6963C0J85j17M2j61o2J57kj46L0L8N3l2mJ43l02R5n1ok9R1K2Jj48J25K79o8j07
6990E6o2K08k48N7J06m0q2j50J48k88O24k43k17r4K42J23j91K0QO8j51J4J13J16
7014A37n1k30n7L17k85J73m6p4M48j70k24J15j74k4P2j56K94p5J8p2J72J95l71
7037f8J54N1o1k6j94k4K76k80M4JK26k08j07K56n1l3K00j42N5r9J36j08O2J4O0
$$ y = [-63, -146, 96, 335, 47, 129, 4, 58, -102, -99, -147, -64, 159, -47, 5, -19, 19, 102, 42, 99, -92, -28, 84, -28, -147, -122, -275, 116, 72, 260, -119, -38, 29, -33, -77, 95, -163, 240, 14, -115, -29, 24, 22, -30, -17, -113, -147, -236, -5, 49, -58, -81, -75, 217, 41, 131, -77, -211, 97, 28, 22, 200, 18, 75, 120, -32, 136, -146, -135, -215, 236, -21, -168, 87, 9, 170, 57, -33, 62, 44, 135, -22, -9, -125, 276, 148, 21, -101, 304, 123, -50, 0, -82, -73, -47, -80, -138, 51, 51, 15, 30, 215, 98, 140, -21, -83, 74, 72, -74, -44, -6, 47, 15, 11, 154, -148, -53, -104, -110, -139, -48, -26, -25, -173, -48, 231, 163, 56, -6, 202, -46, 11, 117, 77, -5, -155, -7, -295, 329, 86, -131, -225, 17, 140, -51, -31, -23, 45, -106, -92, 21, 137, 86, -144, -201, 116, -169, 4, -42, -116, 332, 162, -62, 53, -121, -145, -73, -229, 65, -10, 8, -64, 108, 303, -68, 86, 137, 76, 50, -144, -168, 108, -172, -128, -127, 99, -109, -216, 40, -11, -44, 156, 14, 69, -30, 106, -2, 60, 74, 134]
7062A34K41l59J74j64n1j43j25L87N8l91M22j06L9r3J0J81J8n10K86O9j59k8K75
7085A65k35K82j26j10J11j23q9J04p8j1qN5N0j15Q8j96K44l7J92k91%J88K18k24
7109E4k7m3M2j5J18k19N8k53K30L46j84l9O4j60K2n5J17N4r0j62J6R9J61j64L9
7134IK9M9L6j26J78j59R7j29J88j38j18J93k11J7K6J56Q6m15J11L10j16o8Mj91
7158a82K6M53j83k49J33J08r8m9n7M09l52J61j64J56j32L16j8l97N4M7o6L48k23
7181D1K08l13j32L15J18m66J6L18J61k67n2P7n2j19K68j10K09k53j17k2o3K02
7203c3L56m33J2J9j35L28J17p4k55L25j38O5L4l57L16l32J09J36k52n7L19J17
7225A87Kj49k28J24r3O7J72o9J15q3o1j50K57j47K04q9k75K97K9l73M76k52J38
$$ y = [134, 375, 16, 190, 26, -25, -168, -293, 94, 152, -239, 183, 77, 116, 23, 33, 214, 232, -278, 8, 77, -82, -110, 165, -70, 212, 86, -24, 87, -36, -125, -21, -99, -110, -118, -63, -13, -128, -40, -236, 8, -29, 163, -128, -128, 60, 278, 54, 27, -16, 26, 11, 129, -90, -32, -285, -55, 291, 107, 68, 132, -28, -6, -61, 56, 110, 20, -142, -126, -27, 134, -30, 9, 38, 87, 123, -3, 175, 16, 113, -16, 172, 34, -84, 109, -102, -85, -59, 97, 183, -232, -121, 189, 73, 5, 9, -182, -156, 297, 114, -135, -2, 106, 8, -41, -98, 311, -41, 120, -44, 112, -20, 296, 278, -119, -65, -18, -84, 264, 41, 249, -64, -196, 119, 237, -229, -213, 105, 266, -1, -53, 24, -28, -147, 121, 11, 220, -33, -150, -172, -235, -33, 323, -110, -98, -79, -214, 114, 231, 157, -98, 227, 89, 154, 188, -169, 147, -185, -76, 60, -192, -249, 70, 187, 189, 40, -188, -64, -157, -90, 82, 13, 128, 45, -16, -166, 91, -56, 148, 59, -216, 81, 110, -263, 213, -39, 99]
7248I9r9m9M6j25r8J47K22k71L57j60QJ7L8l48N13j54l5p9K30j73j19K00l83Q8
7272a28K69j14l6j19k6J60O8k84J28oM9q7%L06k86K6R7j97N0L00l80J69k9K58
7296A88o2j12O4l3r9N1Nj29n3L30j41j14K29R9k21Lr3O0L04k28l80K73K03k48
7320a04K33K9o4j91M3P3K21l69J44O2j54J8J04K68m13R1K4K38l04Q3J5J81j89
7343C9J19j86k0j55L78j62J33j23j81J60M3O8j55j07K56j50J25j49J97m7L8j85
7365f4q4J68j40K41J87m05J51k5j03N7N6jQ5j40q6jk2M3J23J01j85K0Q2L1L1k56
7391a36L75k07q4n1Rl6L99l39m3mL6J97m74M80j98J32k07K40r9o0k01R4N2J91
7415F6M9n9J63k95j18L41j83J12k33J48q1j40J88J64J05P3l11K4o1R1J06j38L39
$$ y = [99, 0, -49, -3, -128, -226, -79, 143, -128, 229, 69, 77, 94, 132, -216, 297, 143, 108, 29, 259, 86, -33, 167, -216, -128, 141, 27, -9, -128, -154, 6, 74, -210, -82, -88, -39, -126, -126, 180, -106, -80, 17, -180, -130, 170, -210, -41, -70, 188, 126, 14, 78, 45, -54, -3, 2, -127, -180, 150, 9, -105, 124, 223, 2, 5, -88, -28, 276, 48, -332, -59, 144, -104, 129, 158, 94, -97, -54, 19, 240, -129, 15, 77, -77, -59, 45, 313, -100, -9, 15, 253, -51, 32, 47, 228, 39, 158, -28, -48, -203, 175, 13, 146, 23, -158, 2, 45, 113, -42, -149, 107, -43, 82, -67, 130, 83, 121, -64, -148, 20, -120, 121, 308, -97, 54, 29, -74, -17, 39, 38, 123, -17, -103, -104, -126, -83, 40, 141, -44, -24, 58, 89, 120, -136, 239, 32, -52, -103, -94, -130, 269, -70, -113, -117, -81, 116, -358, 122, -76, 56, -151, 89, -10, -70, -271, -177, -125, 66, 115, 56, 219, -76, -194, 147, -36, 76, -157, -9, -90, -230, -42, 122, 227, 300, -11, 13, -48, 43, 149, 11, 350]
7438C50j95k40RJ70J16j75jN4L0K2k42R3r1J58j69J44J56j6m08K33n9K25j50K8
7462D2O8k97J55J78j63K25k19j55L6j16K32j0J05k16K38J26l02j0J73q9j24L83
7484B60j41JN0k05jk30M84m03Q7M1m4rK30n5j15J47k18L3J16p2j80L54j73k05
7508b48K55l6j8M8J41j73k26L53k17N5K94l08O4K02j26l46M6M13j56J65j9l46
7530a83K78k35K33j6j71j14J77K8R5q7j46Q2j6J95k70J50j6j17J98k13N3J24j42
7553a13o1K41Lk95L03J37k35j10l1Q1PJ06L7L8p8j90J49j1j15J08N5R0J38l71
7577a17J95k11J21J69k63M06m20J86k26J44K14l63J26p8m6K40k00J37J3m14L39
7598d8L1J58J5j08k4J15k39o3K95j81k6j48L30mn4Q4k23J57j29N8k4n2K5q3L4
$$ y = [350, 155, -85, -76, 94, 210, 35, 34, 88, 118, 140, -102, -9, -100, 58, -111, 33, 189, 173, -235, -2, -61, 164, 14, 42, 110, -187, -32, 146, -17, 208, -11, -166, -130, -246, -14, -24, 81, -135, 103, 229, -73, -83, 90, 1, -123, 260, 119, 120, 170, -35, -36, -266, 218, -185, -98, -57, -101, -110, 120, 65, -50, 97, -121, -88, 28, -44, -224, 130, -43, -248, 7, -29, -47, 1, 142, -31, -257, 96, -121, -66, 228, -80, -16, 186, 60, -286, -240, 173, 17, 182, 163, -183, 95, -140, 93, 77, -94, -208, -31, -3, 92, 5, -141, -59, -75, 120, -150, 0, -16, -133, 65, -148, -95, 29, -113, -174, 67, 70, -225, 78, 215, -20, -130, -161, -80, -73, 33, 70, 108, 30, -160, -11, -22, -137, -29, 26, 116, 254, -117, 78, -133, -12, 157, -106, 300, -120, 66, -160, -16, 198, -165, -39, -117, -163, 77, -123, 14, 27, -387, -48, -17, 141, 156, 48, 24, 139, -100, -163, 132, -49, -75, -223, 107, 103, 49, 133, -90, 67, -62, -4, -28, -80, -55, -138, -104]
7623a04p1L27k39J79Rlq3J64l04J46J1n1O0q9K92k45J20N1j95P4J30j21k09m1
7647a92N0K80j15M1k01J16J33P3Kj68p2P8J32k39J58j48L66j38k32L01m6j49L07
7670C37l50j02K7K29k30J17OJ51j46r9m0L22j29l4o7j7Q9l2Jk68J84K09q1j03
7694b6j29N7K02j8l2N4m0M2l4j68j1K88l73P3K12j76J57k61L40k02Q9J36k56Q
7718f8J38p6j93K57q6J34k47jOJ36l8j75R5J09r9o5K18l00J55J85L3l9r9nK54
7743B29l54l7Q1p9J92J98l83Q6lL3q8K4j19L29k96M03l45K31lj88L76k91j84K04
7767A6k01K05k1J4Q1q2r6o3L53m91K60j5M2p1J52k31J49J94mk28J25j1m21L46
7791BK5kJ93k19K12J68k82j97N8j3qR1J55j26o8K84q9K9k38j16L0Q0R9k38J49
$$ y = [-104, -175, 152, -87, 92, 101, 98, 15, 179, -125, 21, 32, -19, 41, -48, 244, -1, 119, 170, -25, 49, 179, 58, -151, -192, -142, 138, 23, 64, -137, -21, 112, 185, 187, 19, -53, 25, 157, -82, 76, -72, 294, 156, -76, 225, 179, 30, 337, -13, -115, -88, 141, -89, 28, 34, 185, 39, -60, -100, 222, 93, 59, -8, -25, 64, 32, 33, -235, -51, 158, 77, -26, -155, -98, 104, 86, 54, 108, 68, 110, 76, -92, -103, 185, -188, -115, 97, -79, 78, -183, 157, -45, 44, 180, -76, -68, 70, -6, -199, 58, -28, 106, -141, -142, -136, 0, -38, -213, -118, -9, -108, -173, 45, -255, -100, 85, 118, 79, -20, -25, 229, -125, -162, -81, -160, 32, 230, -153, -67, -70, -37, -125, -101, -220, 109, -187, 216, -129, 102, 99, -89, 287, -4, -188, 16, -185, 20, -1, 13, 94, 12, -84, -147, 206, -285, -25, -40, 2, -69, 83, -148, 1, 195, 191, -37, 88, 77, -344, 2, 27, 25, 218, -1, 211, 379, 97, -100, -42, -55, -63, 28, 183, 57, -11, 273, 184, 213, -25, -141, -111, -31, 68, -170, -21]
7816b1L8j17J23J02J4l71L54m5l87L02K5j4k96O8R0MK57j33j36K17k10J14j96
7839b18J74L13m95K13K9J05q5k5J1j46J45kq8k16J77M2L06k84M6lOJ4o6K82p3
7864A62o7j92J38J9K17n2o48M67j19J50j14N1n7m0m7R3J69n9m60K40J33kj42O0
7888a00J42q3R8O8j29J62l18K08L4J6N3j62Q6N5j12k89M51m37L83k56Nj84K81
7911b8N7K18k08k80L18k9L2j03Pj16K24P1k62l0J95p1J07r7J45K3j88O6J53l90
7935a86K16o7N3N5k5k0J81m66L93j80pL04k79l17M69O1o0j57J18j48J15R4j33
7958A4p4k19J56L21l25M4l1q5L38R4j36o1O8k63J43J47j19o4P5j52r0L44R3k44
7982b6J0J12j57N2K11j19j51O3L51n22K66o4k00J16k46J60O6K29j12p4Q0r5m9
$$ y = [-21, 17, -100, 23, 125, 139, -232, 122, 77, -310, -8, 17, 3, -293, -225, -135, -131, 126, -7, -143, 74, -136, -22, -218, -44, 269, -226, -13, 16, 121, 36, 11, 22, -124, 21, 19, -69, -285, -108, -66, 240, -44, 2, -1, 5, 19, -47, 235, 162, 95, -97, 41, 60, 277, 225, -423, 44, -75, 75, -39, 12, -45, -85, -132, -39, 130, 71, -389, -149, -16, -18, -160, -100, 42, -41, 57, 125, -4, 158, -160, 48, 82, 98, 151, -11, 75, 130, 18, -271, 180, -257, 126, -130, -125, -309, -28, 29, 247, 39, -241, 77, 48, 80, -23, -16, -132, 92, 163, -99, -129, 66, -5, 102, 5, 150, 173, -15, 51, 204, -186, 30, -37, 16, 71, 46, 26, 207, -259, 134, -46, -53, 251, -28, -345, 124, 185, 125, -32, 86, -62, 53, 147, 14, -60, -279, -123, 198, -127, -83, -114, -199, 139, 233, 97, 36, 104, -159, -16, 131, 12, -52, 23, -129, -219, 125, 218, -26, -16, 96, -61, -9, 202, 83, -68, -5, 346, -176, 90, 26, -174, -58, -304, -144, -78, 151, 39, -35, 45, -50, -99]
8005i9L3l8O5J99j58j15L3r0L95P7l01o7J22k02o0M07l55K2K09j79K04j56K07
8028A53l57K77l07K41O6j4r9K05l9K9j13j79J91j40l2l1Q8Q8J50k26L1m5M5r1
8052a09k40K41n5N08n45J10L01kk44n8r0Q2L8l8R6N9n4l45N90j39j68QK04q4k08
8077a42m3N4N3J07K02l52K37m0q0o3J2R9N8j53M5J14n4pL7r7P1p1L4q7J24n3N7
8104F2k2O4j93r0Km4L43m5m5J66k62m2J74j55J33J33r5l19N29j65n05L10R2J5
8128D1J7K9q5K18k6j94rJ22n1J3j99J00QO1K8q6p3l22L78j67L40j3m3J22J0n21
8154c02OJ75J93j56J62p7Kj69L6K13K21k63M5j58P9j6k12M91l21o7K86L1l64J21
8178d4j58J25J08j53p9K28m6K5j29p9N35J33m76
$$ y = [-99, -66, -104, -39, 160, 2, -113, -80, -170, 225, 302, 1, -66, 56, -146, -206, 201, -154, -132, 77, -102, 102, -54, 153, -204, 73, -234, 7, 73, 59, -40, 165, 126, 155, 42, -137, 54, -86, -118, -149, -61, 27, 177, -49, -18, -63, -18, -109, -349, -108, -163, 345, -200, -90, 211, 209, -35, -93, -183, -101, -63, -101, -5, 54, 0, -345, 245, 106, -62, -54, 150, 66, -142, -185, -131, -78, 29, 231, -121, 116, 76, -4, -67, -55, 44, 102, -51, -6, 108, 54, 47, 84, -13, 58, -13, 21, -66, 58, 5, 62, 40, 104, -89, -179, -177, -221, 122, 77, 32, 198, -64, -106, 68, -87, 46, 179, 84, -235, 294, 129, -376, -66, 26, 41, 58, 87, 2, 220, 194, 0, -9, 113, 62, 75, -124, -24, -16, 45, 73, -13, -86, -408, -30, -197, 143, 130, 87, 209, 219, -302, -296, -121, 72, -84, 78, 1, 3, -166, -130, 83, 304, 41, 86, -72, 7, -9, -221, 270, -51, -118, 168, 199, -165, -44, -202, -77, 31, -122, -201, 27, -19, 6, -123, -202, 333, 466, -10]
8191a0
$$ Imaginary data points
##PAGE= N=2
##DATA TABLE= (X++(I..I)), XYDATA
0@%%%%%%%%%%%%%qJ6j6J6j6K4l2L9m7N6o4P2q8J04j20J36j53J77k05K30k60K97
35A58l35L77m23M72n28N89o53P25q04Q89r84J087j198J320j454J602j765J947
53A022k149K370k621K906l233L613m055M582n223O023p054Q439j0410J3463j8886
68a1213L1459j19202m2418J75747O7970L506r4977m4084K9252P6441K8468m9498
80E1451j13937n4367K6193Q3012O4580j3230o6453k7732K7205P3169M6217l3393
92F2715p5862n2971Q64N6401L6156j9616m2037k3857L1298P4459M0503j7754n6918
105A3381n4099J099L8521K0864j2799m6109l3939K5013N4770M6012J2248l4714
117C0248l3743k884J2895J4825j2296l8555k1637M648K5473L4762Q310r017p8
$$ y = [0, 0, 0, 0, 0, 0, 0, 0, 0, 0, 0, 0, 0, 0, -8, 8, -8, 8, -8, 16, -16, 23, -24, 32, -32, 40, -48, 56, -64, 72, -81, 96, -109, 121, -139, 158, -177, 200, -223, 249, -279, 310, -343, 382, -422, 467, -517, 570, -628, 692, -762, 840, -925, 1022, -1127, 1243, -1378, 1528, -1705, 1908, -2147, 2435, -2788, 3235, -3819, 4620, -5790, 7673, -11213, 20246, -98956, -141374, 34373, 102343, 105849, 10872, -33212, -3960, 72481, 100949, 51451, -62486, -116853, -90660, -7648, 56932, 43702, -22751, -50483, -23278, 49891, 96108, 62715, -13147, -66118, -65254, -8853, 27303, 7687, -34350, -58207, -26909, 47550, 88053, 70299, 13381, -40718, -39619, -1098, 19766, 6967, -39142, -73081, -48068, 6702, 52714, 64962, 30248, -3495, -6379, 6516, 21341, 9045, -29510, -51147, -46499, -21026, 13736, 22046, 13029, 12951]
130A2951M651J5016O280k3732k9989k1091n392J8408J3609n97K525L444J6094
143A2177K4314K325j4067k0559k1267j085O587k137j775n030L876K3345J7911
156B4615O411k761j7589r359l17p760q973j4615j0953J3624K3740K1936J5247
169C3246o709j0680j09r14m83r364k4033j4849k93R663K1182J0105J8M447J206
184A2433N469M323j1524j3262r065n678N688K989m498K577O208J2908J7070O48
198B6286j1014j1394j1731K442N129p855j0264j0028J666K2000K0595J0357j2
211B6177j3010o047L813k743p376j5327j7305K057J4121J4858J1869k051k131
224F905Q663P638K866j0872k6531j6953j64R758J5641J857q619J449J1319K0732
$$ y = [12951, 17602, 32618, 38898, 15166, -14823, -35914, -41306, -22898, -9289, -9886, -7361, -3917, 12177, 36491, 38816, 24749, 4190, -17077, -18162, -11575, -13712, -15487, -20517, -16641, 6704, 24615, 31026, 28265, 10676, 1317, 1000, -6760, -15733, -30348, -41301, -27677, -3937, 17999, 33246, 26537, 15857, 15748, 14834, 14351, 4987, -19046, -33895, -34188, -24525, -3343, 6762, 6780, 11227, 12433, 17902, 22225, 10701, -2561, -11626, -17304, -11616, -8627, -13125, -10548, -4340, 8568, 25638, 26286, 15272, 3878, -7853, -5411, -282, -8137, -18401, -28429, -26763, -4763, 15832, 26189, 26177, 13167, 7120, 10933, 8190, 814, -14513, -31818, -29761, -15640, -782, 11087, 9036, 6905, 15568, 23206, 26072, 15200, -11331, -28284, -28448, -18690, -3049, -1192, -9811, -8362, 2957, 23689]
238B3689J6770r267k3142k0926j1004R052J0601l979o955n160Q209K4990J6633
251B9511p6j2431k0194o116N696L14m273j1437q686J3014K0971J6181N242j3230
265A4486j2828J163M298L733q029k2092j2260L519J4246K0372O228o104k646J491
279E577J0112Q819q710j6457j4303p817Q846R852O21j9k525M928J4044O206l428
294A5746r516j3119k021N225n54k525p719m550J2470J6026J2015L465j1806j1363
308A774k591j051J617n413j3465m114N327J2707J8125N631l315k613m941r23r58
323E797j0711r508m128J033J1476Q162N28K085J172N163Q777l592j1081j2867
337g694j1176K652Q683K897R70l120L98J2540J0744L674m674j4576r765j4J446
$$ y = [23689, 40459, 31192, 8050, -12876, -23880, -14828, -4227, -8206, -15161, -20321, -12112, 12878, 29511, 29435, 17004, -3190, -9306, -3610, -3296, -7569, -19006, -27692, -14678, 6293, 22474, 27716, 14486, 1658, 2821, 7119, 10852, 2823, -19269, -31529, -28010, -13764, 6608, 12836, 6732, 4086, 5577, 15689, 24508, 15798, -659, -14962, -22779, -13933, -4081, -3460, -3479, -6004, -1076, 12968, 19174, 15746, 6230, -6889, -8910, -3685, -4239, -6764, -14483, -19033, -6563, 9463, 21478, 24943, 13137, 1774, -817, -1868, -251, -5664, -19129, -23243, -17916, -5209, 12916, 18547, 15232, 12619, 7678, 6755, 5797, -4914, -14422, -18550, -17517, -6041, 2121, 2649, 4734, 5906, 11069, 19846, 16254, 5173, -7694, -18870, -16218, -7535, -4638, -3668, -6788, -6390, 6150, 16894, 20568, 15894, 1318, -8447, -8461, -7015]
352g015L499k026n641L911Q313Q567O674n518q054j975j756R89k664j0848l991
367a7535M007R294J3662L607n330j887r52N078N001q004j2197j0820n052P731
381a3397Q914K836J918L52L753R806J787n123p673j0313j214L060j617j493k621
396a1025J991J2814J0722K810l373j1191n890K640j57k880q659r572L911J3172
410d687J4060J0130l875q249j637j11J029m322j3285q254J584Q397J2719L638
424G137m516l94L122P650N456r520j5328j0210j460J0794R900k229n602m177N758
439c619J6827R370l906j2108j5400k713P854M247j359r013p878O955J4144J0908
453A4309K707j0311r491J168M319L564m135j4121n693N182J1822J2657l63r047
$$ y = [-7015, -3516, -5542, -11183, -7272, 1041, 9608, 16282, 10764, 2710, 735, -1021, -32, -2696, -13544, -17535, -13528, -4234, 9428, 13035, 7705, 5818, 4866, 9944, 14945, 6941, -5256, -16076, -21128, -13397, -4483, -1647, 271, 623, 4376, 14182, 15969, 10846, 3173, -7140, -8354, -5294, -6911, -8404, -11025, -9034, 3780, 14502, 17312, 13939, 2748, -3142, -502, -659, -3539, -12198, -21770, -17859, -4687, 9373, 19503, 15628, 7379, 5742, 5631, 6660, 2338, -10947, -19201, -17617, -9220, 3499, 7137, 2621, 2227, 5349, 12999, 18455, 8935, -6393, -16603, -18063, -7269, 2631, 402, -5200, -9377, -3619, 13208, 22578, 18672, 6564, -8836, -11549, -3695, 552, -807, -9820, -17698, -10743, 3401, 14309, 17016, 6705, -2786, -1618, 2701, 6265, 2130, -11991, -17684, -12502, -680, 11977, 11614, 2567]
467B567l238K980R012N258j1076j6854j1565L84J4886J3298J026m332n174L809
481I81J3142N828n302j2992j4763j536P921M701J89o174l543R340J3101P687k238
496A6342j3721j0500Q91M223M461m043j1497j661R501J4544J2853l302j3506q694
510d109k493O752N431p230j0212n239L654J4585J0672p98n363o110R64P849K87
525H640o825r301p442M515R628L626l34m579j476R509P968N02p766j4007o300
540a3642N236O068M050m312q053J756R473J0940O391o910j0883m311K39M753J225
555B020q128n414J010O719J1409L201n271l813j900L907M264o541j0024p352J56
570a5757J1853J1194J383k609m908N54Q966K949n452j1290j2524j570Q722O991
$$ y = [2567, -671, 2309, 11321, 16579, 5503, -11351, -22916, -22532, -7646, 5652, 6678, 2346, -2828, 981, 14123, 19951, 14649, 1657, -13106, -14642, -6721, -2020, -1831, -8005, -11548, -2208, 10893, 18580, 16342, 2621, -7879, -6988, -2765, 1696, -2347, -13844, -15505, -6004, 8540, 21393, 18091, 4585, -4109, -6602, 150, 5581, -1649, -11861, -17100, -13446, 1139, 11811, 11013, 5650, -460, 504, 8353, 8640, 1815, -7486, -14928, -10413, -785, 2841, 2507, -2072, -3548, 5961, 13929, 14431, 6665, -7342, -13642, -8406, -2338, 1712, -2600, -10653, -8897, 576, 11516, 17907, 10997, 114, -4197, -3958, 795, 2020, -6108, -11522, -10512, -3793, 7616, 10817, 5546, 1733, -167, 3740, 8004, 1463, -8561, -15913, -15757, -3904, 7290, 8673, 6064, 1156, 1710, 10676, 13625, 8173, -3117, -15641, -17211, -8489, -1498]
584a498L644l077m135N333Q473N514k85j0503r560j643K020L987J6n742j95N451
600b200Q398Q489k994r317o101k551M415M508l997o207l548J571J0248Q719M97
615I930k594n640j584M604P2l643o053o782J372O569L961K540j329j548M910M124
631H909J48l290r536n361J517L050L477q81m468J855O657P968O220m332r757o642
647d466l368K978L394k945l509n53L329R481N801n67l339n358j524K523j985l971
663d079m110k247N809Q397L066l56m466k517M187K809j171o184j0414l632N824
678i084P908O942m05n055m78M255N495K823p348j0289n147r0O806N520j844k439
694b430q92K752P442J636m085m706m497J793M618j083l393l688r86P451P509J181
$$ y = [-1498, 2146, -931, -5066, 267, 8740, 14254, 13969, 3466, -6094, -7737, -5717, -1730, -1714, -7456, -7651, -2200, 6198, 14687, 11693, 2376, -3725, -6276, -1861, 2647, -1350, -7557, -11105, -9534, 714, 9433, 9930, 7336, 1696, 112, 4716, 4788, 1145, -4908, -11690, -10318, -3749, 212, 2752, 1423, -125, 4785, 8909, 9057, 5767, -3769, -9130, -7613, -4563, -1086, -1967, -6435, -4580, 2077, 10045, 16265, 11933, 2176, -4466, -7834, -4856, -1462, -4407, -7916, -8469, -5140, 4341, 10142, 9575, 6236, 878, -646, 1877, -108, -4079, -8189, -10436, -4627, 3770, 6836, 6480, 2014, -503, 3684, 6493, 5322, -862, -11276, -14908, -9084, -1176, 5766, 5361, 306, -172, 4083, 9578, 12401, 5053, -5236, -10383, -10473, -3667, 1853, 9, -2430, -3322, -570, 6872, 8508, 4423, -283, -4780, -2987, 1631, 548, -2845, -6533, -7519, -68, 7441, 8622]
710H622k214o450l240L454K646j042m359p342l94O157N846M937j046m123L09K166
726C927J172l20o540n598J20K307M480J670k812O30L005M497M348l711p549m913
742e287k909K655L713j447j228M94K910P834M361j879m105o623k376K019k36j270
758c374j406j544M148N089J548L61k924k048K648M69j285l953o109n79N391M834
774A266M279j060l932N26K470K888R79o445p621k856L11N224M711n56l07L5J457
791A369M766J051k516k983l713l51J257k134j104j24O55N149L799l37q28k944
807A012j411K513n27k743l796l900J777N815M192L515j254k995P58P53m74j458
823A777n809l347R49J883L376J700j148K488K899J420Q18m794n619j303K92K614
$$ y = [8622, 6408, -42, -3282, 172, 2818, 1776, -2583, -9925, -10319, -4162, 1684, 6621, 5575, 1452, 1761, 3927, 5099, 4779, -1761, -7359, -7239, -4932, -452, 1218, -1594, -964, 2041, 6538, 10886, 7175, -374, -5287, -8196, -5541, -1828, -3275, -4503, -4009, -1099, 6735, 11096, 9217, 5112, -1511, -3887, -1868, -2104, -3374, -4780, -6324, -2176, 2913, 4461, 4822, 1898, -150, 2498, 2967, 1682, -2271, -8380, -8959, -3568, 1266, 5545, 4485, 553, 1079, 3549, 6437, 7416, 971, -6650, -9506, -9195, -3971, 740, 184, -123, -88, 1369, 6135, 7186, 4670, 1687, -2026, -2377, -1120, -3254, -4358, -4482, -3827, 1322, 5121, 4784, 3956, 1012, -399, 2114, 1587, -1156, -4952, -8852, -7075, -1260, 2932, 6447, 5193, 2198, 2956, 3709, 3235, 1777, -4032, -7379, -6430, -4547, -1171, 529, -619, 1869, 4768, 6188, 7006, 2212, -3407, -4710, -4418, -1804]
839a804J674l481j343K200M577P161J317n480n184l880Q05M159j043l460k854
854f636o62O145O659J057k154m397k151M290K103j595m323o379M79O706N035J791
870E968m173n569J545N001M118J06q214p582n51M545P021K563m329l492O51M437
886B045P142N7o173o021l172K012M527j308k954j897R03O988N273j405l263m599
902a845m32M609J434l034n226n064L222P891M833J434m826m728P70L324J448j782
918B028p014m415J913M756N851J927l504r58J414K145K133m020n858k482L66M039
934a679L209j992j975Q42K753O018J113m868n551m061J116N539J136k302l127
949c829k780M477O834K810o13m864m582J503K177M29j642n537j306L504M096L635
$$ y = [-1804, -130, -3611, -4954, -2754, 1823, 8984, 10301, 4821, -363, -4243, -3438, 721, -322, -3782, -6636, -7298, -1153, 5506, 6563, 4409, 12, -2139, 2151, 4254, 2659, -1664, -8043, -7564, -858, 4177, 5968, 1795, -3774, -2229, 2772, 6890, 6996, -1218, -8800, -9351, -4806, 2215, 4778, 449, -3043, -2392, 2045, 9187, 9244, 3071, -2950, -6122, -4110, 417, -891, -3845, -5742, -4839, 2149, 7422, 6017, 2754, -1845, -2277, 2332, 3766, 732, -4494, -9558, -6336, 1555, 6388, 7822, 2996, -1732, -962, 2362, 3810, 2028, -4986, -9401, -7488, -2732, 3119, 5046, 1542, 584, 1998, 4143, 6276, 2256, -3602, -6084, -5718, -1679, 1530, -462, -2437, -1595, 1158, 7176, 8289, 3421, -2130, -6191, -5075, 464, 1600, -702, -3829, -6609, -2132, 4702, 7512, 6899, 2035, -2547, -1044, 1133, 1562, -80, -5617, -6923, -3419, 677, 4312]
965D312q52l982k65K129K158J436m634n734j034J765N309L844k663k319q20K471
981A121N039R95m609n769m715J175N037J947p17j971n79M389M849J353j686n608
997B51l592J549J205J56j363l979R53M990L886K548l101n386p46K205L137M32
1013C145m958n074p4L679O604L496l203k957j728J778L692p45m838l765j891K803
1029d036N191P12j255j187m43M342K150k163l347m520k93M366K572m33l022l792
1045e158K447N470L243P13m907n252J53K722K454k22m967l172J672L948N553J056
1061E753l504j989n13J687K480k751m564j926O27M656L811j366k519j760J037
1076h41M660J814l451m732m778P75N541L205N48k078k897K546M190J756n86n297
$$ y = [4312, 3460, -522, -787, 1342, 3500, 4936, 302, -5432, -6466, -4701, 608, 4452, 1789, -530, -1350, 1121, 6160, 7155, 2546, -3223, -7938, -6763, -1726, 221, -496, -2467, -3046, 1343, 6192, 7545, 5859, 251, -3341, -1792, -587, -431, -1794, -5773, -4820, 170, 4056, 6604, 3503, -1883, -2629, -424, 2713, 3145, -1813, -6887, -6961, -3282, 3322, 6818, 3615, 658, -1070, 708, 4400, 3655, -1183, -4948, -6839, -4036, 1155, 1867, 612, -575, -1018, 3324, 5474, 3311, -36, -4556, -4849, -483, 2089, 1656, -1366, -5158, -2711, 2759, 6002, 6715, 1808, -3444, -3291, -569, 1885, 1663, -3304, -6476, -4804, -856, 4697, 5753, 2249, 260, -253, 1434, 3914, 1163, -3401, -5327, -4700, -44, 3767, 2401, -118, -1878, -841, 3819, 5633, 2182, -2550, -7328, -6553, -1012, 2193, 2741, 663, -2234, 312, 4502, 6258, 5672, 375]
1092C75n577L4J817K709J094l073l06K153K726L460j129l984j934N3J714J797
1108A929k604l154n17J709N034L281j977k950k709J05L481J218k862l177l245
1123f438J461N447K849M82j807k942J492K227N9j082l844k109J709J811J306m99
1139A22k887O64L623K378J722l260n267o29J143K774J518l652k998M31L492O181
1155E355K193l315l694l168Q01L839j60l130l405j675L321N809J354j000k596
1170E29k263K864K200o97l142m430q15M216L549J830j361l956J03K866K756L79
1186D628m606n234p36K054L952K583k197k278N10J804L801J031l411k191j956
1201b246M44K341q28k066l82l0L150L113r38j309j966l80K177M92j494j816k150
$$ y = [375, -5202, -5168, -3351, -642, 452, -2621, -2927, -774, 1952, 5412, 4283, 299, -1635, -1582, 132, 1929, -675, -3829, -4346, -2637, 2397, 5678, 3701, 751, -1958, -1853, 1628, 2846, -16, -3193, -6438, -4977, 470, 3319, 3801, 1994, -948, 544, 2771, 2830, 1748, -2096, -4205, -2496, -685, 621, 122, -2765, -2101, 1522, 3900, 5622, 2362, -2905, -3534, -2391, 383, 1901, -1751, -4749, -4318, -826, 5355, 7548, 4233, 539, -2629, -1828, 2011, 1851, -1279, -4684, -6359, -3038, 2771, 4125, 3125, 529, -1734, 1130, 3330, 2633, -509, -4939, -5754, -1538, 2011, 3841, 2480, -1476, -1373, 1493, 4249, 4628, 22, -5212, -5948, -3894, 58, 2641, 444, -1834, -1324, 480, 4281, 5312, 1901, -290, -2246, -1802, 539, -289, -2355, -2737, -2767, 383, 3496, 2558, 1249, -717, -1097, 1080, 1572, 78, -1738, -3888]
1218c888J026L586J546O49j589j750J092J398m45n55k832j525J084R60O98O75
1234A30j148J209K330O73J85k361k932O56O34L62M15k648o13J896K313L266L37
1251D704l190k476j112N86K407q43k279p65r6K483L269J33k64j146j081J345o53
1268A022j533r28j565O18K584N85J80n43j218J898J479p72j064l147j374J651
1284b127J937J426M35k567J2J408J534J909r30l315j511m81P73J422j555j132
1300b762Q47J045K900J319j601j173q91K90J862o18k174j755q75J817L527R02
1316B660p97j808j600K149J918n27j605l260j530K303J925J586L68k097J60J862
1332A707J158O45k635l235l01N69J745J146j916j389J291J864L255L44l104k551
$$ y = [-3888, -2862, 724, 2270, 2919, 1330, -420, 672, 2070, 1625, 1070, -1762, -3287, -2203, -1243, -545, 130, -1018, 191, 2521, 3194, 3379, 1018, -1914, -1258, -624, -262, 153, -2495, -3108, -1212, 1101, 4367, 4704, 1514, -962, -2074, -1488, 919, 76, -2203, -2968, -3064, -581, 2688, 2821, 2557, 1411, 330, 1675, 1022, -511, -1439, -3004, -2386, 198, 783, 963, 420, -798, 1100, 2579, 1807, 743, -2404, -3778, -2127, -190, 1236, 1671, -896, -884, 524, 2058, 3967, 3037, -278, -1789, -2270, -1497, -75, -1630, -2762, -1915, -870, 2030, 3349, 1748, 575, -316, -26, 1836, 1218, -956, -2711, -3586, -1769, 1758, 2660, 1863, 55, -1545, 604, 2522, 1995, 390, -2870, -4400, -2097, -172, 1414, 1782, -315, -155, 1707, 2865, 3510, 875, -2360, -2661, -2092, -347, 799, -1117, -2506, -1215, 649, 3904, 4248, 1144, -1407]
1348a407j090J015K849l85k364j361n96K855L706N82q14k288k320J706K73m52
1364i1j145j665k50K663J158N53l53j517J193J710O5n80l197j859J519J901J758
1381A863j64k913q74J738J938K204j106l605j728m93J809K286o69j269p69M98
1397a254K982J873j202j034j548o79J348k64j427r30j064J416L019O00n57j072
1413B07j337J654J819m75j059l482j515K325K493J709K93k576p99J200J232R59
1429B648j715k859j032p9K024J840l91n17k36M57K174Q31k028j718j368k9K498
1446E00L93j284q75j013J847K647Q20q75k311k164J203J312L41n78k322q54K154
1463a059K152J454k7k361l68L74P78P38j586k459J04Q23J807J491j878j505K70
$$ y = [-1407, -2497, -1482, 1367, 982, -1382, -2743, -3339, -484, 3222, 3804, 2990, 702, -1618, 88, 361, -91, -1236, -2901, -3151, -488, 670, 1223, 870, -647, 546, 2256, 2321, 1741, -1456, -3315, -1796, 105, 1863, 1699, -1214, -2088, -350, 1588, 3792, 2686, -919, -2647, -3140, -1331, 955, 286, -983, -1752, -1254, 1728, 3601, 2399, 1365, -183, -862, 486, 222, -1205, -2135, -3199, -1783, 1236, 1836, 1279, 207, -1130, 524, 2343, 1868, 809, -2673, -4188, -1863, 630, 2339, 2632, 56, -743, 457, 1689, 2648, 933, -1926, -2958, -3037, -1013, 827, 436, -81, -317, 140, 2314, 3145, 1117, -601, -1969, -1998, 500, 893, -391, -1266, -2279, -432, 2215, 3035, 2160, -151, -2315, -1112, 200, 541, -37, -2359, -3213, -1059, 1093, 2547, 2520, 159, -209, 165, 943, 1681, 95, -2364, -2260, -1437, 370, 1861, -17, -1522, -1252]
1480a252J537K675j40k612k300q90J108L421L85j686j956k00K176L480r4j813
1496A839l249k146J744J601J79k85k194M09K656J787R14j293l238O36J518O74
1512A552k43k944k087J218K218K882L99k850k013O53J727K477p50l444k560k48
1528d013K705L378L39j471j507n12K345J862j045k080k217q59K524J282k74r51
1544d94j688J216K584J122k56k461k509Q67K056R51l97k602j382J618K101K583
1560C309k69k402k012L25R52J483r16k282p66m1K036K502m76j256n74L15K001
1577A929J38j323j504j536K68K279Q18m21j057j269J519K020N56p80k446k263
1593c072P30J567J370O69j902n90J197J116J537j20k206j207k45O80P24n98j325
$$ y = [-1252, 285, 2960, 2820, 208, -2092, -2982, -1874, 1547, 1932, 246, -1710, -1910, 266, 3746, 3652, 1839, -1410, -3556, -1812, -211, -32, -317, -2511, -2102, 554, 2341, 3255, 1962, -1276, -640, 878, 1552, 1309, -1635, -3722, -2504, -286, 2596, 2995, 145, -1868, -1215, 512, 2989, 2239, -1205, -3765, -4013, -1308, 2070, 2409, 938, -569, -1081, 1264, 3126, 2081, 1, -2216, -3075, -551, 731, 457, -494, -2182, -966, 1618, 2740, 2484, 23, -2486, -1619, 437, 1388, 991, -1611, -2993, -1375, 726, 3309, 3040, 638, -1374, -1049, -97, 1386, 470, -1812, -2578, -2619, -583, 1919, 1443, 187, -387, -72, 1929, 2067, 744, -760, -2296, -2028, 251, 1069, 648, -409, -1678, -159, 1861, 2417, 1637, -809, -3072, -2342, -775, 595, 1264, -638, -1228, -31, 1085, 2622, 2502, 296, -911, -1156, -476, 248, -350, -1675]
1610a675L01M16J867J133j037j061m23K5J653K75j817r35r13J187K092J024o28
1627A484j454j245N45J764P4l88j875j120N79J047P72N16p55J70O70L97K20p47
1645F54j541M13J76M4K9r08k53J138Q71J043j85j841p51L70O43R36n90j546n30
1664a828M27J566J636m66l77k41n02P18P5j483p00o72K64K017p2r25k8j5J208
1683F02J588o56j060j855p65J582J196M42m61j656j38J718J152N28p80k395n05
1700a463K29K64J096p28p93O34O85J291R18j039q35j23QN47k27j400n59K37Q68
1719c90J416rq36n37k05J026R99o34q41j027q08R14J212K59L42p51J43L99j58
1738E14N91o55j088J70q6m05L61m34M18Q77N90m1K90j532Q3M24j85O16n71j062
$$ y = [-1675, -1374, -958, 909, 2042, 1005, -56, -479, -454, 1199, 1474, -343, -1278, -2191, -1004, 1088, 2112, 1484, 30, -1215, -670, 1094, 1168, 780, -1095, -2215, -1636, -589, 183, 699, -56, 114, 784, 1181, 1401, 654, -887, -474, -298, -254, -225, -1133, -1386, -248, 623, 1666, 1481, -360, -1111, -741, -98, 838, 248, -1298, -1828, -1401, 165, 1801, 1335, 958, 717, 215, 933, 1008, -475, -1175, -1847, -1583, 434, 362, -563, -591, -606, 602, 2190, 1534, 474, -1381, -2146, -564, 632, 1074, 613, -1043, -1181, 537, 1689, 2217, 1437, -958, -1463, -1234, -970, 126, -602, -1395, -761, -76, 1215, 2133, 1094, 259, 136, 144, 691, 464, -936, -1495, -1258, -390, 1026, 1017, 181, -356, -561, 465, 1464, 830, -11, -1038, -1846, -932, 280, 539, 881, 130, 273, 672, 514, 1105, 450, -638, -468, -554, -959, -598, -1032, -614, 263, 853, 812, 1102, -430, -347, 77, -108, 508, -63, -1125]
1758a125K75J59J021J136l67n68m75l53M47J41n36k88q44K84Q68J31M55M94n17
1777C38M09N09q13m56n14p72M90Q70j93K55p04R4R34J92N23o42j213j99j01M27
1797e66O99n8l99K41J95O62O31m61o76k34l46K49k27q35J96L02N17Q48k97n59
1817a18J6N4R19N62p51j135r19j28J512P15j69l31q88K92J128j4jp06j507K33
1837a236O86M25M59p07m41J316N94N91o11j694l00N24P92N63j080j693L07P26
1855g79J707J108q22j413q74K6J590O62q24j254j139O98J783R22N2r79j038N03
1873g1J230p2m11j789p74J086Q82K91q7j231j18J549J020K06r05k161O1O27Q23
1892A56R17p35j091m15Q40J483R76j406j325o77j54J619N07j077q05Q3O17J625
$$ y = [-1125, -850, -691, 330, 1466, 1099, 531, 56, -297, 150, 291, -245, -533, -1377, -1093, -225, -94, 361, 855, 338, 747, 1256, 443, -13, -527, -1299, -809, 61, -132, 123, -581, -487, 447, 639, 1162, 520, -693, -892, -993, -566, 133, 75, -324, -83, 112, 774, 1405, 944, 268, 34, -312, -63, -290, -1125, -929, -627, -110, 738, 441, -118, -102, -48, 871, 1433, 682, -453, -1372, -1500, 12, 727, 558, 227, -661, -369, 759, 745, 744, 38, -1469, -1236, -550, -125, 334, -373, -814, 502, 1096, 1687, 1076, -618, -918, -394, 398, 961, -119, -1812, -1505, -779, 928, 2036, 1214, -199, -1073, -1047, 543, 1205, 381, -873, -2012, -1314, 469, 1391, 1443, 464, -574, -71, 1159, 1087, 676, -1113, -1887, -801, 81, 372, 285, -946, -1064, 485, 1505, 1711, 806, -1355, -1294, -667, 156, 1073, 338, -753, -1168, -328, 1155, 2131, 725, -600, -1277, -1431, 188, 695, -382, -1187, -1104, -487, 1138]
1910A138K83o06o88o57Q26J052n96r81j222k10J311J232M45p70j802J2J704O96
1928A167O80j324j853l34R62Q83J201q76j141J4O25J417J98j395j309l52O06J510
1946F79j06j259n87k36J644K039k52j472j585o42J776J455k84j268j629n21K214
1963c4J586O21j164k289m68J429J115L76j020k050j05J185J478J173j254r60j14
1980d95R14J016q6j742r63Q0Q32J655n03r34j183J12J836J349o52j154j463m33
1998a814J509J475o9o60j538k85J973Q99J43p71j859M16N98M46K2j411q00J001
2016g25J101M47J43j073m45N82R31M66o73j438r84Q67R04J219n24j421O8j02J360
2035G03R84j362q50o31qJ040O12k12l68n72N74J411M5q77o24q39O09Q88l08l03
$$ y = [1138, 1421, 815, 127, -530, 296, 1348, 752, -229, -1451, -1661, -350, 882, 1327, 557, -1245, -1233, 471, 1167, 1847, 523, -1330, -1664, -702, 181, 1382, 506, -635, -621, 4, 1421, 1619, 224, -1085, -1437, -831, 679, 573, -686, -1273, -1509, 135, 2174, 1922, 450, -1135, -1777, -1, 1454, 1170, -98, -1727, -2248, -34, 1552, 2173, 1009, -1280, -1748, -319, 796, 1172, 152, -1898, -2003, -818, 660, 1833, 579, -381, -495, 419, 1435, 1349, -393, -1356, -1276, -444, 1211, 708, -226, -1409, -1297, 539, 1888, 1236, 82, -1381, -1814, -305, 1170, 1101, 441, -1097, -1382, 591, 1490, 1633, 862, -997, -581, 17, 463, 485, -926, -1726, -725, 376, 823, 966, -107, -552, 30, 961, 1427, 754, -684, -1668, -801, 103, 1322, 798, -623, -555, -657, 703, 1687, 325, -525, -1156, -1164, -124, 488, 276, -92, -664, -90, 1321, 1366, 489, -135, -974, -365, 523, 215, -88]
2055h8q68k20Q75J197K34m54j214l89R63NP54o89p61k83N09M53R81K1p11l51j10
2076a46M64K06o88l31j99N4P49K9n39j6M31L84O01m22p77m42J3O24M83k12l16
2097e0r04JJ110P02K9j79j631R2O28J43M66n47r32O21M39N91M60n89n12L85q5
2118B38N20n25r93l33K93Q33O33k50r49M0J05Q55J093p00j128r40j79J245R67
2137H25R9n45j105o1R84R81l04l67j726J38R24M9O38n71q54L28P70Q37R1r59p17
2158e45J62L94M89J02j066n55K00Q50R77J18j124o14k59Q74M69j43n52m61m27
2177a111P99O28L5J17m14K10N04k77o6m22p29L86M57j86R3l92k29P80K24K04k1
2198E90j029j03m5L51M61K31o07q1L67J25M97k03j82j51o78K30N6o03N94l91K04
$$ y = [-88, -956, -1176, -301, 896, 1130, 676, -538, -927, 36, 41, 795, 106, -655, -938, -429, 24, 1005, 1026, 315, -36, -146, 318, 524, -164, -495, -694, -640, 109, 138, -401, -417, 14, 398, 999, 577, -200, -642, -629, -5, 478, 266, -50, -954, -953, 157, 859, 888, 709, -922, -830, -202, -59, 407, -140, -1072, -451, -12, 579, 1039, 450, -62, 323, 238, 758, 233, -760, -1093, -800, 33, 666, 416, -533, -493, -388, 467, 1560, 860, -268, -1208, -1387, -142, 825, 924, 379, -726, -787, 197, 1178, 874, 507, -1219, -1081, -157, -108, 530, -41, -895, -567, 203, 1040, 1131, 172, -545, -383, 11, 500, 602, -464, -1019, -819, 31, 1008, 1126, 2, -612, -871, 3, 472, 329, -223, -684, -1111, -312, 316, 351, 468, 54, 264, 768, 491, 425, 3, -726, -340, 117, -69, 24, -368, -597, 183, 407, 611, 590, -439, -542, -587, -236, 225, 456, -151, -232, 135, 260, 757, 554, 372, 221, -457, -227, -171, -774, -180, -571, -367]
2219c67O09o5K17jl1M4J96o10n12K92m04N74L69j34K71m96j12M11q1M4r7o10k23
2242g16L37J12O30j21k31J71r3J00M00n99Q7j72Np6k58k67L87L67J38N19o01l27
2264b08m3K02L09J94n95n3l72L46N53R7J00k15p82K42O53k25n6l80n35N01J61
2285a06j26Nk74K47R59J18p1l77p86R9K46N28j60l69n95N29Q7O74K33q42o37l8
2307f56J34N38M01o85k37K22L85P34k78m69j2K6R6J97m72p65R7n4J267L90o78
2328A81m07o37L90J177J30l97l10j237N83R38K12j42k99j045P09K39N60l1j273
2347f59m0L80L15L22l32q22J77M50O20O19p74o59j96O28M73L90p83p71j18K40
2367e40J197L94p75n33m97O01P00J5m62o22n51N21Q23KL2j93l38P78M74j77o09
$$ y = [-367, 242, 177, 394, 393, 362, 406, 602, -8, -520, -228, -632, -58, 311, 177, 448, -48, -160, 251, 170, 214, 117, -493, -716, -379, -267, 363, 242, 11, 182, 89, 189, 589, -10, 77, -95, -90, -166, -424, -691, -304, 63, 201, 720, 119, -208, -251, -49, 260, 454, -141, -194, -566, -220, 333, 430, 530, 315, -467, -225, 428, 203, 147, -233, -768, -267, -106, -232, -227, -501, -254, 705, 823, 752, 375, -411, -312, -66, 462, 302, -67, -662, -133, -46, 628, 861, 19, -618, -656, -522, 16, 417, -268, -505, -283, 102, 836, 558, 89, 77, 103, 199, 396, -76, -841, -744, -798, 469, 859, 181, -226, -863, -473, 704, 834, 437, 127, -1110, -527, 411, 623, 481, 182, -863, -154, 85, 645, 614, -659, -699, -319, -4, 318, -14, -836, -659, -209, 411, 1030, 256, -403, -599, 29, 502, 892, 109, -662, -780, -540, 657, 1051, 276, -257, -754, -153, 547, 562, 100, -522, -1073, -552, 271, 273, 305, 112, -226, 552, 1026, 849, 240]
2388B40j000k7P89K57J76m99p94L83N08N94M92r07r88J43L23O41Q4l96n50J3N20
2409BQ74L5p82j13o93K25R95n72j56m70k71R92O27k68k29l98k58Q79M14m30l50
2430E3j135M33Q17L86K54p64r78L02N20O55L60q77p34R1K82P37O0l86l43OL06
2451D5O77j33r3n66k71K32M68o0p76l85J51P09N23k06j04o90K62L31O05j12o45
2472c8r08J43O89N02K23k65o84M50L78o6q2q64o4K01J27O62j33o80L82R8N36K09
2494H16o34m67l16O7O84N55o47k72l21J63R45N4l80m37m91K49Q60J87l17o18j67
2515d87M75N37k49K61o26k54L63K26j34l31p04L16K22M79K74k72l40K30QK78O62
2536I34j001l34O1p7Q67N3k54n72j62J26P50j19J25m08m60OK91R6p9J3k44L36
$$ y = [240, -760, -787, 2, 259, 435, -64, -858, -475, 33, 627, 1119, 212, -776, -633, -310, 331, 415, 19, -531, -518, 2, 876, 911, 129, 16, -677, -452, 543, -29, -185, -655, -926, 66, 693, 425, 196, -202, -460, 419, 833, 403, 53, -1082, -649, 168, 554, 808, 44, -934, -632, -112, 543, 903, 26, -708, -617, -335, 402, 462, 76, -267, -261, 45, 722, 589, 496, -70, -341, -109, 359, 299, -477, -862, -711, -2, 521, 315, 211, -479, -217, 114, 719, 607, -38, -946, -803, -114, 388, 611, 346, -338, 112, 490, 424, 342, -522, -586, -385, -258, 404, 271, -409, -27, 71, 607, 816, 182, -285, -601, -534, 150, 705, 58, -214, -535, -372, 573, 627, 247, -190, -681, -432, 428, 615, 298, -320, -487, -12, 525, 276, 537, -89, -343, 20, 246, 112, -219, -923, -607, -385, 94, 368, 96, -244, -14, -6, 272, 934, -67, -401, -340, -417, 450, 503, 249, -323, -485, -359, 391, 272, 397, -11, -471, -465, -174, -78, -157, -144, -388, -52]
2558e2M83l33K50J4m90M30n91P36n44n53J81K71L67O98l06q42k35m2Q32m2j54
2579G8k34k80Q2O07L67q7l72k50k68M84J10j93j6n31N8M81q2n3n5q1K36M50r6
2602C55Lm85n06O69J64J47j20m63j57K53K7M64j42n48N6J21J38L20n08j83J07
2623b88k28Q89n0k24p5J82J7K44n6n80j87m0L07P55l85n68K83l18O38J20l77J97
2645B56o12j42M39J37m0P3l67L46P2J16N0k77k93K29k8N6m9j59j31M56K24K70
2667F26o42j29l40J73L23K68j41m61J7j33Q41J6k97j01n1m91M93J87j52r9k84
2688c77J84p4Q5J42Q7j01L69o6k77K97k24K04j64m9k48K8k43K52K17J2J6m6k57
2711b33M41j23j39R2J1k67J04K31k64J24j3L39j98k66N08p76J87M4n8K36Q8k63
$$ y = [-52, 431, 98, 348, 362, -128, 302, -289, 447, -97, -650, -469, -198, 169, 867, 561, -281, -516, -558, 274, 232, 78, -156, -436, -354, 253, 620, 533, 161, -89, -357, 127, 237, 44, 28, -503, -445, 36, -46, -99, -154, -235, 1, 451, 355, 358, -127, -633, 36, 200, 347, 227, -236, -393, -140, -113, 351, 209, -339, -283, -162, -24, 296, -212, -395, -288, -516, 373, 323, 99, 24, 206, 223, 467, 411, -169, -356, -396, -89, 666, 281, -287, -4, -322, 316, 436, 59, 256, -356, -498, -59, 78, 38, 111, -256, 90, 162, 278, 328, 51, -242, -13, -41, 15, -34, -193, -324, 132, 356, 626, -16, -145, -485, -312, 11, 279, 138, -323, -306, -439, 402, 418, 121, 20, -31, -522, -29, 158, 6, -93, -377, -193, -267, -182, -40, 47, -54, 315, 249, -28, 269, 45, 249, 85, 36, -212, -184, -427, -175, 42, 54, 70, 24, -233, 208, 85, -54, 38, 49, -218, -114, 117, -147, -23, -36, 303, 105, -161, 347, -429, -242, -198, -256, -20, 68, -195]
2733a95K14J57J24o7J53m65m14P7J88L70K7q2k33k9Q5K85k03M4l00k95M89P8k18
2756b10P5p8J91L44k41M84o36j57K25J65Q6M4q55K71K08j26O98l41n33J01J06
2777a79j56N19J33j16j24O7o5j45l8j2K08k87O14l5l56j27l27J18P89k95m51O1
2799b04l61M40N06R6K2p59k25N98OK76k27m83j30K68K70L88l75m41J68K44q5N2
2821D4j22l30K90J68K46J3k90p7J72mL16m71j57j10j66M74L16k3k85k75q2M20
2843F7J79l1j11m34p1L34K80J70n1o47L83Rm56P61l61K4m9j08N37k40m96Q3R5
2866a33J95K56j39m11J14J08L7L52k84j18k80J68J01N37o09O4k38K40L90j05k72
2887b7R9l98K06R9j26P8p8p5L02K52j1N4k57j47P5J14j92J35m81N2M0K92L40k1
$$ y = [-195, 19, 176, 300, 233, 386, -79, -493, -416, -228, 142, 169, 87, -146, -175, -90, 195, -8, 36, -264, -559, -70, 8, -210, -135, -213, -22, 322, 81, 565, -71, -228, -3, 162, 248, 292, -563, -292, -84, -210, 488, 147, -386, -285, -179, -335, 184, 317, 201, 77, 144, 79, -66, -104, -116, 92, -195, 419, 384, 28, -99, -426, -308, 481, 186, -265, -204, -565, -125, 381, 477, 499, -260, -485, 113, 119, 395, 168, -315, -445, -177, 93, 481, 106, -335, -167, 77, -8, 44, -78, -408, -118, 50, 296, 309, 19, -58, 114, 110, 426, -45, -202, -312, -478, -4, 312, 289, 4, -271, -353, 67, 246, 215, 104, -330, -401, -67, 213, 383, 332, -315, 68, 77, -379, 382, 21, 45, -4, -112, 425, 185, -311, -228, -133, 62, 318, 179, -232, -118, -10, 27, 379, 95, -23, -303, -135, -34, 503, -106, -42, -280, -40, 350, 245, -27, 72, -326, -120, -21, -147, -69, -147, -222, 80, 332, 321, 375, 118, -29, 46, 160, -32, 103, -378, -326, -286, 6, 346, 325]
2911C25k93j33q1P2M66j08m55J85j38J78L18m00K07l16k45N04N2m36J70k30RM50
2933A01J12J11n48r4J95L15k3L33n42k26RL68L29l15l26j97KK74K24j45J14k69
2955a98n3J17L38k15p8j9j34O03k30j01n0k2L8M38j95l42j96n01M00M53J07j27
2977C3l19J59L5J79J93J1l49k27J49J58J76K51n39J23j83L14J34j12k26N8k59
2998b41K25L30m27P1j34R6K81r7n3r7j62J44J75J59r8O1o41K1O03j81J60l60m16
$$ y = [325, 32, -101, -182, -110, 356, 248, -207, -22, -160, 18, 336, -64, 143, -173, -418, 86, 138, -298, -128, -358, -349, 101, 213, 324, -224, -318, -123, 192, 169, 502, -40, -266, -257, 111, 440, 125, -201, -398, -396, -122, 102, -43, 71, -198, -251, -134, 204, -11, -89, -108, -242, 361, 131, 30, -20, -42, -4, 434, 239, -103, -299, -800, -400, 53, 160, 33, -286, -127, -92, 87, 280, 291, -58, -285, -136, 22, 198, 449, -90, 33, -150, 164, 298, 186, -40, 18, -241, -16, 314, -113, -42, -176, -80, 201, 104, 51, -46, -208, -64, 111, 270, 172, 233, -408, -387, 216, 35, 195, -165, -581]
$$ [...]
8191B45
##END NTUPLES=NMR FID
##END=
