##TITLE=1H_Ser DHA-N-5
 CDCl3, 8 sc, 
 14.05.2021
##JCAMPDX= 6.0         $$ Bruker NMR JCAMP-DX V2.0
##DATA TYPE= NMR FID
##DATA CLASS= NTUPLES
##ORIGIN= UXNMR, Bruker Analytische Messtechnik GmbH
##OWNER= root
$$ XWIN-NMR		Version 3.5
$$ Fri May 14 11:00:12 2021 Russian Standard Time (UT+4h)  she@DPX200
##.OBSERVE FREQUENCY= 200.131506
##.OBSERVE NUCLEUS= ^1H
##.DELAY= (6, 6)
##.ACQUISITION MODE= SIMULTANEOUS
##.ACQUISITION SCHEME= undefined
##.AVERAGES= 8
##.DIGITISER RES= 18
##SPECTROMETER/DATA SYSTEM= spect
##.PULSE SEQUENCE= zg30
##.SOLVENT NAME= CDCl3
##.SHIFT REFERENCE= (INTERNAL, CDCl3, 0, 15.7039)
##AUDIT TRAIL= $$ (NUMBER, WHEN, WHO, WHERE, WHAT)
$$ ##TITLE= Audit trail, XWIN-NMR		Version 3.5
$$ ##JCAMPDX= 5.01
$$ ##ORIGIN= Bruker BioSpin GmbH
$$ ##OWNER= she
$$ F:/spectra/data/she/nmr/H-F/1/audita.txt
$$ ##AUDIT TRAIL=  $$ (NUMBER, WHEN, WHO, WHERE, WHAT)
(   1,<2021-05-14 10:58:38.96 +0400>,<she>,<DPX200>,
      <created by zg, POWCHK disabled, PULCHK disabled
       configuration hash MD5:
       00 E9 B6 7A A2 85 ED C7 34 08 36 98 17 FE 4E 26
       data hash MD5: 16K
       73 4B 1F 30 D5 DF C7 E2 56 47 26 96 BB E6 84 13>)
$$ ##END=
$$ 
$$ hash MD5
$$ B9 92 69 F5 13 1D 1C CA B5 EA 76 48 95 9B 73 57
##$RELAX= 
##$RELAX= 
##$RELAX= 
##$RELAX= 
##$RELAX= 
##$RELAX= 
$$ Bruker specific parameters
$$ --------------------------
##$DU= <F:/spectra>
##$EXPNO= 1
##$NAME= <H-F>
##$PROCNO= 1
##$TYPE= <nmr>
##$USER= <she>
##$AMP= (0..31)
100 100 100 100 100 100 100 100 100 100 100 100 100 100 100 100 100 100 
100 100 100 100 100 100 100 100 100 100 100 100 100 100 
##$AQSEQ= 0
##$AQ_mod= 1
##$AUNM= <au_zg>
##$AUTOPOS= <>
##$BF1= 200.13
##$BF2= 200.13
##$BF3= 200.13
##$BF4= 200.13
##$BF5= 200.13
##$BF6= 200.13
##$BF7= 200.13
##$BF8= 200.13
##$BYTORDA= 1
##$CFDGTYP= 0
##$CFRGTYP= 5
##$CHEMSTR= <none>
##$CNST= (0..31)
1 1 145 1 1 1 1 1 1 1 1 1 1 1 1 1 1 1 1 1 1 1 1 1 1 1 1 1 1 1 1 1 
##$CPDPRG= <>
##$CPDPRG1= <>
##$CPDPRG2= <>
##$CPDPRG3= <>
##$CPDPRG4= <mlev>
##$CPDPRG5= <mlev>
##$CPDPRG6= <mlev>
##$CPDPRG7= <mlev>
##$CPDPRG8= <mlev>
##$CPDPRGB= <>
##$CPDPRGT= <>
##$D= (0..31)
0 1.2 0 0 0 0 0 0 0 0.06 0 0.03 0 0 0 0 0.0002 0 0 0 0 0 0 0 0 0 0 0 0 
0 0 0 
##$DATE= 1620975518
##$DBL= (0..7)
120 120 120 120 120 120 120 120 
##$DBP= (0..7)
150 150 150 150 150 150 150 150 
##$DBP07= 0
##$DBPNAM0= <>
##$DBPNAM1= <>
##$DBPNAM2= <>
##$DBPNAM3= <>
##$DBPNAM4= <>
##$DBPNAM5= <>
##$DBPNAM6= <>
##$DBPNAM7= <>
##$DBPOAL= (0..7)
0.5 0.5 0.5 0.5 0.5 0.5 0.5 0.5 
##$DBPOFFS= (0..7)
0 0 0 0 0 0 0 0 
##$DE= 6
##$DECBNUC= <off>
##$DECIM= 32
##$DECNUC= <off>
##$DECSTAT= 4
##$DIGMOD= 1
##$DIGTYP= 9
##$DL= (0..7)
0 120 120 120 120 120 120 120 
##$DP= (0..7)
150 150 150 150 150 150 150 150 
##$DP07= 0
##$DPNAME0= <>
##$DPNAME1= <>
##$DPNAME2= <>
##$DPNAME3= <>
##$DPNAME4= <>
##$DPNAME5= <>
##$DPNAME6= <>
##$DPNAME7= <>
##$DPOAL= (0..7)
0.5 0.5 0.5 0.5 0.5 0.5 0.5 0.5 
##$DPOFFS= (0..7)
0 0 0 0 0 0 0 0 
##$DQDMODE= 0
##$DR= 18
##$DS= 0
##$DSLIST= <SSSSSSSSSSSSSSS>
$$ [...]
##$SUBNAM2= <"">
##$SUBNAM3= <"">
##$SUBNAM4= <"">
##$SUBNAM5= <"">
##$SUBNAM6= <"">
##$SUBNAM7= <"">
##$SUBNAM8= <"">
##$SUBNAM9= <"">
##$SW= 16.9725357007746
##$SWIBOX= (0..15)
0 0 2 0 0 0 0 0 0 0 0 0 0 0 0 0 
##$SW_h= 3396.73913043478
##$TD= 16384
##$TD0= 1
##$TE= 0
##$TE2= 300
##$TE3= 300
##$TEG= 300
##$TL= (0..7)
0 120 120 120 120 120 120 120 
##$TP= (0..7)
150 150 150 150 150 150 150 150 
##$TP07= 0
##$TPNAME0= <>
##$TPNAME1= <>
##$TPNAME2= <>
##$TPNAME3= <>
##$TPNAME4= <>
##$TPNAME5= <>
##$TPNAME6= <>
##$TPNAME7= <>
##$TPOAL= (0..7)
0.5 0.5 0.5 0.5 0.5 0.5 0.5 0.5 
##$TPOFFS= (0..7)
0 0 0 0 0 0 0 0 
##$TUNHIN= 0
##$TUNHOUT= 0
##$TUNXOUT= 0
##$USERA1= <user>
##$USERA2= <user>
##$USERA3= <user>
##$USERA4= <user>
##$USERA5= <user>
##$V9= 5
##$VALIST= <valist>
##$VCLIST= <CCCCCCCCCCCCCCC>
##$VD= 0
##$VDLIST= <DDDDDDDDDDDDDDD>
##$VPLIST= <PPPPPPPPPPPPPPP>
##$VTLIST= <TTTTTTTTTTTTTTT>
##$WBST= 1024
##$WBSW= 4
##$XGAIN= (0..3)
0 0 0 0 
##$XL= 0
##$YL= 0
##$YMAX_a= 313632
##$YMIN_a= -320172
##$ZGOPTNS= <>
##$ZL1= 120
##$ZL2= 120
##$ZL3= 120
##$ZL4= 120
##$ABSF1= 10
##$ABSF2= 0
##$ABSG= 5
##$ABSL= 3
##$ALPHA= 0
##$AQORDER= 0
##$ASSFAC= 0
##$ASSFACI= 0
##$ASSFACX= 0
##$ASSWID= 0
##$AUNMP= <proc_1d>
##$AZFE= 0.1
##$AZFW= 0.1
##$BCFW= 1
##$BC_mod= 2
##$BYTORDP= 1
##$COROFFS= 0
##$CY= 11.3945322036743
##$DATMOD= 1
##$DC= 2
##$DFILT= <>
##$DTYPP= 0
##$F1P= 15.9154993809931
##$F2P= -4.1035820241983
##$FCOR= 0.5
##$FTSIZE= 0
##$FT_mod= 4
##$GAMMA= 1
##$GB= 0.15
##$INTBC= 1
##$INTSCL= 1
##$ISEN= 128
##$LB= 0.24
##$LEV0= 0
##$LPBIN= 0
##$MAXI= 10000
##$MC2= 0
##$MEAN= 0
##$ME_mod= 0
##$MI= 1.114404
##$NCOEF= 0
##$NC_proc= 0
##$NLEV= 6
##$NOISF1= 3.799351
##$NOISF2= 2.8
##$NSP= 1
##$NTH_PI= 0
##$NZP= 0
##$OFFSET= 15.70392
##$PC= 1
##$PHC0= -11127.16
##$PHC1= 8.801
##$PH_mod= 1
##$PKNL= yes
##$PPARMOD= 0
##$PSCAL= 0
##$PSIGN= 0
##$REVERSE= no
##$SF= 200.130013532006
##$SI= 16384
##$SIGF1= 3
##$SIGF2= 2
##$SINO= 400
##$SIOLD= 16384
##$SREGLST= <1H.CDCl3>
##$SSB= 0
##$STSI= 0
##$STSR= 0
##$SW_p= 3612.71676300578
##$SYMM= 0
##$S_DEV= 0
##$TDeff= 0
##$TDoff= 0
##$TI= <>
##$TILT= no
##$TM1= 0
##$TM2= 0
##$TOPLEV= 0
##$USERP1= <user>
##$USERP2= <user>
##$USERP3= <user>
##$USERP4= <user>
##$USERP5= <user>
##$WDW= 1
##$XDIM= 8192
##$YMAX_p= 0
##$YMIN_p= 0
$$ End of Bruker specific parameters
$$ ---------------------------------
##NTUPLES= NMR FID
##VAR_NAME=  TIME,          FID/REAL,        FID/IMAG
##SYMBOL=    X,             R,               I
##VAR_TYPE=  INDEPENDENT,   DEPENDENT,       DEPENDENT
##VAR_FORM=  AFFN,          ASDF,            ASDF
##VAR_DIM=   8192,          8192,            8192
##UNITS=     SECONDS,       ARBITRARY UNITS, ARBITRARY UNITS
##FACTOR=    0.0002944,     1,               1
##FIRST=     0,             0,               0
##LAST=      2.4114304,     0,               0
##MIN=       0,             -320172,         0
##MAX=       2.4114304,     313632,          0
$$ Real data points
##PAGE= N=1
##DATA TABLE= (X++(R..R)), XYDATA
$$ [...]
380 11121 102412 -33107 -14989 65043 -71751 -66904 81377 7209 -35436 84265 -1313
391 -1313 -102633 25135 29215 -55609 56377 76093 -77249 -26069 43701 -65884 -9728
402 -9728 105163 -15318 -48297 53981 -42299 -77258 72129 36518 -46625 49630 17788
413 17788 -101954 3489 58167 -43380 22810 79412 -66788 -55315 53962 -38549 -27152
424 -27152 100983 2103 -72417 35995 -12237 -78573 61482 61615 -55260 17875 36014 -92742
436 -92742 -16496 82025 -29726 -3761 81059 -54561 -76548 59610 -5573 -38289 88335
447 88335 17088 -85294 20437 18964 -71698 42022 80735 -54380 -9411 46442 -76188
458 -76188 -29887 94896 -11070 -28960 68945 -37017 -81395 55009 22215 -44973 64834
469 64834 33541 -87919 -1657 39057 -56150 23099 89854 -50774 -38564 48704 -52752
480 -52752 -37975 90238 5479 -47138 51629 -17512 -85269 40921 46990 -42628 35934 41916
492 41916 -87264 -19471 58513 -40042 -116 84636 -38363 -56322 46245 -29796 -45408
503 -45408 78745 27003 -57734 23616 3811 -76948 27582 67007 -38683 4177 48476
514 48476 -69337 -35982 64767 -17916 -13805 73801 -20763 -70803 32913 4043 -40992 59455
526 59455 41188 -61837 -145 27716 -63081 7845 79143 -27603 -17858 47162 -52235 -49013
538 -49013 68829 9178 -30102 53373 -3211 -75141 21516 33016 -43783 35242 57287 -61231
550 -61231 -23888 40551 -46794 -7484 85176 -18445 -44128 39737 -27175 -54224 58602 29444
562 29444 -43919 33379 16102 -78201 2652 54338 -34692 12819 61484 -59690 -42959 49797
574 49797 -23603 -22294 74746 -3721 -59217 30403 -4235 -58145 45763 51042 -48507 8801
586 8801 29229 -71787 -6128 69152 -26424 -9896 60167 -44119 -53450 50714 -3581 -30214
598 -30214 64443 12343 -70530 16682 19952 -52102 34813 60813 -50586 -10581 40848 -57056
610 -57056 -17330 72769 -12100 -23942 50242 -27964 -61920 45815 21539 -34306 43526 22664
622 22664 -70045 2188 37832 -43222 16473 63377 -41016 -28965 37846 -36524 -25968 68250
634 68250 3315 -39636 32347 -8039 -60843 33724 38470 -38065 22511 31477 -64206 -13936
646 -13936 47239 -28200 -697 60219 -31609 -45479 34395 -11985 -33366 56417 19316 -50272
658 -50272 16692 9583 -56927 20344 54296 -33448 100 35088 -52158 -25074 53325 -8588
670 -8588 -17879 51134 -14119 -55180 28250 10962 -35671 41650 34509 -53735 -619 25899 -45202
683 -45202 7410 61065 -24425 -21390 37031 -33301 -35438 52925 10055 -31172 38496 2342
695 2342 -61829 20249 31141 -35112 24857 42401 -52528 -17112 37593 -32944 -6269 62322
707 62322 -15295 -39593 33198 -15937 -43963 49609 23922 -41680 23201 14569 -61670 9869
719 9869 45199 -32246 6833 44257 -44981 -31389 42466 -16537 -19015 56473 -5006 -50523
731 -50523 25480 2441 -44686 39654 34916 -44371 7713 22839 -52200 -646 53386 -22666
743 -22666 -9177 41885 -33625 -39450 43071 1454 -26901 47419 5090 -55422 17401 18254 -39249
756 -39249 27620 43138 -42092 -7565 29384 -38674 -10224 55777 -10447 -24399 36611 -19462
768 -19462 -44005 38863 17372 -30934 31857 14972 -54488 6486 30258 -30278 11336 44540
780 44540 -34285 -23571 31688 -22699 -18993 50658 1625 -36582 25189 -3953 -45172 29560
792 29560 30287 -31394 12651 22057 -48561 -7186 39843 -19182 -4707 41862 -24056 -37351 31204
805 31204 -5079 -26379 43009 12508 -43855 13402 11617 -42545 19299 40957 -29844 -4033
817 -4033 28011 -38139 -18271 46710 -7637 -18617 38529 -12033 -45061 28322 12791 -30722
829 -30722 32807 23004 -45921 1159 25157 -33964 6969 47897 -24397 -19325 30215 -24190
841 -24190 -26684 46418 5757 -29520 30263 -516 -47615 21368 27205 -30628 18841 29739
853 29739 -44609 -9955 33268 -24471 -5114 48349 -17894 -32285 29226 -11465 -31703 41570
865 41570 15841 -37866 19293 9892 -46798 13465 35845 -28076 4052 32686 -38816 -20183
877 -20183 36806 -12680 -14185 42766 -9234 -41383 24160 2916 -32142 32510 23773 -38713
889 -38713 6243 18731 -39949 4625 41469 -19671 -9408 30416 -26860 -27399 37065 936
901 936 -21337 33450 2152 -43504 16135 16665 -29496 22123 30274 -35279 -6855 24584 -27578
914 -27578 -4414 43032 -11436 -21259 26602 -12604 -32867 32763 14382 -26819 22806 10487
926 10487 -43433 6826 28503 -24189 8027 32407 -29817 -18559 27592 -14433 -15634 40181
938 40181 -417 -32083 19036 -204 -34943 25585 26215 -30455 8177 17512 -37850 -2984 34479
951 34479 -16713 -6469 33278 -20673 -29662 26904 -585 -22342 34116 8805 -40237 12697
963 12697 12995 -33460 16538 32904 -28671 -3815 24115 -31315 -11895 39461 -6049 -18371
975 -18371 29813 -11136 -36540 27895 12152 -27466 25584 17569 -40829 5054 21999 -28918
987 -28918 8608 37649 -23229 -16717 25784 -19250 -17956 39554 1531 -27222 24507 335
999 335 -38663 22009 21085 -27014 16229 21056 -38306 -4973 29125 -19320 -2081 35257 -17538
1012 -17538 -25367 25289 -7650 -24818 34579 9823 -31599 15784 6425 -36736 15541 28889
1024 28889 -25003 3141 22029 -30425 -12594 31093 -10593 -12401 33222 -9347 -32797 20517
1036 20517 3755 -25145 27862 16357 -34422 6074 15175 -28788 5231 31909 -18145 -8458
1048 -8458 24131 -20516 -20861 30531 2534 -19192 25738 -432 -35389 16111 15667 -23225 15799
1061 15799 22582 -29752 -4633 21137 -20413 -3741 34718 -9318 -20999 21962 -9007 -25075
1073 -25075 28918 11502 -25429 17088 9544 -35325 7822 23694 -20257 4917 26356 -25486
1085 -25486 -16528 26173 -10519 -13028 32559 -2921 -29418 18815 2012 -29126 22900 19512
1097 19512 -26779 6470 15250 -32000 -609 31148 -15339 -7243 26163 -18078 -24098 27101
1109 27101 -1227 -20308 28725 4538 -33755 12165 11568 -27266 15634 25761 -26508 -3662
1121 -3662 20556 -24019 -8280 34117 -9144 -16362 25655 -10354 -28324 25196 9068 -23089
1133 -23089 21909 10692 -33830 6562 19736 -22779 6369 29373 -22368 -12187 22992 -15764
1145 -15764 -13568 33259 -1135 -23391 20508 -1884 -28687 20412 16773 -23113 11158 16050
1157 16050 -30352 -1722 24168 -15881 -2665 28460 -16059 -20818 21711 -6040 -17308 27305
1169 27305 5843 -26917 12228 6649 -27257 12544 22506 -20556 121 18855 -24599 -9654
1181 -9654 27024 -8499 -11101 24844 -7930 -26246 18722 4369 -20352 20249 12667 -27582
1193 -27582 3227 14943 -22946 4107 27095 -16101 -9631 20099 -15284 -16151 27309 913
1205 913 -17671 19562 571 -28224 13330 15334 -20089 11472 18523 -25674 -4792 21038 -15892
1218 -15892 -4440 28973 -10309 -18031 19453 -5824 -20723 24255 9598 -22744 13188 8270
1230 8270 -28352 7240 22502 -18400 1778 22060 -22474 -12110 23788 -8901 -11695 27198
1242 27198 -4439 -24811 16888 2261 -22735 19053 15728 -25264 5150 13943 -26220 1380
1254 1380 26508 -14923 -7130 22382 -17020 -18030 24312 -1322 -16560 22403 1911 -28091
1266 -28091 12466 10207 -21956 12691 19822 -23519 -2567 18020 -20258 -4363 27662 -9226
1278 -9226 -13552 20242 -8922 -21150 22522 6151 -18764 16364 7588 -27375 6811 17118
1290 17118 -18626 5908 21847 -19600 -9709 19983 -11999 -9671 26669 -3140 -19009 15987
1302 15987 -698 -22213 17512 13306 -19727 8261 12020 -24093 -239 21127 -13220 -2821
1314 -2821 21708 -13906 -16379 18770 -3203 -14398 21936 3389 -22937 9819 6697 -21018
1326 -21018 9959 18712 -18428 -1164 15424 -18816 -7457 23297 -6715 -11342 20132 -7303
1338 -7303 -21128 16709 5088 -17006 15774 9682 -24359 3479 13577 -17760 3419 22381
1350 22381 -15242 -9410 18327 -12445 -12185 23923 -297 -16568 16921 -58 -23494 13846
1362 13846 12322 -17225 9024 14507 -22703 -2495 19413 -13737 -3317 23588 -10881 -15793
1374 -15793 18407 -5657 -15858 22257 5147 -20018 11201 5984 -22731 9261 17897 -17008
1386 -17008 1656 17078 -19200 -8597 21952 -8936 -8822 22485 -7092 -20064 15972 1277
1398 1277 -17613 17607 9403 -21406 5410 10868 -20402 2833 21589 -14294 -5371 17551 -15185
1411 -15185 -12504 22030 -2937 -13398 18517 -1899 -20953 12137 7520 -17014 10900 14059
1423 14059 -20019 -1340 14460 -15396 -1982 22846 -9931 -11475 16856 -8253 -14451 18970
1435 18970 3462 -15120 12886 4355 -21169 6631 14044 -13701 3591 16583 -17060 -7070
1447 -7070 17687 -9638 -7223 21074 -4208 -15317 13819 -1669 -16304 14877 10083 -16009
1459 -16009 5046 9634 -19006 1035 18435 -11653 -3690 17817 -12272 -12860 17222 -3705 -10868
1472 -10868 17743 822 -19339 8344 6538 -16098 8628 14250 -16528 -1719 14084 -15847
1484 -15847 -5275 20819 -7533 -9070 16234 -7621 -16614 15919 3731 -14098 12555 6251
1496 6251 -19672 4128 12442 -15525 3166 18839 -14865 -7239 15806 -11026 -8441 21358 -3088
1509 -3088 -13965 14183 -1097 -17344 12496 9658 -15393 7803 11202 -19510 -630 16860
1521 16860 -11517 -1470 18919 -12078 -11211 16570 -5084 -11318 17699 2093 -15652 10113
1533 10113 3738 -17920 8370 14374 -14451 1172 13015 -16994 -3653 18252 -8444 -6802
1545 -6802 17330 -7176 -14804 13553 -5 -12938 13924 6541 -18042 4399 9067 -16079 4131
1558 4131 16230 -13128 -3966 14273 -12617 -8238 17619 -3466 -9801 13870 -2228 -16811 10616
1571 10616 6851 -13314 8439 9972 -16786 -265 12929 -12775 -908 17802 -8955 -8694 12981
1584 12981 -6247 -10849 15928 2647 -13089 9384 4048 -16353 6158 12194 -12429 3042
1596 3042 13131 -14331 -5180 14643 -7401 -5354 16919 -4787 -12994 11220 247 -13047 12110
1609 12110 7916 -15043 4827 8251 -15769 1719 15632 -10559 -3178 14005 -11123 -9219 14996
1622 14996 -2662 -9956 14349 175 -16363 8516 5400 -13962 8236 11740 -15577 -412
1634 -412 11612 -13464 -2278 16885 -7787 -8133 13822 -6543 -12633 14058 2346 -12314 10886
1647 10886 4384 -17659 5620 10189 -13152 3875 13766 -13607 -4666 13789 -9433 -5607 17024
1660 17024 -3849 -11409 11912 -1541 -14082 12390 6869 -13315 6914 7693 -16223 2027 13771
1673 13771 -10802 -240 14436 -10531 -8145 13470 -4586 -8568 15144 -122 -13758 8848
1685 8848 3119 -14006 8486 10159 -13077 2147 9718 -13424 -2194 14824 -7167 -5036 13173
1698 13173 -6731 -11226 11801 682 -10762 11263 3958 -15058 4994 7101 -12378 3909
1710 3909 12655 -11433 -3117 10822 -9626 -5696 14425 -2859 -9231 11209 -2024 -13281 9490
1723 9490 5417 -11295 6919 7694 -14318 945 10839 -9856 -469 13701 -8067 -7636 11562
1736 11562 -4708 -8634 13282 1791 -11779 8095 3137 -13734 6625 9810 -10916 2165
1748 2165 10300 -12253 -3293 13106 -6534 -4666 13566 -4463 -11340 10607 285 -10934 11220
1761 11220 5203 -13584 4630 7077 -13305 3086 12664 -10099 -2014 11368 -9679 -6960 13729
1774 13729 -3058 -8229 12138 -1269 -13766 8671 4424 -12110 7971 8100 -13976 1155 9449
1787 9449 -11299 -769 13822 -8077 -6092 11408 -6165 -9300 12919 915 -10702 9482
1799 9482 2057 -14031 6328 7983 -11239 4006 10129 -12391 -2159 11133 -7887 -3682 13692
1812 13692 -4494 -9331 10400 -1717 -10379 10816 4518 -11684 6391 5568 -13037 3380 10325
1825 10325 -9115 311 10958 -9220 -5708 11501 -3800 -6391 11805 -864 -11401 8237
1837 8237 2426 -11200 7839 7287 -11386 2141 7613 -11277 -340 11758 -6383 -4338 10121
1850 10121 -5565 -8734 10762 159 -9166 9358 2569 -12688 4946 6066 -10603 4322 9452
1863 9452 -10103 -2261 9111 -7695 -4159 12225 -3224 -7948 9356 -1494 -10946 9135 4538
1876 4538 -10565 6589 5447 -12496 2138 9236 -8754 125 10995 -7872 -5653 10090 -3921
1889 -3921 -7316 12108 400 -10853 7958 2077 -11691 7558 7757 -10964 2950 7900 -10824
1902 -10824 -1007 10816 -6166 -3709 11647 -5200 -9198 10206 -270 -9179 10372 3086 -12623
1915 -12623 5975 5196 -11486 4244 9354 -9486 -818 9221 -9060 -4449 11844 -3458 -7018
1928 -7018 10330 -2333 -11106 9511 2573 -10334 7764 5084 -12063 2569 7055 -9743 1339
1941 1339 10538 -7611 -4617 9524 -5358 -6723 11658 -1035 -8961 8907 746 -11722 7022
1954 7022 5404 -9497 4736 6589 -10393 -782 9341 -6531 -2328 10723 -4898 -7246 9378
1967 9378 -1855 -8685 10213 2509 -9819 6145 3288 -10424 4294 8179 -8252 388 8268
1980 8268 -7754 -3961 10038 -3530 -5563 10552 -1953 -9796 7662 1610 -8947 7462 4987
1993 4987 -10441 2571 6236 -8823 64 9682 -6090 -3808 9263 -5442 -7451 10301 -169
2006 -169 -8046 8424 938 -10987 5790 4727 -9155 3715 7705 -9270 -1477 8179 -7171
2019 -7171 -2880 11145 -3951 -7407 9181 -2150 -8872 9540 2406 -9412 6386 4085 -10765
2032 -10765 3130 7667 -7980 945 9135 -8100 -4602 10110 -4307 -5380 11005 -1772 -9045
2045 -9045 8270 775 -9879 7863 5109 -9419 3322 6039 -9741 286 10010 -6701 -2513
2058 -2513 9866 -5778 -6631 9994 -1797 -7286 9892 560 -10185 5903 3378 -9296 4897
2071 4897 7419 -9176 166 7677 -8060 -2597 10524 -4700 -5380 9379 -3668 -8454 8681
2084 8681 1240 -8111 7155 2962 -10287 3205 6026 -8131 1448 8783 -7633 -3117 8418
2097 8418 -5565 -4637 10056 -1899 -7529 7862 -362 -9077 6719 4017 -8185 3779 5565
2110 5565 -9268 402 8172 -6247 -1472 9403 -5216 -5868 8815 -2250 -6322 8781 1173
2123 1173 -8490 5482 2929 -9097 4098 6918 -7618 682 7425 -7664 -2609 9578 -4166
2136 -4166 -4407 8936 -2709 -7890 7686 1076 -7990 6832 3575 -9407 2524 5718 -8507
2149 -8507 1175 8872 -6972 -2825 8295 -5469 -5372 9681 -1829 -6892 7876 -66 -9527 5888
2163 5888 4041 -8599 4082 6149 -9429 -96 7772 -7164 -1742 9886 -5284 -5442 8592
2176 8592 -2958 -7012 8892 1334 -8511 6060 2657 -9518 3922 6668 -7936 1423 7931
2189 7931 -8161 -2202 9091 -4919 -3866 9524 -2758 -7239 7731 -175 -7686 7223 3634
2202 3634 -9009 3837 5019 -8969 1808 8138 -6817 -1342 8290 -6217 -4607 9023 -2498
2215 -2498 -5478 8262 -279 -8597 5807 2663 -8094 4735 5423 -8438 733 6724 -7488 -944
2229 -944 8842 -4982 -4070 7673 -3556 -6581 7896 395 -7038 6182 2093 -8967 3533 5217
2243 5217 -7665 1843 7132 -7343 -2078 7430 -5096 -3487 8828 -2496 -6261 6771 -501
2256 -501 -7424 6398 3432 -7778 3733 4555 -8347 820 7433 -6321 -957 8132 -5684 -4328
2270 -4328 7762 -2277 -5366 8099 323 -8018 5407 2460 -7931 4273 5969 -7895 1030
2283 1030 6614 -7463 -1414 8558 -4498 -3698 8150 -3356 -6482 7490 282 -6867 6303 2640
2297 2640 -9025 3400 4868 -7993 1960 7523 -7346 -1835 7792 -5901 -3482 8935 -2651
2310 -2651 -5797 7268 -1014 -7768 6342 2888 -7800 4327 4585 -8717 1151 6900 -7034 -290
2324 -290 8181 -5778 -3772 7711 -3542 -5144 8366 -276 -7152 5715 1760 -8162 4619 5188
2338 5188 -7646 2192 6209 -7727 -990 7728 -5089 -2421 8316 -3678 -5625 6793 -539
2351 -539 -6236 6486 2107 -7813 3763 4132 -7798 2263 6783 -6637 -425 6747 -5941 -2752
2365 -2752 7936 -2631 -4661 6910 -963 -6900 5424 2033 -6941 4298 4608 -7934 1248 5467
2379 5467 -6603 -21 7475 -5128 -3055 6903 -3465 -5001 6981 -37 -6123 5366 1597 -7997
2393 -7997 3619 4668 -6744 1854 5849 -7290 -870 7037 -4943 -2327 7642 -2774 -5250 6343
2407 6343 -763 -6377 6181 2782 -7364 3397 4131 -7894 2018 6444 -6375 -178 6950 -5469
2421 -5469 -3295 7448 -2795 -4168 7454 -824 -6955 5401 2244 -7238 4673 4590 -7690 1789
2435 1789 5590 -7246 -166 7724 -4925 -2315 6864 -3830 -5029 7103 -173 -6322 5957 1439
2449 1439 -7966 3939 3930 -7654 2826 6090 -7352 -400 6188 -5614 -1982 7601 -3263 -4703
2463 -4703 6720 -1508 -6360 5887 1807 -6859 4521 3353 -8262 2378 5478 -6313 568
2476 568 6529 -5920 -2395 6727 -3399 -3766 7042 -722 -6050 5581 764 -6974 4945 3868
2490 3868 -6828 2193 4832 -6936 448 6375 -4722 -1486 6751 -3507 -4471 6268 -901 -4913
2504 -4913 6132 1255 -7035 3921 3214 -6741 2923 5154 -6214 179 5713 -5344 -2000 6928
2518 6928 -2802 -3742 6014 -1218 -6050 5685 1630 -6414 4323 3012 -7198 1998 4743 -6163
2532 -6163 558 6423 -5060 -2480 5999 -3402 -4096 6879 -724 -5811 5423 893 -6990 4187
2546 4187 3517 -6556 2493 4841 -6876 -311 6044 -4535 -1734 6961 -3409 -4624 6450 -1090
2560 -1090 -5579 5945 1630 -6803 4211 2825 -7075 2729 5254 -5956 293 5969 -5466 -2103
2574 -2103 6884 -2922 -3580 6786 -1412 -5884 5787 885 -6101 4981 3269 -6985 2299 4585
2588 4585 -6457 942 6228 -4905 -1924 6346 -3960 -3959 6782 -1225 -5215 5859 285 -6754
2602 -6754 4314 2752 -6273 3002 4279 -6470 156 5288 -5271 -1352 6547 -3640 -3865 5980
2616 5980 -1982 -5271 6119 680 -5834 4306 1999 -6642 2635 4394 -5780 975 5224 -5345
2630 -5345 -1812 5918 -3361 -3058 6641 -1612 -5057 5191 334 -5703 4718 2902 -6167 2442 3879
2645 3879 -5925 542 5705 -4408 -1425 5977 -3714 -3461 6096 -1051 -4457 5759 292 -6149 3993
2660 3993 2348 -5871 2825 4558 -5855 172 5340 -5103 -1452 6495 -3064 -3420 5932 -1948 -5150
2675 -5150 5502 698 -5764 4211 2269 -6715 2421 4094 -5750 802 5571 -5133 -1967 5905
2689 5905 -3591 -3163 6510 -1487 -5047 5372 -10 -6146 4452 2675 -6169 2736 3946 -6474
2703 -6474 685 5646 -4924 -1123 6176 -3858 -3556 6216 -1828 -4544 6127 145 -5834 4163
2717 4163 2021 -6260 3185 4350 -5888 1072 4889 -5429 -1159 6204 -3450 -2764 6354 -2380 -4762
2732 -4762 5661 139 -5284 4866 1798 -6242 2744 3277 -5757 1478 5342 -5014 -1130 5569
2746 5569 -3957 -2696 6247 -1926 -4266 5428 -596 -5650 4363 1843 -5729 3026 3541 -6099 844
2761 844 4660 -4690 -619 5649 -3656 -3072 5491 -2168 -4169 5652 9 -5209 3980 1536 -5958
2776 -5958 2914 3564 -5310 1101 4576 -5033 -1208 5517 -3326 -2386 5917 -2005 -4509 5243 -136
2791 -136 -5171 4651 2135 -5661 2462 3326 -5480 1115 5166 -4512 -996 5445 -3595 -2962 6125 -1723
2807 -1723 -3941 5528 -316 -5407 4049 1685 -5588 3274 3543 -5759 753 4479 -4899 -763 6073
2822 6073 -3592 -2769 5693 -2432 -4460 5650 -55 -5299 4634 1175 -5997 2911 3497 -5520 1194
2837 1194 4733 -5295 -1006 5582 -3873 -2487 6169 -2302 -4402 5343 -936 -5223 4875 1667
2851 1667 -5636 3074 2915 -5866 1341 4584 -4721 -409 5501 -4143 -2711 5819 -2317 -3347 5759
2866 5759 -724 -5098 4698 987 -5451 3427 3150 -5206 1350 4262 -5132 -262 5689 -3519 -2144
2881 -2144 5720 -2698 -3668 5402 -645 -4548 4606 934 -5349 2871 2761 -5171 1843 4244 -4883
2896 -4883 -659 5021 -3889 -2097 5754 -2354 -3402 5076 -1044 -4732 4408 1209 -4855 2893 2428
2911 2428 -5476 1095 4247 -4458 -576 5140 -3919 -2410 5222 -2302 -3464 5449 -442 -4678 3913
2926 3913 949 -5132 2886 3062 -5198 1251 4037 -4969 -666 5298 -3532 -2084 5824 -2629 -3851
2941 -3851 5061 -328 -4384 4548 1293 -5401 2862 2934 -5185 1403 4686 -4542 -612 5232 -4041
2956 -4041 -2241 5937 -2137 -3358 5331 -958 -4760 4514 1032 -5076 3241 2967 -5440 1134 4150
2971 4150 -4924 49 5406 -3857 -2182 5394 -2754 -3464 5408 -865 -4412 4435 744 -5567 3094
2986 3094 2769 -5210 1740 3887 -5229 -408 4980 -4007 -1589 5594 -2924 -3335 4985 -1009 -4304
3001 -4304 4656 964 -5031 2959 2277 -5258 1678 4243 -4775 166 4760 -4128 -1731 5212 -2397
3016 -2397 -2930 5351 -1142 -4390 4149 775 -4547 3349 2670 -5251 1588 3648 -4758 -6 5039
3031 5039 -3667 -1630 5030 -2763 -2977 4931 -494 -3910 4175 671 -4965 2969 2400 -4797 1618
3046 1618 3964 -4801 -176 4411 -3844 -1431 5212 -2190 -3272 4625 -975 -4246 4212 1065 -4691
3061 -4691 2838 2482 -5343 1382 3829 -4469 2 4761 -3758 -2085 5012 -2261 -3159 5003 -831
3076 -831 -4561 3786 911 -5148 3149 2798 -5044 1455 3770 -4662 -161 4998 -3556 -1744 5177
3091 5177 -2451 -3334 5117 -692 -4131 4594 902 -5000 3028 2507 -5013 1889 4218 -4635 76
3106 76 4651 -3905 -1688 5446 -2293 -2953 4861 -1192 -4333 4305 927 -4760 3344 2317 -5127 1734
3122 1734 3716 -4613 279 4746 -4293 -1715 5046 -2783 -2842 5020 -943 -4167 4275 377 -4966
3137 -4966 3173 2146 -4880 1828 3286 -4928 102 4347 -3644 -1253 4938 -2595 -3111 4581 -1114
3152 -1114 -3795 4216 605 -4634 2932 1955 -4729 2005 3487 -4223 162 4156 -3773 -1398 4858
3167 4858 -2243 -2544 4745 -989 -3967 4060 643 -4291 3212 2082 -4599 1460 3344 -4434 227
3182 227 4433 -3378 -1394 4504 -2388 -2758 4703 -784 -3712 4041 495 -4641 3007 2223 -4529 1713
3198 1713 3476 -4418 4 4059 -3559 -1275 4953 -2369 -2953 4520 -1052 -3897 4068 836 -4599
3213 -4599 2871 1958 -4973 1601 3467 -4329 188 4410 -3909 -1472 4663 -2454 -2644 4716 -1094
3228 -1094 -4137 4000 377 -4456 3239 2389 -4714 1707 3252 -4583 354 4363 -3556 -1265 4753
3243 4753 -2749 -2758 4786 -1061 -3580 4289 537 -4721 3113 1901 -4590 2106 3253 -4448 453 4155
3259 4155 -3751 -796 4812 -2509 -2254 4476 -1298 -3769 4179 565 -4029 3200 1551 -4528 1918
3274 1918 3114 -4483 865 3964 -3894 -958 4043 -2523 -2051 4338 -1208 -3341 3679 -59 -4170
3289 -4170 3145 1695 -4473 1961 2660 -4273 207 3664 -3624 -855 4159 -2721 -2290 3982 -1203
3304 -1203 -3202 3902 211 -4051 2870 1542 -4391 1925 3141 -4058 513 3635 -3692 -639 4261
3319 4261 -2143 -2089 4297 -918 -3574 3699 555 -3907 3271 1777 -4575 1738 2917 -4128 650
3334 650 3903 -3415 -893 4130 -2336 -2101 4296 -925 -3382 3850 206 -4268 3020 1862 -4402
3349 -4402 1923 2930 -4335 485 3645 -3625 -763 4212 -2497 -2390 4084 -1121 -3362 3996 152
3364 152 -4386 2923 1438 -4654 2074 2811 -4217 833 3511 -3816 -923 4105 -2543 -1995 4228 -1450
3380 -1450 -3296 3801 190 -4067 3321 1483 -4327 2162 2413 -4358 816 3756 -3384 -567 3922
3395 3922 -2685 -1901 4072 -1007 -3069 4059 -208 -3886 3172 1317 -4062 2431 2556 -4322 847
3410 847 3271 -3393 -340 3915 -2315 -1922 4134 -1433 -3133 3790 -37 -3692 3168 1117 -4236
3425 -4236 2171 2252 -3916 774 3272 -3420 -643 3731 -2484 -1729 3951 -1233 -3129 3517 -44 -3761
3441 -3761 3344 1208 -3982 1852 2261 -3961 772 3217 -3417 -550 3650 -2475 -2153 3970 -1164
3456 -1164 -2819 3716 -56 -3813 2855 1239 -3978 2105 2481 -3816 583 3140 -3094 -629 3951
3471 3951 -2165 -1791 4043 -1322 -2877 3899 223 -3655 3250 1307 -4134 2081 2434 -3759 904
3486 904 3471 -3188 -608 3622 -2480 -1733 4330 -1261 -3107 3881 -224 -3865 3147 1257 -3955
3501 -3955 2083 2256 -3975 786 3092 -3310 -514 3797 -2626 -1917 3801 -1427 -2858 3740 -155
3516 -155 -3750 3049 928 -3939 2272 2242 -3743 905 3134 -3473 -372 3709 -2436 -1576 3899 -1487
3532 -1487 -2954 3657 -234 -3382 3073 828 -3777 2021 2020 -3842 1025 3107 -3083 -222 3526 -2517
3548 -2517 -1590 3832 -1350 -2362 3570 -301 -3272 3020 1070 -3529 2096 2050 -3524 886 2840 -3214
3564 -3214 -314 3662 -2456 -1655 3710 -1349 -2494 3643 3 -3278 2962 889 -3629 1843 2189
3579 2189 -3392 784 2762 -3300 -372 3309 -2281 -1498 3572 -1408 -2466 3347 -288 -3181 2821
3594 2821 1144 -3656 1791 1912 -3531 640 3031 -3017 -417 3444 -2473 -1571 3703 -1177 -2437
3609 -2437 3295 -142 -3285 2842 899 -3518 1989 2260 -3442 673 2819 -3181 -226 3544 -2301
3624 -2301 -1536 3552 -1440 -2517 3486 -198 -3103 3064 831 -3606 2083 2055 -3503 1036 2931 -3284
3640 -3284 -339 3233 -2499 -1322 3625 -1525 -2356 3275 -317 -3181 2844 829 -3407 2053 1740
3655 1740 -3602 817 2882 -3325 -277 3589 -2489 -1605 3328 -1253 -2240 3323 -347 -3124 2564
3670 2564 805 -3141 2050 1866 -3287 1136 2346 -2634 -10 2910 -2078 -893 3631 -1483 -2282
3685 -2282 3154 -332 -2815 2785 709 -3357 1918 1666 -3117 999 2702 -2903 -124 3139 -2262
3700 -2262 -1211 3371 -1240 -2151 3179 -406 -2966 2699 728 -3036 1890 1851 -3188 759 2585 -2741
3716 -2741 -68 3155 -2308 -1295 3317 -1415 -2242 3317 -262 -2781 2607 628 -3272 1941 1773
3731 1773 -3089 832 2613 -3120 -382 3269 -2257 -1227 3201 -1382 -2172 3086 -277 -2782 2699
3746 2699 659 -3243 1618 1713 -3150 869 2708 -2834 -207 3070 -2384 -1472 3465 -1317 -2053 3290
3762 3290 -642 -2846 2631 600 -3191 2050 1859 -3235 916 2368 -2992 -96 3227 -2281 -1024
3777 -1024 3261 -1595 -2000 3267 -350 -2591 2658 672 -3049 2033 1827 -3164 871 2568 -2938
3792 -2938 -103 2993 -2379 -855 3404 -1482 -2027 3032 -635 -2478 2587 438 -2915 1834 1425
3807 1425 -3238 964 2361 -2796 -42 2917 -2403 -1218 3145 -1483 -1798 2912 -590 -2560 2393
3822 2393 642 -2848 1731 1450 -2808 710 2233 -2710 25 2984 -2213 -891 2981 -1411 -1741
3837 -1741 2866 -483 -2343 2397 500 -2807 1672 1586 -2924 875 2303 -2881 -29 2902 -2270
3852 -2270 -952 3020 -1448 -1795 2914 -514 -2496 2372 657 -2763 1763 1539 -2977 798 2274
3867 2274 -2555 -20 3063 -2220 -1064 2895 -1493 -1739 2935 -370 -2527 2375 583 -2825 1820
3882 1820 1564 -3027 851 2428 -2874 -75 2811 -2119 -950 2975 -1422 -1853 2920 -625 -2333
3897 -2333 2367 502 -2953 1550 1444 -2875 975 2238 -2748 8 2638 -2511 -760 2929 -1518
3912 -1518 -1648 2843 -695 -2333 2461 485 -2619 1891 1312 -2909 908 2321 -2766 160 2712
3927 2712 -2289 -802 2866 -1435 -1595 2803 -536 -2058 2435 196 -2770 1819 1392 -2858 1053
3942 1053 2046 -2647 106 2584 -2105 -595 2904 -1540 -1569 2512 -469 -1986 2375 390 -2528 1724
3958 1724 1145 -2768 984 2085 -2517 112 2557 -2225 -764 2523 -1526 -1415 2661 -563 -2311
3973 -2311 2218 326 -2500 1705 1255 -2837 971 1897 -2519 24 2466 -1968 -853 2733 -1402
3988 -1402 -1537 2611 -306 -2181 2190 446 -2571 1763 1318 -2663 940 2009 -2338 106 2394
4003 2394 -2086 -717 2715 -1439 -1547 2630 -544 -2150 2323 360 -2578 1738 1174 -2798 918
4018 918 2000 -2460 140 2378 -2070 -725 2655 -1268 -1507 2588 -518 -2052 2178 247 -2540
4033 -2540 1788 1379 -2707 989 1842 -2531 152 2220 -2224 -661 2548 -1641 -1495 2426 -666 -1935
4049 -1935 2156 152 -2578 1785 1066 -2568 1002 1673 -2583 101 2224 -2246 -680 2539 -1213
4064 -1213 -1240 2584 -922 -2040 2380 192 -2360 1757 943 -2550 1074 1501 -2327 444 2303 -1825
4080 -1825 -554 2507 -1394 -1148 2405 -535 -2108 2253 200 -2329 1599 1062 -2401 976 1658 -2424
4096 -2424 227 2053 -1843 -467 2494 -1344 -1486 2324 -605 -1822 2159 177 -2282 1522 1005
4111 1005 -2362 1036 1746 -2168 224 2036 -1819 -643 2315 -1192 -1410 2262 -513 -1928 2128
4126 2128 334 -2374 1748 958 -2414 974 1666 -2332 107 2256 -2032 -585 2230 -1437 -1277 2332
4142 2332 -509 -1966 2126 142 -2377 1587 987 -2525 1084 1683 -2339 242 2020 -1866 -419
4157 -419 2246 -1317 -1318 2395 -649 -1783 2314 341 -2314 1728 902 -2389 1040 1407 -2197 386
4173 386 1923 -1924 -478 2352 -1379 -1179 2334 -617 -1858 2128 141 -2117 1702 844 -2182 1159
4189 1159 1438 -2210 333 1828 -1826 -290 2195 -1477 -1173 2323 -851 -1674 2051 -63 -2172 1593
4205 1593 794 -2312 1118 1219 -2184 411 1743 -1994 -311 2147 -1371 -1105 2146 -717 -1713 2084
4221 2084 37 -2278 1826 577 -2125 1151 1362 -2138 511 1733 -1936 -387 2131 -1290 -989
4236 -989 2296 -779 -1678 1994 -47 -2099 1705 727 -2136 1159 1246 -2140 342 1694 -1554 -480
4252 -480 2103 -1430 -1035 2155 -687 -1608 1975 85 -1943 1687 564 -2036 1072 1323 -2130 314
4268 314 1785 -1952 -329 2034 -1180 -1156 2139 -809 -1612 1924 -87 -1941 1681 691 -2109 1025
4284 1025 1244 -2224 456 1756 -1774 -265 1968 -1261 -1050 2216 -701 -1575 2062 -40 -2040 1710
4300 1710 551 -2113 1171 1117 -1994 542 1740 -1759 -80 2074 -1324 -878 2064 -701 -1442 2202
4316 2202 -203 -1841 1708 563 -2154 1236 1168 -1927 621 1599 -1714 -236 1954 -1396 -863 2217
4332 2217 -941 -1351 1899 -166 -1917 1725 429 -2087 1159 863 -1970 409 1657 -1804 -283
4347 -283 1992 -1354 -1053 2098 -732 -1440 2030 -275 -1778 1653 314 -1987 1243 1047 -1888 511
4363 511 1446 -1722 -209 2030 -1262 -772 2027 -809 -1421 1872 -122 -1795 1517 440 -1965 1094
4379 1094 1011 -1836 418 1545 -1660 -282 2083 -1271 -869 2031 -742 -1409 1975 -258 -1776 1745
4395 1745 495 -1973 1002 1104 -1938 584 1557 -1865 -66 1942 -1375 -906 2138 -722 -1312 1910
4411 1910 -319 -1754 1604 335 -1854 1197 990 -1976 687 1363 -1685 -222 2015 -1331 -687 2231
4427 2231 -1203 -1437 1966 -291 -1774 1698 436 -1961 1065 795 -1846 544 1485 -1710 14 1894
4443 1894 -1613 -546 1918 -954 -1207 1977 -440 -1503 1697 310 -1779 1217 945 -1942 724
4458 724 1468 -1691 -54 1846 -1505 -692 1921 -1130 -1087 1999 -437 -1391 1686 235 -1705 1219
4474 1219 894 -1819 521 1242 -1710 104 1647 -1375 -662 1925 -1001 -1181 1848 -395 -1642 1663
4490 1663 214 -1832 1161 830 -1956 601 1130 -1840 126 1745 -1630 -704 1755 -984 -1088 1853
4506 1853 -401 -1585 1590 347 -1798 1238 744 -1886 653 1332 -1761 115 1701 -1470 -410
4521 -410 1962 -939 -1053 1853 -302 -1541 1645 184 -1728 1250 773 -1779 662 1372 -1844 31
4537 31 1651 -1277 -534 1873 -900 -988 1840 -359 -1327 1532 189 -1744 1294 711 -1922 777 1278
4554 1278 -1698 158 1762 -1540 -351 1847 -1073 -1072 1881 -620 -1448 1603 191 -1697 1288 586
4570 586 -1860 802 1224 -1859 277 1599 -1573 -392 1818 -1225 -1033 1669 -556 -1353 1537 154
4586 154 -1695 1180 592 -1825 844 1119 -1666 281 1527 -1613 -376 1799 -1353 -884 1785 -429
4602 -429 -1353 1563 39 -1552 1199 636 -1727 873 1321 -1765 332 1622 -1518 -339 1534 -1102
4618 -1102 -716 1846 -522 -1342 1511 9 -1620 1273 579 -1605 830 1046 -1795 251 1368 -1437
4634 -1437 -241 1705 -1046 -866 1670 -598 -1210 1552 99 -1665 1328 597 -1658 781 1071 -1730
4650 -1730 179 1391 -1476 -259 1739 -1190 -761 1694 -603 -1255 1670 -118 -1543 1301 520 -1754
4666 -1754 851 1124 -1871 374 1338 -1484 -308 1682 -1073 -897 1740 -728 -1219 1565 2 -1550
4682 -1550 1375 462 -1741 993 987 -1730 371 1501 -1539 -49 1652 -1287 -739 1554 -621 -1200
4698 -1200 1615 -87 -1472 1294 384 -1766 789 1091 -1748 494 1311 -1577 -102 1538 -1132 -632
4714 -632 1660 -664 -1017 1737 -56 -1509 1235 288 -1924 847 908 -1640 482 1342 -1496 -197
4730 -197 1652 -1182 -570 1701 -729 -973 1494 -220 -1411 1339 408 -1627 973 965 -1813 455 1307
4747 1307 -1546 78 1566 -1212 -630 1559 -676 -944 1560 -272 -1303 1238 432 -1633 932 892
4763 892 -1706 507 1378 -1513 7 1751 -1172 -565 1705 -577 -1115 1663 -160 -1525 1277 378
4779 378 -1691 861 1005 -1659 586 1394 -1491 -78 1441 -1135 -734 1672 -639 -1079 1501 -201
4795 -201 -1380 1434 515 -1617 992 1000 -1747 366 1221 -1436 22 1603 -1198 -653 1595 -866 -1095
4812 -1095 1598 -144 -1550 1396 394 -1573 923 780 -1637 474 1340 -1681 56 1577 -1316
4827 -1316 -414 1630 -683 -1090 1778 -280 -1427 1476 275 -1630 1040 765 -1766 662 1233 -1630
4843 -1630 59 1480 -1255 -483 1695 -638 -890 1626 -233 -1540 1365 227 -1621 1070 752 -1737
4859 -1737 529 1153 -1553 59 1374 -1326 -350 1569 -741 -972 1492 -261 -1415 1376 141 -1669
4875 -1669 1058 661 -1692 580 1177 -1547 -75 1270 -1214 -464 1555 -847 -802 1644 -387 -1346
4891 -1346 1499 325 -1615 1053 722 -1792 595 1170 -1480 142 1372 -1259 -460 1579 -745 -796
4907 -796 1526 -448 -1290 1281 179 -1672 995 622 -1542 573 1267 -1438 168 1523 -1168 -385
4923 -385 1565 -712 -973 1652 -318 -1324 1477 95 -1599 1184 569 -1733 573 1149 -1491 -22
4939 -22 1348 -1221 -499 1583 -810 -846 1575 -360 -1333 1437 213 -1574 1117 635 -1564 618 1121
4956 1121 -1597 117 1490 -1353 -407 1584 -921 -797 1601 -414 -1306 1570 73 -1489 1062 542
4972 542 -1581 641 1023 -1461 235 1460 -1213 -309 1583 -970 -796 1534 -452 -1153 1460 180
4988 180 -1570 1139 737 -1584 773 897 -1613 98 1409 -1307 -283 1590 -924 -843 1672 -502
5004 -502 -1214 1563 32 -1553 1121 529 -1747 699 1002 -1551 175 1276 -1295 -341 1553 -964
5020 -964 -728 1438 -511 -1158 1324 213 -1511 1117 589 -1517 678 1022 -1506 144 1342 -1324
5036 -1324 -235 1435 -930 -731 1571 -494 -1197 1684 145 -1313 1136 629 -1559 812 1010 -1523
5052 -1523 202 1340 -1161 -260 1578 -871 -779 1584 -551 -1162 1532 -6 -1526 1094 524 -1655
5068 -1655 730 1015 -1537 158 1337 -1280 -280 1526 -1026 -739 1586 -567 -1147 1447 -32 -1496
5084 -1496 1319 564 -1579 796 989 -1548 343 1343 -1539 -283 1505 -1059 -828 1548 -618 -1328
5100 -1328 1492 -61 -1434 1245 324 -1462 831 1000 -1607 288 1220 -1321 -334 1396 -1097 -614
5116 -614 1692 -360 -1029 1399 -10 -1359 1189 505 -1492 877 929 -1539 277 1447 -1414 -264
5132 -264 1386 -996 -525 1571 -565 -1064 1607 22 -1388 1032 489 -1525 822 933 -1547 415
5148 415 1334 -1430 -100 1492 -1036 -676 1641 -613 -1117 1451 -20 -1302 1172 473 -1643 731
5164 731 831 -1406 369 1410 -1360 -320 1464 -941 -795 1420 -516 -1033 1582 -171 -1243 1366
5180 1366 380 -1626 702 907 -1539 227 1273 -1362 -218 1607 -901 -793 1501 -588 -1167 1384
5196 1384 -122 -1332 1138 401 -1584 741 968 -1425 439 1403 -1271 -335 1589 -1100 -654 1702
5212 1702 -507 -1049 1557 -161 -1477 1141 476 -1603 846 920 -1433 410 1379 -1340 -248 1520
5228 1520 -1100 -626 1690 -604 -1048 1411 -225 -1341 1191 470 -1476 843 801 -1545 352 1366
5244 1366 -1363 -47 1398 -1094 -666 1540 -701 -996 1432 -202 -1338 1216 215 -1462 913
5259 913 754 -1412 439 1173 -1366 -289 1368 -958 -611 1534 -803 -924 1486 -341 -1411 1187
5275 1187 428 -1489 883 667 -1428 391 1224 -1111 -65 1525 -983 -649 1499 -640 -972 1379
5291 1379 -170 -1418 1221 375 -1465 864 969 -1408 468 1220 -1305 -149 1578 -1185 -668 1599
5307 1599 -705 -985 1589 -414 -1378 1164 271 -1462 727 769 -1632 437 1199 -1348 -143 1478
5323 1478 -1313 -626 1525 -716 -1003 1457 -152 -1405 1278 419 -1502 933 673 -1571 330 1159
5339 1159 -1389 -89 1567 -1147 -550 1511 -691 -1016 1535 -146 -1311 1265 202 -1599 843
5354 843 910 -1639 471 1261 -1458 26 1352 -1241 -479 1628 -726 -938 1454 -244 -1321 1321
5370 1321 379 -1474 983 745 -1541 444 1233 -1596 93 1604 -1163 -330 1446 -653 -910 1401
5386 1401 -144 -1139 1226 163 -1541 924 647 -1519 452 1073 -1433 47 1373 -1319 -418 1513
5402 1513 -974 -978 1432 -256 -1173 1297 304 -1410 1027 693 -1525 530 1041 -1380 15 1379 -1171
5419 -1171 -477 1464 -724 -884 1404 -260 -1177 1486 259 -1444 939 674 -1488 519 1073 -1375
5435 -1375 81 1200 -1019 -435 1448 -772 -872 1600 -317 -1149 1283 254 -1634 922 784 -1525
5451 -1525 430 1060 -1387 -32 1485 -1195 -598 1505 -864 -1003 1521 -304 -1364 1240 222 -1511
5467 -1511 887 712 -1543 631 1161 -1496 37 1353 -1237 -509 1588 -856 -822 1624 -461 -1303
5483 -1303 1275 211 -1475 912 707 -1696 606 1093 -1487 18 1410 -1185 -530 1499 -856 -905
5499 -905 1514 -352 -1345 1373 207 -1429 1001 559 -1484 519 1032 -1448 151 1371 -1142 -338
5515 -338 1480 -767 -937 1611 -403 -1178 1348 122 -1322 906 576 -1525 611 933 -1409 70
5531 70 1186 -1073 -404 1587 -793 -808 1400 -437 -1123 1271 10 -1383 961 527 -1514 478 938
5548 938 -1390 -42 1268 -1294 -372 1539 -754 -930 1406 -335 -1154 1317 82 -1462 852 556
5564 556 -1557 601 1189 -1419 199 1284 -1029 -346 1508 -873 -878 1528 -368 -1146 1310 231 -1595
5581 -1595 1043 592 -1612 696 1080 -1416 27 1342 -1227 -347 1383 -895 -913 1416 -327 -1191
5597 -1191 1398 98 -1479 1182 548 -1511 630 1089 -1570 149 1416 -1215 -386 1445 -791 -950
5613 -950 1474 -420 -1308 1314 138 -1442 1052 558 -1574 583 1043 -1407 244 1415 -1341 -276
5629 -276 1471 -814 -851 1340 -428 -1035 1436 160 -1420 961 543 -1456 692 963 -1470 144
5645 144 1231 -1269 -311 1405 -718 -849 1489 -444 -1215 1336 210 -1524 1016 508 -1501 815
5661 815 931 -1452 201 1274 -1121 -256 1517 -937 -655 1471 -554 -1126 1284 131 -1484 1102
5677 1102 363 -1500 674 876 -1345 148 1233 -1221 -390 1369 -816 -759 1467 -443 -1241 1347
5693 1347 -90 -1422 1032 419 -1402 523 812 -1419 45 1199 -1221 -297 1338 -719 -884 1528
5709 1528 -496 -1159 1345 -149 -1485 1044 525 -1573 627 1028 -1503 210 1337 -1088 -185 1504
5725 1504 -813 -818 1540 -288 -1094 1318 112 -1310 1054 406 -1433 625 944 -1518 162 1340
5741 1340 -1153 -367 1361 -913 -795 1545 -426 -1245 1234 99 -1432 977 517 -1463 693 893
5757 893 -1483 161 1278 -1223 -441 1366 -858 -640 1439 -398 -1193 1374 133 -1556 1057 487
5773 487 -1571 650 941 -1303 311 1304 -1162 -284 1404 -922 -739 1545 -514 -1135 1488 -97
5789 -97 -1385 1057 439 -1570 679 951 -1425 94 1260 -1092 -279 1490 -691 -728 1483 -382 -958
5806 -958 1157 -13 -1413 1046 526 -1407 599 864 -1371 129 1216 -1220 -231 1421 -862 -717
5822 -717 1467 -485 -906 1403 -219 -1322 1028 417 -1322 680 734 -1383 305 1290 -1111 -165 1362
5839 1362 -786 -721 1547 -379 -1223 1277 -53 -1316 1094 452 -1540 642 802 -1414 216 1123
5855 1123 -1203 -382 1372 -923 -720 1504 -411 -973 1434 -10 -1405 1123 402 -1326 716 878
5871 878 -1386 212 1129 -1235 -221 1389 -920 -798 1460 -568 -971 1415 -102 -1313 1200 428
5887 428 -1396 677 786 -1277 370 1247 -1230 -132 1255 -910 -665 1375 -379 -1104 1315 109
5903 109 -1267 1134 530 -1382 845 864 -1369 279 1145 -1290 -237 1237 -819 -608 1476 -510
5919 -510 -989 1255 -88 -1264 1022 504 -1375 757 771 -1463 282 1059 -1011 -312 1374 -884 -657
5936 -657 1414 -604 -865 1217 40 -1283 1089 232 -1292 589 774 -1314 83 1216 -1137 -210
5952 -210 1511 -811 -644 1378 -454 -910 1217 -39 -1216 1111 421 -1389 760 910 -1317 231
5968 231 1076 -1194 -203 1308 -844 -648 1365 -514 -1017 1236 -27 -1179 1027 473 -1325 613
5984 613 857 -1252 94 1116 -1146 -102 1170 -969 -820 1391 -542 -1009 1269 -35 -1354 1075
6000 1075 290 -1349 623 841 -1400 195 981 -1130 -255 1359 -872 -679 1323 -602 -960 1109
6016 1109 -25 -1189 986 395 -1412 800 700 -1348 305 1117 -1150 -195 1308 -760 -454 1249
6032 1249 -533 -846 1201 -139 -1244 1018 331 -1283 839 628 -1334 314 1064 -1240 -128 1212
6048 1212 -803 -382 1375 -591 -959 1438 -155 -1147 963 369 -1417 663 815 -1326 404 935
6064 935 -1108 -230 1275 -869 -587 1385 -537 -814 1227 -208 -1157 1059 399 -1212 633 722 -1442
6081 -1442 327 977 -1245 -97 1193 -805 -552 1335 -566 -869 1330 -78 -1024 1011 294 -1332
6097 -1332 733 690 -1301 463 987 -1127 -1 1182 -708 -450 1302 -538 -824 1089 -225 -1114
6113 -1114 1237 251 -1270 731 721 -1245 228 1020 -1169 43 1200 -1008 -449 1287 -449 -789
6129 -789 1246 -111 -1156 988 273 -1227 744 408 -1324 367 1066 -1360 79 1314 -1012 -449
6145 -449 1020 -849 -843 1092 -124 -1231 1108 88 -1419 946 354 -1351 271 684 -1272 -132
6161 -132 1214 -769 -403 1594 -550 -840 922 -177 -985 994 351 -1329 550 628 -1292 566 1179
6178 1179 -1191 -349 1018 -1017 -507 848 -590 -628 1308 263 -987 834 -14 -1427 576 945
6194 945 -1316 602 812 -1215 175 1472 -1227 -811 1241 -831 -1146 992 -146 -1028 998 274
6210 274 -1238 354 683 -1016 546 726 -1550 438 869 -1028 -383 1034 -636 -377 1465 -335
6226 -335 -1043 901 164 -1055 782 482 -1290 476 875 -1062 169 1181 -920 -360 1182 -542
6242 -542 -659 1019 -119 -980 1081 300 -1211 648 624 -1276 534 954 -1248 -13 1189 -978 -398
6259 -398 1219 -569 -665 1213 -208 -935 1058 191 -1092 852 599 -1319 407 995 -1144 42 1155
6276 1155 -899 -432 1253 -510 -752 1212 -266 -866 1064 208 -1144 797 559 -1164 369 856
6292 856 -1130 168 1113 -880 -473 1101 -582 -761 1209 -226 -1113 1079 268 -1117 826 552 -1263
6309 -1263 253 872 -1178 38 1046 -862 -162 1234 -700 -678 1173 -254 -1070 1018 150 -1004
6325 -1004 789 401 -1138 495 868 -1164 111 1021 -844 -219 1169 -627 -723 1136 -224 -985 1061
6342 1061 158 -1155 835 564 -1211 502 941 -1123 78 946 -772 -466 1091 -600 -667 1211 -341
6359 -341 -963 1029 175 -1195 814 445 -1168 460 816 -1148 -88 1004 -1031 -275 1208 -685
6375 -685 -760 1010 -183 -951 1149 3 -1178 861 547 -1193 465 807 -1138 -38 1035 -889
6391 -889 -293 1123 -656 -625 1180 -214 -849 1021 92 -1068 703 499 -1137 525 869 -1052 205
6408 205 948 -948 -396 1091 -575 -491 1129 -353 -913 884 126 -1176 886 400 -1034 529 833
6425 833 -974 93 927 -863 -277 1212 -667 -682 1071 -330 -797 990 101 -1064 756 244 -1192
6442 -1192 601 749 -1166 59 1014 -951 -225 1040 -730 -679 993 -373 -841 1060 148 -1070 693
6459 693 334 -1031 486 754 -1138 59 830 -1030 -246 1121 -710 -643 1183 -286 -812 894 105
6476 105 -1067 830 330 -987 549 700 -972 157 864 -869 -346 1197 -569 -400 1098 -251
6492 -251 -868 860 -21 -931 658 493 -1116 608 703 -922 46 872 -878 -347 1067 -662 -428 1132
6510 1132 -338 -796 871 112 -910 674 336 -1220 446 705 -981 120 940 -980 -175 1182
6526 1182 -661 -521 1102 -487 -820 1160 -3 -936 857 390 -1059 479 620 -896 155 1027
6542 1027 -896 -368 969 -728 -462 1069 -309 -751 959 16 -910 661 378 -1102 428 749 -963
6559 -963 162 894 -996 -175 1077 -580 -548 1139 -286 -818 841 -143 -1060 699 338 -1151 653
6576 653 697 -1103 211 827 -964 -99 996 -644 -546 1140 -380 -701 1026 -63 -993 873 204
6593 204 -1041 473 572 -1092 154 847 -905 -87 1144 -710 -503 1035 -343 -698 860 -10 -887
6610 -887 801 164 -1007 474 579 -1037 279 822 -781 -209 901 -583 -482 1064 -283 -667 1026
6627 1026 -86 -997 729 350 -1129 550 611 -952 231 794 -831 -208 908 -527 -543 1008 -480
6644 -480 -785 1050 -41 -843 817 303 -994 577 644 -1054 283 746 -880 -124 1019 -754 -514
6661 -514 942 -433 -762 944 -73 -1011 784 333 -902 567 510 -990 179 863 -811 -63 958
6678 958 -700 -464 994 -372 -732 1030 -187 -834 776 291 -1013 502 469 -1010 218 660 -808
6695 -808 -7 906 -696 -362 1082 -366 -647 967 -219 -860 728 181 -1102 608 475 -1021 218
6712 218 775 -810 -163 1012 -641 -432 1065 -367 -718 835 -179 -893 870 178 -888 572 501
6729 501 -940 239 625 -860 -155 856 -749 -536 990 -410 -734 926 -125 -844 704 142 -1011
6746 -1011 677 410 -1034 286 730 -876 -16 898 -761 -311 1067 -443 -631 929 -135 -955 813
6763 813 180 -943 614 565 -877 251 754 -754 -25 919 -600 -239 860 -482 -676 973 -104
6780 -104 -746 846 161 -876 411 487 -909 400 687 -813 116 960 -706 -419 1084 -401 -747
6797 -747 939 -192 -832 768 254 -871 556 544 -893 405 693 -734 -37 1031 -728 -288 879
6814 879 -577 -614 792 -187 -800 807 156 -853 545 400 -907 399 778 -877 -6 869 -771
6831 -771 -373 959 -427 -525 857 -151 -791 808 100 -983 542 349 -961 390 629 -920 -25
6848 -25 901 -664 -97 891 -549 -480 854 -284 -677 829 144 -877 682 335 -897 226 644 -876
6866 -876 86 989 -690 -358 919 -556 -530 917 -236 -729 875 205 -968 617 489 -900 328
6883 328 592 -856 53 867 -712 -252 909 -507 -609 960 -327 -643 899 -27 -917 643 478
6900 478 -808 231 777 -868 -28 791 -740 -176 889 -484 -554 800 -278 -772 819 -3 -940
6917 -940 660 350 -868 503 542 -807 108 820 -635 -172 953 -572 -393 1018 -137 -680 835
6934 835 47 -861 675 229 -870 436 654 -813 37 905 -706 -174 1022 -532 -334 975 -211
6951 -211 -713 833 -48 -918 463 339 -886 449 696 -929 175 754 -739 -193 1017 -562 -475
6968 -475 973 -195 -749 820 -33 -866 519 235 -923 369 576 -788 -2 788 -908 -35 878
6985 878 -503 -461 805 -196 -775 813 40 -790 632 318 -938 308 451 -872 231 770 -746
7002 -746 -172 747 -621 -449 995 -416 -722 807 50 -782 621 356 -935 648 514 -803 145
7019 145 752 -762 -209 739 -432 -393 889 -264 -716 875 30 -855 703 240 -838 393 426 -1083
7037 -1083 206 755 -661 -254 856 -631 -334 942 -174 -765 681 -115 -847 762 311 -954 380
7054 380 652 -818 81 833 -916 -180 872 -750 -373 870 -208 -570 960 -82 -861 586 217
7071 217 -821 441 546 -867 174 743 -724 -96 817 -562 -413 993 -450 -626 880 -152 -737
7088 -737 680 279 -827 532 354 -843 195 624 -718 -30 751 -756 -316 887 -362 -690 803
7105 803 -108 -630 686 147 -902 546 395 -851 288 601 -709 -106 845 -699 -318 909 -437
7122 -437 -637 878 -35 -694 573 285 -822 549 546 -894 303 716 -801 30 882 -546 -245 941
7140 941 -321 -498 968 -4 -783 694 193 -873 499 378 -767 125 672 -763 -62 776 -616
7157 -616 -266 905 -419 -638 894 -116 -595 756 283 -773 569 329 -712 206 621 -844 -97
7174 -97 823 -561 -365 853 -394 -731 859 -182 -746 650 216 -798 461 268 -898 226 610
7191 610 -889 107 784 -557 -219 826 -279 -591 865 -62 -629 801 94 -882 589 388 -979
7208 -979 184 549 -855 -37 763 -533 -311 766 -322 -591 847 -148 -673 849 136 -748 625
7225 625 291 -842 325 599 -751 -44 669 -623 -320 760 -449 -410 818 -77 -697 662 70 -669
7243 -669 552 352 -802 328 600 -699 88 821 -608 -399 829 -392 -517 909 -106 -678 880
7260 880 118 -822 552 296 -836 380 648 -654 17 680 -567 -307 766 -415 -533 784 -180
7277 -180 -718 777 195 -870 607 342 -830 389 532 -737 32 681 -696 -265 925 -401 -461
7294 -461 939 -107 -702 813 79 -834 638 341 -955 485 628 -745 -67 850 -634 -166 676
7311 676 -530 -441 854 -163 -643 782 14 -882 718 225 -871 390 522 -752 29 725 -581
7328 -581 -312 916 -371 -157 851 -328 -299 587 210 -430 635 485 -937 483 927 -796 67 672
7346 672 -551 -230 809 -534 -433 912 -311 -776 676 50 -864 487 219 -916 283 695 -930
7363 -930 215 777 -631 -145 895 -445 -448 859 -111 -578 815 -36 -817 560 312 -774 119 618
7381 618 -787 1 652 -690 -116 833 -360 -348 939 -325 -652 727 0 -749 549 287 -933 474
7399 474 464 -650 270 709 -752 -262 881 -402 -469 772 -374 -645 830 135 -798 578 399 -712
7417 -712 388 634 -758 85 578 -690 -293 841 -487 -400 893 -171 -592 676 20 -772 523
7434 523 197 -833 355 521 -756 225 726 -630 -125 702 -497 -301 817 -274 -598 733 103
7451 103 -789 628 297 -816 359 508 -727 46 860 -708 -139 865 -593 -466 805 -186 -738
7468 -738 790 70 -801 524 302 -794 415 534 -569 132 627 -540 -85 755 -444 -293 761
7485 761 -297 -620 809 -15 -781 641 220 -899 453 518 -857 131 624 -642 -106 682 -522 -453
7503 -453 737 -318 -571 748 79 -895 529 283 -894 411 586 -805 170 618 -773 -313 767
7520 767 -407 -403 937 -376 -680 607 33 -687 634 316 -858 408 446 -739 161 705 -639 -1
7538 -1 821 -543 -274 800 -307 -538 804 26 -745 541 164 -829 241 623 -733 218 766 -821
7556 -821 -17 846 -510 -466 699 -273 -652 798 -93 -786 719 254 -968 254 548 -734 16 740
7574 740 -656 -50 829 -497 -416 820 -231 -552 809 -83 -786 673 86 -1015 395 603 -793
7591 -793 234 708 -660 -138 848 -565 -485 799 -336 -503 861 -110 -718 559 200 -922 429
7608 429 350 -885 40 719 -645 -102 834 -632 -275 818 -414 -674 814 -89 -732 680 129 -737
7626 -737 450 482 -882 202 732 -863 49 867 -592 -332 830 -469 -703 642 59 -683 699
7643 699 290 -946 358 527 -893 294 708 -831 -9 679 -582 -303 973 -417 -552 758 -163
7660 -163 -647 593 200 -889 446 390 -885 281 674 -715 -50 739 -670 -368 927 -395 -525
7677 -525 846 -117 -823 678 103 -861 515 441 -893 122 735 -704 -144 780 -579 -305 847 -330
7695 -330 -458 851 -143 -657 654 222 -864 388 512 -782 116 621 -779 -18 708 -540 -344 779
7713 779 -531 -552 815 -65 -709 682 210 -890 325 478 -912 176 696 -731 -14 672 -596
7730 -596 -208 896 -376 -441 936 -75 -812 724 50 -960 472 303 -819 386 662 -906 55
7747 55 720 -651 -266 741 -465 -373 768 -151 -774 728 120 -975 521 381 -869 320 635 -629
7765 -629 -32 784 -644 -282 759 -408 -488 791 -10 -654 610 122 -693 479 482 -936 306 726
7783 726 -923 -22 722 -652 -271 943 -489 -563 818 -87 -740 795 41 -798 561 346 -904 325
7801 325 556 -807 36 766 -644 -207 738 -406 -534 770 -260 -665 664 172 -844 403 405 -753
7819 -753 347 525 -656 -125 751 -565 -193 868 -537 -537 742 -316 -754 825 108 -854 453 391
7837 391 -699 210 622 -658 44 832 -730 -278 765 -458 -550 859 -261 -713 788 195 -811
7854 -811 546 519 -953 309 767 -793 136 725 -730 -248 937 -445 -429 769 -246 -728 841
7871 841 284 -739 520 331 -793 219 651 -857 155 774 -687 -346 882 -556 -459 846 -251
7888 -251 -696 784 134 -793 537 387 -908 402 639 -867 11 665 -691 -195 911 -523 -490 785
7906 785 -242 -798 883 100 -740 651 500 -729 333 523 -621 69 752 -674 -294 865 -429
7923 -429 -453 843 -226 -782 679 4 -685 587 409 -861 408 603 -820 60 670 -750 -184 784
7941 784 -406 -528 995 -278 -681 762 73 -799 510 302 -968 403 535 -822 58 707 -632
7958 -632 -135 879 -550 -526 859 -280 -652 699 6 -707 595 310 -876 415 545 -843 87
7975 87 858 -581 -229 910 -470 -353 890 -232 -592 860 -73 -858 664 306 -1004 295 578
7992 578 -905 240 684 -667 -132 831 -428 -513 798 -273 -727 844 -107 -749 624 254 -890
8009 -890 299 544 -798 109 693 -712 -204 865 -444 -398 909 -275 -576 827 39 -735 692
8026 692 205 -848 438 622 -958 56 806 -557 -105 754 -439 -508 843 -410 -639 759 -159
8043 -159 -898 690 356 -785 412 588 -838 17 660 -838 -189 914 -446 -492 743 -338 -825
8060 -825 805 42 -795 710 258 -900 319 568 -809 73 749 -662 -261 941 -493 -312 821
8077 821 -234 -696 779 -11 -844 638 316 -635 392 541 -791 43 654 -851 -146 780 -504 -335
8095 -335 874 -234 -635 849 58 -822 623 266 -933 353 418 -818 170 697 -740 -137 816 -565
8113 -565 -465 873 -351 -668 791 -6 -748 668 242 -879 318 450 -791 279 653 -671 -146
8130 -146 870 -571 -477 875 -314 -596 831 -41 -836 664 228 -798 401 431 -914 190 573
8147 573 -771 -91 799 -637 -365 872 -329 -490 874 -36 -746 640 249 -835 590 402 -919
8164 -919 139 476 -708 -150 829 -617 -330 846 -367 -579 827 -52 -770 651 277 -902 399
8181 399 406 -846 153 694 -811 -9 793 -535 -285 800
8191H00
$$ Imaginary data points
##PAGE= N=2
##DATA TABLE= (X++(I..I)), XYDATA
0 0 0 0 0 0 0 0 0 0 0 0 0 0 -8 8 -8 8 -13 16 -21 24 -32 33 -40 49 -57 68 -81 89 -105 121 -141 161 -182 207
34 207 -233 265 -297 335 -373 417 -467 519 -575 638 -706 782 -863 951 -1049 1155 -1271 1401
52 1401 -1543 1701 -1879 2075 -2300 2554 -2848 3187 -3591 4078 -4678 5438 -6435 7811 -9834
67 -9834 13146 -19769 63655 -217667 -96558 121572 -229791 11151 313632 -43164 -119780
78 -119780 149119 -146878 -226275 197414 121634 -122325 169770 41742 -320172 12411
88 12411 155519 -128092 109401 216925 -201747 -125824 113265 -127972 -42624 267495 19349
99 19349 -167918 76526 -62990 -208911 167552 168538 -128309 66779 65301 -259368 -22526
110 -22526 179015 -67652 37194 183512 -139882 -178634 102750 -18617 -60338 213232
120 213232 53803 -200114 29600 23763 -173325 115367 188821 -108793 -3554 74027 -190425
131 -190425 -60935 195254 1458 -31487 132068 -82150 -192137 96194 63231 -82845
141 -82845 147357 83168 -194443 -17441 69095 -124334 65033 196958 -85913 -78829 68084
152 68084 -111586 -84197 184488 48699 -90818 89580 -30389 -197410 69838 117896
162 117896 -81577 86074 93666 -189578 -58405 106139 -70513 10707 181391 -62343
172 -62343 -131422 71555 -49513 -105864 164487 86542 -127667 46792 10138 -183289 51624
183 51624 152991 -72714 19295 98548 -153710 -86739 125695 -21224 -28987 157633 -28074
194 -28074 -164165 58477 9848 -97661 136261 105345 -136677 525 43975 -144234 27853
205 27853 165811 -48592 -30806 90113 -111468 -108140 133784 25815 -55120 122591 -3990
216 -3990 -173906 42690 59565 -87219 97298 112629 -130806 -41806 66619 -100309 -1777
227 -1777 167599 -28391 -78058 72394 -65165 -116259 123512 61620 -77401 77975 16804
238 16804 -163209 13858 93719 -63970 48232 110228 -112846 -81812 73725 -46741 -28859
249 -28859 149755 -1603 -112069 45284 -19212 -108763 95771 94118 -81748 25409 35958
260 35958 -135817 -14375 116947 -30520 -2900 100530 -82051 -107024 77690 4310 -47317
271 -47317 120364 26172 -129655 21276 25489 -91906 65978 116189 -77377 -23742 55754
282 55754 -101763 -36502 131630 28 -46218 84645 -46644 -123663 74764 49378 -57227
293 -57227 82617 49057 -132404 -10410 62901 -68279 31503 122519 -62326 -67559 60483
304 60483 -61000 -55981 127180 26427 -75910 54768 -13922 -124339 58765 81648 -60859
315 -60859 39954 58699 -120425 -37492 87458 -43545 -3433 116596 -47410 -97209 58437
326 58437 -20855 -68695 113623 46733 -96023 26174 14142 -112384 38959 105983 -56108
337 -56108 824 63318 -99187 -57017 99318 -11228 -29881 101693 -28075 -111178 48811
348 48811 17343 -64824 88020 63066 -98763 -2319 36272 -84878 17595 114623 -38977
359 -38977 -34519 59946 -67831 -66182 96820 20956 -48304 73605 -5572 -111840 33824
370 33824 48425 -53127 53534 70994 -90975 -32387 52098 -54390 -3172 110779 -21204
381 -21204 -66587 49426 -35583 -72648 86963 45156 -60811 40638 13918 -107623 12916
392 12916 73190 -39189 17837 70896 -76750 -61702 63060 -21048 -25045 96544 -2764
403 -2764 -87921 32641 -511 -72049 66776 65156 -63166 4379 29851 -86738 -8189 90481
415 90481 -21484 -16835 64968 -52381 -78678 65114 12127 -40001 79866 15281 -97873
426 -97873 14375 31475 -60293 45454 80475 -62514 -26499 45324 -61437 -27661 100543
437 100543 -2370 -45240 58903 -31324 -88811 63364 43098 -49258 54702 28490 -97956
448 -97956 -1033 56102 -46505 16856 86450 -53177 -52521 51072 -37318 -39823 97552 13531
460 13531 -68539 41408 -9285 -84390 51373 59658 -51047 23679 39460 -88168 -22165
471 -22165 68718 -25982 -6224 80804 -42502 -75389 51327 -9025 -44763 81829 25356
482 25356 -77209 21167 11567 -76041 34419 74820 -42401 -7325 42819 -70982 -35814
493 -35814 81200 -7674 -29049 68674 -23350 -81343 44979 14985 -46318 63512 40098
504 40098 -75429 -5241 31060 -54202 16582 82272 -33377 -35297 44461 -42322 -46782 77146
516 77146 13590 -40179 50309 -6879 -81528 28773 42736 -36259 33885 44466 -67692 -26283
528 -26283 47079 -32325 -7989 81550 -18760 -55151 37301 -21166 -52277 69384 34579 -52896
540 -52896 23001 10216 -72454 12329 61018 -32199 2275 53837 -56114 -48072 54109 -10669
552 -10669 -24177 74602 -7003 -74043 28794 6497 -49996 49482 47937 -55958 -315 28702
564 28702 -62895 -7089 74794 -16912 -22772 51348 -43174 -59829 60237 12762 -35930 55485
576 55485 8987 -76051 16318 29009 -45412 30704 61783 -50749 -25793 40475 -44879 -17674
588 -17674 80625 -7950 -42645 45939 -21210 -63609 53815 29710 -40660 38186 21727 -75855
600 -75855 478 50154 -34906 11236 63104 -47252 -42113 48068 -25848 -30012 74502 3918
612 3918 -53104 31455 -5229 -62139 41605 47946 -41691 11714 28015 -64758 -13504 59877
624 59877 -22770 -9764 58613 -34174 -53632 40820 -4157 -33318 59735 16043 -60379 12813
636 12813 14262 -50777 23948 56858 -38260 -9769 35238 -49896 -25566 62550 -5127 -24831
648 -24831 48376 -19633 -59657 35034 19210 -34035 39501 29256 -59924 -3486 31353 -38786
660 -38786 8329 63494 -28104 -30784 35834 -30319 -31858 59848 11802 -37398 32111 -17
672 -17 -59719 23537 37632 -31697 18046 38414 -53833 -21220 43222 -23211 -7342 59696 -17152
685 -17152 -46993 31367 -8049 -38860 49315 26257 -45293 13514 15937 -56781 9952 52414
697 52414 -28290 -2981 40596 -44612 -35061 49154 -7666 -21933 52686 -6088 -57944 23831
709 23831 12231 -41404 37839 38196 -50366 -2707 28435 -47440 -1969 60745 -21677 -20622 40020
722 40020 -30464 -42598 48176 9963 -31900 41115 6311 -60188 15246 29448 -36399 22610
734 22610 44947 -46677 -16137 35012 -32279 -10989 60096 -10450 -34228 34021 -14886 -44323
746 -44323 43182 25072 -36510 25573 16191 -58151 6516 41012 -28701 6815 45837 -39298
758 -39298 -29256 37883 -16892 -19697 53252 755 -44925 23949 669 -44285 33211 34958
770 34958 -37129 6859 23277 -49389 -5050 46899 -18414 -9380 39944 -26516 -39531 35287
782 35287 754 -26055 40889 11054 -49312 10424 16597 -38378 20175 42142 -32842 -10747
794 -10747 27059 -34845 -16031 49735 -4999 -23195 32300 -12014 -44953 30181 19144 -29756
806 -29756 27760 20857 -48406 -1082 29997 -29292 6297 47309 -26681 -25250 30068 -18785
818 -18785 -24499 48254 7561 -34937 24539 2136 -45999 22381 33584 -30610 11948 28708
830 28708 -44583 -12920 38752 -17721 -8331 45967 -17844 -38252 28375 -2977 -29900 39704
842 39704 18778 -42275 12082 14076 -43321 12304 42205 -27374 -4937 31869 -36797 -22596
854 -22596 42381 -6868 -19739 39901 -8095 -46327 24502 10879 -32213 30033 26473 -44233
866 -44233 11 24843 -36942 3158 46348 -21890 -18007 31966 -24987 -29342 42442 5233
878 5233 -26361 30141 1869 -47351 17766 25063 -29197 17929 30899 -39447 -10865 30813
890 30813 -24823 -5751 46102 -12745 -27876 26059 -10143 -31407 36403 17183 -30705 17342
902 17342 11626 -42843 7396 34240 -23572 4333 32622 -32473 -21437 32444 -10431 -14610
914 -14610 39802 -4083 -35813 19084 3901 -32144 25603 27061 -32672 3811 18541 -37475
926 -37475 -2184 40310 -16048 -11040 30274 -22759 -28903 30597 2935 -22400 30153 7798
938 7798 -41109 9231 16607 -28789 15044 34415 -31051 -10926 24890 -26184 -10576 40596
950 40596 -6365 -22233 26317 -9162 -35027 26281 17180 -25347 19196 16960 -42007 1482
962 1482 29430 -24142 3712 37257 -24930 -21089 28378 -15210 -18328 40047 4394 -31270 18535
975 18535 3431 -36636 22161 28210 -28887 7466 23913 -37496 -7417 35035 -17761 -5833
987 -5833 36447 -17999 -30799 25777 -1168 -23074 33038 10818 -36931 10902 14115 -35105
999 -35105 12535 33969 -26651 -2750 24830 -31259 -14887 37022 -7334 -16096 29614 -9663
1011 -9663 -34389 22143 10335 -26868 23882 18989 -37554 2170 19863 -28649 5736 36930
1023 36930 -22207 -14278 24503 -19470 -18642 34167 2522 -23165 23467 772 -36739 16229
1035 16229 20874 -23653 13868 23083 -35021 -5955 26775 -18462 -4014 34045 -12247 -22507
1047 -22507 22157 -6990 -23651 29044 14172 -26832 12105 9706 -34269 9395 28759 -20351
1059 -20351 695 24608 -25875 -15581 27806 -7993 -12245 30312 -3055 -31542 15987 6330
1071 6330 -25308 21809 20434 -29796 1864 17959 -29568 -587 32937 -14826 -10121 24037
1083 24037 -17661 -24632 28194 3959 -20528 23585 4916 -34998 10747 17386 -26110 12412
1095 12412 26943 -27758 -7871 21821 -21058 -8128 35322 -7502 -20934 21662 -6742 -27763
1107 -27763 25028 14029 -25161 16548 13013 -34756 3865 25259 -20584 3470 29533 -23663
1119 -23663 -16629 25167 -10554 -14754 32731 458 -27680 18495 2624 -29264 20064 21697
1131 21697 -25629 7073 17885 -31341 -2199 29543 -14972 -6436 28594 -16446 -23662 24277
1143 24277 -1738 -19063 27304 6952 -31807 10949 10938 -26959 12855 25269 -23548 -3771
1155 -3771 20423 -23792 -9865 30091 -7269 -14294 23486 -8305 -28037 20371 8230 -20794
1167 -20794 18473 12368 -30420 2369 18060 -21524 4236 27565 -17962 -12739 20497 -13845
1179 -13845 -15453 29055 1266 -20272 17781 1039 -28281 14664 17582 -20334 9362 17694
1191 17694 -26584 -5705 23428 -13696 -4792 28182 -11119 -20424 19125 -2806 -19274 24256
1203 24256 10291 -24431 9981 9280 -26259 7135 24697 -17665 -1875 20773 -21051 -13079
1215 -13079 25389 -5357 -13291 24882 -3633 -26470 15487 6324 -21228 16900 16943 -26178 1056
1228 1056 15919 -22883 -424 28166 -13670 -11707 21497 -14314 -19115 25366 2378 -19116
1240 -19116 19311 3465 -29674 11379 14717 -21169 9454 21109 -24780 -6466 21079 -17477
1252 -17477 -6199 29218 -8646 -18514 19644 -5909 -22129 23275 9783 -21766 12797 9766
1264 9766 -28199 5858 21436 -17674 2416 22850 -20101 -12760 22486 -9174 -11346 26952
1276 26952 -2427 -22733 15660 2507 -22344 17807 15589 -22254 5379 13797 -24225 -536
1288 -536 25025 -13321 -5683 21853 -14665 -17547 21428 -633 -15786 21490 3285 -25384 9674
1301 9674 9614 -20633 10414 19820 -20660 -3219 16435 -18065 -6685 24891 -6468 -13283 18635
1314 18635 -6905 -21270 17512 7559 -17616 13606 9618 -25383 3202 15807 -16334 2283
1326 2283 21887 -15751 -11372 17944 -9821 -11954 23464 1104 -18829 14131 1746 -22628
1338 -22628 13529 15000 -17614 5825 14538 -22344 -3550 21052 -11146 -4693 22138 -10043
1350 -10043 -17833 18302 -1393 -15995 20634 6659 -22159 9003 8866 -22223 8204 20150
1362 20150 -16488 -1779 16916 -17626 -9600 23291 -5611 -11808 20361 -4399 -22277 15464
1374 15464 5706 -18537 15745 11306 -23496 2475 13541 -18625 1934 22526 -14233 -9254
1386 -9254 17596 -11792 -14406 22858 210 -16817 17127 192 -23984 12302 11981 -18053 9218
1399 9218 14505 -21746 -2576 17010 -13742 -4058 23501 -9317 -15176 16886 -5746 -16268 20818
1412 20818 5893 -19341 11819 5768 -21862 8011 15895 -14976 2284 17048 -17153 -8735
1424 -8735 18853 -7013 -8314 21418 -4295 -19240 14507 1738 -16467 15621 10187 -18490
1436 -18490 4847 10138 -18741 1623 19396 -10499 -5655 16333 -11810 -13491 19254 -1157
1448 -1157 -13129 16845 1210 -20472 9459 7320 -16119 9592 14247 -16990 -3411 13493
1460 13493 -13313 -4673 20870 -6972 -12186 15490 -5287 -17295 16395 5270 -15032 11929
1472 11929 5784 -20633 3809 14111 -12861 1512 16614 -14037 -9230 16299 -7561 -10495
1484 -10495 20694 -981 -16434 12809 305 -17822 13405 11609 -16001 4990 10773 -17752
1496 -17752 -1300 17939 -9950 -4878 18925 -9945 -14570 16774 -1894 -12755 18320 3203
1508 3203 -19542 9330 6714 -16757 7803 15101 -14926 -1126 14105 -15062 -6603 20266 -5456
1521 -5456 -10016 16990 -6251 -17242 15698 3656 -14544 12932 6729 -18733 3806 10852 -14739
1534 -14739 2274 17241 -12316 -7404 14554 -9952 -9597 19717 -2167 -13582 13954 -743
1546 -743 -17984 11242 8151 -14060 7657 10291 -17784 -1817 14937 -10998 -2389 17962 -9520
1559 -9520 -11442 14716 -4769 -12242 17040 2802 -14809 9185 3747 -16515 7157 13403 -12694
1572 -12694 1079 12601 -13784 -5819 16380 -6289 -7043 16968 -4654 -14656 11812 1501
1584 1501 -12541 12553 7566 -15785 3360 8874 -13794 1408 15911 -9904 -5024 13955 -10008
1597 -10008 -10173 15834 -832 -10879 13228 44 -16750 8430 7052 -12867 6466 11312 -15201
1610 -15201 -2107 12389 -11394 -3343 17350 -6720 -10589 13129 -4890 -12711 14578 3785
1622 3785 -13451 8935 5228 -17267 4342 11825 -11891 1640 13830 -13051 -7060 14801 -7071
1635 -7071 -7215 16905 -2764 -13753 11521 793 -14415 11756 8561 -14046 4566 9044 -15696
1648 -15696 707 15758 -9785 -3303 14760 -9592 -10318 15136 -2350 -10191 14902 1116 -15551
1661 -15551 8396 5434 -14005 8148 11714 -14008 -44 11098 -12701 -3168 16540 -6818
1673 -6818 -7559 13673 -5991 -12546 13127 2139 -11999 10827 4297 -16053 4540 8988 -12375
1686 -12375 3106 13295 -12064 -4668 12036 -8771 -6311 15573 -2735 -11017 10915 -1288
1698 -1288 -13524 10074 6667 -12150 5635 7633 -14648 412 11806 -9247 -1665 13794 -8385
1711 -8385 -8778 12098 -3671 -8633 13465 1951 -12938 7457 3834 -13313 6742 10465 -11143
1724 -11143 666 10347 -11687 -3694 13895 -5440 -5878 12972 -4027 -11966 10795 1831 -10621
1737 -10621 10121 5630 -13638 3320 8078 -11910 2239 13148 -9598 -4069 11374 -8081
1749 -8081 -7618 14159 -1687 -9674 10866 -302 -13999 8099 6325 -11721 5961 8712 -13816
1762 -13816 -779 10917 -9779 -2172 14233 -7566 -8284 11513 -4254 -10086 12795 2213 -12157
1775 -12157 8343 3316 -14274 5497 10069 -11272 2135 10963 -12252 -3862 12775 -6712 -5222
1788 -5222 14039 -4135 -10980 10615 -33 -10978 10500 5761 -12810 4815 6975 -13115 2596
1801 2596 12422 -9254 -1986 11723 -9253 -6871 12956 -2698 -7441 11770 -353 -12622 8095
1814 8095 4031 -11102 7230 8414 -12459 795 9447 -10799 -1020 13019 -6831 -5493 10763
1827 10763 -5491 -9282 11467 880 -9571 8436 2760 -13132 4594 7779 -10527 3168
1839 3168 9997 -10904 -3162 10178 -7367 -4290 12656 -3563 -8766 8659 -813 -10431 8802
1852 8802 5138 -10781 4794 6078 -12252 1174 10554 -8421 -855 11189 -8182 -6567 10335
1865 10335 -2764 -7042 11114 799 -11063 6763 3500 -10980 6010 8978 -10615 1208
1877 1208 8547 -10549 -1507 12187 -5687 -4870 10789 -4534 -9092 9811 1118 -9220 8872
1890 8872 4442 -12802 3990 6897 -10679 3066 10836 -9958 -2878 10154 -7804 -4768 12077
1903 12077 -2625 -7915 9482 -1028 -11644 8259 5024 -10530 5790 6649 -12960 1417 9552
1916 9552 -9546 -362 11212 -7648 -5872 9991 -4542 -7470 11405 665 -10334 7183 2463
1929 2463 -11966 6519 7596 -10801 3118 8228 -11143 -1419 10608 -6714 -2797 11068 -4897
1942 -4897 -8369 9137 -30 -8714 9550 3322 -11227 5375 5395 -11190 3720 9843 -8955 -68
1956 -68 8498 -8387 -3914 10858 -2852 -6158 9540 -1421 -9870 7675 3182 -9693 6790
1969 6790 6098 -11220 2094 6940 -8931 662 10229 -6763 -4451 8665 -4561 -6689 9485
1982 9485 430 -8730 7672 1886 -11495 5287 6261 -9056 3293 7505 -10142 -1518 8826
1995 8826 -6271 -3077 10002 -3252 -7619 8004 -1062 -9260 8750 4031 -10137 4651 4782
2008 4782 -11122 2851 8920 -8133 -398 9152 -7252 -4989 9539 -2949 -5883 9960 -264
2021 -264 -10274 6862 3043 -9755 6794 6424 -10258 2163 7259 -9332 -412 10295 -5856
2034 -5856 -3510 9198 -4842 -7778 9909 474 -8446 8549 2055 -11136 5327 5466 -9986
2047 -9986 4054 8308 -9600 -919 8212 -7190 -3001 10972 -3791 -6985 8893 -1943 -9143
2060 -9143 8599 2697 -9530 6432 4087 -11335 2725 7213 -8283 870 9042 -7977 -4031
2073 -4031 8973 -4324 -5554 10134 -1061 -8822 7588 796 -9794 6820 5360 -9273 3152
2086 3152 5932 -9667 157 8836 -6064 -2339 9252 -4870 -6589 8934 -1275 -6916 8801
2099 8801 1683 -9600 5154 3851 -8951 4279 7365 -7921 -66 7524 -7098 -2799 9734
2112 9734 -3399 -4948 8389 -2133 -8486 7647 2110 -8013 6248 3933 -9601 2135 6322
2125 6322 -7829 876 8743 -6559 -3554 8028 -4370 -5558 9512 -716 -7735 6935 694
2138 694 -9274 5438 4923 -8531 3225 6317 -9057 -861 8142 -5972 -2510 9538 -4551 -6580
2152 -6580 8136 -1411 -7286 8358 2178 -9258 5168 3611 -9434 3143 7531 -7809 72
2165 72 8034 -7487 -3313 9274 -3573 -5050 9396 -1898 -8512 7629 1443 -8184 6573 4626
2179 4626 -9418 2737 6104 -8696 975 9114 -6347 -2925 8637 -5402 -5570 9614 -1178
2192 -1178 -6684 7950 397 -9475 5863 4101 -8359 4079 6285 -8981 -111 7689 -6898
2205 -6898 -1793 9365 -4628 -5177 7984 -2688 -7137 8343 1252 -7858 5676 2609 -9261
2218 -9261 3383 6094 -7736 1132 7229 -7389 -2741 8136 -4421 -4097 8877 -2291 -6990
2231 -6990 6893 332 -7743 6232 3899 -8243 3174 4774 -8133 510 7884 -5884 -1795
2244 -1795 8053 -5123 -4805 8053 -1458 -5897 7712 551 -8269 5139 3151 -7594 3837 6094
2258 6094 -7739 126 6706 -6570 -1849 8788 -3704 -4628 7821 -2562 -6983 7461 1114
2271 1114 -7055 5679 3048 -8922 2761 5655 -7188 1030 7600 -6703 -3061 7810 -4759
2284 -4759 -3993 8841 -1708 -6798 6827 62 -8359 5939 3659 -7835 3266 5034 -8492
2297 -8492 326 7620 -6173 -1564 8280 -5126 -5290 8235 -2159 -6080 8175 340 -7959 5319
2311 5319 2612 -8377 4131 6034 -7686 873 6627 -7042 -1827 8668 -4351 -3768 8635
2324 8635 -3144 -6523 7206 217 -6862 6670 2749 -8454 3218 4715 -7376 1686 7436
2337 7436 -6632 -1745 7552 -5400 -3747 8660 -2240 -5545 7347 -945 -7539 5809 2825
2350 2825 -7026 3791 4574 -8050 717 6514 -6160 -1025 7963 -4875 -4231 7201 -3137 -5176
2364 -5176 7683 77 -6940 5160 1832 -7743 3503 4834 -6798 1014 6237 -6991 -2025 7393
2378 7393 -4383 -2933 7656 -2918 -5919 6568 -282 -6331 5760 2694 -7011 2732 4172 -7328
2392 -7328 1136 7262 -5665 -1512 7126 -5034 -3878 7993 -2191 -4846 7116 -315 -6843 4973
2406 4973 2709 -6757 3949 5016 -7278 379 6159 -6125 -1012 8036 -4517 -3487 7356 -3013
2420 -3013 -5626 7193 399 -6276 5475 1792 -7707 3190 5105 -6706 1298 6536 -6755 -1605
2434 -1605 7184 -4958 -3275 8217 -2713 -5634 6479 -955 -6589 5884 2660 -7280 3212
2447 3212 4072 -7695 1288 6479 -6238 -604 7511 -5661 -3807 7406 -2783 -4431 7303 -781
2461 -781 -6968 5312 1757 -6914 4138 4597 -6946 1398 5651 -6907 -483 7580 -4610 -2615
2475 -2615 7029 -3656 -4851 7086 -566 -5481 5692 1697 -7104 3382 3914 -6789 2308 6044
2489 6044 -6509 -833 6323 -5145 -2312 7480 -2932 -4357 6222 -993 -6124 5286 2031 -6177
2503 -6177 3728 3505 -7255 1115 5557 -5747 -221 6608 -5053 -2879 6368 -2964 -4214 6663
2517 6663 -417 -5858 4761 1092 -6678 3698 4299 -6513 1365 5140 -6394 -798 6508 -4335
2531 -4335 -2347 6794 -3092 -4820 5867 -516 -5404 5492 1940 -7021 3163 3699 -6663 1834
2545 1834 5889 -5924 -573 6249 -5131 -2704 7090 -2301 -4235 6384 -706 -6199 5417 1899
2559 1899 -6378 4016 3864 -7122 1425 5226 -6277 6 6841 -4875 -2881 6407 -3262 -4261
2573 -4261 6894 -309 -5785 5490 1251 -7117 3918 3725 -6564 2206 5068 -6711 -552 6315
2587 6315 -4811 -1829 6878 -3207 -4373 6088 -1092 -5732 5795 1440 -6465 3768 2739 -7062
2601 -7062 2113 5189 -5948 146 5848 -5273 -2377 6471 -2905 -3559 6578 -1400 -5598 5228
2615 5228 1008 -5973 4469 3382 -6502 2083 4301 -6031 392 6203 -4435 -1858 6095 -3460
2629 -3460 -3766 6182 -681 -5009 5531 1016 -6364 3834 2917 -5691 2452 4673 -5903 -230 5428
2644 5428 -4605 -1680 6384 -2712 -4068 5713 -1345 -5131 5509 1235 -5754 3659 2511 -6626
2658 -6626 1957 4689 -5339 202 5544 -4731 -2448 5948 -2950 -3466 6168 -824 -5347 4780
2672 4780 651 -6101 4093 3214 -6225 1784 4227 -5995 -102 6079 -4546 -1734 6193 -3334
2686 -3334 -4133 6162 -888 -5039 5736 932 -6361 3735 2788 -6155 2747 4854 -5778 79
2700 79 5315 -4906 -1749 6770 -2817 -3548 6184 -1647 -5422 5428 1130 -5743 4412 2682 -6528
2715 -6528 2168 4175 -5585 646 5843 -5047 -1934 6001 -3420 -3296 6558 -1260 -4882 5303 -19
2730 -19 -5847 4316 2597 -5911 2605 4013 -6274 385 5218 -4600 -1195 6004 -3621 -3726 5894
2745 5894 -1724 -4495 5553 530 -5794 3690 1966 -6199 2767 4003 -5405 664 4811 -5130 -1366
2760 -1366 5902 -2957 -2833 5897 -1645 -4899 5008 431 -5030 4369 2242 -5927 2140 3738 -5354
2775 -5354 943 5365 -4471 -1315 5264 -3159 -3181 5991 -1085 -4285 5103 219 -5628 3947 2496
2790 2496 -5711 2791 3797 -5659 394 4695 -4475 -1089 5831 -3150 -3399 5228 -1560 -4448 5364
2805 5364 852 -5468 3922 1912 -5984 2381 4066 -5308 670 4944 -5118 -1622 5600 -3053 -2967
2820 -2967 5842 -1710 -4930 5066 54 -5639 4449 2455 -6001 2450 3423 -5890 1009 5280 -4420
2835 -4420 -1355 5579 -3743 -3153 5798 -1456 -4247 5505 235 -5938 4242 1935 -5600 3343 3804
2850 3804 -5650 740 4714 -4935 -863 5823 -3263 -2771 5491 -2034 -4562 5633 231 -4990 4548
2865 4548 1640 -5971 2942 3454 -5428 1472 4595 -4808 -1069 5043 -3516 -2564 5989 -1782 -4265
2880 -4265 4868 -239 -5256 4483 1730 -5374 2924 2812 -5492 949 4349 -4352 -577 5019 -3684
2895 -3684 -2868 5272 -1639 -3967 5213 -236 -5184 4071 1284 -5468 2945 3401 -4997 852 3941
2910 3941 -4701 -778 5340 -2938 -2536 5320 -2049 -4318 5014 -162 -4689 4358 1654 -5616 2650
2925 2650 3023 -4936 1395 4472 -4275 -1002 5240 -3312 -2606 5594 -1481 -3919 4979 -203 -5223
2940 -5223 4309 1845 -5011 2754 3121 -5361 800 4488 -4404 -781 5362 -3212 -3056 5365 -1931
2955 -1931 -4034 5593 74 -5007 3996 1274 -5602 2749 3263 -5173 1094 4202 -4754 -1077 5172
2970 5172 -3321 -2387 5672 -2133 -4289 4982 -299 -4780 4575 1203 -5510 2814 2864 -5453 1400 4647
2986 4647 -4534 -422 4877 -3776 -2317 5728 -1816 -3601 5265 -699 -4858 4228 1210 -5011 3272
3001 3272 2911 -5380 1115 3932 -4355 -202 5303 -3485 -2296 5240 -2280 -3330 5154 -158 -4362
3016 -4362 4337 1069 -5304 2891 2859 -4699 1372 4007 -4680 -625 4781 -3383 -1938 5264 -1921
3031 -1921 -3698 4669 -756 -4505 4222 1316 -4925 2432 2466 -5055 1142 3975 -4271 -383 4727
3046 4727 -3521 -2416 4952 -1881 -3337 4954 -494 -4631 3656 1189 -4926 2941 3045 -4914 849
3061 849 3874 -4522 -554 5163 -3092 -2105 4911 -1920 -3836 4900 -133 -4360 4120 1318 -5057
3076 -5057 2472 3078 -4649 1186 4423 -4382 -530 4726 -3101 -1951 5340 -1829 -3688 4608 -543
3091 -543 -4534 4050 1674 -4824 2897 2722 -5220 1108 4248 -4341 -435 5065 -3525 -2325 5016
3106 5016 -2109 -3415 5045 -363 -4545 4042 951 -5217 2981 2841 -5017 1263 3872 -4842 -284
3121 -284 4876 -3480 -1763 5003 -2280 -3529 4692 -658 -4104 4198 889 -4933 2723 2416 -5003
3136 -5003 1694 3942 -4388 -284 4284 -3578 -1798 5221 -2162 -2908 4667 -800 -4247 3922 1137
3151 1137 -4530 2944 2625 -4916 1231 3553 -4273 -10 4602 -3305 -1772 4633 -1923 -3007 4743
3166 4743 -425 -3896 3851 800 -4601 2601 2716 -4559 1296 3463 -4453 -386 4309 -3088 -1841
3181 -1841 4664 -1895 -3253 4130 -569 -4004 3831 1281 -4702 2564 2311 -4723 1173 3856 -4103
3196 -4103 -384 4376 -3626 -1894 4748 -1862 -2971 4409 -697 -4346 3603 909 -4522 2846 2646
3211 2646 -4877 1108 3554 -4291 -178 4630 -3276 -1931 4625 -2102 -3098 4676 -476 -3787 3930
3226 3930 814 -4765 2893 2489 -4637 1605 3773 -4335 -208 4586 -3499 -1466 5089 -2127 -2973
3241 -2973 4477 -929 -4038 4078 879 -4371 2889 2250 -4827 1504 3711 -4144 114 4343 -3634
3256 -3634 -1644 4573 -2177 -2679 4756 -989 -3836 3715 463 -4404 3038 2245 -4656 1548 3056
3271 3056 -4400 6 4151 -3482 -1265 4555 -2647 -2708 4337 -902 -3355 3974 388 -4487 2611
3286 2611 1976 -4433 1387 3193 -4315 66 3943 -3534 -1149 4507 -2062 -2460 4244 -1058 -3581
3301 -3581 3779 817 -4070 2604 2232 -4417 1436 3178 -3988 348 4114 -3182 -1346 4129 -2317
3316 -2317 -2446 4272 -823 -3488 3621 682 -4004 2709 1994 -4322 1404 3152 -4247 -131 4023
3331 4023 -3279 -1085 4268 -2217 -2679 4279 -665 -3660 3496 658 -4255 2572 2015 -4313 1589
3346 1589 3306 -4306 32 3781 -3612 -1398 4255 -2323 -2387 4206 -990 -3572 3563 643 -4062
3361 -4062 2829 1956 -4616 1467 3159 -4106 303 4030 -3482 -1068 4272 -2472 -2455 4145 -723 -3214
3377 -3214 3687 435 -4197 2811 2032 -4276 1595 2982 -4349 496 3600 -3527 -817 4308 -2279
3392 -2279 -2147 4039 -1188 -3015 3703 530 -3950 2797 1838 -4439 1787 2906 -4034 517 3657
3407 3657 -3644 -977 3961 -2386 -2086 3953 -1091 -3107 3453 335 -3859 2948 1743 -4215 1504
3422 1504 2486 -4098 589 3595 -3366 -812 3750 -2318 -2103 3891 -892 -2951 3526 274 -3945
3437 -3945 2470 1604 -4051 1847 2822 -3869 372 3236 -3263 -798 3916 -2232 -1898 3698 -1009 -3123
3453 -3123 3437 562 -3592 2718 1638 -4200 1592 2748 -3643 560 3485 -3216 -813 3887 -2182
3468 -2182 -1949 3952 -821 -3072 3423 401 -3794 2667 1895 -4149 1561 2568 -3995 356 3348
3483 3348 -3081 -771 3894 -2366 -2301 3870 -963 -2967 3493 205 -3892 2686 1543 -4246 1834
3498 1834 2764 -3919 519 3283 -3471 -750 3941 -2164 -1971 3912 -1030 -3101 3603 66 -3709
3513 -3709 2695 1479 -4088 1716 2579 -3833 847 3310 -3379 -704 3703 -2297 -1741 3999 -1132
3528 -1132 -2704 3363 -24 -3669 3003 1441 -3778 1888 2223 -3675 616 3252 -3047 -487 3742
3543 3742 -2289 -1758 3729 -1076 -2845 3510 220 -3543 2695 1245 -3658 1811 2392 -3610 582
3558 582 3037 -3199 -579 3551 -2046 -1720 3645 -1261 -2885 3278 71 -3468 2712 1217 -3746
3573 -3746 1551 2094 -3542 383 3192 -2923 -670 3430 -2268 -1811 3566 -941 -2704 3111 169
3588 169 -3531 2470 1390 -3445 1683 2334 -3652 410 2987 -3064 -660 3626 -1992 -1812 3591 -1268
3604 -1268 -2720 3442 150 -3317 2675 1282 -3666 1544 2425 -3374 704 3062 -2888 -704 3648
3619 3648 -2232 -1750 3825 -1131 -2701 3220 46 -3419 2735 1413 -3677 1701 2192 -3578 573
3634 573 3216 -2997 -578 3579 -2331 -1742 3504 -1215 -2721 3474 -81 -3476 2487 1071 -3666
3649 -3666 1698 2283 -3543 589 2893 -3153 -607 3406 -2070 -1731 3428 -1223 -2739 3360 -135
3664 -135 -3082 2734 1106 -3654 1827 1976 -3279 860 2158 -3289 -326 3349 -1880 -1303 3363 -974
3680 -974 -2552 3214 -132 -2973 2611 1185 -3212 1660 2035 -3369 655 2668 -2554 -251 3302
3695 3302 -2179 -1616 3372 -1178 -2332 3236 -16 -3077 2495 863 -3332 1751 1930 -3234 605
3710 605 2702 -2804 -511 3267 -2120 -1365 3236 -1214 -2484 3033 -100 -2880 2588 1020 -3268
3725 -3268 1582 1861 -3208 516 2796 -2793 -464 3123 -2015 -1663 3314 -1155 -2505 3157 -212
3740 -212 -3205 2467 875 -3271 1645 1957 -3327 538 2732 -2670 -410 3402 -1964 -1533 3249 -1057
3756 -1057 -2317 3021 84 -3008 2565 994 -3272 1688 2045 -3051 634 2730 -2790 -465 3127
3771 3127 -1975 -1477 3310 -1247 -2401 3170 -384 -2848 2632 888 -3104 1726 1758 -3147 838 2473
3787 2473 -2646 -391 3145 -2084 -1449 3260 -1206 -2171 2983 -304 -2858 2457 678 -2852 1783
3802 1783 1591 -3004 773 2291 -2734 -321 3023 -2035 -1352 3125 -1189 -2222 3016 -301 -2618
3817 -2618 2272 554 -2915 1742 1661 -2890 712 2488 -2527 -232 2803 -1897 -1409 3099 -1158 -2125
3833 -2125 2893 -139 -2468 2404 765 -2906 1622 1541 -2727 578 2384 -2568 -303 2885 -2080
3848 -2080 -1285 3081 -1150 -2060 2881 -297 -2782 2366 684 -2843 1540 1670 -2822 393 2346 -2594
3864 -2594 -372 3006 -1830 -1401 2994 -1262 -2312 2915 -219 -2672 2309 710 -2877 1686 1543
3879 1543 -2848 623 2528 -2553 -485 2978 -2118 -1383 2901 -1269 -1935 2825 -344 -2842 2501
3894 2501 704 -2692 1635 1504 -2763 575 2473 -2554 -215 2846 -2030 -1230 3036 -1156 -1916 3189
3910 3189 -404 -2464 2388 624 -2652 1621 1576 -2880 605 2297 -2540 -279 2850 -2100 -990
3925 -990 3017 -1322 -1879 2661 -312 -2385 2350 562 -2741 1541 1318 -2745 679 2271 -2372 -175
3941 -175 2576 -2120 -1031 2834 -1245 -1719 2663 -445 -2237 2068 486 -2578 1546 1488 -2806 673
3957 673 1973 -2533 -99 2546 -2058 -1091 2705 -1258 -1733 2620 -251 -2209 2162 502 -2623 1549
3973 1549 1443 -2493 707 2028 -2257 -152 2527 -1866 -1041 2831 -1086 -1787 2581 -340 -2211 2207
3989 2207 828 -2485 1392 1232 -2730 753 2084 -2502 -104 2511 -1927 -1022 2686 -1185 -1867 2726
4005 2726 -402 -2355 2010 548 -2791 1719 1378 -2762 641 2099 -2579 -105 2700 -1928 -916
4020 -916 2612 -1259 -1643 2591 -363 -2385 2277 507 -2558 1456 1155 -2539 821 2154 -2578 -90
4036 -90 2451 -1963 -931 2672 -1208 -1657 2662 -538 -2174 2162 612 -2378 1740 1214 -2788 826
4052 826 1973 -2412 -77 2384 -1940 -798 2548 -1295 -1380 2476 -387 -2100 2075 302 -2470 1616
4068 1616 1284 -2450 869 1959 -2308 98 2425 -1963 -659 2449 -1417 -1469 2460 -388 -1934 2092
4084 2092 331 -2479 1460 1234 -2430 839 1720 -2243 -52 2142 -1836 -845 2460 -1125 -1487 2309
4100 2309 -496 -2151 1910 358 -2351 1450 1234 -2360 773 1710 -2151 110 2204 -1892 -851
4115 -851 2310 -1020 -1473 2378 -477 -2009 2044 422 -2452 1369 1220 -2338 926 1865 -2247 13
4131 13 2244 -1752 -869 2451 -1147 -1344 2348 -421 -1860 2013 415 -2482 1540 1095 -2472 764
4147 764 1857 -2227 54 2226 -1866 -681 2456 -1203 -1359 2328 -427 -2084 1982 318 -2270
4162 -2270 1545 1136 -2404 818 1663 -2275 81 2094 -1744 -704 2385 -1273 -1436 2207 -515 -1933
4178 -1933 1991 279 -2262 1506 882 -2360 962 1642 -2215 103 2103 -1898 -560 2382 -1261
4193 -1261 -1150 2202 -519 -1782 1987 238 -2135 1481 792 -2266 932 1666 -2103 317 1979 -1680
4209 -1680 -447 2182 -1279 -1132 2282 -530 -1666 1840 227 -2093 1502 943 -2219 1048 1415 -2142
4225 -2142 283 1877 -1626 -564 2187 -1225 -1101 2170 -516 -1663 1946 250 -2091 1594 835
4240 835 -2207 979 1663 -2025 183 1890 -1811 -437 2069 -1354 -1126 2027 -641 -1714 1818 228
4256 228 -2003 1470 856 -2194 938 1317 -2151 411 1757 -1738 -379 2102 -1159 -1219 2011 -575
4272 -575 -1644 1814 168 -2174 1590 796 -2148 894 1543 -2087 195 2019 -1830 -385 1988 -1201
4288 -1201 -1072 2167 -541 -1635 2028 194 -2027 1551 767 -2286 968 1411 -2166 339 1773 -1754
4304 -1754 -366 2128 -1256 -1073 2093 -503 -1684 1871 75 -2035 1578 715 -2146 1043 1213 -2076
4320 -2076 464 1857 -1757 -304 2012 -1196 -1027 1940 -585 -1587 1919 -72 -1962 1535 687
4335 687 -2123 1039 1307 -2183 483 1566 -1836 -241 1916 -1102 -1139 1917 -812 -1638 1941 41
4351 41 -1972 1577 709 -2108 1000 1256 -1968 493 1632 -1612 -275 1902 -1092 -823 1902 -603
4367 -603 -1452 1754 175 -1862 1648 669 -2062 969 1186 -1942 429 1618 -1662 -213 1759 -1154
4383 -1154 -979 1995 -612 -1477 1873 29 -1909 1406 693 -1968 907 1208 -1940 298 1512 -1691
4399 -1691 -271 2067 -1220 -883 2023 -733 -1576 1766 -133 -2014 1587 575 -2026 954 1107 -1906
4415 -1906 408 1535 -1630 -300 1879 -1264 -815 2097 -664 -1452 1929 -115 -1787 1633 488
4430 488 -1971 1149 1244 -1920 403 1427 -1729 -243 1901 -1362 -933 2005 -818 -1205 1940 -107
4446 -107 -1695 1505 435 -1917 1171 976 -1826 528 1480 -1687 -241 1862 -1238 -764 1896 -767
4462 -767 -1419 1840 -127 -1592 1535 435 -1973 1034 888 -1923 500 1421 -1647 -100 1663 -1341
4478 -1341 -667 1909 -920 -1300 1797 -262 -1784 1438 414 -1875 1194 914 -1853 468 1429 -1704
4494 -1704 -187 1742 -1255 -742 1843 -713 -1245 1755 -244 -1636 1451 291 -1919 1199 1035 -1871
4510 -1871 601 1381 -1712 -6 1809 -1334 -604 2025 -849 -1230 1835 -224 -1559 1572 521 -1920
4526 -1920 1159 948 -1864 593 1454 -1662 -170 1811 -1296 -651 1761 -892 -1234 1873 -286 -1604
4542 -1604 1413 336 -1736 1119 1004 -1800 510 1377 -1802 63 1570 -1352 -535 1805 -958 -1252
4558 -1252 1800 -360 -1510 1536 259 -1712 1190 768 -1815 585 1348 -1712 41 1646 -1436
4573 -1436 -537 1814 -1054 -967 1822 -467 -1528 1607 226 -1763 1174 660 -1797 745 1458 -1760
4589 -1760 2 1558 -1457 -393 1731 -847 -922 1826 -410 -1323 1542 260 -1616 1237 736 -1817
4605 -1817 811 1184 -1759 140 1533 -1438 -358 1684 -1004 -1047 1638 -446 -1460 1425 124 -1704
4621 -1704 1214 656 -1782 625 1291 -1742 -50 1601 -1357 -347 1698 -959 -1040 1679 -364 -1293
4637 -1293 1434 -50 -1688 1209 717 -1702 806 1184 -1723 83 1453 -1383 -386 1726 -1071 -931
4653 -931 1654 -468 -1287 1406 230 -1635 1327 639 -1580 713 1160 -1551 120 1675 -1397 -361
4669 -361 1831 -1007 -876 1751 -480 -1343 1545 111 -1576 1311 605 -1748 793 1199 -1643 263
4685 263 1325 -1458 -317 1780 -1072 -875 1778 -629 -1250 1574 2 -1669 1220 682 -1700 663
4701 663 908 -1660 188 1438 -1578 -294 1661 -1074 -828 1673 -679 -1257 1543 -13 -1627 1236
4717 1236 563 -1788 758 1083 -1734 228 1495 -1525 -128 1678 -1174 -658 1762 -638 -1252 1610
4733 1610 4 -1469 1295 530 -1565 784 945 -1528 299 1383 -1420 -140 1587 -1129 -675 1545
4749 1545 -702 -1131 1503 -162 -1498 1208 633 -1429 737 865 -1724 262 1403 -1525 -291 1549
4765 1549 -1068 -766 1726 -625 -1139 1443 -191 -1533 1339 604 -1706 808 868 -1756 396 1450
4781 1450 -1474 -309 1730 -1216 -662 1462 -654 -1111 1565 -48 -1553 1364 333 -1651 924
4796 924 992 -1506 230 1366 -1481 -270 1557 -1150 -726 1551 -697 -1046 1591 -131 -1450 1240
4812 1240 518 -1658 862 1126 -1777 445 1335 -1485 -72 1650 -1162 -704 1644 -696 -1163 1419
4828 1419 -31 -1484 1283 524 -1671 1036 995 -1743 435 1336 -1653 -83 1752 -1209 -581 1622
4844 1622 -830 -1053 1480 -226 -1395 1213 241 -1594 959 798 -1693 519 1251 -1540 -32 1459
4860 1459 -1249 -566 1658 -763 -1026 1433 -270 -1418 1246 357 -1639 959 881 -1619 330 1239
4876 1239 -1513 18 1455 -1069 -508 1694 -766 -1100 1476 -270 -1352 1286 228 -1645 1016
4891 1016 865 -1544 491 1273 -1386 -117 1415 -1169 -456 1710 -684 -1071 1449 -182 -1433 1309
4907 1309 233 -1596 940 778 -1551 584 1316 -1461 -32 1479 -1209 -443 1684 -747 -922 1471
4923 1471 -326 -1337 1363 228 -1650 1076 889 -1722 431 1407 -1531 -40 1510 -1274 -603 1720
4939 1720 -822 -1030 1603 -202 -1356 1395 283 -1445 1222 747 -1701 584 1066 -1584 36 1481
4955 1481 -1177 -501 1617 -790 -831 1568 -164 -1369 1384 260 -1541 1011 800 -1578 532 1178
4971 1178 -1477 7 1309 -1261 -384 1798 -750 -928 1571 -339 -1429 1388 150 -1551 1034
4986 1034 756 -1703 602 1211 -1588 86 1573 -1339 -450 1683 -924 -802 1544 -311 -1361 1415
5002 1415 265 -1648 1152 635 -1612 638 993 -1420 0 1485 -1232 -374 1487 -762 -953 1691
5018 1691 -341 -1247 1319 234 -1483 897 739 -1633 530 1202 -1352 122 1326 -1173 -404 1587
5034 1587 -819 -867 1486 -318 -1251 1464 124 -1358 1056 658 -1479 591 1117 -1481 68 1458
5050 1458 -1187 -453 1694 -875 -850 1577 -268 -1330 1410 263 -1529 1001 621 -1472 685 1136
5066 1136 -1550 21 1418 -1178 -395 1524 -887 -893 1591 -436 -1159 1335 223 -1539 1107 582
5082 582 -1731 680 1024 -1673 99 1418 -1347 -398 1752 -795 -963 1442 -442 -1220 1403 65
5098 65 -1614 1153 509 -1663 753 1058 -1631 178 1417 -1359 -390 1559 -852 -752 1533 -412
5114 -412 -1220 1414 77 -1459 1169 589 -1479 599 1109 -1456 285 1285 -1348 -282 1609 -1036
5130 -1036 -852 1480 -413 -1291 1336 25 -1366 1048 597 -1430 654 878 -1494 72 1435 -1280
5146 -1280 -392 1552 -867 -801 1422 -532 -1311 1380 51 -1394 1170 563 -1674 660 966 -1521
5162 -1521 368 1155 -1350 -324 1481 -880 -788 1545 -578 -1216 1415 94 -1481 1027 561 -1544
5178 -1544 641 988 -1416 197 1270 -1263 -409 1558 -832 -928 1555 -444 -1200 1483 -15 -1424
5194 -1424 1210 498 -1590 728 903 -1578 191 1318 -1217 -238 1537 -886 -794 1636 -368 -1205
5210 -1205 1392 70 -1443 1210 588 -1699 775 918 -1602 152 1225 -1333 -341 1688 -945 -753
5226 -753 1468 -528 -1365 1426 107 -1487 1072 396 -1601 780 925 -1445 187 1399 -1194 -249
5242 -249 1567 -813 -723 1576 -512 -1232 1488 -68 -1446 1178 590 -1541 884 1026 -1471 336
5258 336 1181 -1324 -364 1612 -936 -714 1704 -493 -1264 1448 28 -1431 1258 559 -1581 637
5274 637 932 -1475 181 1162 -1214 -179 1417 -858 -832 1484 -556 -1112 1441 -103 -1390 1180
5290 1180 437 -1564 753 936 -1456 292 1176 -1296 -327 1547 -986 -693 1671 -532 -1292 1485
5306 1485 6 -1408 1234 436 -1520 672 980 -1364 184 1266 -1416 -325 1516 -915 -634 1556
5322 1556 -580 -1147 1432 -123 -1398 1079 483 -1594 715 819 -1519 255 1120 -1233 -205 1504
5338 1504 -872 -793 1543 -477 -987 1510 33 -1208 1200 457 -1452 756 858 -1388 332 1249
5354 1249 -1389 -248 1478 -1132 -664 1633 -560 -1116 1670 -99 -1381 1226 303 -1615 830 887
5370 887 -1582 334 1297 -1351 -176 1478 -1003 -565 1591 -782 -1037 1458 -204 -1259 1144 546
5386 546 -1503 856 815 -1523 389 1199 -1368 -151 1493 -1091 -467 1448 -769 -1052 1351 -182
5402 -182 -1378 1202 376 -1501 877 812 -1492 410 1330 -1381 -133 1490 -1047 -611 1577 -501
5418 -501 -1016 1560 -195 -1270 1014 369 -1591 964 828 -1446 236 1140 -1351 -199 1455 -1212
5434 -1212 -550 1541 -657 -1086 1369 -217 -1312 1287 381 -1404 717 957 -1436 416 1254 -1286
5450 -1286 -77 1612 -983 -673 1396 -617 -1033 1428 -129 -1346 1192 216 -1601 922 886 -1603
5466 -1603 383 1132 -1347 -225 1417 -1148 -568 1700 -661 -1054 1404 -243 -1380 1234 474 -1622
5482 -1622 941 910 -1464 395 1164 -1416 -73 1476 -1151 -555 1635 -658 -947 1571 -208 -1351
5498 -1351 1243 244 -1611 807 756 -1477 463 1264 -1287 25 1352 -1115 -534 1602 -741 -956
5514 -956 1496 -227 -1407 1237 310 -1386 1038 606 -1569 500 1142 -1444 8 1364 -1240 -507
5530 -507 1395 -661 -1083 1410 -249 -1419 1256 210 -1366 884 705 -1650 531 1238 -1327 -102
5546 -102 1205 -1120 -655 1517 -825 -873 1493 -226 -1208 1186 278 -1468 855 787 -1470 370 1186
5563 1186 -1397 -9 1442 -1041 -607 1471 -659 -1065 1382 -179 -1237 1265 291 -1459 881 759
5579 759 -1541 541 1158 -1327 11 1416 -1103 -444 1434 -594 -971 1465 -307 -1203 1143 287
5595 287 -1297 875 750 -1468 572 1216 -1365 -112 1430 -1118 -425 1622 -745 -1044 1400 -214
5611 -214 -1347 1282 292 -1502 955 687 -1482 488 1187 -1551 38 1378 -1191 -418 1483 -644
5627 -644 -932 1429 -135 -1262 1287 290 -1382 872 669 -1596 514 1056 -1410 142 1485 -1178
5643 -1178 -575 1507 -747 -912 1451 -361 -1062 1364 349 -1385 899 702 -1413 463 901 -1381
5659 -1381 0 1441 -1101 -344 1348 -841 -882 1358 -210 -1099 1305 229 -1498 963 657 -1606
5675 -1606 439 1029 -1475 139 1320 -1158 -336 1416 -847 -853 1370 -282 -1260 1217 262 -1473 989
5692 989 722 -1570 538 1109 -1501 28 1421 -1115 -318 1418 -840 -845 1478 -231 -1155 1180 391
5709 391 -1478 857 696 -1403 531 1241 -1341 230 1243 -1170 -352 1441 -785 -825 1447 -282
5725 -282 -1154 1141 194 -1411 838 669 -1583 520 1072 -1317 67 1297 -1100 -408 1466 -860
5741 -860 -846 1376 -343 -1299 1142 110 -1409 958 647 -1488 500 957 -1245 111 1295 -1163
5757 -1163 -361 1434 -674 -754 1316 -388 -1151 1140 85 -1427 1002 598 -1436 695 990 -1412
5773 -1412 145 1277 -1196 -442 1341 -844 -677 1406 -292 -1227 1083 154 -1417 918 454 -1593
5789 -1593 565 1001 -1386 103 1280 -1112 -246 1822 -672 -810 1371 -347 -1176 1095 205 -1380
5805 -1380 939 574 -1459 431 1060 -1313 50 1368 -1041 -440 1380 -759 -849 1339 -285 -1092
5821 -1092 1236 131 -1621 870 522 -1464 514 890 -1484 89 1221 -1012 -460 1413 -678 -677
5837 -677 1192 -327 -1267 1294 92 -1370 988 556 -1503 561 890 -1362 172 1119 -1035 -340
5853 -340 1355 -795 -811 1419 -334 -1256 1275 110 -1430 964 669 -1592 635 1058 -1223 84
5869 84 1241 -1109 -297 1477 -815 -729 1411 -171 -1055 1315 -16 -1395 1052 623 -1435 449 855
5886 855 -1397 64 1207 -1042 -191 1339 -796 -882 1558 -508 -1042 1237 195 -1494 1010 532
5902 532 -1375 649 944 -1443 140 1139 -1128 -285 1333 -801 -760 1345 -488 -1065 1124 7 -1402
5919 -1402 1095 439 -1388 711 883 -1320 171 1098 -1088 -379 1308 -845 -867 1314 -521 -1021 1300
5936 1300 71 -1224 961 461 -1474 616 842 -1269 266 1122 -1106 -235 1370 -642 -688 1334
5952 1334 -365 -1021 1259 71 -1342 1137 542 -1420 562 749 -1265 175 1212 -1046 -94 1261
5968 1261 -707 -759 1278 -418 -1114 1231 35 -1334 910 517 -1408 449 877 -1382 78 1249
5984 1249 -1178 -274 1179 -682 -671 1264 -428 -1044 1299 133 -1218 1040 408 -1391 596 1009
6000 1009 -1287 220 1160 -1015 -277 1531 -801 -621 1434 -336 -1070 1230 -25 -1498 1136 399
6016 399 -1188 623 915 -1349 175 1238 -1050 -193 1365 -794 -620 1278 -416 -1020 1279 2
6032 2 -1299 978 500 -1285 615 841 -1286 198 1006 -1068 -351 1371 -848 -690 1328 -535 -1020
6049 -1020 1259 -3 -1297 980 461 -1342 699 820 -1364 252 1083 -1228 -36 1250 -556 -553
6065 -553 1239 -439 -1153 1239 90 -1122 1055 512 -1271 655 715 -1163 214 1087 -1098 -173 1242
6082 1242 -806 -526 1294 -486 -1043 1265 -32 -1197 1050 345 -1359 636 735 -1204 218 1088
6098 1088 -1142 -160 1249 -854 -665 1298 -506 -873 1259 -39 -1256 947 494 -1188 593 809
6114 809 -1140 262 1140 -1091 -176 1116 -824 -674 1339 -421 -1091 1062 -64 -1157 928 394
6130 394 -1368 683 672 -1252 213 1209 -1014 -180 1164 -942 -693 1183 -419 -730 1275 -157 -848
6147 -848 1008 152 -1306 678 534 -1224 313 811 -1099 -228 1440 -706 -595 1250 -550 -1010 1126
6164 1126 -9 -1143 892 213 -1057 760 728 -1142 420 1051 -1181 73 1404 -993 -280 1203
6180 1203 -576 -621 987 -38 -896 1093 312 -1067 764 938 -792 445 727 -954 -185 1283 -658
6197 -658 -722 1646 -587 -802 1303 -97 -847 1331 126 -1094 824 842 -939 385 1035 -926 -280
6214 -280 673 -865 -310 1321 -879 -736 956 -91 -1097 756 334 -1246 695 554 -1146 547
6230 547 911 -1041 -120 1330 -963 -366 1225 -583 -825 1176 -57 -1092 918 467 -1106 739
6246 739 818 -1120 226 925 -992 -147 1142 -851 -477 1328 -454 -775 1133 -97 -1191 986 285
6263 285 -1168 760 580 -1256 115 922 -1103 20 1231 -953 -459 1287 -591 -860 1097 -90
6279 -90 -1030 918 356 -1130 715 569 -1268 303 807 -1165 -105 1098 -868 -555 1133 -534 -781
6296 -781 1064 -180 -1028 1038 207 -1113 686 561 -1196 274 995 -1084 -114 1184 -870 -391 1415
6313 1415 -614 -746 1121 -168 -994 1010 231 -1300 741 626 -1178 376 870 -1143 -134 1149
6329 1149 -830 -559 1366 -519 -721 1206 -250 -962 1031 324 -1062 621 616 -1120 296 765 -1147
6346 -1147 29 1143 -819 -349 1047 -551 -773 1143 -206 -1063 892 200 -1119 751 485 -1224
6362 -1224 317 870 -995 -51 1096 -990 -344 1272 -514 -848 1090 -278 -935 889 418 -1047
6378 -1047 748 552 -1170 364 698 -1030 -30 1056 -867 -595 1132 -537 -626 1145 -140 -1076
6394 -1076 1003 56 -1033 706 549 -1031 326 732 -1076 58 1184 -859 -290 1062 -476 -550
6410 -550 994 -103 -1072 865 37 -1161 710 581 -1355 321 694 -1125 -48 1069 -917 -366
6426 -366 1097 -558 -652 956 -294 -916 1114 78 -1096 910 612 -1184 341 849 -1018 93
6442 93 922 -822 -351 1222 -621 -670 1090 -160 -1047 909 -6 -872 653 452 -1053 344 806 -977
6460 -977 192 974 -806 -300 1138 -624 -603 994 -258 -975 966 95 -1046 741 514 -1128 441
6477 441 824 -1193 116 918 -866 -321 1042 -464 -590 1117 -181 -866 1052 42 -1059 694
6493 694 473 -1088 300 866 -1014 50 849 -725 -320 950 -676 -765 1111 -92 -1012 893 148
6510 148 -1089 681 500 -1049 559 829 -977 126 1000 -888 -331 1161 -487 -677 1122 -255
6526 -255 -987 863 152 -928 481 436 -990 296 839 -1041 45 1034 -854 -197 1070 -569 -618
6543 -618 998 -359 -962 990 258 -1046 715 308 -1219 378 740 -962 90 862 -955 -193 1005
6560 1005 -530 -588 1082 -287 -870 1013 -7 -1019 866 466 -1032 385 709 -978 22 908
6576 908 -875 -147 1108 -501 -539 1009 -284 -874 859 74 -1000 637 433 -1065 428 689 -1077
6593 -1077 156 750 -903 -216 1091 -625 -461 1014 -355 -785 906 38 -948 873 289 -1052 567
6610 567 628 -903 256 915 -810 -214 1153 -535 -656 1016 -231 -964 858 206 -993 574 296
6627 296 -1061 412 708 -960 142 916 -654 -230 932 -677 -489 986 -195 -799 971 79 -990
6644 -990 750 387 -1064 459 626 -921 128 777 -838 -202 1133 -562 -575 1005 -172 -804 882
6661 882 58 -873 736 308 -1027 597 558 -1036 155 841 -779 -250 822 -534 -530 1026 -326 -803
6679 -803 862 -93 -910 723 321 -968 480 679 -954 287 737 -784 -190 948 -638 -526 1036
6696 1036 -210 -719 823 42 -971 797 381 -962 579 605 -1017 296 882 -714 2 894 -590
6713 -590 -577 918 -184 -779 740 -60 -854 812 279 -1084 488 557 -905 181 739 -691 -112 979
6731 979 -456 -620 932 -348 -764 899 -57 -894 728 331 -938 480 573 -938 222 754 -788
6748 -788 -145 989 -561 -374 976 -353 -874 916 8 -797 716 216 -1044 424 636 -871 294
6765 294 897 -906 -83 853 -559 -421 1007 -306 -629 942 -46 -984 725 201 -921 637 403
6782 403 -904 231 755 -904 -165 783 -616 -392 873 -360 -722 933 -126 -1003 798 189 -998
6799 -998 520 480 -1117 221 748 -770 -61 721 -735 -341 977 -443 -659 960 -34 -701 749
6816 749 244 -1059 493 477 -914 312 723 -876 172 856 -527 -314 904 -378 -679 1031 -69
6833 -69 -809 863 173 -826 470 399 -843 334 713 -849 -37 918 -701 -300 922 -371 -596 863
6851 863 -139 -818 721 56 -939 546 456 -949 271 640 -899 -25 931 -594 -458 932 -325
6868 -325 -638 780 -135 -748 845 105 -912 443 381 -848 259 670 -1027 47 891 -619 -310
6885 -310 917 -480 -583 846 -151 -745 851 135 -906 620 485 -1007 264 685 -861 22 840
6902 840 -664 -355 1008 -314 -580 876 -128 -789 922 27 -916 583 519 -796 192 575 -900
6919 -900 73 877 -724 -285 965 -434 -556 896 -271 -681 745 111 -923 599 512 -998 323
6936 323 729 -942 -102 745 -678 -319 800 -518 -424 884 -175 -721 739 131 -869 616 363
6953 363 -875 419 651 -806 143 811 -679 -261 932 -480 -420 861 -280 -679 864 -13 -829
6970 -829 546 269 -958 331 705 -700 -26 699 -710 -114 853 -446 -665 829 -237 -763 675
6987 675 103 -944 587 367 -920 319 427 -882 41 838 -738 -205 931 -516 -385 834 -268
7004 -268 -733 797 172 -870 592 319 -881 428 641 -872 255 779 -793 -216 836 -453 -626
7021 -626 808 -227 -666 758 -34 -877 575 349 -858 350 608 -824 -13 817 -579 -114 722
7038 722 -448 -299 844 -247 -646 879 111 -810 629 221 -870 336 657 -889 145 717 -784
7055 -784 -335 928 -411 -413 839 -331 -578 732 14 -793 568 283 -970 330 509 -774 187 623
7073 623 -645 -99 862 -528 -369 828 -269 -615 796 15 -869 689 257 -965 274 493 -773
7090 -773 227 786 -825 -124 901 -645 -537 797 -279 -672 851 -8 -894 529 273 -793 467
7107 467 537 -954 141 667 -681 -146 811 -546 -461 897 -216 -446 793 -21 -795 586 180 -922
7125 -922 396 503 -796 59 740 -763 6 732 -539 -438 910 -174 -636 900 -9 -807 534
7142 534 362 -973 356 456 -950 258 679 -748 -172 800 -608 -286 828 -342 -573 838 39
7159 39 -724 586 261 -696 336 492 -917 162 722 -577 45 840 -624 -198 814 -389 -599 737
7177 737 24 -788 681 124 -858 494 467 -826 188 727 -735 -25 812 -695 -332 869 -379 -627
7195 -627 731 -61 -750 561 77 -936 475 474 -858 169 799 -711 -32 805 -641 -340 850 -297
7213 -297 -553 743 -102 -573 683 210 -752 515 481 -770 269 579 -869 15 931 -533 -183 807
7231 807 -363 -451 814 -123 -837 697 183 -887 421 553 -720 285 564 -668 -23 737 -644
7248 -644 -147 961 -379 -674 641 -161 -841 776 180 -957 532 391 -883 273 654 -828 8
7265 8 789 -718 -380 853 -338 -642 834 -136 -742 772 104 -840 477 494 -763 271 568 -775
7283 -775 -17 776 -704 -153 866 -448 -555 708 -59 -723 639 116 -917 487 448 -780 240
7300 240 708 -837 60 693 -629 -299 807 -404 -550 902 -9 -743 699 149 -759 415 518 -693
7318 -693 319 744 -752 -43 770 -467 -284 781 -263 -633 984 -144 -711 894 -122 -840 290
7335 290 365 -825 314 681 -525 -78 958 -551 -184 893 -377 -665 764 -33 -693 740 124
7352 124 -747 517 288 -797 327 624 -848 -32 726 -599 -205 838 -375 -516 849 -253 -689
7369 -689 710 131 -797 544 323 -892 555 583 -806 88 749 -651 -151 863 -373 -454 693 -160
7387 -160 -660 618 171 -825 521 409 -815 227 602 -813 -4 738 -609 -149 965 -528 -558 787
7405 787 -329 -792 858 113 -907 499 484 -812 321 495 -800 -21 678 -657 -210 830 -437
7422 -437 -490 796 -114 -620 816 75 -631 545 265 -752 411 511 -716 112 746 -515 -160 639
7440 639 -338 -377 894 -246 -704 768 115 -809 472 334 -892 294 676 -747 27 635 -559 -240
7458 -240 763 -497 -473 769 -94 -731 790 150 -919 641 364 -844 281 661 -955 149 745
7475 745 -611 -199 783 -530 -503 854 -84 -596 669 93 -752 534 256 -897 408 610 -879 156
7493 156 760 -658 -253 606 -343 -394 930 -168 -521 754 110 -854 498 273 -803 230 373 -822
7511 -822 78 718 -810 -102 862 -405 -501 875 -262 -627 845 85 -850 626 378 -908 343 418
7529 418 -830 283 776 -601 -99 878 -530 -404 829 -267 -628 777 3 -740 701 280 -841
7546 -841 376 621 -775 115 879 -719 -248 929 -463 -493 896 -242 -726 764 24 -799 555
7563 555 295 -876 421 532 -852 32 576 -657 -230 783 -448 -525 824 -274 -589 837 -87
7580 -87 -901 639 218 -779 329 584 -844 88 763 -703 -252 779 -492 -519 831 -157 -674 857
7598 857 24 -806 668 356 -861 354 693 -822 59 788 -798 -155 831 -428 -509 760 -353 -586
7616 -586 832 -39 -905 723 225 -737 497 500 -757 146 698 -691 -148 681 -519 -403 873 -378
7634 -378 -460 846 -80 -797 449 334 -925 390 492 -820 85 648 -777 -172 877 -564 -286 661
7652 661 -305 -531 797 -95 -926 641 214 -833 356 608 -794 197 778 -813 9 839 -548 -406
7670 -406 834 -231 -569 756 -129 -684 651 201 -974 445 503 -845 157 633 -748 -135 883
7687 883 -538 -325 902 -323 -513 736 -171 -864 594 295 -798 335 433 -865 103 805 -665
7704 -665 -104 718 -665 -217 717 -389 -527 811 -61 -870 723 164 -784 418 532 -956 181 740
7722 740 -719 -191 873 -674 -381 818 -314 -566 697 10 -812 778 193 -771 441 306 -793
7739 -793 215 769 -727 -11 903 -626 -347 783 -344 -487 719 11 -677 642 171 -846 347
7756 347 545 -721 36 821 -746 -61 861 -597 -269 922 -377 -477 764 -227 -804 671 149 -744
7774 -744 388 444 -929 82 682 -695 -142 957 -728 -442 823 -215 -549 685 -79 -646 619
7791 619 247 -834 319 461 -869 169 587 -685 -48 750 -607 -359 830 -286 -559 891 -84
7808 -84 -757 632 182 -748 530 562 -777 281 507 -720 0 872 -619 -400 892 -422 -458 800
7826 800 -157 -719 613 281 -806 439 483 -808 145 598 -789 -54 889 -704 -345 934 -301 -579
7844 -579 767 -68 -695 754 69 -785 379 350 -848 211 797 -752 -44 846 -595 -156 830 -313
7862 -313 -620 696 -105 -892 613 74 -919 614 521 -870 162 793 -787 -133 844 -561 -228 884
7880 884 -386 -478 790 -123 -764 632 142 -800 618 379 -911 288 799 -891 -108 757 -600 -254
7898 -254 804 -487 -456 970 -97 -611 654 244 -794 599 356 -935 211 583 -725 -95 731
7915 731 -845 -235 846 -371 -537 974 -198 -781 848 245 -781 453 390 -936 206 699 -793
7932 -793 141 786 -567 -203 835 -430 -447 964 -27 -796 767 170 -944 572 362 -856 192
7949 192 613 -795 59 777 -608 -160 852 -470 -600 972 -172 -721 530 -34 -674 421 437 -899
7967 -899 273 652 -845 72 714 -767 -191 857 -316 -621 819 -105 -742 882 252 -834 560
7984 560 320 -793 253 575 -776 -10 826 -703 -195 813 -334 -440 872 -196 -770 704 219
8001 219 -864 573 318 -892 261 584 -850 38 817 -735 -190 882 -454 -502 885 -310 -664
$$ [...]
8191e8
##END NTUPLES=NMR FID
##END=
