##TITLE=1H_Ser DHA-N-4
 CD3Cl3, 8 sc, 
 13.05.2021
##JCAMPDX= 6.0         $$ Bruker NMR JCAMP-DX V2.0
##DATA TYPE= NMR FID
##DATA CLASS= NTUPLES
##ORIGIN= UXNMR, Bruker Analytische Messtechnik GmbH
##OWNER= root
$$ XWIN-NMR		Version 3.5
$$ Thu May 13 10:06:23 2021 Russian Standard Time (UT+4h)  she@DPX200
##.OBSERVE FREQUENCY= 200.131506
##.OBSERVE NUCLEUS= ^1H
##.DELAY= (6, 6)
##.ACQUISITION MODE= SIMULTANEOUS
##.ACQUISITION SCHEME= undefined
##.AVERAGES= 8
##.DIGITISER RES= 18
##SPECTROMETER/DATA SYSTEM= spect
##.PULSE SEQUENCE= zg30
##.SOLVENT NAME= CD3CN
##.SHIFT REFERENCE= (INTERNAL, CD3CN, 0, 15.7039)
##AUDIT TRAIL= $$ (NUMBER, WHEN, WHO, WHERE, WHAT)
$$ ##TITLE= Audit trail, XWIN-NMR		Version 3.5
$$ ##JCAMPDX= 5.01
$$ ##ORIGIN= Bruker BioSpin GmbH
$$ ##OWNER= she
$$ F:/spectra/data/she/nmr/H-F/1/audita.txt
$$ ##AUDIT TRAIL=  $$ (NUMBER, WHEN, WHO, WHERE, WHAT)
(   1,<2021-05-13 10:05:15.93 +0400>,<she>,<DPX200>,
      <created by zg, POWCHK disabled, PULCHK disabled
       configuration hash MD5:
       00 E9 B6 7A A2 85 ED C7 34 08 36 98 17 FE 4E 26
       data hash MD5: 16K
       CE A0 4A 9C 55 AB 01 B9 32 38 44 85 F8 F7 5C 76>)
$$ ##END=
$$ 
$$ hash MD5
$$ 80 0B 7C 62 95 17 B8 88 0F 49 A6 8A 24 C9 C3 A5
##$RELAX= 
##$RELAX= 
##$RELAX= 
##$RELAX= 
##$RELAX= 
##$RELAX= 
$$ Bruker specific parameters
$$ --------------------------
##$DU= <F:/spectra>
##$EXPNO= 1
##$NAME= <H-F>
##$PROCNO= 1
##$TYPE= <nmr>
##$USER= <she>
##$AMP= (0..31)
100 100 100 100 100 100 100 100 100 100 100 100 100 100 100 100 100 100 
100 100 100 100 100 100 100 100 100 100 100 100 100 100 
##$AQSEQ= 0
##$AQ_mod= 1
##$AUNM= <au_zg>
##$AUTOPOS= <>
##$BF1= 200.13
##$BF2= 200.13
##$BF3= 200.13
##$BF4= 200.13
##$BF5= 200.13
##$BF6= 200.13
##$BF7= 200.13
##$BF8= 200.13
##$BYTORDA= 1
##$CFDGTYP= 0
##$CFRGTYP= 5
##$CHEMSTR= <none>
##$CNST= (0..31)
1 1 145 1 1 1 1 1 1 1 1 1 1 1 1 1 1 1 1 1 1 1 1 1 1 1 1 1 1 1 1 1 
##$CPDPRG= <>
##$CPDPRG1= <>
##$CPDPRG2= <>
##$CPDPRG3= <>
##$CPDPRG4= <mlev>
##$CPDPRG5= <mlev>
##$CPDPRG6= <mlev>
##$CPDPRG7= <mlev>
##$CPDPRG8= <mlev>
##$CPDPRGB= <>
##$CPDPRGT= <>
##$D= (0..31)
0 1.2 0 0 0 0 0 0 0 0.06 0 0.03 0 0 0 0 0.0002 0 0 0 0 0 0 0 0 0 0 0 0 
0 0 0 
##$DATE= 1620885915
##$DBL= (0..7)
120 120 120 120 120 120 120 120 
##$DBP= (0..7)
150 150 150 150 150 150 150 150 
##$DBP07= 0
##$DBPNAM0= <>
##$DBPNAM1= <>
##$DBPNAM2= <>
##$DBPNAM3= <>
##$DBPNAM4= <>
##$DBPNAM5= <>
##$DBPNAM6= <>
##$DBPNAM7= <>
##$DBPOAL= (0..7)
0.5 0.5 0.5 0.5 0.5 0.5 0.5 0.5 
##$DBPOFFS= (0..7)
0 0 0 0 0 0 0 0 
##$DE= 6
##$DECBNUC= <off>
##$DECIM= 32
##$DECNUC= <off>
##$DECSTAT= 4
##$DIGMOD= 1
##$DIGTYP= 9
##$DL= (0..7)
0 120 120 120 120 120 120 120 
##$DP= (0..7)
150 150 150 150 150 150 150 150 
##$DP07= 0
##$DPNAME0= <>
##$DPNAME1= <>
##$DPNAME2= <>
##$DPNAME3= <>
##$DPNAME4= <>
##$DPNAME5= <>
##$DPNAME6= <>
##$DPNAME7= <>
##$DPOAL= (0..7)
0.5 0.5 0.5 0.5 0.5 0.5 0.5 0.5 
##$DPOFFS= (0..7)
0 0 0 0 0 0 0 0 
##$DQDMODE= 0
##$DR= 18
##$DS= 0
##$DSLIST= <SSSSSSSSSSSSSSS>
$$ [...]
##$SUBNAM2= <"">
##$SUBNAM3= <"">
##$SUBNAM4= <"">
##$SUBNAM5= <"">
##$SUBNAM6= <"">
##$SUBNAM7= <"">
##$SUBNAM8= <"">
##$SUBNAM9= <"">
##$SW= 16.9725357007746
##$SWIBOX= (0..15)
0 0 2 0 0 0 0 0 0 0 0 0 0 0 0 0 
##$SW_h= 3396.73913043478
##$TD= 16384
##$TD0= 1
##$TE= 0
##$TE2= 300
##$TE3= 300
##$TEG= 300
##$TL= (0..7)
0 120 120 120 120 120 120 120 
##$TP= (0..7)
150 150 150 150 150 150 150 150 
##$TP07= 0
##$TPNAME0= <>
##$TPNAME1= <>
##$TPNAME2= <>
##$TPNAME3= <>
##$TPNAME4= <>
##$TPNAME5= <>
##$TPNAME6= <>
##$TPNAME7= <>
##$TPOAL= (0..7)
0.5 0.5 0.5 0.5 0.5 0.5 0.5 0.5 
##$TPOFFS= (0..7)
0 0 0 0 0 0 0 0 
##$TUNHIN= 0
##$TUNHOUT= 0
##$TUNXOUT= 0
##$USERA1= <user>
##$USERA2= <user>
##$USERA3= <user>
##$USERA4= <user>
##$USERA5= <user>
##$V9= 5
##$VALIST= <valist>
##$VCLIST= <CCCCCCCCCCCCCCC>
##$VD= 0
##$VDLIST= <DDDDDDDDDDDDDDD>
##$VPLIST= <PPPPPPPPPPPPPPP>
##$VTLIST= <TTTTTTTTTTTTTTT>
##$WBST= 1024
##$WBSW= 4
##$XGAIN= (0..3)
0 0 0 0 
##$XL= 0
##$YL= 0
##$YMAX_a= 332586
##$YMIN_a= -273350
##$ZGOPTNS= <>
##$ZL1= 120
##$ZL2= 120
##$ZL3= 120
##$ZL4= 120
##$ABSF1= 10
##$ABSF2= 0
##$ABSG= 5
##$ABSL= 3
##$ALPHA= 0
##$AQORDER= 0
##$ASSFAC= 0
##$ASSFACI= 0
##$ASSFACX= 0
##$ASSWID= 0
##$AUNMP= <proc_1d>
##$AZFE= 0.1
##$AZFW= 0.1
##$BCFW= 1
##$BC_mod= 2
##$BYTORDP= 1
##$COROFFS= 0
##$CY= 11.3945322036743
##$DATMOD= 1
##$DC= 2
##$DFILT= <>
##$DTYPP= 0
##$F1P= 15.9154993809931
##$F2P= -4.1035820241983
##$FCOR= 0.5
##$FTSIZE= 0
##$FT_mod= 4
##$GAMMA= 1
##$GB= 0.15
##$INTBC= 1
##$INTSCL= 1
##$ISEN= 128
##$LB= 0.24
##$LEV0= 0
##$LPBIN= 0
##$MAXI= 10000
##$MC2= 0
##$MEAN= 0
##$ME_mod= 0
##$MI= 1.114404
##$NCOEF= 0
##$NC_proc= 0
##$NLEV= 6
##$NOISF1= 3.799351
##$NOISF2= 2.8
##$NSP= 1
##$NTH_PI= 0
##$NZP= 0
##$OFFSET= 15.70392
##$PC= 1
##$PHC0= -11119.37
##$PHC1= 7.401003
##$PH_mod= 1
##$PKNL= yes
##$PPARMOD= 0
##$PSCAL= 0
##$PSIGN= 0
##$REVERSE= no
##$SF= 200.130013532006
##$SI= 16384
##$SIGF1= 3
##$SIGF2= 2
##$SINO= 400
##$SIOLD= 16384
##$SREGLST= <1H.CDCl3>
##$SSB= 0
##$STSI= 0
##$STSR= 0
##$SW_p= 3612.71676300578
##$SYMM= 0
##$S_DEV= 0
##$TDeff= 0
##$TDoff= 0
##$TI= <>
##$TILT= no
##$TM1= 0
##$TM2= 0
##$TOPLEV= 0
##$USERP1= <user>
##$USERP2= <user>
##$USERP3= <user>
##$USERP4= <user>
##$USERP5= <user>
##$WDW= 1
##$XDIM= 8192
##$YMAX_p= 0
##$YMIN_p= 0
$$ End of Bruker specific parameters
$$ ---------------------------------
##NTUPLES= NMR FID
##VAR_NAME=  TIME,          FID/REAL,        FID/IMAG
##SYMBOL=    X,             R,               I
##VAR_TYPE=  INDEPENDENT,   DEPENDENT,       DEPENDENT
##VAR_FORM=  AFFN,          ASDF,            ASDF
##VAR_DIM=   8192,          8192,            8192
##UNITS=     SECONDS,       ARBITRARY UNITS, ARBITRARY UNITS
##FACTOR=    0.0002944,     1,               1
##FIRST=     0,             0,               0
##LAST=      2.4114304,     0,               0
##MIN=       0,             -273350,         0
##MAX=       2.4114304,     332586,          0
$$ Real data points
##PAGE= N=1
##DATA TABLE= (X++(R..R)), XYDATA
0@%%%%%%%%%%%%qJ6j6J6j6K4l2L3m1M8n6P2q6J02j19J35j53J75j99K26k58K93
34A56l33L73m18M70n25N86o51P23q04Q91r85J090j202J323j460J608j771J950
52A021k146K370k619K898l217L581m002M499n095N822o735P919r526J1841j5483
67h872K2107l8036J48521K08866j70717k13750k00703M651J55277K49101J16929
78B73374o4358k26997j83585m0737J17799K14860J49364m704j90092k14126p6225
89b45427Q9879J99216J67535L3927j62291k04061j26660O3473J89479J79874N8741
100B43685j26071k03314j52743L1907J74446J94295O9593r2348j85022j70194
110b15766K987J37383J97122J02179n9491j73875j75320l7905J14137J98594J15794
$$ y = [0, 0, 0, 0, 0, 0, 0, 0, 0, 0, 0, 0, 0, -8, 8, -8, 8, -8, 16, -16, 17, -24, 24, -32, 40, -46, 56, -63, 72, -81, 94, -105, 121, -137, 156, -177, 196, -222, 248, -277, 309, -342, 381, -423, 468, -517, 573, -629, 694, -766, 842, -929, 1021, -1125, 1245, -1374, 1524, -1693, 1888, -2114, 2385, -2710, 3112, -3623, 4296, -5230, 6611, -8872, 13235, -24801, 123720, 332586, 161869, -51881, -252584, -247933, -92656, 156445, 273374, 209016, -17981, -201566, -242303, -124504, 90356, 239720, 235016, 44924, -169202, -245427, -155548, 43668, 211203, 245130, 82839, -121222, -247882, -184409, 5070, 184944, 243685, 117614, -85700, -238443, -206536, -32090, 162205, 231798, 139450, -45572, -215766, -212779, -75396, 121726, 223905, 164414, -9461, -184781, -222686, -108549, 90045, 205839]
121B05839k4116j62994j69580n6275P5356J78895J29721J0041j26737j63150r8262
132b01262M6177J59741J48540M9758j09537j65493j22116K5483J46844J56077
142A34212O5358q4145j57448j31793M487J15394J60807Q3610n5582j40149j45429
153a50678k4226R3114J58585J01359k3663j30840j46405n2278O5785J56771J11056
164A58580Q233j13982j51218p3090M5104J43283J22072K8912r6756j38805r2891
175a60558K4293J21550J21681N7937p0898j30505j09960l950J01135J37196P5553
186A63474n1238j24613j25528j7492Q6710J37048Q2825l0846j09212j25431l6596
197a50899O1932J27292R3358M169r6839j28195n8555L5136J24725J07257K5896
$$ y = [205839, 181723, 18729, -150851, -207126, -131770, 47125, 176846, 186887, 60150, -103000, -201262, -155085, 4656, 153196, 202954, 93417, -72076, -194192, -168709, -21865, 134212, 199570, 115425, -42023, -173816, -169329, -53935, 106872, 190482, 134900, -5249, -150678, -174904, -81790, 76795, 178154, 154491, 23651, -122754, -175032, -109247, 47524, 158580, 166813, 52831, -98387, -171477, -126373, 16910, 138982, 167894, 71138, -67667, -160558, -136265, -14715, 106966, 164903, 94005, -36500, -146460, -150410, -49275, 87921, 163474, 112236, -12377, -137905, -155397, -68687, 68361, 151186, 120340, 11128, -114303, -150899, -88967, 38325, 131683, 135852, 39013, -89182, -147737, -112601, 12124, 119381, 145277]
208A45277q2181j27636p7689J9790J11949J13112M5745o8945j16401r3050N05
219a29524R9316J12263O0354m7834j05947j01636j5083P3706J13519P4887k5430
230A08591r2206j12706l4665N5938J14614Q6684n182q7021j15716m6565L8760
241h9474J10109Q9348J4168p2713j09808o0983J3978R7757R7619L7793n6041j06395
253c4642q2551j166R0056J01725N6264m5867j02187q9423j2465P5358R8662O3857
265A17621k7488q7004r3871k7071N4064R6113P4663r617p3297r6936m2228L5186
277g9865R3959Q1535J1112o2926r9688n4264J6791R1203Q6907K6657n1561r8471
289c8611o5862N291Q0828Q6526M2017l7982q7005p5877j3535O6030Q7205O1923
$$ y = [145277, 63096, -64540, -142229, -122439, -10490, 102622, 148367, 79422, -36979, -130029, -129524, -30208, 82055, 142409, 94575, -11372, -113008, -128091, -54385, 59134, 134021, 108591, 16385, -96321, -130986, -75048, 39566, 126250, 121068, 34047, -81669, -128234, -89474, 20635, 109983, 124151, 51438, -58370, -119353, -105375, -7618, 90001, 127794, 71753, -34642, -117193, -118359, -28303, 73422, 129686, 83819, -18368, -107791, -120256, -44898, 53764, 117621, 90133, 3129, -90742, -117813, -63749, 32364, 107027, 97410, 24113, -72823, -115051, -79865, 14094, 95629, 106741, 43815, -55873, -110137, -93346, -2143, 84764, 111421, 59860, -38611, -104473, -99182, -18354, 68172, 110189, 72207, -14798, -90675, -104210, -38180, 49025, 110948]
301A10948k5049q0726q4415k7588N3483R0356O8005j5440o8001q9347l2613L7583
313f2804Q0741P0141N161n3830q8416m5922J7141P6132P7567K2225m4576q7596
325c4036n5834J910P0122Q1126L6264l5702q3156o4107j0944O2495P9020M8101
337I5259k4683p4363p0543k0890M9977P4640N8267q872o2355p7556l4579L4303
349f1395P3151P0091M178n3495q4140m0976K3142P0266P1211J3117m4978p6154
361c5982m3856N776O1979O8070K5630k6173p1115n7113q415N2860P1320M3787
373H6768j8631o9284o5296k0680M8592P1453N2781j1188o3785o7843k7914L7289
385d7738O7247N9647j571n1477p0257l7740K3195O2656O5069R341l8748p0000
$$ y = [110948, 85899, 5173, -79242, -106830, -53347, 37009, 105014, 89574, 21573, -67774, -100387, -62804, 17937, 88078, 93239, 39409, -49007, -94929, -77788, -1656, 75911, 98136, 53560, -34036, -89870, -87960, -17838, 63288, 99552, 63850, -19306, -83413, -94357, -31862, 47158, 95259, 70576, -3787, -74330, -95220, -45243, 29397, 87664, 78792, 16437, -61119, -95698, -61395, 11756, 81847, 86025, 32530, -51610, -92586, -69444, 822, 72033, 85150, 40172, -35982, -79838, -74062, -12083, 55987, 81617, 55444, -15671, -72784, -81199, -28339, 42981, 86768, 68137, -1147, -66443, -87123, -38531, 32922, 85703, 74515, 10730, -57113, -85027, -47738, 19509, 79156, 77585, 26108, -44149, -81889, -58694, 3962, 69031, 78372, 39624, -30376]
397c0376m6749Q624N8273O6059K4633k9373p1585n0048l824N2040O6912L2276
409G6862k0237o4377n3355j4883M1376O1947M5216q627n7306n8654k9057L3750
421d7345O4243N3684j385n0205o4869l4426K7238N8946N7029P052l9169o4008
433c3215m0164J3646N0546O1313K0422k8925o3342m6037j630M7102O3814K8559
445G2089j9037o0682n0422j2416M1905O1551L6342r693n5262n3637k0982L4721
457c5523N6047M3646q18m7049n3620l0186K2363N0983N2404Q892l7132n8422l9877
470f8292J3662M9589N8517J5714l1290n9528m2336N570M4369N6395K1832j9120
482D5082n4666m4763q704L5711N6597L2350p856n2006m9926j8948L0520N5337
$$ y = [-30376, -77125, -68501, -10228, 55831, 80464, 51091, -20494, -70542, -74366, -22326, 44586, 76862, 56625, -7752, -61107, -75990, -34614, 27333, 72549, 63922, 6616, -52038, -81095, -47345, 16898, 70582, 69197, 18992, -45877, -80303, -53065, 5881, 62910, 69962, 30793, -33215, -73379, -59733, -9187, 52126, 72548, 43623, -19719, -65756, -67386, -20284, 43530, 72089, 53052, -7630, -58052, -70468, -28563, 32988, 69330, 59637, 4375, -49262, -70244, -35523, 20524, 64170, 63352, 16303, -37317, -67503, -45140, 5843, 58247, 67139, 30007, -28415, -68292, -54630, -5041, 53476, 69190, 37900, -21628, -63964, -58394, -14025, 42370, 64202, 45082, -9584, -54347, -63051, -27340, 29257, 61607, 53751, 1745, -48181, -67129, -36609, 18728]
494A8728L9965j313m6741n0325k6768K4269M9985M4552O784l8727n0540l2687
506f2818J5224M4107N0047J2544k8140n0227l9001N800L8312N3134K1705j9335
518D1352n1065m3806l874L5565N4569K6656j1632m8764m4049j2131K8833M9913
530B1567L2444j191m1969m4757k3645J9781M7449M1279O929l7365m6927l1790
542e8195J5444M4553M4008J1468l0220m5880l4358Q175L5935M5880J7757k0116
554C4451m3790l8954j524K9814M8253K4623j1243m3078m1595j1112K5029M9343
566B0217K9921k965m0261m3902j9245K1318M6245L4369M303l5978m2476k5520
578e3974J3985M0958L8271J1892k7918m1599l3252O773L6406M3236J7425k1663
$$ y = [18728, 58693, 57380, 10639, -39686, -66454, -42185, 7800, 52352, 59136, 20409, -30131, -62818, -47594, -3487, 46560, 59104, 30964, -19263, -58264, -52464, -14152, 38982, 60687, 41352, -9713, -53519, -57393, -21828, 32741, 59397, 47765, -999, -45048, -57179, -28346, 21567, 54011, 52820, 10851, -33906, -57551, -37770, 9679, 50958, 57887, 20522, -26405, -58195, -42751, 1802, 45810, 57278, 27058, -18822, -53180, -45005, -9070, 36810, 54567, 34451, -9339, -48293, -49817, -20003, 28250, 52873, 41630, -1448, -43043, -54155, -29126, 20217, 50138, 47173, 6912, -36990, -56235, -34917, 11328, 45697, 50000, 14022, -28454, -53974, -39989, 969, 39240, 51132, 23214, -18385, -51637, -44864, -8458, 34778, 52203, 30540]
590C0540m1941l6305K573L0411M3488K0249j4299l6764l6634o946K2728M2289
602A9389K6158k581l4325m0655j6490J7166M4038L1859M388l3593m2290k2337
614d9273J4158M0857L5132R282k9996l9657k6957Q368L5217L6791J4045k2241
626B5726l5919l2259J761K8042L7936K0179j2534l4307l7161n838K2483M0527
638A8636K5244o308l3936l7970j0612J7718L9699K6431O73k9956l6257j7239J0690
651c3187L6874L0902Q535k6011l6535k5265O854L5236L3712J3797k2161l6278
663a3527k8406L732K9264L4620J7697j6082l1785l1711k398K2018L5465K2525
675D1412q400k9429l3687r370J6056L6923K4985j101k6777l5457j4961J2306L5669
$$ y = [30540, -11401, -47706, -45133, -14722, 28766, 49015, 34716, -2048, -38682, -45628, -22900, 19389, 45547, 42966, 8641, -32014, -48504, -31338, 12700, 44559, 48947, 15354, -26936, -49273, -35115, 5742, 40874, 50156, 20160, -19497, -46454, -38086, -2869, 33922, 47967, 25726, -10193, -42452, -40691, -12649, 25287, 45466, 32932, -1375, -38536, -44374, -21891, 18636, 43880, 37572, 3636, -34334, -44946, -27228, 12471, 38902, 39575, 9619, -26638, -43877, -33187, 3687, 34589, 43124, 17113, -19422, -44687, -37833, -2597, 31115, 44912, 22751, -13527, -41933, -38201, -8937, 25683, 43380, 27298, -4487, -36198, -38596, -16578, 18887, 41412, 33012, 3583, -30104, -39474, -23418, 13505, 38490, 37389, 10612, -24845, -39806, -27500, 8169]
688H169K6944N208k5164l4947j8212P681L1843K8096J1079k0975l1422k4181J343
701c4538K7665L1254J6559j5508l0857k9904k048K3931L3434J9461j1566k8265
713c82l0722n852J7977L1891K1243l390k4277l1527j1607J0463L1960K5115L611
726C4503k1835l2701j7130O998L0989K6849Q591k0179l1072k0088L142K7855K7258
739B3180J2615j5601k7787k3742j211K2567K7619J7546j0147k4723k8084o322
751c4090J7848K9021K2330m631k4431l1010r250J3538L0682K2366r46k0888k9759
764a9220j2191P706K7008K3412O029j6806k8157j7569J676K5270K4960J1958j3865
777B0211k8137k1076j358K2629K5600J5464j1538k4380k4164m331J7922K5175
$$ y = [8169, 35113, 40321, 15157, -19790, -38002, -30321, 1522, 29618, 40697, 19722, -11700, -35881, -34538, -6873, 24381, 40940, 25432, -5425, -35329, -37377, -13446, 19988, 39449, 27883, -382, -31104, -36956, -18979, 12912, 34155, 30765, 6488, -25039, -36646, -26183, 5777, 30892, 34503, 12668, -20033, -37163, -30165, 824, 27673, 36264, 16085, -14987, -35075, -31933, -4078, 23180, 35795, 20194, -7593, -31335, -32546, -9979, 17640, 35186, 25039, 316, -27768, -34090, -16242, 12779, 35109, 30478, 6047, -24963, -34213, -20675, 10007, 32373, 31427, 10539, -19220, -31411, -23705, 3303, 26715, 32744, 15938, -12219, -29788, -28112, -2842, 22118, 34076, 20211, -7926, -29002, -30360, -7731, 17869, 33333, 21795, -2585, -26749, -31080, -13158, 12017]
789A2017J9091o361k1589k6444q688J2967K6153K1454j065j8911k8491j2118Q390
802b3595K6225K3058L152j6314k8667j4130M725K4245K2686P791j3727k4757j6788
815b6096j408K1034K2553J3239r157k3097k1105n194J8092K3853J7308o636k1441
828A945k4016o901J5185K3111J9118l624j8396k4185r617R177K2644K1167J243
841B6851j4406k6011j3395M940K2085K1876O718j2921k5526j5679J055K0498K1533
854A7618J0630j0389k3210j7113l594J7579K0938J3934o109k0305k0076p147J3635
867a3609K0993J7803l224j7402k2507r911J0442K1450J9348l15j5209k3139j0466
880b5746O350J9623J9927L288j1145k2699j3232N07J8600K1074Q684q454k2545
$$ y = [12017, 31108, 24747, 3158, -23286, -31974, -19007, 7146, 28600, 27535, 8624, -19867, -31985, -23595, 2630, 25688, 28840, 12526, -16141, -30271, -25546, -1301, 21385, 29176, 15449, -9308, -26096, -27504, -6470, 16083, 29322, 20165, -2932, -24037, -29231, -11139, 12714, 30022, 23386, 1945, -22071, -28972, -13787, 9324, 28442, 24818, 6422, -17763, -27380, -18203, 4441, 25608, 26851, 12445, -13566, -26961, -22021, 64, 21940, 28658, 15737, -9789, -25468, -24413, -3915, 17618, 28248, 17859, -5351, -22464, -26058, -8479, 12459, 26393, 20284, -21, -20097, -27244, -13609, 7384, 25187, 21963, 4561, -17946, -27857, -17415, 4035, 23383, 23068, 7859, -15280, -25746, -19396, 227, 20154, 23442, 12297, -10402, -23634, -23127, -4527, 16547, 25231, 16777, -5768]
893e768j6407l079J7862K0809J2040o593k1000j7490m903J4889J9488J4312m115
906B0045j7074j8362p970J0360J7511J7491j29j3419k0223j1228N951J8242J9301
919B0496L145j1300k2140j2864L375J7705J9888N464r850k1251j3307mJ5780J8654
933A3791Q520o084j9016j4738n338J3531J8223J2942l054j7274j7915p550J1405
946a2557J7801J5616j631j4865j8201r383Q371J6177J6710J189j0872j8673j1408
959b1726M149J5044J8623M041q034j9441j3089J145J4252J8503P546o410j8858
972d255j3613k651J3238J7627R960l273j7020j4586o200J0830J6410J3233o37
985A9063j4556j6447r371Q544J6010J6052R01j2646j7438j0572N969J5101J6129
$$ y = [-5768, -22175, -25254, -7392, 13417, 25457, 18864, -2136, -19626, -24529, -9640, 9848, 24160, 20045, 2971, -15391, -23361, -13001, 4510, 22001, 21872, 8453, -11770, -22998, -17047, 1195, 20496, 23641, 12341, -9799, -22663, -19288, -1583, 18305, 23769, 13919, -7332, -20639, -20643, -4863, 13791, 22311, 16227, -2789, -17527, -22865, -9334, 8889, 21831, 18777, 1503, -16412, -23962, -12557, 5244, 20860, 19229, 4364, -13837, -23220, -14849, 1328, 18038, 19227, 8355, -10318, -21726, -17577, -2533, 16090, 20131, 12097, -7344, -20433, -19288, -5036, 13467, 21013, 14603, -4255, -17868, -20519, -7281, 10346, 20306, 17033, 13, -14573, -20773, -9943, 6467, 19700, 19063, 4507, -11940, -21311, -12767, 3243, 19295, 20196, 7550, -9888, -20460, -14491, 610, 16739]
998A6739K476r101j6966j1080J961J2639J6646N260n134j6814j3110j757J0971
1011g270J6928R067l048j7424j3970m340J0117J7523J0061j466j5226j3967p372
1024b0387R106J4641J3339K28j2549j3947j0142O291J2374J5470L017q811j5794
1037g164j1772L642J1081J7585M055p597j5100j1890P52J1346J6934M889l811
1050A2950j4106j2235l499Q789J6448Q483j190j3486j4192o182Q658J4458J1686
1063A6582L47j3208j3322q196P049J2954J3116J509j0165j3446j0201M303J1259
1076a419J4559M067o905j4356j1820J370R855J5354O362m681j4507j2472j444
1089a6037R138J5067P775k206j3900j2029m525P523J4296R246J44j1914j2505
$$ y = [16739, 19215, 10114, -6852, -17932, -15971, -3332, 13314, 18574, 13440, -3374, -16484, -18241, -7270, 9658, 18725, 15677, -1747, -15717, -20057, -9940, 7583, 17644, 16178, 952, -13015, -20387, -11281, 3360, 16699, 16927, 4378, -9569, -19711, -13420, -1046, 14424, 17441, 8630, -7164, -18936, -15294, -4213, 13372, 17427, 9830, -5270, -17160, -16408, -5062, 11872, 16761, 12950, -1156, -13391, -16890, -8101, 8347, 16830, 15640, 2154, -12038, -18220, -9562, 4896, 16582, 16929, 3721, -9601, -17797, -10748, 2206, 15322, 16831, 6666, -6780, -16981, -12678, -1419, 13140, 17207, 10302, -4054, -15874, -14504, -4649, 10705, 17067, 12386, -2121, -14593, -16037, -6899, 8168, 15943, 13737, -163, -12192, -16717, -9194, 5102, 14348, 14492, 2578, -9927]
1102i927p590O040J3043J1855K282j0676j2909r722N058J1911J2865L656q459
1115G427j3303r895K169J0289J3828M654n025j2505j1707j62Q028J4792P067k748
1129A2909j2710j2408l296P760J4234Q565m95j2362j1800n289O100J2783R775
1142A3766J094j0328j1364p807M512J0673J1441L438q060j1749r962K259R668
1155b419J3109M973o145j2491j1113R67Q206J3854N340l907j1291j1241k047O984
1169g221J3041P185o10j1327j1171m363M994J2703Q931J378j0394j1628o295L911
1183a0866J1810R916L009r296j0438q118K611R912J0359M807o283j0473r977Q27
1197a2200P955J1970O038l611j0696j1303j141O931J2899O717j874j0764j1041
$$ y = [-9927, -17517, -11477, 1566, 13421, 15703, 5027, -7882, -17604, -12546, -635, 12230, 15886, 7427, -5876, -15771, -13602, -3313, 10515, 15169, 10144, -2361, -14068, -14230, -6202, 8590, 15657, 12909, 199, -12209, -15505, -7745, 6489, 15054, 14559, 2197, -9603, -14892, -8792, 3991, 13766, 14860, 4532, -6832, -14639, -10127, 546, 11987, 15425, 7365, -4384, -14346, -12087, -2419, 10690, 15663, 9518, -2973, -14086, -13119, -4913, 8941, 14281, 10374, -917, -12158, -14205, -7221, 5820, 13005, 12395, 1068, -10103, -14466, -9472, 3231, 12162, 13540, 3146, -8482, -14777, -10866, 944, 10860, 13869, 4573, -5865, -13983, -11372, -1460, 8899, 13706, 7423, -3050, -13027, -12200, -4245, 7725, 13763, 10152, -544, -11847, -12988, -6057, 6842, 13559, 11685, 921, -10120]
1210a0120k820N818J2151P340J35r475j0225m863L378J0968P835L402p958j0938
1224e372p016K144R804R595M588o864r803r398J203Q021J0694N078n253q853r754
1239a1186l71O171J1376O230k709r022j0743j647M489J1196O760P8r049j0709
1253i136l913M284J1094P266K137q786r559n827K679R439Q672L289o581q518p961
1268a1421M44Q388R927N563o010q639r219M80O413J0460N104l757p743r032q26
1283i868M690J0768N542k379o655r256l493M421R121P400J240o987j1273m518
1297a1247K506R359R523K126o840r759n877J228Q652P847L957n508q606o770N0
1312i359P015Q663L583k919p230q798j192N010R357O167j344p887r652k087M163
$$ y = [-10120, -12940, -7122, 5029, 12369, 12504, 3029, -7196, -12059, -8681, 2287, 10122, 13524, 5566, -5372, -12388, -10244, -440, 9155, 13743, 6879, -2924, -12322, -11119, -3098, 7596, 12674, 7421, -1432, -11186, -11557, -5386, 5990, 12220, 9511, 489, -10254, -11901, -7412, 3784, 10544, 10622, 1573, -9136, -13049, -8765, 2329, 9595, 11732, 2946, -6613, -12440, -9761, -322, 8350, 11639, 5058, -3460, -11421, -10977, -2589, 7338, 12901, 6891, -1748, -10967, -10487, -4074, 6386, 11490, 7733, -10, -9042, -9868, -5178, 5590, 11132, 8753, 2098, -7158, -10651, -6230, 2891, 10291, 11531, 4544, -6729, -11247, -8741, 618, 10141, 12267, 5427, -4332, -10209, -8981, -329, 7518, 11475, 5967, -2639, -9409, -9359, -2344, 6319, 9902, 6983, -247, -9045, -10237, -5227, 4130, 10297, 8953, 1066, -8586, -10673, -6510]
1327f510R410P007j856o251q807l841K341R976O783J429o365q864l648qQ221Q044
1343G061K790m684q238p155M6Q322Q270M227m405p235q130L05M794Q715N250k826
1359G107o315p977j775L869P967P172j958m599r806l111K777Q728N799J426n328
1374C976r731l147J650P380P228J697l779q533m963q8P689O008M630m295p528
1389a806o348j420O489O789N972l587o121q407j047M791P812N402j750m841q117
1404f189k962L046P194O143M37m446r138k774M80P605P737J287m311q227n177
1419i295Q26P216P332K463l913p305m530q81O084N716N146l350n504o451j987
1434h433N081O184O294j187o468p894k293L629Q074N512o90m931p635l464L133
$$ y = [-6510, 2900, 9907, 8051, 1800, -7007, -10848, -8507, 1469, 8252, 9681, 3316, -5548, -9196, -9204, -983, 7061, 9851, 5167, -3071, -10226, -10180, -1858, 6412, 10639, 6234, -1001, -9131, -8826, -4032, 4683, 9933, 7107, 792, -7185, -8960, -5091, 2876, 10048, 8090, 3491, -6315, -9426, -6649, 2079, 7878, 9304, 3976, -5755, -8902, -7252, 128, 7356, 9053, 5274, -3259, -8222, -8310, -621, 5387, 10017, 5722, -1806, -8154, -9574, -3085, 3704, 9676, 6089, -32, -8439, -9486, -4695, 3117, 8519, 6769, 1928, -6189, -9151, -6105, 1089, 7232, 7669, 3223, -5915, -8689, -8209, -604, 7133, 8420, 4109, -4118, -9295, -8469, -1253, 6079, 8542, 4629, -2676, -7206, -8087, -2003, 3713, 8859, 5509, 5, -6446, -8433, -3352, 2832, 9126, 7939, 1471, -6423, -8716, -5087, 2987, 8499, 7809, 2878, -4757, -8221, -5088]
1449e088O097O257P59l821p811l626L80O239O299K031k445p635m644n27O023O258
1465D746L235k117o972n744j148M794O330N115k291o209n602k402M111O470M863
1480G179q71n523n972k949K522O200O327l2m468p088l889J588O712O269J586l507
1496D084p393m201N39O040N661K724l179o094l647k253N142O585L683k031n970
1511c10m587k776M814N042N384j279m519o028k907K992O003M698P6l493p262k922
1527g074K503N499M563J343l060o883m248J382M908O886J212k673n799m754p96
1542f991N450N188K395q87o133n055j557M174N482N289j880n107n243k698K926
1557d647N175O562j429m036o383k514K327M777O010lk315o616l566J490M531M649
$$ y = [-5088, 1009, 7266, 8025, 4204, -3607, -7233, -6853, -614, 5685, 7716, 5271, -2364, -7008, -7535, -1512, 4746, 7981, 5864, -1108, -6852, -8000, -3206, 3124, 8239, 5948, -261, -5863, -8265, -4154, 2316, 7179, 6308, 785, -5187, -8136, -5614, 586, 6913, 6881, 2413, -4675, -8564, -6976, -264, 6005, 7591, 4084, -3309, -7510, -6971, -931, 4730, 7454, 4275, -1819, -5466, -7719, -2577, 4008, 7691, 5660, -310, -4897, -7673, -2859, 2183, 7567, 6288, 1769, -4259, -7166, -4174, 1829, 6527, 6603, 3110, -4152, -7074, -4571, 928, 5491, 6834, 3774, -3109, -7357, -5975, -1067, 5819, 7031, 4358, -1441, -6195, -6991, -1541, 3647, 6042, 5155, -978, -6033, -7590, -3416, 2066, 7355, 5475, 368, -4875, -7573, -4647, 528, 7090, 5661, 1625, -4758, -7272, -4945, -168, 5842, 5839, 3524, -3092, -6658, -5168, -637, 4012]
1573D012J899k153n809l515n03N025M897K077o94n556l777k383L968M171M686
1588F345j47o335m192j758L160N487M027j167m051n197l385L450M739M558O14
1603F148k849n638l815J157M790N877N09k880o183k882M14L834O132J593k218
1618C989n126m087r30L871N141K583q66n441l602k504M054M976L355k27m749m530
1634d093k782K355M778M874J11l448m983k972J324M600M658J362l414m891l187
1649e708K18L834N975J600j738n494m084PL505N946J185p47n314l421j650L935
1665a951M214L026o1m231m636k053K913M395L568O76m020m252l612K001M443M875
1681E295O88l806m035l288L59L519M853J189j406m583l497k12K863N449J582l56
$$ y = [4012, 5911, 3758, -2051, -5566, -6069, -1044, 3853, 5930, 5236, -320, -4097, -6480, -2512, 1659, 6345, 6198, -137, -4329, -6087, -2927, 2560, 6587, 5420, 1369, -3828, -7213, -3763, 976, 5534, 6148, 3299, -2339, -6154, -4997, -207, 5670, 6179, 3299, -2884, -5766, -5352, -1518, 4614, 6207, 3989, -1137, -5224, -6154, -2283, 2858, 5441, 4575, -866, -4468, -6972, -2918, 2058, 5413, 5186, 437, -4093, -6875, -4520, 258, 5132, 5243, 1795, -3188, -6160, -4836, -236, 4422, 5784, 2370, -2521, -5708, -5490, -1656, 4319, 5919, 4181, -1313, -5397, -5390, -1885, 4061, 5246, 4499, -815, -4236, -5886, -1951, 2263, 5289, 5228, 997, -3639, -5692, -2779, 1616, 5184, 5860, 1840, -2412, -6024, -4023, 420, 5295, 5983, 2177, -1858, -5146, -4787, -1268, 3585, 4774, 3368, -1215, -4712, -4924, -2061, 3388, 4970, 4614]
1697D614n581l035p74K069N190K421l9n209l824j928K728M180L831M64l840m364
1713c097k451J870L617L433J515m136l194k577N05M483L889J115k272m447l804
1728e551J323K611M420J845j876l753l019J48J961M245K734p90l786l984j019
1743d491K979L142K530O41l766l881k549J667M626L447o1l004m009k566J376M283
1759C64L588J087l060l247l220J084K745L588J253j318l664l546j02L196L632
1774B380K227j291m049l104o61J402N012K252j054l446j726k211N13M428K466
1789C138J513l527l084k612J200L166L793R07k742l473k663N29L416L076K009
1804D646k624k697m022L40L415L442J898j310l067l668K89J097M253K068l53k675
$$ y = [4614, -967, -4002, -4776, -2707, 2483, 4904, 4865, -344, -4168, -6096, -3368, 812, 4643, 5107, 1267, -3097, -5548, -3678, -61, 3372, 4887, 751, -2443, -5020, -4515, -32, 3857, 4972, 2700, -1747, -5551, -4228, -1617, 2803, 4648, 2772, -981, -4000, -3852, -1891, 2354, 5088, 4298, 512, -3472, -4491, -1512, 1630, 4160, 4801, 1035, -2846, -5395, -3728, 898, 4345, 4284, 1280, -2729, -5295, -3919, 364, 3952, 5039, 1979, -1268, -4488, -3404, -659, 2929, 4182, 2864, -800, -4346, -4448, -1252, 2380, 4607, 3316, -733, -3837, -4498, -3096, 1916, 4168, 3114, -332, -2058, -4269, -3756, 672, 3138, 4651, 1124, -1960, -4572, -3372, -206, 3587, 4494, 1752, -1721, -4384, -3855, -439, 2637, 4646, 2022, -675, -4697, -4357, -942, 2500, 4398, 3088, 21, -3647, -3358, -2261, 1992, 4060, 3707, 1032]
1820A032m089j019J723M107K548l96k862k971k006J135L313K433J399k394l646
1835a693k059Q47K809K767J891k511k974l152M04K523L821P96j069k904l401J57
1851c748J689L839J826j011k701l596l7J199L769K124K39k699l457j736J229L672
1867F01K033J144k603l370k068R27L254K959Q84j925k995k586M68K625K774J828
1883C950j667k474l280J32K225L456J572r30k644l492j41J428L605J862k25k502
1899H75l351q27J246L103K182M54k293l232j727Q76L166K361J257k437k862k050
1915c259K41K638K598J240j689k342k834j14K375K893J879j412k461l152p6J700
1931a775L010J849m05k427l290k74J023L120K273j39k457k907q91N98L411J729
$$ y = [1032, -3057, -4076, -2353, 1754, 4302, 3906, 1044, -1927, -3933, -2798, 515, 2948, 4347, 1953, -1693, -3752, -2905, -96, 2671, 4562, 2051, -923, -4075, -3671, -1148, 2673, 3469, 2400, -504, -3905, -3748, -2059, 1780, 3606, 2595, -106, -3702, -3739, -2540, 1229, 3353, 3592, 893, -2564, -4300, -3071, 601, 2634, 3778, 1175, -2195, -4263, -3336, -82, 2877, 3761, 1836, -1159, -3745, -3277, -652, 2122, 3950, 2283, -191, -3471, -3339, -1114, 2342, 3914, 2984, 340, -3152, -3293, -1865, 1740, 3602, 3377, 875, -2476, -3303, -2057, 1046, 3228, 3682, 1389, -1843, -3570, -2694, 472, 2833, 4090, 1653, -1209, -3259, -3018, -380, 2218, 3458, 1769, -573, -3407, -3521, -1146, 1747, 3626, 2214, -247, -3399, -3475, -1775, 1235, 3084, 2679, 252, -3038, -3312, -2289, 831, 3104, 2965, 508, -2399, -3290, -2692, 719, 2448]
1947B448N91j823k996j289K27K811J919J619j646k689k318k3K484K817J617j817
1963A932k126k691M5J878K475J951j068j927k861l28J156K981J699k51j808l093
1979b036p85N09L177K140J22j555l077j372M58K682K246R44j713l062j553L74
1995b501J995K050J669j787j972k270J84J455K464J628o43j866l258l53J206K845
2011H46J284J77j996k574l27O24K247K129J25j733l256j048Q95J900L375L0j509
2028A189k712N2j690K990J788J149m66l756j307l54K145K498J771o50k585j882
2044a820j085J844K396J811j306j571k162q16Q93K846J597Rj685k708l93L5K430
2061C15K117M2j076l045p21l09K759J494J129j718k272j381J73J748K082J545
$$ y = [2448, 3039, 1216, -1780, -3069, -2842, -31, 1888, 3507, 1861, -828, -3146, -3169, -685, 2132, 3749, 1932, -194, -2885, -2840, -962, 1513, 3464, 2396, 469, -2392, -2720, -1564, 1417, 3116, 2865, 1057, -2036, -2821, -2312, 865, 3005, 3127, 1572, -1505, -2877, -2419, 263, 2509, 3453, 1740, -1322, -2875, -2501, -506, 1544, 3213, 1426, -546, -2816, -2632, -1177, 1287, 2915, 2272, 406, -2852, -3205, -1999, 846, 2130, 2307, 311, -2263, -2590, -1966, 281, 2410, 2535, 802, -2454, -3502, -2607, -707, 2668, 2698, 1189, -1523, -1471, -3161, -171, 1617, 2766, 2300, -1456, -2763, -3117, -972, 1526, 3297, 2647, 62, -1820, -2905, -1061, 1335, 3146, 1840, 269, -1893, -2709, -1816, 1030, 2627, 2636, 951, -1757, -2150, -2115, 315, 2432, 2474, 1398, -1647, -2368, -2677, 82, 1576, 2705, 987, -1285, -2666, -2493, -745, 1337, 2882]
2077B882j702j831j900o57K573J566J910j109k037j793p52J359K044J880m60j453
2093E20k544o91R07K262J898j52j049k731j098N38K196K066J33p80k604q87m15
2110b431K121J887J257j145k386j508k48K005J858J337p18k171j537q56J726J895
2126A086J728l74j846k095q37J080J880K227p46j114k504o16L86J629K065K42
2142B191r65k190j327L2K175J872N47p48k366j333n56J972J920J144p98k201j670
2159b301l18J630J912J425q37j345k130o17J251J566J801j89j190k223r40N53
2175a952J939J920J58j013k437q03M52J494K076K68m84k353j000k81J234K285
2191A503R92o99k176j411n21J810J909R02l87k039j471n60J640J433J404m19j399
$$ y = [2882, 1180, -651, -2551, -3208, -635, 931, 2841, 1732, -305, -2098, -2850, -1491, 553, 2433, 1973, 520, -2024, -2715, -1808, 454, 2352, 2200, 1151, -1580, -2678, -2140, 56, 2122, 2255, 1475, -1129, -2016, -2431, -310, 1577, 2834, 1689, -697, -2205, -2453, -448, 1410, 2747, 2029, -142, -1679, -2535, -809, 1086, 2814, 2440, 594, -1501, -2338, -1258, 622, 2849, 2103, 989, -1515, -2131, -1745, -116, 1949, 2191, 1226, -964, -2291, -2259, -84, 1788, 2335, 1587, -779, -2112, -2668, -696, 1224, 2368, 1570, -631, -2301, -2619, -989, 923, 2348, 1511, 166, -1964, -2581, -1330, 236, 2037, 1848, 658, -1565, -2505, -1952, -13, 1907, 2065, 1052, -1385, -2188, -1736, -242, 1834, 2102, 1618, -735, -1735, -2016, -782, 1503, 2495, 1796, -380, -1791, -2312, -502, 1407, 2309, 1922, -117, -1588, -2148, -508, 925, 2329, 1910, 511]
2208E11j642r58P70J840J544j46j022j953j294R24J541J675J86p00k186j030J41
2225a799J392J812N69k58k816r79j12J586J975M80m39j695j616k91J227J599J363
2242A998l77j709j310j055J367J230J880k37j206j729q54O58J254K012j59q70
2258H93j557j269J56J583J600O98m80k237j127p3J490J744P59m43j959j243j51
2275a616J022J884N97l23j661j083p44J178J239J459L2j335j586q20O57J003J922
2292A825j62o68j902r63O68J094J591Q1n89j734j225J92J433J767L05k47k120
2309f54j196nR09J725P77l73j551j200n37J243J620Q64j36j485j231r71R46J540
2327B85J281K51j319j311q90M95J212J359M42j070j377j024L65J197J650M57p48
$$ y = [511, -1131, -2089, -1319, 521, 2065, 1919, 897, -1056, -2350, -1426, 115, 1790, 1976, 1276, -910, -1940, -1799, -407, 1405, 1974, 1716, -1100, -2079, -2191, -605, 1370, 1850, 1411, -284, -1900, -2191, -964, 635, 1998, 1621, -88, -1398, -2453, -1086, 144, 2024, 1787, 581, -1148, -2002, -1344, -90, 1922, 1763, 893, -664, -1933, -1777, -194, 1406, 2104, 1624, -613, -1740, -1813, -323, 1421, 2180, 1737, -222, -1465, -1616, -594, 1290, 1887, 1564, -97, -1180, -1924, -746, 493, 1952, 1984, 649, -937, -1757, -1100, -97, 1825, 1663, 995, -907, -1870, -1202, -108, 1483, 1564, 975, -759, -1984, -1792, -359, 1408, 1713, 1466, -654, -1850, -1855, -946, 779, 1556, 1183, -368, -1568, -2105, -862, 758, 1622, 1486, 1, -1230, -2201, -1255, 285, 1566, 1817, 498, -813, -1703, -1208, 4, 1363, 1805, 735, -642, -1666, -1301, -104, 1546, 2003, 1255]
2344A255j687j043N8J156J604N05m24j409j174m81P86J535J197p0j631j111q66
2361a800Q92J404J485pj504j497p32M64J361J628K4j184j317j138M34J033J624
2378A170O24j074j402j041J50P35J786P83o40j431j377Q3P49J760N86k76j485
2395c00r43m85P08J442R30L05j621q30j005Q46J054J202K71j058j270q61M30J063
2413a22J681K01j141j190j098M37J084J333N11n37j439j121J26P52J593O71j91
2430A550j499j025m39M69J584Q06j1j120j436n51Q28J278Q03M25j141j348r40
2447a767O55J226J318K84j235j097j007J64J206J274L50n29j115r76OM32J691
2464H80N66m20j190j360Q1N71J396N10K58j247j280k72N37J572N36K97j189j068
$$ y = [1255, -432, -1475, -1417, -261, 1343, 1848, 1424, 15, -1159, -1640, -854, 681, 1878, 1808, 177, -934, -1800, -908, 496, 1981, 1974, 470, -1027, -1759, -1295, 66, 1694, 1718, 534, -783, -1921, -1487, -454, 1170, 1794, 720, -682, -1723, -1573, -838, 948, 1731, 1091, -340, -1717, -1634, -885, 875, 1461, 1185, -300, -1243, -1728, -1020, 422, 1352, 1657, 36, -794, -1799, -953, 101, 1303, 1574, 516, -754, -1615, -1185, -122, 1559, 1760, 619, -571, -1669, -1232, -148, 1185, 1696, 1159, -280, -1401, -1275, -523, 1070, 1741, 1550, 51, -974, -1413, -944, 640, 1446, 1435, 315, -1121, -1672, -844, 434, 1237, 1662, 521, -827, -1767, -1112, 114, 1432, 1716, 481, -616, -1623, -1459, -253, 1021, 1371, 842, -273, -1249, -1243, -811, 880, 1446, 1026, -164, -1524, -1443, -872, 524, 1034, 1292, 45, -1235, -1507, -970, 602, 1138, 1435, 246, -822]
2482h22o10K45J175J225M04j114j077n77J09J009R98P76q76j029j172k6J182J216
2500A036N59k05j462j118j22R59J254K96K04j429j369J22N66J263Q66l5j156r22
2518f93n52J65J261P20O14r63j228o02K3J183Q89O77j134q01j194L06P41J382
2536G94N93p32j106j139L32O63J296K37K26j518r78KN47J198Q49N0j148j385l18
2555a537N03J259Q29K76p85j359n06K19J402O66L57j146o74r00K98R75Q64P79
2573A520q18j038o49q4P19J102Q87q18r80r40J28M82J511N34o23q01j261K5K85
2592h19J355P58L8r40j399j60J34J224J046L07j291q91m97j50J204P85N49p04
2610E49r30q50J00Q39R78O00o45q40r58O1K49J303O39k94r06j213K77L34J081
$$ y = [-822, -1432, -1187, -12, 1213, 1617, 503, -574, -1151, -1042, -33, 965, 1741, 865, -164, -1336, -1362, -180, 1036, 1595, 1390, -72, -1190, -1312, -353, 901, 1197, 1401, -28, -1397, -1275, -709, 554, 1420, 1385, 229, -693, -1245, -1080, 181, 901, 1515, 552, -676, -1278, -1255, -72, 817, 1494, 360, -441, -1635, -1329, -588, 794, 1387, 655, -451, -1590, -1258, -595, 701, 938, 1164, -354, -1332, -1330, -783, 415, 1264, 1314, 166, -1219, -1537, -1034, 225, 1054, 1330, 545, -814, -1320, -1101, 301, 967, 1324, 178, -496, -1396, -1098, -123, 741, 1520, 702, -336, -985, -1069, -350, 752, 1639, 821, -159, -1099, -971, -489, 1022, 1556, 933, 132, -1129, -1104, -819, 536, 1294, 1332, 392, -1007, -1167, -1033, 191, 1237, 1544, 253, -638, -1135, -1285, -81, 704, 1253, 549, -381, -1231, -1131, -292, 686, 1286, 641, -199, -1157, -1096, -847, 456, 1095, 801, -105, -1318, -1041, -707, 374]
2629C74O98o7q21j292j63M57J167O93J26n82j186n35L00J085P69M59r86j085o38
2648a227M05O77J018O21p74j048n46j85J027O50P65n23n72j397k26J168O43J010
2666A486k21j042j184K3J12J131P11L06r58r13n67J63J437L04M96r23j000o80
2684a319M5J334O92L71n32p83j092K40R4J445P92n36j259q14J44O90J002P27m13
2703H28j164p87j6O50P23Q89l76k90j224m6R4J003L63O56j204m35j036K82J125
2722C5O96N53r23m30j144J15O73J095L27m86o03j025k40O23J005J111l29p19o68
2741c34l73K44J318K69m9n7k291K01N57R04N77n3l22j012n91M09O71J111R1j571
2761c01m32ll96J374L01N15m33j382L99j053J230J65O14n98l09p80N2M39L07J498
$$ y = [374, 1072, 1005, 184, -1108, -1271, -814, 353, 1046, 1172, 590, -596, -1131, -831, 254, 1023, 1482, 496, -589, -1227, -822, -145, 873, 1494, 720, -328, -874, -1059, -32, 618, 1383, 860, 288, -1109, -1335, -167, 476, 1486, 1265, 223, -961, -938, -826, 305, 1016, 1322, 364, -549, -1116, -953, 484, 788, 1284, 361, -639, -1319, -1274, 60, 752, 1123, 591, -192, -1284, -1044, -950, 495, 1287, 751, -508, -1322, -1178, -488, 514, 1241, 828, -336, -1123, -1139, -489, 234, 1123, 747, 457, -767, -813, -719, 284, 647, 1303, 99, -336, -1372, -1090, 35, 731, 1284, 361, -69, -1213, -1098, -425, 670, 997, 511, -92, -1117, -1357, -734, 271, 1382, 1053, 334, -334, -707, -463, 855, 1124, 1075, 1018, -1273, -1072, -515, 389, 966, 913, 591, -421, -1012, -603, 68, 1179, 1270, -301, -733, -736, -1132, 242, 543, 1058, 625, -757, -358, -1411, -181, -16, 598, 0, -309, -1089, -1037, -598, -291, 1207]
2781A207m73o59j646P75P34M85Q27N76j571j431L60L37O08J432p04n79n22m95
2799g39q4O05J139J21q65p68l36l90J409P96L18n46l38j396M05R0J142L9P05r88
2819C19j223P29k80J186R75p02q28m53q91N39K91J716j530j27m70M77n91J076
2837B13N89L35p14p51p36Q8J023J20L03L73j482l31k80J004P84J16j71p62n77
2856h56l46J203J05N21K92q06o30k48L51M46R81j00l97r66p23N92M93J047kn07
2876D50q07m31R2O61Q16L03m14p78p64n5R32O34L71k72o97p00l39O57P87M39j16
2897G69p81o92k47M42N93R21k56p30m24k97J31M22P83P8k50q93n42Q0O16O94J93
2918F10j27j060j56k35Q35P70J19l02p65k81l19N71P32M34L4q25o23l79O51O49
$$ y = [1207, 734, 75, -1571, -796, -62, 423, 1250, 1826, 255, -1176, -816, -479, 129, 1561, 857, 278, -244, -739, -823, -218, 921, 1042, 177, -591, -927, -1317, 92, 888, 1206, 660, 322, -1074, -669, -579, 563, 602, 1307, 319, -904, -175, -455, 731, 1706, 1004, 176, -277, -1168, -629, -338, 1378, -152, -279, -749, -272, -863, 213, 802, 1137, 423, -328, -1064, -976, 47, 167, 470, 843, -639, -970, -1250, -246, 538, 654, 483, -279, -856, -1202, 1, 106, 627, 919, 113, -517, -765, -414, 32, 1013, 913, 516, -450, -1173, -581, -88, 959, 957, 450, -357, -788, -696, -35, 781, 1084, 670, -108, -872, -927, 5, 639, 1010, 738, 41, -659, -998, -341, 446, 885, 769, -12, -704, -951, -509, 84, 1005, 749, 19, -405, -702, -571, -149, 634, 712, 462, -431, -973, -893, -277, 417, 610, 483, -577, -733, -968, -133, 637, 756, 454, -311, -592, -911, -340, 392, 826, 860, 35, -588, -967, -316, 333]
2938C33N69n96l27m39l71M10M52N08L77m16j052k6j82Q12O62J42k76n84n87r0
2958f81Q64N36J73k80o91n58l7L09Q88J62n6o17o19m20N34Q57K88o5n10m18n15
2979h56M11M34Q13l18j56r19j75K02L28P48J04m94q56n0K3P23O40Q1k23r40k39
3000g19j42N65O79J75m6q91m59Q2M07O50M28J03r82k09n99L41R87L42J85o51m94
3021b48o50M95N60M28J80k85o29o29K46L45Q56J75l90m95l98p5M83P54R0j45p15
3042d7j66l49L41N76M85j5p64l53p60R97J55P49m0r19n72k59O36L02N13j3j43
3063C54q34k31K10K66P77L5r7r11k21nL63N20M06n7q12m45k63N55Q37J3K21p22
3085d1n02%O0N39P61q3p20m87j00P3M61Q35mm70n37n05L52O16M10L09m04p19k77
$$ y = [333, 902, 306, -21, -460, -831, -421, 31, 539, 916, 500, -552, -578, -760, 52, 714, 856, 580, -4, -591, -681, 183, 719, 892, 612, -79, -637, -674, -365, 523, 685, 629, 12, -607, -1027, -493, 364, 652, 587, 77, -341, -856, -445, -11, 802, 484, 328, -591, -766, -564, -236, 512, 616, 122, -734, -784, -761, -38, 602, 683, 460, -480, -719, -861, -296, 383, 558, 512, -379, -838, -756, -349, 301, 729, 832, -150, -359, -958, -617, 370, 712, 897, 246, -248, -898, -403, 157, 585, 765, 480, -149, -778, -532, -187, 669, 844, 454, -41, -439, -514, -31, 723, 813, 668, -47, -213, -562, -221, 355, 840, 825, 61, -292, -1052, -55, 100, 849, 809, -110, -682, -941, -305, -3, 510, 497, 354, -480, -711, -501, -235, 542, 577, 480, -431, -652, -657, -294, 226, 632, 575, -237, -682, -945, -390, 447, 460, 681, -41, -543, -543, -483, 56, 817, 734, 14, -473, -573, -500, -39, 796, 792, 322, -215, -720, -368, 248, 658, 967, 563, -156, -433]
3108d33K27J46N36K63l50n97l14J87k06J218r5J38o39l93k69K45P27L12j75n99
3128g1l01m33L63O33M01J9m90n95k73K98M57M95K58o79l57o97M40K77N54J85j37
3149C47m98o46L04J68O24L33k11n66o40J35J63O91L05j05j71o02j81K75M43K33
3169D01J09k39o59k65K11M93O08k19l96k58m02L27P45q0N00p08l81k87P9J36O56
3190C71L39k35k32q31J1N40M73K30k03m68l95NL87K6M38J91o24m69j31j5O23L30
3212C61J20m65n36k53L85L68M40K19n35j87n20j17N07L50L91j85m81m08j59K55
3232d50N75O50l53l12p27j49M36P55Q2j31l42n27J1J12N16K88Q5n12m12j65k3
3253e93Q09J59K49l78m28p0lL78K35K31l85l56k78Q0L48K64L29j79k20n97L7J92
$$ y = [-433, -206, -60, 476, 739, 389, -208, -522, -335, -541, 677, 582, 720, 81, -312, -581, -336, 391, 703, 528, -71, -372, -805, -442, 191, 592, 611, 121, -474, -747, -449, 8, 503, 761, 82, -275, -972, -532, -255, 299, 484, 347, -151, -797, -493, -325, 299, 632, 421, -145, -785, -650, -487, 204, 509, 404, 233, -369, -550, -275, 168, 401, 510, 271, -388, -653, -442, 51, 659, 440, 44, -214, -616, -289, 456, 376, 876, 168, -213, -500, -421, -285, 371, 710, 475, 243, -588, -577, -37, 436, 666, 463, -5, -400, -395, -8, 18, 456, 647, 23, -446, -577, -592, 31, 361, 481, 16, -520, -773, -388, -20, 420, 639, 104, -83, -603, -720, -213, 137, 528, 343, -138, -546, -705, -450, 125, 775, 422, 110, -617, -766, -330, 425, 507, 376, 34, -493, -482, -370, 146, 434, 519, 7, -405, -570, -593, 216, 375, 624, 246, -182, -252, -255, 123, 358, 589, 204, -152, -430, -350, -2, 262, 591, 412, 192, -405, -368, -176]
3275a76M38J37P2l15n07r2J63N95o0Pj18n00k02o5N51L90q0j52m85j14J1M08K95
3298B01L27l71n45j76L7K69M24M67m72k01l87j88M06J38P84l08n82r5l76K78O98
3319C28L53l34n4n45j87l2O27L85j95n9l17k90r0N89L68n3l8n16l52JN69J65M21
3342G44l70m98j68l2L42K18M00m16j34l82O2k0L06L01n8l53l72O0j04L62O16j91
3364C13l43l25q4O2O79j21m6l3m37k2p3N28M2K16j82l78J2q8Q2M05Q6j12j17o02
3388e38K5L99K02L42n0l57k38l88M87K99K57J54k93m97j59O1M75K42J55k40n78
3409b40M8k85N42K12K28L9p18j7K0M18m9J70j3k42l13j25M12p6N85n04k28J06
3431c0k19L24k7J60J32l35m14k55J85K29J08L67L64q68k29K77K81J32o2K40j001
$$ y = [-176, 262, 399, 471, 156, -351, -443, -280, 315, 255, 262, 144, -356, -558, -623, -72, 318, 238, 86, -399, -513, -502, -94, 201, 528, 157, -388, -564, -527, -258, 166, 633, 161, -40, -427, -615, -209, -71, 713, 405, -177, -272, -648, -370, 328, 681, 347, 293, -252, -439, -471, 156, 541, 346, 287, -30, -320, -410, 179, 547, 494, 456, -60, -412, -411, 158, 323, 744, 374, -124, -292, -324, 18, 236, 636, 220, 86, -296, -234, -254, 52, 353, 295, -58, -430, -370, -474, -112, 504, 313, -30, -355, -439, -377, 302, 181, 135, 102, -335, -357, -430, 98, 140, 356, 174, -204, -192, -280, -198, 207, 293, 181, 64, -538, -513, -114, 88, 430, 380, 23, -215, -603, -116, 183, 440, 594, 301, -196, -355, -294, 181, 423, 578, 338, -240, -192, -477, 65, 277, 505, 544, -174, -191, -171, 247, 198, 368, 355, 113, -200, -325, 87, 11, 596, 92, -136, -30, -249, 75, 48, 208, 340, 5, -409, -664, -479, -250, -142, 225, 589, -279, -508, -231, 50, 182, 120, 360, -641]
3452f41M07J9j78L09L83m49J86j112O36J83M51k68O02r43p00R38jK28M29q6m6
3473C47n00o37O74l34J43P31j011M18J89j37Q47l92M05j17n50p75O01r8P27q53
3493c22Q09j49j063j76J18P17P7L43q28O7n0N88n57J64K86P8k92m70K08K33P61
3514E42k32n69K94k11m32K80O26k40j66l42L18k43L20N90p3k44m26m28M22L5K17
3535C8L58m75n1j5j83K6L24J82J23m79k19j6K35J02M09M2k95l78j23L51J30K94
3557C80j45q6m58J39J53O8J72J19L6j69m00J16J24L19q7O6n13k5r1p4P94q6j50
3580B02j77k17k33K73K39J39K12l02m51m5k8L80K37K92m99k75l33N04j54M56J7
3601B37k67j20m02L38Q9L51J12l0m30l62J08L88k56N27L96q08j79R1J46M57j12
$$ y = [-641, -234, -215, -393, -84, 299, -150, 36, -1076, -440, -257, 194, -74, 528, -415, -1115, -177, -178, 50, 479, 393, 347, -153, -790, -116, -450, -307, 424, -587, -169, 20, -117, 730, 338, 743, 626, 76, -699, -98, -196, 531, -322, 487, 338, -725, -901, -783, -66, 11, 354, -474, -407, -457, 131, -426, -262, 24, 102, -190, -660, -452, -219, 542, 310, -259, 35, -176, -608, -328, 298, 58, -108, -450, -132, -375, -55, 535, 462, 218, -208, -636, -214, -179, 38, 396, -79, -130, -145, -328, -302, 22, 204, 327, -152, -371, -387, -152, -50, 359, 401, 106, -272, -395, -44, 86, 380, 235, 149, -309, -170, -17, 51, 223, 342, 378, 209, -191, -75, 49, 368, 281, 347, -166, -191, -282, -356, 438, 352, 202, 25, -192, -425, -152, 87, 226, 438, 136, -315, -360, -388, -8, 229, 521, 22, -253, -586, -82, -236, 220, 237, -30, -150, -552, -214, -125, 226, 338, 308, -122, -484, -376, 12, -244, 283, 679, -129, -308, -217, -71, 386, 274]
3622B74k00rj42q2q2N11k07M07n05o3p2Q6J64J22K27m51Lk91L49j46M67M1k93
3645A08k64j13J70lL61J8J4k48l68J8J13N76O9k17l76j24n0K49Q0M01p6k26j59
3668d7k29J99J6K88K8j50l78J87k22M03K25p2l17k35r4j7L70J19J12J54m61J4
3690a07l17K97M06j1Jk38m10Q1K71Q2L72r4k98L6k09p7M46k6Q3k89j33j79K99
3713a4J22J18J45l04l73K83k20M25J94r7k03kl54K59N9j75M70j45k64k43L10k31
3735b40N53k3J92o94o3J44kL50P5j99k96J83n23L13M40lk0o4j88k09j66L23K43
3758A26N7J69m74j68J73K36o1L45m23r9j55n0J20J28K37j2l35o7L5L02p1J00K94
3781D07j92l71o5K55J5J81P1l20j4j57o2K54K11J2k10R1k05K5J22L7J78j33j90
$$ y = [274, 74, 65, -77, -159, -241, 270, 63, 470, -35, -98, -170, -84, 80, 202, 429, -22, -19, -310, 39, -107, 360, 401, 108, -156, -269, -99, -102, 259, 277, 291, 43, -325, -307, -194, 382, 451, 234, -142, -266, -316, -67, 13, 414, 338, 112, -47, -276, -77, -61, 227, 255, 105, -273, -86, -308, 95, 320, 248, -69, -304, -398, -415, -45, 74, 186, 340, -121, -107, -424, -127, 279, 268, 269, 31, -379, -298, -27, 55, 427, 333, 35, 71, -138, -215, 231, 205, 288, -1, -134, -313, -14, 108, 226, 371, 67, -306, -23, -243, 182, 376, 279, 76, 74, -280, -21, 38, -137, 333, 188, -76, -319, -9, -240, 313, 290, 482, -212, -275, -131, -133, 217, 292, 93, -203, -20, -543, -230, 210, 207, 187, 123, -65, -274, -440, -117, 126, 183, 352, -122, -290, -117, 119, 58, 403, -20, -119, -274, -324, -204, -76, 161, 149, -186, -253, -218, 84, 13, 113, 407, 215, -156, -221, 34, 49, 230, 301, -19, -33, -190, -252, 2, 213, 225, 15, 106, -99, -74, 48, 85, 263, 130, -60]
3804f0m71L52K3L62k8n7M8l03j68K58L42r8k05L0l04Q9n3M49J26j53n8k86J2j50
3828c03K90l5M34l89k1o8j03K47K9J41j72m8j06k38M08r2J46K42l79r2J00n6K52
3851A87L43l92j37j73q5K91L63k85n6R0l66J13R8K26j8Q4j86m67M96l89L57K58
3873C52j58k03l86K79k95N25o1M10k99m7k89L2L1K99N4k7k72k58J91J29R1J68
3895B66q6k63j85J35l44L56KL49k24l52L67l45J21K95j08J4R7l72q2J97L38K65
3917D41k84k64M0J28j59J65J31q6N8k02j30k33N25K69j77j63k86O3q1L21M50l25
3939B01n4o17M46J95k0P6p2N13n43k39M77l0k61JJ33l76L92j77n7j74O56m79k29
3962b38j3M17n67K19K53M84j252L21N5K49j66N6M24p31M66M3P71j160J55J52J88
$$ y = [-60, -531, -179, -156, 206, 178, 121, 169, -134, -302, -44, 298, 200, -5, 25, -279, -190, -243, 206, 332, 179, 121, -165, -153, -303, -13, -48, 386, -3, -24, -92, -195, 52, 81, 222, 50, 2, -104, -342, 66, -26, 120, 362, -17, -109, -9, -65, 187, 530, 138, 1, -172, -257, 34, 397, 112, 56, 146, -220, -107, -9, 217, 199, 283, 97, -370, 126, -263, 94, 352, 194, -9, -395, -116, -411, 114, 53, 463, 164, 117, -172, -140, -109, 190, 244, 217, -55, -313, -122, 7, 98, 266, 180, -83, -268, -133, -477, -121, -119, 230, 6, -346, 21, -324, -203, 92, -16, -2, 95, -277, -359, -162, 176, 441, 157, -107, -67, 61, -98, 67, 198, 112, 170, -32, -162, -395, 130, 399, 222, 59, -227, -164, -245, 76, 526, 201, 147, -470, -24, 171, 151, 227, 155, 668, 125, -114, 363, 333, 72, 73, 206, -170, 222, 45, -12, -186, 470, -9, -238, -251, 166, -401, -182, 71, 555, -697, -376, -321, -72, -238, -182, 242, -489, -23, 20, 791, -369, -214, -62, 126]
3983A26m72q6K45J42J23N7m4l97K35k98O97m40R3R5O5j15j50j47L87L29k47l48
4005a50P5p1K49n2K21k27L2j3j43%J5L39j71rj30j02K08J26R1J9j87j53J72p5
4029F4n5J74J46k54l71K29r3J10O9K29q9j12k76O8J03jK48l5k10k18m4K63j31
4052a86N90k39j45j54L6O4J78o2l9j17J81k42j9J67N0L7j55j58j39J73J39O0L7
4075E7j39J30k12L12K6l70N42k35j61L8k08N9K24j27J6K0n9k0K6K81Lr3J70j79
4099A01k14N5J68J18k63L16n93L79k51L0K65K6j09q2j10J50K00n4m9K70l06j34
4121h7j90Q3K32J36M5j20j45q3p2J17K90k41j18J50l44L22N4J47J2L1j33l09O1
4144a62J48J58l41J65n1j69O7J43J23P4J93o36K26j09L6J51K32k73o8pP0J47k18
$$ y = [126, -346, -432, -187, -45, 78, 135, 91, -306, -71, -369, 328, -112, -19, 76, 141, 26, -124, -271, 116, 445, 198, -150, -75, -146, 103, 51, 272, 45, 77, 64, -79, -79, -64, 275, 104, 95, -35, -137, 71, 197, 288, 307, 120, -33, 139, 64, 9, 183, 329, 75, -296, -67, -160, -50, 19, 248, 159, 47, -229, -161, -58, -59, 189, 154, -56, -274, -318, -55, -186, 404, 165, 20, -134, -98, -34, 144, 82, 43, -74, 107, -135, -154, 13, 63, 100, -55, -213, -352, -179, -40, 20, 57, -82, 48, -164, 148, 174, -196, 346, 111, -50, -12, -220, -161, 63, -64, -48, -28, -87, -107, -81, 200, 203, 110, 280, 101, -113, -58, 110, 228, -35, 281, -312, 67, -184, -154, 111, 137, 28, -54, -164, -14, 186, 132, 83, 353, 47, -87, -277, -194, 38, 174, 219, 99, -46, -129, -201, -84, 206, -35, -153, -3, -347, -25, 29, 176, 188, 219, 86, -223, -162, -14, 144, -197, -32, -83, -252, -185, -42, 81, 155, 348, -288, -62, -171, -135, 16, 248, -25, -93, -100, -30, 117, -101]
4167a01O3K15k73m7p8o9J32O13k73q9l33QJ65K05j08L01m09k3J32r9p1M02j0j78
4191G5r8j47k5O3K64k00K40k75K91n33J83J81L53l03m6k11p1K17N7K05J59l02
4213G7k42k22K30K89J2j23O4R9l16J44j48L61k31M5j46J7N6Rp5J93J44l57l2j52
4237c04L70N0p1O8k70J69l00M71k42K09Nj47K8k63K19N2K44l49J71j00j35J27
4259BN3J51JL6j48k94J65j7n3K22jp7l22J33k4K49K0Jk08Jl7P3J86j04r9k4Q0
4286c5l24L61K0K97j32k06lr8j82K87J54n4j15J4k10K79r0o4L73k71O1k07K17
4309G2j81Q4M51n1n46M2jM3J21N6j56J8r6Q6o4R0L0J48l1j30n9P2J07MR5k14J28
4336A18k51r5M60k18j3J70r9l81K42l7K47k4M2p6l12K85q7J6l9M83k75m17J08
$$ y = [-101, -38, 177, -96, -143, -221, -290, -158, 455, 182, 93, -240, -232, -67, 138, 30, 331, -78, -101, 31, -68, -139, 263, 253, 75, -23, -170, -195, -132, 132, -68, 172, -103, 188, -345, -162, 19, 372, 69, 23, -188, -259, -42, 15, 220, 379, 77, -165, -387, -157, 132, 144, 21, 85, 184, -132, 12, -136, 225, -6, 39, -107, -90, -34, -25, -100, 93, 237, -120, -152, -304, 66, 116, 45, 113, -157, 12, -288, 183, -59, 150, 155, 8, 36, -227, -8, 44, 288, -61, 110, 10, -125, 2, 55, 206, 207, 243, 95, -199, -34, -51, -104, 118, 117, 40, -282, -149, -173, 76, 96, 97, -111, -110, -147, -74, 112, 8, -91, -115, -35, -359, 2, 22, 319, 187, -19, -22, -120, -302, -15, 139, 85, -30, -16, -226, 53, -37, -101, 272, 1, 62, -145, 72, -109, -25, 426, 375, -171, -129, -130, -87, 34, 90, -66, -48, -144, -58, -122, -32, -2, 146, 115, -15, -74, -2, 105, 109, 204, -10, 118, -133, -228, 232, 14, 1, 171, 72, -309, -67, -104, 143, 119, 161, 85, -227, 58, -29, -13, -52, 431, 156, -261, -153]
4359a53k69L84q6K32m11K11k67J22K74J36j08m9k84J26J32p2J74Q8j62Q0k86J11
4381g7r1L84p3j15O9m00J64K97k25L70j22L0n24J29J4L72L8m3j78p9%J8k5p6L42
4406A99k78n5M6n6L21n7Q7k24j79K25k44K27j36J78K2j36j09r8J38J31K45o5j27
4429E5l81K24J1J31K7L5N1k99l8j0J91N9j01j70m1k1L1M10L6j36k39K34k46J35
4453e2NL0K78k37kN6k64K33J12p5L9l9l31J03K82M7J01k48j42o6L33k25L28j01
4477A65J59l68m5j8J50J79m61M15j57oj27k07M72p4j3K2M2j65j56M24k25j91n5
4500b40L23k10j31L03JK50O5k90j37j01MP4M11j89l8o3l82L21J3J68k94J50pm8
4524d7j28K60j13K68j03l95K00pj06J00J54k07N2P9J6M0k03L11j71r6j85K36q0
$$ y = [-153, -422, -38, -124, 108, -303, -92, -359, -237, 37, 173, 65, 16, -268, -142, -10, -82, 92, 180, 18, 98, -188, -77, -168, 216, 143, 28, 97, -303, -139, 158, -67, 303, 181, 211, -313, -184, -170, 202, 240, 197, 19, -60, -60, -42, -67, -143, 199, -79, -134, -88, -144, 177, 120, 207, -17, -196, 29, -215, 12, -124, 54, 76, -60, -169, -267, -129, 2, 247, 182, 55, -326, -102, -91, 40, 67, 102, 153, -146, -184, -194, -3, 56, -45, -215, -256, -277, -246, 164, 200, 64, -175, 59, -187, -52, -47, -17, 261, 24, 22, 78, -186, 47, 159, 84, 123, 84, -247, -144, 138, 185, 286, 38, -104, -170, 163, -62, 266, 165, 324, -44, -89, -107, 43, 222, -239, 176, 19, 13, -114, -321, 151, 77, 64, 86, 128, -37, -193, 231, 6, -185, -240, 83, -127, -258, 45, 46, 296, 361, 71, -66, -167, -163, -89, 322, 133, 95, 32, -350, -29, -16, 152, -142, 8, 1, -47, -175, 85, -28, 240, 137, -258, -58, -65, -171, -71, 83, -124, -72, 7, 23, 63, -140, 171, 0, -96, -281, -45, -125]
4547a25n2N67l09Q2j11q7J61r4J30J4N2k21J1L9N7j01J03m5l23J03L09k02L6k54
4571b60K02L00m69R7O2J54j36L09l62p2K80k20J36J68j30K74l75m1R7O3L40m03
4593A4j6j67K5j9J90J55j58r2k61K11P3K57m56L56J92m02l4J27N0K90p8l72J35
4616B0L4P8L3p3J28j79j49J51j30r7O1J76j01J2mo3M6j03N3J02J76m09p2J10J9
4641a81N1pj0J88j15p6J93j51K52q1j57J99j34K00j21m3l2k7J55k45K14m6L54
4664C80m33J79k68Q5OQ1J98k97K61k63q5L0%K03k7r8pr3P9J13O4j06K10k83o2
4689a33j3J66J03N6L2k49l0j45J73m7J15m3rP8j01J54k76N25l31P5j02j70K1L2
4713a19k3J49L5m11L03k45K48L04j62j04j13n0L86l81J67K92l17O6pM5M8j14J75
$$ y = [-125, -177, 390, 81, 163, 52, -35, 126, 32, 162, 176, 228, 7, 18, 57, 114, 13, 116, 71, -252, -149, 160, -42, -6, -260, -58, 242, -227, -130, -68, 86, -50, 259, -103, -175, 105, -115, 21, 189, 59, 333, -42, -83, 14, 77, 417, 14, -2, -169, -144, -163, 27, 182, 24, -68, -329, -118, -45, 212, -244, 112, 304, -98, -132, -5, 45, 335, 257, -115, 20, 54, 132, 165, 92, 220, 41, -108, 43, -87, -184, -123, 53, -48, -36, -40, -103, -57, -160, -107, -5, 171, -238, -310, -200, -181, -130, -137, -147, 41, -74, -150, 43, -108, 144, 63, -94, 105, -29, 171, 50, 7, -25, -52, 103, -142, 72, 26, 380, -53, 126, -142, -57, -51, 30, 228, -69, 192, -71, -156, -126, -126, 77, 50, -48, -55, -148, -69, 44, 108, 2, 212, -71, -133, -146, 20, 123, 179, 211, -38, -68, -213, -40, -87, 28, -15, -24, 54, -47, 107, -169, 356, 25, 100, -2, -172, -151, -119, -142, 7, 42, -369, -66, -311, -63, 241, 79, -25, -138, -188, 198, -183, -16, 276, -41, 25, 18, 63, 111, -3, 172]
4736A72k0j13J19n08N20k11K72o1j18l2k39K25k13K22M4j26K53j63k44K55k27
4757a93K97r7j32J1j72L12qO1J47j39l2r3o3K20M1or3k5o9QQJ51k3r5q9L5KJ56
4785A20J54o4o0j78j40O3J2K80q2k52M0J77j63j61N53k35n8p1l6J4M12m79L41
4808A87j20j80K35m18L57j53K90J22o97N30l50o6J23K81J77l31l0l04Q09l17j25
4829B0j4K10k25L4N8j85L16k60K02k13j90L60k07M09l05J80j09j28l92K46L63
4850A70j1K0l0j20m84L62J16R8m2M6L5p8P9k30K88j03rk5l61L20O2K40j94n3j36
4875d0L29o39K89J46j65q2K36k55J07K96k97K23m22J77J13l00J45N9q9L93k60
4896c6K59m17J28q9Q2n1K10k08r8K36l9J37oj56J95j65K19l10K51o3J7j44L2M9
$$ y = [172, 152, 39, 158, -350, 170, -41, 231, 170, 52, 20, -219, 6, -207, 15, 59, -67, 186, 23, -221, 34, -193, 104, 7, -125, -114, -286, 26, 18, 79, 226, 87, 55, -38, -101, 119, 160, 154, 61, 36, -33, -25, -17, 134, 111, 16, -73, -38, -36, 120, 274, 210, 150, -28, -168, -105, -93, 187, 105, -147, -107, 70, -93, -254, 299, 64, 6, -65, -101, -87, 325, -154, 187, 67, -113, 122, -296, 61, -92, 198, 320, -377, 153, -197, -263, -140, 141, 318, -13, -43, -347, 462, 145, 20, 6, 216, -9, 25, 83, -102, 214, -46, 156, -57, -247, 113, -94, 315, 10, 190, 81, -47, -439, -193, 170, 159, 179, 149, 29, -455, -93, 23, 121, 79, 125, 160, 82, 161, -69, 219, 116, 107, 82, -279, 41, 103, 343, 149, 96, -40, 289, -350, -61, 85, -80, -162, 74, -181, -74, 222, -75, 148, -274, -97, 16, -284, -139, -80, -169, 224, -36, 223, -194, -66, -155, -73, -124, 86, -122, -220, 16, -23, 114, 108, -48, 147, -18, 201, -109, 142, 79, 96, -48, -16, 33]
4920C3R7l2j36pm4R1r1j67J42J98M42n09q7J05k18J97R0J05k24k4j27L04nj66
4944c3J60j74m7j53J84PJ37J57l15K0q4J53L22l68R4j92o4J59j47K61K0j13K16
4967B00j61j62n9J77r5J16K28l9r1l27N0M1J10M4N7r0n5QK76p9j4p2J89l09J42
4992H5j30J03j1m5Q8m0J65k81J68r3P2p1J5o0J73j27Q7j35M3O3l97L74J52j55
5016D3J62o7j79k8R9p6j2M4J90j13Rk9K22k06k78L91k89j22L91k08m8K8M5N8l10
5041b83M3K03k9r3K20on3n6j33L58p8j28K21j26m4n5j04J04j7Q1j64M1%K94k14
5066a8n7M7K1mJ34k13j0K31k32P8J28l10J34J36L0j12j10K57j3j95OJ52rj92L4
5091h7K5j04l4R5Q6K8o2j90m2L87k12K37m90M52k14j08J38oL48l25L70m41J43
$$ y = [33, 130, 98, -38, -45, -89, 2, -89, -256, -114, 84, 526, 17, -70, 35, -183, 14, 104, 209, -15, -39, -166, 138, 133, -33, 127, -47, -94, -247, -63, -56, 81, 238, -77, -57, -141, 12, 334, -34, 60, -132, -196, -37, -184, 77, 97, -16, 200, 39, -123, -182, -5, -100, 16, 244, 205, 114, -213, -163, -122, -12, 32, 89, -1, -56, -48, 228, 149, 135, 63, 252, -57, 85, -45, 58, 47, 2, 90, 50, 215, -66, 102, 9, 81, 10, 25, -35, 138, 11, 98, -37, 6, 69, -328, 46, 198, 43, 205, 138, -41, -69, 30, -46, -58, -14, 176, 63, 72, 43, 265, 59, -219, 172, -117, -239, 152, -56, -104, -76, -31, 27, -283, -240, -37, -66, -159, 61, 55, 2, -54, -187, 171, 93, -35, 186, 60, 16, -39, -143, -39, -56, 25, -139, -98, -98, 196, -18, -75, -28, -7, -11, 123, -90, -100, 131, -101, -23, 105, -205, -71, 65, 95, -17, -127, 130, 117, -78, -72, 80, 71, -121, -87, -62, -166, -200, -105, -19, 9, -53, -243, -285, 102, -110, 127, -363, 89, -125, -233, -95, -101, 247, -78, 292, -149, -6]
5114fJ06j62M9OL18n88L25rk06J51k8K26k25J72k79K47j60P0r1k24K34j8Q5p9
5138h6J81P3j78P9o0k4J37P2j63rn9R6q4j0J53M3n2j12K0K18j84P9m7N9k31k38
5164c27L64n7J80J1Q9l36q1N7K97M3k43J83m4p6j44K32j17M6j95K3qJ54l2K1K29
5189B69k88R7o9j51n3Q8J60r2P4l39L02j33K38kr1K3L1P5j90J08j17K14J03m20
5213a63J47j07K97q7k45J92k72J47r5J88J1q5R2J8J09l22J68O6j13J94k11r8K36
5236F7j60K10J68j40j42j51M0P0L4J11l38Q9J57rj99J68L05k49N0k22J85l05R4
5259a67J48j9J66NK4j97m1L25l88K57o7j63P0N5O3m9n0l3j61K65q2J67p7O7k6
5284I2k28P2J10k04K17J6k3j31J91rj11N7j77K74k13J07k64M36j18N0n5j3Q1l06
$$ y = [-6, 100, -62, -13, -7, 311, -277, 48, 39, -167, -16, -44, 182, -43, 129, -150, 97, -63, 7, -84, -308, -74, -92, -7, -86, 95, 168, -10, 69, 9, -15, 122, 194, 31, 22, -37, 59, -25, -35, 118, 161, 109, -3, 17, 235, 51, 130, 83, 142, -89, -327, 37, -20, 160, 171, 260, -76, -157, -100, 197, 240, -3, 180, 136, 60, -84, 148, 31, 77, -118, -95, -103, 51, 19, 40, 269, -19, 78, 9, -142, -195, -107, 53, -39, 35, -304, -2, -135, 103, 101, 10, 33, 64, 139, -51, 57, -60, 154, 257, -163, -16, -123, 174, 87, -158, 34, -238, -91, -186, 2, 13, -72, 20, 38, 147, -175, -7, 59, -54, 140, -71, -169, 67, -93, 117, 285, 145, 3, -148, -108, -38, -4, 107, -231, -142, 15, 6, -193, -25, 280, 31, 81, -141, 44, -261, -167, -19, -38, 128, 133, 157, -40, -81, 244, -144, 113, 46, -117, -47, 8, 71, 22, -28, -61, -222, 43, -39, 128, 51, 118, 92, -136, -64, 46, -158, 59, 75, 52, -79, 112, 103, -8, 49, -128, 146, -67, 40, -224, 212, 94, 144, 89, 76, 157, -149]
5308a49J53k51J57r6J55K9J26Ok31K08j3q8J0j09J00J61j62r0P0lj40O8k0K94
5332A85j29J36m67L35k7m5P9Pk74K8J42K31l92K59JQ4j59J33l33J89k8J98k95
5355a42K74j95j7O6J53j79J83P7l92K78l96M41q3k58L50k74P4j10J99l37L02j24
5377a10j3J20m5J88k39L6M1j41J49J63j41k1l6K01l41J12j46J62O4J75j19J21
5399A80j19k90M90j92j14J31l9j89j3J59j69K61Rq9n4k8o5K99L36n33NP3k18P5
5423i4M1j35L07j5j63K19n62N62L6j37l89K57P0j30M57o96N59j43n60M13l88M23
5445f8P4k56L59j08L2K73m3o01N16m17L10n9P1l51M44J1J08r4n35L91pk60K17
5468GN5J76k71K17k53O77j008J085p57l24O57k9n33J15L49o48M14m9K65l0j82
$$ y = [-149, 4, -247, -90, -186, -31, -2, 124, 130, -101, 107, 94, 6, 16, -93, 7, 168, 6, -84, -14, -17, -157, -89, -109, 185, 56, 192, -275, 60, 33, -12, 67, 74, -200, -172, -30, 201, -191, 68, 69, 153, -6, 127, -206, -17, -45, 153, -142, 132, -63, -80, -14, 139, -40, 143, 220, -172, 106, -290, 151, 68, -190, 160, -114, -40, -150, 49, -288, 14, -110, -123, -3, -48, 140, -99, -63, -22, -163, -14, 149, 8, -13, -49, 152, -189, -77, -223, -61, 3, 178, 59, 180, 61, -229, 261, 69, -45, 86, 47, -142, -155, 4, -165, 96, 105, 16, -38, -66, -131, 168, 504, -29, -24, 49, -169, -94, -53, -188, 119, 104, -59, 160, -402, 160, 196, 59, -330, -73, -3, -133, 324, -372, 187, 44, -516, -103, -491, -68, 6, -250, 109, 1, 33, 306, 263, -338, 178, -239, 71, 12, 83, -268, 176, 187, 295, 201, -334, 57, 50, -210, 7, 62, 238, -33, 184, -69, 608, -400, 685, -72, -396, 261, 232, -301, -186, 163, -485, -71, -120, 145, 115, -67]
5489f7N9J26o61L56o97Q60j43K27L63k49p1L57p11J93L64n75L82L46j018L75L75
5510A91J40o0O11q03j0o13Q87k52lQ55j35o25l62L64j2N01j147N77P35j231k36
5531f28J132r44M85L26Q6n60k07L73n95J338o46j29Q64j211K95j5K30L02p36M82
5551B42k57p2N4J95n29j24N01k14J95j96J11M02j16m42j79P0m9o2N29K14l24k10
5573b61K10j29L37l12r9L04K95k09l17L90J71m17J73Lj77J1J39j50l60Q78j35
5594C45n41n3M82o45n28R83n27K42Q6M48J43o19J36j00N21l61k9J74j89R7j74
5615a09L00Lj76l9J3J41k51n1K36N7O4k00J27m27K97K11k12p0P0K0j27J33N9j40
5639g1k05L46r4Q7mk88N30n10K65j0rl0K18j16j75Q2P2J16k34K89m45J13o2K71
$$ y = [-67, -8, 118, -543, -187, -884, -24, -167, 60, 423, 174, 103, 460, -251, -58, 306, -269, 113, 459, -559, -184, 191, 331, 271, 882, 79, 69, -544, 343, 91, 88, 943, 808, 183, -179, 185, 173, 674, -473, 104, 839, -392, -628, 504, -440, 45, 371, 457, -103, -310, 63, -532, 806, 160, 31, 895, -316, -21, -36, 194, 496, -240, 242, -15, -87, -33, 162, -367, -491, 10, -204, -9, -205, -94, 308, 192, -250, -429, -359, -408, -470, 59, 273, -51, -261, -51, -180, 157, -155, -254, 50, 345, 136, -181, 209, 380, -37, 136, 139, -38, -27, 112, -38, -398, 480, 345, -196, -249, 233, -412, -940, 43, -484, -242, -156, 292, 435, -184, -48, -148, 373, 12, -17, 157, -32, 65, -109, 191, 194, 18, -21, -8, 133, -118, -169, 67, 124, 188, -12, 115, -312, -15, 196, -16, -86, -16, 4, -123, 10, 69, -71, -276, 70, -24, 63, 59, -229, 301, -209, 56, 46, 37, 7, 225, 109, -66, 16, 88, 204, -30, 259, -186, -73, -135, 136]
5663A36j42l1m8J32r2m7J77p2J78k92N2QJ05j24M39l58n69P05k92l49N47nKk51
5687a91j26N88j34K16k7n86M28k24K56N4l96j75K53m89O96Q0k70L10m14m62R07
5708B94l33L52N99j397J54L72P66j451O73m12l36O50L25j33p49M20N66k69k55
5727a64J73N36r6k46N96q83O55r26Q35p01M91k97J59J87o49L60J93k50j45K61
5747H9j85J00J67k5r7j08n0nJ05J47j40O1r9j51j2L01J3R2l89K68j84K8J54K34
5771C14l31q2Lo1j34L07j10J40P3n0j68J73P4l7L7O1k70qK96l21o1L52k18O5o8
5796b4Mk6J9J49l9K14l67M2KkK8L6K68m28J2j13L07Qk2K44k77r4k8O6J04op2j03
5824i8jL9K80o2R4l9k87J93k28J06N1q3j77K4J98J32q7k63J40P3K8j67K30l20
$$ y = [136, -6, -37, -85, 47, -45, -92, 85, 13, 191, -101, -49, -41, 64, -60, 379, 21, -548, 157, -135, -484, 63, 58, 60, -191, -317, 271, 137, 353, 326, -260, 168, -56, 200, 254, -142, -317, -64, -553, 143, 223, -47, 263, -151, -613, 294, -39, 313, 912, -485, -331, 41, 807, -644, 29, -383, -719, -69, 256, 123, -626, -206, 360, 91, -164, 9, 545, 449, 203, 799, -84, 571, -355, 480, -221, 270, -27, 132, 319, -330, 30, 223, -27, -172, 89, -96, 4, 171, 146, 49, -59, -109, -114, -9, 138, -2, 59, -40, -191, -203, 98, 111, 203, -186, 82, -102, -74, 80, 314, -17, -99, -96, -157, -291, 16, -94, 46, 119, 69, -99, 74, 148, 111, 148, 209, -61, -69, 227, -94, -155, 197, -21, 44, -24, -20, -46, -27, 122, 83, 297, -70, -28, -26, -28, 0, 36, 304, -124, -112, -225, 82, 90, 68, 312, 35, -59, -87, -21, 83, 77, 5, -98, -99, -60, 220, 158, 252, 213, -74, 119, -109, -3, 48, -35, -212, -188, 10, 142, 55, -208, -68, 5, 33, -134, 96, -224]
5848b24L95k91K65j37j55q1L27N1R3l06L00k85k2n5K77j58J27Nk31N3p9K64j57
5871b4K78l00R6K17L3n05J98K57m58L11k28R5n3o9J95j62J52p7Q3j4J38k65J58
5894E6J50k06N5m2n2RL18l37m6K4j85L22M7J10k64J84r2p8J65l2j77K06j85j35
5918a85K43K1j47J3p5r0K64p9p0NK3j44K72k20L37m61L40J79k02J43Q6K2k52j7
5942FK2J83m75N02k01k1J7j20J50r6p5k2J65n8qK36j04N0m26L73N2l34L80l31
5966a35J39J61o1j02J65l4l0j38j84L50q3Q7l92J27K88j69N4l0p1P3L5k46N8J19
5990a9Jj2N8K61l49Q2Jm2m5K28j86j35K45N7k11K75k66oOq5K02j65J99j90Q0p8
6016i4L97m23J19r1P8J02NP4k97K59k3j99J08j99J23Q6j36K44j82O1p7l9M8N8
$$ y = [-224, 171, -120, 145, 8, -147, -228, 99, 150, 243, -63, 237, -48, -70, -125, 152, -6, 121, 126, -105, -52, -131, 133, -24, 254, -46, 50, 267, 300, -205, -7, 250, -208, 103, -125, -30, -83, -152, 43, -119, 33, -44, 39, 25, 163, -102, 56, 206, 0, 55, 13, -39, -30, 288, -49, -95, -71, -256, 66, 113, 223, -41, 143, 51, -27, 138, 106, -71, 135, -50, -185, 58, 79, -68, -55, -130, -220, 44, -35, -105, -100, -77, -221, 51, -169, 168, -293, 47, 226, 24, 167, 253, 275, 23, 6, 28, 211, -264, 238, 37, 16, 33, -87, 63, -33, -108, -130, 35, -23, -31, 205, 101, 151, -275, 98, 150, -184, 196, -135, 4, 165, 104, 2, 167, 133, 103, -35, -219, 131, 48, 135, -257, -130, 158, -11, 43, 13, -58, 15, 50, -196, -138, -19, -18, -30, 28, 289, -60, 22, 23, -19, -64, 164, -22, -157, 88, 145, -66, 209, -57, -63, -57, -142, 60, -105, 94, -96, -16, -94, 303, -120, -1, -92, -14, 88, 93, 167, -130, 129, 106, -93, 15, -184, -61, 25, -111, 133, -49, 12, -65, -104, -56, 2]
6040BK4P7j52L9k32K73j42J71j26J43k13M2M1J22Ol81K26P6J2%J29j15l30M51
6064A43Ol02J10%j49n1L80Kq4M7j85O8J28m98M27n2K64j10j59J70k64j4K53q7
6088D3q0j68J5L11j37J40j21J61j98J2j84K25r1j03L08K2Mn2mj18j23J77k21J59
6112b3o0j1J10J30j08n6M2l11M78o9p8j65K17n9j42q0J73J52j56J26j75K05JP
6136A48k8k17K20k25j01R8J11K10k19Ro3K81l48k8RK31L6nP2m94K9L68r3O7j39
6161g1K41k13J77or5l2j80J77k36M33j96R7j87o2J72J54j21r2J15l9J37n14M09
6184F8o4M9M4P3j47j17K38R5k89o2j01O3J07K04l7L3l47J29j14J0L9j7L61Jl4
6209A85j3K0l24N1J37K0O5N8j57j35K66j02n0J00o7o7j86O5J12l0J07j75M7J16
$$ y = [2, 26, 103, -49, -10, -242, 31, -111, 60, -66, 77, -136, -94, -53, 69, 75, -306, -80, -4, 8, 8, 137, 22, -308, 143, 149, -153, -43, -43, -192, -243, 137, 139, 55, 102, -83, -15, 113, -385, 42, -10, 254, 144, -15, 155, -109, -123, 130, 43, -37, -205, -190, 121, -16, 124, 3, 164, -34, -22, -206, 19, -72, -175, 133, 155, 159, 107, 103, -15, -138, 39, -182, -23, -83, -94, 16, 146, 38, -18, 24, -287, 191, 122, 44, -121, 96, 37, -105, -185, -12, 140, -16, 110, -65, 140, 141, 148, 120, -97, 123, -102, -203, -105, 6, 216, -3, 6, -57, 224, -124, -152, -143, 88, 124, 119, 191, -303, -274, 94, 1, 68, -71, 170, -43, 134, 128, 33, 1, -179, -2, -238, 195, -1, 96, -91, -153, 19, 173, 52, -40, 75, 36, 173, -341, 68, 4, 53, 97, 170, 23, -94, 144, 239, -50, -112, -213, -150, -43, 161, 124, 157, -190, -61, -175, -165, -126, -143, 218, 219, 185, 172, 192, -132, -81, 56, 76, 141, 199, 42, -93, 173, 71, 21, 121, 54, -13, -199, -134, -22, -52, 55, -120, -73, 43]
6233D3M2k20K62k01J36J22k26PP0j25J70nj86J41k58K29m8k4K01m0q6j75nK53
6257G7qj08j69N17l76R1k79J43L15k54J78p2p5k06J12K18j52J11j92L02k28O2
6279GL3P9j8n1L5j77J34Qj11R0KQ1l6j35k61J77M03k22n9r1J11k1J29k01K34j77
6305c7K19k64l2J2Q1L6K10k06J07k18m7l9K74MR4l61J31K08k02J92q6J12j05j33
6329e0M7J4Q0k84K76lk9j49J43K7J77r7j81m4m7K62J89K13n00l67M17l2m51P55
6353C66Q8l83J17L95o52K90J46l60r1J89K31J47r65K84O93Q0n21o86L75O94j21
6374C16k26J50k03K89J77J82j004P01j301J403L5o94J83j47J73n99M02L98q2j60
6394gpM90o8l52k63M84n4q88l4J84Q16J50r04K82M18m48O71k48K80j95j13J56
$$ y = [43, 85, -135, 127, -74, 62, 184, -42, -35, 35, -90, 80, 75, -111, 30, -228, 1, -47, -71, 130, 90, 4, -171, -176, 77, 69, -39, -208, 309, -67, 24, -255, -112, 203, -51, 127, 55, -20, -226, -114, 104, -48, 63, -129, 173, -55, 7, 40, 119, 101, 50, 85, -92, 42, 50, -61, 29, 31, 112, 76, -59, -320, -143, 260, 38, -21, -112, -1, -22, 107, -94, 140, -37, 182, -82, -114, -102, -21, 15, 225, 19, 126, -92, -139, -178, 96, 100, 194, -167, -36, 172, -30, 162, 76, 188, 83, -50, -3, 11, 91, -193, 83, 80, 51, -98, 45, 72, 249, 152, -29, -73, -120, 142, 331, 544, 44, -323, 94, 62, -389, 366, 454, 71, 188, 583, -69, 221, 367, 7, -84, 105, 336, 483, -482, -198, 495, 575, 54, -632, -257, 437, 316, 90, 240, 37, 326, 503, 685, -319, 382, -919, 484, 519, -175, 8, -139, 34, -565, -163, 235, 153, -7, -14, 476, 408, 56, -207, 277, 223, -665, -699, -515, 301, 451, -453, -171, 247, -201, 470, 222, 502, 307, 194, 350]
6416C50n5o20Q55k82j02K44o92L28k60J56N46j83Moj13k7L9J12K04k51m41Q87
6438F93q31K65k6n89Q45p15M80r4J00l27O83p18K73K07J02l92N87o80R6M80o17
6459a78M77l78L77Q3j56o35K46J29q4Q65r90j5M14J09q71P59m33Q0L03k51L12
6480A63j68J01jj3l64l19N28K25k3l13N00m54O9M90k60m81M03Ro6J93l78N51k41
6503A51l00J30ok46M07J78J69o47K51J61k33K11k50k39J0N94l23O1l82J53K01
6524E1J53p6l5L5l72N23j20r1o4j32K58N7j26p6q2R2N7J5n0n4j98L17M9j25R3
6549I9j13K9J79q6K2j80J02k11M67l75J83N3k20r8m4K85q6o3P0P0q9J23j65K90
6573B42k18K4j7J14o7LL02o64L86j10k51K96o4P2L2O2k84J65k03K45O6Mm3O5k3
$$ y = [350, 295, -325, 530, 248, 146, 390, -302, 26, -234, -78, 468, 285, 289, 283, 170, 143, 182, 294, 498, 247, -194, 693, -138, 127, 101, -488, 357, -358, 122, 28, 128, -199, 484, -234, 39, 246, 348, -44, 543, -137, -41, 439, -178, 299, -79, 298, 381, 225, -410, -164, -35, -119, 746, -244, -259, 155, 264, -607, 152, -281, -201, 102, -149, 163, -5, 96, 95, 82, -282, -601, -73, 152, 129, -184, 316, -138, -69, 421, 161, -320, 83, 92, 26, 219, -159, 392, 151, -149, -19, -25, -271, 136, 314, 483, -164, 87, 248, 15, 226, -24, -263, -253, 341, 18, 79, -303, -150, 51, 204, 128, 93, 128, -244, 279, 159, 68, 4, -128, 130, 187, 61, -15, -97, -5, 52, 67, 17, -37, -235, 82, 131, 6, 99, -14, 15, 194, 108, 130, -50, 52, -159, 308, -67, 116, 169, -51, -149, -193, 92, 6, -57, 13, 83, -6, 117, -48, 242, 24, 48, 31, 145, 78, 81, 383, -281, 105, -5, -256, 40, -24, 48, 80, 142, -142, 23, -180, 65, 131, 135, 92, 157, 134]
6598A34j38l7n8r3K75l22M37j09o9q8R7m9j46J01K36l81K04J94k81R0N9r1K51
6621B16k89j58R4p8K63k15L10j11k60J30K87k19k7O2O8qM7l6k00K86m7L7j60K10
6645B02l48l5N2L31l66J29r7K64j20j04L77l08N6j59J72n1J66k11j5j15J07j30
6667b03L68j19M6k34J14J15P4k91J57nN3j27M2j18J37M1R4j03J57k90m6L17o1
6690A18j65K3J8J94l32O0O0J24k6j39M2l3J28n7j25J52l0k3M4n2J73l9k3k25L31
6715A98j24O5O2l97K98P5j60J37m91N10k78K49j95J75p1j28O5J19k2r5j7o7j5
6738a07K3J0J46j77J30L7L1Ok03J41o8r8J38n5P2P0k35K53Kq9m4k65J31o5L80
6763A64j06ql7J35r6j11K00j18L19m63J38O8r4N1o5j6l7J4J80j10P1k15K11m0
$$ y = [134, -4, -41, -99, -192, 83, -239, 198, 89, 20, -68, 29, -20, -166, -65, 171, -210, -6, 188, -93, -3, 56, -35, 216, -73, -231, -137, -215, 48, -167, 143, 32, -228, -98, 189, -30, -57, 5, 73, 65, 112, 76, -124, 162, 115, 152, -8, 202, -146, -181, -129, 202, -164, -35, -132, 132, 12, -92, 285, -23, 33, -126, 46, -5, 161, -50, -65, -180, -73, -203, 165, 46, 92, -142, -28, 87, 161, -130, 27, 22, 75, -52, -10, -128, 9, 50, 144, 41, 198, -92, -138, 179, 118, -47, -24, -6, 188, -144, -84, -24, 100, 74, -65, -23, -56, 72, 15, -110, 42, 12, -11, 33, -19, 154, 115, 92, -133, 198, 74, 139, 201, -196, 102, 177, 17, 154, -337, 173, -105, 144, -51, 124, 53, -75, -10, 109, 87, -8, -25, -92, -107, -84, -74, 72, -105, 25, 62, 93, 99, -104, 37, -31, -129, 9, -46, 26, 96, -139, 114, 116, 27, -17, -282, -151, -216, 164, 58, 50, 13, 148, 52, -59, 141, 23, 342, -121, 17, 85, -9, 42, -23, -39, -76, -62, 118, 8, 79, -136, 75, 35]
6787C5K53l50J34o8K11l04J13J29r8j39J44j10L07k69Rp6J26k54J50K39l92J64
6809d6j50L64j53j05J30j30O3j7l5J92mn6n0j14k5K29p9p8j44N06j08j38J8Q0
6833A50m4j9l76K08Q4j05K7N4J62j34J42j97M9j58K05o9kM2l5k41N14j58j35n6
6857i2K32k36l7J03j87N8P9K47m5Rj84K41k33K74j84rJ09l17K10M3k09K75l65
6880b18J76j17M37k45j45K06k85L60k00J9j97M8L19k40K90q5m9K14n13K68j67
6901a24K45K0n1K38n4k33p7N8K41j93Q3k34n3K33j61J26j65j32L30j35Q3J62k48
6924d1J03m5L9q3J50qn2j51J87lR3k61J59k50l80J031m94J30j1n1j85O6P3Q3k53
6949a54m9L04p5p9j08J81L06l67L4l9M1L9j76P2o7J68P2r5J6M2n7nj97l1L63N5
$$ y = [35, 288, -62, 72, 4, 215, -89, 24, 153, 55, -84, 60, -50, 257, -12, -3, -79, 47, -207, -57, 182, -210, -46, -196, 168, 15, -90, 40, -90, -27, -44, -79, 113, 109, 53, 3, -111, -136, 93, 14, -64, -208, 298, 190, 52, 70, 150, 106, 87, -289, -81, 3, -102, -75, -21, 141, 7, 149, -48, 1, -157, 48, -21, -23, 19, -16, -257, 257, 99, -36, -92, 140, -96, -133, -30, -217, -159, -80, 167, 122, 131, -53, 188, -45, 229, 45, 36, 145, -172, 38, 81, -128, 147, -218, -42, -159, 278, 33, -112, 94, -191, 169, -31, -12, -209, -161, 158, -82, 208, 123, 74, 288, -225, 43, -124, 121, 141, 90, 328, 274, 41, -36, 22, 263, 70, 153, -81, -134, 99, -62, 64, -101, -233, 97, -38, 45, 207, -41, 62, 17, 56, -27, 123, 115, 63, -88, 99, 96, 189, -72, 87, -163, -543, 488, -6, 124, 113, 62, -123, -57, 16, 99, -154, -203, 101, 26, -53, -161, 20, 326, -41, -7, -46, -5, 34, -142, -70, -137, 31, 103, 8, 24, 66, 9, 4, -193, -224, 139, 194]
6975A94k29L03k67J03k32P6Q8j40J79J84l32L5J06J4K2k03J2O2J22j30M6L4r3
6998d6l0j52M11K7k58K9K07j82R4P6j78j42o1l8M13l4j48m5J62k45J68n2j5J26
7022H7k77L20k55J56k1K00l15P6J05N0O1j85J17r0N5k38J0M7P2n5J5K50o6j1R7
7047B05k58J44j06q4J04K06m99R5K60j43N7J14l7j26J19p2J08j11l8K2k7J20l92
7070c39M45Q2n3k31K7lj08L55m31K12j6O3n9N3K7k5K14k50Q4j31J35J52l33PJ49
7095B6J93l1l4l22N78l05l52N98n7m03J62K22J62q01M15P6k06K0j97K18l9L4L17
7118B74k81L57l91o91R32r4j47L17P1m09K76L83q46Q83j554Q23j03O72o75m6J136
7139H87q07L06o30L39Qj42L4L46n29L98l33K52J00j70k44M87k02l3m9Q6l7r8J29
$$ y = [194, -35, 268, 1, 104, -128, -52, 36, -104, 75, 259, -73, -38, 68, 82, 104, -99, -87, -25, 97, -33, 13, 47, -46, -76, -228, 183, 210, -48, -19, 188, 6, 100, 176, -2, -144, -205, -243, 170, 136, -12, -57, 105, -140, 28, -24, -39, 87, -190, 130, -125, 31, 10, 210, -105, -29, 76, 126, 187, 2, 119, 29, 84, -154, -144, -97, -25, -80, -65, 185, 119, 108, 205, -53, 91, -15, -99, 5, 211, -288, -193, 67, -76, -19, 95, 58, -68, 51, -21, 87, -24, -62, -40, -67, 53, -339, 106, 188, 135, -96, -69, -72, -180, 175, -256, -44, -60, 3, -56, -3, 24, -1, 213, -37, 47, -84, 51, 203, -130, -123, 26, 219, 188, 154, -168, 410, 105, -247, 351, 294, -109, 53, 275, 437, -364, 51, 127, -79, -59, -256, -38, -77, -43, 274, -7, 350, -41, -732, 200, 106, -41, 276, 347, -62, 214, 597, -249, 634, -920, -97, -200, 472, -203, -249, 887, 80, 386, -244, 95, 103, -39, -5, 341, -188, 210, -123, 129, 229, 59, -185, 302, 100, 67, 18, 104, 67, -31, 98]
7162I8j89J67p7J06l41M08l29L28R7m50O1J42oj6P3j68J65%M5o5P3j27J97k78
7186h6J45L3j09j43K48j11Q5j17p3L35k79R7J69P5k00n2K06Q5j90l50K15J60j80
7209c7J07N0r1o1K46j98q2k4j40J35o3K13P7k83J29L4j54J58n1j27J70K6N6j03
7233a3mj18R0J89m2j6k72J5R47p74N98o95L63m09n14R09o8o11L52q6J78P8l17
7256b20J77q3L02k51m9L5J27j01L6j61K97j39o6p1K7J92M4j01j48o3L11M6q8k84
7280b31L6J24q7K28k34K52j7j15L7j68K84l92J89R0L3k1J6J9jk72J72J65J6R2
7304B15m8l5j61O1J38q6q1K5K33k17l3m3k00J28k0J09r1K52k63r7K03p0J83r1
7328A1J50l89L45k71Q8L26l49K07j72L02l36n0M29n6k30J26n50L64k11J92j99
$$ y = [98, -91, 76, -1, 105, -236, 172, -157, 171, 268, -182, -121, 21, 15, -1, 72, -96, 69, 69, 114, 49, 122, -5, 192, -86, 59, 92, -17, -160, 88, -23, 62, -55, -128, 207, -72, 25, 194, 269, 69, 17, 223, 308, 118, -232, -17, 143, -37, 70, 120, 29, -32, 214, 16, -66, -90, -230, -95, -158, 55, 132, -151, -22, 12, -142, 16, -35, -162, 8, 34, 90, -13, -17, -135, -45, 144, 102, 86, -186, -171, 776, 2, 600, -95, 268, -141, -655, 254, 186, -425, -73, -159, 19, 97, -220, -43, -126, 176, -75, -124, -89, 38, -63, -27, -188, 109, -30, -96, -167, -140, 52, 96, -5, -153, -216, 95, 141, 53, -231, -195, -71, -158, 70, -164, 88, 71, -44, -7, -175, 109, -283, -94, -4, 29, 8, 24, 43, 42, -230, -58, 107, 123, 215, 167, 132, -29, 32, 170, 84, 3, 28, 261, 44, 11, -32, -232, -104, -124, -15, -106, 146, -117, -214, -11, -81, 102, 11, 161, -228, 117, -154, -66, 260, -89, 118, -54, 248, -88, -138, 291, 235, 5, 131, -419, -55, -266, -74, -273]
7349b73K04N6o6j47K79m5J44N8l21O2L4O2l0p1K59r6q6R4R2m93K73j45K26j11
7373d1k02L08p1J73l55K28J31j39n2J13O0q6L5j17K8j25K99l93J72j11L81k06
7395C0o8K53l18L18k27L23k99J13J06j07j5r0K6nJ10P6l01Oj96L82Rj70J52j55
7419d7j39K55l4k5j51Q2K31k18Q3J16j72Oj60K58J8p4jj08M1J55q1Q4J65m54L14
7444A44j61r0K24l6O5p4p2P1k7pm8l5j06n3K68P6o8L13m58J0L23k92M5m2Q6k87
7470b31j0K10j08J75o2Oj7k51K46p1K00j88K65j65q5K21j10R6k59J46J37j41j06
7493a02o4Q3K33k79k6J32n9k3k02K98J34n9J45l53J76q4lLJ77J30l35pl1M19k98
7518EPj34R3K10k17K12k05J72Q3o44O2M3L08n31L87P65p19L28k88J6M95m90L84
$$ y = [-273, -69, -13, -79, -226, 53, 8, 152, 210, -111, -49, -15, 47, 17, -54, 205, 109, 23, 117, 209, -284, -11, -156, 70, -41, -243, 65, -6, 167, -188, 40, 171, 32, -20, 93, 153, 67, 102, -15, 13, -112, 187, -206, -34, -145, 236, 30, -38, 215, -103, 215, -12, 311, 12, 125, 231, 124, 109, 19, 45, 40, 150, 226, -75, -69, -265, 117, 126, -44, 108, -47, -186, 69, 35, 10, -141, -59, 172, -46, 37, 153, -19, -13, -173, 85, 103, 29, 28, -80, -39, 116, 35, 119, 284, -170, 144, -17, -107, 117, 81, 146, 72, 0, 71, 44, 37, -11, -46, -152, -205, 63, 139, 71, 384, -74, -64, 259, -33, 12, -30, 56, -231, -241, -31, -139, 36, -26, -20, -37, -288, -42, -113, 87, -101, 164, -1, -86, 135, 25, 121, -138, 8, 145, 4, -102, -166, -83, 150, -129, -155, -23, -82, -105, -307, -9, 125, 66, 211, -142, 34, -50, -53, -50, 127, 257, -78, -85, -116, 303, 5, 12, -122, -29, 181, -36, 176, -29, 143, 226, -418, -356, -313, -5, -536, -149, 616, -103, 225, -63, -47, 448, -42, 342]
7541C42l06K08l14n22P68r8k12j46M79p5m15L6L06J13k52J90j96K33j62k43K32
7562c4K59J75n95J82j39L10j78K74L23m62N4j00R0P7M9k09j47J31J47l05k1K83
7584A64j68p4J76r0L4r4J5Q4J75k98K13k90K70j90O7j77j3L61k52K8J61k37J76
7607D1K7k33K29L9n2k00L03j05j37J73j30J53rj28K04n8o2L1j9q3J83j92J40j24
7631iK0R3k25K12p4q3l8J02q2M7JJ48k83L83j83j13J91J09q4L2K0j02j74k6r0
7656b08K04n1J18j12O5m5rJ38j14J18J01k13L5j34P7pM9J2q0l6O5J8J52q5J08
7681A66r5k21K13j35Q9j66K66l75M25j23kJ7j70K37k78K75j68K9Q4K9j40lK23
7704A77j83l49M84k6l8Q4k3k94K91j80K3J36O1P2m67J64Q3r5K17l19J77k15J80
$$ y = [342, 36, 244, -70, -592, 176, 78, -134, -280, 199, 124, -291, -255, 51, 164, -88, 102, -94, 139, -23, -266, -34, 225, 400, -195, -13, -152, 158, -20, 254, 577, 115, 169, 69, 159, 236, 285, 76, -71, 60, 207, -98, -119, 164, -4, -78, 98, 8, 42, -52, -37, 47, 222, -76, 137, -153, 117, -73, -6, -183, -196, 165, -87, -59, 102, -135, 41, 68, -165, 64, 103, 51, -149, 154, 49, -88, 85, -45, 108, 99, -29, 175, 117, 55, 86, 67, -16, 167, -25, 115, -9, 11, 104, -121, 91, 17, -66, -104, -2, -84, -37, -36, 112, -171, 212, 29, -84, 107, 216, 132, 164, 184, 82, -92, -118, -208, -4, -55, 63, -49, 16, -29, -38, 100, -14, 104, 205, -8, 27, -107, -30, -37, 12, 24, -56, -92, -27, -9, 143, 58, 166, 71, -150, 63, -72, 17, -149, 117, -258, 167, 44, 42, 59, -111, 126, -152, 123, -45, -16, 68, 97, -43, -46, 177, -6, -355, 129, 103, 65, 149, 126, -168, 123, -57, -34, 102, 163, 235, -232, -68, 15, -80, 137, -182, -5, -220, -40]
7727d0k0K44j66m5J8l26M43q3k4L1k34K67j94K12q4O7j17j05O4L5J21J03j17r2
7751d2J34j93L42k17q4k4r9L65j56O3k67jJ48j44P6R0Q9J65j90k35K51J35m35
7774b29k0K27j3k80N14q5r7k31J59J24Mk3J2J3ML9l2j21J74l72L28n1o0N8j92
7799a50L67m47O6k6J79p3J09J88k05J46k21K0J54j7p8K8o0J45rl45M54k20l8K42
7823B09l07K9o5J29O8Q7k47L7O4j15p3K04J9j46L61l30K0J7lJ46p7r3n0J31o8
7848e3K28j44r2j15J48J49l9l8n9N4P1L6j3j14J64k81J90j94J40n3j7L9J2L5P
7873F1K63k94L2k30L74j52j21K3J09j14J12k10J64Ml2k9K35n35R7K78K02j99l6
7896BQ5l05M25k27M9l54L14k75L03K95m44oo0J64j02J14Mk2K1M3k17K02L3j84
$$ y = [-40, -60, 184, 18, -27, -9, -335, 108, 25, 1, 32, -202, 65, -129, 83, -1, 66, -51, -156, -92, -57, 64, 167, 50, -42, 92, -101, 241, 24, -60, -84, -183, 182, 26, 89, -178, -179, -31, -175, -99, -9, 80, 245, 55, -180, 71, 206, -229, -249, -22, -35, -315, 199, 114, 17, -214, -55, 69, 73, 50, 62, 75, 79, 118, 86, -35, 139, -233, 95, 44, -16, 42, -150, 217, -230, -164, -190, -11, -84, 25, 213, 8, 154, -67, -47, 107, 90, 12, 40, -20, 125, 116, -229, 225, 5, -33, 209, -98, -69, -134, -5, 63, 150, -97, -60, 4, -111, -184, 20, 39, -107, 254, -76, -56, -39, -42, 104, 27, -66, -116, 15, -53, 175, 31, -61, -176, -28, 121, 82, 44, -15, 39, 110, 146, 133, 19, 183, -98, 92, -102, 38, -15, -32, 7, 19, 54, 61, 324, 30, 62, -168, 206, 54, -67, -44, 65, -49, 63, -147, 17, 21, -11, -40, 195, -340, -243, 35, 237, 38, 2, 87, -218, 207, -20, 29, -325, -11, -286, 17, 312, -132, -138, -198, -34, -136, -22, -18, -40, -19, 24, -193, 9, 42, -142]
7920a42J99M4j79J43l5J87l07K21k6p2J35k02J55j77l3J01j06J75O6k71J60o0
7942b4J09p3O2k39J30J06q0J76m5k30L09k61o6J96j82j17K60k83J55M6K00k76
7964a27K3R8O6j65J62P3L2J8l11K21o6j94J50q8J28Pn7q8J89M9r1O7n7q8J69k31
7990a11K02J8j50j02J23mR0n1M3k53K64K61m07R3j29K9K06n2J09j13n5K62k96
8013b3J31k33K86Q3j8p38R93l97n6N6J41m16L25l98L73J33j09j86j55Pm9L1L20
8036A01O2j81L0q8k95N99L35n91n9m3J74J0K80J0L51j053K48k83L34l00O80n20
8058a99j5K86j79j65N58k55p0j44P83o86K25p10N76J37q31pO27J1L20m90M28j09
8080I1l17K3J58oQ4K75j73M6J20P3j054Q73L7j3k86O65j206P60L6k22N39l95N04
$$ y = [-142, 57, 101, -78, 65, 30, 217, -90, 131, 105, 33, 168, -34, 121, -56, -89, 12, -94, 81, 147, -124, 36, -24, 85, 12, 74, -165, -35, 71, -9, 167, 122, -108, 201, -60, -126, 70, -112, -229, 31, -252, -97, -51, 149, -127, -104, -6, 60, -105, 57, 130, 162, 180, -131, 90, 24, -170, -20, -108, 20, 27, -30, -118, 71, 120, 29, 96, 39, -49, 120, -111, 91, 109, -41, -143, -20, -24, 66, 15, 58, -195, 69, 330, -77, 16, -113, -84, 122, 70, 179, 66, 11, 273, -23, 108, -125, 161, 244, 226, -512, 481, 84, 28, 84, 225, -191, 134, -264, 109, 242, 133, -53, -208, -201, -250, -219, 101, 163, -18, 12, -76, -371, 228, 563, -28, -87, -130, 44, 54, 334, 344, 695, -358, -110, -393, -59, -359, 321, -199, -214, 72, -107, -272, 286, 31, -39, -183, 600, -86, 139, -571, 5, 142, -689, -696, -69, -58, 262, -228, 200, 91, -226, -203, -45, -51, 33, 308, 135, 181, 301, 374, -680, 193, 230, 217, -69, 596, -610, 150, 186, -36, 503, 108, 612]
8103F12j55m58N8M0m57L28j97M59j50K42n3n36O70q03Q66rJ23j317Q50p33R09
8124B89P2M73k97m86p9K87l99j23R18j088Q65J0j095Q02J88m81O73q52n8n92M02
8145e71Q73L87J36n70n29rL93k88J91l26l0K6J49K18m77j73K94J104q2l56p22
8166c62O29l77n65O56n14O95r47J121n81P01o43Q13j43l00P8p77Q33n18L78m90
8186c13N45K10j24l6R6
$$ y = [612, 457, -1, 57, 97, -360, -32, -229, 230, 80, 322, 269, -267, 403, -400, 466, 457, 580, -737, 113, -620, 289, 361, 834, 537, 51, -28, 259, -140, -263, 655, -433, 432, 442, -653, 149, 337, -144, 529, -323, -381, -973, -571, 302, 689, 825, 255, -274, -283, 110, -178, 13, -313, -343, -317, -168, 50, -427, -600, -306, 798, 716, 360, -362, 267, -110, -675, -19, -533, 162, -785, 336, -245, 456, -187, 626, 483, 183, 261, -516, 317, -201, 177, -313, 232, 442, 318, 282, 378]
8191C78
$$ Imaginary data points
##PAGE= N=2
##DATA TABLE= (X++(I..I)), XYDATA
0@%%%%%%%%%%%%qJ6j6J6j6K4l2L3m1N6o4P2q8J04j21J38j61J90k15K45k83L20
34A69l60M06m57N14n76O43p18Q00q89R87j093J209j334J470j622J789j970K170
52A138k393K638k910L217l565L962m417M949n582O343p287Q493j0091J2333j5732
67h904K1585l4483J18608q9691k54699j8169J31526K43840J50939j6953k10812
78C2787k14236r1901J27265J89882J78616J3869j43529k20764j36022P2591J94062
89B620J85512M9737j09076k14812j55685K5428J68314K12199P1471q0346k04179
100d8817j68000j6750J51131K13435J04252o1996j90820j63986n3602J24067K00742
111H9656J25402j8612j70996j76050p9232R1911J86010J54900K373j44530j78236
$$ y = [0, 0, 0, 0, 0, 0, 0, 0, 0, 0, 0, 0, 0, -8, 8, -8, 8, -8, 16, -16, 17, -24, 32, -32, 40, -48, 56, -65, 73, -88, 102, -113, 132, -151, 169, -191, 215, -242, 272, -304, 339, -379, 421, -468, 519, -574, 635, -699, 771, -851, 938, -1032, 1138, -1255, 1383, -1527, 1690, -1875, 2087, -2330, 2619, -2963, 3380, -3907, 4586, -5505, 6828, -8904, 12681, -21802, 96806, 7115, -247584, -265753, -134227, 109613, 260552, 243599, 32787, -181449, -273350, -146085, 43797, 222413, 236282, 92753, -128011, -264033, -191442, 2620, 188132, 237869, 128793, -86019, -241704, -216276, -47962, 164237, 235708, 155362, -48817, -216817, -233567, -82436, 130999, 235251, 173255, -17565, -181551, -235153, -111086, 89656, 215058, 196446, 25450, -150600, -229832, -137921, 48089, 202989, 205362, 60832, -117404]
122a17404j00584P1919J56197J58432L5167j09290j66758j17490K2273J33710
132c3828J72466O3410o9509j69359j40135o490J20910J77955Q1931m8749j58641
143a0039j43726l2793J03496J63448R9530j6971j44390j43363o1721P6417J55561
154D5449J17629Q499j21511j49007q4242N3623J36471J37309K9864r7961j44645
165f8522j07507K9621J24590J42805M9559p3571j41086j12185M031J02363J43799
176I3897O2073l9264j27056j23533k3775Q0430J40440Q8851j4289j24458j28190
187a14874m8415O8612J39125R8670J773j11462j23021o4435M7735J22981J07381
198A24070K2866q3255j21689q9179K7461J04966J20778M7400o5669j21508j02346
$$ y = [-117404, -217988, -146069, 10128, 168560, 203727, 94437, -72321, -189811, -167538, -33828, 138638, 202048, 132539, -36820, -176955, -183445, -62535, 115420, 197351, 148602, -10039, -153765, -186558, -83062, 80386, 179916, 162945, 18555, -124808, -186529, -110112, 45449, 163078, 171577, 50066, -98941, -183183, -129560, 6911, 144220, 174084, 76123, -68522, -176029, -146408, -21818, 120987, 170546, 96975, -44111, -156296, -152265, -49902, 93897, 155970, 116706, -10350, -133883, -157658, -77228, 63212, 152063, 137774, 13316, -114874, -163289, -94677, 44448, 143118, 144891, 33429, -89592, -154027, -106292, 16689, 124070, 146936, 63681, -58008, -147187, -119726, -14760, 106018, 153418, 87749, -33759, -136105]
209a36105M917R3302J25553O0601m1995j17963j07522j4214P2878J27609P1320
220A38381k2878j04596j09670l5356N7444J17237Q0652L948r3021j08312n7704
231a33875L7048J11887R4154K2326q0133j11057p4058K7330R9763J01784L5240
242A30409o4218j03596q4163R637P9178J04591N4574m0475r8611r6008j5196O6349
254e7529J14543O5172k0573r5136j03601k7209N4087J10326P1255n047q3227r8136
266g5075m4319L8307R9762P6448J8290p1226r6249n7365K0704Q8227Q6474L1397
278A15375n5578r0748p4346O419P6135R4201M6505m3910q6601q5175o568O5836
290c8455R5969N3888k5518q0532q7815k1627M6186R3284O5342k055p2163r5464
$$ y = [-136105, -131188, -37886, 87667, 148268, 106273, -11690, -119212, -133426, -60548, 67061, 138381, 115503, 10907, -98763, -134119, -76675, 40562, 121214, 125162, 32141, -76171, -133875, -96827, 15060, 109214, 131540, 51407, -59650, -133708, -106378, -6615, 95169, 130409, 66191, -37405, -121568, -111931, -32753, 71838, 126412, 85937, -12674, -108682, -123878, -57529, 57014, 122186, 101613, 6477, -97124, -124333, -70246, 40080, 111335, 106288, 23061, -75075, -119394, -81087, 18675, 95123, 113413, 42187, -54062, -111427, -90723, -2496, 83978, 115375, 59797, -30951, -105297, -98878, -22743, 71458, 117963, 74053, -12548, -97723, -104291, -38455, 57514, 111402, 85884, 5352, -82463, -104090, -57904, 35380, 100722, 98667, 26504, -68960]
302f8960l7006L2892R1274P4781J1070o8439q8783m8048J9109Q5093P3328K3564
314I9875n1613q0971o1851N542O9773P8025L9975l5794p6888p4602p487O0390
326c5626Q0492N2936k5059p2555p8453j8942M5952Q3909N8983r930o5776q1452
338f5521k9229L1866Q0525O3289O039n5407p8807m2644J5849P5380O8921K3454
350I3715m6213q0125n4035N764P0539P0825L2356l7269p4008n9097j315N4477
362b4386O9845M2976k5503o1062o5027j8443M0353P0546N4522q814n7706p3756
374e6455k9230L0735P4573N9273J603n1913p6935l5753K0973O9143O1645J5580
386H3239m4439p4378m3797P730O2319O3650K8605l5209o7261n2861n100N2633
$$ y = [-68960, -105966, -73074, 18200, 92981, 104051, 35612, -53171, -101219, -82110, 2983, 76311, 99875, 48262, -32709, -94560, -89018, -19245, 58780, 98755, 62961, -13927, -88529, -96016, -35626, 44866, 97802, 72743, 188, -78265, -97207, -51255, 32654, 91637, 81707, 15931, -65521, -94750, -62884, 17641, 80930, 86969, 31562, -47245, -89889, -74040, 1340, 70261, 93715, 47502, -32623, -86658, -80894, -10355, 60470, 92826, 55557, -18451, -77548, -78863, -24386, 45459, 88435, 62932, 1870, -63157, -81600, -41247, 29299, 83821, 75007, 17301, -56455, -85685, -54950, 19623, 78896, 80499, 28586, -48349, -84102, -63129, 6014, 67659, 83239, 38800, -35578, -79375, -71645, -9326, 54324, 82929, 47720, -19541, -72402, -77502, -24869]
398b4869O6201L9826k4268o1213o2280j3871M4490O5381M7775j5157n4169o4101
410e6255k1827L2420O2074N1153J086m4767o8266l0726J7364O0835O0702J1895
422G5688m0606o9092l9951R301O0721N9916J9997l2593o3625m5853k018N2280
434a5835N8132L2554k0619n8877n4092j2458M2036N9250M4230j3661n2407n8901
446e0648k1161L2120N8859M9934m586m5274o1057k8204K1706N7269N1010M952
458F4920l5228o1273l3513R445N0318N2935J9254k6998n9641m1883l401M7627
470a7438N7169K9172k1373n8919m7140r395M3234N4859L4644j4530m9509n0140
482d9366j7669L1668N1540M4084l892m1156n4776k7754K2526N1193M9485M804
$$ y = [-24869, 41332, 81158, 56890, -4323, -66603, -80474, -35984, 29397, 77172, 62015, 7846, -56255, -78082, -45662, 16412, 67565, 68651, 23884, -44382, -75108, -57744, 3091, 63793, 75688, 35082, -34010, -73961, -64660, -3939, 55977, 75974, 43381, -20244, -66097, -68115, -15835, 42297, 74851, 54232, -4645, -58737, -71195, -29159, 30091, 74321, 60660, 8253, -50648, -71809, -39689, 19170, 69104, 64518, 19244, -41813, -70017, -48311, 8958, 59968, 64920, 29692, -31581, -65094, -55649, -5331, 47604, 66858, 39860, -19781, -61664, -65065, -17438, 39731, 68903, 47530, -11389, -58529, -67924, -24690, 30169, 64813, 50283, 774, -49366, -67035, -35367, 16173, 60257, 56365, 15209, -39567, -67321, -44795, 6398, 55883, 60687]
494F0687l5001n7620l1153J2751M8106N0897J2525k6585n5665l5807K399M3317
506a1149N0517K2332j9327n2201l9843q725L8322M9680L1322j0701m8250m5988
518d4011j7075L1487N0210L9368o247m2822m8568k2565K5104M5708M2148J645
530E4382l3027m9343k8827J3071M0831M7869J2350k5160n2660l4641L720M0067
542a1368N0143J7704k0173m9541l6280m020L5133M6616K4054j0975m4248l9043
554d1998j3951K8837M4625L2437l071l9731m2973k1006K2273M2501M0047K740
566E0730l3843m5071k7522J5225M0942M3590P993k6496m6010l0501P129L5980
578g854M4389J5079j7740m4421l4106l398L1152M6015K2789j0799m3288l7563
$$ y = [60687, 25686, -31934, -63087, -50336, -2230, 48667, 61192, 34607, -21058, -56865, -54466, -11149, 39368, 61700, 42373, -9828, -49671, -58396, -20074, 29606, 60928, 50227, 1977, -44011, -61086, -29599, 20611, 59979, 53732, 10910, -37658, -60223, -35119, 10589, 52737, 54382, 21355, -27988, -56815, -43744, -2913, 44956, 57306, 32146, -20514, -55155, -51435, -11368, 38775, 56479, 36306, -13235, -49515, -53535, -18402, 28214, 52268, 41293, -2955, -41998, -55949, -27112, 17513, 49950, 46879, 7148, -35825, -56831, -34558, 7943, 47990, 50730, 16887, -28184, -55706, -40481, 461, 44051, 52044, 25548, -20462, -50963, -43834, -7854, 36535, 51614, 33874, -10547, -44653, -48051, -16899, 29116, 51905, 41106, -2182, -39745]
590c9745j0513K8739M3488K6831n661l8604l6045j6538K0656L8040L2864K150
602D5662l0251l8706k5914J3556L6080M0017Q994k5708m2434l0985Q373L5154
614f162M2485J2392j9771m2604l2280K402K9968M1950J7315j2805l8989l2387
626c8486o795K4041L9496K3546l610l4791l4430j6610J9097L8316L0106K744l1690
639A0934l6883k1903J5893L5553L3271O089k5973l5694k5540R627L0164L5973
651C1511J2586j8497l6750k9741J625K7123M0572J6437j3274l6651l2104l806
663d0969K4731L8989J9281o522l3998l1971j0304J9079L5796K3905J053k9570
675I500l2611j7977J3683L2703K9366O406k5647l2697k3484Q502L0404L3146R520
$$ y = [-39745, -50258, -21519, 21969, 48800, 43139, 4535, -31510, -48048, -27392, 10648, 43512, 45662, 15411, -23295, -49209, -35653, 427, 40444, 49438, 23730, -18704, -49689, -41316, -6162, 36323, 48715, 28944, -13660, -45940, -43538, -13570, 28380, 45695, 32890, -6099, -38486, -45281, -21240, 18256, 41802, 38192, 3401, -31029, -47639, -28542, 9774, 39880, 42624, 10934, -25949, -47852, -31959, 3594, 36865, 42954, 16981, -18713, -44253, -34626, -4462, 31511, 44097, 25600, -11150, -40891, -39266, -12143, 28429, 44866, 31592, -5059, -37163, -40969, -16238, 22751, 42032, 35510, 1512, -30459, -40763, -21684, 14112, 38017, 39070, 9500, -23111, -41088, -27405, 5298, 34664, 41070, 15423, -17274, -40758, -32256, -1852, 31294, 40814]
688D0814k0006l3056k7322N334K6346L3720J3124j3555l2238k8037j389K0270
700a5995L4891J8507o784l1150l0682q795J8100L5758K2050j757k9756l0603j2935
713c9151J4338L2138K3709M081k4019k9011j9337Q532K7759K8085J0430j9630
725A7924k9538k4504M300K5136L1365J3212j4828k9461k6914R36K1278L1824J5499
738C6229r559k7492k7162m784J6491L1272J8388k528k5337k7996j1161J1669L0469
751H499K2427L803k3346k9342j6925Q680K9194K5348O968k1051k7566j9895N628
764b7578K4435K5617J0778j4943k5064k3370L82J8805K8268J5179r477k4600k6721
777b8289l882J6577K9129J7019m744k3492k6751p692J2416K8249J8441J718k1347
$$ y = [40814, 20808, -12248, -39570, -34236, -7890, 25830, 38954, 25399, -6839, -34876, -36265, -15995, 18896, 37403, 30619, -531, -31213, -40008, -21908, 13850, 35900, 34143, 4387, -26216, -39151, -24813, 7325, 31034, 35115, 11096, -17915, -37252, -28720, -961, 27124, 37554, 17924, -11614, -36118, -31818, -6682, 24683, 37895, 23067, -6394, -33308, -32372, -11094, 20730, 36229, 26670, -822, -27984, -32768, -16277, 14995, 33383, 30855, 5518, -22478, -33639, -21970, 8499, 30926, 34729, 11383, -17959, -34884, -26204, 2990, 28338, 35306, 14255, -13311, -33206, -27578, -3143, 22474, 33252, 18309, -6755, -30125, -29743, -10938, 17330, 32509, 23032, -1568, -28289, -32171, -15594, 13535, 30554, 25810, 2318, -24433, -32125, -19709, 8540, 26981, 28699, 7352]
790G352k6442j2361P660K6490K1895O207j8508k5387j8124M469K4728K3909J0772
803C2660j5626k5045k1230J813K1258K4516J2966j0842k3145k2420j201J4953
815a1343K4858J5861n911j9604k4509p191J1098K6160J8346k26j9830k6009j0417
828b8717Q839K5836J8589M040j7968k4425j3443N106K2340K0500Q246j4769k2671
841h497j7990J104J9847K2169J2562j1552k1700k1339j873J7252K3181J4086p231
854B0019k0090k2485m360J2396K3115J6141k805j7676k2287q483P854K2518J7651
867B1508L229j5450k3357j1936M115K2484J9382O534j4315k2111j4807K258J9799
880b667J9329R885j1068j9867j7335j543J5827J9936J3976p257j8265k0865m658
$$ y = [7352, -19090, -31451, -23791, 2699, 24594, 30801, 12293, -13094, -31218, -26749, -2021, 21888, 32660, 17034, -8011, -29241, -27428, -6170, 18346, 31312, 20470, -2675, -25095, -26296, -11343, 13515, 29376, 23465, 3861, -20648, -27839, -16741, 9419, 27765, 27539, 7709, -18300, -28717, -19878, 5958, 24547, 28587, 10619, -13806, -27249, -22143, 197, 20697, 28943, 14174, -8497, -26487, -25383, -5536, 16633, 29195, 17643, -4057, -25396, -27269, -10017, 13164, 27250, 20019, -71, -22556, -26916, -14520, 8595, 24736, 21931, 4255, -18032, -26515, -18661, 3857, 21508, 24737, 9287, -14070, -26006, -21891, 593, 19975, 26509, 12194, -9917, -24724, -22466, -2667, 16662, 26547, 15479, -4388, -21723, -23266, -7439, 12497, 26473, 19216, 951, -19914, -24572]
893b4572J2566K2263J6156m853j7152k2405o290R959K1342J5720m08j4738k1038
906a3450q870M673J9572J6776M664j1994k0368j2613R07J7793J8318R184j0574
919A4018j9517j6297j686J7641J8697J1849q996j8558j7697k715J4035J8537J3111
932B2422n497j5296j9083n473R335J8358J5689j095j3387k0360q526N914J9189
945B190J6628K495j2070k0459r907K791J7511J6320O373r457j8975j2651n86J5866
959c931J6437J0222p539j7131j5475l474J3803J7315J1925m935j5691j7556m672
972b0702J1093J6736J3865k625j3225j8308p077P083J6283J5468Q88j0590j8951
985a0062r544K828J6527J6223M700r056j9423j1434Q57J5517J5854P073p884j7237
$$ y = [-24572, -12006, 10257, 26413, 21560, 4408, -17997, -24287, -14328, 7014, 22734, 22326, 7588, -13450, -22320, -17647, 1925, 18701, 23365, 11371, -8997, -21610, -20703, -2910, 15408, 24592, 14018, -5499, -21796, -23482, -5841, 12856, 24705, 15709, -2849, -20546, -23261, -9226, 9311, 22422, 16925, 1629, -17454, -22927, -13592, 4766, 20455, 19360, 5973, -14387, -22913, -16999, 2190, 18818, 21313, 9243, -11216, -21123, -18332, -821, 15499, 21872, 12415, -6560, -19211, -19797, -3931, 12506, 22728, 15189, -1942, -17417, -20891, -7088, 10227, 22152, 17217, 1526, -16030, -20702, -9609, 7127, 20992, 18367, 5142, -13166, -20243, -13160, 3123, 18591, 19479, 8889, -10062, -19606, -16778, -251, 15972, 20672, 11616, -7807, -19241, -18384, -2867, 12987, 20060, 12176, -5061]
999e061j1798j997J3136J4357J0095n074j4251j4546n356J0561J5290J3633k926
1012A6063j3493j6311o452P868J4973J4969o79j1603j7537o410M342J5209J3749
1025A4688K949q779j6910r289J403J4073J4601N584o011j6234j1344k390J2518
1038e141J5132R522m921j5819j3156l621J0788J4302J1393l970j2829j3353o166
1051a7839R220J2535J1635J60j0160j4284r496O016J3227J4615J512r021j6437
1064h317q934K764J3830J4235L434o478j6867r150k3J1520J3816P272n269j4596
1078b763j1100l963J1111J3704R223k766j2919j3241n586R132J3099J1614j179
1091A4366j1020j4112o654O403J2277J3117L93q648j3939q316L158J1640J4055
$$ y = [-5061, -16859, -18856, -5720, 8637, 18732, 13658, -593, -15139, -20495, -9934, 5356, 18989, 16063, 2570, -13741, -20193, -12325, 2648, 17617, 16938, 5335, -12202, -18612, -14270, 939, 14688, 17637, 8858, -8052, -17341, -15938, -1865, 12736, 18320, 12309, -3925, -15269, -17659, -5141, 9991, 19513, 14592, -1227, -14383, -18004, -7216, 7086, 18479, 14509, 1680, -11673, -17839, -8619, 3916, 15551, 15711, 5551, -8733, -18229, -12213, 1014, 15629, 17141, 8120, -8317, -17251, -14487, -657, 13578, 17012, 10534, -6333, -15483, -15506, -3986, 9830, 17102, 11833, -2763, -13863, -17826, -6715, 6989, 16212, 13446, 527, -12714, -18300, -9168, 3931, 15545, 14366, 3346, -10766, -17420, -11017, 1260, 14377, 14770, 6122, -7817, -16133, -12975, -1335, 12720]
1104A2720L069o284j5163r520N86J1503J4419N025m992j4682j0165j316J0109
1117d691J3167P448l074j2807j0882m802Q401J2477J0369r67j1277j2597o687
1130a5922O774J1723J2386J95r622j3520p675M989J0998J2618J352o965j3221
1143e890q310J646J0139J2581L692m341j2892r682j638R207J3084O681k807j2911
1157a441j0732l434Q833J2503Q215j741j1767j0645n497P055J1186J0089J64r258
1171C530j1644p394N072J0289J1783K140p448j2012q841K961R828J2162L642n491
1185H577j2478q260K97Q153J2640M008k528j1312q993k912P077J1598P309q79
1199A2297j0412j0346n486O606J1279R311N17j1045j0629n896N433J0340R661
$$ y = [12720, 15789, 9505, -5658, -15178, -14592, -3089, 11330, 16355, 11363, -3319, -13484, -14800, -4691, 8476, 15924, 12850, 43, -10839, -15641, -7240, 5237, 15606, 14639, 3362, -9235, -15922, -9148, 2575, 14961, 15156, 5534, -7986, -15661, -10672, 326, 12944, 14296, 7331, -5890, -14200, -12554, -2415, 10166, 13858, 9517, -3375, -13057, -14695, -5488, 7596, 14277, 11470, -1441, -12173, -15607, -6774, 5729, 13944, 12203, 436, -10209, -15706, -8651, 2535, 12624, 12788, 3530, -8114, -15508, -10436, -147, 11636, 13776, 6328, -5684, -14525, -11564, -1736, 10426, 14068, 8577, -3901, -12161, -11864, -3711, 8929, 12937, 10409, -903, -9896, -12808, -5731, 5867, 13176, 12297, 1885, -8461, -13947, -7341, 3938, 13249, 13766, 2721, -7908, -13804, -8371, 1969, 11630]
1212A1630J461q309j0665p753M281Q405J0665K823n853r943q590J12Q284J1384
1226G932M362l201j0874r552j252O905J1341N913j336j0457r479l498N982J1090
1240C876P102L81r571r159o418N275R830R236J500q544r915o835M313Q304R984
1255I359K136o062r527q011K368P350J0581L376l571r431q388k97O144J0821M791
1270A1639j927q555r725l002N701J0416P052r06r706q462m094M871Q721Q181Q69
1285A1073q677p755o238L539Q315Q319K471n621r020p224J845P396R376K751m390
1300F160r074q242J128O073J0062M080k883r146p931o39M959R910M322k17q323
1315B39q170k447L490R194O296J224p017r469n061L416R304P815J783o666q674
$$ y = [11630, 13091, 4782, -5883, -13636, -9355, -950, 9715, 12538, 6685, -3258, -11848, -11736, -3452, 7932, 12294, 9093, -1781, -11333, -12585, -5680, 5661, 11574, 10238, -219, -9698, -13196, -7214, 3876, 10978, 11359, 1788, -7371, -13789, -8514, 1316, 10552, 12052, 3508, -6407, -13242, -8929, -625, 9359, 11495, 5433, -4094, -12105, -9737, -2387, 8194, 11570, 7999, -1432, -9820, -10117, -3973, 6848, 11639, 9712, 1157, -8568, -11570, -5869, 4547, 11599, 10693, 987, -7475, -11569, -6698, 2023, 10204, 11073, 2396, -5359, -11597, -8058, 257, 8576, 11047, 5426, -3594, -10818, -8973, -1577, 7799, 10550, 6160, -2914, -11156, -10028, -3955, 6107, 10187, 7304, -1842, -9773, -10412, -5453, 4457, 8779, 8562, 239, -7931, -10378, -6888, 2306, 8602, 9826, 2809, -6660, -11721, -8305, 999, 8814, 10597, 3931, -4743]
1330d743o384K402P629Q464L254n691o703p599J071O198R549K452l053p868p620
1345h642p03N301R866L923j080q253p461j426L591Q351N833k81p461p105m128
1360i675K487Q785O734J161o319p550n274J860P527P636K605o054p290n732M89
1375h610P434P666K528l428p539p185N47M538Q016M427j560p679o950k150M323
1390e622Q740N158n87o895p881k377K784Q721O047N13o032p257m551J565Q133
1405D59N927K546m395p279n600J395N835O649M022m403n599p726j56N802P897
1420E374L831k955o175o887q54L564Q202M860j898n780p327j793J710Q814N367
1435H053l89n336p719k782J621P445O296J763n775o453n233J991O630N736K203
$$ y = [-4743, -11127, -8725, -1096, 7368, 10622, 4931, -1772, -9371, -8300, -2102, 7447, 9899, 6846, -1022, -8642, -9345, -4044, 5822, 9745, 8665, 412, -7049, -8475, -4884, 3467, 9300, 9019, 1558, -5547, -9675, -7188, 1597, 8331, 9492, 3173, -4377, -9651, -7791, -264, 7372, 9977, 3923, -3367, -9099, -8610, -1176, 6490, 9018, 5590, -1949, -9134, -8587, -4049, 3967, 8394, 6834, -845, -7795, -9945, -5622, 3118, 8276, 7689, 794, -7087, -9464, -6680, 2041, 8088, 8601, 2569, -4688, -9239, -7674, 459, 6386, 8932, 4537, -2742, -8342, -6947, -1112, 5537, 9559, 5156, -443, -8169, -8325, -2523, 5374, 9205, 6250, 75, -6812, -7666, -4102, 4100, 8960, 7062, 1282, -6045, -7838, -6128, 2686, 8053, 7664, 2328, -5391, -8173, -6552, 893, 7189, 8952, 3177, -3276, -8509, -6518, 112, 5848, 8051]
1450H051m309n994n502K94N266O066M646l878n538o310r19L308Q510L564j074
1465F181n803p298j236L219P195M755n4n835o508k573K346O698N041J379m526
1480B981p278k575N15O538N836K919m813o856m422J93O182O352K360l355n078
1495e01o478j18M897O146M605k931m877o320j847M255O208M287K24n623o764k092
1511f929J190P609M970m95l695o544k718N09O552N196J610m152o357l837Q4N777
1527a230O212K097k783n990n533K28M730N920L971k385n255p259k78M153N940
1542B538L727j121m399n828j988J913O851L416J107l399p230l263K515N866M929
1557E634J630l768o729l291R65N192M537L180l858n713k935j105N186M681L332
$$ y = [8051, 3742, -2252, -7754, -7460, -2194, 3872, 8518, 4640, -898, -7208, -8127, -4819, 3691, 7255, 6181, 378, -6920, -8156, -4937, 2258, 7013, 6959, 1124, -5384, -7957, -5611, 1087, 6128, 7507, 2981, -4297, -6872, -6357, 181, 6017, 8936, 4123, -2733, -7155, -6962, -780, 5572, 7932, 4577, -501, -6979, -7097, -2200, 3946, 8551, 5620, 743, -5577, -7424, -3169, 3039, 7326, 7550, 1927, -4837, -6929, -5739, 1870, 6840, 6345, 2650, -3894, -6612, -6103, 449, 5645, 7255, 3103, -3254, -7091, -7007, -1230, 4982, 7079, 4296, -1694, -7227, -6999, -2269, 3651, 7622, 5237, -18, -7277, -7555, -3402, 2538, 6265, 5144, 745, -5083, -7071, -5158, 1693, 5109, 6216, 2817, -4413, -7676, -5161, 705, 5634, 7264, 3496, -3233, -6524, -5559, -367, 4170, 7350, 3492, -2221, -5156, -6261, -1075, 3606, 6938]
1572F938k532m373m630k504M288N428M274o53m842n776j876K856N251M740j564
1587E025k393o593k135K346M534M623R78l274o006l057L60M858N396J687k066
1602D283o623l733q59N197N064L146j935n940m310r32M404M683L347j453m949
1617f10m792j183L218N175L659j118l573n122k656K215N687M573j02l210n438
1632c277l081J555M823M677J528k789n732k951m60M869M553K378j682n402l846
1647d837r41M094N127L282j595n170l845j861L306N243K911r66m016m598j866
1662e732K591M249M180m90l120m440k748J124M506M837Q09k642n875k220n22M337
1678a156M985J551k291n503k309q98M218L875K626j401m795l580p32K351N013
$$ y = [6938, 4406, 33, -4597, -7101, -2813, 2615, 6889, 6236, 1394, -4382, -6258, -3402, 1849, 6589, 5025, 2632, -3961, -6096, -3750, 784, 5407, 6385, 3111, -2895, -5952, -5592, -734, 4662, 6349, 4283, -2340, -6073, -6932, -1735, 3329, 6475, 4540, -1400, -5710, -6642, -2238, 2445, 5792, 4339, -610, -5402, -6585, -3367, 1808, 5467, 4349, 776, -4346, -7002, -4787, 900, 5473, 5371, 2161, -3277, -6358, -4803, 20, 4697, 6225, 3436, -2296, -5247, -5707, -838, 3715, 6093, 4411, -991, -4837, -5778, -1684, 3443, 6725, 5130, -40, -3885, -5746, -2440, 2803, 5714, 4748, 732, -3866, -5732, -3141, 1108, 5288, 4798, 1678, -2762, -5510, -4386, 120, 4957, 5766, 3124, -2751, -4971, -5493, -1156, 3829, 5380, 3089, -2414, -4723, -5621, -1403, 2472, 5098, 3697, -1098, -4678, -5410, -3059, 1954]
1693A954K869j240l204l832k003L053L299L189L4l242l237l363K386M182M047
1708D892k91j989n327j714O50L605L853R50j407m916k400m85L747M345K186j600
1724D099n081l284o63L352L908K374p88m308k727k265K636M764K241P73l874m152
1740b995j473J454L897L736J01l118m085k490J094L618N300n58k597m185j768
1755d069k80L347M861L43j232m705k164m83K441M004K063r34k937m644j015L182
1771b222L328K361M00l055m271j985K787L793K331Q42l282l500k091J445L819
1786G00K735J405j829m896k676K3L890M201J176k247l068k746j095M413L583L86
1802C955l98l933l336m02K203L365K694k65l197l145j835J674L561K906l55k157
$$ y = [1954, 4823, 3583, 379, -3453, -5456, -2403, 896, 4085, 4119, 877, -2360, -5723, -3337, 845, 4892, 4601, 2612, -2715, -4429, -3779, -174, 3679, 4629, 3222, -1694, -4094, -4579, -832, 3513, 5699, 4099, -982, -4266, -4929, -1577, 2331, 4705, 3917, -391, -3118, -5383, -2747, 2017, 4258, 5031, 1157, -2995, -4468, -3014, 883, 4619, 4720, 1602, -2483, -4973, -3879, -261, 5039, 4481, 1884, -2301, -4069, -4349, -1002, 3859, 4202, 2970, -1735, -3899, -4382, -1941, 2063, 4126, 3192, 255, -4389, -5404, -2222, 1106, 3467, 3867, 812, -3459, -5444, -2657, 1136, 3467, 4309, 1027, -2473, -4564, -3119, 700, 3435, 4840, 3011, -1885, -4561, -4538, -648, 3553, 4729, 2482, -586, -3332, -4427, -14, 3569, 3955, 3557, -376, -3712, -4114, -1911, 1454, 4148, 3883, 686, -2459, -4294, -2620, 941, 3847, 3492, 1335]
1818A335k887k663J731K738L222N18k181l407k696J227K857L131R44j721l630
1833a482k389J08K335L920J368p67m046k703q29K402M071K044o50l717l109j140
1849d584K231L423K578j20k687k949j458J163K541L211N06k229l534j913Q72K650
1865b99L155J133j700l055l080L86K506L876J116j093l402k976L15K066L443J173
1881C564m46l019k698q15J490L408K080L69l286k739j798J785L028K397N28k798
1897A050k655k300J220K832K605O61j998k763k537O01K410L148J304j512k743
1912f77k670nJ979L321J248q21k981k320p46J678L433J583R8l084k712q29J223
1929b282K925K239M50k395k621k075J114L036K460O53k071k715k231J043K351
$$ y = [1335, -1552, -4215, -2484, 254, 3476, 3994, 1813, -1594, -4290, -3063, -206, 2925, 3869, 2148, -1482, -3871, -3763, -1428, 2492, 3860, 3093, -953, -3656, -4485, -2083, 1988, 4032, 3382, -335, -3444, -4584, -2353, 1070, 3648, 3528, 841, -2108, -3566, -2403, 138, 3349, 3855, 1626, -1908, -3821, -2949, -299, 2856, 3989, 2289, -766, -3846, -3460, -954, 2922, 4038, 2945, -457, -3433, -3118, -1052, 2391, 3564, 3118, 99, -2599, -3414, -1924, 1484, 3564, 3933, 647, -2092, -3890, -2105, 923, 3320, 3848, 1050, -1605, -3905, -2685, 147, 2752, 3413, 1415, -1348, -3885, -3284, -874, 2274, 3578, 2066, -677, -3347, -3352, -1373, 1948, 3196, 2375, -606, -2926, -3672, -1994, 1439, 3022, 3120, 36, -2676, -3505, -2282, 643, 2882, 3332, 937, -1684, -3759, -2645, 391, 2851, 3504, 1433, -1282, -3513, -2470, -119]
$$ [...]
8191a8
##END NTUPLES=NMR FID
##END=
