##TITLE=1H_Ser DHA-N-3
 CDCl3,8 sc, 
 23.9.2021
##JCAMPDX= 6.0         $$ Bruker NMR JCAMP-DX V2.0
##DATA TYPE= NMR FID
##DATA CLASS= NTUPLES
##ORIGIN= UXNMR, Bruker Analytische Messtechnik GmbH
##OWNER= root
$$ XWIN-NMR		Version 3.5
$$ Thu Sep 23 09:00:06 2021 Russian Standard Time (UT+4h)  she@DPX200
##.OBSERVE FREQUENCY= 200.1314
##.OBSERVE NUCLEUS= ^1H
##.DELAY= (6, 6)
##.ACQUISITION MODE= SIMULTANEOUS
##.ACQUISITION SCHEME= undefined
##.AVERAGES= 8
##.DIGITISER RES= 18
##SPECTROMETER/DATA SYSTEM= spect
##.PULSE SEQUENCE= zg30
##.SOLVENT NAME= CDCl3
##.SHIFT REFERENCE= (INTERNAL, CDCl3, 0, 15.7039)
##AUDIT TRAIL= $$ (NUMBER, WHEN, WHO, WHERE, WHAT)
$$ ##TITLE= Audit trail, XWIN-NMR		Version 3.5
$$ ##JCAMPDX= 5.01
$$ ##ORIGIN= Bruker BioSpin GmbH
$$ ##OWNER= she
$$ F:/spectra/data/she/nmr/H-F/1/audita.txt
$$ ##AUDIT TRAIL=  $$ (NUMBER, WHEN, WHO, WHERE, WHAT)
(   1,<2021-09-23 08:58:35.57 +0400>,<she>,<DPX200>,
      <created by zg, POWCHK disabled, PULCHK disabled
       configuration hash MD5:
       00 E9 B6 7A A2 85 ED C7 34 08 36 98 17 FE 4E 26
       data hash MD5: 16K
       87 34 CA C0 7C 8D EB 31 3F D6 B9 1B 4B 29 B2 68>)
$$ ##END=
$$ 
$$ hash MD5
$$ 80 5F 6B FC FF 80 4F 97 A0 2B DD 94 E7 1B 5A 4C
##$RELAX= 
##$RELAX= 
##$RELAX= 
##$RELAX= 
##$RELAX= 
##$RELAX= 
$$ Bruker specific parameters
$$ --------------------------
##$DU= <F:/spectra>
##$EXPNO= 1
##$NAME= <H-F>
##$PROCNO= 1
##$TYPE= <nmr>
##$USER= <she>
##$AMP= (0..31)
100 100 100 100 100 100 100 100 100 100 100 100 100 100 100 100 100 100 
100 100 100 100 100 100 100 100 100 100 100 100 100 100 
##$AQSEQ= 0
##$AQ_mod= 1
##$AUNM= <au_zg>
##$AUTOPOS= <>
##$BF1= 200.13
##$BF2= 200.13
##$BF3= 200.13
##$BF4= 200.13
##$BF5= 200.13
##$BF6= 200.13
##$BF7= 200.13
##$BF8= 200.13
##$BYTORDA= 1
##$CFDGTYP= 0
##$CFRGTYP= 5
##$CHEMSTR= <none>
##$CNST= (0..31)
1 1 145 1 1 1 1 1 1 1 1 1 1 1 1 1 1 1 1 1 1 1 1 1 1 1 1 1 1 1 1 1 
##$CPDPRG= <>
##$CPDPRG1= <>
##$CPDPRG2= <>
##$CPDPRG3= <>
##$CPDPRG4= <mlev>
##$CPDPRG5= <mlev>
##$CPDPRG6= <mlev>
##$CPDPRG7= <mlev>
##$CPDPRG8= <mlev>
##$CPDPRGB= <>
##$CPDPRGT= <>
##$D= (0..31)
0 1.2 0 0 0 0 0 0 0 0.06 0 0.03 0 0 0 0 0.0002 0 0 0 0 0 0 0 0 0 0 0 0 
0 0 0 
##$DATE= 1632373115
##$DBL= (0..7)
120 120 120 120 120 120 120 120 
##$DBP= (0..7)
150 150 150 150 150 150 150 150 
##$DBP07= 0
##$DBPNAM0= <>
##$DBPNAM1= <>
##$DBPNAM2= <>
##$DBPNAM3= <>
##$DBPNAM4= <>
##$DBPNAM5= <>
##$DBPNAM6= <>
##$DBPNAM7= <>
##$DBPOAL= (0..7)
0.5 0.5 0.5 0.5 0.5 0.5 0.5 0.5 
##$DBPOFFS= (0..7)
0 0 0 0 0 0 0 0 
##$DE= 6
##$DECBNUC= <off>
##$DECIM= 32
##$DECNUC= <off>
##$DECSTAT= 4
##$DIGMOD= 1
##$DIGTYP= 9
##$DL= (0..7)
0 120 120 120 120 120 120 120 
##$DP= (0..7)
150 150 150 150 150 150 150 150 
##$DP07= 0
##$DPNAME0= <>
##$DPNAME1= <>
##$DPNAME2= <>
##$DPNAME3= <>
##$DPNAME4= <>
##$DPNAME5= <>
##$DPNAME6= <>
##$DPNAME7= <>
##$DPOAL= (0..7)
0.5 0.5 0.5 0.5 0.5 0.5 0.5 0.5 
##$DPOFFS= (0..7)
0 0 0 0 0 0 0 0 
##$DQDMODE= 0
##$DR= 18
##$DS= 0
##$DSLIST= <SSSSSSSSSSSSSSS>
$$ [...]
##$SUBNAM2= <"">
##$SUBNAM3= <"">
##$SUBNAM4= <"">
##$SUBNAM5= <"">
##$SUBNAM6= <"">
##$SUBNAM7= <"">
##$SUBNAM8= <"">
##$SUBNAM9= <"">
##$SW= 20.0188988654967
##$SWIBOX= (0..15)
0 0 2 0 0 0 0 0 0 0 0 0 0 0 0 0 
##$SW_h= 4006.41025641026
##$TD= 16384
##$TD0= 1
##$TE= 0
##$TE2= 300
##$TE3= 300
##$TEG= 300
##$TL= (0..7)
0 120 120 120 120 120 120 120 
##$TP= (0..7)
150 150 150 150 150 150 150 150 
##$TP07= 0
##$TPNAME0= <>
##$TPNAME1= <>
##$TPNAME2= <>
##$TPNAME3= <>
##$TPNAME4= <>
##$TPNAME5= <>
##$TPNAME6= <>
##$TPNAME7= <>
##$TPOAL= (0..7)
0.5 0.5 0.5 0.5 0.5 0.5 0.5 0.5 
##$TPOFFS= (0..7)
0 0 0 0 0 0 0 0 
##$TUNHIN= 0
##$TUNHOUT= 0
##$TUNXOUT= 0
##$USERA1= <user>
##$USERA2= <user>
##$USERA3= <user>
##$USERA4= <user>
##$USERA5= <user>
##$V9= 5
##$VALIST= <valist>
##$VCLIST= <CCCCCCCCCCCCCCC>
##$VD= 0
##$VDLIST= <DDDDDDDDDDDDDDD>
##$VPLIST= <PPPPPPPPPPPPPPP>
##$VTLIST= <TTTTTTTTTTTTTTT>
##$WBST= 1024
##$WBSW= 4
##$XGAIN= (0..3)
0 0 0 0 
##$XL= 0
##$YL= 0
##$YMAX_a= 68240
##$YMIN_a= -75030
##$ZGOPTNS= <>
##$ZL1= 120
##$ZL2= 120
##$ZL3= 120
##$ZL4= 120
##$ABSF1= 10
##$ABSF2= 0
##$ABSG= 5
##$ABSL= 3
##$ALPHA= 0
##$AQORDER= 0
##$ASSFAC= 0
##$ASSFACI= 0
##$ASSFACX= 0
##$ASSWID= 0
##$AUNMP= <proc_1d>
##$AZFE= 0.1
##$AZFW= 0.1
##$BCFW= 1
##$BC_mod= 2
##$BYTORDP= 1
##$COROFFS= 0
##$CY= 11.3945322036743
##$DATMOD= 1
##$DC= 2
##$DFILT= <>
##$DTYPP= 0
##$F1P= 2.36226072786647
##$F2P= -0.459571619588291
##$FCOR= 0.5
##$FTSIZE= 0
##$FT_mod= 4
##$GAMMA= 1
##$GB= 0.15
##$INTBC= 1
##$INTSCL= 1
##$ISEN= 128
##$LB= 0.24
##$LEV0= 0
##$LPBIN= 0
##$MAXI= 10000
##$MC2= 0
##$MEAN= 0
##$ME_mod= 0
##$MI= 1.114404
##$NCOEF= 0
##$NC_proc= 0
##$NLEV= 6
##$NOISF1= 3.799351
##$NOISF2= 2.8
##$NSP= 1
##$NTH_PI= 0
##$NZP= 0
##$OFFSET= 15.70392
##$PC= 1
##$PHC0= -14073.73
##$PHC1= 10.20089
##$PH_mod= 1
##$PKNL= yes
##$PPARMOD= 0
##$PSCAL= 0
##$PSIGN= 0
##$REVERSE= no
##$SF= 200.130013532006
##$SI= 16384
##$SIGF1= 3
##$SIGF2= 2
##$SINO= 400
##$SIOLD= 16384
##$SREGLST= <1H.CDCl3>
##$SSB= 0
##$STSI= 0
##$STSR= 0
##$SW_p= 3612.71676300578
##$SYMM= 0
##$S_DEV= 0
##$TDeff= 0
##$TDoff= 0
##$TI= <>
##$TILT= no
##$TM1= 0
##$TM2= 0
##$TOPLEV= 0
##$USERP1= <user>
##$USERP2= <user>
##$USERP3= <user>
##$USERP4= <user>
##$USERP5= <user>
##$WDW= 1
##$XDIM= 8192
##$YMAX_p= 0
##$YMIN_p= 0
$$ End of Bruker specific parameters
$$ ---------------------------------
##NTUPLES= NMR FID
##VAR_NAME=  TIME,          FID/REAL,        FID/IMAG
##SYMBOL=    X,             R,               I
##VAR_TYPE=  INDEPENDENT,   DEPENDENT,       DEPENDENT
##VAR_FORM=  AFFN,          ASDF,            ASDF
##VAR_DIM=   8192,          8192,            8192
##UNITS=     SECONDS,       ARBITRARY UNITS, ARBITRARY UNITS
##FACTOR=    0.0002496,     1,               1
##FIRST=     0,             0,               0
##LAST=      2.0444736,     0,               0
##MIN=       0,             -75030,          0
##MAX=       2.0444736,     68240,           0
$$ Real data points
##PAGE= N=1
##DATA TABLE= (X++(R..R)), XYDATA
$$ [...]
1732H20N04j66L74j204j142q4j056J45Q27M78J196R95o22J84p03j202o04k96l61
1751a917J197P65P35Q62J1q38J57j525q29K12j42N06J361J14Q23M44j083j92q66
1770b05j152J77j89M38J534O27K17M78o20j394l75j031k76Q46J83R65J363k86
1788A300K22l18j563l65n78p12R85O11M22J218L75q69J95j157j227J74n78L72
1806a493J082M41Q94Q08o80l67o46j349j66K26j24J179Q73J71Q03m64p36l48j035
1825i31n22M68j4O88J434K08K22j3j156m97m40r08M63O28K6J351O83m51J41p77
1845F03j240j67n35o7R09M83O30J080m66l70k44j325n23K8l44P67Q53M21N80J82
1865A255p27m35p56r61K53J33K27J495J46L72M96r47n80l03j094j22O36M4J041
$$ y = [820, 1324, 1158, 1532, 328, -814, -898, -1954, -1809, -982, -504, 692, 1687, 1065, 1249, 546, -656, -1260, -1556, -1917, -720, 45, 780, 1642, 1653, 815, 972, -553, -1382, -1170, -1312, -806, 555, 669, 1492, 1936, 853, 661, -205, -1357, -1180, -1369, -931, 603, 1230, 1447, 1925, 1305, -89, -464, -1495, -1771, -925, -742, 223, 1586, 1300, 1522, 1204, -359, -724, -1302, -2014, -1029, -418, 4, 1222, 1597, 728, 923, -234, -1461, -1287, -1865, -1493, -411, 30, 924, 1732, 1052, 685, 39, -1310, -1476, -1250, -1374, -195, 678, 849, 1652, 1188, 452, 104, -931, -1453, -985, -999, -311, 1123, 1331, 1553, 1540, 384, -113, -553, -1461, -998, -370, -344, 1007, 1690, 1239, 1380, 603, -637, -804, -1339, -1406, -497, -14, 616, 1696, 1230, 860, 616, -709, -1232, -1204, -1548, -781, 72, 493, 1073, 1255, 528, 93, -663, -1624, -1371, -1238, -1011, 484, 630, 1002, 1498, 551, -29, -332, -1426, -1548, -912, -868, 173]
1884A73R46M2K99l54j457j85n26n55R33N69M20J274k10l60Q6j207m44k87k99M00
1904g42R58K36P73O57q67l49o45j117J13k9P3J040M59K23N70n62o19j48j225k69
1924a470O34j52O56Q50L24L36k38j135n9p17p66O48M12N24R47K36j21j0o30r34
1944f65q5o11P2J058J29R89N75m60k27k16j294jl19j68J014O78L04O56o3o75m09
1965B82q03o19N00l31M56J233P6L90L08j068j72o09j034M09M26lR36O35j43L07
1985A176m60j020k19n91l23R00J40O40P40l00k9j46q42p32N8k65M35O63K93R50
2005A068q2m20j65o43q41K10l18L61Q78L39M94N56q52l82k05q90m2K50k8J042
2025C30M97J5M70l21p50k92n69l49L55J14M61J065j01J06j6j140l65n2n19K33
$$ y = [173, 1119, 1161, 1460, 1106, -351, -536, -1062, -1617, -684, -115, 305, 1579, 1369, 1009, 1095, -112, -556, -843, -1142, -742, 216, 452, 1225, 1882, 1015, 666, 21, -1096, -983, -1012, -939, 101, 560, 783, 1353, 791, 172, 24, -1201, -1470, -836, -988, -332, 518, 842, 1178, 940, -195, -254, -971, -1737, -1089, -677, -153, 794, 1030, 909, 899, 269, -665, -750, -1361, -1289, -231, -102, 887, 1462, 1002, 775, 559, -735, -736, -1055, -1223, -209, 469, 773, 1429, 1366, 691, 282, -521, -1140, -640, -971, -515, 718, 794, 1184, 1492, 424, 252, -357, -1391, -982, -556, -559, 377, 1012, 869, 1176, 716, -304, -523, -1114, -1437, -537, -397, 243, 983, 683, 654, 508, -334, -1066, -1008, -1273, -838, -175, 118, 1068, 986, 566, 401, -242, -1083, -873, -1191, -830, 48, 387, 881, 1437, 585, 203, -2, -892, -934, -684, -712, 330, 827, 842, 1312, 991, 241, -51, -620, -969, -614, -500, -39, 1026, 925, 1031, 1015, -125, -490, -542, -1061, -828]
2045h28P21J36P63J75l35K02n28j105q5l56J31Q72K37L05O87k47m91l4q67n75
2065a222L26k65P94Q81j5M09jp76k4o00o42M59j44L73J147J9r6L78p16l73k3q16
2087i27J7O04%P83N89k07P9l38q42n9n40r4N72M70L12Q68j76m58P7j092l92K89
2109d65n06L57Q19N7N77K27o51j38l46q39K03Q6j08Q33K40P7P20n93p39j45m68
2130h02l98L86K05N94P26p9M8J52r96k06k09o15O72K09N7R71J73l44J79n60o61
2151d98k7m23L80N02K80L08O32k76m67Jr95O0r6k0O48L97K19O02l94n00j79o37
2173d83n62M16l1L94Q86j45K35M5p15p6l13n42J94L09l0P53J98j33L11m34q92
2194f15O0l87p6N10L92J32Q59l35l19J3o80k95K5q4M66N88k13P57L9n65K13o35
$$ y = [-828, -107, 29, 792, 967, 632, 834, 306, -799, -884, -1240, -1109, -237, 0, 305, 992, 745, 254, 220, -647, -1222, -896, -1161, -367, 514, 499, 908, 907, 131, 107, -493, -1135, -676, -820, -447, 700, 719, 623, 1001, 285, -88, -111, -927, -910, -306, -306, 477, 1066, 859, 938, 600, -242, -301, -841, -935, -363, 107, 419, 1287, 1111, 653, 730, -362, -754, -465, -971, -614, 205, 262, 839, 1066, 415, 277, -69, -908, -705, -619, -727, 106, 346, 423, 1143, 550, -189, -334, -802, -1200, -814, -609, -15, 711, 632, 680, 832, -164, -370, -579, -1194, -522, -313, -256, 715, 888, 544, 723, 163, -498, -525, -948, -568, -66, 214, 522, 1154, 878, 411, 412, -583, -523, -619, -639, 9, 406, 625, 1227, 833, 333, 154, -483, -1045, -629, -660, -266, 620, 475, 710, 755, 40, -36, -349, -891, -697, -388, -418, 335, 533, 400, 711, 277, -615, -555, -942, -1018, -508, -116, 16, 875, 540, 221, 234, -446, -741, -716, -800, -334, 254, 41, 798, 837, 272, 485, -150]
2216a50n49L77l04K02Q23K35L4L28o86k28R8q09qK34R3M11O41l2K16k10r12J27
2238f9m12m24M61K36J42Q45k38k38L49p13m83n1k94K08N11k9N42L37k88r7m69
2259a74n63L3n5j03P19L53J02M61k47l37j20m89k85K20j17L22O95j7K17P3n35
2280A53j19l03n95M21R9J92O07K79k13L98m78p85J68m12j23N70J26L32M37r5K5
2301F84k06r45J74n6m45O00M74O0M10j92l69J93o17n48K47j43L25N58k80N62J86
2322F72m64j93k48m44P3K20l07O82L56j38N49m40o40K99m84l36N05j01K66P60
2342E87p2m1R9o52M3k49m06L61N07r6N91Q7l71K72n15n48N0p6J40L70J32P6O60
2365I49n06j85j26m95J12j20jL86M77l10O81j96o82L0l80m42M43l8J56P26j62
$$ y = [-150, -699, -322, -626, -424, 399, 634, 668, 996, 310, 82, 180, -629, -637, -403, -310, 101, 742, 710, 926, 716, -196, -69, -481, -905, -444, -208, -66, 779, 541, 303, 652, -61, -544, -595, -889, -681, -170, -199, 343, 680, 392, 295, -174, -737, -704, -759, -862, -143, 210, 312, 773, 526, 189, 69, -420, -705, -485, -602, -280, 415, 398, 615, 688, 153, 34, -269, -864, -443, -344, -152, 455, 734, 521, 919, 441, -344, -176, -588, -711, -141, -15, 317, 754, 659, 684, 478, -467, -293, -349, -794, -194, 280, 340, 750, 558, 189, 382, -235, -783, -536, -679, -354, 204, -76, 486, 672, 208, 15, -233, -677, -604, -384, -691, -9, 347, 209, 758, 318, -322, -23, -507, -843, -338, -439, -173, 587, 515, 474, 573, -79, -36, -285, -691, -330, 177, 81, 672, 759, 388, 660, 145, -403, -353, -429, -289, 81, 213, 289, 949, 443, 258, 132, -363, -251, -371, -372, 14, 491, 181, 862, 666, -16, 14, -366, -808, -365, -403, -247, 479, 317]
2386C17k4K43n16l42om46NO25k00N66L96l61K17m74m48J36j98j71N58K51k4O14
2408G18j2m77J02p42r3J22k48L06O79j15N33l4m94k5j49n74J2K78O5L20J47K00
2430E19K23n41j88O0n07p5L53k57M57N32k50n8K19n76j68j29k75L53J00J08N15
2451D15J80n35M02o30l55R3k98K60M09M1M01J66n20R5q4n63J07r9j61O45K84j01
2473A52N25k13n41J39m42k72L11K2L01M28J34N6K26q00m9q6m02K05K57q2M71K79
2495F19l54M25n60k43j16k90J14M54O3O6O11o43L9q9l93l9j61n1K66L36J20K05
2517C79p2j95r9m55l24M60k19J54O24r5P3L63m26j95o6m39L7M15k19N26J82k39
2539A70M13l11n33K82l42l62M84J93j4O10j58j36J92o47j33Mj26L80Q4L5K57J24
$$ y = [317, 293, 536, 20, -322, -328, -774, -769, -144, -344, 222, 618, 257, 474, 0, -448, -312, -510, -681, -123, 128, 104, 718, 706, 229, 331, -411, -504, -382, -630, -324, 355, 240, 773, 739, 245, 220, 71, -503, -491, -213, -148, 172, 319, 519, 742, 201, 13, 73, -434, -509, -156, -413, 44, 576, 326, 268, 487, -89, -257, -386, -661, -308, -208, -100, 415, 595, 60, 462, -168, -523, -430, -728, -468, -59, -18, 383, 549, 29, 124, 40, -523, -416, -515, -676, -31, 253, 152, 677, 464, -77, 62, -380, -652, -341, -319, -18, 410, 544, 600, 826, 26, -23, -109, -511, -306, -49, -131, 340, 619, 265, 690, 130, -113, -229, -519, -405, 49, 112, 178, 789, 146, 185, 96, -297, -336, -497, -548, -282, 54, 174, 379, 307, 112, 13, -442, -766, -306, -525, -371, 253, 158, 231, 594, 168, -27, -93, -532, -495, -80, -299, 227, 409, 170, 583, 272, -261, 21, -321, -683, -199, -6, -20, 590, 432, 296, 488, -159, -292, -288, -414, -34, 50, 85, 342, 466]
2561D66m18J40k43m51K59r8Q4M42Q1l8J92k11l70L26n90j10M06m58O33K68q6Q0
2583C04j77k81J82l65l25M28J07J22M44j98o3K12n36j52K14n06J21N56q3K25K99
2604E28l18K04j08o20J16P4k39M24J57oK92q3k07N5l87k64K22k33K44N25j54K52
2626D74J49m68jj76n62L19J92k70O51J38j61J08k00n09J46k66j20M57p1L20K81
2647D31m37J60K0m89O3q7j89K29L45p0L80l6k59K30n56j85K49k06%M10Q5O9L19
2670D76j70j54j03l36J5K75j99M20L1N9J76ol87j09o3l32L17q3J19P07l53P3O8
2693D41m76M0j01k81J32K50M5J60J25n6K2k8n87R1k11j02M81qJ93K54k93O1p8
2716G4n63J8M7M7M8L50n5K92R5l66K49l56m07K93k4o2O34rr3J17j48k90Q9m06
$$ y = [466, 48, 188, -55, -506, -247, -345, -261, 181, 262, 224, 416, 205, -165, 161, -429, -539, -133, -591, 42, 310, 224, 304, 127, -154, 28, -337, -662, -234, -127, -5, 439, 241, 178, 390, -146, -298, -84, -590, -469, 87, 4, 229, 528, 210, 414, 306, -314, -198, -124, -363, 61, 218, 212, 504, 421, 214, 269, -118, -382, -160, -393, -149, 376, 222, 474, 623, 155, 154, -22, -584, -265, -73, -343, 308, 446, 285, 393, 193, -316, -170, -436, -556, -99, -170, 150, 431, -6, 154, 174, -315, -252, -339, -528, -299, 46, -24, 356, 320, 61, 291, -265, -450, -201, -407, -407, 3, 88, 157, 476, 306, 152, 49, -287, -272, 3, -196, 224, 255, 314, 490, 484, 97, -12, -75, -407, -90, -173, -54, 653, 300, 373, 441, -35, 5, -96, -377, -245, 5, 50, 210, 335, 279, 301, 273, -314, -223, -434, -536, -55, -63, 130, 384, 91, 152, 74, -489, -471, -424, -377, -329, 21, -34, 258, 353, -13, 236, -120, -527, -234, -258, -320, 314, 305, 212, 329, 181, -109, -20, -426]
2740d26J89J40o4L62J39j63K48j79m03K67l76k00K01L02N1N66l32q4K8l71j70
2761b75P1l25L49M09k45L57J31l22Q9k78n92Q9K22j79N52n8J99L66m81j84J13
2782Hm67Q5K69l13L82K9R1K83j53l34n5l9k34K93J09o7M67P7k74K02l76l29J42
2805b04o8j55O60k18K12L05m09K72r1n19qj24k7M24J75j13M55j96l79K25l14k81
2827c78K34o6O6L61n4K8Q2n51K36j21k90J97O4r6L99P0j48K80l80k82K60k96j43
2850e28N51k16Q4N02j92p1J15n10R8j13P7R2L75j62J47K10m35J55r9l46J21p8
2872b23j7N04j71L9L44k29j30j15k34L6J38qJ05K17m0J75l8l19n9q7k71L32q5
2895a36J35J20J23j10J40l40p9J12m77K14L89l53N79R8l99O1m4j50q9k1j8J06
$$ y = [-426, -237, -97, -161, 201, 340, 177, 425, 246, -157, 110, -266, -466, -265, 37, 88, 654, 322, 238, 266, -105, -275, -204, -529, -180, 229, -16, 341, 472, 150, 239, -39, -631, -542, -320, -499, 53, -5, 194, 560, 79, -105, 8, -459, -374, -105, -418, -36, -7, 84, 367, 214, -120, -175, -214, -448, -155, -46, -113, 354, 431, 157, 359, -17, -346, -204, -272, -427, 233, 15, 227, 532, 123, 395, 304, -215, -223, -347, -374, 50, 225, 112, 567, 371, -8, 217, -97, -378, -144, -210, -144, 217, 163, 191, 273, -278, -42, -163, -453, -256, -192, -288, 111, 181, 33, 313, -67, -349, -89, -385, -528, 23, -193, -109, 393, 201, 130, 245, -265, -167, -280, -203, -111, 264, 102, 249, 459, 24, 179, 80, -266, -145, -223, -240, 264, 93, 132, 476, 247, 117, 2, -232, -196, -58, -66, 39, 256, 216, 391, 353, 34, -25, -112, -383, -51, -136, -1, 119, 242, 132, 272, -68, -147, -35, -512, -298, 91, -262, 317, 415, 16, 77, 33, -117, -206, -227, -245, -139]
2917a39J88p7M43l00j19Pr0j70N6k26K41M93k60K9K74l27K20k42m16K28J11k5
2939a01L99j13K8O8j51k39K65l29j34L11j7K82J16k50K83j74m42J20j50o5J85
2960a08J69j31L35j09l0J10l04j15J06J9k13K89m9J42M6m2j26m0m33K30p2J5M18
2983A07J21k8kp8j62j9Jk87L26k65R8M43N7j07J47l83NR5l75L20KJ2L69n6L0K9
3009D00l79j76J99j30j9K56O4j08J99k81J58J8m92O5P8lJ66J71l06N10k10l14
3031a34J68l03k21N28j43j49N16k21o0J14K6k19rl20J90K40j53J97K76m11K47
3052A59j68m3r6j05Q5J09R5j93N01j48J5r1l78K4L36m39L69K20k21K61p8k71K10
3075A53l5l05J24L6m6K49J7k9J62j56k09J16k32l3P7m7J94K41k81J82p1k82N9
$$ y = [-139, 49, -28, 415, 115, -4, 3, -87, -257, -201, -427, -186, 307, 47, 76, 350, 23, 243, 1, -415, -187, -76, -101, 298, 185, 213, 281, 130, -109, 156, -173, -307, 4, -13, 269, 385, 135, 418, 244, -198, -78, -228, -293, -108, 61, -70, 265, 156, 126, 236, -68, -183, -77, -58, -271, 18, -31, 111, 157, 115, -11, -51, -484, -254, -326, -311, 107, 228, 200, 198, 120, -42, -61, -60, -347, -21, -286, -188, 255, 312, 205, 352, -31, -26, 69, -306, 14, 16, 28, 397, 341, 371, 400, 21, -155, 44, -86, -105, 151, 215, 107, 306, 25, 183, 201, -291, -226, -148, -151, 15, 186, -120, 390, 180, -134, 34, -269, -490, 38, -105, -254, 262, 41, -19, 95, 121, -98, -107, -427, -237, 3, -150, 47, 323, -88, 159, -9, -52, -148, -253, -168, -59, 36, -157, 344, 196, 211, 120, -258, -234, 102, -337, 32, 252, 31, 292, 214, -57, 153, 118, -187, -63, -27, -73, 176, 193, 164, 326, 170, -39, 77, -155, -188, -111, -158, 36, 277, -4, 178, 107, -175, -116]
3098a16O6l65L68n7j13L25O0k34K1Pj50J15l89L86K51k64L72ok12j01n0k20Q0
3121b26m5J02L47j7q1P1J79l50j7l17NL92j66J18K22n2rR7k73J26l8k89J61m4
3145a04j0L75j49k7K53m03n5J13k87k9L22k02K22K35j70K45j21k88J1j05p5J69
3167h0J26j18J78O0q3j36j13j55L40l87K40L43l06J21K40k62j30J43l83K94J41
3188G3k48K16P4p3L77q5k51o1n8k69J90P8K30J32j22j97K27k24k20K37k00J41
3210c3l6J11J18J72q9n8j39k38L6J42k03K66p7K21J17j86k56K81l26k2M2m0J18
3233g9K51k0j30K70m08J02j99k10L56k88J85K63J40q9J70k85J2Q1m09J78N2j07
3255a64K69J23j11J92nk39n3J16l41M10j57q9J74mk02L85k70k16J99j57J20J33
$$ y = [-116, -50, -415, -47, -104, -217, 108, 168, -66, -45, -38, -188, -73, -462, -76, 175, -89, 283, 277, 65, -36, -86, -306, -226, -271, -169, 178, 161, 80, 151, 330, -20, -37, -354, -349, 43, -123, -5, 217, 165, 156, 253, -20, 106, 68, -221, -60, -104, -114, 261, 112, 85, 338, -65, -120, -7, -294, -323, -1, -203, 19, 254, 84, 329, 208, -80, -69, -174, -249, -80, 46, -72, 106, 166, 83, -53, -166, -321, 19, -368, -128, 215, -91, 30, 270, 8, -122, 21, -362, -68, 73, -175, 41, 115, 42, 419, 334, 83, 22, -36, -305, -115, -37, 193, 325, 203, 6, 233, 9, -211, 26, -174, -33, -69, 42, 160, 332, 243, 185, 46, -192, -156, -14, -217, 49, -28, 193, 310, 124, -132, 149, -177, -199, -157, -197, -79, 172, 152, 22, 292, -116, -14, -213, -423, -67, -355, -170, 93, 233, 144, 314, 29, 41, 122, -287, -109, -57, -164, 105, 228, 117, 309, 304, 65, 12, 128, -213, 197, 40, -49, 125, 121, -81, 304, 34, -182, 17, -140, -20, 113]
3277A13k3J14k5j80J3qk82L80j09k60L81N2n8Q8j50j49lJ10l45M27l93K37J93
3300A23j25N1J3l05J42J06k66K93j18m7K46j11N2j63qj22K80l22P4Q1m4L41J40
3323C11k06p0J39l31K44j72P9rK83k21N3J48k29Q8q8j70J56k0m4K91n7L6M8k35
3347B4p8K27m06J71n4o9M64Q0l83J32l4l10QJ32j97K53m6RM19k36j28L26n05J14
3371h7M8k37J66K50k53P7O6rr4N0k06K89j25l6L12j14j60M12j32k73L2k4o2K15
3395A05k18J95J56j14J51j59j95K3%k02M14l6o6K10n5k46K77m75k33N14j83p1
3417b08M61l03K25p9j80K74k38k53K63j38p0K89K6LK38k79j53J46k38M8J06K1
3439c9r5M3J89o6Nk35K92k22n4K90k29p8K41M7k60L54n3j18r4J9k3J23N3JK17
$$ y = [113, 90, 204, 179, -1, 12, 4, -278, 102, -7, -267, 114, 166, 108, 196, 46, -103, -106, 4, -341, 86, -307, -70, 123, -2, 49, 62, -243, -101, 5, -261, 32, -86, -133, 113, 2, 54, -109, -117, -239, 41, -281, -207, -126, -170, 171, 311, 105, 35, 174, -157, 87, -85, -6, -15, 268, 47, 100, 248, 19, 107, 19, -151, 5, -15, -59, 232, 175, 211, 259, 24, -54, 173, -233, -62, -116, -185, 279, 359, -24, 108, 74, -236, -228, -96, -293, -40, -86, -77, 342, 106, -22, 304, -201, -87, -39, -276, -110, 140, -113, -36, 30, 21, -73, -23, -229, 60, -65, -101, 211, 97, -63, 349, 217, -56, -24, -48, -110, 105, -113, 82, 238, 124, 275, 116, -79, -56, -56, -258, 156, 120, 54, 264, 209, -37, 240, -235, -468, 46, -137, -208, 253, -50, 175, 96, -84, 190, -48, -301, -38, -176, -246, 43, 69, 72, 310, 31, -122, 24, -214, -166, -60, -39, -134, -91, 98, 32, 37, -198, 94, -128, -182, 108, -121, -199, 42, 89, -171, 183, 130, 12, -82, -63, -86, 37, 90, 91, 308]
3464C08j59K6K32m48k5O8j21K06m1LK13j41j20L09j71k90J30k7m2L43j35k5k0
3487G3mQ0p8l89J31L7k9L52o0j06L8k8j59J92k78M4K03k2J47J30j43k23J25j56
3511a23J52Lk88K96j66K92K09k06j15K6j70o7P9j7J02L18l08o1L55k47J09j6k19
3534f2P2N0j93K01J22j56n6J71k21J04j41n3J53p0j8K34q9q7K44j91k10J84k70
3557b82N9K49P5L2l7j55R5J17m87K14J49l20J35K28l45N78j84j00K03j46k20J
3579a41K0N6L13l42L20o3j57J08j35j52J49j13J51M9M3O2P6j93k19J56j66K7J61
3602A0L9K3M32n74J44J3k71K58j72j19L42p3j04J46K5r9J23k60jR6k10J06K43
3625A17k71K96j49Q6j4k30o2J28R1n9K53m6k56J96J09k49O4j33j6J79j47mL66
$$ y = [308, 149, 175, 407, -41, -66, 2, -119, 87, 46, 49, 262, 121, 1, 310, 139, -151, -21, -48, -90, 253, 118, 93, 73, 69, 149, 71, -318, -187, -150, -179, 173, 113, 7, 45, 17, -142, 50, -228, -184, 19, -3, 144, 274, 131, -92, 33, -123, 29, 32, -256, 40, -126, 166, 375, 169, 54, 80, -90, -157, -78, -95, 7, 325, 17, -44, 311, 64, 173, 157, -62, 10, 60, -133, 68, 190, 34, -22, 149, -72, 32, -109, -162, -9, -79, -97, 137, 48, -39, 205, 14, -196, -12, -282, -223, 26, 101, 133, 96, -59, 36, 153, -334, -120, 29, -291, -156, 72, -273, 305, 121, 21, 224, 78, -142, -141, -121, -65, 248, -94, 226, 163, 6, 114, -21, -173, -24, -137, 14, 63, 106, 168, 244, 51, -168, -12, -178, -151, 10, 49, 72, 504, -70, 74, 87, -184, 74, -98, -217, 125, 52, -52, 94, 119, 20, 143, -117, -118, -22, -232, -126, 117, -154, 142, -7, 79, 65, -165, -227, -99, -8, -67, 186, 140, -116, 80, 189, -60, 4, -129, -145, 34, -113, -117, 249]
3648B49l35J37R5k33q6M17m47R0J67j40K72j10j02L12k44l10L19j68q8K73R3j7
3670A44K7j19R0J48m26J7qk07L13O2n8O8n3j50J36p0j52K5O9J68j11K0J00J27
3694A60j76L0p6o6J42p2j33J90Q6j10K31k46L1M7k52k4L22k41L13N5k52K16j17
3717E8k86K16N7k51J48K00k55L98l0k15n2Q4k96K39q8j24M07j32K3nr8kl8k87
3741c29K57%M6j00K42j43R1K6k53L10l56R6m5J18j80L50j00j82J35j0k76L05k94
3764b92K74K4k49L79M1j50j1J03k21J52n1k87M10k3k31L93k58RJ15j35m1K04j96
3787d1N9K27k64J45Nj23R6K9k21J06K5K5%J12l62K69p2QPk6j58L05j43Q6J10j56
3813D8J2j2k56K24k4l09M65l53J30J30j18Q9mj4m14N06k17K5J49k61J70L02j68
$$ y = [249, -86, 51, 146, -87, -173, 244, -203, -113, 54, -86, 186, 76, -26, 286, 42, -268, 51, -117, -205, 68, 161, 144, 171, 52, 142, 290, -136, -119, -127, -334, -21, 41, -17, 51, -2, -152, -16, -86, -238, -213, -144, 24, -87, -67, 33, 160, -16, 14, -62, -128, 14, -58, -191, -1, 85, -25, 206, -40, -9, 38, -214, -238, 84, -157, 156, 211, -41, 175, 58, -228, -12, 45, -206, -58, 142, -113, 285, 255, 40, -12, 72, -224, 15, -73, -197, 210, 78, 101, 96, -2, -4, -42, -329, -72, -72, -26, -126, 116, -27, 64, 90, -163, 147, -209, -113, -158, -40, -220, 130, 30, -152, -17, -27, -303, 2, -292, -18, 6, -243, 136, 177, 27, 16, 119, -102, 50, -1, -288, 122, 99, -132, 261, 3, 12, 127, -8, -49, 155, -41, 18, 245, -19, 126, 131, 8, 104, 133, -88, 18, 43, 68, 68, 180, -182, 87, 15, 23, 30, 4, -154, 151, 8, 94, 204, 48, 60, 48, -208, 16, -8, -317, 148, -205, -75, 55, -63, 26, 22, 8, -406, 100, -117, -92, 57, -204, -34, 268, 100]
3836A00Kr3p1O2k9m2J63J64j81K0qq1J68k43j39L37j23LJ02K0J83n5m18K49j04
3861a4j56K64n6j55J02K30k71J15o3j90L44k33J7J57r3L3P3j04n7o5j03p3L58
3884F0j56J77j52l4L58j21l33N02k62l78K76j6N3K69k70J27O1k57l9J71l28K78
3906a4k5o7L14p8j16J51j1k37N1j6l28M67K6J6J78k22j43N4rk45L05k4l8Q1q7
3931a7J81j57oj86J98m1l1k6kJ78p4lmm0k57K15l7l3J16k25J83R0j15J69k4k00
3957a48J30m7j60L51j41m6J09pn8K0j48L1J24L5l00M87k88M8Q6j19L06n4l90K52
3981G3J4k66L20n9N0R7k25q2J87j2l2l4j18oL60l36M4K88k58j91L0j18J07K20
4005E3j93L32j32q3J94l13J47pj63O2J32k31K92l3j33J54N9j43o9M9j78K63q8
$$ y = [100, 102, 9, -62, 0, -29, -71, 92, 256, 75, 95, 87, 6, 174, -69, -208, 129, 6, 9, 111, 131, 314, 259, -159, 90, -14, -170, 94, 38, -117, -15, 215, -56, 59, -4, -194, 150, -83, -66, 91, -2, 31, 104, 0, -57, -122, -225, -298, 60, -96, 81, -71, -105, 253, 132, -201, 301, 39, -339, -63, -79, -26, 243, -27, 100, 161, -96, -135, 36, -292, -14, -39, -106, 208, 130, 14, 165, 154, -83, -32, -48, -376, 91, 117, 133, 311, 89, -54, 0, -9, -254, 51, 27, -11, 70, -17, 164, 7, 1, -185, 13, -28, -59, -85, -87, 91, 17, 14, 10, -30, -287, -72, -109, -142, -26, -251, -68, 22, -93, 76, 52, -148, -18, -65, -225, 126, -15, -61, 48, 41, -17, 3, -145, -114, 10, 45, -255, 232, -56, -8, 78, -41, 265, 211, -179, 73, 87, -179, 141, 82, 132, 229, 4, -78, 109, 97, 65, 31, -87, -93, 267, -69, -25, 263, 5, -186, -156, -274, -167, 53, -140, 192, 60, -23, 171, -142, 5, -2, -165, -103, 29, -202, 90, 57, -76, 78, 137, -6, -75, -26, -204, 59, -29]
4028b9j89K67K55k72Q2q8l50L23M5j17L00k25k9J15l7j27K73k39q4K30r4M0K8
4051G8K1J27J5k58Mo4n5K11N9k25J49j04J16K8j06j05j21K25P0J3j00J1J71l70
4075b10K55M0k03K48l9k04J32j10q5L09j70m9M2j09O1J49l69K39J88m57L86q8
4097d4j56K74j8k45J60N0n0P0r9l5L49m20K64O5l45O3J52KL1J58j41k0O3j36j39
4122a47K41l55K89K6j36L41k52M8j40K8j63Q7o7M3L45j83J0J09j46M0j83o3L30
4145A02r0k37K01R3k18L52k53r0K48k05M1L5NK0j3lK4K2j17PJ03k01J89J02l01
4170a84K58l2K6j5k8j08Q1j09L94k00l7J14r1k92K36L6N9o5j70m8L55p9p5J23
4194A49M7k77J67j07l45N81k38l0J62k55J34j59Q5j9j4r6R2Q1j63J38N5j99L09
$$ y = [-29, -218, 49, 304, 32, 114, 26, -324, -1, 44, -73, 227, 2, -27, 88, 51, -76, 197, -42, -126, 104, 10, 50, 78, 99, 226, 241, -17, -13, -77, -132, 79, 138, -87, 62, -42, 74, 102, -4, -109, -230, -5, 65, 78, -22, -11, 160, -210, 45, 85, -118, 130, 91, -113, 19, -91, -176, 133, -37, -86, -44, -153, -92, 57, -312, -73, 115, -342, 44, -44, -200, 74, 56, -189, -29, 21, -29, 41, -58, -93, 256, -164, 100, 165, -180, -117, 35, 37, 68, 226, 85, 65, 128, -8, -147, 94, -261, 28, 54, -82, 259, 7, 55, -85, -57, -220, -133, -200, -157, 188, 5, 15, 124, -22, 18, -165, -228, 102, 12, -225, -24, 69, -149, 203, -50, -140, 108, -97, -56, -21, -16, 4, -9, -12, 12, 34, -83, -76, 27, -174, 15, 117, -184, 74, 42, 68, 53, 25, -83, -2, -111, 283, 83, 46, 160, 69, -223, 13, 49, 108, 43, -127, -175, 180, 101, 26, 149, 196, -81, 86, -21, -366, 215, -23, -53, 109, -146, -12, -171, -86, -105, -119, -215, -123, -42, -205, -67, -12, -211, 98]
4217I8m3k4K1k12q4L06j7M6Q1j75j23K41k27K34l72J57J41N7j06N0J5j56J80o
4241H2j43J83k11k3K11P3j38K45k94K44j80l18L74M1j29j5P9j52J87k82P2J72
4263G8k2j70L7J43j77L53j36k10J79l05K98o3j49K9Q7l00L78n4j24n7J51j62J61
4286c5jm6J55m5N4Oj73J40o9p6RQ9j08P3P5k07K47J10k83N7O7p7J85k35J44J44
4312B00J46l81K16j17k1l6l0R1R9k02K13j82n2K94k21j13O9K6k69K61q8p5J71
4335al2n1J72q3j24K0J35m3J33j02j05K05l85K84j62J3Q9J36j25O9L6j07l6J61
4359I7j02J36l50N3J09R0r2K81k81M3o2J11K32k81N5j17Q7L5r4J25K4q2No2J63
4384A23l04J41M0k8n7K77k43k4J47p9l6J77k12P5q9n5K05o1m1J49j35n6J80JJ6
$$ y = [98, 55, 31, 52, -160, -244, 62, 45, 91, 172, -3, -126, 115, -112, 122, -250, -93, 48, 105, -1, 49, 64, -92, 88, 82, -61, 122, -89, -112, 99, 172, 34, 279, -15, 229, 49, -269, 105, 146, 17, 2, 81, -71, 116, -166, -94, 78, 56, -114, -77, 66, -111, 242, 106, -104, 75, -230, 68, 5, -144, -115, -28, -328, 50, -4, -128, -185, -34, -196, -35, -36, -82, 73, 28, 82, 88, -85, 55, -14, -90, -81, 8, -100, -27, 48, -159, 88, 198, -85, -28, 39, -38, 147, -88, 56, 200, 346, -35, 181, 64, 43, 7, -23, 68, 167, -35, 178, -4, -56, 238, 17, -96, -27, -1, -270, -9, -97, -172, -1, -33, -84, 88, 5, -119, -99, 36, -7, 126, 24, -81, 124, -261, 23, -139, -126, -37, 99, -26, 43, 79, -28, -64, 97, -5, 131, -219, -166, -57, 33, -59, 222, -59, -16, -78, 33, 265, -16, 39, -78, 9, 44, -50, 75, 99, 17, 22, -40, 123, -181, -40, 0, -28, -85, 192, -51, -75, 72, -7, -43, 134, -78, -3, -92, -147, 58, -3, -44, 105, -30, -86, 94, 95, 111]
4409A11j32j5j52K08r3r2J52l1r1K93j82P2L3m9m7O4j14K0n3O0J66j26j02K44
4433A44j28r0K37l10M2J91K4kK01l84J52M6j48J66k55J64N6q0R7Q2j37r4J24k20
4457a22L9K12p4j63q6J01J03Q6l02K40J58k61lR7j55J66j09q0K76q2k33J71j34
4480a55o8J96j02M1N3q4oJ00j46K05j6j84N4J41j19O1j8j6J91M2k88J91j47M4
4504c0K87l59J43J89j49k9j25M9k1J56j74O8n3LJ71n0mp1m6k5Q1Ol5n8l8K68l7
4531A17k18K65j64j31K10j80oK20j83KoM8j3l7J24j20K32k57K00k01J52p8J62
4554A38k20J39j21Ko0m1J97j4J6j8K22k45M5J3j55R5j3q6K21mpj16k5p4N0J98
4580A37l11L23l5m8P9l5k01J75O3k24j4lP4J87k13O6O4j40j22K25k84j0R0k4K76
$$ y = [111, -21, -36, -188, 20, -73, -165, -13, -44, -135, 158, -24, 48, 81, 32, -15, 49, -65, -45, -98, -38, 128, 2, -100, 144, 16, -74, 163, -147, -105, 86, 110, 108, 309, -75, 77, 123, -25, 141, -114, 50, 106, 26, 123, 205, 68, -26, 98, -122, -83, 129, 55, -108, -194, -93, 10, 96, -206, 34, 192, -69, -72, 25, -130, 36, -73, -153, 123, 41, -192, -21, -155, -223, -27, -129, -88, -35, -119, -125, -25, -171, 34, 18, -166, -112, 29, -90, -29, -47, -63, 128, 170, -118, 73, -74, -30, 257, -102, 41, 230, 81, 52, -73, -24, -45, 111, -63, 5, -48, -45, 126, 76, 72, 1, -45, -70, 11, 17, -18, -76, -114, 154, 117, -101, 164, 0, -131, 79, -101, -107, 113, -70, -68, -74, -26, -39, -76, 48, -72, 160, -97, 103, -98, 54, -24, 138, -82, 57, -64, -62, -122, -163, 34, 20, 36, 18, 240, -5, 40, 53, -102, -7, -20, -106, 115, 111, 104, -12, -37, -111, -61, 137, -174, 149, 114, 66, 145, 110, -91, 84, 147, -77, -91, -94, -20, 167, -46, 20, 84, -56, -178, 47, -237, -247, -157, -181, 95]
4605I5m3j51J32j83n5K07m3K9R2j20k05M44j63j97L31k20j01K91j99R0K8j58R4
4628ePJ0Q1j00l4J06N7q3J52n2j27P5j04j33J94j39PQ6p1K28o0j98K68j82kJ96
4654A77k61l3J33Q1k63J98K5P3k67j7j38L22k70K11J52k59O7J49l3j23o4J40P3
4677G3k80J00K53l0k71J80j00k39M83l2l09J75m3LO2K8J08R3l40J77j2k91K57
4700D5P5k32J56j96K32J23k76L8J5o8J49J50m04O7J87r5J05l5P8j24r7J11q0J9
4724e7n3J78JJ04q9q9r2N7Om8J47n3k8L39m03m5J74k24J30J69n6n9K1n8R0m1o1
4751d0K12k07JL1M5j0J74j23j03O5j26%J84j62j2J81j39N6O0j13P1j48L3N7P1
4776E8m9Q4l23M09m4j91P5N2j68N5J78k48L48l00j03n8K86n5R8l3j35pM5kJ85
$$ y = [95, 52, -99, 33, -150, -205, 2, -41, -12, 80, -40, -245, 199, 36, -161, 170, -50, -151, 140, -59, 31, 59, -99, -5, 2, 12, 93, -7, -41, 65, 122, 39, 191, 139, 12, 87, -17, -150, 44, -95, -88, -2, -73, 155, 95, -103, 165, -17, -19, 177, -84, -117, 16, 97, -166, 32, 57, 130, -137, -154, -292, 30, -240, -29, 123, -136, -69, 80, 47, -76, -140, 0, 73, -207, -107, 146, 116, -155, 25, -75, -314, 169, 137, -172, 3, -40, -37, 25, 53, 161, 254, -86, 91, 79, -212, 45, 120, -112, 44, -152, 80, 203, -73, -35, -20, -88, 61, 211, -193, -126, 61, -34, 71, 36, 114, -10, -107, 4, -76, -57, -110, 68, 69, 173, 84, -5, -97, -40, -34, -82, 65, 12, -16, 323, -80, -125, 49, -175, -45, 124, 68, 9, 30, -28, 62, 21, -40, 172, -35, -34, -3, 42, 32, 206, 83, -20, 45, -81, -81, 103, -59, -71, 110, -29, 27, 87, -26, 45, -103, -70, -13, 58, 9, 93, -230, 179, 135, -56, 19, 71, -97, -42, 136, -112, 236, -64, -167, -225, 61, 6, 104, 71, -64, -71, -26, -28, 157]
4801A57j77m2J54l3k40K6n3Q5Q9j22J4L13r7j65K22k90J64J7j24J64m9J1J6p4
4825c4p8K38j72j36L75k46k1K09j04J89m2l43K08p6J52J8k08J97j98J19l2K67
4847B82k78K3K4p0j09L1K3N3Mj10K09l0j86J08R7l11L57j79j10J95r6n1K86j60
4871Bj95N0O8R9J35j80P4O2j64K0JoK06j06j27n3K07k09K43Nk13J76m5j2R6k00
4897f6J47p2l8J06M7j44o8N7j3L9J68k13P3m0o7L1K21j39L2j33J82o5j6J5o5J39
4923A18j24R0k59L69k17l03K88R6m6J43k70R2m7o8J19O6k75J07Q7o0N2J74j99
4946f7Q1K06l78J86J3j46R7K50k48O2M5l39M21j88M5n4J45n8L6j22r2L45l19J25
4970D6n2O2l3J03j16q2J49j08J06L7j12K5j25J36qK4k9Q4l05J44L7j55J27J78
$$ y = [157, -20, -62, 92, 59, -181, -155, -208, -123, -34, -156, -142, 171, 74, -91, 131, -159, 5, 22, -102, 62, 13, 24, 40, -34, -112, 126, -46, -182, 193, -53, -74, 135, 31, 220, 178, -165, 43, -33, 119, 137, -71, 126, -72, 47, 15, 282, 4, 27, 51, -19, -128, -97, -74, -21, -17, -127, 82, 52, -134, -26, 71, -240, 117, -62, -172, 23, -73, -124, 162, 2, -193, -143, -75, 24, 159, -21, 53, 115, -49, -29, -28, -34, 172, 66, -61, -114, 93, -116, 127, 132, -81, 95, 50, 38, 134, -66, 81, 9, -29, 77, 124, -20, -88, -31, -44, -5, 163, -50, 23, -17, -84, -53, 168, 29, 61, -72, 110, 45, 29, 44, -21, 118, -6, 84, -175, 194, -23, -326, -38, 58, 12, 155, -115, -23, -70, -138, -19, 47, -228, -121, -34, -94, -42, 132, -67, 14, 220, -158, 28, 41, -105, -8, 242, -6, 56, 101, -238, 183, -5, 40, -14, 131, 73, 109, -13, -105, 240, -79, 46, -6, 56, 23, 126, 10, -72, 77, -31, 75, 112, 0, 25, -100, 36, 28, 52, 23, 107, -198, -54, -17, -172, -45, 133]
4994A33k87j11L62j50J02K1k55K63j43j78L38k23n1R4j6J19K54m96O6J29l2J69
5016A08j08J12k21L28j37j09J95k30J99j98j02J92J52j46J1R2k98L89j91n2J24
5037A10p9q7J95j20j41L18k17k0J7J67l20K29j98L18k74p1K80j69L1j72J21k08
5059b90L58q6O4n9j68K08M3j85J48k7l40K63O4P7p9q1M7n8P7k05L64j45j16K17
5083I1j07Q3j34N4K1J47k19K06j04n5j0J34Kj57N0J2J41j22M8R3j83K5J86k43
5107d1J95l8k27K1L8K9K9J07k27O5J22j74K39k47J10L5j00j8Q1J5j52J97q2K2
5131aJ57l85J18l0l4K10J22m6j43j4j16J14N3j48K29j85l0J31R3k98L22j52j45
5154a78K74p4O0J12l56M58k31p2J91p2J3j34K6j40J55k1j48K94j14k08K15j48
$$ y = [133, -154, -265, 97, -53, 49, 70, -185, 78, -65, -243, 95, -128, -179, -85, -101, 18, 272, -224, -158, -29, -61, 108, 0, 112, -109, 219, 82, -27, 168, -62, 137, -61, -163, 29, 181, 35, 46, 138, -160, 229, 38, -14, 110, 31, -56, 139, 19, -122, 196, -21, -41, -24, 143, -177, 52, -146, 172, -102, -173, 107, -62, -31, -203, -82, -290, 68, -18, 46, -13, -181, 27, 70, -115, 33, 6, -334, -71, -7, 70, -9, -90, -43, -101, -24, -229, 135, -10, -126, 91, -16, 67, -67, -13, 8, 155, -64, 142, 38, -17, -27, 107, 109, -48, 2, 14, 155, 33, 81, 174, -9, 16, 202, -41, 154, 116, -111, -90, -52, -23, 6, 113, -114, -49, 73, -101, 138, -109, 1, 36, -64, -82, -1, 14, -138, 59, -23, -1, 156, -229, -111, -141, -175, 35, 157, 111, -32, -46, -162, -48, 5, -143, 86, -99, -129, 2, 95, -203, 119, -33, -178, 96, 22, 82, 194, -162, 296, 65, -7, 184, 112, 125, -9, 17, -123, 32, 11, -137, 157, 43, -165, 50, -98]
5176i8J67j8j16J9J0m6J98k00o1L2J09j19kL2K1K85l06O3J26j97q8J55j31J06
5200e9J39m5Nj17q5R0L49m98K69j3j01K9l4j13L46k30n7L21m2l08K71j02n9K37
5224A93j71l7J8N7M1j02p7J89L6n8Pj40J17j50N3l4n2Q3m1J56q9k9O0r3J23P0
5250A30k08R1J6k12K29N2n6J01N0j38j46J85k15Q1j00M0K25k00l6K87j45O9q8
5273A2j34J73K6o9l1P8j42l0J66j40R7j08k5K33l10K75J07j30j00J66Nj81J57
5296I5r2m3K5P2N0K9j88J20j2k04J57k41N8NJ68j09P9J03j41K06k80j53K83j05
5320a18P0J46j75j0K77k10J07Rk11P4N7j93L20k04Q0J54j31Q6q5j17oJ48p9M5
5344C4PO2q3M0J09mo9k34J45r9O8J7n7j31L26j29K8j08j09K34n3j76L1K45j60
$$ y = [-98, 69, 51, -65, -46, -36, -82, 116, -84, -145, -113, -4, -123, -125, -93, -72, 213, -93, -30, 96, -101, -189, -34, -165, -59, 80, 35, 40, -77, -162, -72, 277, -221, 48, 35, -66, -37, -71, -184, 162, -68, -125, 196, 154, -154, 117, 15, -44, 193, 22, -15, 3, 60, 101, -1, -78, 111, 147, 89, 96, -44, 73, -77, -24, -58, -110, -27, -68, 88, -1, -30, 30, -63, 60, 130, -78, 13, 29, -183, 46, 98, 42, 143, 193, 55, -91, 94, -121, -40, -140, -100, 125, -75, -111, 176, 31, 100, 12, -122, 51, 77, 8, -23, 55, -87, -117, 49, -91, 6, -102, -127, 106, -204, 71, 178, 48, -52, 114, 119, -62, 95, 3, -40, -15, 57, 107, 136, -52, 68, 56, -148, 9, -232, -174, -169, -1, -110, -31, 72, -69, 137, -143, -296, -13, -118, -48, 98, -77, -87, 190, -20, 87, 96, -115, -41, 16, -177, 143, -61, 19, 173, 42, 128, 43, -74, -80, 68, -11, 34, 41, 103, 20, 60, 169, 165, 96, -138, 7, -92, -24, -7, -64, -195, 131, 2, 30, -78, -187, 47, -6, -182, -151, 94, -66]
5369f6l4J71j48N2%o8K26j3l2j4k28J52J15j09k9M7k07L3O9K8K36j98k2Q4o5R8
5395G8j6%j29Q9l0RMJ54l15Q1L9l5L31k63j34L56k39k6P0j14Q8nm9O0l8L8r5Q9
5423bR4j58R2J76m9k52J83K42l63k3R9k8P5J07k21k6J57j14nJ20j19J14r4k12
5447b07O5R6K0o3M7R1j05%p7K18k15J62jk03J59k2j79K19N8p1K17k15n4J93j17
5472A6Q9r0LP4j25J62j73J30k04J67K4j81L24k1k25J2J12j57K8N7j48P3N2J40
5496A39J0j66R8Q9j76M9J84j70k87L37j88J69P7l20K67K1j89O6Qj29K72k83J89
5519F7k1r5oJ19p8J45j14j83J19R1j67J33rJm9N7qR2l5r7K04Ko0j11P7p4J22p3
5547D9j48R7J8NQ8j57N2K1j13J99M0k82J47J2j39L09j02k48L25j45q1R7k25J73
$$ y = [-66, -100, 71, -77, -25, -25, -93, 133, 120, 88, 74, -154, -2, 113, 4, -25, 22, -185, -152, -83, -55, 181, -17, -39, 45, -20, 78, 62, 62, -67, 22, -8, 1, 5, 159, -156, -75, -36, -71, 260, -3, -137, 219, -20, -46, 24, -90, -2, -7, -56, 4, -34, 4, -91, -2, 92, -66, 26, 202, 153, -99, 84, 326, -37, -60, 39, 11, 86, 193, -28, -54, 103, -11, -16, 104, -15, 99, 5, -207, -142, -46, -26, -89, -42, 49, -56, -56, -133, 85, -130, 32, 31, -172, -13, -35, -214, 5, 63, -8, 209, -6, -60, 133, 16, 105, 15, 18, 92, -33, 129, -44, 86, -118, 49, 73, -108, 216, 195, -30, -18, 94, -63, -35, 22, -126, -53, -1, 139, 149, -17, 81, 170, -6, 43, 227, 57, -230, 107, -81, 88, 165, -155, 112, 133, -56, 10, 18, -111, 161, -122, 67, 46, -49, -55, 64, -14, 131, 17, -166, -47, 44, -123, 10, 1, 2, -47, 10, 2, 94, 59, -38, 166, 168, 108, -3, 74, 0, 122, 49, -99, -2, 16, 21, 109, -48, 4, 25, -88, 111, 151, -131, 16, 28, -111, 198, 96, -152, 173, 28, -53, 44, -181, -8]
5571hO2o6K7L4j54l1J62p1M6J35l54K37k48J87p6J34j47P4O5j43K7l3L31k49M0
5596a9J03P1k16n6J42j65J15Jp8K21p4k5J07m2k24J02N1p6J10o2M9p4K4N1l3p5
5622g2n5P7N2k5J8L2P1q8j20O1K15k85K46n8n0J69m32K67J68k33R0K7l89K71J09
5647F6j90O0N5r5J76j26k2J09m1j44J7K33j38l5P2P9O2j55r8K13M8m11L03QR1
5672A37k63J05J0J44j24J1l5l0K26o4n8r2jLL48k88P1O0l28J46L1k01K64O7k40
5697a01pJ97k19J76m5pL9R6q6j8j67J68L6j06N5L9k63J72K78k29M5r7q5J06J19
5722I6j27Q0J8J36j39j83J19J44k85J53JJ0KNk56K07J30j62j4J29K6p7P4k19K04
5747G2j63J71j05k01J56R8r9R9L4p2J68l2j50J9O9N9KL7k42K73M1l66J72J04j45
$$ y = [-8, 54, -12, 15, 49, -105, -136, 26, -45, 1, 136, -218, 19, -229, -42, -118, 16, -131, -57, 8, -135, -108, -141, 190, -59, -19, 84, 155, -61, -117, 25, -140, -25, -24, -102, 119, 45, 20, 127, 85, -139, -37, 14, -62, 48, -14, 35, -39, -15, 36, 3, -72, -127, -50, 2, -23, -5, 27, 98, 10, -110, -49, 166, -119, 127, 69, 19, 188, -244, 23, 191, -42, 48, 75, -314, -43, 66, -124, -64, -9, -104, 72, -54, -76, 33, -8, -152, -135, 98, -40, -75, -3, 76, 138, -17, -115, 98, 146, -265, 38, 46, 137, -126, -21, -11, 133, 9, 20, -15, -45, 181, 117, 59, -33, -34, -31, 317, 29, 100, 160, -168, -22, 9, -192, 72, 139, -101, -108, 89, -130, 46, 1, -6, 33, 129, 43, 25, -142, 26, 62, -44, 11, 50, -213, -41, 237, 8, 53, -44, -129, -23, 96, -31, 49, 67, 203, 64, -119, 0, 144, -141, 12, 13, 23, 25, 30, -226, -19, 111, -51, -65, 64, 90, 13, 87, -132, 72, -91, 80, -25, -226, -70, 28, -71, 28, 62, -10, 158, 126, -24, -5, 64, 123, 125, 162, -80, 193, 234, -132, 40, 144, -1]
5772aK06k05o9N8j46K00k7K33k90k2l0K32j83L2K8M2j15Q5l2m5O9M3k39J41j9
5797e4n2K15k28p1K92j2l7J02j32j55L17p7j16J78j66P0N0n2j99R3o7Q3P5j56
5821i9K72l6j36L0r4l3K58k67J21m0j81P1J24M1J22j7k34R8M4j22J12j74K0J94
5845G4R1k83R7O5K8j11R0j63J34k24K56j05o3J92o9q6M2J48k41K10q9p9J50k04
5869a40J7L02l01N6Q7j37J52n2K6Q3p1J57l15J78j81J18p6R7K12j38j6j56J28
5892C0q6J89k06J10L8j41L9J19l0j19RPO4p0j29N0J11j2J68l51L85l26J14k7K89
5917B25m12l9K15p5N3J05m8j11K9j45R9J52P7j12j40J07O4o3j37K16j63O1J02
5940F0jJ50l40J47K5k7k7j11J52j74K58j5j9o7M1k40J19R3p1l8J24n2K43l35m3
$$ y = [-1, 205, 0, -69, -11, -157, 43, 16, 249, -41, -63, -93, 139, -44, -12, 16, 58, -57, 28, -4, -49, 20, 63, -176, -35, -54, -106, 109, -119, -190, 102, 90, 53, 155, 23, -132, 185, 108, -8, 170, 4, 74, 124, 72, -127, -34, -101, -18, 57, -99, 173, 137, 1, 31, -63, -96, 162, -105, 16, -24, -205, -134, -10, 31, 153, 136, -98, 0, 44, -78, 34, -140, -120, 74, 165, -118, -21, 44, 72, -39, 51, -112, 22, -202, 54, -51, -114, 78, 9, -77, -35, 113, -128, 82, -7, -86, 64, -140, -123, 179, -122, -66, 21, -116, 36, -16, 10, 93, 22, 179, -136, 42, -139, -21, -97, 0, 212, 74, 58, -98, 30, -56, 133, -73, 37, 75, -66, -27, 92, 62, -57, -48, -41, 23, -47, -176, -126, -15, -27, 141, -210, 175, -151, -37, -64, 225, -187, -226, -11, -86, -33, 72, 24, -87, -58, -203, -104, 48, 125, 13, -127, -20, 44, -19, -156, 60, -103, -42, 60, 59, 209, -131, 16, 41, 14, -13, -124, 28, -146, 112, 97, 78, 11, 52, -188, -69, 24, -47, -85, 39, -13, 230, -105, -148]
5965a48K16k04J43k5N7p3J9r2O6O3p1O2J30k48Q9j13j6J48m0K6P3k4k7M9j59R9
5991@L4q2P4j19L5J67l3q8k8M7q1J10M9N7n3q1N6J10j32L0m1j43K35j0k86L8K27
6018I2j31Lp1L3P6Q5r2R7j16r9K53j17M1q3J05l1J0j12j2K23r0O5l1j09P5p9r4
6045a09J39J50j42oj61K23j03J17k29j8J76j75J46j59J32M0L2o9j32J44j29k2
6067a55L8R9M1q2p8J81j04M3K35k13M1m4m8K10k89J88J65l88K33mj80J80j19J6
6091c4O6L7m9j34J51n1M8p9k1J55q7M3j8j64r5J68l9J44N2k9r4p9R2%P3n8M3q8
6119d7p2K16o9J3J96k19K9J67k44K3J07K4lo9j33J86j18J7k7o2k1J65R4k21J37
6144F9M0j44Q0k5k5J27r8k76K95k07J65M7n4J05L2k77O3O1k18K03J5j6J04m1k08
$$ y = [-148, 68, -136, 7, -18, 39, -34, -15, -107, -41, 22, -49, 13, 143, -105, -16, -129, -145, 3, -37, -11, 62, 38, 11, 60, -99, 0, 34, -48, 26, -93, -58, 109, 76, -12, -40, 7, -74, 36, 85, 142, 89, 8, 64, 174, 42, 72, 31, -112, 123, 113, -173, -135, 92, -39, -36, -107, -74, 2, 87, -5, 92, -24, -123, 130, 13, 54, -29, 76, 45, 55, -57, -69, 154, 64, 129, 98, -11, 64, -15, -109, 30, 180, 38, 32, -129, 94, -9, 108, -121, -139, 37, -138, 8, -151, -19, 21, 53, -16, -148, -4, -133, -155, -117, -18, 23, -59, -137, 44, -60, -17, 218, 5, 46, 2, -46, 164, -125, 63, 228, -160, 73, 69, -111, 69, -50, -34, 32, 69, 20, -114, 37, -14, 34, -45, -66, 89, 2, 45, 27, -137, -232, -64, -103, 41, 93, 64, -30, -109, -17, -17, 56, -2, 41, -47, -119, 97, 28, 41, 237, 18, 47, 214, -30, -7, 100, 124, 121, 52, -81, 105, -13, 4, -23, -85, -106, 59, 153, -68, 69, 109, -35, 45, 20, -5, 122, 24, -252, 43, -164, 1, 48, -6, 99, 131, -146, -83, -22, -240, -37, -22, -38, 66, 25, -183]
6169a83J14J84r6O9p9k31K48k11J33oL8M2q1L8J20Q1k97J91j09o9P7k3j7K20k01
6194d8J09jjq8j26Q4R5r7n7L5K56k88K43k25k4J33j24n1L26k17oK6Q4j09J46n6
6220A9P6j25jP9o8K3K30j86k32J94O3n0j80Q6O0j50K33l49J00R5O8K55j84j21
6244f5R4j16J58j22j67J68J46j7j00j07J75j85N0j13J63j03j1J43J7j06J52J3
6266F7k5j9l6J8J20j64J68j24j1J86k02r5K21m7L7n4j20J25r3J17k47J34Kj8J90
6291A30j23j0r5q9J68R1Q3p3j56Q4P9p8j18K47j82n7K72k84N3m2k0J16p1K8M2
6316eK2LJ12j31L2Q9r5RJ03j02j43Q8j5J30p4l3j42J82r4j03jK10k0n1l3N8k7
6343c1r1J24J9o8M1J59k19K79l26krJ14j9l1K37k21J7k3L6N9k12nJ76n3J44r5
$$ y = [-183, -69, 115, 19, 88, 9, -222, 26, -185, -52, -58, -20, 22, -59, -21, 99, 180, -117, 74, -35, -104, -27, -50, -67, 153, -48, 61, 60, 59, -29, -155, -71, 24, -73, -130, -95, 161, -127, 116, -109, -133, 0, -124, -175, 151, -66, -72, -46, 38, -71, 75, 19, 95, -30, -31, 48, -20, 3, 233, 47, -185, 9, 72, 22, -158, -72, -12, -162, 71, -278, -178, -83, -15, 240, 56, -65, 29, -87, 71, -51, -218, -50, 96, 79, -21, -128, 47, -138, -88, -201, -38, -141, -152, -9, 8, -98, 54, 67, 42, 23, -13, 5, 125, -39, 129, 5, -6, 180, -22, -117, 104, 57, 94, 40, -80, 45, -48, 69, -178, -44, -42, -60, 130, 7, -3, -98, -187, -19, 72, 155, 82, -74, 10, 89, 11, -107, 140, -42, -99, 173, -111, -58, -100, -120, -4, -75, -47, -5, 17, 20, 132, 1, 33, 122, 27, 36, 139, 37, -106, -18, -33, 97, 23, -10, -152, 30, -64, -167, -168, 42, 22, -29, -62, -4, -31, -122, 2, 21, -47, -6, 153, -66, 213, -113, -115, -124, -10, -29, -60, 177, -44, -27, -50, -14, 45, -167, -172, 4, -49, 95, 0]
6369@j60Q7J59j47m4K4j5j7PJ30j5k5QJ1J4M9O7l20J69O8j00J04J11k92L00k07
6395c4mK36k0j57oJ43m08K80J04j88J42Ol5k3n5L1O9k51K22j09K29k44J06j17
6419h3J46LJ12j30j34k8Qj11R2N3oJ15r9k44L48j11Q4j7p7n9J51O8j39N2r7J15
6445A2j5J03k23J56j46J69K4RL8j01j37K06o1m7j37K03l0O5j19k5J91k25J20j5
6469A5P0j01K6n6j25K24k22L11j16r3J79m0R2j93J49q5M5l8k59K84K42l81R1N
6493B4QJ35j84j6M9l2j09J70J09l34K04o4l1K06l98L67q5m7P6n8p8j43O8J43k2
6518d2K17k28r3O0k2J96k89L51k7M4j87K0p1J70o5lj26l7Q7J76j16L0l0p2L2J3
6544a2l6j31L18j85L5K5j5p6P6O3r8n1O7N6Ql5pj12R6R8j54L6N9l9J64k28M9m4
$$ y = [0, -160, -73, 86, -61, -105, -81, -96, -113, -106, 24, 9, -16, -8, 3, 17, 66, 133, -187, -18, 50, -50, 54, 165, -127, 173, -34, -38, 198, 178, 21, 15, 158, -250, 30, 134, -54, 88, 94, 59, 36, -19, 12, 81, -170, 52, -57, 172, -72, 34, -83, 63, 66, 178, 48, -86, -114, -106, -217, -125, -72, -78, 37, -62, -306, 42, -69, 15, -2, -79, -138, 13, 81, -58, -6, -103, 12, -3, 100, -123, 33, -113, 56, 80, 89, 127, 26, -111, 95, 34, -13, -150, 53, 23, 88, -31, -56, 135, -90, 30, 15, 85, -16, 10, -46, -171, 53, -169, 142, 26, -67, 112, 72, 164, -29, 120, 35, 80, 42, -217, 67, 309, -72, 19, 24, 32, 167, -17, -33, 16, -16, -125, 45, 154, -180, 24, -40, -71, 135, -263, 104, 19, -28, 48, -10, -88, -231, -163, -20, -42, 175, -53, -146, -86, -108, 88, -201, 150, 123, 167, -20, 0, -71, 99, 34, 31, -95, -132, -45, 131, 15, 45, 15, -57, -25, -12, -48, -179, 139, -46, -11, 14, -1, -77, -1, 62, -36, -87, -20, 36, 44, 9, 2, -110, -14, 84, -70, -34, 25, -14, 150, -78, -29, -73]
6572g3o2J60j42K69j19p6J2j50J67Oq5J63q6N3m3J18j78O5L7j12K18n1p4lp3M7
6598a2N3J9l0J11N4k40j05K51Q7l7j08k2L0k98L12n7M7j03L5R4q6L2j24J8k4N7
6624d6N2R2p8p8R8m6o7k3M8l7J83o2l5j31K91l19Q5K6o8J14O0j71M7O7j3J40l35
6651b06K88j52L8j14K56q7l1Q5k23J4M5M9K0P9r6N8rq0M6n2n2J39Q7k80M2j33
6677b69K82K7n0q4L43k29p0J62p9q4L37j94L2k16n8K08r4Q1kmj88N4N1q1K73j96
6703d8m1R1r9N7J44j88N9J8j36K35m9j53J88j77k6Q5L0N6Q0L0l6J0pj15K20j56
6729G2j81O1M0M8j8J0j8J26J6j72l9K18j86M5m2j7n9q5J31J91j20M6l08K53o8
6754e6L3o6mM1k9K7pJ21q4m6P5M6p1j0L04l90m5J38j33L22k08P7n8J60k16K06
$$ y = [-73, -135, 25, -117, 152, 33, -43, -31, -181, -14, -8, -93, 70, -16, 37, -6, 112, -66, -1, 36, -76, 142, 91, 17, 14, -59, -12, 41, 60, 30, 141, 195, -45, -150, 101, 188, 151, 43, 21, 51, -247, 65, 8, 55, -48, -13, 81, -5, 27, -97, -79, -103, -46, 6, 98, 20, -58, 40, -6, -73, -96, -48, -85, 98, 36, 1, -130, 161, -158, -73, -47, -115, -1, 59, -112, -65, 2, -11, 129, -206, 82, -70, -32, -146, 110, 23, -8, 77, -146, -132, -87, -38, -18, 61, -35, 23, 14, -66, -20, -72, -124, 15, 102, -178, -136, -269, 13, 40, -10, -94, 249, 20, -50, 112, 33, -51, 286, 92, 124, -92, -150, 58, -36, 45, 43, 39, -149, -95, -44, -125, 148, -48, -89, 2, -97, -40, 104, -84, -25, -7, -143, 92, 43, -110, 78, -99, -125, -40, -10, 46, 126, 156, 120, 130, 123, 8, 228, 72, -109, -48, -8, 40, 22, 32, 14, 140, 156, -16, -55, 163, -23, 22, -20, -37, -96, -181, -50, 141, 21, 67, -241, 12, -56, -23, -89, -93, -52, -81, -54, -61, 60, -24, -70, 5, 51, -20, -30, 274, -116, -161, -23, -156, 166, -42, 35, -23, 137, -79, 127]
6780A27j45l6Q8rML9M1l41J00J36Q6K3j08N5J30j72n8J09j86J26p8o6J88mJ20
6805A69p3j47l4Q5R6m7j30N2%Q4j13J39m5ql2N8j12J95j37L7q9l6J51j06N9l9
6831b3p5J50o2K04l20J97k8l18K67j24K54p7O6j20M8M5r5L3J9n7j9L9J01j39Q6
6856E2j26R8r6J76j94Q4m3L5N2j2N9j15J03k33Q1JJ09j52J00J52N5k25R7RJ15
6881A82j70M4n4n4K52k48j5j9N1o1K00l8j31MJ23l6j94N3J55j8P7j46j41J74J37
6906A27k02j76J06K07j25J12pj60L54k20o6J50j12k6j24L3K46k92K20k63K44r9
6928g3O9np9K16k50J82l6k5J51J3j33o6J9r5Q9O4J19j41j10K64j79m4j21J77K0
6953B6j75K13m2nJ53r4O0j22n9j8J29l1o8L6j52J20R3k27J45J62j70P8j7o1K10
$$ y = [127, -18, -54, 34, 25, 29, 68, 109, -232, -132, 4, 90, 113, 5, 60, 190, 18, -40, 69, -117, 9, -69, -135, 53, 49, 169, 96, -51, -85, 0, 96, 49, -81, -29, -29, 55, -58, 81, 36, 28, -4, 54, -58, 137, 0, 37, -52, -88, 63, -43, 16, -23, -98, 52, -10, 194, -126, 71, 43, -275, -8, -132, 122, 45, 111, -9, 39, 84, -11, 22, 41, -16, -35, 4, 105, -34, 52, -74, 24, -72, 104, -90, -6, -49, -14, 38, 26, 85, -30, 73, -160, -79, -78, 31, -121, -21, 131, 186, -39, 58, 67, 182, 12, 56, 2, -52, 200, -48, -63, -82, -31, -92, 108, 70, -61, -57, 66, 30, -164, -111, 44, 26, 103, -43, -184, -10, 127, -75, -251, -145, 62, -63, 49, 42, -118, 236, 16, -50, 100, -12, -38, -162, -129, 117, -175, 45, -218, 26, -73, -4, -9, -88, 128, -122, 60, 24, -1, 150, 163, 30, -36, -17, -112, -23, 41, 160, 19, -91, 173, -6, -50, -171, 6, 26, -149, 64, 22, 17, 170, 76, 136, 14, -45, -63, 66, 35, -33, 3, -149, -29, 64, -163, -18, 144, -26, 52, 35, -26, 184]
6978A84k15P2K56k30j13nO9k9J82k80K98r6j89Q0M0j2q4J40j88M64j67k22O9o
7002A8M1RK3j03J47L6j21j44L2R9R6K2k50O3M5q0J19l0j03K25l66N79l74k6q9
7027a32J57J8n5L7l2J16k61P3K11k52J83J5j01MqnO6p4J2k9N4j91J55J32n6J7
7053E4j3o7l6L3J54k6l5K1j57J97j94KJ38j44l1K48j49j95K95r4Q8r0J24j36k5
7078c8K4O0n8K7j75J79j02R6q0pJ02r3M5p2M3m7P2o%Q7j13Q3j6j9j02L02j91P6
7106G7j67R2P2p2Q5jk0Jm7K34l78L99l05J4k4N9J06j58l9J07Jk9O2Ro1J04l3n9
7134B9J6k44K48k6m9J49k76J37J61j93K52l08L7j15Q4J6J72j17J13k14j04J69
7156f3K18j73k1L3k46J72N4p2J47J31l65P6J11O1l7p0P4J02j16lj8J1O1k13J48
$$ y = [184, -31, 41, 297, 67, -46, -51, 18, -11, 171, -109, 189, 93, -96, -16, 24, 12, -72, 68, -120, 344, 177, -45, 24, 18, 59, 68, 91, -12, 135, 171, 50, -94, -62, 37, 133, 155, -95, -32, 13, -67, 52, 22, -81, 144, -222, 357, -17, -43, -132, 25, 43, -12, 25, -7, 109, -152, -79, 132, -120, 63, 78, -23, -19, -27, -32, 34, -40, -28, -57, -3, -194, -39, 93, 37, 54, 41, -26, -62, -29, 125, 99, 64, 85, -72, 125, -69, -67, 71, -73, -104, 144, -5, -200, 95, 1, 89, -1, 123, -13, -38, -14, 46, -12, 15, -160, 19, -83, 13, -67, -74, 28, -65, -20, -92, -49, -96, -24, -30, -30, 57, -56, 27, 11, -8, -110, 192, 1, 77, -90, 2, 74, 2, 87, 86, 66, 67, 20, 254, -124, 275, -30, -16, -40, 19, 125, -33, -72, 35, 36, 7, 69, 78, 17, 121, 88, 29, 45, -199, 49, 23, -26, 123, -153, -16, 145, -48, 204, -104, -67, -182, -98, -82, 90, -27, 86, -128, -232, -63, 155, -18, -39, -6, -252, -80, -26, -98, 49, 180, -185, -109, 2, 63, 26, -44, 30, 132, 16, 13, -5, 6, 67, -146, 2]
7181Bj31J48K0j48Q2l1K53r7pp4q3k2M6j16Q5Q9p7J94mj27P1o1j05J55p3j49K34
7208G4n1k0J69k22P6M4r8J88p0j19rO6p2o8J27j67K68k55Q2N7R2j6r6J49j9l93
7234b83L32N6o8k77J56j8J54M9j40L5N5M2j78J67rp3Lp6j3J79j05N9MP1j86J65
7260A01l2q4m0o4p9K51J3j47J52j08m4R9j33l5J66p9J25K1j29K6j09J56M8k15
7284a40R8j5J46O4m5k36N7oO2rn5N8l6K56k25Om5M7P6k25K02J8k71K47%l1J5j44
7312a31m0K9K78j24R4j02k4L1q2J06l9J51Nk08o5J69j21J29r0j6L6l9j15J84m4
7337b8j57J03r2J70n7Q9j24J31l0j36mJ78r5O1Kl5M4J00k01o5L04j41j50k2K26
7362G1n8NR2j81m9J67J95l02J91m7j75J5J8l7J63j86NJ0K21j10q8M4J44j50l4
$$ y = [2, -129, 19, 39, -109, -27, -58, 195, 98, 91, 17, -66, -88, -42, -158, -73, 16, -61, 133, 129, 2, 73, 12, -93, 62, -11, -160, 74, 23, 3, 172, -50, 26, 70, -28, 160, 90, -29, -38, 28, -44, -112, 15, -152, 116, -139, -57, 0, 92, 76, -20, 129, 110, -283, 49, 105, 37, -240, -84, -102, 52, 101, -39, -4, 51, 93, -85, 82, 73, 0, 3, -73, -86, 93, -12, 47, 51, 122, -64, 101, 69, -15, -55, -119, -198, 53, 66, -81, 71, -37, -81, 18, -115, -150, 16, -63, 62, 83, -46, -20, -129, 27, 75, -140, -42, -57, 89, 153, 108, -128, -71, -77, -15, -24, -79, -21, -57, 199, -26, -20, -65, -18, 58, -167, 35, 53, -218, 29, 29, -2, 13, -131, -171, -142, 136, 12, 106, 4, -20, 11, -71, 35, -4, 147, 152, -56, -121, 48, -73, 56, -34, -50, -14, -53, -168, 16, -28, -185, -82, -174, -4, -61, 28, -96, 35, 5, -131, -135, 43, -52, 9, 11, -24, 20, 120, -81, -146, 158, 17, -133, -155, 71, 13, 18, 110, -71, -120, 47, 242, -60, 131, 84, -91, -76, -58, -95, 68, -118, -113, -103, 118, 8, -80, -36, 108, -42, -76]
7387g6R4mm6l7K20q2p7J62o1j35J45K3J2k9p4j6j00L4O4Nj23K07J06k74K21j46
7413A3r5J20p5N0j8L9j50J19M3O0j88K11j71K4N2j7pO4k4m3J08p4n2nj26K44r5
7440GJ01l01K27o2N6j5r5J71r7J3m8J04P6j07j34L14l01J01L5M3j15P1j36K53
7464A61l38J92j5j87K6J17K3m3J45L4j25J79k98K91k75K58k1R1k99R9q1j1J65
7487H8q8m0J8M9J77o6k11J47j2l8n7M8q8R7j7j7%k1J07r9O1r4M0j01J51K9j83
7514a20L5J58q4N4J7p9j28J35p9J51p0p5O2J62r9O9l23J67JJ19k01K06q0j38K41
7539A01m8J5j3N1jo5k00K07j85J31L1M0k94K59N7j11JJ15j05j40R7N7Rj4mj07
7565a16N8J25q3o0JJ54j32J58Qj86P5j70K39J6m7j57J73j15K81o8n5j46L1q6P2
$$ y = [-76, 18, 14, -32, -69, 151, 69, -8, 154, 93, -42, 103, 126, 138, 109, 35, 19, -81, -47, 17, 22, -101, 106, 212, -62, 159, 13, -82, 38, -37, 13, -5, 34, -116, 3, 46, 106, -82, 129, -42, -18, 34, 17, 10, 74, 50, 7, 115, 41, -11, -16, -142, 102, 7, 108, -193, 34, -28, 28, 13, -82, 89, -8, 5, -43, 61, 137, 30, -104, 210, -91, 10, 45, 88, -27, 44, -92, 161, -177, 15, 0, -187, -161, -44, -21, -64, 81, 115, -10, 169, -129, 162, -113, 145, 124, 215, -84, 15, -66, -77, 88, 0, -40, -22, 27, 204, 138, -73, 74, 62, 24, -33, 15, -73, 24, 7, -10, -10, -31, 76, -23, 38, -56, -16, -117, 34, 63, -120, -85, 73, -11, 43, 60, -19, -147, -12, -91, 60, -10, -85, -23, 139, 40, 109, -214, -47, -46, 73, -128, 78, -2, -140, 101, 53, 68, 55, 106, 105, 40, -160, 47, -138, -7, 24, 64, -230, 29, 86, -25, -24, 91, -14, -154, -57, 0, 9, -5, -9, -116, -58, 67, -16, -76, -75, 79, -53, 105, 113, -73, 2, -168, 71, 87, 40, -117, 56, -59, 222, 154, 99, -47, -16, -102, -30]
7590c0L7j41J68j11Rp8L9J16l3rOn2o6K53j59K6n4J39j69P6RL8%n2Q1P1k64QL6
7619a06J06p8J22J20Pj99J7J20k88K05j16J26Q5k08M0k0q3R0P4j19J74n7j6N0
7643D6j65J20n3O3K9r7J52n2j5j61J07N0n4P7j06P1N6j05m9J88p6m8p7O9Q7n3
7669DJ06j7J5r0j06K41k9k57N9K40q0k18J08L3Om6K2m7J02N8j42O1J17q6rK9j54
7696h0M0l6K1M2n5J3K6q6J58o6oJ37K6j21o6J49j65J2lQ3L4%j05J85m8j65J67
7723I1j16rJ06j64pJ05p7M5j17K10j76P0J32N1k31J63r6J24j29RKO2n3N3pLO5
7750A09j43R1j30j23K42k05L23l06J58Q2k8L1j43M6Pl4mn4L7q1J90j61N8Q8J18
7775A68k10J14l6k8o5R6j17P8J49j83nj27K24k50J92j06j5O3p0J37J99k53J79
$$ y = [-30, 7, -134, 34, -77, -68, -146, -107, 9, -24, -33, -27, -79, -145, 108, -51, -25, -79, 60, -109, -33, -24, 14, 14, -38, 43, 114, -150, -142, -106, 0, -78, 44, 164, 171, -28, -11, 109, -179, 26, -90, 36, 121, -87, -47, -67, -150, -60, 14, -105, 69, 12, -4, 46, -119, 1, -52, 11, 40, -57, 95, 43, 28, -133, -26, 24, -30, 47, -59, 12, 68, -37, -86, 102, 26, -22, -99, -30, 57, 4, 110, 93, 108, 18, -88, 153, 124, -133, -74, 166, 86, -132, -24, 9, 15, -31, -9, -56, 46, 104, -38, 23, 140, 54, 45, 74, -80, -40, -76, -55, -13, -68, -55, -29, -115, 43, -23, -29, 108, 134, 13, -53, 96, -69, -57, -60, 23, 57, 57, -48, 137, 89, -76, 91, -25, -34, 72, -92, -99, 6, -71, -26, -143, 67, -109, -39, 93, 144, -87, 76, -20, 104, -25, -16, -14, 48, -5, 48, 41, 44, 109, -34, 57, -73, -196, 46, -159, 164, -142, 16, 98, 70, 101, -42, 4, 11, -23, -27, -81, -44, -125, 65, -96, -38, 50, 168, -42, 72, 36, 8, -57, 39, -78, 0, 149, -34, -39, -166, 58, -192, 0, -106, -121, -58, -128, 9, 208, -45, 134]
7798A34r9R1K7k52J32P9p3j74J44K2N9o5o3O9qk57L73l07K18r9k6K9J05K9k30
7823a42K79j23L1o3R6o8l1J4M3P1k32K40M8L1j94n6J99N5j30Nl04K83q3K5LP3
7849G0o2pl8L4J09j73J8K0J66k26mL7Q0q0p5o7J17J45O2j81Q1p9J75k64J36N9
7875E3j06P9l5K6P7K3j01j98J18L2o2k1L0R4j7P4Oj03n7Q1Oj20K8J06j68O8K7
7902f0J74j4k21K26L2L1o9Nk06J52j05K14o5R8k30K9k4p8J04q0o9J2J33J09k9
7927F9j92J53j65J42p2J74j47j08K85k29J16mK1lM8k32K47j52L0J02j06O3k8m1
7951b9l9K02j96K06j68N2R9j85J61K1n0j8j43R4j10N5N0l0j13J39j70K05N8j25
7975c4Q8k6m3M6r7J10j39J22l8j9J4K0N9m6J33j22m6N0M2q0R1j48K48l77K13m8
$$ y = [134, 35, 126, 153, -99, 33, 112, 39, -135, 9, 31, 90, 25, -38, 31, 23, -234, 139, -168, 50, -49, -75, -46, 59, 88, -142, 137, 14, 45, -18, 78, 10, -21, -7, 36, 107, -125, 115, 163, 194, 0, -56, 143, 198, 68, 73, -231, 52, -31, -6, -3, 70, 8, 1, -37, -3, 106, -67, -49, -29, 137, -89, -93, -56, 24, -56, -131, -198, -81, 64, 126, -55, 26, -53, 122, -142, -6, 53, -53, 26, -9, 17, 94, 117, 16, -182, -64, -32, -94, -115, -85, 9, -8, 66, 72, -31, -88, -7, -1, -121, -93, 13, -155, -87, -60, 114, 100, -121, 105, 137, 168, 99, 104, -102, 50, -55, 159, 94, 192, -38, -9, -33, -111, -7, -87, -156, -144, -11, 98, 69, -123, 30, -135, 7, -65, 109, -38, -146, 139, -90, 26, 22, 43, 40, 88, -144, 103, -49, -19, 83, -23, 40, 12, -29, -68, 134, -62, 144, -24, 28, 127, -58, 103, 124, 74, 56, -87, 7, -103, -48, 2, -28, -141, -2, -172, 33, 91, -34, 54, 28, -15, 31, -66, 44, -95, 27, -11, -30, -16, 4, 63, 17, 150, 28, -18, 32, 74, -6, 85, -63, 185, -192, 21, -27]
8001b7kP5k04K25l9n0J6Q6m1JN1J3j37O4O6j95K1Qp1J49p8R6j40j33L24o2l8O6
8029D4j00J22q4j3O4Q9j64K9R6q3R1k00R0R5pj43Q2J94j61Q2k21J25k36K82j35
8054f2J05K7l5Q3k32K00k26J99J05l87P3R1p7L39k49Q4L5o7O8l5K0j57P5O5j5
8079B7qp3J29p9J85j66jl2l5J32n0qn6o1J4J32r8R5l1j86J64Q0o0j73J53J16j56
8106d6j08N9J61k4N8p2j55M4N4K5j14K8Q9K7j6K6K5N9k34l4M0J99j89M1J35J4
8132I2o2j94Q9K3R3j21J79j81J00k34K33k77J78Q8J31j58o3L7N8q4M0L5o0J56
8156I8m2p9L5J5j09J28o6K0j17m7P9K06o4n0l8j40O7K95k06N9j61J27j5Q7p4l8
8182c0L5O8k6N5kk17Q4J2P8
$$ y = [-27, -29, 46, -158, 67, 28, -22, -6, 80, 39, 40, 91, 104, -33, 31, 97, -98, -77, -69, -140, 9, -69, 27, -113, -246, 78, 16, -22, 44, -56, 66, -18, -31, 33, 122, -42, -13, 83, 0, 91, -109, -19, 76, 69, -74, 8, 202, 41, 123, -98, 27, -209, 73, -62, 43, 70, 35, 118, -114, 86, -140, 59, 164, -223, -150, -59, -136, 203, -46, 38, 73, 6, 74, 39, 59, -98, -23, 42, 27, 19, -54, 75, -4, 181, 15, 14, -18, -53, 79, 29, 21, -35, -96, -82, 50, -48, 47, 16, -170, -6, 74, 14, -159, -6, 110, -46, -154, -95, 66, 42, 100, 28, -127, -83, -29, -4, -118, -90, -1, 26, 10, 36, 61, 120, -114, -148, -108, 91, -98, -57, 78, 92, 30, -164, -75, -52, 41, -80, 99, -82, 18, -216, 17, -260, -82, 6, 137, -21, -84, -47, 11, -73, -33, 2, -58, 98, 56, -23, 12, 27, -82, 46, -20, 0, -117, -164, -85, 121, 57, 7, -31, -171, -104, 191, -15, 44, -117, 10, -5, 82, 8, -30, 5, 73, 47, 102, 100, -117, -33, -21, 57]
8191E7
$$ Imaginary data points
##PAGE= N=2
##DATA TABLE= (X++(I..I)), XYDATA
0@%%%%%%%%%%%%%%%%%%%%Oj4J6j6J6j6J6k0K8l2L2l9M7n0N8o6P3q1R0j00J11j25
42f6J40j55J70j88K07k27K50k76L04l34L71m10M51n01N55o17O90p76Q82j010J170
63F30j382J668k081K744l969O982k8954n0668J1444O087K6573M3447L6803J8916
77F8240m605k7927k3662l9328l7268K786J7746J8304M1804L4357J2652k084k5297
90C5718l1782k8500l4048m021K4530J9534L2003L8835R547p646k1016l4835k7913
103b9594k5363j0205K6511K8795K2905L5564J5253j5577k3001l3009l0009j5896
115e3626p840K0925L7522K1390K3921J8422j6239k6849k6507l0866j4835M41J6040
128c8101L6386K7096J5014J5985j2332l3324k2801k3875j6747N810J6795K9440
$$ y = [0, 0, 0, 0, 0, 0, 0, 0, 0, 0, 0, 0, 0, 0, 0, 0, 0, 0, 0, 0, 0, 6, -8, 8, -8, 8, -8, 8, -12, 16, -16, 16, -23, 24, -26, 32, -34, 39, -42, 48, -52, 59, -66, 74, -81, 89, -99, 108, -119, 131, -145, 159, -175, 196, -214, 237, -264, 291, -326, 364, -412, 470, -540, 630, -752, 916, -1165, 1579, -2390, 4592, -24362, -75030, -63586, -57499, -30926, 12521, 49324, 68240, 63635, 35708, 12046, -27282, -64550, -61764, -44018, -25714, 16090, 50447, 63099, 61015, 35718, 3936, -24564, -58612, -62633, -38103, -18569, 13434, 52269, 61816, 54170, 33154, -1681, -29594, -54957, -65162, -38651, -9856, 13049, 48613, 63866, 48289, 25288, -7721, -37730, -53626, -61466, -40541, -3019, 18371, 42292, 60714, 44475, 17626, -8881, -39747, -54582, -54141, -38101, -1715, 25381, 40395, 56380, 44048, 10724, -12077, -35952, -52699, -46889, -30094, -654]
140f54L0136J1104Q410m320l2892k7658j6543j6139M210K0784K5332L0388J4416
153D6574j827n217k6505l3317j4213r290J473K3510K5088K3916J6992m691j1041
166C1452j9819l3952j7066j118N01K0220K9815J9460J3905k359j6229j8286k8583
179b2059k1548L054O237J4088L0827K0688Q358m74j8126k1042k1184k1586N02
192d2265J4146J3089K5749K2854L286k237j3930k4611j7923j5359l765J6181J5835
205h950J9382K4827M610q701j1309k3482k0833j0534l432J5400K1960J4894J9731
218C3563R049j3100j5200j8465k1578q321K2J1213K4389J6733J2194J0134j1427
231B9206k0125j5627j9776j0337N398J0772K0470K0758R015N662p402k3177j6033
$$ y = [-654, 29482, 40586, 48996, 44676, 11784, -15874, -32417, -48556, -44346, -23562, 1770, 32158, 46574, 44747, 39530, 13025, -20292, -34505, -43795, -42322, -18812, 6276, 30192, 47184, 42493, 31452, 11633, -22319, -39385, -40503, -40002, -19782, 10033, 29493, 43398, 41039, 24810, 6524, -22059, -43607, -40553, -34316, -20228, 10599, 31287, 39645, 39171, 21045, 3, -21181, -42767, -42265, -28119, -15030, 10719, 33573, 36859, 34622, 20692, -3919, -21842, -37201, -40966, -24785, -8950, 10432, 35259, 39869, 31168, 19859, -3623, -24456, -34990, -38422, -23022, -1062, 13832, 33563, 42612, 29512, 14312, -4153, -25731, -34052, -34030, -22817, 1572, 18305, 30499, 40633, 29206, 9081, -6546, -26322, -36659, -31261, -20489, -19, 20739, 29754, 35416, 28014, 4837, -11196]
244a1196j4104j2331O091J5041J6776K0345R218L39m874k1502k0157q791r094
257c4239L156J7726J6023J7502J1721l603o981j5788k3188r881k855J345J7974
270a1088J9154J3022J1866k692j2558j3801k0524j2427J465L216J4165K2498J1346
283B3642O707K06j3977j5313j6464j4624J877Q097J0162K1518J4945J918r56j2548
297A5190j8537j3206j2277q38J2272J1262J6332J6529Q03m730r729j9386j3660
310a9975o989k194J1437J4999J2304J5517K993r336q639j5986j6812m594K62R449
324a7564J7786J1770J1304O502j0633j3306j1802j6490n534M433Q285J7197J4850
337A6798O466M933p635j6821j1104j2543p981O851R870J3190J6636O402N28n365
$$ y = [-11196, -25300, -37631, -31540, -16499, 277, 20622, 29840, 30179, 25305, 3803, -16354, -25145, -34239, -31083, -13357, 2666, 20168, 31889, 28286, 21305, 5517, -17671, -27552, -30407, -29062, -11088, 8066, 21088, 32954, 30262, 17704, 3903, -16621, -29048, -27583, -24367, -10202, 12296, 23642, 30349, 30555, 16578, 1265, -15199, -29823, -27946, -19849, -9687, 11831, 26776, 28694, 27738, 15190, -3347, -16553, -28830, -29668, -17396, -6134, 10198, 26727, 27530, 22800, 13071, -6315, -19975, -26964, -29158, -17721, -2722, 9582, 25099, 28092, 18756, 10117, -5869, -22681, -27275, -27013, -17564, 222, 11992, 23296, 29798, 19165, 5859, -5943, -22433, -27967, -23534, -15249, 1948, 16798, 23264, 28197, 20562, 3741, -7363, -19906, -27887, -21036, -11166, 2024, 18660, 25062, 25590, 20225]
351B0225j6778j3523q388q124N453J4073J0928J3839Q098l039n942j4134j6183
364a3495o136m038J983J4790J2825J0277Q752l384q959j0828j6576q363M38K363
378b0351J2798J5829P828O822j100j2181j0891j2987j0462K016N511R824J7329
391I985Q744K152M12j1333j4046r924r096Q33Q915Q343J4617J2037l54k347q081
406A0857j5854r507o188j260J0740J0771J0415J1986R36o562p209j4386j1224
419a6485k384l27P869J3623Q691Q854K746q267q254j0810j3134k653L037N865
433a1629J3386J0983N776L383q056j1980q625j1293m920N919P079J1755J2559
446A4337L698R95n390j3825r715p247n514O003R894Q835J2289M863k678m449j1707
$$ y = [20225, 3447, -10076, -18464, -26588, -21135, -7062, 3866, 17705, 25803, 22764, 16822, 2688, -13495, -19631, -23669, -21686, -6896, 5929, 16206, 24958, 21574, 12615, 1787, -14789, -23152, -22714, -20351, -7553, 8276, 16104, 22926, 21826, 9645, -1246, -14233, -24695, -22679, -17168, -7344, 9985, 18729, 20881, 21293, 9960, -4086, -14010, -23106, -22273, -13358, -5015, 9602, 21639, 21285, 18938, 10857, -4997, -14504, -20692, -21952, -11212, -441, 9974, 21960, 22896, 16334, 9125, -5261, -16485, -18869, -19196, -11327, 2296, 10987, 19841, 22587, 14320, 6066, -4744, -17878, -20531, -17494, -11629, 1757, 12740, 18516, 21899, 13843, 1863, -6762, -18055, -22975, -17056, -9977, 1778, 14337, 18035, 19030, 13640, -185, -9900, -17147, -22661, -16658, -6764, 2071, 14360, 19223, 16545, 12096, 389]
461C89j1662m811l923L887J2271Q382R097P080l632o661r465j2518n030k43K149
476a4690J1655J1378N902N572k265r308q159j0725p450K289L480Q783J2927O055
490A5444K979r13j0698r986p938p920J807O819P578J2175P345m58j306q439j2779
505f290o392n161m2Q512P909R538Q915r42m436n954j1969q101k173n38Q004J0222
521A102O754P784J467o750o309r791r507o36J352N731J1983P388M692K195o862
536A0593q559p043r564j856M799M891R976R584K830J219n518j1017o452p036m357
551a7510N921P348P857R915K724j892l857j1019q469l846l372M249R219O451Q201
566A1920M372m130m635p728j0288l738r37K627R835P746N173N584l410p599o114
$$ y = [389, -11273, -16084, -20007, -16120, -3849, 4533, 13630, 20710, 17078, 10417, 952, -11566, -16596, -16839, -14690, -3035, 8343, 14245, 19817, 17552, 8244, 85, -10640, -18090, -15801, -12321, -3538, 9389, 15444, 18423, 17510, 6812, -3174, -11112, -19032, -17225, -10406, -2828, 9347, 16692, 16234, 14928, 6489, -6290, -12682, -17843, -17885, -9373, -1464, 8074, 16989, 16047, 11611, 5657, -6312, -14413, -16586, -17124, -9120, 1102, 7856, 15640, 17107, 10357, 4048, -5743, -15250, -15886, -14534, -8803, 3180, 10568, 15260, 17455, 10593, 2034, -5009, -14573, -16429, -11630, -6739, 3237, 12821, 15651, 16870, 11352, 335, -6117, -13153, -17510, -11589, -4241, 3616, 13531, 16255, 14363, 10506, -513, -8982, -12828, -16200, -11951, -2732, 3719, 11920, 16292, 12162, 7527, -201, -10489, -14227, -15164, -12537, -2702, 5044, 10217, 15801, 12391, 4792, -1322]
581a322r285m981J823K699Q316J0040L915L020j473q725o780p091n803K820M989
596g838N761J0516M867O9r73q001q609m911m992Q16P342O104Q157O433j030k763
612A0948n880j0564m998j893m60P189Q084N612O280p45n301m562q893o941q5O40
628a1569N372R061M987M389J222o291o187o326p629m36L019M115R158O619J662
643A1166R53m987q187n222o235j657N124M647O908Q005J295j035l473r104n451
658g253l681k746N084O863N152P142K680l069l302p762p662j921j106K784Q417
673c80N640M715L960m040m898n035q251k945J325K393P146O878L084L141k346
688A0387p352n043n876m215K122L354N595Q134K974N12j078p417o667l910m110
$$ y = [-1322, -10607, -15588, -13765, -11066, -2750, 7290, 11205, 14225, 12752, 4027, -2753, -9844, -15647, -12827, -7838, -2077, 8439, 13306, 13375, 12402, 4401, -4208, -9119, -14111, -13295, -5953, 151, 8308, 14741, 13711, 10948, 5068, -5496, -10494, -12387, -12847, -5658, 2426, 8038, 14318, 13573, 8272, 3710, -5183, -12124, -12209, -11569, -6197, 2864, 7851, 12240, 13462, 7171, 984, -5342, -12971, -13407, -10388, -6273, 2885, 9504, 11166, 12119, 7132, -1055, -6277, -12512, -14169, -9045, -4398, 2510, 10515, 11810, 10775, 7302, -1802, -7253, -10934, -13680, -8596, -1733, 3419, 10561, 13241, 10172, 6870, -892, -8554, -10475, -11581, -8797, -380, 5260, 9975, 13935, 9895, 4997, -38, -8289, -11234, -9909, -7516, -370, 6508, 9592, 12733, 10387, 3035, -2008, -7884, -12099, -9977, -6623, -1028, 7106, 10080, 10592, 9514, 2097, -4570, -8480, -12590]
703a2590J905N284M572P388M382j669j665n372p879l236k627L84O679N259N009
718E824N380j111l704m102p767m210k10k0N389P490L892M016J81n363m069n922
734d306o013P27K340L347P743M332J969R99n336o048l827n303p53L920L417O319
750C527N693M02l02l381p523m373l060j643M231M935M256O398Q78k688k562o778
766a990n474j500j508L170O766L645M504K820l644l693m853o710j414Q26J851
781g204O962N124K717K408k964n406l445n763k630K558K395N196O187J801J362
796I298j471o307m321l247l603K279L853L770O250K894j015r06n222o187k388
811f323k683J180N384L632M796M154j846k741l733o553k804n10j8N440N121K711
$$ y = [-12590, -10685, -5401, -829, 6559, 10941, 9272, 7607, 2235, -5644, -8880, -11507, -11123, -4444, 815, 5824, 11204, 10093, 6389, 2287, -5480, -9690, -9900, -9920, -4531, 2959, 6851, 10867, 11048, 5685, 1616, -4306, -10319, -9592, -7252, -3905, 3838, 8170, 10139, 11138, 5802, -246, -4073, -9376, -10129, -6209, -2792, 3527, 9220, 9622, 9320, 5939, -1584, -5957, -9017, -10660, -6429, -1494, 2762, 9160, 10038, 7350, 4788, -1990, -7464, -8964, -10472, -7302, -536, 3109, 7613, 10433, 6789, 3096, -1757, -8467, -9881, -9055, -7204, -242, 4882, 7599, 10007, 7043, 1637, -1808, -7571, -10201, -7643, -5248, -52, 6135, 7936, 9298, 7827, 1520, -2801, -6048, -9651, -7372, -3519, 251, 6501, 9395, 8380, 7474, 2252, -3935, -6323, -9006, -7826, -2442, 1190, 5986, 10140, 8294, 5553, 1820, -4733, -7537, -8047, -8065, -2625, 2496, 5207]
827E207L659m54m507l299n569l846R55P03L476O502L046J668M63m821m195l520
843d532m515L62L080K718N649M045L42L47l609n688k729l025j417M133L382M364
859B907M938o4j211k210n845l953j207j281L390M843L137M457J276l281k272m667
875a043n283n34j72K258N900L228K192K251l061l900l125m917j405J533J176M963
891F1N127P95J333j498n254l147l671k499K765K516L161N245J672n00r42m930
907B34m063j758k661J473M131K809M355K803j505j298l563n333j692p96L48M831
923a685L594K799L327j406l210k460n084k694R06O42L704M963J946J879K7m261
939B987k945l210l428P87J793K110N381K533Q5L43l337m404k390l177K5L244K294
$$ y = [5207, 8866, 8412, 3905, 606, -4963, -8809, -7854, -7151, -3675, 2827, 5873, 7541, 8004, 3183, -1012, -4532, -9047, -8685, -5605, -2887, 2762, 6807, 7149, 7496, 3887, -1801, -4530, -7555, -8972, -4839, -1457, 2907, 7845, 7781, 6570, 4360, -1485, -5438, -6645, -7926, -4536, 307, 3444, 7901, 9177, 5896, 3624, -1043, -6326, -6860, -7032, -4774, 1126, 4354, 6546, 8797, 5736, 1836, -1289, -6206, -7611, -6078, -4902, 61, 5188, 5983, 7316, 5818, 564, -2583, -6254, -8753, -5988, -3472, -311, 4934, 6606, 6106, 5164, 234, -3829, -5587, -8248, -6775, -2644, 165, 4520, 7323, 5818, 4520, 957, -4376, -6068, -6864, -6516, -1685, 1909, 4708, 8035, 6629, 3419, 959, -4125, -6819, -5913, -5271, -1567, 3396, 5342, 7221, 7248, 2987, 42, -3168, -6596, -5809, -4016, -1906, 3475, 6008, 6093, 6436, 3099, -1305, -3695, -6872, -6847, -3603, -1309]
956a309L987L692n56o22k404n133k289j677r34L550L596K230L702M09k198j820
972B224m377m032N2l12K108M968K330K370J518k906k686k623m375m68J037J753
988c419M434L285J130J342k121m167k058l241j474K102J849L258M344N49j22o68
1004E023m533k980j800j991K052L222J795L970J643j481r25l554m025j148j043
1019e775N93M334K392K233K520j625k212k247m584j369M49K10L576L847J407K055
1035E804r44l524j816l401k690J304J450K375M277J423N54L86l709l202j530k708
1051e951P99K340J882L966K396o81N9k466m045j627j609l23K977K507K469L369
1067F062n17j903j193m003k636p6o11K436L795J583K203P04k670j806k891l554
$$ y = [-1309, 2678, 6370, 5814, 5192, 2788, -2345, -4634, -6311, -7245, -3695, -99, 2131, 5833, 6242, 4044, 2224, -2153, -6185, -6133, -6445, -4337, 631, 2961, 5331, 6849, 3943, 1257, -1366, -5741, -6209, -5172, -3419, 1015, 4300, 5430, 6772, 4651, 484, -1574, -4815, -6289, -4187, -2338, 920, 5264, 5813, 5691, 5023, 490, -2490, -4290, -6281, -4229, -1007, 788, 4758, 6401, 4920, 3995, 441, -3584, -4732, -5775, -5182, -848, 1544, 3777, 6297, 4672, 2460, 213, -4371, -5740, -5291, -5081, -1505, 2342, 3749, 5804, 4860, 1336, -480, -3881, -6571, -5267, -3817, -1442, 2835, 4258, 4812, 5198, 1489, -1713, -3243, -5951, -5152, -2812, -930, 3036, 5432, 4751, 4810, 2344, -1701, -3328, -4937, -5260, -2283, 224, 2693, 6062, 5545, 3642, 2449, -1554, -4190, -4266, -4877, -2441, 1354, 2937, 5140, 5844, 3174, 1368, -1523, -5077]
1083e077K83P80J103M141K257P53J090k542k824j945k907r61K085J166L170L168
1099C740K43M41j217m170j862j595j528K254K219J879L748N43j054o25l442k962
1115c388n32j196J443L150J661K597K075j870j607k117l702p01J85M58L637K495
1131B588R73K072j464k548j645l071j634J521L36K383L446J102N26j16l384k051
1147i66j871k434J248J825J417L706J421m07j37k895l134q68j678n5K982J572
1163b74K441K521j187r06j403l597j386l62j33K235K668J366K329j48k233r66
1179I65k684k521L65K31J654L462J392J005Q86k442k128j703k562J95J544O74
1195a667L341K181n2L67j354l127j102k237p41K195J243K030K941J20o97p28l418
$$ y = [-5077, -4794, -4014, -2911, 1230, 3487, 4240, 5330, 2788, -36, -1981, -4888, -5849, -3764, -2598, 572, 3740, 3983, 4424, 3207, -963, -2825, -4420, -5948, -3694, -1475, 404, 4152, 4695, 3641, 3016, -426, -3388, -3920, -5116, -3673, -523, 1138, 3735, 5810, 3940, 2333, 216, -3486, -4187, -4002, -3544, 93, 2588, 3561, 5633, 4169, 1621, -24, -3095, -4729, -3208, -2872, -489, 2957, 4059, 4585, 4469, 1085, -966, -2837, -5271, -4023, -2198, -781, 2925, 4346, 3939, 3802, 907, -2227, -3095, -4773, -4828, -1846, -274, 2167, 4688, 3501, 2595, 1192, -2405, -3791, -4153, -4286, -2051, 617, 1983, 4312, 4164, 1931, 965, -1719, -4240, -3875, -3644, -1990, 1472, 2864, 3869, 4755, 2313, 185, -1518, -4080, -3885, -2341, -1667, 1674, 3855, 3803, 4170, 2816, -311, -1413, -3650, -4391, -2196, -953, 1077, 4018, 4138, 3441, 2713, -705]
1212g05j972o13j037J557K530J288K436Q56j651p18k362l052j2l91N37L192J422
1229A305J392J669j787j791j262k812p24N34N08K632K788K89J325p85k904j369
1245i92j846j443J184J154J637L289N65k53J32k651k170r80j551N84K397J259
1261C15K279J660q14o25j769l007o56n24l33K749J883J001K064q16j574r18k888
1278a973j503M21J87J434K776P99J265K44k392j204j734k261N18O49J090K922
1294A238J452P3O15j945k494r04j940P8J793Q64K028K472n96k14p79k806j048
1311b113r21q42K208J690P81K493L73j342n50k089k227Q5p29J273K636J007J170
1328B903J029j588j002j487k575j90P22K39K376J785O11P68j194k042j095j647
$$ y = [-705, -2677, -3290, -4327, -2770, -240, 1048, 3484, 4340, 2689, 1971, -391, -3443, -3455, -3846, -3309, -117, 1305, 2697, 4366, 2579, 788, -474, -3286, -4010, -3476, -2968, -336, 2452, 2741, 4066, 3281, 377, -992, -2838, -4281, -3097, -1943, -306, 2983, 3548, 3295, 3427, 776, -1394, -2374, -3925, -3341, -944, 315, 2594, 4254, 3440, 2815, 1046, -1961, -2617, -3141, -3474, -725, 1158, 2159, 4223, 3407, 1833, 915, -1973, -3476, -3055, -2868, -1434, 1342, 2141, 3406, 3650, 1258, 54, -1680, -3941, -3423, -2774, -1684, 1238, 2690, 2763, 3378, 1433, -1061, -1965, -3905, -3827, -2034, -1170, 858, 3330, 2734, 2520, 1741, -1065, -2113, -3034, -3876, -1668, 22, 803, 3296, 3669, 2327, 1777, -312, -2539, -2454, -3183, -1910, 726, 1733, 2903, 3932, 2344, 1342, -145, -2720, -2910, -2188, -1949, 427, 2212, 2823, 3591, 2397, 355, -740, -2387]
1344b387j362J549N28J761K286L65J89l00k562j808o04j423J121J426J075K415
1360B269P36p89l97j762k170n63n59J47K299J093J348J825j110r17j187k209r87
1377b933K52J2K053K188L23J303k08j744r40j905j532R40L62R28K699P98K61M82
1395C339k175j666o02j896K74J468P33K061J383k99J07j298k548o60p32m57J663
1412a305J075J228K136m35r99o30k192j457O2p27J596J947M41J638N35j477q23
1429F13j458j824l5J61N91K426J028M91R99j381j512q79j789k75J045L67J957
1446E25J847j83M76m84k105j065p79j269J466J204P26K108L94o69J1k010j945
1463a752K86j196M95K079Q91J418J107j274p54r06k368l85L2R6K097J049N76J492
$$ y = [-2387, -3749, -2200, -1672, 89, 2375, 2740, 2929, 2629, 67, -1741, -2345, -3768, -2647, -1221, -146, 2269, 3005, 2216, 1819, 57, -2113, -2676, -3235, -3088, -789, 304, 1652, 3477, 2367, 1450, 263, -1946, -2933, -2681, -2669, -616, 1572, 1895, 3198, 2990, 1246, 306, -1599, -3131, -2191, -1829, -901, 1798, 2596, 2857, 3339, 1164, -502, -1104, -3000, -2726, -1258, -525, 1536, 2919, 2620, 2727, 1429, -1119, -1779, -2511, -2968, -1305, -230, 998, 3134, 2699, 1700, 1070, -1122, -2579, -2517, -3244, -1648, 299, 740, 2378, 2913, 1436, 613, -845, -2669, -2704, -2543, -1952, 474, 1502, 1993, 2992, 1611, 99, -780, -2569, -2844, -1799, -1432, 525, 2372, 2189, 2665, 2181, 76, -989, -1768, -3037, -1571, -367, 359, 2467, 2861, 2192, 2203, 193, -1752, -1466, -2662, -2167, -88, 803, 2221, 3328, 2054, 1300, 394, -1974, -2359, -2327, -2231, -134, 915, 1491, 2983]
1481B983p56j465p22j735j302P78J95J219K133K54O49Q8j993r52j123j420P68
1498b401J030M13K341Q16j98jj205j829k07j279J23J576P45J183J662n06n68n50
1516A145k219p17k3n06J492J435P60J205J09j433k23j727j545M97K4O49K060N07
1534A490P65L63j321j178p69j565j46N97M91K002J140j07M91q25j842p08j104
1551b226n38J295M74J202J664p9l19k32j596j202l36p84P50J413P38J485N87q34
1569A462m69j183j599q1j48K86J812Q98O97J004j072r23m79j777n18P58j1J323
1587b0J546K34P49l55j748o37r42j047P06O43O84J870K49j57K95j562j270m73
1605a235j044L99J245M42J144J330q64l8r86j651l35m82j51J653O96P17J151l77
$$ y = [2983, 2227, 762, 40, -1695, -2997, -2219, -2024, -805, 1328, 1582, 2231, 2319, 326, -626, -1749, -3169, -2401, -1371, -958, 1383, 2199, 2001, 2000, 795, -1034, -1241, -2520, -2397, -821, -76, 1107, 2769, 2263, 1695, 1145, -1074, -1791, -1814, -2320, -828, 607, 1367, 2572, 2681, 1248, 1025, -702, -2247, -1750, -1726, -1077, 983, 1490, 2255, 2618, 1297, 119, -650, -2215, -2361, -1764, -1273, 729, 1869, 1762, 2253, 1428, -414, -1122, -2226, -2764, -1469, -995, 207, 1871, 1792, 1473, 1241, -355, -1557, -1893, -2677, -1927, -514, 224, 1709, 2296, 1462, 993, -190, -1789, -1870, -2018, -1732, 80, 978, 1675, 2679, 1607, 684, 205, -1572, -2090, -1332, -1343, -20, 1526, 1760, 2509, 2154, 406, -231, -1173, -2220, -1514, -871, -187, 1683, 1932, 1775, 2070, 508, -762, -1235, -2279, -1880, -635, -193, 951, 2281, 1417, 1379, 393, -1258, -1593, -2075, -2226, -573, 123, 840, 1991, 1614]
1623A614p62m35j673q64K23k37J104J590N50O48L01j465m98r41j404M40L71M78
1641i60J717R15m6O04j306j271j83j132k74J038M91J251J345m73p0k74j861m36
1659i25l68n29Q71R23N00J521J52p86j85j463j344M6m33N94J753K02R32P08j061
1678A108n77q11j617K5M36j23J579J072K52M45m88j417l44j126q45J031R4J010
1696b96J578J39Q3p7j449p11n38q52O54Q70M99J539N53n63R6j027j445L5p11J46
1716a477J278N10Q66J075p48o53j33j733m19K46k89J388J144J24Q65k63j238m73
1734G0r60j043N85J09O33J470J38L31J26p91j119p72r92L41R44K49J220R79j93
1753A325M4p40j508j31n26m94J167L98Q22J087o8j38m58j326q11K88o06O14J326
$$ y = [1614, 852, 417, -1256, -2120, -1897, -2134, -1030, 560, 1110, 1758, 2059, 594, 96, -845, -2249, -1809, -1438, -960, 757, 1672, 1626, 2230, 924, -347, -530, -1662, -1936, -898, -407, 844, 2189, 1716, 1646, 1372, -489, -925, -1293, -1822, -951, -28, 472, 1993, 2145, 1359, 1174, -289, -1633, -1587, -2020, -1426, 327, 529, 1461, 2169, 1108, 531, -280, -1897, -1872, -1436, -1559, 20, 1092, 1344, 1789, 1301, -116, -460, -1586, -2431, -1400, -1306, -296, 1282, 1421, 1504, 1427, -22, -733, -1271, -2123, -1469, -599, -100, 1439, 1992, 1429, 1525, 498, -947, -912, -1623, -1477, -199, 311, 1177, 2252, 1504, 851, 718, -1015, -1434, -1188, -1477, -89, 1055, 1179, 2044, 1781, 543, 70, -890, -1933, -1348, -1239, -606, 864, 1002, 1333, 1459, 668, -451, -1223, -2215, -1874, -930, -681, 539, 1518, 1325, 1369, 629, -879, -1010, -1536, -2030, -863, -465, 357, 1444, 1376, 1238, 780, -546, -1357, -1069, -1675, -1061, 265]
1772B65M29P96M38r97k17q47j254Q1K2L12J508N22L77O83q41j157k46r98l42N82
1792h84P7J031J229j45M46l29j273n78o59p32P10N85M53J422P2j71m1j308j038
1811a133l8n29L52J016K29J078N09n60j84p78j121k96Jk18J383O29M01Q01m03
1830A139q97K1j347n68N01o4R37J344j45M71M8j087l58m74j120M19O62K20J294
1849I96M95o3R9q37j010k94o63k01J085J68R51J025l94k90k32j480l20k77j25
1868a367O97Q46K62R73j75n67l00q86p29J3q1L43J254K75M06N25r84o33k00j279
1888a607L51K05J02J117P84k6M79n21j250j39p57m09Q21L57R59P35j37L4M0j097
1908D1o04k95m33N67P61k6J085N59n83k68n57q90j79p1j23J297L20K62Q53p12
$$ y = [265, 694, 1490, 1928, 931, 714, -133, -1387, -1306, -1284, -972, 536, 1058, 1435, 2118, 1277, 120, -126, -1124, -1466, -884, -807, 224, 1453, 1308, 1754, 1425, 152, -426, -1085, -1817, -1107, -522, -69, 1353, 1425, 1254, 1213, -95, -1133, -1171, -1700, -1348, -332, -103, 975, 1484, 924, 740, -38, -1159, -1455, -1454, -1672, -289, 340, 741, 1542, 1139, 242, 263, -1084, -1652, -1151, -1215, -278, 1066, 921, 1392, 1440, 353, -5, -479, -1599, -1180, -518, -298, 996, 1491, 1428, 1527, 690, -320, -614, -1277, -1478, -393, -225, 726, 1751, 1357, 1067, 835, -645, -965, -1242, -1367, -670, 176, 438, 1411, 1236, 669, 369, -517, -1246, -1233, -1314, -971, 283, 558, 964, 1489, 505, -128, -328, -1607, -1256, -1051, -949, 168, 952, 926, 1405, 884, -366, -505, -1262, -1671, -850, -493, 466, 1201, 1064, 1098, 1138, 41, -563, -858, -1291, -724, 37, 11, 1096, 1655, 1072, 804, 247, -643, -822, -893, -1016, 281, 601, 863, 1716, 1004]
1928A004m98l43j006m28L48j13R99P34l4M33j06r60j73o14p79N91L63K31Q72L76
1948H97L1J66j061p45O9q11J06Q52K32Q44N13k57j35l91r28k89k24p7R19M57K43
1969D11J083k38o40q2r13p04L07k90P34J019l3N12K73p84l35m47q72K49J46k5
1989f29J180L05J08M93p96q20J4j063j00Q67M8P04O38j38K2j02j114l05j28p85
2009a601P89N18L72Q10K59o05Nq55n40j53j75J45R12J44O32N66p42j68l63p64
2029h14j30J19J7R16N15N3N72k68r35J3p64l38O17l6M24R55o6J60np30k30n41
2051d96o28N92L41M1Q92K42j19J03p09r04Q8m52j64J102J61L13N56k33k00k13
2071C13p88l23K1l22M75P58P0O85l4o30j66m55q86L80j6L59R74o0M07K77n19o59
$$ y = [1004, 506, 163, -843, -1271, -923, -1036, -37, 697, 663, 1096, 990, 30, -143, -757, -1536, -945, -582, -351, 521, 897, 928, 1094, 33, -712, -643, -1454, -1348, -496, -264, 580, 1093, 836, 701, 310, -618, -907, -1131, -1208, -289, 168, 411, 1494, 1256, 616, 534, -379, -1083, -776, -1066, -332, 687, 654, 1166, 1439, 655, 320, -127, -999, -750, -604, -629, 551, 856, 964, 1457, 661, -159, -145, -1208, -1308, -441, -393, 311, 949, 811, 833, 731, -383, -688, -816, -1601, -812, -294, 78, 888, 1147, 542, 547, -308, -848, -1001, -1176, -1031, -119, 25, 657, 1223, 481, 313, -50, -814, -944, -825, -808, 108, 623, 676, 1248, 980, 45, 58, -706, -1044, -427, -463, -39, 916, 850, 1010, 1005, 275, 45, -496, -1124, -532, -191, -150, 742, 984, 865, 968, 259, -645, -557, -1009, -1173, -71, 90, 403, 959, 726, 526, 313, -475, -798, -777, -1099, -624, 134, 204, 889, 855, 225, 59, -396, -1282, -902, -918, -559, 415, 355, 762, 1039, 520, -139]
2093a39k17o30R5L64m3J083N05j76J46l14o69l40m48k34P65J73K80R85k16j58
2113H12q6j017m15J56l48K99Q74O3K59O14o56j27n46p20J63j60Q2R72K92P5M49
2134A035o18k73l09o36k61M51j29M93P49j21M47q2j077K8l44n24M85J04L91P26
2154E35J91j05J33p78m29N5p41K77R51j00N56M26l08p3l25q10P3j93k07Q88L34
2175C50R7N29k00k62o6q20n08O13l45L57N94K52J37J46o87k98J52j016L55P8J90
2196c52P66J92o7K92m80p33N7n51j09N26J17M31P66l43rj17o82l78r7l10N31M27
2218a23K04O49L2m77n5n75m93M77m41K83P06K53m7N37n12j95j04p19j12L05j3
2239d20P09L24j9M22m70o14M7l06l69K65Q3L50M39L93n7J08q62l76J45n95K15
$$ y = [-139, -356, -986, -891, -527, -570, 513, 1018, 842, 988, 674, 5, -335, -783, -1017, -252, -79, 201, 1186, 970, 812, 726, -291, -706, -550, -898, -599, 275, 338, 597, 1211, 555, 428, -118, -838, -675, -835, -753, 219, 511, 586, 1035, 417, 144, -165, -801, -1062, -611, -740, -247, 502, 381, 828, 746, -331, -303, -647, -1171, -686, -582, -191, 535, 726, 621, 754, -24, -453, -398, -1139, -862, 89, -11, 545, 971, 663, 590, 265, -545, -472, -665, -872, 16, 350, 447, 976, 776, 514, 448, -372, -880, -267, -612, -255, 339, 591, 728, 874, 187, -111, 41, -975, -620, -542, -352, 414, 606, 539, 831, 351, -382, -325, -876, -985, -459, -342, 89, 855, 512, 503, 386, -296, -674, -771, -1081, -550, -123, 81, 730, 762, 285, 230, -345, -838, -361, -802, -519, 187, 440, 393, 930, 418, 223, 119, -600, -712, -407, -420, 289, 613, 594, 1016, 546, -68, -21, -327, -696, -431, -348, 2, 441, 834, 777, 885, 23, -353, -208, -803, -588]
2260e88N95k53O85M68n08O4l99n49Kj75l44Q38R2M35L08k35l33K27p57l79L90
2281d16m69M73O32L1L06K2m26M3m92o65N55j09J75Q71K1J00R5m41l42o4o92J35
2303f57O45r3M16O53m63J83k88o18R9k26k99N08L14r2P63l07j98R6n41o57L04
2324d58j18R2O70j08M44L15m61l60j13p64K48J61k73R73J58j61L29l93k63j10
2344a92n49n9M32m0K03Q18j35JJ02p44j10j62l64M34K04K2Q39q0k30R4m32n21
2366d69K47l50J86N09p6L50M68m39r0j08o40N2K0r0O95K14j64M46j57k59j80n53
2388c88j65J78l8K75N35l3J51J83m84l47j74n38K68L60n8M99K74k24K49m17l66
2409b60Ql91o5N78j04L11M40l2k18o8o01j77K51l79L92N72j22M50K05m82J10m21
$$ y = [-588, 7, -246, 439, 907, 399, 463, 64, -485, -483, -658, -1002, -164, -72, 363, 671, 436, 103, 330, -427, -806, -416, -885, -412, 220, 251, 557, 579, 153, 196, -296, -961, -406, -515, -340, 531, 552, 652, 747, 306, -36, -100, -792, -657, -12, -105, 311, 964, 501, 684, 396, -222, -123, -349, -648, -140, 174, 82, 845, 538, 340, 436, -105, -762, -458, -576, -484, 186, 78, 522, 837, 376, 16, -97, -861, -613, -452, -725, 248, 406, 245, 574, 181, -82, -192, -741, -800, -368, -408, -205, 613, 478, 479, 581, -163, -273, -435, -799, -365, -161, -139, 700, 620, 390, 484, 52, -469, -222, -572, -386, 123, 47, 397, 865, 426, 336, 228, -412, -360, -340, -430, 265, 479, 315, 761, 604, 345, 165, -388, -553, -375, -413, -138, 397, 364, 515, 698, 214, -133, -307, -845, -577, -217, -275, 224, 498, 274, 523, 106, -260, -252, -643, -708, -130, -234, 77, 517, 485, 267, 199, -402, -579, -328, -707, -315, 257, 135, 585, 790, 308, 418, -3]
2431co36K50J74j17O37J20L38J00m98j33k01n65j4M22o1M23L58j38M7ml86j96
2453h3k66l46N90J0j02N79J05j22J1l66k43k10l15J74M91j6J50L92m19K61k36
2474C9n78R9m4j89Q36k4N0M04k91k20j57l78J2K46j67J15O76k01M25kn69k7j53
2497i8m51K90J45k5N93O6k50L59n42k42P1m38J50L67n0L06M28k47j0rn14j65k13
2520d79j60O32K5J41L63l2l47R6n36l92K78j50K09L49k3L08L38p60J97j16o22
2541f81K68K36k64P13N7M5l3p3m45P9j69l45L92R8K52K59j66L09j24l04m65K42
2563a19j78J7N35l49P45j42j72J29k18o06K98k07j05O19l05K67M44l31k71J71
2583B22o40K3J84l84O25K11o1J78j0l69N9l49k99L20J03j65O57n8n6K84n02k34
$$ y = [-3, -639, -389, -215, -332, 305, 425, 763, 863, 365, 232, 31, -534, -548, -126, -187, 236, 594, 456, 503, 499, 113, -83, -349, -695, -105, -95, -197, 382, 487, 365, 376, 10, -233, -443, -758, -584, -93, -109, 41, 433, 14, 275, 39, -539, -440, -484, -673, 163, 139, 189, 593, 302, 82, -75, -453, -441, -195, -362, -247, 429, 228, 653, 651, 82, 55, -98, -549, -259, -114, -139, 454, 520, 270, 629, 87, -155, -84, -522, -372, -5, -55, 251, 679, 432, 422, 413, -101, -266, -479, -639, -7, 18, 159, 522, 490, 143, 239, -297, -689, -411, -561, -352, -3, -26, 282, 620, -140, 57, -59, -681, -413, -177, -441, 272, 329, 374, 341, 268, -177, -98, -267, -612, -220, -122, 130, 389, 223, 532, 408, 104, -361, -119, -297, -280, 255, -94, 651, 509, 337, 466, 248, -358, -60, -267, -372, 247, -58, 209, 653, 322, 51, 222, -418, -395, -211, -595, 30, 241, 180, 358, 348, -21, 38, -311, -610, -290, -187, -352, 305, 247, 191, 475, -27, -261]
2605b61L7m16J62M08l85P51J87l36K29n6o72J08o3j71N75j33J52M83k56j94J85
2626C34n81r2K14n8o1N63j5J97K01o24K17m20m26M13k54J06M92K69k46L39k77
2647B91l94nl81J36L55m37L40M96j58M8q0m22J18l07j11K52L74j51L14j6k63L05
2669C04n01l42L16k01j1M17q4M00N0k27J27q6o73K85m1O3L39m8J71J43O6l16q4
2692F7l01k32M84j31Q9M72j95K19n5m25j61J36l35J40J69j30N38R7j10M2l18k70
2714b10J90m42l3M58P2L8N14l99K3j67l71j18J40o2K14K10l4K01N6m30J27M8n46
2737e21K92j34m7N31l6R6L95l91l08K29l39q4J66L7L79J81l21L37j53m94J98l33
2759c20J57R1K9K03M17k65k74K78m23n7J58m83L97J87M6J41J12j82K4l51k95M21
$$ y = [-261, -224, -640, -478, -70, -455, 296, 483, 147, 376, 320, -352, -244, -307, -478, 97, -36, 116, 599, 343, 149, 334, -247, -339, -125, -183, -244, 319, 304, 501, 702, 78, 295, -125, -551, -138, -392, -286, 206, 475, 229, 568, 291, -103, -108, -489, -353, 2, -435, -95, 401, 243, 291, 211, -211, -93, -400, -511, -259, 115, -36, 278, 262, -1, 304, -197, -539, -223, -424, -435, -18, -102, 298, 348, 121, 248, 162, -511, -226, -267, -204, 135, 87, 258, 401, 467, 151, 67, -234, -466, 18, -113, -24, 448, 253, 472, 417, -8, -169, -33, -368, -228, -59, -189, 349, 446, 336, 378, 60, -210, -20, -462, -495, -37, 35, 73, 587, 188, 211, 44, -327, -445, -305, -367, -153, 57, 23, 224, 280, -150, -23, 25, -521, -229, -363, -410, 121, 85, 181, 576, 185, -123, 106, -233, -317, -151, -114, 265, 446, 125, 462, 309, -185, 13, -320, -163, -72, -43, 160, 577, 312, 38, 316, -107, -164, -6, -489, -92, 95, 141, 282, 394, 212, 236, -115, -410, 11]
2781A1l45k27N87K0K52J05l66J0j30k83j89M17k65L20K88r0J79J4n57J65j27j84
2803c95R5J65J21K65N1q9J26k60k47l9j52K00J84p2L79J3k31K07k50k62J77k19
2825b33j72M52J71m6K39j51r1L5k27j03J56k56O9L49J33KJ06l94O9k18l59K54
2847b15J44j34L79K6j14L69k73l82R8j71m4L21k07J13K82l2o3J12n85L31j48j93
2869c86K78J17j1K16J44k79K62l31l40K07n6kL65n4l1L05j83j96Nl51K6K79k57
2892b73L91L36k02K28r9l43J61m47j22L66j49J65L44j60J78j54l99J02l6k31K3
2913c21K22m0M58j91r9L30l51m09K25Jj91K82R7J96J22k52r3L58p26R9Op6L85
2936C2J83k53L12k9k41j27M4k26L08j49J12L02p5j41L29j86k28M5m25J51M55k30
$$ y = [11, -334, -561, 26, 46, 298, 403, 37, 47, -83, -366, -555, -138, -403, -83, 205, 115, 294, 308, -249, -84, -211, -395, -300, -135, -14, 251, 302, 213, 339, 79, -168, -207, -359, -159, 25, -47, 332, 345, 114, 321, 71, -191, -14, -233, -405, 47, 218, 172, 411, 260, 169, 204, -23, -126, 30, -226, -157, 192, 325, 327, 433, 39, 108, -110, -469, -215, -71, -205, 174, 200, 86, 455, 182, -200, -102, -273, -317, 4, -203, -90, 192, 160, 97, 209, -376, -45, -193, -386, -108, 9, -2, 214, 358, 79, 341, 10, -330, -123, -179, -181, 184, 130, 99, 404, 221, 25, 30, -321, -295, -16, -273, 118, 454, 252, 480, 381, 38, 199, -248, -370, -4, -153, 12, 356, 196, 374, 220, -179, -77, -113, -344, -321, -99, -139, 319, 128, 29, 359, 8, -401, -176, -175, -366, -84, 13, 209, 331, 79, -14, 344, -382, -283, -277, -353, 32, 215, -38, 274, 245, 4, -123, -79, -305, 3, -146, -34, 268, 193, 52, 381, 195, -33, 12, -413, -262, 193, -37]
2958c7K08J81j49K48j23m14%N9k16Q8J50j15M27l1j30J10m40m6J43m0J50J77r9
2981A01J25Ok91J69r0j98j45K17m7J89J07j17L81k97k20R5k08O7n0n0K43K69k12
3004D4K42p8k29K8l03O6J85k09J48L71o0J8j3j88k73K60m13K43K12P6R9K50l06
3027A70j16K8j85nK9k96L55K64k07K86n9k21q0j87k03M53l25J29L53j34J53l8
3049A64l00M6k7j27o8o5J57L00J23l55M66k05m67K12k00K0J03J38J11K53j64j23
3071hJ55m48J20J42j82J98J78j71L08J3j90J48k53k84K27l7k98O30j26J22K5j33
3093A36o4O9k60o5J68K9J38K18k49R7K99n63J5j49m34N56m3J94J26j06L7kj91
3116d4k9J10m23P2K41l0Q2K07l53Q7l8j73J30pj03L42j23M0J13J78j94J70n35
$$ y = [-37, 171, 352, 203, 451, 328, -86, -86, -27, -243, -155, -5, -120, 307, 276, 146, 256, -184, -230, -87, -127, 23, 200, 101, 226, 232, -59, 110, 20, -178, -323, -106, -153, 36, 143, 26, 407, 110, -110, -15, -223, -156, -206, -256, -13, 256, 44, 286, 208, -21, 7, -296, -230, -45, -254, -106, 265, 205, 223, 210, 22, -251, 9, -404, -161, 51, 127, 226, 476, 170, 54, 82, -103, -108, -79, -375, -20, 244, 37, 323, 264, 43, -37, -224, -427, 26, -299, -170, 183, 49, 202, 164, -136, -90, -117, -244, -312, -377, -220, 80, 203, -152, 314, 109, -358, -146, -346, -326, -223, -85, 26, 279, 115, -8, 147, -301, -181, -39, -221, -23, 155, -16, 292, 305, 115, 263, 10, -274, -47, -84, -382, 248, 122, 244, 269, 136, 72, 141, -119, -184, -16, 13, 151, 369, 120, 217, 516, -47, -32, -181, -615, -59, -102, 92, 218, 112, 149, 147, -44, -73, 37, -386, -314, -73, -103, -21, 186, -167, -80, -118, -291, -161, -168, -271, 71, -52, -12, 101, 279, 85, 255, -280]
3139b80P8O4J6J94K39j03nO6m38K18j4k26K30o0j37K58J75k9K15m27j57L27m36
3162b32J45J04j92K05M50k63K1m5m37J95j50o8K08m8r6M24k8l06K65k90J32J6
3184A0j73J48J13j78K42o4j35j9J85m79j01L22j22K30J45mK9p7j42Q4o1n1L6K14
3208A52k71K69J12k2j08m05J24J67k12J47J67j32K91j32M2J0k90j45J34M0j19
3229a81J21p2L14L59m99k3O9l27P5J33l0J53J16j42J01Jo6q2l46l9J19J49QL73
3253B84j54p8K61l26m5J53l21Q8K90l96J36M32k67J23j84j07k1Q4k57L52m8j10
3275a11M65k43J03n6p7k18J70J1nj8J68mJ8j29k6oj59L18l60J6L53n4L2q7o9j23
3301i1J07k62m7K72l36K50K56kR%j59j72R2k02K42J34l49L29mN3J56k72r5O3j67
$$ y = [-280, -202, -138, -122, 72, 311, 208, 203, 269, -169, 49, 35, -191, 39, -21, -158, 100, 275, 246, 461, 34, -123, 204, -232, -87, 17, -175, 30, 480, 217, 238, 193, -244, -49, -199, -267, -59, -107, -203, 221, 193, -113, 152, -138, -6, 10, -163, -15, 98, -80, 162, 98, -37, -56, 129, -350, -451, -129, -251, -21, 124, 120, 149, 72, -70, 14, -47, -98, -62, 152, -119, 150, 262, 240, 132, -273, -149, 18, -194, -47, 120, -12, 279, 147, 189, 199, -91, -236, -102, -62, -181, -60, -132, 182, 541, 42, 19, 88, -239, -164, -31, -61, 92, 208, 66, 167, 168, 102, 20, -326, -365, -246, -97, -89, 284, 130, 52, 313, -13, -58, 95, -226, -138, 152, -244, -108, 324, 57, 180, -4, -111, -132, -48, -305, 47, -1, -111, 354, 111, 214, 158, 81, -137, 33, 44, 39, 21, 189, 185, 203, 74, 48, 42, -117, 201, -159, -143, 210, 156, 188, 101, 32, -91, 16, -246, -293, -21, -357, -107, 149, 147, 156, 156, -3, -175, -83, -285, -43, 91, -258, 71, 67, 120, 276, 4, -91, -28, -195]
3326a95j4K78k01K24J46m64M26l5l41J26l4o9J29L14k80L01k29j88K09p4k24M02
3348B07k68J03L91l72M1P5k97K18n9j57J15l2K1L8J51j85K66k83l0jk11J20K23
3371G4k20R8L45k20p3K05k47r7J1p3J46Q2m0J11K0k37K33k37k84M46k76M7K57
3394G1j33N9J60q3r5K10o52K87L0M1J82R1j43M17k80k49M5J21l81L34n8K48J42
3417C64k35j8J26k17o0Q2n2k6J13k09K58q7j86L44j79l00L52k08k13N08j53J21
3439A25J7o6r7K38l37p2J7Q7O2J54j52O7O4k23p3J93k27J21p4k3J93K09k3j37
3463D3k50L2J58j51J21k3J28J02J07j72m4Pj39n4J49j68K82k2j37J23o1p0J75
3486A36j45j30J05m8l5K73k09J03K54k29n3R0k30P7j9J1J71J49l72L37Nl78O1
$$ y = [-195, -209, 69, -132, 92, 238, -226, 200, 165, -176, -50, -84, -153, -24, 290, 10, 311, 82, -106, 103, 29, -195, 207, -61, 42, 433, 61, 102, 177, -120, 98, 39, -118, -3, -35, -14, 24, 175, -10, 256, -27, -57, -58, -269, -149, 74, -146, -48, 297, 77, 4, 209, -38, -135, -124, -197, -51, 31, -9, 102, 122, -115, 118, -119, -403, 43, -233, -186, 71, -62, -3, 157, 74, -21, 189, -463, -176, -146, -105, 77, 168, 25, 442, 162, -87, -42, 79, -302, 32, -26, 222, 364, 129, 111, 237, 20, -40, 42, -10, -36, 77, -132, 126, 39, -147, 197, 18, -282, 70, -138, -351, 157, 4, 125, 142, 76, -21, 217, -120, -192, -175, -88, -26, 128, -24, 43, 107, -116, -189, 4, -223, -102, -176, -199, -6, 203, 180, 43, -207, -175, -17, -168, -47, -70, 58, 160, 267, 95, 51, 58, -81, -135, 14, -154, 128, 106, -31, 92, 31, -39, 136, -9, -139, -34, -82, -117, 156, -53, 50, 304, 75, 22, 112, -118, -41, -60, -49, 122, 271, -101, 236, 241, -137, -76]
3509g6o7o3J63j8J12O8o0J6J6j46l4l5j12K12o3j0J89L6j24J31j48j32J03q3q
3534a33L17l24K61K49l43M1P4l46J56P8j21K14J33k90L52j54k34J72j35k8L02
3555B41l44J45J58j68O6J56l60J6K20m65L38M2p5L5K60l55L3J55k86J58j33J19
3577d4K7j03K18o4o0P2K0l08K14J39l16J23J08p3J98j19j70J12K8j79K17k5n0
3600c5K13j34J16J20l29R0M5m15K75J22m5n1K27m1p8P1k99K44j49p3J14N0l3K95
3624C00k21j00J96m03J78K30m78K2M17k09K2J09j05M5J4j47j03J17nJ87J9j45
3646f0N13m81m0K33l72J30J85j37j47K39j29l2L47k40K4%j99K80m1k57L60m6j23
3669GK12j18j04J27j88n8J78LP1P6j54k0J22j57J2R6k28K34l1j22J72k07OJ67
$$ y = [-76, -143, -206, -43, -61, 51, 119, 59, 75, 91, -55, -89, -124, -236, -24, -87, -97, 92, 128, 4, 135, -13, -145, -42, -125, -133, 184, -140, 121, 370, 27, 68, 142, -204, -48, 30, -91, 123, 256, -34, 318, 164, -70, 102, -33, -61, 241, -103, 42, 200, 32, 98, 254, -106, -90, 130, -335, 3, 45, -30, 5, 265, -90, -57, 98, -188, -30, -163, -44, -17, -120, 98, 34, -26, 46, 66, -242, -28, 111, -205, -82, 26, -47, 151, 32, -138, -26, 2, -177, 40, 15, -35, 178, 44, 160, 280, -49, 41, 86, -329, -54, 68, 23, -28, 199, 158, 80, 151, -148, 96, -53, -126, -12, 38, 5, 300, 79, -21, 175, -228, -50, 180, -298, -276, 141, -68, -46, 63, -42, 3, 17, -130, -233, -116, -121, 66, 85, -60, 453, -28, -68, 165, -207, -77, 108, -29, -176, 63, -66, -98, 249, 9, 33, 33, -166, 114, 73, -184, 176, 130, 7, 219, 101, -3, 124, -64, -122, 56, 59, 130, 206, 52, 32, 154, -3, 9, 105, -123, 111, 80, -42, 130, -77, -71, 96]
3693I6j05k11L18j82j34K32r5R3Lm0J33j60l40L73J37j50J97j59q9K31j85r0K67
3716A40k71K47k6k09P6K35j92K6M1j61N4K52m96L65K02o09L57K00k64K42k21k
3738a4J21k84L2J14J53q3J65k05L9O3l10O9J0R3J98q3q4J61j24p4R0k95J72J68
3762I2qk8K06l57qK99k88PJ39m98M22n6j46J33L2QJ26p8k50K70j90q1L08o6n8
3787g0L89k94k17R0j63K36J72k34R9J98l01K15n0k05K28j82r0K69k06Q4K96j19
3809A45q4J26j96J8n3P3k9J80k05MK02j66K57k60j88K56o6j85J72Pj46K98L5k87
3833i2L27k07k51K46j26l1L6k2J86j9n0m8J20j47J9q5K8K14k22P8J09j29pK24
3857A51k33k53M32j98J29K32k21K24j83n7P7J0k31J82q3RK56j21k1J50j18j46
$$ y = [96, -9, -220, 98, -84, -218, 14, -81, 12, 15, -25, 108, -52, -392, -19, 118, -32, 165, 6, -83, 148, -37, -127, 140, -131, 116, 90, -119, -43, 192, 0, 26, 67, -94, -40, 212, -284, 81, 283, -326, 31, 231, -33, 209, -12, -14, 107, -177, -145, -31, 122, 39, 204, -1, 38, 101, -209, -140, -130, -37, 161, 78, -6, 155, 31, -43, 47, -248, -76, 92, 84, 56, 262, -95, -103, 196, -92, -85, 54, -444, -22, -78, -224, -91, -59, -51, 75, -3, -253, 17, -173, -254, 54, -12, -70, 319, 25, -192, -102, -265, -29, 143, -91, 8, 206, -95, 120, 70, -135, 93, -89, -179, 90, -116, -32, 264, 145, 61, 187, -9, 9, -44, 29, 0, 180, -25, -21, 181, 15, 272, 12, -176, 80, 14, -171, 1, 8, -138, 160, 195, -92, 235, 28, -223, 23, -103, -134, -98, -120, 66, 47, -3, -51, 69, -78, -59, -144, -116, 98, -124, -46, 63, -66, -73, 151, -82, -335, 97, -101, 28, 260, 39, 263, 80, 23, 100, 110, -121, 61, -22, -13, 243, 122, 101, 251, 133, -13]
3879a3J2p1J8Q8k7J97k26O4K1k4k91L68j03K0j28J69k05K73o7l70M92j75j57K10
3903G5j84P4J1K9K2P0l21K82r5j20Q7J82j05J83j95o6J06rl0o8j08N5L51j99k8
3928aJ93J60k00N8j31rq9j87J96J24j44P8K5p2j7Mj66J78r3N9J51mm0O9j34J7
3954B5n2j01K02j11j33J82J01j32J65R4l59K77j59j90L18k43n4L4J72o7M4k04
3976a91J68J12k40p9K69k46J59J14m9J29l0k50J92k02q2M19j52j54R5J23j14Q8
3998G9k07j18L76k57J54P2j33K18p4k44K15P2k19N4l5NK05j76J0M47l15l24J76
4021a9o1o9L12k40J26K14m70L05j00k95K88J23l16K89Oj32J66j92O8J09o3j88
4043a39J87j61j54K40r4N3P5j60Q4q7kK12P9j79R8K9m5K9O9k78K08l9r2K21l03
$$ y = [-13, -1, -72, -54, 34, 7, 204, -22, 42, 63, 39, -252, 116, 13, 33, -95, 74, -131, 142, 75, -295, 197, 22, -135, 75, -109, -35, -24, 5, 27, 97, -224, 58, -37, -157, -70, 112, 7, 190, -5, -71, 35, 26, -4, -72, -180, -125, 226, 27, -1, 192, 352, 152, 210, 79, 70, -19, -206, -10, 114, -30, 48, 73, 1, -16, -12, -178, 0, -93, -34, 117, 113, 73, 142, 8, 25, -27, -128, 74, -37, -170, 12, 113, -19, 146, 240, -119, 158, -1, -191, 127, -116, -170, -136, 36, -31, 13, -191, -23, 89, -151, -230, 39, -207, -48, 66, 17, 146, 116, -134, 58, -144, -226, 193, 41, -113, -18, 105, -9, 79, -128, -246, 130, -127, 27, 99, -34, 184, 110, -134, 81, 153, -66, -12, -47, -42, 163, -13, -3, 444, 129, -195, -19, -80, -149, 163, -77, 49, 263, -207, 98, -2, -297, -9, 114, -202, 87, 93, -39, 127, -65, 3, 112, 49, -139, 48, -113, -267, -27, -121, -68, 7, -153, -69, -156, -158, 54, 133, -46, 52, 81, 36, 65, 134, -144, 64, 25, -67, 154, -149]
4068a49L13j5j14P4M0k27P3j50O9J17J4l1J51j4k67K93k77j64L06m8Q3J89l10
4091d4k8K76k02j83K09j08j5Q1j54P3J58M2l4N1k59j1P9j04mj9J06Q8l0N0R5k72
4117a59J92J0n8o6J37j83J63K56l70K34O0l52J22R2k88L39k16Q3L94k83l1N0j57
4140c1j6r6J28M0J06j05P7J5k73J40O2k94L20k80M9J54j26nJ86m4p5J24j34l37
4164d15M62r7J45l3q0M1J6J09q0j21j76K64P1k00J17J18k15K67k44j3J78k88J34
4187d0J63j78J49M2j38Q4O6k27R4q8M6J88m0KM1j2m5L7j08m7J11k41R7M0r4j1
4213a09K66l61K86k23P6J49j38r0J71J41j92J00j12l8k7J08k3k9q4J18K44l24
4235i1l4J33j71O6p5j8m8K36J0K36k42o4K19l14l8L88j72q7J30j73K22l6mrJ32
$$ y = [-149, 164, 149, 35, 109, 149, -78, -5, -155, -86, 31, 45, 14, 165, 151, -116, 177, -100, -264, 42, -6, 77, 266, -44, -72, 204, 2, -181, 28, -80, -95, -14, -168, -95, 63, 105, 71, 122, -137, -148, -69, -173, -177, -196, -90, -2, -32, 18, 113, -159, 33, 43, -15, -81, 56, -127, 36, 292, -78, 156, 216, -136, -14, 78, -210, 129, -87, -4, 390, 107, 76, 126, -31, -47, -143, -15, 25, 131, 26, 103, 118, -155, -15, 47, -247, 73, -207, -158, -4, -130, -135, 51, 7, -68, 56, -78, -415, 47, -50, 95, 62, -18, 23, 39, 148, 68, -53, -229, 35, 106, -94, 23, 141, -74, 193, -51, -64, 114, -174, -40, 123, -55, 94, 136, -2, 82, 148, -79, 15, -73, -27, 161, 121, 123, 164, 152, 107, 144, 36, -11, 100, -141, -44, -4, -98, -109, 157, -204, 82, -141, -65, 84, -54, -144, 27, 168, -24, 76, -36, -74, -101, 7, -16, -45, -129, -11, 233, -91, -125, 8, -163, -97, -172, -190, -238, -2, 8, 244, 2, -62, 157, -157, -195, 193, 21, -66, 64, -109, 113, 77, 73, 64, 196]
4260A96k06qL3j31K44R0k70K15%j13l8K6Rp0q6J65MKo9R0J7k96M09k99o5J43M4
4287C6J3m7P3l4j77N7oj43J09L90k30j8K9k%k7j79o5J57J69mj90P3J66l5j67N8
4314FJ49k51J40n9Q3P9Q5k70J41M6q1P9k74lJ19j00J67J68j94J14j6k27J09j65
4338a55J9K92j58k47M94k24r7K94m58K29J08j70j93M09k17j1J72k15J69n9j21
4359a39P3p3k2K10m5P1P2l48k4L24k39O2J76j71K22j14P8Q4o3k38J52J4j54L08
4383B16k49K4J80j13K1K2l5JJ6j11RJ19j21Q6P0j47J13Qk30J46p8j08K25j2q0
4408b8J97j36r7J22j38Q3Jm4m9K25k38J94Q1k41n6Q7j23J39J9q8J76j93J66N3
4432A12k46MK15m3j96J30n0Q0lO4j35N9o0O4J00k11L8K30r5K10l9j52M0j07r4
$$ y = [196, -10, -18, 15, -116, 128, 218, -52, 163, 163, 50, 12, 38, 47, -23, -109, 56, 60, 62, -7, 83, 100, -196, 213, -86, -151, -8, 36, 49, 2, 75, 41, -136, -79, -85, -228, -119, 271, 41, 23, 52, 50, 50, 23, -156, -221, -64, 105, 101, -89, -16, 150, 115, -52, 6, 155, -96, 44, -15, 68, 147, 232, -38, 103, 149, 68, 147, -127, -130, -11, -111, 56, 224, 30, 144, 128, -99, 10, -155, -136, 156, -2, -249, 245, 21, -76, 218, -240, -11, 97, -73, -266, 143, -74, -85, 87, -128, 41, -18, -139, -66, -139, -161, 49, 4, 75, 147, -201, -225, 99, -140, -78, 98, -73, 149, 35, 113, 197, 134, -104, 48, 62, -92, 216, -33, -9, 171, 58, 79, 101, 66, 67, 83, -28, -19, 100, -21, 65, 135, -12, 101, 109, -121, 25, -53, -161, 64, 52, -28, 169, 33, -64, 58, -80, 3, 4, -40, -89, 136, -102, 92, 173, -68, -124, -37, -160, -21, -2, -90, 86, -107, 59, 112, -134, -130, 85, 42, -154, -24, -74, 6, 3, 67, -68, -9, -69, -5, 95, -116, -78, 152, 57, 267, 228, 76, 116, 9, -85]
4457h5L92k97j08K67q0K1K2j43P2r3p2J57k1N4q0M1rR9k51K6N8o7PJ59k9m8K52
4484B44j74o2J28k41k07L49j07k5P7j28J93L3j18J12j60j08J22J6J4Q8k5j44K23
4507A00o9j45M28l34j0P4j79K28J21k09P7J18l30K14j62j1P2m1O6o5K75l00L21
4530B39l22J54l9l12K17J93N3j4k14j08L20j42k12J25N0j58J27k5p7K87j68RP5
4553E8L4j45o7m7m8K00p2M3J08j67O2J02m27M50j35j75K44J04j92J35j34J19j45
4576i5K5r6L78k50J99l8o3j96R1p0mK13j78K36q6j02M2R0J12k18K6r6K50j98j22
4601a50M08l47l3J70o0K8K05k41j08J09j3K81k36j00K78j71N8k32J07r0J67j25
4623i5RO9J13j04K0L2j72K13l11J11K45k16K12ok51J50O1jn5m9j24J42j41R9M19
$$ y = [-85, 307, 10, -98, 169, 89, 110, 132, -11, 61, -32, -104, 53, 32, 86, 6, 47, 38, 137, -114, -88, -30, -97, -90, 69, 40, -8, 244, 70, 8, 136, -105, -312, 37, -70, -95, -18, -146, 47, 80, -38, 74, -86, -194, -72, -56, -42, 46, 21, -123, 100, 31, -114, 314, -20, -30, 44, -135, 93, 214, 5, 82, 200, -130, 84, -78, -89, -17, -58, 8, -57, 218, -82, 239, -83, 71, 32, -280, -63, 130, 183, 169, -45, -153, 167, 25, -187, -62, -12, -170, -43, -68, -145, 142, -26, -17, 58, 92, -53, -120, -167, -215, -15, -87, -44, 64, -103, -41, 61, -366, 84, -51, -226, 18, 122, -70, 65, -69, 50, -95, -70, -166, 212, -38, 161, 123, 60, -136, -45, -115, -119, 94, -84, 152, 66, -36, 6, 96, 208, -10, 16, -80, 170, -28, -150, 258, -89, -122, 48, -12, 16, 221, -20, -128, -19, -32, 249, 13, -87, 191, 20, 78, -154, -47, -137, 30, -95, -86, -17, 96, -8, 12, 44, -128, 85, -226, -115, 130, -86, 126, 120, -131, 19, 80, 79, 24, -25, -149, -7, -148, -49, 370]
4648C70m20J51J37l17O4J33j10N7J76k15J12k1r9J57j87j66K69J35l35J82j43
4669g0J02J28q7j19J08k11L36j60j4P2r4N8R5j11k70L7K87r9P1j47oK45l18j9
4693a86K80j63k1J95j85J80k5q4L5N2n7j16K4l4J65q0j79L90k29K68j15k10O0
4716c5J08j45J27P0pj73J39No5P8k85J63k3L0n6k2O3J75j93N9N1j5j93K42l35
4741b37J71J13j75J44l1k8n0M1O2q3K1j8q6J04r7J48o7J65lj36l2j07K36r7Q4
4766D2J2QR0k94J17L9l6k10M20j62J38q7ml4M6j98K47j84J48N4j06kL0p9J0J33
4792A38k06O8J34j81K9P4J12N0p9k38k3R8M2P5j31j78L31n2r0P3QK6r1j51Q0P4
4818hj31K00j31O9Q0j23K6J3rj77K10j02J99j49J28n0L2j25j12J33k6L7O9LN8
$$ y = [370, -50, 101, 238, -79, -15, 118, 8, 65, 241, 26, 138, 117, 18, 175, -12, -178, 91, 226, -109, 73, -70, 32, 160, 73, -46, 62, -149, 187, 27, 13, 85, -9, 49, 144, 33, -237, -200, 87, -12, 59, -88, -94, 151, -167, -186, 94, -69, -90, 105, -80, 100, 75, -9, 26, 78, 21, -95, -71, -105, 60, -20, -199, 191, -38, 230, 115, -95, -35, 73, -72, 55, 125, 118, -55, 84, 89, 24, 102, -183, -20, -43, -13, -69, -91, -28, 147, -46, 13, 64, 49, -144, 98, -237, -66, 47, -128, 16, -15, -43, -93, -52, 10, -73, -52, -70, -156, -52, -149, -1, -68, 97, 94, -42, -74, -181, 55, -42, 42, 54, 62, 152, -142, -25, 14, -22, -232, 188, 26, 164, 77, 73, 39, 85, -113, 134, -50, 98, 152, 46, 44, 74, -5, 5, 138, -68, 0, 134, -47, -18, 56, 168, 218, 139, -99, -122, -24, 18, 93, -38, -216, 115, 63, -27, 46, 54, 80, -11, -162, -82, -8, -139, 61, -70, -1, 79, -44, -18, -5, -14, -191, 19, -83, 116, -33, 95, 45, 77, -48, -160, -27, -53, -16, 53, 56, 114]
4843A14j16M6j6r8O1M6j62M7J31j9Pk7J14k00K41j40j12K51l17J46M6j14j16Q7
4867a00J38j15N1j11J2K24k09M06j39j75J19k11R3q3K04k22K58k19K4J31n1n8
4889c3p7j57K7K34j53J07j10Q0L06k21J14jj84j30J83J49r1J85j48o1J62l38J59
4912BO8q5o9J57K4KJ06k77K11P4j39N4nj55P6o0J19L3Ln0j01m1m1J03o3q7J49
4939HJ23Q5j39k66K31r8j33K18k09N8R1r1JJ06O7j38J98k13N2k7j00K26L2q7J27
4964A22j07lJ7k15J98J35k22P4R7j20O2j07J01k17N23m60K42Q3l59J78J03j43
4986a8L5m8j33Q5L9j06K54k25J46J14k08n1J80j01J09K4j83k2J45p1P3j18K6J4
5010d0q4Q3N2J09k40K40j96J2J08J2j04o8k6K6L1K5J28Rj65N3J84j73K8M2j37
$$ y = [114, -2, 44, 28, -70, -9, 37, -125, -78, 53, 34, 41, 14, 128, -72, 169, 29, -83, 168, -149, -3, 43, -71, -187, -100, 38, -77, -26, -137, -125, 99, -110, 296, 157, -18, 101, -110, -17, -100, 104, -118, 140, -79, -55, 76, 25, -33, -110, -267, -240, -6, -159, -52, -162, -82, 224, 3, 117, 116, -68, -198, -15, 134, 43, 228, 80, 19, 181, -157, 2, 70, -15, -84, 73, 97, 99, 205, -72, 139, 213, 74, 128, 123, -32, 44, -16, 103, 136, 139, 89, -12, -53, -94, 9, -54, -141, 8, 131, 216, 77, -189, 42, -56, -189, 29, -180, -122, -31, -122, -121, -15, 52, -86, 112, -101, -49, -76, -176, 50, 82, -5, 122, 15, 12, 29, -186, 12, 147, -75, -1, 96, -24, 38, -69, 32, -185, 338, -122, 120, 203, -156, 22, 125, -18, 17, -31, -164, -79, -40, -146, 108, -117, 29, 143, -65, -116, 64, -37, 72, 96, -87, -109, 36, -35, 38, -80, -54, -40, -124, -41, 11, 120, -120, 120, -76, -64, 44, 56, -48, -116, -142, -116, -85, -60, 68, 77, -88, -35, 149, -24, 4, 46, -91]
5035i1K77q4m7J97j51l07N15l22n1J29k52P4K48n5p8J43k36j4J21j43N4P4j87
5058a86L23j26J27j53j3l9P6l4j95K82j60L4J91j45p7J37n9Qp8j5k1J37q7k2j4
5083a09O4p0l6J16J15k67J32J0M2p4N6j8N5J01j73m9J47j00L9J67l73L47j68J2
5107c4J60j18N5Qj21J16k2lMP1j5p3o7j47J83Q2k2K6k07k6J98o6j27J54j23M4
5133g0J44j63Q4O3PJ07l32m4J16R0k8k4K13j89Q0j94o5L20m3j05l6R3P4r9O2j05
5159d4J09L7n9k9n6RJ33p1K67q8l37K00R1l23N1J55k23L78l04J10J45o2m6o6J79
5184A56J59j81j48J5%n8O6M6j13J97j09l9J48k95J82N0KJ5l0j36j8J02j5m2J5
5209c1p8Q3q2J5J16n6M7j07nR8k7N9j49N1j58K76L2k15N5N0m6J40R2q7n2J20k61
$$ y = [-91, 186, 102, 55, 252, 101, -206, 309, -13, -64, 65, -187, -113, 135, 80, 2, 145, -91, -105, 16, -127, -73, 1, -186, 137, 11, 138, -15, -28, -67, 9, -25, -220, 62, -98, -64, 127, -18, -95, 42, -17, -9, -87, -102, -123, 14, -73, -95, -109, -45, -115, -151, -35, 80, -187, -55, -45, -3, -77, -21, -39, 16, 117, -56, -105, 42, -58, -19, 148, -225, 122, -46, -34, 126, 8, 63, 71, -50, 66, 44, 41, 45, 116, 101, 28, -39, -186, -3, 79, 57, 83, -124, -150, 48, -18, -145, 9, -114, -70, 74, -89, -5, 58, 65, 172, -160, -204, -88, 2, -26, -50, 163, -26, 54, -140, -205, 115, 72, -33, -69, 24, 98, -1, 61, -44, 65, 102, 43, 14, -42, -33, 100, 29, 296, 208, -129, 71, 162, -161, -110, 45, -178, 200, -104, 6, 151, 89, 43, -23, 156, 315, 134, -14, 1, 1, -57, 9, 55, -58, 139, 30, -9, 139, -156, 26, 76, 78, 93, 63, -73, -91, 11, -4, -46, -31, -109, -26, -108, -93, 23, -33, 14, -93, -98, 0, -27, 32, -117, -66, -224, 52, 84, -131, -76, -26, -72, 68, 160, 73, 21, 141, -120]
5236a20Q5J32k02Q4qj01L8L8J0J24o3R7M9m26L25q2Q7r1K53k90j4L11l41J89R
5261I3j84M7Q4k36L22j20J09J84l80J57Pk19j17K77o7M8k8j79J38l7o8P0J65k22
5285a56K08Q1k53Q2J97j66QR0k56K21J06k55J99J2r4J02l5p1PJ8K5j45J09J3o3
5310a6O6q5M5k7Q7m7j50K00n7L6O5l6k3k9j9j03R3R2r9N9j39N5J19j74OJ79k55
5337a57J60q0K4J28k15J11j01N7k2J21j65J43O6k14J85nj90K40N9k02J58j03j7
5360a9K2j20P3L38l22j0J26L9l16L94r7k11K22j54M4kP0n0j69R9K67j81p2jM1
5385A1l4J01K8n0m3l6q0M20l22j40J79K3N0j91K17oj31k8O7J42n5q8J04k49J90
5410G9k20N5O8R1k38J76p7K64p0j27LJ38k45j2K02j31P4p7n7J85j45L2J10K5q4
$$ y = [-120, -35, 97, -105, -21, -29, -130, -92, -54, -44, 80, 17, 114, 163, -263, 62, -20, 67, -24, 229, -61, -75, 236, -105, 84, 93, -91, -44, 40, -196, 126, 6, 115, 299, -81, 76, 83, -136, -253, 24, -43, 5, -23, -202, -64, -101, -169, -99, 66, -156, 52, 133, -120, -38, 159, -7, 1, 91, -165, 56, 162, -93, 106, 118, 24, 126, 91, 20, 27, 45, 70, -75, 34, 47, -16, 50, -35, 10, -17, 70, 23, -127, 73, 16, 52, 117, 81, 58, 29, 10, -93, 0, 92, -7, 52, -87, -32, 87, -87, -81, 98, -157, 3, -77, -53, 75, -140, -29, -130, -73, -95, 26, -139, 4, 70, -144, 41, 36, -154, 86, 145, -57, 101, -2, -19, 3, -117, -44, 294, -28, -38, 88, 127, -189, 205, 108, -103, 119, -35, 9, 7, 77, 27, -142, -43, 224, 43, -29, -30, 11, -23, 78, 106, 56, 13, -23, -103, 317, -5, -145, 34, 57, 107, -84, 133, 127, -4, -32, 35, 177, 122, 34, 138, -111, 79, -141, -86, -18, 73, -165, 11, -66, 198, 128, 1, 4, 142, -103, -115, 87, -44, 30, -47, -104, 81, -64, -32, 78, 103, 19]
5435A9N7K0lo9oP3PJ2Rj77K9q8L13l53J87J78l36J38J4j13K10j62k9K5r6R8J24
5462H1k97Q0P2r4k2K50j83J55m4l3J56j81m8J5J72j64nJ46j80P2L6j30J08p9K37
5487A20l9k55J67P9p7LQ6k52J65L8j48J39j11R6Q4o1k7R6J42k36J65l20J28Q7
5511F9k81qL34k46J01J07k29K29L6l02L07j56j03J80j72R4J28k94K11P8j78k3
5533a18K9L2j29J78p2K8J29k76K96lj24P9j62J23L3k2Lrn1pl2m5M2N3j38O9J50
5560E6k38J34J38j80K12p5j74J99k81K31J02k04J49J07l14K6J58j49j1J58K8p8
5582fO8k5j28N4n4J92j0p6J71k39K1J09k6j68J37j17L8L7m4k3R4K8p0J41l7m6
5608B1j6j50J60k0j59J49L2k19L61p2l02L82j71PM9J0j76K01j13P7J3j04K83k19
$$ y = [19, 76, 96, 93, 24, 18, 91, 98, 110, 119, -58, -29, -117, 196, -157, 30, 208, -128, 10, 24, -89, 121, -41, -70, -45, -141, -43, 81, -216, -136, -64, -158, -180, 70, -113, 42, -2, -35, 121, -60, -108, -93, 79, -85, -90, 56, -124, -52, -16, -146, -38, -117, 120, 81, -174, -7, 72, -5, -2, 84, -168, -3, 35, -113, 26, -85, 11, 95, 34, 7, 103, 245, 9, 174, -146, -18, 69, -212, -220, 114, -132, -31, 76, -153, 76, 112, -190, 117, -39, -142, 38, -134, -40, 88, -206, 5, 83, -95, -118, -89, -57, -186, -8, -80, -52, 77, -199, 97, 94, -30, 49, -113, 10, 43, 21, 24, 15, -36, -43, -75, -120, -78, -25, -163, -94, 56, -182, -48, 90, -90, 122, 47, -127, 72, -209, 22, 124, -80, 69, 176, -138, -112, 46, -103, -114, 44, 72, -6, 62, 37, -91, -37, -91, 101, 91, 15, 186, -53, -32, 77, 51, -117, 20, -97, -59, -22, -66, -89, 5, 33, -37, 104, 67, 21, 5, -145, 15, -5, -164, -15, 17, -202, 159, 87, -215, 167, -4, 3, 52, 62, -114, 87, -26, 51, 64, -40, 243, 24]
5632B4j49O9J19j11J64m2K4k1j45LJ96j45p7J61K6J97l34J52r9m9j14K29l6pR9
5657A34q1j54J58m3R9R0k80L2o7L4O0J77l03O1J66j44O6l2M2N7j55p8K66k06R9
5682bJ62N4j69j37K22n9m0j38l1J80m3q2J70j68J51r2J96j55Pj42J25NP4P4r8
5707F4j17J72r2r8P2M9k72J59P7PJ03k00P8L7j75K01O2j90Q0k3Q3j1k32j37K98
$$ y = [24, -125, -56, 63, -48, 116, 74, 98, 77, -68, -65, 131, -14, -91, 70, 96, 293, -41, 111, 12, -37, -151, 78, 42, 35, 134, 53, -101, 57, 14, 113, 203, -77, -45, -112, -78, -18, 159, -144, -83, 83, -61, 5, -27, 15, 72, -83, -161, 105, -101, -2, 160, 214, 45, -92, 130, 71, 31, -107, -138, 42, -1, -83, 87, -81, 70, -22, 174, 19, 26, -116, 9, 14, 88, 162, 64, -53, 119, 27, -71, 1, 50, -222, -63, 14, 21, 124, -76, 2, 39, -136, 65, 127, -63, 17, -6, 77, 66, -166, -303, -5]
$$ [...]
8191c4
##END NTUPLES=NMR FID
##END=
