##TITLE=1H_Ser DHA-N-2
 CDCl3,8 sc, 
 21.9.2021
##JCAMPDX= 6.0         $$ Bruker NMR JCAMP-DX V2.0
##DATA TYPE= NMR FID
##DATA CLASS= NTUPLES
##ORIGIN= UXNMR, Bruker Analytische Messtechnik GmbH
##OWNER= root
$$ XWIN-NMR		Version 3.5
$$ Tue Sep 21 09:24:45 2021 Russian Standard Time (UT+4h)  she@DPX200
##.OBSERVE FREQUENCY= 200.1314
##.OBSERVE NUCLEUS= ^1H
##.DELAY= (6, 6)
##.ACQUISITION MODE= SIMULTANEOUS
##.ACQUISITION SCHEME= undefined
##.AVERAGES= 8
##.DIGITISER RES= 18
##SPECTROMETER/DATA SYSTEM= spect
##.PULSE SEQUENCE= zg30
##.SOLVENT NAME= CDCl3
##.SHIFT REFERENCE= (INTERNAL, CDCl3, 0, 15.7039)
##AUDIT TRAIL= $$ (NUMBER, WHEN, WHO, WHERE, WHAT)
$$ ##TITLE= Audit trail, XWIN-NMR		Version 3.5
$$ ##JCAMPDX= 5.01
$$ ##ORIGIN= Bruker BioSpin GmbH
$$ ##OWNER= she
$$ F:/spectra/data/she/nmr/H-F/1/audita.txt
$$ ##AUDIT TRAIL=  $$ (NUMBER, WHEN, WHO, WHERE, WHAT)
(   1,<2021-09-21 09:23:06.31 +0400>,<she>,<DPX200>,
      <created by zg, POWCHK disabled, PULCHK disabled
       configuration hash MD5:
       00 E9 B6 7A A2 85 ED C7 34 08 36 98 17 FE 4E 26
       data hash MD5: 16K
       F8 24 BD A8 27 8F 2D A5 27 8D 3C 6A F6 CB E3 12>)
$$ ##END=
$$ 
$$ hash MD5
$$ 25 45 A4 DC 25 B9 2E 14 2A 29 A6 E4 A6 FC FA F2
##$RELAX= 
##$RELAX= 
##$RELAX= 
##$RELAX= 
##$RELAX= 
##$RELAX= 
$$ Bruker specific parameters
$$ --------------------------
##$DU= <F:/spectra>
##$EXPNO= 1
##$NAME= <H-F>
##$PROCNO= 1
##$TYPE= <nmr>
##$USER= <she>
##$AMP= (0..31)
100 100 100 100 100 100 100 100 100 100 100 100 100 100 100 100 100 100 
100 100 100 100 100 100 100 100 100 100 100 100 100 100 
##$AQSEQ= 0
##$AQ_mod= 1
##$AUNM= <au_zg>
##$AUTOPOS= <>
##$BF1= 200.13
##$BF2= 200.13
##$BF3= 200.13
##$BF4= 200.13
##$BF5= 200.13
##$BF6= 200.13
##$BF7= 200.13
##$BF8= 200.13
##$BYTORDA= 1
##$CFDGTYP= 0
##$CFRGTYP= 5
##$CHEMSTR= <none>
##$CNST= (0..31)
1 1 145 1 1 1 1 1 1 1 1 1 1 1 1 1 1 1 1 1 1 1 1 1 1 1 1 1 1 1 1 1 
##$CPDPRG= <>
##$CPDPRG1= <>
##$CPDPRG2= <>
##$CPDPRG3= <>
##$CPDPRG4= <mlev>
##$CPDPRG5= <mlev>
##$CPDPRG6= <mlev>
##$CPDPRG7= <mlev>
##$CPDPRG8= <mlev>
##$CPDPRGB= <>
##$CPDPRGT= <>
##$D= (0..31)
0 1.2 0 0 0 0 0 0 0 0.06 0 0.03 0 0 0 0 0.0002 0 0 0 0 0 0 0 0 0 0 0 0 
0 0 0 
##$DATE= 1632201785
##$DBL= (0..7)
120 120 120 120 120 120 120 120 
##$DBP= (0..7)
150 150 150 150 150 150 150 150 
##$DBP07= 0
##$DBPNAM0= <>
##$DBPNAM1= <>
##$DBPNAM2= <>
##$DBPNAM3= <>
##$DBPNAM4= <>
##$DBPNAM5= <>
##$DBPNAM6= <>
##$DBPNAM7= <>
##$DBPOAL= (0..7)
0.5 0.5 0.5 0.5 0.5 0.5 0.5 0.5 
##$DBPOFFS= (0..7)
0 0 0 0 0 0 0 0 
##$DE= 6
##$DECBNUC= <off>
##$DECIM= 32
##$DECNUC= <off>
##$DECSTAT= 4
##$DIGMOD= 1
##$DIGTYP= 9
##$DL= (0..7)
0 120 120 120 120 120 120 120 
##$DP= (0..7)
150 150 150 150 150 150 150 150 
##$DP07= 0
##$DPNAME0= <>
##$DPNAME1= <>
##$DPNAME2= <>
##$DPNAME3= <>
##$DPNAME4= <>
##$DPNAME5= <>
##$DPNAME6= <>
##$DPNAME7= <>
##$DPOAL= (0..7)
0.5 0.5 0.5 0.5 0.5 0.5 0.5 0.5 
##$DPOFFS= (0..7)
0 0 0 0 0 0 0 0 
##$DQDMODE= 0
##$DR= 18
##$DS= 0
##$DSLIST= <SSSSSSSSSSSSSSS>
$$ [...]
##$SUBNAM2= <"">
##$SUBNAM3= <"">
##$SUBNAM4= <"">
##$SUBNAM5= <"">
##$SUBNAM6= <"">
##$SUBNAM7= <"">
##$SUBNAM8= <"">
##$SUBNAM9= <"">
##$SW= 20.0188988654967
##$SWIBOX= (0..15)
0 0 2 0 0 0 0 0 0 0 0 0 0 0 0 0 
##$SW_h= 4006.41025641026
##$TD= 16384
##$TD0= 1
##$TE= 0
##$TE2= 300
##$TE3= 300
##$TEG= 300
##$TL= (0..7)
0 120 120 120 120 120 120 120 
##$TP= (0..7)
150 150 150 150 150 150 150 150 
##$TP07= 0
##$TPNAME0= <>
##$TPNAME1= <>
##$TPNAME2= <>
##$TPNAME3= <>
##$TPNAME4= <>
##$TPNAME5= <>
##$TPNAME6= <>
##$TPNAME7= <>
##$TPOAL= (0..7)
0.5 0.5 0.5 0.5 0.5 0.5 0.5 0.5 
##$TPOFFS= (0..7)
0 0 0 0 0 0 0 0 
##$TUNHIN= 0
##$TUNHOUT= 0
##$TUNXOUT= 0
##$USERA1= <user>
##$USERA2= <user>
##$USERA3= <user>
##$USERA4= <user>
##$USERA5= <user>
##$V9= 5
##$VALIST= <valist>
##$VCLIST= <CCCCCCCCCCCCCCC>
##$VD= 0
##$VDLIST= <DDDDDDDDDDDDDDD>
##$VPLIST= <PPPPPPPPPPPPPPP>
##$VTLIST= <TTTTTTTTTTTTTTT>
##$WBST= 1024
##$WBSW= 4
##$XGAIN= (0..3)
0 0 0 0 
##$XL= 0
##$YL= 0
##$YMAX_a= 310063
##$YMIN_a= -543992
##$ZGOPTNS= <>
##$ZL1= 120
##$ZL2= 120
##$ZL3= 120
##$ZL4= 120
##$ABSF1= 10
##$ABSF2= 0
##$ABSG= 5
##$ABSL= 3
##$ALPHA= 0
##$AQORDER= 0
##$ASSFAC= 0
##$ASSFACI= 0
##$ASSFACX= 0
##$ASSWID= 0
##$AUNMP= <proc_1d>
##$AZFE= 0.1
##$AZFW= 0.1
##$BCFW= 1
##$BC_mod= 2
##$BYTORDP= 1
##$COROFFS= 0
##$CY= 11.3945322036743
##$DATMOD= 1
##$DC= 2
##$DFILT= <>
##$DTYPP= 0
##$F1P= 2.36226072786647
##$F2P= -0.459571619588291
##$FCOR= 0.5
##$FTSIZE= 0
##$FT_mod= 4
##$GAMMA= 1
##$GB= 0.15
##$INTBC= 1
##$INTSCL= 1
##$ISEN= 128
##$LB= 0.24
##$LEV0= 0
##$LPBIN= 0
##$MAXI= 10000
##$MC2= 0
##$MEAN= 0
##$ME_mod= 0
##$MI= 1.114404
##$NCOEF= 0
##$NC_proc= 0
##$NLEV= 6
##$NOISF1= 3.799351
##$NOISF2= 2.8
##$NSP= 1
##$NTH_PI= 0
##$NZP= 0
##$OFFSET= 15.70392
##$PC= 1
##$PHC0= -14073.73
##$PHC1= 11.8009
##$PH_mod= 1
##$PKNL= yes
##$PPARMOD= 0
##$PSCAL= 0
##$PSIGN= 0
##$REVERSE= no
##$SF= 200.130013532006
##$SI= 16384
##$SIGF1= 3
##$SIGF2= 2
##$SINO= 400
##$SIOLD= 16384
##$SREGLST= <1H.CDCl3>
##$SSB= 0
##$STSI= 0
##$STSR= 0
##$SW_p= 3612.71676300578
##$SYMM= 0
##$S_DEV= 0
##$TDeff= 0
##$TDoff= 0
##$TI= <>
##$TILT= no
##$TM1= 0
##$TM2= 0
##$TOPLEV= 0
##$USERP1= <user>
##$USERP2= <user>
##$USERP3= <user>
##$USERP4= <user>
##$USERP5= <user>
##$WDW= 1
##$XDIM= 8192
##$YMAX_p= 0
##$YMIN_p= 0
$$ End of Bruker specific parameters
$$ ---------------------------------
##NTUPLES= NMR FID
##VAR_NAME=  TIME,          FID/REAL,        FID/IMAG
##SYMBOL=    X,             R,               I
##VAR_TYPE=  INDEPENDENT,   DEPENDENT,       DEPENDENT
##VAR_FORM=  AFFN,          ASDF,            ASDF
##VAR_DIM=   8192,          8192,            8192
##UNITS=     SECONDS,       ARBITRARY UNITS, ARBITRARY UNITS
##FACTOR=    0.0002496,     1,               1
##FIRST=     0,             0,               0
##LAST=      2.0444736,     0,               0
##MIN=       0,             -543992,         0
##MAX=       2.0444736,     310063,          0
$$ Real data points
##PAGE= N=1
##DATA TABLE= (X++(R..R)), XYDATA
0@%%%%%%%%%Qj6J6j6J6k4L2m0N6o5P4r0J13j36J60j90K22k57K97l44L94m51N15
32B74n85O64p52Q47r52J069j198J338j490J655j836K037k256K494k755L038l348
49a756L690m065M480m937N443o010O648p371Q196r151J0271j1601J3219j5234
63h178J7821k1290K6212l3795M7153p7669K80728L3173m56540j15975p7815Q8951
75b97224J59753K06801Q6573O7169K5082m1722j68737j44776r9652j1636J17159
86a01210J69559L301p0142J369M3484Q042K6373J6533o0647j22032m3451L5622
98i3199O831L19Q4362J02757P3448K9593q2796j77009j28219l4536L2466J01093
110h4890J57147J12066q592n6132k8514q5777j52098o6862N2604R2540J12244
$$ plain form
0 0 0 0 0 0 0 0 0 0 0 8 -8 8 -8 8 -16 16 -24 32 -33 41 -49 64 -72 88 -102 120 -137 160 -184 210 -241 274
32 274 -311 353 -399 448 -504 565 -633 705 -785 870 -966 1071 -1185 1309 -1446 1592 -1756
49 -1756 1934 -2131 2349 -2588 2855 -3155 3493 -3878 4318 -4833 5438 -6163 7056 -8178
63 -8178 9643 -11647 14565 -19230 27923 -49746 230982 264155 -192385 -308360 -386175 -297224
75 -297224 -137471 69330 155903 223072 248154 206432 37695 -107081 -206733 -218369 -101210
86 -101210 68349 71650 1508 2877 46361 54403 80776 97309 36662 -85370 -128821 -93199
98 -93199 -86368 -86049 -1687 101070 174518 204111 121315 -55694 -183913 -218449 -185983 -84890
110 -84890 72257 184323 175731 119599 91085 5308 -146790 -213652 -161048 -68508 43736
121D3736R0288J0359m3976n2945n3229n1509k5699R204M724R165P3593P5923j6038
134G3596l4736R023j0108m0600k7173j9247k7898j3963L9352P9944N9825K4203
146A12218p953n3296n9780m3793o0932l1063O1194R2652O0159L8937J9645k9179
158I8809q4050q1079k7885r506n03N1778P7688N9900L4235j9932o4884m9974k8565
171d3968k8160j4121J5231L9105L6845L3415M7987J6729n0790n7744k6464k1674
183e3609j6690k764J1756M4175O1751M6229J4724k5691n6767o6185n1477J255
195i3293L9814K1513K2419N7148N0154O044l4784o0725n8483l9818q725L6384
207f2352N5121L9206K6058J1474K338j0923n2350o6344k1723J3299J7980K8706
$$ plain form
121 43736 134024 144383 100407 47462 -5767 -57276 -82975 -73771 -69047 -59882 13711 89634 73596
134 73596 38860 47883 37775 -2825 -29998 -49245 -77143 -91106 -51754 28190 88015 112218
146 112218 104265 50969 -8811 -52604 -113536 -144599 -83405 9247 69406 108343 127988 98809
158 98809 14759 -66320 -94205 -103711 -104214 -52436 25252 85152 119387 99455 34571 -15403 -43968
171 -43968 -72128 -86249 -71018 -31913 4932 38347 86334 103063 52273 -5471 -31935 -53609
183 -53609 -70299 -73063 -61307 -17132 44619 90848 105572 79881 23114 -43071 -94548 -93293
195 -93293 -53479 -31966 -9547 47601 97755 103799 69015 8290 -50193 -90011 -98736 -62352
207 -62352 -7231 31975 58033 69507 71845 60922 8572 -57772 -79495 -66196 -48216 -19510
219a9510L7044L2557J1516r130m813j4452n2259n4751j7582K1744M6725L8099
231A5188K1107K8340J6196k2245m1726m5314l9404k3831L434M9447P2561L8633
243G2386L452q303k5473l9642m4694l6475p97K7476L3469M4737M0899J0017k1954
256E5098l7671k8762j4568k5709j8566K2484M0998L0404K0338J1304M843j5756
268D4437m4806l8346j2953n692M419K3728M3275M7980J2231k2163j8029k1263
280A2818m2007m0783j2836K4433M6157M1590L4297K0733k1191m6915l9008k6567
292d9279j1537j308J3012M3424N0144J8759l613j6924l1695l4833k8173l116K0622
305c4517J0291O862L2843L7214J0041k0297l3723k1727j2901k1527q509J6668
$$ plain form
219 -19510 17534 50091 61607 52477 47664 33212 -19047 -73798 -91380 -69636 -22911 15188
231 15188 36295 64635 80831 58586 16860 -28454 -67858 -91689 -88255 -38808 33753 72386
243 72386 75838 67535 42062 2420 -42274 -78749 -79546 -52070 -18601 26136 67035 77052 55098
256 55098 17427 -11335 -25903 -51612 -70178 -47694 -6696 23708 44046 55350 60193 44437
268 44437 -369 -38715 -51668 -57360 -52941 -29213 14062 62042 74273 52110 34081 12818
280 12818 -29189 -69972 -82808 -58375 -12218 29372 63669 84402 63211 16296 -22712 -49279
292 -49279 -60816 -62124 -49112 -5688 44456 63215 59602 42678 10983 -23850 -52023 -55139 -34517
305 -34517 -24226 -17364 15479 52693 62734 42437 8714 -13013 -25914 -47441 -55950 -39282
317c9282K5764K9505K7249J9959O285l0400n8514l6730n982O837J7620K7200L8958
330B8469L7559P120j7850k9819m7010m1756r326K0622L7180L0532J4097J8318
342D8136J3151j5597l4409l5995k4863o249P524K6233M1824K0621o198l109J694
355C2763q174k8019l8555j5296J2990J6826K2177L1007K2498M807j5989k5059
367A1976j8414k5578l1699k541L1103M1271L3722J4615J704j0906l5762l9820
379c0329k0627p275P373K5687L7069L8691J3816j9923k3420j8819k5532k1692
391d4981o734J2760K8584K2777J7882J9781L92k3691k8039k0876j0047n833o752
404d4777J5785L8489K9610J0708k559j5257k3872l1957k5814K251J4488J2364
$$ plain form
317 -39282 -13518 15987 43236 63195 69480 39080 -19434 -56164 -62146 -55309 -37689 -10489 28469
330 28469 66028 73148 55298 25479 -21531 -63287 -72613 -51991 -14811 15721 29818 48136
342 48136 61287 45690 11281 -24714 -49577 -55826 -48302 -22069 19755 40376 34178 31069 32763
355 32763 24589 -3430 -41985 -57281 -44291 -27465 -5288 25719 48217 53024 37035 11976
367 11976 -6438 -32016 -63715 -66256 -35153 6118 39840 54455 56159 45253 9491 -30329
379 -30329 -50956 -58231 -50858 -25171 11898 50589 64405 44482 21062 2243 -23289 -44981
391 -44981 -51715 -38955 -10371 12406 30288 50069 50461 26770 -1269 -22145 -32192 -38025 -44777
404 -44777 -28992 9497 39107 49815 47256 31999 8127 -23830 -49644 -47393 -32905 -20541
416b0541K3234L1144K1751j101k8263l1694j9041j8932j1121J3011K8734L0867
428A8048J9770O346K850j4643l9637l2415o835N547J0233J5323K6476L1488Q612
441E1163j4362j6765k2914k8124j7388J869K1992K5127J1597J3709J9780J152
453D6836k2337l1236k4553r484k477Q378L0997L1038J0080J367j957j0067k4793
466A792l6354k0395J1534K2342K1948K2508J5447N864j2103k4265j5921j2587
478b0190k0920p408J8584L1377K6806R815o44m046j8910k7581j7091q807o00J0497
492b9118K1551L1264K3991m758j8902j5119j8641k2254j3978N037K3551K1061
504C685J4691J9870Q454j7573k8175k2553q632N06j762O639K5921K5409J1458
$$ plain form
416 -20541 2693 33837 55588 54487 26224 -5470 -24511 -43443 -54564 -41553 -12819 18048
428 18048 37818 44164 47014 32371 -7266 -39681 -46516 -40969 -30736 -15413 11063 42551 51163
441 51163 36801 20036 -2878 -31002 -48390 -46521 -24529 598 12195 25904 45684 46836
453 46836 24499 -6737 -31290 -40774 -43251 -34873 -3876 27162 37242 38609 36652 26585 1792
466 1792 -34562 -54957 -43423 -21081 867 23375 38822 44686 32583 8318 -7603 -20190
478 -20190 -41110 -48518 -29934 1443 28249 38064 37420 33374 14464 -13117 -30208 -39015 -39615 -29118
492 -29118 -7567 23697 47688 42930 24028 8909 -9732 -31986 -45964 -40927 -17376 3685
504 3685 18376 38246 46700 29127 952 -21601 -30233 -29727 -31489 -24850 1071 26480 37938
517C7938k722j0473j3957k2822k4933j456J4751J0081J2968K1003J6700L680j3864
530B6894k2184j8699j6685p774Q763J6735K0160J6417O810M061j903k4468l0060
543b1933j3703j84P689J3328K1357K4757O722j0585r946j3108j9385j6197q305
556c9493Q667K4287J8179Q601Q521M087r636k3315k2289o142j263j559J6105K6516
570A1266J4691M569j575r344j3927k0812j8866l323R665J8617K0395J4993J0113
583C6462l301k1696j7571o360j1937j0702P446K1327K1174J0531L344J702j0832
596A9587k2252j6498r023l6P866R473J5959K4981R371j2202j6666j4258j2621
609a6319j3162m517J3994J8431J0872J3040J0445m824j4698k0438j7442k892K637
$$ plain form
517 37938 35216 24743 10786 -12036 -36969 -38425 -23674 -13593 -625 20378 37078 40758 26894
530 26894 4710 -13989 -30674 -38448 -29685 -12950 7210 23627 30437 34498 32595 8127 -21933
543 -21933 -35636 -35820 -28131 -14803 6554 31311 38033 27448 17502 4394 -14991 -31188 -39493
556 -39493 -30826 -6539 11640 20241 28762 32849 23213 -102 -22391 -28533 -29796 -31355 -15250 11266
570 11266 25957 30526 28951 19607 5680 -15132 -33998 -37321 -27656 -9039 11356 26349 36462
583 36462 33161 11465 -6106 -12466 -24403 -35105 -27659 -6332 14842 25373 28717 30419 19587
596 19587 -2665 -19163 -28186 -28222 -20356 -10883 5076 30057 39428 27226 10560 -3698 -16319
609 -16319 -29481 -33998 -20004 -1573 9299 22339 32784 27960 13262 -7176 -24618 -27510 -24873
622b4873M553J3708J9198J4037J204q806p736j1916k1642j0558R466J0369P956
635e040J1807J3540J0272m457j6569j5112j1703r589j966Q363J9026J9790L857
648B2219n92M405q814k3614j7701m550N020P817J1859K0928J5288l946j1273j1668
662E378j2430j0471r750j51J7697J7627N502N982N622l898j5606j7352n216M47
676a6619n205L768J6218J4533Q426K810n108p364j4524j9346p632O319J0683J1633
690a408J2109J3892P178j2263j7807r992j1744j1352L252J6696K0389J2072N31
703B1553l33l248j3999j7353j1108J54Q962O445Q857J7605J0257o941j0479p254
717C118q048j1326j0832M633J5930J2254R407P308O0o423j3002j3701n497k915
$$ plain form
622 -24873 -20320 -6612 12586 26623 27827 19021 11285 -631 -22273 -32831 -23365 -12996 -5040
635 -5040 6767 20307 30579 26122 9553 -5559 -17262 -26851 -28817 -20454 -1428 18362 22219
648 22219 21627 26032 17218 -6396 -24097 -28647 -23627 -15810 -3951 16977 32265 28319 17046 5378
662 5378 -7052 -17523 -27273 -27424 -9727 7900 13402 19384 25006 21108 5502 -11850 -17066 -16619
676 -16619 -21824 -18056 -1838 12695 21121 23931 18823 11459 -3065 -22411 -30043 -23724 -13041 -1408
690 -1408 10701 24593 31771 19508 1701 -8291 -20035 -31387 -28135 -11439 8950 21022 21553
703 21553 21220 17972 3973 -13380 -24488 -24334 -15372 -8927 -70 17535 27792 20851 10372 3118
717 3118 -4930 -16256 -27088 -22455 -6525 5729 15136 22444 22504 16081 3079 -10622 -16119 -19034
731a9034m421P887J9628J6200O003m257p342j0180j7473j1767K805O573O482J0781
745A885J3873J2464j420j7763j6181o435m085k796K929J1368J4561O367R24L958
759A9649m277j5453j5117p490L182P645N613Q282J2123O486j087p030j1311j0623
773i408j1053n602R909J4247P929P956P740Q9q657j5622j1775l752k298L777J2854
788c666J3185Q928J698n103l235o890j7358j2357K522J0755J1057P513Q291Q385
802B3725m395j3249r531p983q133k791N771J4714J5949M874j715k344o568j1119
816b795j2216o969L303N971P354J5256J2607j530q114q835p718q646r402r96J1396
831a1334J2203R017P957K976l580j1653j5635p059J322j080L291J2522J5089Q367
$$ plain form
731 -19034 -23455 -15568 4060 20260 26263 22006 14664 4484 -12989 -24756 -21951 -15378 -8896 1885
745 1885 15758 28222 26802 9039 -7142 -13577 -17662 -20458 -17529 -6161 8400 14767 15691 19649
759 19649 15372 -81 -15198 -22688 -19506 -11861 -6248 2034 14157 20643 19556 12526 1215 -9408
773 -9408 -20461 -26063 -16154 -1907 6022 13978 21718 21807 13150 -2472 -14247 -17999 -20297 -16520 -3666
788 -3666 9519 18447 20145 15042 11807 4917 -12441 -24798 -22276 -11521 -464 7049 15340 23725
802 23725 19330 6081 -3450 -11433 -19566 -22357 -16586 -1872 14077 18951 17236 14892 8324 -2795
816 -2795 -15011 -21980 -18677 -12706 -5352 9904 22511 20981 12867 4032 -3686 -12332 -21734 -22730 -11334
831 -11334 869 9886 17843 20819 17239 5586 -10049 -17108 -15786 -16866 -13575 -1053 14036 22403
845B2403m437q567m677q157j1304l852L099O626Q894Q448J0280N583q878j5529
859f8r099m345j526m12M526J3023J0525K581K792o80j1574j5416j0167R62P705
874a1173M311N057J1788R253k42o758j0379q574q463p804N370J4235Q710M524
888I855M022K948k543j2592j3147m114n63N07P439J1965R723L780m386l773l986
903E135j1174j1846j683O577R664O908N580Q403J697r434j0284p116p182l307
917a8062J938J0813J5239O959j128k349m899q453j0077p026K034O177M184Q975
931D325J0956K614n142p813o625n378p055l871P217R923O230N148L306N55n161
946I229j2612q688l12o59J86P065J1591R716L72o959l451m377j0196p317J38N793
$$ plain form
845 22403 17966 9399 4722 -3435 -14739 -18591 -15492 -8866 28 8476 18756 24339 15461 -68
859 -68 -9167 -13512 -15038 -15450 -10924 2099 12624 15205 17997 17317 5743 -9673 -19840 -18878 -11173
874 -11173 -6862 -1805 9983 19236 18994 12236 1857 -6717 -15180 -22984 -17614 -3379 5331 9855
888 9855 13877 16825 14282 1690 -11457 -15571 -16134 -15627 -8188 3777 13500 17280 12894 9121 5135
903 5135 -6039 -17885 -19568 -12991 -3327 3581 9161 17564 19261 9827 -457 -7573 -14755 -18062
917 -18062 -16124 -5311 9928 16887 15759 13410 8511 58 -10019 -17045 -15011 -8834 -4650 4325
931 4325 15281 17895 12753 4940 -1685 -7063 -14118 -17989 -10772 -849 5381 10529 13835 14390 9229
946 9229 -3383 -12071 -12383 -13042 -12856 -5791 5800 15516 15888 8929 5478 1101 -9095 -16412 -16274 -10481
962a0481R931P124N656N041m042j0486q111m284j970q34J004Q963J1415M221J402
977A4549j439q077r470p187j179M459K142J521Q127R312M107l780q006o960n672
992g553p610j167Q633R002N223L841L519J591o866j4923q491L11K916M844O012
1007g18P893O961j074n352l440o919r486m047L408R274O655K341M169K595l953
1022H307o324n512n616l665p48N265J2050P215j384j350j83k876p609r183k211
1037a3824M498K761N031J0183O480j293p458o996j942l523o773j135P495Q922
1051B426O997L006N13j810r882j0088k144J378N64L736O984Q602L389m121m060
1066E490l214p093o343j338M017O734L383L005O712K018p120q066m201j624k151
$$ plain form
962 -10481 -550 6574 12230 17271 13229 2743 -5368 -9652 -11622 -12456 -11452 -2489 8926 13147 14549
977 14549 13110 5033 -4437 -11624 -12803 -8344 -6202 -4681 3446 12758 16865 13085 5079 -1881 -7553
992 -7553 -15163 -16330 -7697 1305 6528 10369 13888 15479 8613 -6310 -14801 -14490 -11574 -6730 -718
1007 -718 7175 14136 13062 7710 4270 -2649 -12135 -16182 -12774 -3500 3155 5496 9665 12260 8307
1022 8307 1983 -3529 -9145 -12810 -13558 -8293 3757 10972 9588 8238 8055 5179 -2430 -11613 -13824
1037 -13824 -9326 -6565 -1534 8649 15129 13836 6378 -618 -2560 -6083 -12856 -13991 -6496 2426
1051 2426 9423 12429 12942 11132 1250 -8838 -10982 -9604 -9040 -5304 1680 10282 13671 9550 5490
1066 5490 2276 -4817 -11160 -12498 -8481 -1747 1636 4641 11353 13371 6251 -1815 -6016 -7640 -9791
1081i791k589N254J1248N241O51L63k221o078r397o735K090N473K113M944Q419
1096H985M476j379p292o604l049n182l535M867P854N407L193J823K203k988j0216
1111a437p254m30K98J087M166O903P754N94m169k071m213p420n006L90M946O046
1127A84K176L498N604K16o159p173n654k706r29J750Q553P831N36j28K33j974
1143E858n094q322n158K788L695L911O643N072J282l386o432k011j381o577l181
1158a2293L923O750P176K992P05J01m871p494l806j156n15J618L305P661P280
1173A1376k65l965l452n459n831k372J527M974L738K100N719L752l388o271n465
1188c282k851j054j567J137P766O849K160k01j656l070o581p908o79M554K592
$$ plain form
1081 -9791 -12380 -7126 4122 9363 10014 10377 8156 2078 -7319 -14054 -11964 -6491 -4378 566 8985
1096 8985 13461 12082 4790 -1814 -4863 -10045 -13580 -8713 -859 4548 7741 9564 11767 8779 -1437
1111 -1437 -8691 -9121 -8823 -7736 -3570 3333 11087 11681 7512 5441 1228 -6192 -11198 -10808 -5862 184
1127 184 2360 5858 11462 11678 5519 -1654 -7308 -10014 -10943 -9193 -640 7191 7727 7599 7832 5858
1143 5858 764 -7558 -12716 -9928 -6233 -2322 4321 9393 10675 7289 857 -1154 -2535 -9112 -12293
1158 -12293 -8370 -1620 5556 8548 9253 9354 4483 -3011 -6817 -7973 -8488 -6870 -3565 4096 11376
1173 11376 11111 7146 3694 -1765 -7596 -9968 -8441 -3467 271 2371 8090 11842 8454 2183 -3282
1188 -3282 -6133 -7187 -8754 -7617 149 6998 9158 8957 7301 4231 -2350 -10258 -10937 -6383 -3791
1203c791K597N194M483K650l397o747m521l939l399J572M797N831M659J006J208
1218H203N34o187p785l412m44P72K700N531P585L500l291k932k434n520n199k960
1234a1339L424P223L303R10M970K365l350p443o378n50M58j249K983P907M325
1249G559N58n48j314k927o905p217M28M275M497M338L602K346p23m327l102k008
1265a468n473m892K669P057P019K450m74M58k092o657m249r61o87K80K131O274
1281A385Q375P08n750l925j438k551l618k893L137O010K253L677M516j298n343
1296C245o287k870J011r17j318L975O256M228J518j347k999n011o477k017L572
1311e438K283J127L429N437L774k280o486m261k445l613N25M391M707K895L29
$$ plain form
1203 -3791 -1194 4000 8483 11133 7736 989 -3532 -7471 -10870 -9298 -4501 1330 5989 6995 8203
1218 8203 8737 2550 -5235 -8647 -9091 -8319 -5619 -88 7497 10997 7706 4774 2340 -3180 -8379 -11339
1234 -11339 -7915 -692 2611 3521 8491 10856 7506 63 -6315 -6865 -6407 -7656 -4673 3234 7559
1249 7559 8117 7569 6255 3328 -3577 -10794 -10366 -6091 -1594 2744 6346 8692 7969 3642 540 -1468
1265 -1468 -6941 -11833 -9164 -2107 4912 7362 6888 7346 5254 -1403 -5652 -6613 -7300 -7020 -4889 1385
1281 1385 9760 10468 4718 793 -645 -3196 -6814 -9707 -6570 -560 1693 5370 9886 8588 3245
1296 3245 -3042 -5912 -4901 -5818 -7136 -3161 3095 7323 8841 7494 4495 -516 -6993 -9010 -5438
1311 -5438 -3155 -2028 1401 6838 10612 8332 1846 -2415 -4860 -8473 -7948 -3557 1150 4045 4374
1326D374J659K997l453q281n320j181K570L054K629N225L898j864k577j180l211
1341f61m856l643M84O266M598R46K342J570j608m161m412k406j84j460J500O246
1357E61M746J136o51j068j045m310o801j458K543K950M160L999K776O46l877m499
1373a92j584k738l180K79M132O386L583q49l64m02m356m118j471n31M49J295L237
1390d24O452K569l049l213k063j906k312l327P49M600K889K118L381O03k518n116
1406e67l903k09l63j787K097N165M621K347p62l097k573m777l434J197K238R41
1422b866K325L920N175K92n710n087j468k208p29J834L485M083O83J20K529k19
1438F159n158n908k449K297L402M58J305M709J848j288j857k664l552m022j495
$$ plain form
1326 4374 6033 9030 5577 -2704 -8024 -9205 -6635 -3581 -952 4273 8171 6307 3730 2550 -661
1341 -661 -5517 -9160 -8676 -2410 2188 3134 5476 7046 5438 1277 -3135 -5541 -5725 -7185 -5685 561
1357 561 5307 6443 5792 4724 3679 -631 -7432 -8890 -6347 -3397 763 4762 7538 8184 4307 -192
1373 -192 -1776 -4514 -7694 -7415 -3283 3103 6686 5837 5473 5071 715 -3403 -4874 -5405 -4956 -3661 -424
1390 -424 6028 8597 5548 2335 272 -1634 -3946 -7273 -6524 -1924 965 3083 6464 7067 4549 -567
1406 -567 -4470 -4679 -5042 -6829 -4732 433 5054 7401 6639 3542 969 -3808 -7242 -6045 -3807 -2866
1422 -2866 -541 3379 8554 8846 3136 -1951 -3419 -5627 -6356 -4522 -1037 3046 3729 3849 6378 6159
1438 6159 1001 -4907 -7356 -5059 -1657 -1199 106 4815 6663 5375 3518 854 -2698 -6720 -8215
1453h215M053N354J293J357J690J37j977m573l382j199o45N91M381N016J823j198
1469D506j508L2j814o085l019K131L218K131K584K125K278j681m520j798j007
1484b427k363j858J385N485N003k63j240P6j483l205k936j318O49J169J556M864
1500C094M055q84k484k583j917k227k765r4L725K643J549K654J608j272m355l808
1516c061n08P37j990K71M311L913J937j127j906m77k400m346j573J904J843J584
1532h88K309L896J753l315m512j798j081j419J48J981L522K910N80Q38O3m327
1548F60m254k279J029K249J134N07L705K387n00j450k036k362l107k607K167M204
1564e53J815J438J713R00m39l627m482j119K41m21K440L801K899O95k107k81n40
$$ plain form
1453 -8215 -4162 1192 2485 3842 5532 5669 3692 -881 -4263 -5462 -6107 -5516 -1135 3881 5704 4506
1469 4506 2998 3030 1216 -4869 -7888 -5757 -2539 -408 2176 4301 6579 4898 378 -1420 -2427
1484 -2427 -4790 -6648 -5263 222 5225 4962 3722 3798 2315 -890 -3826 -5144 -4495 -3326 -1770 3094
1500 3094 7149 6265 3781 1198 -719 -2946 -5711 -5805 -2080 563 2112 4766 6374 5102 747 -3061
1516 -3061 -3569 -2832 -4822 -4551 -240 3673 5610 4483 2577 2100 -300 -4646 -6219 -4315 -2472 -888
1532 -888 1421 5317 7070 3755 -757 -2555 -3636 -5055 -4907 -2926 596 3506 4086 4924 4987 660
1548 660 -3594 -5873 -4844 -2595 -1461 -954 2751 5138 4638 3188 1152 -1210 -4317 -6924 -4757 -553
1564 -553 1262 2700 4413 5313 4874 1247 -3235 -4354 -4113 -4534 -2094 1707 4606 5301 3194 2913 2373
1581B373m388l926M44K096K755J538J831K240M10l175k620j383k073j194J99K949
1597a924M912J168j251K30k43k440k888k346P7J597P64K758L877Q46j699j882
1613A556j606r66k869k020K014L385J766J885J591nj491m473k468J08l06k18K378
1630a739M214K896o39k303l31j012l591k536J04K394K657J568K298K008j516l869
1646F03k654m43mj024k88K674M135J043m6M1k472l336j787j15J274K70k77L180
1664G74L636Q48j513l198k059j088k584j60L900J889N05J154K582J171l757n396
1680c296j366Q34O08J144K109K442J565j74j597j15k204m256j254K041L385J316
1696A182o5J555J761j386j591j676k458k231j14K861M068J807r47NK21q53k749
$$ plain form
1581 2373 -2015 -5941 -5497 -3401 -646 892 2723 4963 5373 2198 -422 -1805 -3878 -5072 -4873 -1924
1597 -1924 2988 4156 2905 3135 2892 452 -2436 -4782 -4705 -3108 -2344 414 4291 5137 3438 1556
1613 1556 -50 -1016 -3885 -5905 -3891 -506 1260 3145 4736 4731 3240 -1233 -3701 -3593 -3899 -4117 -1739
1630 -1739 2475 5371 4732 2429 2098 1086 -2505 -5041 -4937 -2543 114 1682 3980 5988 4472 603
1646 603 -2051 -2494 -2498 -3522 -3810 -1136 2999 4042 3996 4037 1565 -1771 -3558 -3673 -2399 -2129 -2406 774
1664 774 4410 5258 3745 547 -1512 -2600 -5184 -5344 -1444 445 950 2104 4686 5857 2100 -3296
1680 -3296 -4662 -3828 -3220 -2076 33 2475 4040 3866 2269 2154 -50 -4306 -5560 -3519 -134 1182
1696 1182 1117 2672 4433 3047 1456 -220 -2678 -4909 -5023 -2162 1906 3713 2766 2771 2992 2139 -610
1713f10l315m95J690L60J536M397J849k002k574j167K81j914l188N28K434L074
1729H84K056P10m30o5l022l196K16M10j216P36K928L451J170j372j211j501k858
1746b310j454J24P81J757J442J384K509N03k662l139q22n23n63j017K400L844
1762B254N60kQ96o65k864k744j257Q19J783M27J183K107J984n53k241k333n81
1779a227j648j666K333K220J229P01J122O19j194k906k461l16l8P84J183K278
1795A013K333m4j467n87l52l191j861L78J790K285L1J318J761pk033k023j974
1812b630l73l53L38K667K986n4p62N02j74j457l082j582J178J097Q91K480J981
1829C653j34j452k028l74l16k185j567J576K789K374O40L49P9k095l450o20P46
$$ plain form
1713 -610 -3925 -4420 -2730 -2370 -834 3563 5412 3410 836 -331 -50 -1964 -5152 -4624 -2190 884
1729 884 2940 3650 3220 3155 133 -3063 -2847 -2437 -3653 -2917 11 3462 4632 3260 2049 548 -2310
1746 -2310 -3764 -3640 -2859 -1102 340 1724 4233 4736 2074 -1065 -1887 -2410 -2973 -3990 -1590 2254
1762 2254 2814 2812 3708 3043 179 -2565 -3822 -3003 -1220 -793 390 2497 4481 3928 1687 -646 -1227
1779 -1227 -2875 -4541 -2208 12 1241 1942 3064 3683 2489 -417 -2878 -3194 -3232 -2448 -1265 1013
1795 1013 3346 3302 1835 1248 896 -2295 -4156 -3778 -1988 297 328 1646 3407 3400 1367 -656 -2630
1812 -2630 -3003 -3356 -3018 -351 2635 2581 1819 2321 2147 690 -2392 -3974 -2796 -1699 -808 1672 3653
1829 3653 3519 2067 39 -335 -651 -2836 -4403 -2827 -38 2336 2976 3325 3404 1309 -2141 -2761 -2015
1846b015l48J6J513K508K548o81k119n98j704j664r72O49J966J071M6J911J964
1863D091j678k631j516l48o1j160O74L118J990k12J89Oj087k397k880%K259O49
1881i94O70J532K059M24k164j607n47j147j435J60K436J707J217j85K53M56k192
1898F43k260n98K47l17M76K207K437P46j796n85l58j576j928J00N57J815J2P52
1916E74K076Q89j743k271j155l4m40j161J475K698J103k68L64k08q51k437k171
1933c560P20J448N46J176J195Q78j41j448q07k76j643j600J139K148J438N63K52
1950B028K95n27k287j085J0o26j24Q05K267K889m27j678r23m60j081j754j53J714
1968a117J265N40J095J225m71j671j649p59L05n46n09J391J891J159L57o77p15
$$ plain form
1846 -2015 -2363 -2347 -834 1674 4222 3541 1422 824 -880 -2544 -3516 -2867 -901 170 216 2127 4091
1863 4091 2413 -218 -1734 -2082 -2143 -3303 -2629 489 2479 2267 2456 2462 1375 -1022 -3902 -3902 -1643 -994
1881 -994 -324 1208 3267 3691 1527 -80 -627 -1774 -3209 -3049 -613 1094 2311 2126 2379 2835 643
1898 643 -1617 -2215 -1968 -2285 -1809 398 2835 3581 1785 1200 842 -734 -2662 -2562 -2005 -190 -178 574
1916 574 2650 3539 1796 -475 -1630 -1664 -2104 -3265 -1790 908 2011 1743 2107 1899 1048 -1389 -3560
1933 -3560 -2840 -1392 -846 330 1525 2403 2262 814 7 -269 -1912 -3512 -2373 -225 1213 1776 2028
1950 2028 2323 1796 -491 -1576 -1566 -2192 -2316 -1511 756 3645 3218 1540 617 157 -924 -2678 -2831 -1117
1968 -1117 148 688 1783 3008 2537 866 -783 -1542 -1237 -1783 -2292 -901 990 2149 2506 1829 1114
1985A114j102j919p61J184L67m49J596K045J128n69k198j228o72j534R2J769J404
2002B67Q55K47J65J159j119k991j382J92Q32P13P27J773J166p51q75l0j028j100
2020a180j361L86J386J558n0N19J123j71j115j387p41l01j453K61K538J710J62
2037A884L45k88l75j532k550p61J512J095P12J084J189L16j345j898K38r52j288
2054b614l1J482J921J078o25J60L81j389j212p90j02K2n8Q38K979J198j742p89
2072G07k27n80j339j574N45J768R97P47J511P51j842k007j256K99K91p51L61K035
2090D36J716N05o98r22l48k047j143J220Q87o56R24J382J754j29k014j118n83
2107h34j157k70M89J326J257L25J2J707m58k678k336O9Q66O75K98J083J714l47
$$ plain form
1985 1114 12 -1907 -2668 -1484 -1117 -1566 30 2075 3203 2634 436 -792 -1464 -2998 -2906 -1137 267
2002 267 1122 1369 1534 2693 1574 -1417 -2799 -2607 -1775 -1062 -335 1438 2604 1853 978 948 -80 -1180
2020 -1180 -2541 -2155 -769 789 739 1258 2381 2210 1095 -292 -1033 -1334 -2787 -2526 12 1722 1884
2037 1884 2229 1941 1566 34 -2516 -3277 -1765 -670 42 1126 2315 2631 1286 -612 -374 -1326 -2614
2054 -2614 -2645 -1163 758 1836 1211 1371 1752 363 -849 -1639 -1741 -1719 -1777 -939 2040 3238 1496 707
2072 707 480 -100 -1439 -3013 -2468 -700 297 1044 2555 3306 1464 -543 -1799 -1500 -1209 -1960 -1599 436
2090 436 2152 2657 1959 1037 689 -1358 -2501 -1281 -394 -1050 -126 1256 3010 2881 867 -251 -834
2107 -834 -1991 -2261 -1772 -446 811 1136 1148 2855 2397 -281 -2617 -2548 -1682 -1007 -709 374 2088 1741
2125A741l21n68l73j491j704p18J873J903O96j07R81m33j75j280q49o25o11P6
2143a985K012J476L55k16m00n5p82k029n14L11Q53P41P91J754N55j119j994k55
2161e01K39j377o61O74J861J798n08r0P9o83j552q13p0J77K39k7J957J561l50
2180A953o36q09p29r27r50k33J069J243P26J418K97p00j516j560j56L17p72J77
2198a788K206Q48P75n41m57m15j169j827J98J423K62L87J95J669O75j030j672
2215b61l86o28l73J89L43J532P67J72N31K78j626j607r21J92P95M38M86J367P64
2234B052n50m36p69p39j337p42J195J847M28m66N49L57l25o66j586q4J47p32P44
2253a113J503J368k03p92L5O5j247j933K46P90O63R51N08J120K02k155p17J3p92
$$ plain form
2125 1741 1420 852 479 -1012 -2716 -3434 -1561 342 1038 931 1912 1479 1304 24 -825 -1450 -2061 -1985
2143 -1985 27 1503 1858 1642 1242 1187 405 -1624 -2138 -1827 -974 -233 558 2312 2867 1748 -246 -501
2161 -501 -262 -1639 -2300 -1626 235 2033 1525 1435 1514 831 -721 -1534 -1604 -1427 -1188 -1215 742 2303 1953
2180 1953 1317 508 -221 -1148 -2098 -2331 -1262 -19 707 2125 2422 1722 206 -1354 -1510 -1193 -1965 -1788
2198 -1788 418 1266 2041 1500 1043 628 -541 -2368 -2170 -747 -485 -98 97 1766 2441 1411 -261
2215 -261 -647 -1275 -1648 -1459 -1116 416 1183 1355 1886 2164 538 -1069 -1990 -1798 -1003 -565 -79 1288 2052
2234 2052 1502 1066 297 -442 -1779 -2521 -1326 521 949 483 1032 1389 1064 398 -1188 -1272 -1125 -1857 -1113
2253 -1113 390 1758 1555 763 798 863 -384 -2317 -2071 -1281 -618 333 841 1961 2163 8 -709 -696 -1488
2272a488j73N6J420J687K33p29J90k25j039j079k21N60K03k03P74J503K97r18
2290H48j81n41k65j187q42Q59J376K34N29Q23M38q84j744j003Q15o97J25J083
2308b14J461L31l95r85J6K2j538n44P39P17M79J55M28Q72p71j354M7J38k12q67
2328a475n1J036J574n6M54Nj074q67o12M6L35q1M5J046J568oo60q70n79o30r27
2349a779N58J454J16k80O33O39K98q55j956J18M50j08l7N69J363k7k02m62N81
2368A073j126j456k30O64Q64P74j48N91O45q69n30p64o51m45j30Q91J401O13n47
2387F20J90L15m95j381l89j62L27K3J004J080K82p22q23L60j73k54j636R3J462
2406b79O63M59L32J7J69j282j220K95O26p03O9O28J486N85r46o22J94r82p04J79
$$ plain form
2272 -1488 -1661 -1605 -185 1502 1735 1006 1196 971 -68 -1147 -1368 -808 -605 -808 -34 1469 1766 848
2290 848 667 126 -139 -1326 -2168 -1309 67 301 830 1653 2091 1207 -537 -1540 -725 -1422 -1297 -214
2308 -214 1247 1578 1183 198 214 236 -1302 -1846 -1107 -390 89 244 672 1544 773 -581 -534 -396 -608 -1475
2328 -1475 -1526 -490 1084 1028 1482 1487 413 -454 -1066 -1020 -685 -766 -721 325 1893 1887 1227 357 -222 -852 -1779
2349 -1779 -1221 233 349 69 702 1341 1639 784 -1172 -1054 -604 -712 -749 -180 1183 1156 954 492 1073
2368 1073 -53 -1509 -1739 -1075 -211 563 415 1006 1651 782 252 -512 -1163 -1608 -1738 -847 554 1167 620
2387 620 810 1125 630 -751 -1140 -1302 -975 -952 52 1132 1414 692 -131 229 56 -198 -1834 -1741 -279
2406 -279 384 843 1175 1192 1361 79 -1141 -846 -220 -923 -854 -226 1260 1845 899 277 471 -511 -1215 -1036
2426a036L65N09J65Q19R93j05j367o07l15j2o93M7O67J483k23m7M87L38j377j025
2446i34o36Q69M62o72N40J142J056m05j038o65r3n43m57K55J186K29m2P91L17
2465A362j62j431j086P6K74j16P66R52P11l20m67K45l98j216j156P87P96Q37k83
2484A71O63Q60k97j205n50K22j069k72K84J486J076m07o17Q09o73o13j036p61
2502a929J150M26p8J067R88n76n39p01K97l14j223l25J257N84O47M00n9l6j047
2521a1j210M83K73l41j57M98J469M97l89n61j32p78o94L5K56P74Ll0J021P65o85
2542A086j200j66n52M3k88L48J548l15J12M03M3m83j170q59L01P70j8R5R39O21
2562A258j74j77j136R6m90q19M67J151M22N8m4K89Q6r95j013R3P0l77Q32O63O67
$$ plain form
2426 -1036 -671 -162 3 822 1815 1710 343 -264 -579 -591 -1284 -1237 -570 913 690 643 1130 1468 91 -934
2446 -934 -1570 -701 -239 -911 -371 771 1827 1422 384 -281 -374 -917 -1374 -1119 67 296 254 1045 1362
2465 1362 1200 -231 -1317 -1241 -967 -1083 -317 635 1346 1026 559 804 406 -810 -1966 -1179 -383 454 171
2484 171 834 1694 1397 192 -358 -136 -1205 -1477 -1193 293 1369 962 345 1154 481 -132 -1168 -1929
2502 -1929 -779 -353 -431 636 1624 1048 509 -192 105 -209 -1432 -1757 -500 84 731 1131 1072 1036 -11
2521 -11 -1221 -738 -465 -806 -963 -465 1004 1501 1112 551 419 -359 -1053 -1018 -762 12 15 -15 1006 1771 1086
2542 1086 -114 -280 -832 -789 -1077 -729 819 504 616 1019 1062 579 -591 -1450 -1149 -379 -397 -302 637 1258
2562 1258 1084 907 -229 -133 -623 -1442 -975 176 598 656 612 901 987 -8 -1021 -928 -858 -1235 -403 260 927
2583I27J08m19l61J42p57p71j69L90P48J08L58J147J17j273p18k52Kk27l55P65
2603d90J300J14k12L97l40o72r40q93J136N36j50L90N25L35P6o42q07J86o90m04
2623a245P83L92P22K81j53L01o16j125k52K66k91Q1L08J123R59k20q76j38k0q63
2643e83p38K87Q55N69j75J8R29n6r49m86m81L46j23m69Q46J018R2m88O40m41m65
2664A46j233KM32K87K03M60O15L00o83o21R8m02o80r2Q00P22M39m63L63N37n14
2685G16j315j41J93k65J73K49J282L13m87o88N93p53n57k81l4O56M84J21J05Q64
2705A228o23p16m44l6N8n75L78Q59P33l28J08m6j33o17j263L50J011k10p7P15
2725C72M24N1l37m20q7n53q16M72P71P69K06o15L52L59r04o80K87j69j91K45M31
$$ plain form
2583 927 1035 616 255 397 -360 -1131 -1300 -910 -162 -54 304 1451 1568 295 -423 -675 -673 -900 -1255 -490
2603 -490 810 924 712 1109 769 97 -843 -1736 -600 -64 -214 176 701 1036 1112 470 -337 -151 -841 -1245
2623 -1245 -462 -70 652 933 780 1081 465 -660 -912 -646 -937 -856 -548 575 1534 1314 438 300 280 -583
2643 -583 -1321 -1034 -179 390 215 233 1162 1106 157 -329 -810 -464 -587 -1056 -210 808 900 412 1052 611 146
2664 146 -1087 -1085 -653 -366 -163 297 912 1212 529 -92 6 -396 -1076 -1168 -368 354 793 330 693 1230 716
2685 716 -599 -740 -547 -812 -639 -390 892 1205 718 30 623 -130 -687 -968 -1002 -346 138 259 364 1228
2705 1228 605 -111 -555 -591 -533 -1108 -730 129 862 534 642 596 463 -154 -1417 -1067 -56 -266 -343 372
2725 372 796 847 510 90 3 -550 -1366 -894 -123 646 852 237 589 948 44 -636 -349 -518 -709 -464 -33
2746c3J085J79j086K15k49r3n76j90m2R26O7L7P65P1q29l88k25J04p9q76M80R91
2768B54K96K30m28p2k98k23p46N45N7J6J25P04L00o1q91j48q3k12L2L16M12R2
2790B17j14J77O78o9j049n70n2N65K9k37K97P09Q9l29L22k63o10q16j46P13R50
2811D91l53M82j6J20l31p42l12K91q0p81J353L72L50l90k73L75k50j164l44O38
2831e64M5J47N70M46J45Q0j016K69J8r63l73O61P91J77j04k15O08k24j212J07
2851f07J67r8j2O3O66R34k72m26k46n10o4n58L19N05K10k03Q27M59n35m33m40
2872b54j1j66m15J63J217J38P8j64r1Rl02j279J88O48j39N4M26J144j35q69m88
2893b48J0J86m64k30N35L80M49l01J34L68p61r27j72O46L09k50J47N38L18j66
$$ plain form
2746 -33 1052 1231 145 360 111 18 -558 -748 -790 136 203 240 1005 1076 247 -141 -366 -262 -341 -1217 -737 254
2768 254 550 780 352 280 -18 -241 -987 -442 -385 -369 -244 460 760 699 -192 -340 -423 -635 -603 -287 125 217
2790 217 103 280 958 889 -160 -730 -782 -217 -188 -425 -128 581 670 341 663 400 -210 -1026 -1172 -459 491
2811 491 138 620 604 724 393 -349 -661 -370 -450 -1231 122 494 844 454 181 556 306 -858 -1202 -564
2831 -564 -519 -372 198 644 789 869 -147 122 140 -823 -1196 -535 256 433 329 114 722 498 -714 -607
2851 -607 -440 -538 -550 -487 179 1113 841 415 169 -341 -405 -963 -644 -139 71 -132 695 1154 619 186 -254
2872 -254 -265 -431 -846 -683 534 672 750 586 495 504 202 -1077 -889 -241 -380 -326 100 1244 1109 240 -248
2893 -248 -238 -52 -516 -746 -211 169 618 317 451 819 58 -869 -1041 -395 -86 -336 -189 349 667 501
2913E01Q0Q9j078k40n03N19P84j1J03K25L70j70k42p53p8k68n25R78R63K29n15
2934D58l31M70k34n40j152N63N53L7L28M40K87k20m14l58l8O5n84j38O04P09R2
2955E97j34O7k20m99j97j50J40k37P6N00R13k1l68n71J29L0q13k88N47M92j84
2976a91P62L1km70q02K01j51J42m8L73P25QQ4k4j29o43m95k13J48N65K45K82K08
2999F06L80n12o30K5J11m91J36j01R08J07J81j37K54m91q98k37K38J74J93LL77
3020A96N70l14j24J6o06k44j47N2M72K53n54O44M52Ll43o88l05L1J03j07Q67L88
3042F15j17k48m49P56n57o96k83O26M81JJP0O84l96p54K3j35l04k7L81O59M30
3064G61m62mK63k49l63n28J28L42q8K57O86K08o72k61Q5O5o70m36N19N96k59K67
$$ plain form
2913 501 581 670 -408 -648 -1151 -632 152 141 244 469 839 669 427 -326 -404 -672 -1197 -219 744 973 458
2934 458 127 597 363 -177 -1329 -766 -213 -176 152 592 879 659 245 -113 -151 -86 -670 -808 -204 505 597
2955 597 463 530 310 -189 -386 -536 -396 -633 -557 -57 856 835 467 -104 25 55 -758 -1046 -499 -7 -191
2976 -191 571 602 600 130 -672 -471 -622 -480 -528 -155 570 578 662 638 509 -134 -629 -842 -694 -129 116 398 606
2999 606 986 474 -156 -131 -20 -511 -375 -476 432 539 720 583 837 346 -552 -789 -551 -377 -184 -181 196
3020 196 766 452 328 344 -262 -506 -653 -601 -129 124 -430 214 666 669 326 -362 -667 -636 -533 -640 227 615
3042 615 498 250 -199 557 0 -696 -979 -353 128 129 130 200 884 488 -266 -243 -378 -682 -709 -328 331 761
3064 761 299 295 558 309 -54 -582 -454 -112 -200 57 743 951 279 18 103 168 -502 -938 -419 177 -82 185
3086A85K64M33j94j156k10M49K48q90M21M35N19Q0m31J00o3m69m46J17m4N41L8
3107g3K75M83k3n40k92%l65L7J30J99R87n20l19N33o9n24m01k44N39K64l99K08
3129a14R49k98j76k65J56J13p93n99J066L74j46j51K17K62p9p02k17K65j99j86
3149e23O86K60P3j82j92K25j29p13j66N72j55N6J17J79K22k11l09k00K87l95m3
3170e41k50R47O68p04j08L26j17p5p67J32L46Pk53P38J27J14l12k30K57m2l74
3191a11l52K66K24J78L0K56l6l08p72L09J63j18j69M11J13O07m81j40Q7j76n99
3212f18M05n6L68j94j18P43K76m78k08l30l43K59j56JO69k62J99K15m3N0n45k57
3234d23k86M55K02l11N58L85j16k6m29Q2n75m17O02M64J00j46K8M01o2m29n31
$$ plain form
3086 185 449 882 688 -468 -678 -229 19 -871 -450 -15 504 584 153 253 190 -279 -725 -608 -652 -111 -73
3107 -73 202 685 662 122 -170 -170 -535 -498 -368 -169 818 298 -21 512 443 -81 -482 -726 -187 77 -322 -114
3129 -114 835 537 361 96 252 365 -428 -1027 39 413 267 116 333 595 516 -186 -403 -138 -337 -523
3149 -523 163 423 496 314 122 347 218 -495 -661 -89 -244 -188 -71 108 330 119 -190 -390 -103 -498 -541
3170 -541 -791 156 824 120 12 338 221 146 -621 -489 -143 -136 -389 349 476 590 278 48 305 263 -111
3191 -111 -463 -197 27 205 235 491 455 147 -625 -316 -153 -271 -440 -29 84 691 210 70 157 -19 -618
3212 -618 -213 -269 99 -95 -213 530 806 328 120 -210 -553 -294 -450 -449 220 -42 157 372 329 379 -166 -423
3234 -423 -709 -254 -52 -363 195 580 464 438 9 91 -484 -901 -299 165 265 119 147 548 486 57 -474
3255d74L6R4J78LL37N77k53k91J09N1l49n67J85J26N20k3j19O50l37j03k25k37
3277a12p5n37K15L49O03k21j09K84N0j04k29q74L00M12l10L32M77r3N3n29n1M62
3299B93n34o04M20L43J72K68m8J24l31k94j09J66k62j94N46R0N65k18m57M36l02
3320G0n13j51N67r1j32L08J82O49m60l71k40P5J09j56l07K23O89k81r7M96j2n70
3342a3o52K37K86P9k76O40R1q5k27J6j50m71o7J60N03J43Pl39N65K46o84n11Q0
3365d22j03J14K05R4M96K17l13l34M31k80n39k25J53O19J76l79K25P51p45j76
3385c5j93Q8j53j86L57L27L57l50K24j59k13j52l94o1N20J30k6J12M85k17n14
3406e3q2J24qo43M90n8M04j48L33J59j43m97k78L14j9j66n8QQ32L00q95k9J10
$$ plain form
3255 -474 -438 -344 -166 -163 174 751 498 207 316 367 18 -549 -364 -238 282 259 140 790 453 350 125 -112
3277 -112 -187 -724 -509 -160 443 222 113 397 447 343 114 -760 -460 -48 -358 -26 451 358 411 -118 -169 293
3299 293 -241 -845 -425 -82 90 358 310 434 103 -191 -300 -134 -396 -590 -44 46 611 393 -64 372 70
3320 70 -443 -594 -27 -118 -250 58 240 889 429 58 -182 -107 2 -154 -461 -238 451 170 73 569 557 -13
3342 -13 -665 -428 -142 -63 -339 301 392 307 80 96 -54 -525 -592 -432 71 214 221 -118 447 693 9 -502 -422
3365 -422 -525 -411 -206 -112 384 601 288 -46 385 105 -434 -659 -506 113 289 -90 135 886 141 -35
3385 -35 -228 -140 -293 -479 -122 205 562 212 436 277 64 -88 -482 -543 -23 107 81 193 678 461 -53
3406 -53 -135 -11 -19 -662 -172 -230 174 26 359 518 375 -122 -400 -86 -105 -271 -329 -321 511 811 -84 -113 -3
3429cj14j0l51K22M13j22j78N39L2o38m56M04O1o4k99J49O05K00k31J83m5l70
3451g3m54n4M51J01J08k7jM57j24p1n22o1k41J64K64L37J74l09k07P57j05o80
3473a16n15K37L86R4m60R84k08k49j45J23N9n05j57k49Q18L43m04K11N0j38k9
3494A30k54N8J54n35k06N39O15J10l95j01n0K21m46l63M42j01J7M82J16M01j284
3515d50N0N03k45k03m5K90J11L44k9j35j14J95n22p7L02p7l0r6N68J18o9l62k11
3538a84oJ95m67L14q9M63j81J88J73j51l96p5M9J09m05L01L33O1l68J93O7j5j04
3561En74L36L93k10k03K78K58K75p36j44K62J46n42L72j47J93L81m97N67J04m92
3582B5j3m00L5L95j5j32L67J72k74p9L30k43n76N2K41K24j39J26J42K44k45r9
$$ plain form
3429 -3 -117 -127 -478 -256 157 35 -143 396 428 -210 -666 -262 -201 -265 -564 -415 190 390 159 342 297 -73
3451 -73 -527 -581 -130 -29 79 52 51 508 384 313 -209 -270 -511 -347 -83 254 428 119 -88 669 564 -116
3473 -116 -631 -394 -8 86 -374 610 402 153 8 131 190 -315 -472 -721 97 440 36 247 297 159 130
3494 130 -124 -66 88 -447 -653 -114 501 611 216 115 65 286 -160 -523 -81 -182 -165 317 433 834 -450
3515 -450 -400 103 -142 -345 -390 -100 11 355 326 191 77 272 -250 -327 -25 -102 -132 -228 340 458 389 27 -184
3538 -184 -190 5 -462 -148 -237 226 45 233 406 255 -141 -216 -167 -58 -463 -162 171 232 -136 57 124 109 5
3561 5 -569 -233 160 -50 -253 25 283 558 -178 -322 -60 86 -456 -84 -231 -38 343 -154 413 517 25
3582 25 12 -388 -353 42 27 -105 262 434 160 81 411 168 -408 -356 -115 109 -30 96 238 482 237 138
3604A38l71J35k04k42L52N67j05j9J25m28N26p30k19L15J27j2J3N61k45q6l97
3625a99j67J89J11n77O10o1K86l6O4p6j01l61J08O3J09J0k59L29M35k4l97J85
3647B41m58L88n06l5K49K78j9j3K68N5n92K96m77L18K7m95K10M48J66Q8l66J75
3669B46k84r3j41K44j46J46K38J39K90m59l43k26M90l56j6l9M66M8o8k35O21p33
3691b11k63K75M7L54k74j2M32J31k59n2q3K4l46j75J42O48j37m99L46K23Q0j17
3713B74o06R9L04m35J67O14L4l74k34L79K51k23p94J58K40K14n8L41k55J15r7
3734A14j47K16l90j21J94M4M64r1j69O5j43j55O6j20m57N60M1j08L23L08m38m1
3756A5Q6k33M5n78N36K55j85R0L08o8J11p59kN58k8o14J69N33R8j87q8K1K2l23
$$ plain form
3604 138 -233 -98 -302 -544 -192 375 270 251 376 -52 474 -256 -475 -160 -33 -45 -32 529 284 198 -199
3625 -199 -366 -177 -66 -643 -33 -94 192 156 220 144 43 -318 -210 -147 -38 -28 -287 42 477 453 56 241
3647 241 -217 171 -335 -370 -121 157 138 125 393 448 -144 152 -325 -7 20 -475 -265 183 349 437 71 246
3669 246 -38 -131 -272 -28 -174 -28 210 349 639 180 -163 -389 101 -255 -271 -310 156 204 136 -99 522 -211
3691 -211 -474 -199 -152 202 -72 -84 348 479 220 168 85 109 -237 -412 -270 378 241 -258 88 311 391 274
3713 274 -332 -233 71 -364 -197 417 451 77 -157 222 473 250 -544 -386 -146 68 10 351 96 211 114
3734 114 -33 183 -207 -328 -134 -90 374 283 114 179 36 -119 -53 -173 -630 -70 -29 -137 186 494 56 15
3756 15 101 -132 -87 -665 -129 126 -59 31 339 271 382 -377 -379 179 151 -463 -294 239 337 150 62 83 105 -218
3780b18l63M69P8K08l37K17K34J42m85m1J7o2l6K10P0O6J2J56Q0k12k22l18L71
3803C6k97K87k20K84K90l41J44j75j09M8l86p2O12L07m55K78J15K5k38l98o1O65
3825C39o70J74L26J03K5j32k53K28K8m05j47M33k43J09k0N20j71k96p3J00J27
3846A02Rj62k86N68L01k63l04L81j29k13m2l42L28j57q8N24M65n34j32j54p0K02
3868Dj76j01K73L3J30PJ19n2k91l00K37M6K41m23K18J6p9K29k21K92j84l89R2
3891b79N65m72J10q2L09K84l52k3r6Nj15L4K54J43m1l17K64o5q2j84O4p2K49m6
3915E5j6J32N1j63K30n26O34m17j96L05J34k83J68J33n5o3j19KK47j28o29L51
3937a53M83j80J97l40J53J5q6m26K54L73l46J6q5K38K20k85q8K83l39n2j39K34
$$ plain form
3780 -218 -581 -112 -34 174 -163 54 288 430 -55 -96 -79 -141 -177 33 103 169 181 337 417 205 -17 -335 36
3803 36 -261 26 -194 90 380 39 183 8 -101 -53 -439 -511 101 408 -47 231 346 371 133 -265 -326 339
3825 339 -331 -157 169 272 297 165 -88 140 168 -237 -384 49 -194 -85 -105 415 244 -52 -125 -25 102
3846 102 111 -51 -337 231 532 269 -35 346 217 4 -38 -380 -52 -209 -297 227 692 158 26 -128 -198 4
3868 4 -172 -273 0 33 163 170 289 237 -54 -354 -117 -71 170 -253 -35 -19 -98 131 -90 202 18 -371 -279
3891 -279 286 -186 -76 -158 151 435 83 60 -36 -31 -146 -112 142 285 244 -73 191 126 44 -140 -76 -148 101 55
3915 55 39 171 222 59 289 -237 397 -20 -216 89 223 -60 108 241 186 123 4 6 253 125 -504 -153
3937 -153 330 150 347 7 160 175 89 -337 -83 290 -56 -40 -125 113 333 48 -40 243 -96 -148 -287 -53
3959e3K84o4l08L13J84n03p8q5K33J33l28J03M69k6K2l62J77o5k37k44L49K94
3981B08J2q7J6j08l4j48k08K81j92j2K19J21K00j26k56J68J16m32m0Q2M5J75l18
4004c18N64L7m3o53K35Q0o4j23j36M74J40l78J71p3L16j48m99m1L09j01L06j87
4026a32N35l36o4l85L14M2j57j2J04P0k05M60j69K44l57j38J3j01J72R2m1M28
4048C77k17n1Q9J07k51j98k65J05O59j46m57J64O45o31p0N0K60j98k86K77L33
4069B96j46j10J18L4r6l93Q9K28R3k97p0N60q4j15j47J32j37j93l3O6M40p5O7
4092B27k35k9L70m20J85j58M4k27J97j4K70R6m22q1L97o7m09KJ40K34p3J66L18
4115E11Qp65K56J5j24l1j24K37L02j98r0M67m67m6j32k88N90K03n81NJ59K53j6
$$ plain form
3959 -53 231 167 -141 172 356 -147 -225 -310 -77 56 -272 -169 300 274 296 -66 111 46 -191 -435 -86 208
3981 208 220 133 149 41 7 -141 -349 -68 -260 -272 -53 68 268 142 -114 54 170 -262 -302 -220 -175 0 -318
4004 -318 246 283 240 -413 -178 -98 -162 -285 -421 53 193 -185 -14 -87 229 81 -418 -459 -150 -251 55 -132
4026 -132 403 67 3 -382 -68 -26 -183 -195 -91 -21 -226 234 65 309 -48 -186 -173 -274 -102 -10 -51 377
4048 377 160 109 198 305 54 -144 -409 -304 355 209 -248 -84 561 -70 -140 -90 170 -28 -314 -37 296
4069 296 150 40 158 192 96 -297 -208 20 113 -184 -254 306 222 107 -40 92 -45 -238 -271 -205 235 160 227
4092 227 -8 -37 333 -87 98 -60 -16 -243 -46 -60 210 306 -116 -197 200 133 -276 -274 -134 100 27 193 511
4115 511 519 -246 10 25 -99 -130 -254 -17 285 87 -3 464 -3 -49 -181 -469 121 324 -257 -252 -93 160 144
4138A44n1k8J18n92K92j35M89l29J69j93L11j15k69k39Q1R9L1J48L1M80m81N3
4160A4K58m9k61k26J51J33L23n58L63L67n51N1j53K7M39p33K63K94l6K43m35p
4182h3L5K17j30J40k23k1m1J43L54j37k37j22K8J19m69M4L69J56j43K9K83k95
4204A6l01j21K45K95j3j53k00K78J13j74m34M56O0k24m4J59l9k07K26K09pk83
4226a43M02m48Q7j4JJ66o0L38n51O15p6m16Pk93M02J87j78l2K83j37p8q3j54N50
4250C75n77k7K22P4J97l99QP3N12l57l59J91p1J92l26L26K63l47l23P47k76p9
4272C9l69l5Q6N03j35j59L42Q1l81j06n0J93j42j23M10L64l41j93j67J22K66m05
4294b00r5j57O47k03k20K71J10l11j08O3J48J50n13M06J68n5j47K08J53l15P8
$$ plain form
4138 144 93 65 183 -409 -117 -252 237 -92 77 -116 195 80 -189 -428 -347 -248 -217 -69 -38 442 -39 14
4160 14 272 223 -38 -264 -113 20 343 -215 148 515 -36 15 -138 -111 328 -405 -142 152 116 359 -76 -83
4182 -83 -48 169 39 179 -44 -65 -106 37 391 254 17 -105 -77 42 -427 -383 -14 142 -1 28 311 16
4204 16 -285 -406 -161 134 121 -32 -232 46 159 -15 -449 7 67 -157 -201 -42 -81 -288 -62 147 140 -143
4226 -143 259 -189 -102 -116 -115 51 -9 329 -222 393 317 -99 -92 -385 17 204 26 -6 277 140 62 -21 -175 375
4250 375 -202 -229 -7 67 264 -135 -127 -54 458 101 -258 -67 -138 54 -272 54 317 -30 -353 394 118 39
4272 39 -330 -365 -279 224 89 -70 272 353 -28 -134 -184 9 -133 -256 154 518 177 -16 -183 -61 205 -200
4294 -200 -295 -452 195 -8 -228 43 153 -158 -266 -203 -55 95 -418 -12 156 101 -46 162 315 0 78
4315G8k16K19J01r1j69j7J55j56r%j64L25j27m7K80k74Q8l14N84Ml74O7m6m0l2
4340a75J63K4L16l21K7N8J0j12m01O7L65M1o3k36L68J7l00l0m0J83q6J90k3K71
4364C13j62r8J21K29l53l59L34j39P1O7n1K28k17L94l03p3r7lN3J6M57n74O4M19
4388C37j42j07j99L9m0j33K28j38O46m38l8l5K14k76K68l33k2K11J61k47p1L41
4410B26l62N0j27N02m13j41N36k59J18J89k72J05j18j28j81K87q3P6r2L73N8k67
4432G7k96j9rL62k09N1K0K02n6o2m9r2M1N6j82L45j34m34K31M37J02l06k36L66
4456B06k45M1j66K3K37j77n6K44j46J11K15l96R3P1j77j97L34RJ12k79L73l14
4478h4J28j05J77K6m67L01J58J45j21j82J28l1p7j96O1K12L73o46J43K59q6k56
$$ plain form
4315 78 -138 81 182 91 -78 -95 60 -96 -105 -105 -269 56 -71 -118 162 -112 -24 -338 246 250 -124 -57 -103 -143 -175
4340 -175 -12 12 328 7 34 92 102 -10 -411 -344 21 62 -1 -237 131 148 -152 -182 -222 -39 -125 65 42 313
4364 313 151 53 174 403 50 -309 25 -114 -43 24 -27 201 -16 378 75 2 -95 -98 -45 -29 428 -146 -82 337
4388 337 195 88 -111 -72 -112 -245 -17 -155 491 53 15 -20 194 -82 186 -147 -169 42 203 -44 -115 226
4410 226 -136 -86 -213 289 -124 -265 271 12 130 319 47 152 34 -94 -275 12 -71 5 -87 286 344 77
4432 77 -219 -238 -247 115 -94 -43 -23 179 123 61 12 -80 -39 17 -165 180 46 -388 -157 280 382 76 -160 206
4456 206 -39 2 -164 -141 96 -81 -137 107 -39 72 287 -109 -16 55 -122 -319 15 24 136 -143 230 -84
4478 -84 44 -61 116 142 -325 -24 134 279 158 -24 104 73 -4 -200 -139 73 446 -200 -57 202 116 -140
4500a40K68k67L11j88j96L16K23n4l59k75P62j90k88j22L93k25k66O50l84K05
4520A74r2j72K54k12n3jp2L62J24l52J31J86k54l48J83K98n4k64k1J83K77m27
4542a50l4J38R0l0l94K25J26r7j01N8K14P5j47k0L41n9k95n5Q5J57K01l0k50L3
4566H1j78k26N54k20j21k99L47K53J7k89j78M83r3k16J06L36k84j84R7L19J47
4587D52l71j07K42m43L80j13k65K29J16J41j25j02pJ39m00J38K41m62L20j16o6
4608a79K0J24k33M08K7m8k9K8l9P8k19J79j69pj48QM34k58k19R3K4j20K9K38k1
4633An8l37L91N0J85j61k24M91k27j75K42lj25k2n02O55P6o2l41r5L80k50j01
4656b12k66N77R0l96L80l3j86p4j41L01j60J27j49L14k72R8K35j67k77K49l86
$$ plain form
4500 -140 128 -139 172 -16 -212 104 327 273 -86 -361 401 211 -77 -199 194 -31 -297 353 -31 174
4520 174 82 -90 164 -48 -101 -102 -174 188 312 -40 91 277 23 -325 -142 156 102 -162 -183 0 277 -150
4542 -150 -184 -46 44 14 -380 -155 -29 -126 -227 -169 45 120 -27 -47 294 235 -60 -115 -30 127 328 298 48 81
4566 81 -97 -323 231 11 -110 -409 -62 191 208 -81 -259 224 131 -85 21 357 73 -111 -14 305 452
4587 452 81 -26 216 -227 153 40 -225 4 120 261 136 34 27 166 -234 -96 145 -317 3 -113 -179
4608 -179 -159 -35 -268 140 167 119 90 118 79 157 -62 117 -52 -59 -207 -199 235 -23 -242 -149 -125 -245 -216 22 1
4633 1 -57 -394 -3 47 232 71 -153 338 111 -64 178 175 50 28 -474 181 257 195 -146 -241 139 -111 -212
4656 -212 -478 99 189 -207 173 140 -46 -120 -261 40 -120 7 -142 172 -100 -2 233 66 -211 38 -348
4677c48K43J27j94J3j7M05p6k54J53J41l78j25K76j9K21j64l36L11J42N5k10j56
4699a90K13K76k89n8J04J84q9k53j50M18k25k12J59rK84m4k35Q2K04q2j68l4J47
4722C3k34J64p4J36L36o09J68M48k53j17p6Q0qK4N1l5J37k01k45M00j41k7R4k85
4746b34M58j17k54J11Ln9k8J33j75J17k18L96r7O6M5k59J23m4j02J78m7P7P6L4
4770A83m9j11k31J42L02j90j42M6Q2J02K8J55m28M66k86k58Q1n0J01K85j85j06
4792f3R3J73l37m3M12j70Q4l02O7K57j02k13J53J70k76K2LL91j83j55l23J27K90
4815G5P8k71K73j92k54J79J98J42r5n3k84J47J43q0n3j84l2K42k8M8J28q4k16
4838a73K54j61l9J84r9M7J03j28R6l6j37j27P8M0r8K19p8r6N5J71k26J27j5Q1
$$ plain form
4677 -348 -105 22 -172 -159 -176 229 153 -101 52 193 -185 -310 -34 -53 168 4 -332 -21 121 176 -34 -190
4699 -190 23 299 10 -48 56 240 151 -102 -252 166 -59 -271 -112 -121 163 119 -116 -34 170 88 -80 -114 33
4722 33 -201 -37 -111 25 361 -248 -80 368 115 -2 -78 2 -6 18 69 34 171 -30 -275 125 -16 -43 51 -234
4746 -234 224 107 -147 -36 -33 -92 -120 13 -162 -45 -263 133 36 102 147 -112 11 -33 -135 43 -4 73 149 183
4770 183 134 23 -208 -66 236 46 -96 -50 32 134 162 317 -111 355 69 -189 -108 -158 -57 228 43 -63
4792 -63 30 203 -134 -177 235 65 149 -153 -86 171 69 -144 9 179 -97 -75 -72 319 136 -19 -342 -215 75
4815 75 153 -118 155 -37 -291 -112 86 228 133 80 -204 -57 86 6 -47 -231 -263 -21 -49 -1 127 43 -173
4838 -173 81 -80 -119 65 -34 13 116 -12 84 48 -89 -216 -138 -98 -196 23 -55 -151 -96 75 -151 -24 -39 42
4862D2J13k36j91J75N6J67Qm0k59J47K23j96n0J25o3k97L34j38K22k00k61J95
4884a24K33k41m6K44j60N02l59k11J25Qk23J77K76o0j80n8q1M32l44J5j11q9M36
4907A61m7j19L7K00o5j97L05k84KK92o23M26o5m20J55M19j68K1L6K61n29K63l74
4930c13L31K02l87R4K05J90k65l75J63M68k32k84M5J96qQ5k43JN2m2j3L27l24
4953a27K10p1j12M6M2K16o6ok27N6j08K69J50j34j92J57J52k01k19M16n5l83J10
4976g7JK45p5j21K7q3J43p2j08L25j61J53o5k54J25M9j44J39m66N11k77J11J79
4999A05j38j46Q8J09k0J42l41P9J09K58k13K69p5m42O7J36J33p6j85K8K65J86
5021C38j24j93j26K03l74J79Q6Q6j46J85k1l7N4l21J44J42k94K22K6%M5Q3l22
$$ plain form
4862 42 155 -81 -272 -97 -41 126 134 94 -165 -18 205 9 -41 84 21 -276 58 -80 142 -58 -319 -124
4884 -124 109 -132 -178 66 -94 408 49 -162 -37 -29 -252 -75 201 141 -39 -97 -178 254 -90 -75 -186 -275 161
4907 161 114 -5 32 232 167 -30 275 -9 -7 285 -338 88 23 -397 -242 177 9 30 66 327 -202 61 -313
4930 -313 18 220 -167 -73 132 322 57 -318 -155 313 81 -203 -158 38 30 115 -128 -127 -75 -117 -130 197 -127
4953 -127 83 12 -100 -54 -12 204 138 132 -95 -39 -147 122 272 138 -54 103 255 54 -165 251 196 -187 -77
4976 -77 -76 169 94 -27 0 -83 60 -12 -120 205 44 197 132 -122 3 52 -92 47 -419 92 -185 -74 105
4999 105 -33 -179 -91 18 -2 140 -201 -122 -13 245 32 301 226 -216 -149 -13 120 44 -141 -113 152 338
5021 338 214 21 -105 98 -276 -97 -11 75 -71 114 93 56 110 -211 -67 75 -219 3 29 29 74 157 -165
5044a65L8L12k49J11l8K95p5l15J90o7J16j49J18J03l88R5jK14J70j93l24L49
5066A47K5j91J32l38K91J45m58J89K47j32j23P6J14R8k99RJ70k14R2M0L36l76
5088b0K07m35K14K01j37k73Q5K61J89n45K11J05l57K76k6j59J38j44M42n09L82
5109A06j45QK01l99L77r7k96M68J19n76K82J73j75M0n8j99L57k94j39Q3J40j5
5131c9J10n6j08J82k12P5r5J25k3kQ1o9K02k42K11k47K17l8l0j23j09Q0J70J28
5155A88r5k14r7J59J52K8m8L25l67J38k35R9j35j40M42j92J28M4m67M09J4k5k30
5178a19PK20n1R7Om07N9K77k28J66j86K1L2N9K07J4K0j79P5j18p6%L79o5l3O7
5204B44%k30j77J31q0J78k49J65K0N0n6k58J73J13m1j31K62o9k37K82k28J24K65
$$ plain form
5044 -165 -127 185 -64 47 9 304 229 -86 104 37 153 4 122 225 -163 -68 -69 145 315 122 -202 147
5066 147 172 -19 113 -225 66 211 -247 -58 189 57 -66 10 124 222 -77 -68 102 -112 -20 20 356 -20
5088 -20 187 -248 -34 167 30 -243 -158 103 292 -253 -42 63 -294 -18 -44 -203 -65 -209 233 -276 106
5109 106 -39 -31 170 -229 148 51 -245 223 342 -234 48 221 46 86 28 -171 186 -108 -247 -164 -24 -39
5131 -39 71 15 -93 89 -123 -48 -143 -18 -41 -43 38 -31 171 -71 140 -107 110 72 42 -81 -190 -110 60 188
5155 188 93 -121 -218 -59 93 121 73 398 31 169 -66 33 -102 -242 200 8 136 180 -287 122 136 111 -119
5178 -119 -112 108 57 154 160 -247 -188 89 -139 27 -159 -138 -106 -47 160 174 194 15 90 -28 -104 -104 275 210 177 244
5204 244 244 14 -163 -32 -112 66 -183 -18 2 52 -4 -262 -89 24 -17 -148 114 45 -192 90 -138 -14 251
5227B51k05K5N3q5j41J26O2k68K85P1j89J24k93M40k43r0J06j10k57N71j58p3
5249Bo0K16K9j18j44J60k05j41K10J85o8N1j85j37K67l25L6K37j90K06q4K8L70
5272C40l46M16j77k66K92k60q7j58L49j50J02o0J80mj86J53k43M65l08k05K82
5293A29J03r1j52R4l0o8n6k07J52L02p3L8j01m5j59R0R6J04l60L13m1k48J44K3
5317d3K20j62J19k90K77k73K84j8k22M42l47K32l42r2O08n32JR2M5K20l48K25
5339I6J28k16l4J05k29L51l03n4m4K41J72k41R9q8m3k60M25k16L03j32l59M75
5361A76l20pK43n2K13j94m7J64j49j53k1J00R4K06m36K93k18K94j54j15K1N16
5383D54n61M5j62K77j44Q2J58l6j91j42L14j37K42l17J81j22P9j14J52J1o6J28
$$ plain form
5227 251 46 71 124 39 -102 24 86 -182 103 174 -15 109 -184 256 13 -77 29 -81 -338 233 75 2
5249 2 -58 158 187 69 -75 85 -120 -261 -51 134 66 117 -68 -205 62 -263 -227 10 -180 26 -58 -30 340
5272 340 -6 410 233 -33 259 -1 -88 -246 103 -47 55 -5 175 171 -15 138 -105 360 52 -153 129
5293 129 232 141 -11 83 53 -15 -71 -278 -126 176 103 141 40 -5 -164 -74 22 126 -234 79 38 -210 -66 -43
5317 -43 177 15 134 -156 121 -152 132 114 -108 334 -13 219 -123 -215 393 -139 -138 -46 -1 219 -129 96
5339 96 224 8 -26 79 -150 201 -102 -156 -200 41 213 -28 71 -17 -60 -320 105 -111 192 60 -299 176
5361 176 -144 -151 92 40 253 59 12 176 27 -126 -147 -47 47 253 -183 110 -108 186 32 -83 -62 454
5383 454 -107 -62 -224 53 -91 -9 149 113 -78 -220 94 -43 199 -118 63 -59 20 -94 58 69 3 131
5405A31o8j07L28m40j2J47j38pj11J61K25Q7k35J11q6J49j17J5K03j38j59k3J45
5428F1j99L3k2P0j50L70j90k77M01l07J16oj57K14j20J73R0kj74P1L7j44l3k01
5452c46M27o5K41l54K26K4j79K28l63mJ39j49kN8j8L42j30k1L60l28m20L44j9
5475ij4L2JN0J29l20K07K45m05k0j60K21K91j89k63L63j24j8j29M59j57k59OJ35
5499G2R0l03J77j24J58P3j67r6P5%Q3r5M6j12l0J04n8K55l74J4K12j8k3o9R5K
5525a3p8M9K08j43o7NK74j35k37L66k7r9l80K56j25O9L99j74l11J37J46l07L61
5548A74l36Q0K64j37k41M9L76k16o2J73rN4m09J44n5K36k7r6J75j22R0k94L04
5571A15Nk27j94K53J21k10L03k98L80j5j93P3p7N2L8j69J39n6Q2k13K40J84k29
$$ plain form
5405 131 63 -44 284 -156 -168 -21 -159 -166 -277 -116 109 196 -39 72 -14 135 18 33 236 98 -61 -84 61
5428 61 -138 -105 -127 -57 -207 163 -27 -304 97 -210 -94 -100 -257 -43 -163 10 100 98 -76 -5 32 -112 -145 -346
5452 -346 81 16 257 -97 129 153 -26 202 -161 -165 -26 -175 -177 -119 -137 205 75 54 414 86 -334 10 -9
5475 -9 -23 9 10 60 189 -131 76 321 -84 -104 -264 -43 248 59 -204 159 35 17 -112 347 190 -69 -63 72
5499 72 162 -141 36 -88 70 143 -24 -120 -45 -45 38 -57 -11 -123 -153 -49 -107 148 -226 -212 0 -18 -41 -110 -15 -13
5525 -13 -91 -42 166 23 -44 -39 235 100 -137 229 202 103 -277 -21 -146 -77 322 148 -163 -26 120 -187 174
5548 174 -162 -82 182 45 -196 -147 229 13 -49 124 115 169 -240 -96 -151 85 58 -38 137 15 105 -189 115
5571 115 120 -107 -301 -48 73 -137 166 -132 248 233 40 113 36 88 126 -43 96 40 122 -91 149 333 104
5594A04j18k19K21K32k95J22J17j39j54J7K69k39n7K18k8k16L00o4R4k14J43l31
5616b37RM95l2l12J98O7k0q1k67K92Q0j86K18m32K13n2M3O5L2p1n1K18l3l77M79
5641B58m69K02L05l22J9j61L10l65K51j22L4j01J74n7O0k6l04K73J26l28K75k62
5663b30L88j23L3m5j72J48nQ6J76k50M0K5j56J27k9j44Q2J09j3R4j11R3K2j05
5687D0J2R1j32j47Q4J00O0m2j37k4m3J42m4JK04r8k24R5K26Pj27P0J15j23j40
5712c4o4L00l15J31l39M67k1k66l1K31k01K35j90K80mj55L2J72l52M76l04k87
5734b39L19K3L4l19M34j52j67N3J08J48j61j86L82J9l97j8l1K51r6k28L97k23
5756d9J12%%k27M85m9l92Q5l5M18k01k85L17l70P7j22K66K78k75k6J6J66o9j96
$$ plain form
5594 104 -14 -233 -12 220 -75 47 164 25 -129 -112 157 -82 -139 79 51 -165 135 71 165 -49 94 -237
5616 -237 -228 267 235 -77 121 188 168 87 -180 112 192 6 224 -208 5 -47 -4 61 93 22 -29 189 156 -221 258
5641 258 -211 -9 296 -26 -7 -168 142 -223 28 -94 -60 -161 13 -44 16 -10 -314 -41 85 -243 32 -230
5663 -230 158 35 68 23 -149 -1 -6 80 256 6 46 71 -85 42 13 -131 -49 60 47 141 30 123 145 40
5687 40 52 143 11 -136 -52 48 108 66 -71 -95 -138 4 -40 -39 165 67 -157 -62 164 171 44 114 229 106 -34
5712 -34 -98 202 -113 18 -321 146 125 -141 -172 59 -142 93 -97 183 179 24 56 228 -124 352 48 -239
5734 -239 80 103 137 -182 252 100 -67 -14 94 242 81 -105 277 296 -101 -119 -150 101 5 -223 174 -49
5756 -49 63 63 63 -164 321 272 -120 -35 -70 348 147 -138 179 -191 -114 -236 30 308 33 7 23 189 120 -76
5780g6K08l7j85N2K3J38J10j25j47k12M18r5j4Kq9J25n1K67j04j27l83l0M77k79
5804a34N6J28R3j58k7K23j26j30j29J41K5K30k21mJ64J05k75J09K85l51P6j97
5826a17J7J09l73M30k17L22j51k6O9o3J13K48l34l2J11O1l34K74k19K76l3MK0
5849A55K00m76J58M4K07k70j31L26m26Q1K36j15L44k55r3L17k77J08k90L5M87
5870C65k77n4k76L06n7Q0N7j80L60k97R0J65k06K37l20J15Lj70M9k14K80l2j95
5893a71M5L58k14M3k34K9R5J7j37j45K68L82n80L70j18M7N1J7n6l38M19l0j93
5916g5K42j22l96K99K50k67O0j16N37n10J59P2j83L26j54k59J22p5j84M21N7l42
5938a38J23J76j39q1j45J51o1K57q8Q1l20J10K19l7K1j20j67J08r7K08j27L37
$$ plain form
5780 -76 132 95 -90 -38 -15 123 233 108 -39 -251 167 72 58 60 -29 96 45 312 208 81 -302 -332 145 -134
5804 -134 -78 50 143 -15 -42 181 55 -75 -204 -63 -38 192 -29 -33 131 236 -39 70 355 4 80 -117
5826 -117 -100 9 -364 66 -151 171 20 -6 63 0 113 361 27 -5 106 167 -167 107 -112 164 131 135 155
5849 155 355 -121 37 81 288 18 -113 213 -213 -132 104 -11 333 78 -15 302 25 133 -157 -122 365
5870 365 88 34 -242 64 7 87 144 -36 324 27 117 282 76 313 -7 108 111 -59 -10 -224 56 24 -171
5893 -171 -126 232 18 61 -173 -144 -49 -32 -169 -314 -46 336 -244 126 8 55 106 123 67 -271 148 118 -75
5916 -75 167 45 -351 -52 198 -69 -9 -125 412 -98 61 133 -50 276 122 -137 -15 -90 -274 147 204 -138
5938 -138 -15 161 22 -59 -204 -53 -114 143 55 136 -184 -74 145 108 129 9 -158 -50 -147 61 -66 271
5960B71j44L7j50j21J71j43o0l7j80J90L3J22k9K43l00j07M86k18J43j69k07K79
5982A10K0lRj66J7P4O0k46R9J65p1J15l95K35K89m17LJ05K76k03J19k06N9r3J46
6007A01j52J31J4q8J09k22K89j12okn0k44L43j07J11m3p6q0N5J2L3K44j42j59
6031d1j82J37nR6l7k3kL3K4k05lJ58o1m3J36M1N9j99K4L35l59j67R8L04K80o55
6057b57J32L8L43j29k67Q3K56p9l74J74q7K45L6l1L1j22R8k07L18l10K74m7O5
6080A83k69J34R2r2p2j38J21J07m7J7j55O0J39p9R2j03j9M9K42j70k16L70k18
6103B8o0lJ11O2j04n8J2j9j47M7J37k83L15N3j5j61q2kK81l72K06o6K01k14O1
6128g2K02m40J30M18j80K93l62J69j87Q3r0K17l91O3L35k40M01m18k90M12k8j27
$$ plain form
5960 271 127 164 14 -107 64 -79 -139 -176 -356 -166 -133 -11 -40 203 -97 -204 282 64 207 38 -169 110
5982 110 130 127 136 -30 -13 61 121 -125 -26 139 68 183 -212 23 312 -105 -102 3 279 76 195 -11 48 -45 101
6007 101 -51 80 94 6 115 -107 182 70 64 62 12 -232 111 4 115 72 -4 -84 -29 -17 16 260 118 -41
6031 -41 -223 -86 -91 5 -32 -55 -57 -24 0 -205 -208 -50 -111 -154 -18 23 82 -117 -93 242 -117 -284 -186 118 398 -257
6057 -257 -125 -87 256 127 -140 -57 199 120 -254 -80 -167 78 114 83 114 -8 90 -117 201 -109 165 118 183
6080 183 -86 48 140 48 -24 -162 -41 66 19 36 -119 -59 80 1 93 -10 -29 20 262 92 -124 246 28
6103 28 -32 -35 76 138 34 -24 -12 -31 -178 -131 6 -277 38 91 76 -85 -167 -169 112 -260 -54 -120 81 -133 -72
6128 -72 130 -310 -180 238 58 351 -11 158 -29 54 -36 181 -210 -147 188 -52 349 -69 -359 53 25 -102
6150a02lm4J38J61j77j78J44n1J2l5J44k62k3M18k93K32J55k95j12J02J42L8K9
6173A40k55j24J35K53n1j6l06k6J68m5m5K05Mn5j06j91M39J24J43n09K68j01M8
6196I7m2k46K71k41J58j2k05M05L09m79P5o9R6m2R1j83j43R9N7K38k49J06N8l12
6220a63L48j49r3J58j36K47j10j87J95j77K65k08l51K93j30K14L04k87Mn8N5p1
6242c7M7r9K61r9P2J19j13k57O7K3J35Q8k51J66j20k55K89j82K67N7j79r0J05
6265A4k44M74l96M06P9m6j80l27K02k04K37k5L1o0J14M7m85L72o6q0J4K84k47
6288h6%J10j61K66l48r1L61R3j11m5J95k24j7O9n3O9j1K98m52M2K49N2J0l77L00
6313A38j28%o1K22k77J75o1J17l47J04L40l80K55j44j36K34j74n5J32j4K07j98
$$ plain form
6150 -102 -105 -149 -11 150 -27 -205 -61 -112 -100 -135 9 -253 -276 142 -151 81 236 -59 -171 -69 73 111 140
6173 140 -115 -239 -104 149 98 82 -224 -250 -82 -127 -172 33 37 -18 -124 -315 124 248 391 -118 150 49 97
6196 97 55 -191 80 -161 -3 -15 -220 185 494 15 90 21 117 75 166 -17 -160 -61 -4 234 -15 91 149 -163
6220 -163 185 36 -57 101 -35 212 102 -85 110 -67 198 -10 -361 -68 -198 16 320 33 37 -21 34 -37
6242 -37 10 -89 172 73 145 264 151 -106 -39 -16 119 207 -44 122 2 -253 36 -146 121 178 -1 -91 14
6265 14 -230 244 -152 254 333 287 107 -220 -18 -222 15 -10 21 -39 75 122 -363 9 -57 -137 -123 161 -86
6288 -86 -86 24 -137 129 -219 -310 51 144 33 -12 183 -41 -58 11 -42 27 16 314 -138 -96 153 205 215 -162 138
6313 138 10 10 -51 171 -106 69 8 125 -222 -118 222 -158 97 -47 -183 51 -123 -178 -46 -60 147 -51
6335e1j78J84L77k42j01p7J13R1j71j7l1p5K79k0K2P1k75M1R7j91k0J85R5j03
6359Cj07R9K29k82j04M6J44j6j19L0N4K81k76m0r3K45j18j23N8o6P9j46lM6N01
6384C22o27L14J3J35l12r2M2J81L4J1J91j99j03J9J30O8j01m6L2J3J50j58L41
6407C58k91J9m2j30K47J5k08k71K57p3J91j99K30J92N6j25l09K3P6j47R5K42p8
6430A28j70O3P5k7N%k7k29L06K3j13J67l43K70K1j68p8p7pN2J33j86K08k90K40
6455b4J06k9J07j78l6J33j37O7l9J2qj89L07k94j8J85J55j05j15K55k84L5K22
6478A28j62R0J66k67N0R7R7l96J68O9j78J57K3r4K53L5j50l83L14J65l14J74J09
6501A51l69K11j3M1Kj34j71J13K37j13M5j68P6j7R0k55K53R2N7m34K31J06j63
$$ plain form
6335 -51 -229 -45 332 90 -11 -88 25 116 -55 -72 -103 -178 101 81 103 174 -101 -60 37 -154 -174 11 106 3
6359 3 -104 -5 224 -58 -162 -116 28 12 -107 -77 -23 258 -18 -58 -151 94 -24 -147 -89 -155 -76 -222 -225 -179 322
6384 322 -305 9 22 157 -155 -247 -205 -24 10 21 212 13 -90 -71 59 127 26 -20 12 25 175 17 358
6407 358 67 86 44 -86 161 176 -32 -303 -46 -119 72 -127 103 295 351 226 -83 -60 16 -131 -36 206 128
6430 128 -42 21 96 69 74 74 47 -182 124 147 34 201 -142 128 149 -19 -97 -174 -181 -129 4 -182 26 -264 -24
6455 -24 82 53 160 -18 -54 79 -58 9 -30 -18 -26 -215 92 -202 -220 -35 120 15 -100 155 -129 -94 128
6478 128 -34 56 222 -45 5 102 199 -197 -29 40 -138 19 42 -52 201 236 86 -297 17 182 -132 42 151
6501 151 -218 -7 -20 21 23 -111 -282 -169 68 -45 0 -168 -92 -109 -19 -274 -21 71 128 -306 -75 31 -132
6524a32J16j28K63J06l18R6L7j32K68o0O2k05R9j08K67k02o9J22j12J42K46m24
6546f6J43k69R3J85Q4j14K85m07K05j74L35j55n2j9j06O5k2j35J01J32k09K85
6568A85o8j41o5N4K4J22j90L42j28J17j78L31j44j28l12L87j50q6K02k90L4K01
6590A19j58J86j93K91k70K43k44L15k58o4k47L78K39j20k2j78K75l12L22m17J22
6611Gn6j3Q7J07k74R3K73j63R8l28l2L94l69R2P7K42l95K84j24J05k11J22J00
6634A16k60K75m1j01O7J86k82o7L26m26K21j64J62j81K05m6Q6j43p9rK19j89K76
6657A51j47j2j4J10J51k69J82j23P4j90K28m18K28J54j03j63N9J8J64p8N9p3K87
6680B75j15n5j86M0ll8m4J98j80N1k1K52k48k09J77K07k82K63r8k05K09p1k1K01
$$ plain form
6524 -132 -16 -144 119 225 -93 3 40 -92 176 116 178 -27 72 -36 231 29 -40 82 -30 112 358 -66
6546 -66 77 -192 -99 86 170 56 341 -66 139 -35 300 145 93 74 -32 33 11 -124 -23 109 -100 185
6568 185 117 -24 -89 -35 -11 111 -79 263 135 252 74 405 261 133 -179 208 58 -28 174 -116 -82 119
6590 119 -39 147 -46 245 -25 218 -26 289 31 -33 -280 98 337 217 195 17 292 -20 302 -115 7
6611 7 -49 -62 25 132 -142 -49 224 61 159 -169 -201 193 -176 -84 -7 235 -160 124 0 105 -106 16 116
6634 116 -144 131 90 -11 56 242 -40 -107 219 -207 14 -150 12 -169 36 -10 76 -67 -146 -155 64 -125 151
6657 151 4 -8 -22 88 239 -30 152 29 103 -87 141 -277 -49 105 2 -161 -102 -84 80 2 61 -12 275
6680 275 160 105 -81 -41 -44 -82 -126 72 -108 -57 -78 174 -74 -283 -106 101 -181 82 -16 -221 -12 -83 -104 97
6704I7m7k54J24M1RK29j69L23j99j05J23l5k18J18p6J15q3j13pK3K15K7j32MN9
6729F9j30k81N6R4J94j53J00K08j11p6l51M42Q1l11J33J12k42L98m58M46m63K77
6751C4l62M19k6j18L2k0L7J45k07p4rJ13R7j39P2J39j99J00J02K9O7l83j13M9
6775b15K99j39J63k73M4K35m59M37P8j94l8K3R5R8l09K75k6M8K02n05J89j57o2
6798a91J51Q4J0j86K72k40R1k47J61K23l25K45k21J13J82m0j38K32j17J30l00
6819a11J33J43o1j89L7J15K06k07l47J48K20j03o8K82n2l09L30j06R1n6j71m1
6841a16j69K26m9J08k66M15k22J5K43k97n2K81Q9j96o7J57P8m5o9J18m58L70l54
6864b60O0J4K44R5j93j82L75j69K35n69K99%J02J73j02J9j09R9l36R8K33k32K41
$$ plain form
6704 97 50 -204 -80 -39 -30 199 30 353 154 49 172 137 -81 37 -39 76 -7 -120 -127 -104 111 138 6 10 69
6729 69 -61 -342 -286 -192 2 -151 -51 157 46 -30 -381 61 142 -169 -36 76 -166 232 -226 220 -243 34
6751 34 -328 91 65 -53 -21 -41 -4 141 -66 -140 -149 -36 61 -78 -6 133 -66 34 136 165 232 -151 -264 -215
6775 -215 84 -55 108 -165 -121 114 -345 92 170 -24 -62 -39 56 154 -155 120 94 142 344 -161 28 -129 -191
6798 -191 -40 44 54 -132 140 -100 -9 -256 -95 128 -197 48 -173 -60 122 82 -56 176 59 189 -111
6819 -111 22 165 104 -85 -48 67 273 66 -281 -133 87 -16 -84 198 146 -163 167 61 152 96 -75 -116
6841 -116 -285 -59 -108 0 -266 149 -73 -58 185 -112 -164 117 206 10 -57 100 178 133 64 182 -276 94 -260
6864 -260 -200 -186 58 153 -40 -222 153 -16 219 -350 -51 -51 51 224 122 141 32 131 -205 -107 126 -106 135
6887A35l31J62J93k63K80j06k09J71q5K69j68j53q7L57j49l83L15p0L58k96K01
6908A41j56J78j37p6l0pM3n4J39J63j93k88J97M2o2K89k14R0K8j85J21k04Q4R0
6932aJ1P3k81M93m73K8M20o38K69j6J82Q2J22k38J4J9k69R6M7R7K17j80o2K36
6956B48l31J32j48n2Q6M1J55j26J57j59j94J49k21L50R9o3j20k8J8L6L7j70k26
6979c30N93j83j88NJ33K39j29j9l15j66K49j68L95P0m16K31Q0k66M04P6m32J63
7001B6j22J61o4Jj62j22L14j40L07m9l02J36J66r0k23J71l8q8K65q1k55L99k2
7024A88l82J23J29q3P2k2Q2q6K90k45k0l74O01k64n4MJ51q9j87M6j46J82j29L53
7048A40k90N2K53q9j80N82o87R0J23L6p3m3K1J18R7l68J54P4p9K12l18R3N9j29
$$ plain form
6887 135 -196 -34 159 -104 176 70 -139 32 -53 216 48 -105 -192 165 16 -367 -52 -122 236 -60 141
6908 141 -15 163 26 -50 -80 -87 -44 -98 41 204 11 -277 -80 -38 -100 189 -25 65 93 -92 29 -175 -91 -1
6932 -1 10 83 -198 295 -178 -150 270 -368 -99 -115 67 149 271 33 47 66 -203 -107 -60 37 254 74 12 248
6956 248 -83 49 -99 -151 -65 -24 131 5 162 3 -191 -42 -263 87 186 123 3 -25 -7 29 66 -104 -330
6979 -330 263 80 -108 -103 30 269 140 121 -194 -360 -111 -279 116 186 -230 1 81 -185 219 295 -137 26
7001 26 -96 65 1 2 -160 -282 32 -108 199 150 -152 -16 150 60 -163 8 -30 -118 147 66 -189 210 188
7024 188 -194 -71 58 -25 47 25 107 21 311 66 46 -328 273 9 -45 -41 110 21 -166 -120 -266 -84 -213 140
7048 140 -150 -98 155 66 -114 468 -219 -129 -6 30 -43 -86 -65 53 150 -218 -64 10 -69 143 -175 -82 -23 -152
7072a52J62j50O0P8j30l5R0L09l56J22K45p8l55P3K73l0j82M67k22l4j62k88L61
7095F6j0L41n80L82k13J33j32K26j93j02j40L66o3j50J49k49J83j78J47p0J38
7116E1q0o5K20j66L16m25Q3J52m2k78N57k60O6J18l43J18J23j05R7Ml27L57k42
7139g1k17L56Q0k29k25L39N3j59j12L60K6j80j47J49J14k88O0k10J65J39J05k31
7161a23L36no5j87M2n5J86j10Q0n6j00L09l74K24j20j28J37l8J7k0P3k40L95k30
7185e2pR4J15J92m47J25J10k81J46R8l60K40Qn0R9K8l8n1P1p2j15K59j9o2k0K44
7211B55r0l13J0L9j09J90%j19J20m2J44j48J0L57j66m5j54J52J58j71r7J64j62
7234a7K94j53J70j96J43j58k2l7q4j5rK3J39l98J41L09j4l7j34J76m8nn4m09J85
$$ plain form
7072 -152 10 -140 -80 -2 -132 -167 -77 232 -124 -2 243 165 -190 -117 156 126 -56 411 189 155 -7 -295 66
7095 66 56 397 -183 199 -14 119 -13 213 20 -82 -222 144 81 -69 80 -169 14 -164 -17 -87 51
7116 51 -29 -94 126 -40 276 -149 -66 86 44 -234 323 63 129 247 -96 22 145 40 137 141 -186 171 -71
7139 -71 -288 68 148 -81 -306 33 86 -73 -185 175 201 21 -126 23 137 -151 -91 -301 -136 3 108 -123
7161 -123 213 208 143 -44 -2 -57 129 19 99 43 -57 252 -122 102 -18 -146 -9 -47 -30 -50 23 -217 178 -52
7185 -52 -59 35 150 342 -105 20 130 -151 -5 93 -267 -27 -19 -69 30 58 20 -31 40 -32 -147 112 93 31 11 255
7211 255 165 -148 -138 -99 -208 -18 -18 -137 -17 -59 85 -63 -53 304 138 93 -61 91 249 78 -19 145 -17
7234 -17 277 124 294 98 241 83 61 24 -60 -75 -84 -61 78 -320 -179 130 116 79 -55 121 73 68 14 -395 -210
7259b10L83k42m3K47L1l34L0L14M2p8J80k07mj42J83l07J17L1P7RJ2Q8k88rL5
7284h5R6J81n91L79J77k70K19l9J5o1j17r0K08oj76K6J66J59l31K43j6K29l81
7307f5J47q8K54k29j16K46k19O2J03l17K31J58k86L16l77K21k31L08j54q6J13
7328ij28K62m9N2j52j07L15k13j01K71k9k2o8k12L44j5k7j32p6O1M7K36j98k20
7352a70K4k7N6J35j4mJ21LJ9m32L47p7J20l80K93j62K07j09n8R1k4K84k98M9j5
7377b1J46j33l73K35K09m2j09j2RM43m85K56nP7k94J69J92m23J69j06K79m52M04
7400A33j12K67k40k41J79J09Q4l48K53q0j92Qn0M6M13k36mJ96m5k21J04n2M4K39
7424B54n64J80p5M10l25J94J1p5K59m15J13j25L4L98n43L03j30KJ84k06J14p6
$$ plain form
7259 -210 173 -69 -112 135 166 -168 -138 176 218 140 320 113 109 -33 150 -157 -40 -9 68 77 89 177 -111 -120 -85
7284 -85 11 192 -399 -20 157 -113 106 67 82 21 -96 -186 22 16 -160 -134 32 191 -140 103 87 316 -65
7307 -65 82 -6 248 19 -97 149 -70 -8 95 -222 9 167 -119 197 -180 41 -190 118 -36 -122 -9
7328 -9 -137 125 76 128 -24 -131 184 -29 -130 141 112 90 22 -190 154 139 112 -20 -96 -35 12 248 50 -170
7352 -170 -146 -173 -117 18 4 0 121 124 143 -289 58 -19 101 -279 14 -148 59 -50 -108 -17 -41 243 -55 -6 -21
7377 -21 125 -8 -381 -146 63 21 -88 -100 -91 352 -133 123 118 195 -99 70 262 -161 8 -98 181 -271 133
7400 133 21 288 48 -193 -14 95 179 -169 84 4 -188 -180 -230 -184 229 -7 -11 185 140 -81 23 -29 15 254
7424 254 -310 -130 -205 205 -120 74 85 10 269 -146 -33 -158 -124 274 -269 34 -96 -94 90 -116 -2 -78
7446g8J45j36K13K6j11O1J50k76j08J88j31P0K16j67J68j03m52K61j60P17m75
7467A8j80J45K58j8k89J53kk86L21M3j45K67n42K40L7k93rK29P9M25n05K2m8L43
7491B63j64j14L04j38J41m00j4J01L25m78K61J40Ql14J39l05J92m6J40J14L7j76
7513A6p4J46J16q6L0j43j28J09k8J67qj39K98m28J19l4j22L11o2j3K52k34l14
7536b49K33Lj32N5O8P2j53J32k09N2O7K46k3p6L7l56L10j64J1N26o78J10R6P4
7560E2k69K67K3j56L04l72J75J57j64k16M4L1Q1L23k53j49Q3j2L51l21o8J52Q7
7583A50j46J10k19K23k3j28PM3J90L8l14K00p9k76K05M9J35j57M8O9J72m11J19
7606EK26j96K16l91P6M3l3K73k49R2Pj49K68j14M9r6J8j80J96jon9j68K48k35
$$ plain form
7446 -78 67 -69 144 170 59 120 270 -6 -114 74 -57 13 229 62 230 127 -325 -64 -224 493 18
7467 18 -162 -17 241 223 -66 87 85 -201 120 163 18 285 -257 -17 20 -273 -282 -53 26 451 -54 -32 -80 263
7491 263 99 -15 289 151 292 -108 -122 -21 304 -174 87 227 235 -79 60 -245 -53 -99 41 155 192 16
7513 16 -58 88 204 118 148 5 -123 -14 -42 125 117 -22 276 -152 -33 -67 -189 122 60 47 299 65 -249
7536 -249 -16 -13 -145 -90 -22 50 -103 29 -180 -128 -61 185 162 86 123 -233 77 -87 -76 450 -228 -118 -22 52
7560 52 -217 50 73 -83 221 -151 24 181 17 -199 -155 -124 -43 280 27 -122 -39 -51 300 -21 -89 63 150
7583 150 4 114 -105 118 95 -33 -26 17 207 245 -69 131 52 -224 -19 30 165 8 56 125 297 -114 5
7606 5 231 35 251 -140 -64 -21 -54 219 -30 62 69 -80 188 74 123 27 45 -135 61 60 54 -5 -173 75 -160
7631a60N5j59M63k89j55K84K27l25K39k92K47k79j17L22j52K37j70L7J18l2l5
7652F4k18J15K62k17j84M8N0j20K75L7j16J01k03P3R7k78k35L07K48j91K88l88
7674a85K04n9o2K00k56J31P0l81J10n9J96J98j91K58J37j83l55L45o5mJ32k13
7696c2j1K82k82k4J91O3j32M6O5j43q0k04R8K04J4Pn6R1J11l34L57r3N3l99L98
7721A90k01p8L26l37J10m0j20o3J43K35j57j3N8J8l2j00Mn1L34k91k3L08p0l17
7745a67J59n8K53k53j04J82l77L61k8j19J94L3R3j99j40J07j28mJ46J07n3j12
7767a07J65j2J62k02j5R6j66k4J70o2j85P8O6P9j72K0J32j19R1K4L7K11k69p1
7791g3k35J73J57K51l43P0K77k54j78o5K11j60J41O1j09K96j80K17k50J13j87
$$ plain form
7631 -160 -105 -264 199 -90 -245 39 266 -59 180 -112 135 -144 -261 61 -91 146 -24 13 131 99 64
7652 64 -154 -39 223 6 -178 -130 -80 -200 75 112 -4 97 -106 -33 64 -214 -449 -142 106 -85 203 -185
7674 -185 19 -40 -102 98 -158 -27 43 -338 -228 -287 -91 107 -84 174 311 128 -227 118 53 49 181 -32
7696 -32 -43 239 -43 -67 124 187 55 101 166 23 -57 -261 -163 41 55 62 6 97 208 -126 231 138 191 -208 190
7721 190 -11 -89 237 -100 10 -30 -150 -213 -70 165 8 -5 53 71 39 -61 -57 -108 226 -65 -88 220 150 -167
7745 -167 -8 -66 187 -66 -170 12 -365 -4 -32 -151 43 76 169 -30 -170 -63 -191 -195 -49 58 5 -107
7767 -107 58 46 208 6 -9 87 -79 -103 67 5 -180 -102 -36 43 -129 -109 23 -96 -5 19 56 267 -2 -73
7791 -73 -308 -135 22 273 -70 0 277 23 -155 -220 -9 -169 -28 33 -76 220 40 257 7 120 -67
7812f7j14J26R1oj44j40L75l59L25q0J22J10n21K18J61J03j12k89J94K17m04J47
7834d7N5k17O3L79k83q6J01m8J52qr6n3R1J02J23l69N5J35K98l70j39J48Jj99
7858b12L37m00K39L10k20L2l03J48n2k4L7L8n8j97K79J07o1j41j7J85j77l8R3
7881i5J12ol62L83l10K91j65L23k07M52n79m8K51L1L03m63J34R4J53m31R5J1L1
7904bjMJ88j92j04k12K63J29J20k96j40L45k2p7o9J05p3J65j51N1J16m23L42j6
7928E0J77k30P4j05L5r6K63R5k27L00k75J6k08J93q6l5K8j46K37R8j15K45j47
7951A41r7j99J79J23j58k10L48J09m17l1O49l82j42J94j3j32j55R7j0J43j7k24
7973b04J42Q7L9k23J37p1J24m51M16J7l1K4J79j32j10Ln6K07j07p5J48Pj19J91
$$ plain form
7812 -67 -181 -55 36 30 -114 -254 121 -238 87 7 129 239 -282 -64 97 200 88 -201 -7 210 -194 -47
7834 -47 8 -209 -146 233 -50 -136 -35 -83 69 61 -35 -88 3 105 228 -141 -86 49 347 -23 -162 -14 -13 -212
7858 -212 125 -275 -36 274 54 86 -217 -69 -121 -145 -108 -70 -128 -325 -46 61 0 -141 -158 27 -150 -188 -95
7881 -95 17 11 -351 32 -278 13 -152 171 -36 416 -163 -211 40 71 374 -89 45 139 292 -139 -44 -33 -2
7904 -2 -3 1 189 -3 -107 -319 -56 73 193 -103 -243 102 80 3 -66 39 -34 131 -20 31 147 -276 66 50
7928 50 227 -3 71 -34 1 -95 168 263 36 336 61 77 -131 62 -24 -59 -31 -177 60 158 43 288 141
7951 141 44 -155 24 147 -11 -221 127 236 -181 -212 437 55 -87 107 94 -38 -193 -96 -106 37 20 -204
7973 -204 -62 25 64 -159 -22 -93 31 -420 -4 13 -18 6 185 53 -57 -54 -110 97 -10 -85 63 70 -49 142
7997A42j3j66J72k18pk0L5Q4k13J49M15m05O9j31J1J57j61J07J14O8k22qJ7Q0
8021E6K51k59J37q1N1r4k28K80o9O1k31P8J53q0k70L21J12j09j59q6J88R5j57
8044d0l6L56l12NK68k27q0O7J15r8M4O3k93J81M5lk47J64j63J03M8o6J74k3Mj87
8070a38J27K74l63L19j52k4j31r8J35O1O5j39j46m6M06p8l19L84o3k1J30o0k05
8093h2J9K1R0K16k14k1l00N6K56n8q7J9J35o1j44K11N6N4k94K03J64j09j14r4
8117g8j90L04j35J61j23J4K4j79J70J80P1k83k7K41j5k21k76L55L86m10j64L29
8139A34O0l24j61M00k62R6k66J38R9o2l8P2J52J1k56J33L03j86m6O8j33R4m22
8162c96K72J66q9N8j71M8m6J1l7J47K10l11k8J50J64K5k35K98k66j08J21j03L9
$$ plain form
7997 142 129 -37 135 -83 -90 -110 -75 9 -204 -55 360 -45 24 -107 -96 61 -100 7 121 189 -33 -41 -24 56
8021 56 307 48 185 104 155 61 -167 113 44 105 -126 -48 105 25 -245 76 188 79 -80 -166 22 117 -40
8044 -40 -76 280 -32 -27 241 14 -66 1 116 18 62 125 -168 13 58 55 -192 -28 -191 -88 -40 -106 68 45 49 -138
8070 -138 -11 263 -100 219 67 43 -88 -186 -51 10 75 -64 -210 -256 150 72 -247 137 74 53 183 123 -82
8093 -82 -63 -42 48 264 50 29 -271 -215 41 -17 -104 -85 50 -11 -155 56 112 166 -128 75 239 130 16 -78
8117 -78 -268 36 -99 62 -61 -47 -23 -202 -32 148 219 -64 -91 150 135 -86 -362 -7 379 -31 -195 134
8139 134 194 -130 -291 109 -153 -57 -323 -185 -86 -148 -186 -114 38 49 -207 -74 229 43 -3 65 -68 26 -396
8162 -396 -124 42 -47 11 -160 -112 -158 -147 -184 -37 173 -138 -166 -16 148 173 -62 236 -30 -138 -17 -120 -81
8185h1J26l00P6M24k20j57
$$ plain form
8185 -81 45 -255 -179 245 25 -132
8191a32
$$ Imaginary data points
##PAGE= N=2
##DATA TABLE= (X++(I..I)), XYDATA
0@%%%%%%%%%%%qQqJ6j6K1k9L2l8M6n6O4p2Q8j04J20j39J61j85K11k39K74l12L50
35A85l94M43m98N55o17O90p67Q50r41J041j151J269j399J543j700J875k065K277
53A196k515K774l070L410l798M250m783N424o210P201q496J0266j2849J6986k4691
68a4905M3894j82999l89982J01236J99003K22953J98186J32677l2286q7958r5371
79I4448j14195j59686p4924M2307J10890J53685J33623m6692j24698j3935M8924
90D9747q016j9665j7659o3027q1882J3870R9158N6606J1310O3871N6988k4381
102A36920p5455j25043j43638l0255R8641J31012J21859R6099O259j10752j31913
113b6266n7514m6192o9361L1544J46853J24891O1240M312p2896j02786o5530k7520
$$ plain form
0 0 0 0 0 0 0 0 0 0 0 0 0 -8 0 -8 8 -8 13 -16 16 -22 24 -32 32 -40 48 -56 64 -75 86 -99 112 -127 147 -165 185
35 185 -209 234 -264 291 -326 364 -403 447 -494 547 -604 665 -734 809 -891 984 -1081 1196
53 1196 -1319 1455 -1615 1795 -2003 2247 -2536 2888 -3322 3879 -4617 5649 -7200 9786 -14905
68 -14905 28989 -154010 -543992 -442756 -243753 -20800 177386 310063 277777 189819 94448
79 94448 -19747 -179433 -254357 -212050 -101160 52525 186148 139456 14758 823 49747
90 49747 41731 22066 4407 -58620 -140502 -126632 -27474 29132 40442 104313 161301 136920
102 136920 61465 -63578 -207216 -237471 -138830 -7818 114041 210140 216399 105647 -26266
113 -26266 -83780 -129972 -199333 -167789 -20936 103955 165195 169507 96611 -6175 -71705 -99225
125i9225n309K2635M8862L9800K1509M7997L7867n5071p2885m143l543l5194j0368
138f7068J4815J1770K3247N5742O3881J3268m1999n8593o6909m9097j179J0283
150i1839L1484R3971Q9568J0877l4655m5976o7520p9583m0631L2122N6002M2504
162c676N9187N8968N355l6823o5121p8668l4545J2485J7974K3708M3432M6178
174D8454K5600O03l447k6313p2899n6780M008J9544J6773K9238L3778M0576L3931
187I3066m267m0790o1336o0594l2351N475M9205O9924L2633O227K2989O002m5362
200D0821o6689n5525k2602J7100M3091O3220N3840J2051j5436k5310l1328l1389
212a8156m2420l5088K2063N6127L9089K5545J8722J176k0824l5387k5246j7752
$$ plain form
125 -99225 -104534 -81899 -33037 6763 28272 76269 114136 59065 -13820 -17963 -21506 -56700 -67068
138 -67068 -52253 -40483 -17236 38506 102387 115655 73656 15063 -51846 -100943 -102122 -91839
150 -91839 -60355 33616 123184 134061 99406 53430 -14090 -93673 -134304 -102182 -46180 -3676
162 -3676 55511 114479 119834 83011 17890 -60778 -95323 -82838 -64864 -41156 2276 48454
174 48454 74054 74657 71210 44897 -28002 -84782 -80774 -61230 -44457 -15219 18559 59135 93066
187 93066 88799 48009 -13327 -73921 -106272 -100797 -51592 18332 50965 57192 80181 86183 40821
200 40821 -25868 -81393 -103995 -86895 -43804 19416 73256 85307 69871 44561 13233 -18156
212 -18156 -60576 -95664 -73601 -17474 21615 47160 65882 67058 46234 10847 -14399 -32151
224c2151l3686j9026K9690N6886N2276K2322j0838j2599j8036m6013m6823k1892
236g9890J541K4475M3308N8587M9782m019m7059m3186l6549l1665j4648P552L7351
249c4420N3194L4570J7816K678l0800m9384m0422j5060R251Q487J0034M0669M4135
262E0748J1671j0198j8596k2467k8714l7111j6580K0308K8084K5095L1847K8954
274F3041J3013k3883n1244l3361j2399j8243m971K8979N1256M8340J8483q384
286G0627k2999m7438n2636j9639R005K2581K8917K9561L6017K4207j7795m0009
298B0399l4613k9258j6547L602K4295L7332K0115K813J5833J2625k1630m1960
310f994l5416r832R656N795J2964L2966K9304J3729J132j4044k5965m1476m5108
$$ plain form
224 -32151 -65837 -84863 -55173 1713 53989 76311 65473 52874 34838 -11175 -57998 -79890
236 -79890 -78349 -53874 -10566 48021 97803 93784 46725 3539 -33010 -64675 -79323 -71771 -34420
249 -34420 18774 53344 71160 73838 43038 -6346 -46768 -61828 -52577 -44090 -34056 6613 50748
262 50748 62419 52221 33625 11158 -17556 -54667 -71247 -50939 -22855 2240 34087 63041
274 63041 76054 52171 927 -32434 -44833 -63076 -68047 -39068 12188 60528 79011 70627
286 70627 47628 190 -52446 -72085 -63080 -40499 -11582 17979 53996 78203 60408 20399
298 20399 -14214 -43472 -60019 -56417 -32122 5210 25325 28138 43971 56596 34966 -6994
310 -6994 -42410 -52242 -42586 -36791 -23827 9139 38443 52172 53304 39260 13295 -28181 -73289
323g3289n633L4308L7026K9250K4599J6372K125k8003m5818l5004k5063n539L1229
336d3440M7637L9777J5956r597j2774j2181l2039l6641j6803N633K5038L1141
348A707K9580K6215j939l0607k0892p651j2955k0927j6826J1641L8309K9217J4852
361C9724J1630m070k3001l1737k8391r391j251l12K4896M7179L3789N967j8744
374D6288k9988k8203l2190k1823R766K6746K8895L1821K4540O938j9200m3376
386B14l3096r514m915K718J9341K9701L0029J2662n219p725j9655l4431k3290
399d3180k531J0864J6003J3078K2366L1350R276j9265k7317k6454k1600j2388
411d9798J172K6164L3565J6538J2486J1268p298k8266l8013k6443L91J0002J3702
$$ plain form
323 -73289 -78922 -44614 -7588 21662 46261 62633 64758 36755 -9063 -44067 -69130 -74669 -43440
336 -43440 4197 43974 59930 50333 37559 25378 -6661 -43302 -60105 -54472 -29434 1707
348 1707 31287 57502 55563 24956 4064 -3587 -16542 -37469 -54295 -42654 -4345 24872 39724
361 39724 51354 47284 24283 -7454 -35845 -45236 -46487 -46799 -21903 25276 59065 65032 46288
374 46288 16300 -11903 -44093 -65916 -56150 -29404 -509 31312 55852 62790 43590 214
386 214 -32882 -42396 -47311 -44593 -25252 4449 34478 47140 41921 34196 14541 -19890 -43180
399 -43180 -45711 -34847 -18844 -5766 16600 47950 57226 37961 10644 -15810 -37410 -49798
411 -49798 -48626 -22462 11103 27641 40127 51395 44097 15831 -22182 -48625 -48234 -38232 -24530
424b4530K9482L1746J5872m616j9814k0736k3178l1250j2173K1545K8729K1154
436A2231J5960J3542P174j6302l4831k4991j2639q283Q086K5249L1131K1656n65
449C7418p072k281j6980l2690k4165m127J5380K1385K0884K6952J6801j2842k2489
462A6174j6504j7091j8869j5277P148L5211L4100J4661M060o314j7449k4036k5136
475b9322q594N943K159J1942L1078K8460Q591j3341k2845j7839j8989j8778J031
488d0504J5086J7202K0977K0475J3232j404k7042l2998j4811n870l136Q713K3032
501g048K9413J6310k623l958j1472l0166k7644o693J0984J8398J2444J1599K1092
514C0636J1692j0838k1477k1323j4711j0086m273J6660K9558J4662N553P581k172
$$ plain form
424 -24530 4952 36698 52570 47954 28140 7404 -15774 -47024 -59197 -37652 -8923 12231
436 12231 28191 41733 48907 32605 -2226 -27217 -39856 -48139 -40053 -14804 16327 37983 37418
449 37418 30346 28065 11085 -21605 -45770 -49897 -34517 -13132 7752 34704 51505 38663 16174
462 16174 -330 -17421 -36290 -51567 -44419 -9208 24892 39553 43613 37299 19850 -4186 -29322
475 -29322 -37916 -31973 -29814 -17872 13206 41666 50257 36916 14071 -3768 -22757 -41535 -40504
488 -40504 -25418 -8216 12761 33236 46468 45064 18022 -14976 -29787 -35657 -38793 -30080 -7048
501 -7048 22365 38675 36052 32094 20622 -9544 -37188 -43881 -32897 -14499 -2055 9544 30636
514 30636 42328 31490 10013 -11310 -26021 -36107 -40380 -23720 5838 20500 26053 33634 31462
527C1462j6020k4596k1729o603M601J1271K2258K1780J1243J811j0506j4198j3558
540b784k3004j8433P318K1902K0327J6393J2307O271j2155k6391j7339q350q411
553c2349J021J2521K0932K5000R969q173r267j0182j8058k0450r658J0568J6901
566a1225J0936J6871J9214q03j5338j5343j6011j3423q280q75J4942K3858J8940
579B3463J0539j539j0440j7498k4681j3197N895N579M074J8551K3282J1205n197
592C0036j3635j3071j4870j7849m552R687J4186J6766J2170P922Q214q324k6738
605e8k1010o822N15L893J0782K1497J8767J512l626m814j7069k0122j3260k008
619c1823J1875J6872J1201J1447J0600j349j3937j8844j1786n965q098M013K2173
$$ plain form
527 31462 15442 -9154 -30883 -37486 -32885 -21614 644 22424 33667 35478 24972 10774 -2784
540 -2784 -25788 -44221 -36903 -15001 5326 21719 34026 40297 28142 1751 -15588 -23938 -32349
553 -32349 -31328 -18807 2125 27125 37094 28921 19654 9472 -8586 -29036 -38694 -28126 -11225
566 -11225 -289 16582 35796 34993 19655 4312 -11699 -25122 -33402 -34277 -19335 4523 23463
579 23463 34002 32463 22023 4525 -20156 -33353 -27458 -21879 -17805 746 24028 35233 30036
592 30036 16401 3330 -11540 -29389 -33941 -24254 -10068 6698 18868 26790 35004 26680 -58
605 -58 -21068 -27890 -27375 -23482 -12700 8797 27564 29076 25450 20636 3567 -16555 -29815 -31823
619 -31823 -19948 -3076 8125 19572 30172 28823 14886 -3958 -15744 -21709 -29807 -25794 -3621
632c621J7130M679L714J681n495j5522k0422j0784J812N388J1623J6495J6462
645B3140Q527r115j4932o765j0922j9095n110J3261J8239J3880R533Q633j95j8531
659A0548k0058j0367m429J009O037J1472K0440J3882m946q097n106j1299j5658
672a6572r701N301J2244N263P259J5628P532n217j0229j2805j1315q904o785O600
686b1701J9330J5891Q005L173j321p495k0150j9674k224L071L461J4798K1244
699A6408J3488j814j3494j2398q224j2564r317L175J2733J6567R255L580O336
712B3731k318j7785j6325m535j271j331K548J3468J9527Q420k843m652j0015j3229
726f610j0778o203M195R310O065J1500J6914N118r476j6299j2943p790p040l59
$$ plain form
632 -3621 13509 18188 21902 23583 18088 2566 -17856 -28640 -26828 -21440 -9817 6678 23140
645 23140 31667 22552 7620 855 -10067 -29162 -34272 -21011 -2772 11108 20641 29274 29079 10548
659 10548 -9510 -19877 -24306 -23297 -17260 -5788 14652 28534 23588 15491 10385 -914 -16572
672 -16572 -26273 -20972 -8728 -3465 3794 19422 26954 21737 11508 -1297 -12612 -21516 -28301 -21701
686 -21701 -2371 13520 21525 24698 23377 15882 -4268 -23942 -26166 -23095 -19634 -4836 16408
699 16408 29896 28082 14588 2190 -6034 -18598 -27915 -24740 -12007 4560 13815 17395 23731
712 23731 21413 3628 -12697 -17232 -18503 -19834 -17286 -3818 15709 24129 21286 16634 6619 -6610
726 -6610 -17388 -23591 -19396 -10086 -4021 7479 24393 29511 20035 3736 -9207 -16997 -24037 -24396
740b4396J5315J5161P578N987L689k454j2878k1609j2488M847P911O640R044J1596
754A3943Q344j960j0618n468q050j4370p453O467J2845J2737O328K749L564l636
768A5422j1323j2016j0130l469J609O564J6293J5351K185l864k646r658j3271
781h953j2133l052Q245R085Q893J2646P976k641r048j2035p613m534q411j158
795b2733J4676J7336R228P64k088l247j1274j6545n939K197K715P302J2386J3264
809A8042P599n725j3366q626p747p822k877M507J2358J1700O638O305J452j2382
823A0056j6054q306l552J56K165Q150J5905J0903N93l616p526j1025j2227q907
837b3285K742J1485P399O426J0459P328m319j3040j3995m830j192l500N284J1395
$$ plain form
740 -24396 -9081 6080 13658 19645 23334 20880 8002 -13607 -26095 -21248 -13337 -6697 2347 13943
754 13943 22287 20327 9709 4241 -3809 -18179 -25632 -19165 -6320 6417 12745 15494 19058 15422
768 15422 4099 -7917 -18047 -21516 -19907 -13343 2950 18301 20486 16622 13976 4318 -8953
781 -8953 -21086 -24138 -15893 -6808 2085 14731 22707 20066 11018 -1017 -8630 -13164 -21575 -22733
795 -22733 -8057 9279 18507 19271 17183 13936 2662 -13883 -19822 -17625 -14910 -7608 4778 18042
809 18042 25641 19916 6550 -2076 -9823 -17645 -20522 -16015 -3657 8043 14681 20986 22438 10056
823 10056 -5998 -14304 -17856 -17700 -15535 -7385 8520 19423 20016 16400 8874 -2151 -14378 -23285
837 -23285 -20543 -9058 -1659 4767 15226 22554 18235 5195 -8800 -13630 -14822 -18322 -13038 -1643
851a643R771O786K595q80n097j5013j5564j430N839P017O722P202J0069M279o864
866A3789p337o789j1827r704J594J1078J3665O634J680M668nr932j2617r339l440
881a7882J627L664J1770J5981M187m555m599m778p981j1226p517N263R428O482
895a36Q810Q078J119o138j0582q402k808n503l860Q095J4018R890K776j835j283
910A2239n817j3593r626j35K283N744R272J1171R288j852j1375q672o276o519
924a3868k538K293R255J1028M683L291K964n705j2360q714l496M79J397L640J1505
939C854J0476J075k983l646o161p460r809l069P891O965M340P676P186J093q516
954H912j2320n317j407m241R1Q404J0412Q687K162l202l699q753j1275m210K669
$$ plain form
851 -1643 8128 14914 17509 16629 11532 -3481 -19045 -20475 -14636 -7619 -897 6305 16374 20653 13789
866 13789 6452 -337 -12164 -21868 -20274 -9196 4469 11103 12783 17451 17446 7514 -5103 -14442 -17882
881 -17882 -16255 -12591 -821 15160 19347 14792 10193 5415 -2566 -13792 -21309 -16046 -6618 -136
895 -136 8674 16752 17871 11733 1151 -7251 -10059 -15562 -19422 -11327 2691 12581 15357 13522 12239
910 12239 6422 -7171 -16797 -16932 -14649 -8905 367 11538 20826 18974 7599 -1073 -7349 -13868
924 -13868 -16406 -14113 -4858 6170 10853 14144 17108 11403 -957 -9671 -13167 -12688 -11291 -7651 3854
939 3854 14330 15405 12422 8776 2615 -4845 -14654 -17723 -9832 -2867 1473 9149 16335 17428 8912
954 8912 -3408 -8725 -10132 -14373 -14282 -5878 4534 13221 15383 12181 8482 -271 -11546 -15756 -13087
969a3087M791N145N310P538O667l078p739o296q561n944M06O471Q645N048R93
984F309M501L673m261r633r929m419R58J634M966J2582Q166n89k895l560m860
999B643q996j0775j020R742R103O337M707J898m81p124j0229m106k575l246L586
1014a0536J0187R662L742k561l132k108p381p218k060K73K374N569P749R031J895
1029A5486q580o785k365l811m803l545M737R744N894K660M584o03q575j0095n432
1044a1489J318J919n10M051J0621P193J098m155o429n884q292n420N045P851M217
1059A134M938M861K845l367r357o836j884k759n49N304P635O757J362j457K62
1074H889k753j0058p766N48L439L451K347O229R015L69o974m864n017n755m631
$$ plain form
969 -13087 -8296 -3151 2159 9697 16364 13286 5547 -749 -9310 -15254 -14848 -8377 268 5316 6309
984 6309 10810 14483 10222 589 -9340 -13759 -12801 -11167 -6201 6381 14547 13958 11063 7503 2643
999 2643 -6353 -17128 -18148 -8406 697 7034 11741 13639 13158 6034 -4195 -8301 -10876 -14122 -10536
1014 -10536 -349 9313 13055 10494 7362 5254 -2127 -9345 -11405 -11132 -8758 -3189 4560 13591 15486
1029 15486 6906 121 -2244 -6055 -10858 -14403 -9666 78 5972 8632 13216 12613 4038 -6057 -11489
1044 -11489 -10171 -8252 -8762 -4711 5910 13103 14201 10046 3617 -2267 -10559 -15979 -10934 -3083 1134
1059 1134 6072 10933 13778 10411 1054 -5782 -7666 -10425 -10974 -5670 1965 8722 10084 8627 8889
1074 8889 6136 -3922 -11688 -11140 -7701 -4250 -1903 4326 13341 13710 6736 1872 -3145 -8900 -13531
1089a3531L01Q233R009K917J620L214k126p695q801n176J111J858K289Q095Q243
1104I561J707j974l601l549n095q188k979O114N749L704M776M177J478m801q081
1119a002m372j963l114M96O297P360N528l81j488P09m757q523n234k39K826N158
1135b699M624P295M212m653n857k350l364m404m003N99Q119O933L087K415L40
1150A0294m649o960o148q44J978j368Q49P952P513K959k345m971m364n152n354
1165a0610M38M246L225M135M312M116J568n520q721l699k374j110L100N562O232
1180D900L048p38J27k63p056p494k260J270L849K735L268P114M018m039n420m323
1196a264l771m135k000M347Q826L810R22J840J3l041o325p481j638J724J662N250
$$ plain form
1089 -13531 -13230 -4997 4012 6929 8549 11763 9637 1942 -6859 -12035 -10924 -9066 -6777 1318 9561
1104 9561 11268 9294 5693 2144 -2951 -11139 -14118 -8004 -2255 1449 6225 10402 11880 7079 -1002
1119 -1002 -5374 -7337 -10451 -9955 -3658 3702 9230 8849 7361 8070 3313 -5210 -10444 -10683 -7857 -2699
1135 -2699 1925 9220 13432 8779 2922 572 -2792 -7196 -11199 -10600 -2481 4452 7539 9954 10294
1150 10294 5645 -1315 -7463 -8307 -6329 -7697 -6848 1104 8617 11576 9231 4260 -104 -5256 -10610
1165 -10610 -10172 -5926 -2701 1434 5746 9862 11430 5910 -2811 -6510 -8884 -9994 -6894 -1332 4900
1180 4900 7948 7210 7337 7074 18 -7476 -9736 -8466 -4617 -1882 1386 8500 12518 8479 3059 -1264
1196 -1264 -5035 -9170 -11170 -6823 2003 5813 6735 8575 8588 5547 -778 -8259 -9897 -8173 -6511 -1261
1212a261O512L859L71l267l480k638n923n727J797N042L899M603M438K575k239
1227H561p469n618j720k431r88L343O046P448K114l223l32j263o487o842k299
1242a1160L684N094K309L625N991N79m672m162l137l497l634j885N569Q307M056
1257G067J486j76k635m019n464l004M46l51l98O955P779L699k824m789l154l087
1273b469m982j989M028L163K707L333M291L044m028r298m401L32J97L05J205N171
1289F09O000J132j803jm147p150m046Q55M422K785O56M136N014o5l439m607m959
1306d608l125j827K189P061M432K54J565K088j188n913p619k192K084J255L329
1321b215N992L684M49l029k116k04m277p288j042M775N370M467J532J402%m643
$$ plain form
1212 -1261 5251 9110 9481 6214 2734 96 -5827 -11554 -9757 -4715 -816 3787 8225 10800 8561
1227 8561 1092 -4526 -6246 -8677 -9665 -6322 -276 7172 9286 6063 5731 4468 -2019 -8861 -11160
1242 -11160 -7476 -2382 -73 3552 9543 10122 5450 1288 -1849 -5346 -8980 -10865 -5296 3011 7067
1257 7067 8553 8377 5742 1723 -3741 -6745 -6299 -6650 -7048 -93 7686 11385 8561 3772 618 -2469
1273 -2469 -7451 -9440 -5412 -2249 458 3791 8082 11126 7098 -2200 -6601 -6269 -6072 -5767 -4562 609
1289 609 6609 7741 5938 5937 1790 -5360 -9406 -8551 -4129 -1344 -688 3448 8462 8397 4958 351 -4608
1306 -4608 -7733 -9560 -7371 -310 4122 4376 5941 8029 6841 928 -6691 -8883 -6799 -5544 -2215
1321 -2215 3777 7461 7910 4881 2765 2561 -1716 -9004 -10046 -5271 99 4566 6098 7500 7500 2857
1337B857n516j345j438j868P97M626O751L475k415j357j287m326m082k228N49
1352f807L388J919K694N264K029l147l929k958k062k434k878K295O448M232K453
1367F507R74j430l127n633m264L02J425J54L651N607M112K2m624l402j609l442
1383d777k516J866L128K750K258K157L135p89o419m821p54o9N51K02K812N787
1399D501K478j449k12k279m561m229j617K453L184N42K696N034J524k025m429
1414A611m784k392j164o5L923M736J427J141J506M85l513p059m284J812K037J997
1430b586L604L471J426j219k559n54j627n067l318J884N387M461N81m71K156n83
1446D986m293l265j802j492l40K320O118M889p38k317p10k086l389l285j146K084
$$ plain form
1337 2857 -2659 -4004 -5442 -7310 -6513 -1887 4864 8339 5924 4567 3280 -1046 -5128 -7356 -6807
1352 -6807 -3419 -1500 1194 6458 8487 5340 1411 -1547 -3609 -6043 -8921 -6626 -178 4054 6507
1367 6507 7481 6051 2924 -2709 -6973 -6671 -5246 -5092 -1441 4166 8278 8300 3676 274 -1335 -4777
1383 -4777 -7293 -5427 -2299 451 2709 4866 8001 7212 793 -4028 -4782 -4851 -4300 -4098 -1286 4501
1399 4501 6979 5530 5318 3039 -1522 -5751 -7368 -4915 -1731 -1189 1507 6541 8065 6040 1611
1414 1611 -3173 -5565 -6729 -6794 -2871 1865 3292 4433 5939 6424 2911 -4148 -8432 -6620 -4583 -2586
1430 -2586 1018 4489 5915 4696 2137 1583 -44 -5111 -8429 -6545 -1158 3303 3884 3413 5569 4986
1446 4986 693 -2572 -4374 -5866 -6206 -3886 2232 7121 6383 4066 3356 1270 -2119 -5404 -6550 -4466
1462d466L050K136M479K658j877l926l121j260p93l474N9N389M774J086L11k67
1478D758j253l409m859o52J438J69Q49L358M927K438l114m621j211j113k883n93
1494e771J778K767K675J625K169J319l872m927k164n18O60L00J826N128K204p06
1510D493k94r76l378l751k316J489L513M11J466L846K317j526l584l272q84r51
1526c397k379J580M303K666J558L75L68r27n322m810M95J753J034K234K351K853
1542D735P87j912k150j750l750k571J179L258L857J048n53K230L44l459l226j599
1558c532j372n17J148L957M917N40j375p12j079k393l698k727J813L207J926K070
1574B173L227K0j977l251k005n69k157j323K978M341K616P00n46o55j415m073
$$ plain form
1462 -4466 -1416 720 5199 7857 5980 2054 -1067 -2327 -3120 -6594 -6535 -1146 3628 4714 5025 4758
1478 4758 3505 96 -4763 -5415 -3977 -3808 -2959 399 5326 7764 4650 29 -1182 -2295 -5178 -5771
1494 -5771 -3993 -1226 1449 3074 5243 6562 2690 -2237 -4401 -4919 -4259 -3959 -2133 2995 5199 4493
1510 4493 4199 3223 -155 -3906 -6222 -4733 -1220 -809 657 4503 6820 5294 1710 -1562 -2446 -3397
1526 -3397 -5776 -4196 107 2773 4331 4706 5074 4147 -1175 -5985 -5490 -3737 -2703 -469 1882 4735
1542 4735 5522 3610 1460 -290 -4040 -6611 -5432 -2174 1683 2731 2178 4408 4752 1293 -1933 -3532
1558 -3532 -4904 -5421 -4273 -316 4601 5141 3766 3054 1975 -418 -4116 -6843 -5030 -1823 103 2173
1574 2173 5400 5420 3443 192 -1813 -2382 -4539 -5862 -2884 1457 4073 4773 4227 3572 2157 -1916
1590a916k627L95O38J071K266L266K888q68l771j311o74k157j743%K681L172R91
1607B301J345J654j760l725k717j021K87K5J8L395M059O68q35q80k016k438l317
1624d957q74K480K252R96K513K836P6k790m354q76R1j669o84L069L468K668N46
1641D791j047m89l093m296j064J870J853O28R72K812K723j044l239j533j892k676
1657d724P87J769K601J225j49K001J757j568m012k970j227R57M74J434M167J965
1673D487j330p95O52j597l920m124Q90L877K455J085J600r1J38j950k793q99r14
1690c229k025J050M266L331N36j621m97M25k333k468q03l29j57K466L507L046
1706E165j69l123j770k29j169k094j294J651L604J433Q94K282l71m386l003m34
$$ plain form
1590 -1916 -4543 -4148 -3510 -2439 -173 3093 5981 5113 1342 31 -643 -2800 -4543 -4543 -1862 1310 2301
1607 2301 3646 5300 3540 -185 -2902 -3923 -3636 -3611 -3593 -198 3861 4529 3694 2814 798 -1640 -4957
1624 -4957 -5831 -3351 -1099 -103 2410 5246 5322 2532 -1822 -2698 -2607 -4276 -4960 -1891 1577 4245 4791
1641 4791 3744 3255 162 -4134 -5198 -3328 -1475 -847 125 2937 5660 4616 1377 -156 -2048 -4724
1657 -4724 -3937 -2168 433 1658 1509 3510 5267 3699 -313 -3283 -4510 -3553 -3079 -1645 2522 4487
1673 4487 3157 2362 3014 1417 -2503 -6627 -5737 -1860 595 1680 3280 3189 3327 1377 -1416 -2315 -3229
1690 -3229 -5254 -4204 62 3393 3929 2308 1811 2236 -97 -2565 -3368 -3697 -3854 -1388 2119 5165
1706 5165 4996 1873 103 -126 -1295 -3389 -4683 -3032 572 2005 2899 5181 4810 424 -2579 -3013
1722c013O15o2j022J875M233K088j60j533k284j667j889k169J827K407J51J554
1738I51K427J633j400l194k294j239r74J25K516J817J578R45J44J31j188l768
1754a790k845P71J572J009P04K420K641p15k287j055j290k284j574J243K582K480
1770A582K46L56J288p8k370l047j771O95P36O1L203K778j74p94n30j165j595k913
1788c492j069J802K091J357J926O70K12q89l387j120J58j632k44K171K975J548
1804C077n40n82M12j338l185j022k18P16J508J764J916J647j600k342m80o83j192
1821b142j901L45L065K247N32J211K68k320k354j380K5M77m98Q5K814L128M91
1838D093j026k018q37k309j876N36K420J008R80Q88J864J12k247l074p16k60m10
$$ plain form
1722 -3013 -2398 -2460 -3482 -1607 2626 4714 4554 3021 737 -930 -2819 -4988 -3161 -754 -603 951
1738 951 3378 5011 3611 417 -1877 -3116 -4090 -3965 -1449 368 1946 2891 3035 3166 1978 -1790
1754 -1790 -4635 -3864 -2292 -1283 -579 1841 4482 3767 1480 425 -865 -3149 -4723 -3480 -898 1582
1770 1582 1828 2184 3472 3394 1024 -2023 -3794 -3099 -2363 -2302 901 3679 3505 2711 2181 1016 -579 -3492
1788 -3492 -4561 -2759 -668 689 2615 3285 3497 2608 -779 -1899 -1741 -3373 -3617 -1446 1529 3077
1804 3077 2537 1955 2367 1029 -2156 -3178 -3396 -2680 -1172 592 2508 4155 2555 213 -267 -950 -2142
1821 -2142 -4043 -3698 -633 1614 2146 3357 3625 1305 -1049 -2429 -2404 -1927 -2425 -2340 474 3602 4093
1838 4093 3067 1049 212 -2097 -3973 -3437 -1017 -9 971 1859 3723 3835 1588 -1486 -2202 -2462 -2872
1855b872J024J952J727R22o99QK89k373k911n48Q10J175P03J328K491R52k156
1872A822j521n87j269j546j012J707L448R99p29P47P64j487k437j731K13N15R4
1889b010J383K555J173m63j384p46r74j335j716Q95J773M12J214J661J020p31
1905B727k958j062K08j079m38R89J843J807k9k61N48K3l039k228j84J530J263
1922c40l10J507K303p7j787j008n16j415j589l86K108K756O98O23l62o92j083
1939D30j335j212K52m43O5K284K287O50q93j052o23j154j667n94J391P02N06J386
1957I80J691J092j657l222q96N03o45k14Q89K164J833L1q71K40j429k071q88Q9
1975b381J449J197k90J353J490j37j287j173j550q75j67M09K075P88n6J080Q94
$$ plain form
1855 -2872 -1848 104 1831 2753 2054 2062 2351 -22 -2933 -3481 -2671 -1496 -793 535 3026 3978 1822
1872 1822 301 -286 -1555 -3101 -4113 -2406 1042 2041 1312 2059 2823 1336 -1101 -2832 -2619 -2104 -2010
1889 -2010 -627 1928 3101 2638 1254 508 -466 -1801 -3517 -2622 -849 -437 777 2438 3458 2727
1905 2727 -231 -1293 -1085 -2164 -2602 -1613 230 2037 2008 1747 2295 2318 -721 -2949 -3133 -1603 -340
1922 -340 -650 857 3160 3083 1296 288 -228 -1643 -3232 -3618 -1510 1246 1944 2567 2205 1513 430
1939 430 -905 -2117 -1865 -2308 -2243 41 2328 2978 2085 1033 410 -744 -2411 -3005 -1614 -912 -406 980
1957 980 2671 3763 2106 -1116 -2012 -1509 -2154 -2368 -1479 685 2518 2549 1678 1918 489 -1582 -2470 -2381
1975 -2381 -932 265 -25 1328 2818 2681 1394 221 -1329 -2204 -2371 -1962 113 901 845 1925 2819
1992B819o51j561k339q87M83l5J211K244J210r3j164o93K91j809k493K23J822
2009a422J955Q14R6M71M85j890j689k28J1p59P5J157K244J206j250Lk14r63j498
2028a396j026M60O58L06Q54K309R70j064j028p52r71j004j493P10K669J440P10
2045B352M2m18p88k191j168N33K46l68R43K141J686j95j722j112K21j455r19M9
2063b123J081P12O12R39J576j62k652j658N5J01n02l24J584K116Q71o45M64p28
2081A317k369j513l34J538J070j30N36K111L16p13j772q02r03o58j13J794J529
2098I04j16K51J012K02j074k312j391P74J12N39J396J385L09k30r01O60j037k617
2116b134j584J490K457R03M29R0R81j057j891m82o12p78p0O76K389J814o31r84
$$ plain form
1992 2819 2168 607 -1732 -2619 -2136 -2171 -960 1284 2494 2401 1237 544 835 -974 -3467 -3244 -1422
2009 -1422 533 1347 1443 1914 2399 509 -1180 -1408 -1397 -2156 -2081 -924 1320 2526 1276 1279 1065 102 -1396
2028 -1396 -2422 -1962 -1304 -998 -144 2165 3135 2071 1043 291 -680 -1684 -3177 -2467 202 1642 2352
2045 2352 2394 1976 1188 -1003 -2171 -1638 -1392 -1760 -817 1324 3010 2815 1093 -19 202 -1253 -2172 -2123
2063 -2123 -1042 -330 282 1221 2797 2635 -17 -1675 -1620 -1519 -2021 -2345 -761 1355 2226 1581 2045 1317
2081 1317 -1052 -2565 -2899 -1361 -291 -421 115 2226 2542 1829 57 -745 -1648 -2306 -2419 -625 904
2098 904 788 1039 2051 2253 1179 -1133 -2524 -1750 -1638 -1099 297 1682 1991 1761 860 1520 483 -2134
2116 -2134 -3718 -2228 229 1132 1561 1651 2632 1575 -316 -798 -1410 -2188 -2258 -1582 807 2621 1990 1006
2134A006l09k87j124j095l02O90M70N17J972J199o91j309j097k81l85j364mK230
2152a64R20N72O06J39m96j646k136J16J151l35K64J498J461R27j271j375n12m33
2170g14j000n55J334R01O81K98J137M46j140k030q04j84K09r1R12J527Q15o4J68
2189A846k62j650j835n32M11J562K04M93J789L00p64j234j339j92m43r72J517
$$ plain form
2134 1006 697 410 -714 -1809 -2111 -1421 -951 -434 1538 2737 2046 737 -360 -641 -1026 -2390 -2394 -164
2152 -164 756 1328 1934 2073 1577 -69 -2205 -2089 -938 -1273 -1009 489 1950 2877 1606 231 -281 -714
2170 -714 -1714 -2269 -935 -34 647 945 2082 2528 1388 -642 -1446 -1630 -1421 -1512 -600 927 1742 1678 1846
2189 1846 1584 -66 -1901 -2433 -2022 -460 -256 237 2026 2326 1562 328 -1011 -1203 -1646 -2618 -1101
$$ [...]
8191A44
##END NTUPLES=NMR FID
##END=
