##TITLE=1H_Ser DHA-7
 CDCl3
 8 sc, 
 17.2.2023
##JCAMPDX= 6.0         $$ Bruker NMR JCAMP-DX V2.0
##DATA TYPE= NMR FID
##DATA CLASS= NTUPLES
##ORIGIN= UXNMR, Bruker Analytische Messtechnik GmbH
##OWNER= root
$$ XWIN-NMR		Version 3.5
$$ Fri Feb 17 14:11:38 2023 Russian Standard Time (UT+4h)  she@DPX200
##.OBSERVE FREQUENCY= 200.13135
##.OBSERVE NUCLEUS= ^1H
##.DELAY= (6, 6)
##.ACQUISITION MODE= SIMULTANEOUS
##.ACQUISITION SCHEME= undefined
##.AVERAGES= 8
##.DIGITISER RES= 18
##SPECTROMETER/DATA SYSTEM= spect
##.PULSE SEQUENCE= zg30
##.SOLVENT NAME= DMSO
##.SHIFT REFERENCE= (INTERNAL, DMSO, 0, 15.7039)
##AUDIT TRAIL= $$ (NUMBER, WHEN, WHO, WHERE, WHAT)
$$ ##TITLE= Audit trail, XWIN-NMR		Version 3.5
$$ ##JCAMPDX= 5.01
$$ ##ORIGIN= Bruker BioSpin GmbH
$$ ##OWNER= she
$$ F:/spectra/data/she/nmr/H-F/1/audita.txt
$$ ##AUDIT TRAIL=  $$ (NUMBER, WHEN, WHO, WHERE, WHAT)
(   1,<2023-02-17 14:10:19.60 +0400>,<she>,<DPX200>,
      <created by zg, POWCHK disabled, PULCHK disabled
       configuration hash MD5:
       00 E9 B6 7A A2 85 ED C7 34 08 36 98 17 FE 4E 26
       data hash MD5: 16K
       7B 7A 76 DF 0C FE 99 A4 3A 45 02 B3 47 69 B8 08>)
$$ ##END=
$$ 
$$ hash MD5
$$ 7D 4B AE 32 27 BF 66 8F 6E A1 1B DE BD 6E C4 C1
##$RELAX= 
##$RELAX= 
##$RELAX= 
##$RELAX= 
##$RELAX= 
##$RELAX= 
$$ Bruker specific parameters
$$ --------------------------
##$DU= <F:/spectra>
##$EXPNO= 1
##$NAME= <H-F>
##$PROCNO= 1
##$TYPE= <nmr>
##$USER= <she>
##$AMP= (0..31)
100 100 100 100 100 100 100 100 100 100 100 100 100 100 100 100 100 100 
100 100 100 100 100 100 100 100 100 100 100 100 100 100 
##$AQSEQ= 0
##$AQ_mod= 1
##$AUNM= <au_zg>
##$AUTOPOS= <>
##$BF1= 200.13
##$BF2= 200.13
##$BF3= 200.13
##$BF4= 200.13
##$BF5= 200.13
##$BF6= 200.13
##$BF7= 200.13
##$BF8= 200.13
##$BYTORDA= 1
##$CFDGTYP= 0
##$CFRGTYP= 5
##$CHEMSTR= <none>
##$CNST= (0..31)
1 1 145 1 1 1 1 1 1 1 1 1 1 1 1 1 1 1 1 1 1 1 1 1 1 1 1 1 1 1 1 1 
##$CPDPRG= <>
##$CPDPRG1= <>
##$CPDPRG2= <>
##$CPDPRG3= <>
##$CPDPRG4= <mlev>
##$CPDPRG5= <mlev>
##$CPDPRG6= <mlev>
##$CPDPRG7= <mlev>
##$CPDPRG8= <mlev>
##$CPDPRGB= <>
##$CPDPRGT= <>
##$D= (0..31)
0 1.2 0 0 0 0 0 0 0 0.06 0 0.03 0 0 0 0 0.0002 0 0 0 0 0 0 0 0 0 0 0 0 
0 0 0 
##$DATE= 1676628619
##$DBL= (0..7)
120 120 120 120 120 120 120 120 
##$DBP= (0..7)
150 150 150 150 150 150 150 150 
##$DBP07= 0
##$DBPNAM0= <>
##$DBPNAM1= <>
##$DBPNAM2= <>
##$DBPNAM3= <>
##$DBPNAM4= <>
##$DBPNAM5= <>
##$DBPNAM6= <>
##$DBPNAM7= <>
##$DBPOAL= (0..7)
0.5 0.5 0.5 0.5 0.5 0.5 0.5 0.5 
##$DBPOFFS= (0..7)
0 0 0 0 0 0 0 0 
##$DE= 6
##$DECBNUC= <off>
##$DECIM= 32
##$DECNUC= <off>
##$DECSTAT= 4
##$DIGMOD= 1
##$DIGTYP= 9
##$DL= (0..7)
0 120 120 120 120 120 120 120 
##$DP= (0..7)
150 150 150 150 150 150 150 150 
##$DP07= 0
##$DPNAME0= <>
##$DPNAME1= <>
##$DPNAME2= <>
##$DPNAME3= <>
##$DPNAME4= <>
##$DPNAME5= <>
##$DPNAME6= <>
##$DPNAME7= <>
##$DPOAL= (0..7)
0.5 0.5 0.5 0.5 0.5 0.5 0.5 0.5 
##$DPOFFS= (0..7)
0 0 0 0 0 0 0 0 
##$DQDMODE= 0
##$DR= 18
##$DS= 0
##$DSLIST= <SSSSSSSSSSSSSSS>
$$ [...]
##$SUBNAM2= <"">
##$SUBNAM3= <"">
##$SUBNAM4= <"">
##$SUBNAM5= <"">
##$SUBNAM6= <"">
##$SUBNAM7= <"">
##$SUBNAM8= <"">
##$SUBNAM9= <"">
##$SW= 18.05172834244
##$SWIBOX= (0..15)
0 0 2 0 0 0 0 0 0 0 0 0 0 0 0 0 
##$SW_h= 3612.71676300578
##$TD= 16384
##$TD0= 1
##$TE= 0
##$TE2= 300
##$TE3= 300
##$TEG= 300
##$TL= (0..7)
0 120 120 120 120 120 120 120 
##$TP= (0..7)
150 150 150 150 150 150 150 150 
##$TP07= 0
##$TPNAME0= <>
##$TPNAME1= <>
##$TPNAME2= <>
##$TPNAME3= <>
##$TPNAME4= <>
##$TPNAME5= <>
##$TPNAME6= <>
##$TPNAME7= <>
##$TPOAL= (0..7)
0.5 0.5 0.5 0.5 0.5 0.5 0.5 0.5 
##$TPOFFS= (0..7)
0 0 0 0 0 0 0 0 
##$TUNHIN= 0
##$TUNHOUT= 0
##$TUNXOUT= 0
##$USERA1= <user>
##$USERA2= <user>
##$USERA3= <user>
##$USERA4= <user>
##$USERA5= <user>
##$V9= 5
##$VALIST= <valist>
##$VCLIST= <CCCCCCCCCCCCCCC>
##$VD= 0
##$VDLIST= <DDDDDDDDDDDDDDD>
##$VPLIST= <PPPPPPPPPPPPPPP>
##$VTLIST= <TTTTTTTTTTTTTTT>
##$WBST= 1024
##$WBSW= 4
##$XGAIN= (0..3)
0 0 0 0 
##$XL= 0
##$YL= 0
##$YMAX_a= 74955
##$YMIN_a= -139005
##$ZGOPTNS= <>
##$ZL1= 120
##$ZL2= 120
##$ZL3= 120
##$ZL4= 120
##$ABSF1= 10
##$ABSF2= 0
##$ABSG= 5
##$ABSL= 3
##$ALPHA= 0
##$AQORDER= 0
##$ASSFAC= 0
##$ASSFACI= 0
##$ASSFACX= 0
##$ASSWID= 0
##$AUNMP= <proc_1d>
##$AZFE= 0.1
##$AZFW= 0.1
##$BCFW= 1
##$BC_mod= 2
##$BYTORDP= 1
##$COROFFS= 0
##$CY= 11.3945322036743
##$DATMOD= 1
##$DC= 2
##$DFILT= <>
##$DTYPP= 0
##$F1P= 2.36226072786647
##$F2P= -0.459571619588291
##$FCOR= 0.5
##$FTSIZE= 0
##$FT_mod= 4
##$GAMMA= 1
##$GB= 0.15
##$INTBC= 1
##$INTSCL= 1
##$ISEN= 128
##$LB= 0.24
##$LEV0= 0
##$LPBIN= 0
##$MAXI= 10000
##$MC2= 0
##$MEAN= 0
##$ME_mod= 0
##$MI= 1.114404
##$NCOEF= 0
##$NC_proc= 0
##$NLEV= 6
##$NOISF1= 3.799351
##$NOISF2= 2.8
##$NSP= 1
##$NTH_PI= 0
##$NZP= 0
##$OFFSET= 15.70392
##$PC= 1
##$PHC0= -19108.43
##$PHC1= 14.80078
##$PH_mod= 1
##$PKNL= yes
##$PPARMOD= 0
##$PSCAL= 0
##$PSIGN= 0
##$REVERSE= no
##$SF= 200.130013532006
##$SI= 16384
##$SIGF1= 3
##$SIGF2= 2
##$SINO= 400
##$SIOLD= 16384
##$SREGLST= <1H.CDCl3>
##$SSB= 0
##$STSI= 0
##$STSR= 0
##$SW_p= 3612.71676300578
##$SYMM= 0
##$S_DEV= 0
##$TDeff= 0
##$TDoff= 0
##$TI= <>
##$TILT= no
##$TM1= 0
##$TM2= 0
##$TOPLEV= 0
##$USERP1= <user>
##$USERP2= <user>
##$USERP3= <user>
##$USERP4= <user>
##$USERP5= <user>
##$WDW= 1
##$XDIM= 8192
##$YMAX_p= 0
##$YMIN_p= 0
$$ End of Bruker specific parameters
$$ ---------------------------------
##NTUPLES= NMR FID
##VAR_NAME=  TIME,          FID/REAL,        FID/IMAG
##SYMBOL=    X,             R,               I
##VAR_TYPE=  INDEPENDENT,   DEPENDENT,       DEPENDENT
##VAR_FORM=  AFFN,          ASDF,            ASDF
##VAR_DIM=   8192,          8192,            8192
##UNITS=     SECONDS,       ARBITRARY UNITS, ARBITRARY UNITS
##FACTOR=    0.0002768,     1,               1
##FIRST=     0,             0,               0
##LAST=      2.2672688,     0,               0
##MIN=       0,             -139005,         0
##MAX=       2.2672688,     74955,           0
$$ Real data points
##PAGE= N=1
##DATA TABLE= (X++(R..R)), XYDATA
0@%%%%%%%%%%%%%%qJ6j6J6j6K4l2L2m0M8n6O9p7Q8j04J20j36J57j81K04k29K58
$$ 0 0 0 0 0 0 0 0 0 0 0 0 0 0 0 -8 8 -8 8 -8 16 -16 16 -24 24 -32 37 -40 48 -56 64 -72 85 -96 108 -121 137
36A37k91L27l65M07m54N06n62O23o91P65q45R31j025J130j245J371j511J667j840
$$ 137 -154 173 -192 215 -239 267 -295 328 -363 402 -443 488 -537 593 -652 719 -792 875 -965
55i65K034k256K509k800L143l553M048m665N457o519Q030j0360J4463k3849Q7886
$$ -965 1069 -1187 1322 -1478 1665 -1888 2160 -2505 2952 -3567 4463 -5897 8566 -15283 72603
70G2603K352j47399j9528L1519O6691K2001q123l4877L088L7935L6349l1174p0526
$$ 72603 74955 -72444 -91972 -60453 6238 28239 20116 -14761 -11673 26262 62611 31437 -39089
83c9089m7147L9806P6454L3488k9458m1246k9182R06K8185K9627r476k9981K251
$$ -39089 -86236 -46430 30024 63512 34054 -7192 -36374 -35468 -7283 22344 12868 -17113 -14862
96a4862L8115J5416k7241m1781j2408K5926L5162J8730l923k7159k6966k70K3463
$$ -14862 23253 38669 11428 -30353 -42761 -16835 18327 37057 33134 5975 -20991 -21261 2202
109B202P056k3551j0616K6976K8948J536k0627k6480j5907L143K1609K0750k570
$$ 2202 9258 -14293 -24909 2067 31015 32551 11924 -14556 -30463 -27320 -5711 15039 12469
122A2469j8083m939J8218J4258j5034k4131j912J1615J1360R024J294j1854j2890
$$ 12469 -5614 -10553 7665 21923 6889 -17242 -19154 -7539 3821 12845 14139 2285 -10605
135a0605M834J7095K630j4825j1411N336J3320P35q886k091K227K8M621N452n848
$$ -10605 -5771 11324 13954 -871 -12282 -6946 6374 7109 -1777 -3868 -1641 -1613 3008 8460 2612
150B612j3866j524J3921N798r056o924L211J0521N194n237n437k607k021M066
$$ 2612 -11254 -12778 1143 6941 -2115 -9039 -5828 4693 9887 4650 -787 -3394 -5415 -1349
164a349Q125l88j2839n878J5305J4086m762j2201o160P19L143K374J117l608n241
$$ -1349 6776 6388 -6451 -12329 2976 17062 12300 99 -6061 -5342 -2199 175 1292 -2316 -7557
179g557M253J2843O238j2480j8164J09J3011M044j817k33jj847K031O913j797
$$ -7557 -3304 9539 15777 3297 -14867 -14758 -1747 2297 480 247 246 -1601 430 7343 5546
194E546j2227m546J0532J2375r22j2330m537M678J938R46L154j237o105j164R473
$$ 5546 -6681 -11227 -695 11680 10758 -1572 -6109 -1431 507 1453 4607 3370 -2735 -3899 5574
209E574M534j2364j1835M590J1186M424l469k668l58m450M05O963J797q565n651
$$ 5574 10108 -2256 -14091 -9501 1685 6109 2640 -28 -386 -4836 -4431 2532 4329 -4236 -9887
224i887Q996J1670m063r803n74L874P13l09L315J851p237l437P373M351p000p573
$$ -9887 -891 10779 6716 -3087 -3661 213 926 617 3932 5783 -1454 -4891 2482 6833 -167 -7740
240g740M905Q862k256o709J473J814k990j589M675J863o521k537R051N984o445
$$ -7740 -2835 6027 3771 -2938 -1465 349 -2641 -4230 445 2308 -4213 -6750 2301 8285 1840
255A840q871J867Q117o4l972K354J443m234N85P151K278j0977p438P222R226j904
$$ 1840 -7031 -5164 2953 2889 -1083 1271 2714 -1520 -935 6216 8494 -2483 -9921 -2699 6527 4623
271D623m952m08K447k025j627L149o27p458j893R727Q131n849q892K554M246j920
$$ 4623 -329 -737 1710 -315 -1942 1207 580 -6878 -8771 956 9087 3238 -5654 -3100 1146 -774
287g74j993K765J620k957K72P109P86r220n184O011Q008j469n823J098K328l234
$$ -774 -2767 -2 1618 -1339 -1067 6042 6828 -2392 -7576 -1565 6443 4974 -849 249 2577 -657
303f57j939L030P66n300q04R663N102q070q532k35L790K40P5M551K603k968j005
$$ -657 -2596 434 1200 -4100 -4904 4759 9861 1791 -6741 -6976 -3186 -2946 -2871 1680 4283 1315 310
320C10L933m49q171n740N868Q520N56j390J772p91n147l889L096L427l540l94
$$ 310 4243 3794 -4377 -10117 -4249 4271 4827 3437 5209 4418 -729 -4618 -1522 1905 -1635 -2029
336b029N442K787n117n288J753K795k813j242M615K581l250l947J582J803k960
$$ -2029 3413 6200 1083 -4205 -2452 343 -2470 -3712 903 3484 234 -3713 -2131 -328 -3288
351c288J56O304L422l764n560Q52K824k657j726M545L603j140j664J459n63o341
$$ -3288 -3132 3172 6594 2830 -2730 -1878 946 -1711 -3437 1108 4711 3571 1907 3366 2803 -3538
367c538l074M704M555p94k321J430K823l352m790Q28J433j198M70M623L643m644
$$ -3538 -6612 -1908 2647 1853 -468 962 3785 433 -4357 -3529 -2096 -3294 -2824 1799 5442 798
383G98m377L421K889k542m207O50M508J267p0J744o32m667k919L902M948k569
$$ 798 -3579 -158 2731 189 -4018 -3368 1140 2407 2337 4081 3449 -1218 -4137 -235 4713 2144
399B144o352K694N040j47l079j317n32k847k7O309L255m574n362J360N356r6m056
$$ 2144 -4208 -1514 3526 3379 300 -1017 -1549 -4396 -4423 1886 5141 567 -4795 -3435 1921 1825 -2231
416b231K21K815J0n36J835J513n048m313N259N973j559m576J81L664j308m262
$$ -2231 -2010 805 815 279 2114 3627 -1421 -5734 -475 5498 3939 -637 -456 3208 1900 -2362
432b362N85J780j506m73M086K955m256o325J822M909j593l589J625M468L74k587
$$ -2362 -1777 3 -1503 -1976 2110 5065 809 -5516 -3694 1215 -378 -3967 -2342 2126 2500 -87
448h7J397R45n413k885N221N546j467n258K209M498k675l830J097K072j500j896
$$ -87 1310 2255 -3158 -6043 -822 4724 3257 -2001 208 4706 2031 -1799 -702 1370 -130 -2026
464b026L663L124m908m291K673M708k082m346K149L965k497l342J579J846j899
$$ -2026 1637 4761 -147 -4438 -1765 2943 861 -3485 -1336 2629 132 -3210 -1631 215 -1684
479a684j134N137L264n255n011K998M322j364l833K048L833j135p42K131p11n410
$$ -1684 -2818 2319 5583 328 -4683 -1685 2637 1273 -2560 -512 3321 2186 1444 3575 2864 -2546
495b546l960N234O378l048n166K152K888o52k284P57k63l998o97O514L370m116
$$ -2546 -6506 -1272 5106 2058 -3108 -956 1932 1280 -1004 -247 -510 -4508 -5205 1309 4679 563
511E63m864K638M979j406l153Q48O89j650k12M427J733n144k901M994L770l742
$$ 563 -4301 -1663 3316 1910 -1243 -395 294 -1356 -1568 2859 4592 -552 -3453 1541 5311 1569
527A569m092N63K438n41p95J978jl412j73M032K734m864n111K416M209K60j444
$$ 1569 -2523 -1960 478 -63 -858 1120 1119 -2293 -2466 1566 4300 -564 -5675 -3259 950 1210 -234
544b34P9M97j662J38M405O20m703l496K891M803l65l097J89R41n35J95J744n54
$$ -234 -155 342 -1320 -1182 3223 3843 -860 -4356 -1465 3338 2973 -124 65 1006 471 666 2410 1856
562A856m287k769L837M304j025k873j92J899q80j948J435N92k726m77L403L594
$$ 1856 -2431 -5200 -1363 2941 1916 -957 -1149 750 -130 -2078 -643 -51 -2777 -3254 149 3743
578C743j669m186L93L010n50q93Q66J263j264k208K455K349k988k705J341M060
$$ 3743 2074 -2112 -1719 1291 741 -152 714 1977 713 -1495 960 3309 321 -2384 -1043 3017
594C017k07l500q74O47j006l42L080J960k240l935K155L453k037l694n96K991
$$ 3017 2810 -690 -1564 -917 -1923 -2265 815 2775 535 -3400 -1245 2208 171 -3523 -4119 -1128
610a128K404O93J581M31m873l953L083N255n42m879l21M619J181j524p28j266
$$ -1128 1276 1969 3550 3981 -892 -4845 -1762 3493 2951 -1928 -2249 2370 3551 2027 1299 33
626C3l144j281M984N024k979p010n2M594K235k789j157Q92j457m89M778K007m741
$$ 33 -3111 -4392 592 5616 2637 -4373 -4425 169 2404 -385 -1542 -650 -2107 -2596 2182 4189 -552
643e52n525L158P119L99m658j610Q23R27N82K059N25m728l593N468N647k474p201
$$ -552 -6077 -2919 4200 4599 -59 -1669 -846 81 663 2722 3247 -1481 -5074 394 6041 3567 -3634
660c634j484M982K246j139j60j403l478J53N730L853n423o760K126P023K089l301
$$ -3634 -5118 -136 2110 971 811 -592 -4070 -3917 1813 5666 243 -6517 -4391 2632 4721 1420
676A420k891o08n00J651N365N68o505l930M890P080j016p029k505J874J556K037
$$ 1420 -1471 -2079 -2579 -928 4437 5005 -1500 -5430 -540 6540 5524 -1505 -4010 -2136 -580 1457
692A457J928q05n637j808N840M501m311o506K42N062K732j599n83j855j711J424
$$ 1457 3385 2580 -3057 -4865 975 5476 1165 -5341 -5099 -37 2695 1096 513 -1342 -3053 -1629
708a629M721J836n255m837L191O072o9m117j944J359R99J463K023j586n498j762
$$ -1629 3092 4928 -327 -5164 -1973 4099 4030 -87 -2031 -672 327 1790 3813 2227 -3271 -5033
724e033N066M374j853n541o14L764J835n56j518j947k212M62N737L151l881m443
$$ -5033 33 4407 2554 -2987 -3601 163 1998 1442 -76 -2023 -4235 -3773 1964 5115 1234 -3209
740c209J686L587O79l192j459K25Q35J840K842r2l726l055J976L864j414l280
$$ -3209 -1523 2064 2743 -449 -1908 -1683 -848 992 3834 3742 16 -3039 -1063 2801 1387 -1893
756a893k19K488J058j000k40R5k004l68K420J908k755l218J200M051L90k197l01
$$ -1893 -2112 376 1434 434 194 289 -1715 -2083 337 2245 -510 -3728 -2528 1523 1913 -284 -585
773e85J083L97o29K72N71k638j480L359L704j184l677l67K541k34j960k92O14
$$ -585 498 895 266 538 1109 -1529 -3009 350 4054 2870 -807 -1174 1367 1133 -827 -1119 -505
790e05m85m74K281K058k484l376J186K896n24k896N6K673L35j000O54J061j431
$$ -505 -990 -1464 817 2875 391 -2985 -1799 1097 573 -2323 -2267 406 741 -259 395 1456 25
807B5j548J569K453j869l443J710L416L00k731o06J344J38r36J109n8k038j897
$$ 25 -1523 46 2499 630 -2813 -1103 2313 2613 -118 -724 620 758 -178 931 873 -1165 -3062
824c062J718M208q65m219n15L081N58j344n93R35j250m68K957K267k737l375J211
$$ -3062 -1344 2864 1999 -2220 -2735 346 904 -440 -1033 -98 -1348 -1816 1141 3408 671 -2704 -1493
841a493L311M80k764n47J281M66p23R37J179k208k495K814K918k056l949m9L080
$$ -1493 1818 2298 -466 -1013 268 734 11 948 2127 -81 -2576 238 3156 1100 -2849 -2898 182
858A82J243j813k3Q64j290p58K278J066k716l255K341M950P1l003j287Q36N41
$$ 182 1425 -388 -411 453 -837 -1595 683 1749 -967 -4222 -1881 3069 3140 137 -1150 -314 227
875B27l20J245R04k970j715L000L899j533m737o58K892J008q71P2p08j701j217
$$ 227 -93 1152 2056 -914 -2629 371 4270 2737 -2000 -2658 234 1242 371 443 -265 -1966 -3183
892c183L352L304k836l390N14L337J075k866r61J183q37N75K861J320k813k963
$$ -3183 169 3473 637 -2753 -2239 1098 2173 -693 -1654 -471 -1308 -733 2128 3448 635 -2328
908b328J319L262o74k953K75K199L20q12L55Q2k811j335K643K823j058l079N2
$$ -2328 -1009 2253 1579 -1374 -1099 1100 1420 608 963 1045 -1766 -3101 -458 2365 1307 -1772 -1720
925a720K571j0k232M34O56n21o55K408K153k654k867J126K275J63j118K01J118
$$ -1720 851 841 -1391 -957 -301 -822 -1477 931 3084 430 -2437 -1311 964 1127 9 210 1328
942A328q24j167J305J145j235k068P41K533o29k209P56L29j076m99J379J920j363
$$ 1328 504 -663 642 1787 552 -1516 -775 1758 1129 -1080 -324 5 -1071 -1570 -191 1729 366
959C66k234O77J836q49r90M26J324n39o96J600J431j512k354M90J822K29j162
$$ 366 -1868 -1191 645 -204 -1194 -768 556 17 -679 921 2352 840 -1514 -1024 798 1027 -135
976a35M08Q94q08q57O80J332j506k149R95K090R1j675n89R82K15j374R23J036
$$ -135 273 1167 359 -498 182 1514 8 -2141 -1146 944 1035 -640 -1229 -247 -32 -1406 -483 553
994E53r85j160J216K118n30k537j3J832N78r36P9O27n86j062J228J303q16k095
$$ 553 -432 -1592 -376 1742 1212 -1325 -1338 494 1072 136 215 842 256 -806 422 1725 909 -1186
1012a186J05K311M8k045m63J057n3o04Q29J162o39k452P11K068m91j961J13J892
$$ -1186 -1081 1230 1278 -767 -1230 -173 -226 -830 -1 1161 522 -1930 -1219 849 358 -1603 -1490 402
1030D02P34j445O91J109q21j628M51J659l85j794L72K631o25k072J56J472J72
$$ 402 1136 -309 382 1491 670 -958 -507 1152 767 -1027 -655 1976 1351 -721 -565 907 1079
1047A079j835j35J110o11j090J246J885j003k645K23K740j1k406n4J287N60m81
$$ 1079 -756 -891 219 -392 -1482 -236 1649 646 -1999 -1776 964 953 -1453 -1507 -220 340 -141
1064a41N82J695k076k028J258K870j97k747m45K265J4j472N44P29j347j004J931
$$ -141 441 2136 60 -1968 -710 2160 1963 -784 -1229 1036 1050 -422 122 851 -496 -1500 431
1081D31K012j659l283P53K423N98j934m02R66j53r93J412J426k013j907J808L308
$$ 431 2443 784 -2499 -1746 677 1275 -659 -1061 -95 -248 -1241 171 1597 -416 -2323 -515 2793
1098B793p86l312j3J198Q47n63Q72M84j630j393K289J475j700k886N3L177N47
$$ 2793 2007 -1305 -1318 -120 727 164 1036 1520 -110 -1503 786 2261 561 -2325 -2272 905 1452
1115A452j211m45P1j114l27J774J392j660k315J556K764k98k508l62J204l7K16
$$ 1452 241 -204 -133 -1247 -1574 200 1592 -68 -2383 -827 1937 1639 -869 -1231 -27 -64 152
1132A52R24L83j459j115J663J515j247k601O47K339K7r20o39Jn63k28J350P65
$$ 152 1076 1459 0 -1115 548 2063 816 -1785 -1138 1201 1228 308 -331 -330 -893 -1121 229 994
1150I94j427j252J079K211n35k280n83J367M43L43O03m74r81j063J728K285j333
$$ 994 -433 -1685 -606 1605 1070 -1210 -1793 -426 17 360 963 489 -492 -1555 173 2458 1125
1167A125k425K35J529P93j022m36N60q57lJ221O32j168k336K73K723M84j301r64
$$ 1125 -1300 -1065 464 1257 235 -201 359 -498 -501 720 1352 184 -2152 -1879 844 1328 27 -937
1185i37Q34q0k15KQ09r38j134J560K057k48k378p88J685P97n98J59J6p62m82O22
$$ -937 -103 -183 -398 -396 413 -525 -1659 -99 1958 1710 -668 -1456 229 1026 428 587 603 -159 -641 -19
1205a9J657q29j816j2K291M19j738j550N24L01l63J520J122j098j846J05K100
$$ -19 1638 809 -1007 -1019 1272 1691 -47 -1597 -1073 -772 -1135 385 1507 409 -1437 -1332 768
1222G68J15k149j91J475J011m24L49N28j744j512Q22K432M64k284l53J370J66
$$ 768 883 -1266 -1457 18 1029 605 954 1482 -262 -1774 -952 1480 1944 -340 -693 677 843
1239H43j196J40M04o73j051J315J614m67k659l72K040M95o77J23P25l53j206M36
$$ 843 -353 -213 191 -482 -1533 -218 1396 929 -1730 -2102 -62 433 -244 -121 604 251 -955 -519
1257e19J545q31j657N57K596O47k187o51P66n56m88Q19J449j185j543R30J902
$$ -519 1026 195 -1462 -905 1691 2338 151 -500 266 -290 -778 41 1490 305 -1238 -308 1594
1274A594m25k102p67J343O71p38N02N70j438j459J726K196k81k633m26J784M99
$$ 1594 1169 -933 -1700 -357 314 -424 78 648 -790 -2249 -523 1673 1392 -1241 -1667 117 616
1291F16k17k41K62n62r08J918J555j391l135L63K492R21r96o78L5m34o88J327
$$ 616 399 158 420 -142 -1050 868 2423 1032 -2103 -1740 752 1673 677 -1 34 -400 -1088 239
1309B39N85j387j712J368K656m27j709r23R32N02r3N67O64j420j316J246J790
$$ 239 824 -563 -2275 -907 1749 1322 -387 -1310 -378 124 31 598 1262 -158 -1474 -228 1562
1326A562n66j836j67K108O52j143m49r1p89m4J098J445j104j948L25J812m4j515
$$ 1562 996 -840 -1007 1101 1753 610 161 70 -719 -763 335 1780 676 -1272 -947 865 821 -694
1344f94o83J019K46j0R09L59j382j392N04K266L7j591j27P07O56o78m5O39q49
$$ -694 -1377 -358 -112 -122 787 1146 -236 -1628 -1124 1142 1179 -412 -539 168 824 146 101 740 -109
1363a09n39J185J088j024j434l54J334L53j067N15P17o5p40l54O48l63j216J230
$$ -109 -648 537 1625 601 -833 -1187 147 500 -567 -52 665 600 -140 -494 154 -209 -1425 -195
1381a95J103m35j458J89J374K62j094k20P50N8k06L62L04q61j019J118J573l5
$$ -195 908 473 -985 -796 578 840 -254 -474 276 334 128 490 794 -67 -1086 32 1605 1570
1399A570k100o15J080M26n24j30K74k56k57L47J088p63j799J88J783M39o07p92
$$ 1570 -530 -1145 -65 361 -163 -293 -19 -275 -532 -185 903 140 -1659 -1471 312 751 144 -648
1417f48N42L02l03L54O08o07j447Q07J741n0j818o29J562N50j20p16j25l25p53
$$ -648 -106 196 -107 247 855 248 -1199 -392 1349 1299 -519 -1148 414 964 844 128 3 -322 -1075
1436a075J029J044n39j956J2K199Q26j770j111L56N64J80O74N77n63j861Q15J657
$$ -1075 -46 998 459 -1497 -1485 714 1540 -230 -1341 -985 -421 -241 433 1010 447 -1414 -599 1058
1454A058Q7j734p28J273J395p85j73N2q55m76P36J644p74j939L7J603N25j362
$$ 1058 1145 -589 -1317 -44 1351 566 393 445 -410 -886 -150 1494 720 -1219 -1182 421 946 -416
1472d16p83L15J037j15K24Q16j220j528M23K420L09k051p32J644P67n54m12q0
$$ -416 -1199 -884 153 38 262 1078 -142 -1670 -1247 1173 1482 -569 -1301 343 1110 556 144 64
1490F4p65k93J363J853j020k639K19J827R03j175r57M23j67j06Q64O94j521j839
$$ 64 -701 -994 369 2222 1202 -1437 -1218 609 1512 337 -620 -197 -364 -470 394 1088 -433 -2272
1508b272J012K587K35k107o91R99M28Qo4L37q10q95J552J494n42k113k43J312
$$ -2272 -1260 1327 1562 -545 -1236 -237 191 199 135 472 -338 -1233 319 1813 1271 -842 -1085 227
1526B27J065r18p05J45k75J41R94N32j027j914N19J702K81j148r30Q95O33P7N26
$$ 227 1292 374 -331 -186 -461 -320 674 1206 179 -1735 -1216 486 767 -381 -1311 -416 217 294 820
1545H20m10j219p67R70J798j94j400l11J308L82m54n52R2m41l57J137J086p28
$$ 820 410 -809 -1576 -606 1192 998 -402 -713 595 977 523 -29 63 -378 -735 402 1488 760
1563G60j267j75P34L09m63n05K60m9K78J68K46l61q62M88J174M8j043k46P34K76
$$ 760 -507 -682 52 361 -102 -607 -347 -396 -118 50 296 -65 -927 -439 735 783 -260 -506 228 504
1583E04o90k11P93Q3l43L73J13j06r75k77J000K01m82l53N33K62q46j03J48J05
$$ 504 -186 -397 396 479 136 509 622 516 -459 -736 264 465 -17 -370 163 425 -421 -524 -376 -271
1603b71l88J72J120M1j055l45O92O3j69l25P21N78m92m02N78q0n95l6O90M3o11
$$ -271 -659 -487 633 674 -381 -726 -34 29 -140 -465 256 834 342 -60 518 438 -157 -193 497 540 -71
1624g1o81J042M15j000j53L84K27j70q4N71l12j128J46P06O91p84q82J082L64
$$ -71 -752 290 705 -295 -448 -64 163 -7 -91 480 168 -960 -814 -108 583 -201 -1083 -1 363
1643C63p57L50M13j04r62m4J546J20j330n77J144L28o39Q2M71k03j121J81J178
$$ 363 -394 -44 369 265 -697 -741 805 925 -405 -982 162 490 -149 -67 404 201 -920 -739 439
1662D39J28r92m75R54K09o41l07Q59j16o32L0J001M19j518j16J163j8n19j30Q45
$$ 439 567 -425 -900 54 263 -378 -685 174 58 -574 -544 457 876 -642 -758 405 387 -132 -262 583
1682E83K38j239N4J034j94q30Q7Q56J82j440K99Q04n30n89K78R06m9j001j29J070
$$ 583 821 -418 -364 670 476 -354 -267 589 771 -669 -370 434 -96 -685 -407 499 450 -551 -680 390
1702C90k34q98k42J014K94l65N1Q51l65r49k50J482j18r16R6Q55p3o92RK34j3
$$ 390 156 -742 -984 30 324 -41 10 861 496 -453 -703 779 661 -255 -159 696 623 -69 -60 174 161
1723A61r72M16J450k35j262k21L99K28l11N7P13m43o49M49P67k96j012J0J063
$$ 161 -811 -395 1055 820 -442 -663 -264 -36 -347 -290 423 -20 -669 -220 547 251 -761 -751 312
1742C12N37m77k49r6J56n11J86O66p7o28j59R68K06j020m17O29J94l88J85J30
$$ 312 849 372 123 27 183 -328 -142 524 447 -181 -340 628 834 -186 -603 26 220 -168 17 147
1762A47j83p62M19Q30l19p99j94R39L08j28n20L88k96J12M30L28m19o11k26R83
$$ 147 -36 -798 -379 451 132 -667 -861 78 386 258 -262 126 -170 -58 372 700 281 -330 -556 427
1782D27O13j106j91K53L96l07j58J93J15j042M45O94J39n58q91Q56N01m66k03
$$ 427 1040 -66 -257 -4 392 85 -73 120 235 -807 -362 332 471 -87 -978 -122 379 -87 -290
1801b90J67J79j28j93Q50J00j170j82J140M02o59n78K42O07n09K86K74k59q72
$$ -290 -123 56 -72 -265 585 685 -485 -667 473 875 216 -362 -120 487 -22 264 538 279 -593
1820e93K19R00l1r20p66Q42L41K54m53K20k41p50N00J187k83q14p14J020P93n18
$$ -593 -374 526 495 -425 -1191 -349 -8 246 -207 13 -228 -978 -478 709 426 -388 -1102 -82 711 193
1840A93l33M0J41k83K82P25K38j332k64J001L9m59n56M20L65l19j36N79j64q78
$$ 193 -140 -100 41 -242 40 765 1003 -329 -593 408 447 -12 -568 -148 217 -102 -238 341 177 -701
1860g01J11Q05K80p96j98K92N07k35n44M52K94p54J55O64M81q85j90L28L48j56
$$ -701 -590 215 495 -301 -499 -207 300 65 -479 -27 267 -487 -332 332 813 -72 -262 66 414 258
1880B58o10P74q3n86J40N22k19p19k21R30N32j012o0L72J02l28j84N74L09r93
$$ 258 -352 422 339 -247 -107 415 196 -523 -744 186 718 -294 -354 18 120 -208 -392 182 491 -502
1900e02J78O71j34n72j8N53J17l62j12O04K76j051J3P15R0q70j94J257k40p03
$$ -502 -324 347 213 -359 -377 176 293 -69 -181 423 699 -352 -339 376 466 -404 -598 659 419 -284
1920b84j87P61j77m87O2M28J70p05j57P98J69r68J15P14O0n65j8M77Km35%P53
$$ -284 -471 290 113 -374 -312 116 286 -419 -576 222 391 -577 -462 252 312 -253 -271 206 208 -227 -227 526
1942E26l09k88k47M67L85o21K1K38j36l17K58J58L08q26p8M19L97n04m98O42J56
$$ 526 217 -71 -318 149 534 -87 -66 172 36 -281 -23 135 443 -383 -461 -42 355 -149 -647 -5 151
1963A51k82n0M68k94o3j88O08M7k57l61O04l6m31J54L08K6p51K27N28k16l81j69
$$ 151 -131 -181 287 -7 -70 -258 350 397 140 -221 383 347 -84 70 378 404 -347 -120 408 192 -189 -358
1985c58M82L14j103K73L04K38l41J35J45l55O5k48R72j63o92l8N02L00n00J0J64
$$ -358 124 438 -665 -392 -88 150 -191 -56 89 -266 -201 -449 523 360 -332 -370 132 432 -68 -58 106
2006A06J40j21k36N65j15n77j08O34L2n86l21K12N29k70k45M05K5m25K02M85j09
$$ 106 246 125 -111 454 339 -238 -346 288 320 -266 -587 -375 154 -116 -361 44 69 -356 -154 331 222
2027B22k73n31N85N52m30l34NO49k62m64N99q2m26j24R35K36q48o83L95O98j05
$$ 222 -51 -582 3 555 125 -209 -204 445 183 -281 318 236 -190 -314 621 857 9 -674 -279 419 314
2048C14l97k73N8k81J66Q97q0q41m32P12P94o04l55J21J37J21J78M38j35r19l25
$$ 314 -83 -356 -298 -579 -413 484 404 -437 -869 -157 637 33 -322 -201 -64 57 235 673 538 -381 -706
2069g06J054J56p28j98L77L44Lm9J86k74o29K7Q11J84m98r56P70O53n48L8k37
$$ -706 348 504 -224 -422 -45 299 302 253 439 165 -464 -437 374 558 60 -896 -126 527 -21 17 -220
2090b20J26l46L79N93j93p59l39R93L43j51p36k87O96k27L04K32l25q87L46R44
$$ -220 -94 -440 -61 532 339 -420 -759 234 577 426 -310 -597 99 -128 176 408 83 -804 -458 486
2110D86M85j095n23K97Q20l38l37K45j24l43J31R36k18r37k27N30P46k26k57J45
$$ 486 971 -124 -647 -350 470 132 -205 40 -84 -427 -296 640 422 -515 -742 -212 534 308 51 196
2130A96l06l4O17K55n21r74M74N25N79m92n87J30M75k90J46j93p4n31L96N28R1
$$ 196 -110 -144 473 728 207 -767 -293 232 811 319 -268 -138 337 47 193 0 -74 -605 -209 319 410
2151D10r24q5N29O06k31n70j27K70k05M43M88j92q47K09K89N04l4p35J81j70K34
$$ 410 -514 -599 -70 536 305 -265 -392 -122 -327 116 604 412 -435 -226 63 567 533 -202 -21 -191 43
2172D3K12J61j59n78OP32j54n32k10M38L12j64k53J38J17n44P1O23pk44m18O26
$$ 43 255 416 257 -321 -315 417 263 -269 -479 -41 271 107 -146 -8 109 -435 -364 259 252 8 -410 216
2194B16M70n79l26M08q2Q1k13L13m6j64J2Q6R1m22m84O03M57m37o2K23k46P0k26
$$ 216 686 107 -219 189 107 188 -25 288 242 78 90 176 267 -155 -639 -36 421 -16 -78 145 -101 -31 -257
2217b57M95j61j91m03Q87k60k32l00L67J88o1m2J99J05l01j59M93k9q29K4P82
$$ -257 238 77 -114 -517 370 110 -122 -422 -55 133 72 30 229 334 33 -126 367 338 -491 -467 315
2238C15J27l26m59JM51j45o7P9J15m37j10Q70o5q45n6K66L43K16j11j26K1k23
$$ 315 442 116 -343 -342 109 -36 -103 -24 91 -346 -456 414 349 -496 -552 -286 57 273 162 36 57 -166
2260a66j60O09nk72l89L57L10j86o1J5J14k41N2j2K93o49l13N71M38n08j20j9
$$ -166 -326 283 278 6 -383 -26 284 98 37 52 166 -75 -23 -35 258 -391 -704 -133 305 -203 -323 -342
2282c42M71%m16M15j89m39r6O78L17j32n11L42L35m08j30L75j43l55J30O06j8
$$ -342 129 129 -287 128 -61 -500 -596 82 399 267 -244 98 433 25 -105 270 127 -228 -98 508 490
2303D90p21L6K61K45q0k63K09j50n65L81O25k90k36l07N37N4l24q2J71K77m75
$$ 490 -231 -195 66 311 231 -32 177 27 -538 -157 468 178 -58 -365 172 226 -98 -180 -9 268 -207
2324b07O8L67r2k57j96K68N55n21j24N12m37j06j2L01k2j81n9J78P7j81k62L2
$$ -207 -139 228 136 -121 -317 -49 506 -15 -139 373 -64 -170 -182 119 97 -84 -143 35 112 -69 -331 -299
2346b99J96J83k38L23j57j03Q9j16Q1ro2J11J53m9l80K57L17l14j19N5K77j26
$$ -299 -103 80 -158 165 8 -95 -6 -122 -41 -50 -112 -1 152 103 -277 -20 297 -17 -136 -81 196 70
2368G0j87J45K75k12l77L70M0k33J15k0J30k38j27K83J62n26J65J70J74m04M44
$$ 70 -117 28 303 91 -286 84 124 -109 6 -14 116 -122 -249 34 196 -330 -165 5 179 -225 219
2389B19Pj56p5j36N57j06k56j97J44lj02J37k05N8J76o8LJ39m42O9l1L57k95R3
$$ 219 226 70 -5 -141 416 310 54 -143 1 -2 -104 33 -172 -114 62 -6 -3 136 -306 -237 -268 89 -206 -113
2413a13J18M9o5NP6k2j50l8M11p8k32l33N03K72l13m04M10j48M0m3L38K2k44m03
$$ -113 5 54 -11 -6 70 48 -102 -140 271 193 -39 -372 131 403 90 -314 96 -52 -12 -55 283 305 61 -342
2437c42J80L02j94r4J59j42n5J56k50J75j55j94M41L06j16l14p4M74j32r7O9J53
$$ -342 -162 140 -54 -148 11 -131 -186 -30 -280 -105 -260 -454 -13 293 177 -137 -211 263 131 34 103 256
2459B56m68K43J3M93o72k1M36j05k85%J01J45k90k94M39J15l28j48Q7N07j62l06
$$ 256 -212 31 44 537 -135 -156 280 175 -110 -110 -9 136 -154 -448 -9 106 -222 -370 -283 224 62 -244
2481b44k7M45m82M56j43J61j38J26J72R9k24o17M19K26j22l21M93k87K02m51K66
$$ -244 -271 174 -308 148 5 166 28 154 326 425 201 -416 3 229 107 -214 279 -8 194 -257 9
2502IK76k53o07M10N34n51J68J97r3l41o8L29L10n69j32M24K43k45l08M75n2n26
$$ 9 285 32 -575 -165 369 -182 -14 183 90 -251 -319 10 320 -249 -381 43 286 41 -267 208 156 -370
2524c70L14J96J29l6k20J38K6k02j39J86N9p0k49J33J61j50m2R1K14Kk17L31l07
$$ -370 -56 140 269 233 13 151 177 -25 -164 22 81 11 -238 -105 56 -94 -136 -45 169 171 -46 285 -22
2547b2J47k85J12J39j60p8L12j43j93R2L40l5k59n1M7L01k95j99K87k21j43q8
$$ -22 125 -160 -48 91 -69 -147 165 22 -171 -79 261 226 -33 -84 -37 264 -31 -230 57 -164 -307 -395
2569c95N14K16k56k27j8L75o2k85J34qR9O6J86l50j23rJ43J39k3j85K44K36j52
$$ -395 119 335 79 -148 -166 209 147 -138 -4 -12 87 153 339 -11 -134 -143 0 139 116 -69 175 411 259
2592B59m98o3M87l66N2K53k32q6J5j02L04q6L3j51L30M7j99P2Q1m04J73k41Q01
$$ 259 -239 -302 185 -181 -129 124 -108 -194 -179 -281 23 -63 -30 -181 149 196 -3 69 150 -254 -81 -322 479
2615D79m94j13J60K20M3l35R0rk48L90m14M02k07m57M21K65j20o1J17k5J52k48
$$ 479 -15 -128 32 252 295 -40 50 41 -207 183 -231 171 -36 -493 -72 193 73 12 129 104 256 8
2637Hj29M9p4J2L21r4j13m29L43K10M7J8k83P8Q8J49L1l2m11L9J88L96l3l96k56
$$ 8 -121 -72 -146 -134 187 93 -20 -449 -106 104 151 169 -114 -36 52 201 232 200 -211 -172 16 412 379 -17 -273
2662b73j38K41J98J98j10j74k63K77M23n49p3J62J84N9j38k12K99m37J98K56J15
$$ -273 -411 -170 28 226 116 -58 -321 -44 379 -170 -243 -81 103 162 24 -188 111 -326 -128 128 243
2683B43n03J33J89K30o8q2n22K59q2L16P4L4m68M2L01L54m96l41OM52p1J04j7
$$ 243 -260 -127 62 292 224 142 -380 -121 -203 113 187 221 -247 -205 96 450 -46 -387 -381 71 0 104 87
2706H7j39j92j17O24K55o20l13M08K71K22m29l4j77o5L43K55p8m68k2J47L19j21
$$ 87 -52 -244 -361 263 518 -102 -415 -7 264 486 57 23 -154 -219 124 379 301 -167 -189 -42 277 156
2728A56j85j74J33J16r6K25k19j92J23J99M3j04j57j84K21J24n2L12q2l20M29
$$ 156 -29 -203 -70 46 -50 175 -44 -236 -113 86 129 25 -132 -316 -95 29 -23 289 207 -113 316
2749C16n7j21l52J6L1L38j24j68l3K06PrK18l03q3j58K28K50m0k33n8K84k22j07
$$ 316 259 138 -214 -198 -167 171 47 -121 -154 52 59 50 268 -35 -118 -276 -48 202 162 -71 -129 155 -67 -174
2773a74R4J34n7KQ1J13j58l85N14n1k80J26K26l9k07K66q0j25J15l37K44r5K07
$$ -174 -80 54 -3 -1 80 193 35 -350 164 113 -167 -41 185 146 -61 205 125 0 115 -222 22 -73 134
2796A34l18J03K43J2k09pN4qK15J46l83N3m66N97J77k54m55L96O5l12K66m03M42
$$ 134 -184 -81 162 174 -35 -42 12 4 219 365 -18 35 -431 166 343 89 -366 30 95 -217 49 -354 88
2819H8j75K5K11k28n7Q0j67K20K3j12l7N2n2J34J35K0j55jq9K45o0k39K59m49
$$ 88 -87 -62 149 -79 -136 -56 -223 -3 20 -92 -129 -77 -129 5 140 160 5 4 -85 160 100 -139 120 -329
2843c29J80L82m0k1k61p2K72o4j56j46n0N93l42O1j29J26k94K2L63j44J07j96
$$ -329 -149 233 193 172 -89 -161 111 47 -109 -255 -305 288 -54 7 -122 4 -290 -268 95 -49 58 -138
2865a38j53O06j4k47k91J63K34j6o8N8k31k4L63P8j64m64J97K66j00r9o5K1j98
$$ -138 -291 315 301 54 -237 -74 160 144 76 134 -97 -121 242 320 156 -308 -111 155 55 -44 -109 -88 -286
2888b86J86M7K27N3l34K68j20j56j77J96P0j54k18N69Kk13l13K65L06J40k52k98
$$ -286 -100 -53 174 227 -107 161 41 -115 -292 -96 -26 -180 -398 171 173 -40 -353 -88 218 358 106 -192
2910a92l5N46m78J59j48K3J52K7K74m43j16J11Q4K17m63L65j57q3R6R2L79n05
$$ -192 -227 319 -159 0 -148 -125 27 54 328 -115 -231 -120 -36 181 -282 83 -74 -157 -61 31 410 -95
2932i5j15K92J05N3n16K8M48o6j34Q0O7j81R7m2J72r5O6j04R9k74J00K53k22k09
$$ -95 -210 82 187 240 -276 -248 200 134 0 80 147 -34 63 21 193 98 164 60 159 -115 -15 238 16 -193
2956a93j67K13M29k16j52j6O2J17K7j3L0p0k3J47k7k50j07J29oJ44k27M11m8k43
$$ -193 -360 -147 282 66 -86 -102 -40 77 104 91 121 51 28 175 148 -102 -209 -80 -86 58 -169 242 194 -49
2980d9q6m5M74m30OM22k62J3k96K48K44j96j23O2L2k20k1J14K26l9l66L80n0M8
$$ -49 -135 -180 294 -136 -130 292 30 43 -253 -5 239 43 -80 -18 14 -206 -227 -113 113 74 -292 88 38 86
3004H6M6k0l01J54K6J7K72k33k45Q2K10K97n06J17p9J28R1j88O9l81K95J03k1
$$ 86 132 112 -189 -35 -9 8 280 47 -198 -116 94 391 -115 2 -77 51 142 -46 23 -358 -63 40 19
3027A9L0j90j93L78Q4r4k6M5l24L97p0K61l46j70J50P4J41j56l2j84r6J85K66
$$ 19 49 -141 -334 44 128 34 8 53 -271 126 56 317 -29 -199 -49 25 166 10 -22 -206 -302 -117 149
3050A49j75j1r0l1M13O5n31J65N5R6j98K49j0l88J33J18j21K33K1k21L36m03J09
$$ 149 -26 -37 -127 -158 255 320 -211 -46 9 105 -93 156 146 -242 -109 9 -112 121 142 -79 257 -146 -37
3073c7J02M8l98K53j21J60P2j85j37K52J32l61m6K25K00l96J17J10j27k56L80
$$ -37 65 113 -285 -32 -153 7 79 -106 -243 9 141 -220 -266 -41 159 -237 -120 -10 -137 -393 -13
3094a3J78j15k44j60O74l26l7N3K09p5j73j6K10k0j81J18J17k48j30p2j35L38
$$ -13 165 50 -194 -354 320 -6 -43 10 219 144 -29 -45 165 145 -36 82 199 -49 -179 -251 -386 -48
3116d8l63N12r2k00j71L28J50m1k24K97j73q6j53K40j0K3m14M35J23r0j60J48
$$ -48 -411 101 9 -191 -362 -34 116 75 -149 148 -25 -111 -264 -24 -34 -11 -425 10 133 43 -117 31
3138C1K06j8m35J19j25J67L6J16k94N7J10Q3J54j72k51L1K62q1j03P6m6Kq7K66
$$ 31 237 219 -216 -97 -222 -55 -19 97 -197 -140 -30 53 207 35 -216 -185 77 -4 -107 -31 -77 -75 -162 104
3162A04J56k81r3J63L25k89K8m7j94O4J18J74j04j58J5K14K0k63k31L57K8j42
$$ 104 260 -21 -114 49 374 85 113 66 -128 -64 54 228 124 -34 -19 195 215 -48 -279 78 106 -36
3184c6k46N58k26k10P1m7J40J7O7k43K06on0p1M5k48K72J16J82l29p1J76k08L37
$$ -36 -282 276 50 -160 -89 -136 4 21 88 -155 51 45 -5 -76 -31 -279 -7 109 291 -38 -109 67 -141 196
3208A96l00J56M5l15J00K74J37o47K99jO2m3M3j31O5l4O9M15l95K08l65j5L06
$$ 196 -104 52 97 -218 -118 156 293 -354 -55 -56 6 -37 6 -125 -60 -94 -25 390 -5 203 -162 -177 129
3231A29Nj6j26J08k2m02K65k8rL3K01j57j32J85l00J36K18k88m0K08j08r2L53
$$ 129 134 118 -8 100 78 -324 -59 -87 -96 -63 138 -19 -151 34 -266 -130 88 -200 -240 -32 -140 -232 121
3254A21l5Q8l13J77J72J2m09J32Q2M7n0K68j39k05K95o7J99l41n3p4J94J2j92
$$ 121 86 174 -139 38 210 222 -187 -55 27 74 24 292 153 -52 243 176 375 34 -19 -93 101 113 -79
3277g9J12j52j34J82K10L2k10j51L24K1j52k31o1K24M7J03O4j53o5Q7K34Jo5l08
$$ -79 33 -119 -253 -71 139 171 -39 -190 134 155 3 -228 -289 -65 -18 85 149 -4 -69 18 252 253 188 -120
3301a20K60M1k85p2L4J62J8k41J60M0r0r9J45K04n26K78K85k53J20l36M70P1l20
$$ -120 140 181 -104 -176 -142 20 38 -203 -43 -3 -93 -192 -47 157 -369 -91 194 -59 61 -275 195 266 -54
3324e4J27qJ31M5l16qJ78j2j4o7L1J3j55j69M76j82m3k9J13j26N3j73K86k2Qk02
$$ -54 73 65 196 241 -75 -83 95 83 69 2 33 46 -109 -278 198 16 -27 -56 57 -69 -16 -189 97 75 83 -119
3350a19K37k0l16L10k9m3l47N50p9j0M2l6q0k03K01q4lL11n36K4J95K54j46j76
$$ -119 118 98 -218 92 63 20 -327 223 144 134 176 140 60 -143 58 -26 -29 282 -254 -230 -35 219 73 -103
3374a03K27j48j7j69L14j79k6N7K99K0m30j46K12L39j26k78J29j11mL6K49O7l99
$$ -103 124 -24 -41 -210 104 -75 -101 -44 255 275 -155 -301 -89 250 124 -154 -25 -136 -140 -104 145 212 -187
3397a87L23j36N9j07J78j50K17k30mP3O0m6m8Q8l85o7J52K05J41j30J25k42P1
$$ -187 136 0 59 -48 130 -20 197 -33 -37 36 96 50 2 90 -295 -362 -210 -5 136 6 131 -111 -40
3420d0L0P4K67k18j51M9jL29l27k80K39P9NN1j78j1J48j2O6k49J6m30J45L32J11
$$ -40 -10 64 331 113 -38 11 10 339 12 -268 -29 50 55 106 -72 -83 65 53 119 -130 -114 -544 -399 -67 44
3445D4J1J46k50q7J71O8j76rp5L23j33J52k50j70K86k7L1k23L88k51o5K64P2l09
$$ 44 55 201 -49 -136 35 103 -73 -82 -157 166 33 185 -65 -235 51 24 55 -168 220 -31 -96 168 240 -69
3469f9k68K91K78l1l23m4J40k23K09o8J03K6k86M20n0j28L22k77k08N6L69J29
$$ -69 -337 -46 232 201 -122 -166 -26 -249 -40 -108 -5 21 -265 155 105 -23 299 22 -186 -130 239 368
3491C68l63J9n5J3J24N3l29J74j81K20k6j26J8%J51J73k02j32n06M68k6M06rl31
$$ 368 5 24 -31 -18 106 159 -170 4 -177 43 17 -109 -91 -91 60 233 31 -101 -607 -139 -165 241 232 -99
3515i9L2p7L35q1R8m14K23L01k43lOl1K53m21J99J9N3j86m6J69N0k27K2K45m06
$$ -99 -67 -144 191 110 208 -206 17 318 75 72 78 47 300 -121 78 97 150 -36 -82 87 137 -90 -68 177 -229
3540b29l1K47l9j37Q5r1K86k31j3J11r1M0P4J69k6m59K10R1L12Nn77lL63k47J87
$$ -229 -260 -13 -52 -189 -104 -195 91 -140 -153 -42 -133 -93 -19 150 124 -335 -125 -34 278 283 -294 -297 66 -181 6
3565FL1j09o0J75j13kR0l39L21m7N5Qm0j7J8oL78j96M9l01J03k4l45L09J60K1
$$ 6 37 -72 -132 43 -70 -72 18 -321 0 -47 8 16 -24 -41 -23 -29 349 153 202 -99 4 -20 -365 -56 104 125
3591A25J1j13j42k09M95l78K33n1l9K42l05Q1N5J88n70L78M3n1j80O5J59j77q2
$$ 125 136 23 -119 -328 167 -211 22 -29 -68 174 -131 -50 5 193 -377 1 44 -7 -187 -122 37 -140 -222
3614b22K18J00M7q8j6k17K09o0J46j66j37J51j0K62m15J93r4p7J47k3j9K43o4
$$ -222 -4 96 143 55 39 -178 31 -29 117 -49 -186 -35 -45 217 -198 -5 -99 -176 -29 -52 -71 172 108
3637A08j84Q3K87o08L69p0P1o1j04J93j74L58l69L58j34k28J93k19L21m8j83O4
$$ 108 -76 7 294 -314 55 -15 56 -5 -109 84 -90 268 -101 257 123 -105 88 -131 190 142 -41 23
3659B3m1n7R9r1O4j21R1J33l0Oj00J87j18j16J08N0p3p6J78m2m02J46J95n7n4
$$ 23 -18 -75 24 -67 -3 -124 -33 100 70 76 -24 163 45 -71 37 87 14 -62 116 74 -328 -182 13 -44 -98
3684i8L02j49o8Mj82J57lj73J99n0J92j68Q8l26PL05R9m1j56j95J91j48L06j07
$$ -98 204 55 -13 -9 -191 -34 -37 -210 -11 -61 131 -37 51 -275 -268 37 136 95 -61 -256 -65 -213 93 -14
3708a4j71j75M19n5J25L6j48o4P1N3O7l06J8J79l0q9j36k1L95j5r6J14l00J71
$$ -14 -185 -360 59 4 129 165 17 -47 24 77 144 -162 -144 35 5 -84 -220 -241 154 139 43 157 -143 28
3732B8k14J18K60m66K46j81L18J50j97j88K73k04K17q3K9k43L5J42K16l17j2J45
$$ 28 -186 -68 192 -274 -28 -209 109 259 62 -126 147 -57 160 77 106 -137 -102 40 256 -61 -73 72
3754G2J93k10K93n55J97jK40q4J30l03l57L1M42K34m28L2J87m6j09J0J81l53L4
$$ 72 265 55 348 -207 -10 -11 229 145 275 -28 -385 -354 88 322 -106 -74 113 67 -42 -32 149 -204 -170
3777a70L01n8j87L03k48p4K48J04j77L02k55j64J53J31M4l30J78j31M6J13j42
$$ -170 131 73 -114 189 -59 -133 115 219 42 344 89 -75 78 209 253 -77 101 -30 16 129 -13
3798a3M2r0p6K20k53J60j40J00K10j72o7Q5Q9j65N4j46J21K84l08J92N9l99K87
$$ -13 29 -61 -137 83 -170 -10 -150 -50 160 -12 -79 6 95 -70 -16 -162 -41 243 -65 127 186 -213 74
3821G4j21J76J11k96j43L51l53L20N7l95J99J08l33M26l83J02J49J68k81L22j91
$$ 74 -47 129 240 -56 -199 152 -201 119 176 -219 -20 88 -245 181 -202 -100 49 217 -64 258 67
3842F7j04k33K89K07j47q8P2J13k36J81k30q0K75l70K31J10j79K34j82o3M6J85
$$ 67 -37 -270 19 226 79 -9 63 176 -60 121 -109 -189 86 -284 -53 57 -122 112 -70 -133 -87 98
3864I8O6k02J34O0j87mj28N04m24L0O8J39l05N07k62k70P7J95q9j61L72J2l11
$$ 98 164 -38 96 156 -31 -35 -163 341 -83 -53 15 154 -151 356 94 -176 -99 96 7 -154 218 230 -81
3887h1J41L7r5j89K41K3j25j29J98k68J23J10J43k28K30J0k92K57j51O7j65M0
$$ -81 60 97 2 -187 54 77 -48 -177 21 -247 -124 -14 129 -99 131 141 -151 106 -45 22 -143 -103
3909a03N1K50k06rK45m70K01j51J6K20L1k06m9K86O3o5j68J00l17K76j71K42K3
$$ -103 -52 198 -8 -17 228 -242 -41 -192 -176 44 75 -131 -180 106 169 104 -64 36 -281 -5 -176 66 89
3932H9l99K56M2NK7j67J46m4K68l83J46K92l45J92j68qn7L24p5j02J53ql75J39
$$ 89 -310 -54 -12 -7 20 -147 -1 -45 223 -160 -14 278 -67 125 -43 -51 -108 216 141 39 192 184 -191 -52
3956e2J7J15J09l30M2J98K15l14J05k18J30j29Q7J34mR1j08m8n7j20J17j86L22
$$ -52 -35 80 189 -141 -99 99 314 0 105 -113 17 -112 -25 109 105 196 88 40 -17 -137 -20 -206 116
3979A16r7k88L92k04J6K16k89J14j36o8M13l9k09Q5j15P4k68J03Q8n8R1J77l76
$$ 116 19 -269 123 -81 -65 151 -138 -24 -160 -228 185 146 -63 22 -93 -19 -287 -184 -96 -154 -63 114 -262
4002b62L69r1K39j57j13j78L21q4j42L8J7R6M8PN9j99L4o6K40l60J49KJ34l31
$$ -262 107 16 255 98 -15 -193 128 44 -98 -60 -43 53 101 108 167 -32 2 -64 176 -184 -35 -33 101 -230
4026b30L57o7k68j49L21K53j90K62l46J73k98K45J75p4rk33j27J64j8J97o1o5
$$ -230 127 60 -208 -357 -36 217 27 289 -57 116 -182 63 238 164 155 -78 -205 -41 -59 138 77 12
4048A2J06o0L7j25Qj9J18O1K2o5p7o9O4m8j41J18k05Q5K14J71l31K1R0K7q0J54
$$ 12 118 58 95 -30 -22 -41 77 138 160 95 18 -51 13 -35 -176 -58 -263 -178 36 207 -124 -103 -13 14 -66 88
4074H8j36k06P0L10L26n34L0RQ1k20K64k72J54J23l0k0N7r3N3MN9lJ00j92j24
$$ 88 -48 -254 -184 126 452 -82 -52 -43 38 -182 82 -190 -36 87 57 37 94 1 54 58 117 114 214 22 -102
4099a02L11m8R7j37l10J31j38M32j14M1j87J24rl0j4j66L5j16M08k54n6J52j55
$$ -102 209 161 258 121 -189 -58 -196 236 122 163 -24 100 91 61 47 -119 -84 -200 208 -46 -102 50 -105
4122a05J70q7j99K23k3J24M9k92L77j85NJ22q9Q2k05K13k83o5J40m7J59J4j84
$$ -105 65 -22 -221 2 -21 103 152 -140 237 52 57 179 90 172 -33 180 -103 -168 -28 -75 84 98 -86
4145h6J81N1l28k22K62J60L2j27N0n9j37J52p2J93k47rJ92K4J49l13O5K57j21
$$ -86 95 146 -182 -404 -142 18 50 -77 -27 -86 -223 -71 -143 50 -197 -206 -14 10 159 -154 -89 168 47
4168D7J24p5K4j2j29L02l61P5J46P6k62J45j85pM6J34r7J18K9o7l88L68L7n3P9
$$ 47 171 96 120 108 -21 281 -80 -5 141 217 -45 100 -85 -92 -46 88 -9 109 138 71 -317 51 88 35 114
4193A14j63J18k15J8L73l70O0l1j48L84k11k29L40Q7k5k21K29l76n0J66K10l10
$$ 114 -49 69 -146 -128 245 -125 -65 -96 -244 140 -71 -300 40 127 102 -119 110 -266 -316 -150 60 -250
4215b50n0L12k13K11j82l1j58M05J6j72J74J6K5k07M22j28l04o0J02J34K5J23
$$ -250 -300 12 -201 10 -172 -203 -361 44 60 -112 62 78 103 -104 318 190 -114 -174 -72 62 87 210
4237B10k17J57J40M4k64Q5j71O5p1m1R6J3O3P8j7j61J2o1j83O0J73l3Q9j27P9
$$ 210 -7 150 290 334 70 155 -16 49 -22 -63 33 46 109 187 170 9 21 -40 -223 -163 10 -23 66 -61 18
4262A8J81l24J1L63j56j68K1j08K53O4l14K87j24j33J25j15L36k60j2J97k76J18
$$ 18 199 -125 -114 249 93 -75 -54 -162 91 155 -159 128 4 -129 -4 -119 217 -43 -55 142 -134 -16
4284a6r8K49j25p0j79K39Q4n8Pj25J15j68L21l06K70k17P4K00k38J43j60lM45
$$ -16 -114 135 10 -60 -239 0 84 26 33 -92 23 -145 176 -130 140 -77 -3 197 -41 102 -58 -61 384
4307C84k91j54P8o9j4N5N5r5J79j71NK46k26j1K65m00K48j16j70J53J90L8l32
$$ 384 93 -61 17 -52 -66 -11 44 -51 128 -43 -38 208 -18 -29 236 -164 84 -32 -202 -49 141 179 -153
4330a53J09M8K02m24N98m72K40m1NJr9l5J64j06j27l6K20j58k5J54j5j0p4Q1J72
$$ -153 -44 4 206 -218 380 -92 148 107 112 113 14 -21 143 37 -90 -126 94 -64 -89 65 50 40 -34 47 219
4355B19m66K19J24J3q7l1J68p6j13J58k76J90j7k47J84N0m7J52J68l30J71k45
$$ 219 -247 -28 96 109 22 -9 159 83 -30 128 -148 42 25 -222 -38 12 -35 117 285 -45 126 -119
4377a19J0K08L7m72K51o7M48m82K54j0K8j93J57k90l9J47m9K64j66j58L48j16
$$ -119 -109 99 136 -336 -85 -152 296 -186 68 58 86 -107 50 -240 -279 -132 -181 83 -83 -241 107 -9
4399iJ79j96l4K70l77l3l1M60l63J79k78K89Q7j36k67L16k41J06O8J67k27J31
$$ -9 170 -26 -60 210 -167 -200 -231 229 -134 45 -233 56 143 7 -260 56 -185 -79 -11 156 -71 60
4421F0j62m2K18l68J15M81j58j59K81j50r9j15J38n6n0P5j07K61k14J81n2k73
$$ 60 -102 -144 74 -294 -179 302 144 -15 266 116 17 -98 40 -16 -66 9 -98 163 -51 130 78 -195
4443a95J64n3MJ42O9l41pK18j07J45Q5j79J99k6p3l3j38M02l88M80m87P4J75j82
$$ -195 -31 -84 -80 62 131 -210 -217 1 -106 39 124 -55 144 118 45 12 -126 276 -112 368 -119 -45 130 -52
4467e2J19r0J59j37J06J8k67R4O8k64J65K17Kk47K94j56j15L0j40R0L7pK64J2
$$ -52 67 -23 136 -1 105 123 -144 -50 18 -246 -81 136 138 -109 185 29 -86 -56 -196 -106 -69 -76 188 200
4491B00j24J60l83L44l01K15k89j2J68l3K59r9k40J26J04J54j58r7j2j99J40M0
$$ 200 76 236 -147 197 -104 111 -178 -190 -22 -55 204 105 -135 -9 95 249 91 -6 -18 -217 -77 -37
4513c7j93L15j18k1J0O7k04K52k55P4L36j84m0M0l66K01J50L5o7j22j05P7J44
$$ -37 -230 85 -33 -54 -44 23 -181 71 -184 -110 226 42 2 42 -324 -123 27 62 -5 -127 -232 -155 -11
4536a1j14L35q0r8k12L52j9j95P3R1M3J07l55P9J44m1L1q6J98l60J0L89n2l61
$$ -11 -125 210 130 32 -180 172 153 -42 31 122 165 272 -83 -4 140 99 130 44 242 -118 -108 281 229 -132
4560a32J78%J22j58p8J87m8k29Mr9M87l02K9J07j51o0M4K0J06J87k64l3L22j09
$$ -132 46 46 168 10 -68 119 71 -158 -154 -253 234 -68 -39 68 -83 -143 -99 -79 27 214 -50 -83 239 130
4584A30p4q3L01l48k6M2J80K8j61J19j65R7k12K6L25k65L03k45j3J67k82J1r6
$$ 130 56 -27 274 -74 -100 -58 122 150 -11 108 -57 40 -172 -146 179 -86 217 -28 -41 126 -156 -145 -241
4607b41L53o4k51RR7K58l34J77K5k6j32L53j14j61J61k16j1p0J91N7k80Rk9K02
$$ -241 112 48 -203 -194 -97 161 -173 4 29 3 -129 224 110 -51 110 -106 -117 -187 4 61 -219 -210 -239 -37
4631c7R2l9J10k37l9o1R5L34k14j61j05J97J12j66R5J71p4m35J86K00Q7k10P0
$$ -37 55 16 126 -111 -150 -211 -116 218 4 -157 -262 -65 47 -119 -24 147 73 -362 -176 24 111 -99 -29
4654b9J73l28L27j18k15K69o3R4K50l87J95k59P9K51j22n6L5j04k57L84P8p5l10
$$ -29 144 -184 143 25 -190 79 16 110 360 -27 168 -91 -12 239 117 61 96 -8 -265 119 197 122 -188
4677a88K42J50L0k83M5J72j5k36L4K90J7j26j18J24k31J8o8L81j61k22J70%r9
$$ -188 54 204 234 -49 -4 168 153 -83 -49 241 258 132 14 138 -93 -75 -143 238 77 -145 25 25 -74
4700g4k3n5L00k59j21M12J37m4m28R0K07k23J6P4m0N0m3L4K29N9l25j3P6Q4l8
$$ -74 -97 -152 148 -111 -232 180 317 273 -155 -65 142 -81 -65 9 -31 19 -24 10 239 298 -27 -40 36 120 82
4725H2J32k2l28qJ74J13j97L6P3P9j39j09M8J87n6j13J48k10L3K96k15LJ4K3P1
$$ 82 214 192 -136 -144 30 143 -54 -18 55 134 -5 -114 -66 121 65 -48 100 -110 -77 219 4 7 21 44 115
4750A15J73pl79K75j63P9j32j08L16k25k5L40k17O4l45L01j74K27J17l81M18k50
$$ 115 288 281 -98 177 14 93 -39 -147 169 -56 -81 259 42 106 -239 62 -112 115 232 -149 269 19
4772A9j00J24j78N1p6L50r3L78l76m2o6p7K28J31l76J25J3r4j4r5J42M7m3j5j49
$$ 19 -81 43 -135 -84 -160 190 97 475 99 57 -9 -86 142 273 -103 22 35 -59 -73 -168 -26 21 -22 -37 -186
4797a86LJ11o1K18K9P1k35j24J02K24j36j37Rj18L49K4r7j43J16k90K16L22l31
$$ -186 -183 -72 -133 85 114 185 -50 -174 -72 152 16 -121 -112 -230 119 143 46 -97 19 -271 -55 267 -64
4820f4N6P0J27j69j30j36L83J62l62j44K19n9j12L07o4j74J25j32J57N2k3j25
$$ -64 -8 62 189 20 -110 -246 137 299 -63 -207 12 -47 -159 148 84 -90 35 -97 60 112 89 -36
4842c6K1j10%K97j42r3p0J93K52k85k2O9j40K38k82mP5q4j4K70j6J51l76j1R6
$$ -36 -15 -125 -125 172 30 -63 -133 60 312 27 5 74 -66 172 -110 -114 -39 -123 -137 133 117 268 -108 -119 -23
4867b3J08j00J70jm07J72L18m8j03j12J0J40j34R2L0J02Q6j67l26J47K47l29K47
$$ -23 85 -15 155 154 -253 -81 237 189 86 -26 -16 124 -10 82 112 214 300 133 -193 -46 201 -128 119
4890A19j46N0mj09K35k48K71k87o1J98k04K64Q2k00J3J2k20K9K81p0L26m68r3
$$ 119 -27 23 19 -90 145 -103 168 -119 -180 18 -186 78 160 -40 -27 -15 -235 -206 75 5 331 -137 -230
4913b30L63O4j47j41k35L44k55K46l1J31k76j23L63M0j51j61L63j29j63L7j41
$$ -230 133 197 50 -91 -326 18 -237 9 -22 109 -167 -290 73 113 -38 -199 164 35 -128 -91 -232
4934b32K85nR2M6k96J03j89L31J10j99j71J69q5K32l15kK38j66j1P4k45M76l08
$$ -232 53 48 140 186 -110 -7 -196 135 245 46 -125 44 -41 191 -124 -126 112 -54 -65 9 -236 240 -68
4957f8O9j4J22j68n1Q4l6kJ90j98j76M21k83J35J59l23K15j46Oq2J86k60P9J28
$$ -68 1 -13 109 -59 -110 -26 -62 -64 126 -72 -248 173 -110 25 184 -139 76 -70 -64 -146 40 -220 -141 -13
4981a3J83j95J99q4j45j11N5J45R3q8kj33j04L20j69k24K49j66J56q7L63j86k64
$$ -13 170 -25 174 90 -55 -166 -111 34 127 39 37 -96 -200 120 -49 -273 -24 -190 -34 -121 242 56 -208
5004b08K59n9J68%k40l2K02kj90J10O3l4j41K6K42l87J52j34K46j30J14QJ37j87
$$ -208 51 -8 160 160 -80 -112 90 88 -102 8 71 37 -104 -78 164 -223 -71 -205 41 -89 25 33 170 -17
5028a7k14K3K19j45r5K01j38M40m18K2K47j81Q5j54J10k23L34l17K69p1o8J96
$$ -17 -231 -208 11 -134 -229 -28 -166 274 -144 -122 125 -56 29 -125 -15 -238 96 -221 48 -23 -91 105
5050A05p9l6k4J14N1m6k1m6j48L17j61j04P2k26r7K98J36M8j08k61J07j09K30
$$ 105 26 -10 -34 80 131 85 64 18 -130 187 26 -78 -6 -232 -329 -31 105 153 45 -216 -109 -218 12
5073A2K67k07j4p6j11J86Q1l04M17j23j29k76M20O5j64Q7k13J72k11o9J24n2K09
$$ 12 279 72 58 -18 -129 57 138 -166 251 128 -1 -277 143 208 44 131 -82 90 -121 -190 -66 -118 91
5096I1j65K84l47p1J68J36m1k91K66l4K8r5J21j02J08o0lJ55k5q8k31L88k71j6
$$ 91 -74 210 -137 -208 -40 96 55 -236 30 -4 24 -71 50 -52 56 -4 -7 148 123 35 -196 192 -79 -95
5120i5r5J88j72J70J7k47K27j81j6L68pn1k33l6J64J1M8j3J07j2r0MJ64k96M9
$$ -95 -190 -2 -174 -4 13 -234 -7 -188 -204 164 157 106 -127 -163 1 12 60 47 154 142 52 56 220 -76 -27
5145b7M3j4J33k95L06j03Q2j20O3m1n2r4K63o5j01j15J10L3j54j00J73K51j95
$$ -27 16 2 135 -160 146 43 125 5 68 27 -25 -119 144 79 -22 -137 -27 6 -148 -248 -75 176 -19
5168a9J25j48R3K2M2j19Q8j46k09M6L86j12N8o0nk78J36nK88l4j81J35k0j02j67
$$ -19 106 -42 51 73 115 -4 84 -62 -271 -225 161 49 107 47 42 -236 -100 -105 183 149 -32 103 83 -19 -186
5193a86J22k9Q4J6K47K5k44k44O8L20l2m23K74k3K54n57J42K50j7j60Q6K06m51
$$ -186 -64 -93 -9 7 254 279 35 -209 -141 179 147 -276 -2 -25 229 -328 -186 64 47 -113 -27 179 -272
5216b72K22M8k00M55k23k6K06l04q7J88K6P5k29p8J14M02m06o5M86l34r4j21K6
$$ -272 -50 -2 -202 253 30 4 210 -94 -181 7 33 108 -121 -199 -85 317 -89 -154 332 -2 -96 -217 -191
5239a91R4n4N9J59K6j34mJ43r8ml8m6n2j30L05M3j87J78j76K94k39j10Q2J11q1
$$ -191 -97 -151 -92 67 93 -41 -45 98 0 -4 -42 -88 -140 -270 35 78 -109 69 -107 187 -52 -162 -80 31 -50
5264e0on6QJ01M3O8N0J03l33j25Q5n4K76M8R2K1l06J8n9K11j32R1k39K00n9j77
$$ -50 -56 -112 -104 -3 40 108 158 261 -72 -197 -112 -166 110 158 250 271 -35 -17 -76 135 3 94 -145 55 -4 -181
5290a81J94J00J8k94M47n53K22J04J00j21k04NK84j63L7j11R8P7k81L14NJ0k59
$$ -181 13 113 131 -163 284 -269 -47 57 157 36 -168 -163 121 -42 -5 -116 -18 59 -222 92 97 107 -152
5313a52J18J10Kj92J20K22k3q8k83J88j56J04J32J65k90j95r5M69j09j11Q0j70
$$ -152 -34 76 78 -114 6 228 205 117 -166 22 -134 -30 102 267 -23 -218 -313 156 47 -64 16 -154
5335a54L32j37m0j1J05p1k45J65J33Rm32L63KK14l08k8j05J52K58l57K77j87j73
$$ -154 178 41 1 -10 95 24 -221 -56 77 86 -346 17 19 233 -75 -103 -208 -56 202 -155 122 -65 -238
5358b38Q8N8Q3P7p1K21k09j42P5OP7j4k06K36q9l6J40l2J25m15L73n9L4q8K88
$$ -238 -150 -92 -9 68 -3 218 9 -133 -58 -52 25 11 -195 41 -48 -84 56 24 149 -266 107 48 82 -6 282
5383B82k64P6r8R0m4j4Pj28J44l19K97J99j73l6L6p6K90l99K30q1j7k46L4J61
$$ 282 18 94 -4 86 42 28 35 -93 51 -268 29 228 55 19 55 -21 269 -130 100 19 2 -244 -210 -49
5407d9k27L11J13L9k30J58l36L61n29L61J16J5j70MJ44L4m2m7K10j88J68l72k51
$$ -49 -276 35 148 187 -43 115 -221 140 -389 -28 88 103 -67 -63 81 115 73 26 236 48 216 -156 -407
5430d07K54L34j68j88K47k0j13K70j43l9M4K13j24j35k27J86L8j42L1K88l49J93
$$ -407 -153 181 13 -175 72 52 -61 209 66 27 71 284 160 25 -202 -16 22 -120 -89 199 -150 43
5452D3k79P0K05J01m8m8K43l15j43J02K98j11l88L26J52l27K68k27R3j69K62j45
$$ 43 -236 -166 39 140 92 44 287 -28 -171 -69 229 118 -270 56 208 -119 149 -78 15 -154 108 -37
5474c7K36p5P0j46mq8k30L40j04J81j17J00k97l4K34j53k14P15m89K0R2m1Q2P8
$$ -37 199 124 194 48 44 -44 -274 66 -38 143 26 126 -171 -205 29 -124 -338 377 -112 -92 0 -41 41 119
5498A19r5M2j46L05j23l4j2l3j87P1N6Qj41L80M9k86K14m06P8J8J33L0j02k04
$$ 119 24 66 -80 225 102 68 56 23 -164 -93 -37 -29 -170 210 259 -27 187 -219 -141 -123 10 40 -62 -266
5522b66M18Jk23K24P8o6np9l0o5J12j69J21k34Q9K60k23j54K80l45M88rj28r8
$$ -266 152 153 -70 154 232 166 161 82 52 -13 99 -70 51 -183 -94 166 -57 -211 69 -276 212 203 75 -23
5546b3k04K74J9j7l8K35m29K47k1m2j10q1L05j96J86k82J13R6j26O9L39m90J06
$$ -23 -227 47 66 49 11 246 -183 64 43 1 -109 -190 115 -81 105 -177 -64 32 -94 -25 314 -176 -70
5569g0K53p4j69m5k92M42LN7l7k06J62n9L6LK74m19m6L43k39J54O9k23K07o4M1
$$ -70 183 109 -60 -105 -397 45 48 105 68 -138 24 -35 1 4 278 -141 -187 156 -83 71 140 -83 124 60 101
5594A01l9k8p2l19M49J76k02o4L4Q9j20K77Mj47j09k7J17k07p7rK00n8l1J52m0
$$ 101 62 34 -38 -357 92 268 66 2 36 125 5 282 286 139 30 3 120 -87 -164 -173 27 -31 -62 90 50
5619E0M32p41n4L08J2rK2J63k47J39k29k58L16N6j53M38k45j68J91L44k60r5L9
$$ 50 482 -259 -313 -5 7 -2 20 183 -64 75 -154 -412 -96 -40 -193 245 0 -168 23 367 107 12 51
5642E1m5J33l30K35o6J04j43M5j3r9J6J44K00j15k3q9K7p3J92o8q9j1k0L8j3J1
$$ 51 6 139 -191 44 -22 82 -61 -16 -29 -128 -112 32 232 117 94 5 32 -41 151 83 -6 -17 -37 1 -12 -1
5668aK15p4j2j32J22m07K84J92l03o5K69m2r4K00J00l37Jo0K85J21l76K39p8j76
$$ -1 214 140 128 -4 118 -289 -5 187 -116 -181 88 46 -48 152 252 -85 -84 -144 141 262 -114 125 47 -129
5692a29q3J70J34k68K43k4J08l29J04j72N09l29j05K22k32J26j9R5J19q3k47K71
$$ -129 -212 -42 92 -176 67 43 151 -178 -74 -246 263 -66 -171 51 -181 -55 -74 21 140 57 -190 81
5714H1q9P1Jr4K22k10%j13K18q0p3k9J58Pm9o3K7k31J75j5R0j48J07J13q3N7o5
$$ 81 -8 63 64 -30 192 -18 -18 -131 87 7 -66 -95 63 70 21 -42 -15 -246 -71 -86 4 -144 -37 76 -7 50 -15
5741a5j45M34q0n52J42J14K94k31K04k79Q8N1l3J77j17J0j64J94j24o2J48N7J27
$$ -15 -160 274 194 -358 -216 -102 192 -39 165 -114 -26 25 -8 169 52 62 -102 92 -32 -94 54 111 238
5764B38m04J77J14p4k70N9K57j44j25j3OL95l44m1J82N8J09l02L39l52K45K9J4
$$ 238 -166 11 125 51 -219 -160 97 -47 -172 -185 -179 216 -128 -169 13 71 180 -122 217 -135 110 139 153
5787A53p6J37l05K37p0p7j45k9J77k8K50l68K90l05M24on8k49K34K9j58j28J4
$$ 153 77 214 -91 146 76 -1 -146 -175 2 -26 224 -144 146 -159 265 259 201 -48 186 215 57 -71 -57
5810e7pK45o5l36Q6J10Q4J33j73J28l27L5L77l07j50P7O2l6O7J28m6l3j67K43
$$ -57 -64 181 116 -220 -134 -24 60 193 20 148 -179 -144 233 -74 -224 -147 -85 -121 -54 74 28 -5 -172 71
5834G1j58Q5k22K98Mk27P9j87M22m6p8k30K94j21k5m8K52l44R9j0L32k25J68j31
$$ 71 -87 -2 -224 74 78 -149 -70 -257 165 119 41 -189 105 -16 -41 -89 163 -181 -82 -92 240 15 183 52
5858E2R1m26L56o1J08l27L2J27J98J23m41P3K70j60j73r4M30J8k85m5L88j54l9
$$ 52 143 -283 73 12 120 -207 -175 -48 150 273 -168 -95 175 15 -158 -252 178 196 -89 -134 254 100 61
5881F1k72R1O4o7K67j53J57j59l0J15j71n1L58m77K82j05l3K04j04J89k09K51
$$ 61 -211 -120 -56 -123 144 -9 148 -11 -41 74 -97 -148 210 -267 15 -90 -123 81 -23 166 -43 208
5903B08k52K7j40J77n9j83K22O1P6J22o4M9l85j3j3Q1L81j69n8k58K7J6K88j02
$$ 208 -44 -17 -157 20 -39 -222 0 61 137 259 195 244 -141 -154 -167 -86 295 126 68 -190 -163 -147 141 39
5927C9J99j66k46J44j38q6J96k1P0qj7j12J08R5k87J83M6J79j29J51m5l08j15
$$ 39 238 72 -174 -30 -168 -254 -58 -79 -9 -17 -34 -146 -38 57 -230 -47 -1 178 49 200 155 -153 -268
5950b68K69l1M7j51K13L40k58j59J25K81k75j87K03k44K72j03j78O9k20L66j77
$$ -268 1 -30 17 -134 79 419 161 2 127 408 133 -54 149 -95 177 74 -104 -35 -255 111 -66
5971f6K8J07j90J94K52m01j57K07j15K68k0J73k08k69K8J41K9r8O5p0R8j84J01
$$ -66 -38 69 -121 73 325 -76 -233 -26 -141 127 107 280 72 -197 -169 -28 1 -97 -32 -102 -4 -188 -87
5994h7kJ08LM17m78K75m98K40nq1K54j25K28P3l64J88j76M1k55O9K54k98L00n0
$$ -87 -89 19 22 439 -39 236 -262 -22 -27 -108 146 21 249 322 -42 146 -30 11 -244 -175 79 -219 81 31
6018C1J34l74J17qK23r8J7k30m1J72N3l1k02K13j23k8J97j75R0j18K65P0j22k01
$$ 31 165 -209 -92 -100 123 25 42 -188 -229 -57 -4 -35 -237 -24 -147 -175 22 -153 -63 -181 84 154 32 -169
6042a69M3J21k14L19M4j9r6J27k3j86r3q0L20j85J45J21m66L73l23O2L8O4j93
$$ -169 -126 -5 -219 100 144 125 29 156 133 -53 -146 -226 94 -91 54 175 -291 82 -241 -179 -141 -77 -270
6065b70L23l31K48J01k18J86K8l4j15L69q4l01K71q0k0j01l64M30p0R2J94k77
$$ -270 53 -278 -30 71 -147 39 67 33 -82 287 203 -98 173 93 73 -28 -392 38 -32 60 254 -23
6087b3Pk2J01J33L1k54j09mQ6l58L79K06j12J5l34K49Q8k9j28k7Q3o0J04k95L78
$$ -23 -16 -38 63 196 227 -27 -136 -140 -54 -412 -33 173 61 76 -258 -9 79 50 -78 -105 -22 -82 22 -273 105
6112A05l73K99L73m59K58k88N0O2j74J25l65L20j86L7K25J76j48J13O5J76p55
$$ 105 -268 31 404 -55 203 -85 -35 27 -147 -22 -387 -67 -253 -216 9 185 37 150 215 391 -364
6133c64L12j41J07K00N5m8k30O9oO0J00j26j69O1J06m9ML4L5K00k61J70J75n64
$$ -364 -52 -193 -86 114 169 121 -109 -40 -46 14 114 -12 -181 -120 -14 -63 -59 -25 10 210 -51 119 294 -270
6157b70L57J15r0k43p8K12J18m39K90k8M1k19J05p0L93j15j67K94j57j19m3L64
$$ -270 87 202 112 -131 -209 3 121 -318 -28 -56 -15 -234 -129 -199 194 79 -88 206 49 -70 -113 251
6179B51m3j32J63m6k92N2J78K10k61l78J11J14K93k73P2l0l0JQ9J88j75j16j40
$$ 251 208 76 239 193 -99 -47 131 341 80 -298 -187 -73 220 -53 19 -11 -41 -40 49 237 62 -54 -194
6202a94R3K60k29j48J73K05k89J57q2j13p9K23j58L60l80O6L07j08j0n7O9j54
$$ -194 -101 159 -70 -218 -45 160 -129 28 -54 -167 -246 -23 -181 179 -201 -135 172 64 54 -3 66 -88
6224h8Jk61L91L18m29j10J61k5Q5Q5L8k80J65J71k98K19j57j20J80mj72J54p2
$$ -88 -87 -348 43 361 -68 -178 -17 -42 43 128 166 -114 51 222 -76 143 -14 -134 46 42 -130 24 -48
6247d8J01M8R7j65k92J74P8K5j49J40O1P9O9j91k38M56k96K58j80R3J11j28k29
$$ -48 53 101 198 33 -259 -85 -7 18 -131 9 70 149 218 27 -211 245 -51 207 27 120 231 103 -126
6270a26J85j5J11M1k59L9k9l18N16j39l8K42k89L9J22J7k90L45K9k49J91M7k17
$$ -126 59 44 155 196 -63 -24 -53 -371 145 6 -32 210 -79 -40 82 99 -191 154 183 -66 125 172 -45
6293d5j59L81J1Q5o1j01J03k51J17k01K39q5J59l50K98n8j25R2K3q0P6K0j1K19
$$ -45 -204 177 188 273 212 111 214 -37 80 -121 118 33 192 -158 140 82 -43 49 72 -8 68 88 77 296
6317B96n57K79k45J00J95K0q2J5l0rQ2k10L87k39j28O7p4J77J7j69J67j89N0J02
$$ 296 -261 18 -227 -127 68 88 6 21 -9 -18 64 -146 241 2 -126 -59 -133 44 61 -108 59 -130 -80 22
6341B2o5J65q3P7R5m8q6ok0j12J62k57j97J37K75q0j9k31M41j49J02m00O02l42
$$ 22 -43 122 39 116 211 163 77 71 51 -61 101 -156 -353 -216 59 -21 -40 -271 170 21 123 -277 325 -17
6365a7J32J35k86r9o6K32J68m00L12j85J78m27L45k92O6J67K7j62jj6L09J4k42
$$ -17 115 250 -36 -135 -201 31 199 -201 111 -74 104 -323 22 -270 -204 -37 -10 -172 -173 -189 120 134 -108
6388a08J55j05P7nk9j57K77n9M1j88K29k5k14M4J50j6R4k75j3J44N7j45O1n8q
$$ -108 47 -58 19 14 -15 -172 105 46 87 -101 128 103 -111 -67 83 67 161 -114 -127 17 74 -71 -10 -68 -76
6413g6n2J00O7L8j36K63m34K90k12P7K44m3o5k91K54r0l02N51j51J32m44K17P0
$$ -76 -128 -28 39 77 -59 204 -230 60 -152 -75 169 126 61 -230 24 -66 -368 183 32 164 -280 -63 7
6436Gr9j1J57M2j22J41q5j4j90J90J8oO0j08QJ65j23j1q2L69m08j5L84r4k90M56
$$ 7 -92 -103 54 96 -26 115 30 16 -174 16 34 28 88 -20 -12 153 30 19 -63 306 -102 -117 267 173 -117 339
6462C39m46J01J69k85L3L67l92J59J32j86q4J39M4j75l1P8O7j99j61J05J91M8
$$ 339 -107 -6 163 -122 -89 278 -114 45 177 -9 -93 46 90 -85 -116 -38 29 -170 -331 -226 -35 13
6484A3J18j38O2q6N1l4M0K31m02Q6l5J1q1J07K31m87L92j47O7j17L46j03K6p4
$$ 13 131 -7 55 -31 20 -14 26 257 -145 -59 -94 -83 -164 -57 174 -313 79 -68 -1 -118 228 125 151 77
6508G7j84J10j74K21J8N9N8l23J90n8J3K6l41K70K0K28j32j76N9L75m90L10q5
$$ 77 -107 3 -171 50 68 127 185 -138 52 -6 7 33 -308 -38 -18 210 78 -98 -39 336 -154 156 71
6531G1n2q8j60J75N9k44p8J77O2J80j64K22k46R2J00j35J50N3k3J17M3m00l13
$$ 71 19 -69 -229 -54 5 -239 -317 -140 -78 102 -62 160 -86 6 106 -29 121 174 151 268 311 -89 -402
6554d02N14k41o3Q0k04N83l36J55k15L62j47k35J99k28L41r3j97L5j69M13l92
$$ -402 112 -129 -192 -112 -316 267 -69 86 -129 233 86 -149 50 -178 163 70 -127 -92 -261 152 -240
6575b40K75j3j92j23M50l38M45r3j79R7j95L45k91K66j21j9K8j91J45K1J18m50
$$ -240 35 22 -170 -293 157 -181 264 171 -8 89 -106 239 -52 214 93 74 102 -89 56 77 195 -255
6597b55L31k11J48k8l0K58k24r4J35j35L35j68l32M31j66J13P4l87L78l7j56J47
$$ -255 76 -135 13 -15 -45 213 -11 -105 30 -105 230 62 -270 161 -5 108 182 -205 173 136 -20 127
6619A27l3Q1k29l9J80o6O9LK1j8n0o2N6L7j35J9j6o1L05l95L41m8j80J29Nk6k51
$$ 127 94 175 -54 -93 87 21 90 93 114 96 46 -16 40 77 -58 -39 -55 -116 189 -206 135 87 -93 36 41 15 -236
6646b36L29L2l62L19J05k93K99l29R3L61j58k12j23K11J01l03Q6L14l01j05L39
$$ -236 93 125 -237 82 187 -106 193 -136 -43 318 160 -52 -175 36 137 -166 -80 234 -67 -172 167
6667A67j73j8O7p2m2r9J29q6MK74m2j42jn2J10k59K77q0J50m61O50k18k55J13
$$ 167 -6 -24 43 -29 -71 -170 -41 -127 -123 151 109 -33 -34 -86 24 -235 42 -38 112 -349 301 83 -172 -59
6691e9J00LJ71m92K27J87p2J58l35M40l20L4J10l11k5K49l11L14j22Q9P3j67K9
$$ -59 41 44 215 -277 -50 137 65 223 -112 328 8 42 152 -159 -184 65 -246 68 -54 35 108 -59 -30
6714c0M4m1j0Q0J83k77j9O8j62K42m0l7O8M6l38K28OMO0J9K90m76K48l66M05o5
$$ -30 14 -27 -37 43 226 -51 -70 -2 -164 78 38 1 69 115 -223 5 11 15 75 94 384 -92 156 -210 195 130
6740A30k76j03J79M61m69K20j82J12K8P5k1j07J48r2j64K27j36N0j59l8K7K02
$$ 130 -146 -249 -70 391 -78 142 -40 72 100 175 154 47 195 103 -61 166 30 80 -79 -117 -90 112
6762A12k04L96l04l0L02m01J2q6oL20n8P4k90M14l95Q6N3K4j85l2N9J05J7k4P4
$$ 112 -92 304 0 -30 272 -129 -117 -203 -209 111 53 127 -163 251 -144 -58 -5 19 -166 -198 -139 -34 -17 -41 33
6787C3J55n9j32j33N8J23mJ9j04K01k59J9J56o2q6Q7j02L8R6J06l16RQ9Q2j0j19
$$ 33 188 129 -3 -136 -78 45 41 60 -44 157 -102 -83 73 11 -75 12 -90 -52 44 150 -166 -157 -68 14 4 -115
6813a15m6L19R8l36k72N65j51l51L35j17J97j19m2M61l61n0j14J91k9o7R8j52
$$ -115 -161 158 256 -80 -352 213 62 -289 46 -71 126 7 -35 426 65 15 -99 92 63 -4 94 -58
6835e8j62N5L7J21L07l33K73k83R7j54n0K02o1QQ9j37m3K6M8J1j8j73J56k88N21
$$ -58 -220 -165 -128 -7 300 -33 240 -43 54 -100 -150 52 -9 -1 88 -49 -92 -66 -18 -7 -25 -198 -42 -330 191
6860A91j69o2K1rL2Q2j08J28k04k25M69l00j88K34J9J58m6k55N0P0K27K9j77K35
$$ 191 22 -40 -19 -28 4 86 -22 106 -98 -323 146 -154 -342 -108 -89 69 23 -232 -182 -112 115 144 -33 202
6884B02k24J18k48R1R9k29L21k3p7r0J12k61N0J01J57j2L8j72q3oJ03j42J59J6
$$ 202 -22 96 -152 -61 38 -191 130 107 30 -60 52 -209 -159 -58 99 87 125 -47 -130 -136 -33 -175 -16 0
6908@K75l06j59J36r2M8k2J33R5K0j74l4R5M0m4j00Q6p6M3l5j8l5K05l4m3n1k20
$$ 0 275 -31 -190 -54 -146 -98 -120 13 108 128 -46 -80 15 55 11 -89 -3 -79 -36 -71 -89 -124 81 47 4 -47 -267
6935b67N15j29k4n1L3j48OJ83J3k94k5K8Ok77M35Q0l01K79j78q1M69m53K83Rj04
$$ -267 248 119 95 44 77 -71 -65 118 131 -163 -188 -160 -154 -431 4 84 -217 62 -116 -197 272 -181 102 111 7
6960GJ32j86l26N28j30K2J22j75O8O6j66J37q6L06p4j83k17q0K82j03j78J62J24
$$ 7 139 -47 -373 155 25 47 169 -6 62 128 -38 99 13 319 245 62 -155 -235 47 -56 -234 -72 52
6983E2N2l35pL28o2RJ7j69p1K80j75J2J72j50J36J22k10j15K78m91L40J17l83
$$ 52 104 -231 -238 90 28 37 54 -115 -186 94 -81 -69 103 -47 89 211 1 -114 164 -327 13 130 -253
7006b53N91k74k76L66k65K78k25k36L79O7o7j61L02j52o1j72K66j12Lr3J93J20
$$ -253 338 64 -212 154 -111 167 -58 -294 85 152 85 -76 226 74 13 -159 107 -5 -2 -95 98 218
7028B18j83Jo8MJ0n1O5O1K6R0k17R9l8R3j07J90l32K02k09L07l77J53J91q1J38
$$ 218 35 36 -32 -28 -18 -69 -4 57 83 173 -44 55 17 110 3 193 -139 63 -146 161 -216 -63 128 47 185
7053A85l58K87p7K02j16k43K99k28J02K6L9Mk14J14r5R4l7p7K00q3j8J33j62Q8
$$ 185 -173 114 37 239 123 -120 179 -49 53 79 118 122 -92 22 -73 21 -16 -93 107 24 6 139 -23 65
7077F5J21j4j4k04l52M34J62j3j94J04K34j34j89J10J48l27N5mP7r2J51k91K4
$$ 65 186 172 158 -46 -398 36 198 185 -9 95 329 195 6 116 264 -63 -8 -12 65 -27 124 -167 -143
7100a43L13r0K78o3j03k10k95P01k62j37R1K41n06K42O0k92N3K10O6J6j08J42
$$ -143 170 80 358 295 192 -18 -313 388 126 -11 80 321 -185 57 117 -175 -122 88 154 170 62 204
7122B04k67J27m4j58K45k41LJ41Q7j48J02Q1O1j84o9J91k34K89j47K18n8j07J2
$$ 204 -63 64 20 -138 107 -134 -131 10 97 -51 51 132 193 9 -60 131 -103 186 39 257 199 92 104
7145A04j25J89k61K40j9k97J84o3Jj03M7K7J92J13j20k77J56O5J17k4k12J3J13
$$ 104 -21 168 -93 147 128 -169 15 -48 -47 -150 -103 -76 116 229 109 -168 -12 53 170 146 -66 -53 60
7168F0J82m71K74j18Lk63L38J38J3M8j85k11L88k29j46J55j7p5L3L69l16J33k50
$$ 60 242 -229 45 -73 -70 -333 5 143 156 204 19 -192 196 -33 -179 -24 -41 -116 -83 286 -30 103 -147
7191a47n8J51J48O2l25J64J57j03j76O4J17j13r8K02j30j6J61k34K58p0q5M3j
$$ -147 -205 -54 94 156 -169 -5 152 49 -127 -63 54 -59 -157 45 -85 -101 60 -174 84 14 -71 -28 -29
7214b9K42J66l42j51kj1MJ12Q5j56J9J03N4n2j75L47j72P8j40K33k60j0Q6Rj6
$$ -29 213 379 37 -114 -116 -127 -123 -11 74 -82 -63 40 94 42 -133 214 42 120 -20 213 -47 -57 29 38 22
7239B2O4j37J17L5J10k93l2M1J19o5J8j37j4Q5J77P1q2p2r6J43o7j51L92k01j01
$$ 22 86 -51 66 101 211 -82 -114 -73 46 -19 -1 -138 -152 -67 110 181 99 27 -69 74 7 -144 248 47 -54
7264e4K00j88j86J81K20k37K26k15j50K07K65k90k4l4P1j54J3K01q0N1k14K52
$$ -54 146 -42 -228 -47 173 -64 162 -53 -203 4 269 -21 -45 -79 -8 -162 -149 52 -28 23 -191 61
7286F1n1J24m19J37R3P1mm40M07J01L83m41k17M06j01On0J3k32J38k1J5p5m2K93
$$ 61 10 134 -285 -148 -55 16 12 -428 -21 80 463 22 -195 211 110 116 66 79 -153 -15 -36 -21 -96 -138 155
7311A55j72O4j20J0O5L5j78rK86j22k00K91j51R7k33J58k5Q0j35j15L02Pq6r0
$$ 155 -17 47 -73 -63 2 37 -141 -150 136 14 -186 105 -46 51 -182 -24 -49 31 -104 -219 83 90 4 -86
7335h6L59k04j47p4K6R6m3K06k36J13k1n0P0j27J64N6j01j87R2K88k6k06j98K97
$$ -86 273 69 -78 -152 -126 -30 -73 133 -103 10 -11 -61 9 -118 46 102 1 -186 -94 194 168 -38 -236 61
7359F1j09J03j70P4P4M3j25J63J74k29m66K94J46k33M2K42j00J98j81j04J82K9
$$ 61 -48 55 -115 -41 33 76 -49 114 288 59 -407 -113 33 -200 -158 84 -16 182 1 -103 79 108
7381A08N2j1r7j23J14j06N5p3o6M3J12o6l9p1J61Oj78J10K0J39J30k50LM3p8O
$$ 108 160 149 52 -71 43 -63 -8 -81 -147 -104 8 -58 -97 -168 -7 -1 -179 -69 -49 90 220 -30 -27 16 -62 -56
7407e6M8oO5j33O5J28l94K76J71j88J26k01K39O3k09J07k57J41k1n6n5M11l82
$$ -56 -8 -14 51 -82 -17 111 -283 -7 164 -24 102 -99 140 203 -6 101 -156 -15 -36 -92 -147 264 -118
7430a18J13k59L48j01n9K5P6J75k12p9r5L24k15K28k04o9J76j81J36l6J02K6j58
$$ -118 -5 -264 84 -17 -76 -51 25 200 -12 -91 -186 138 -77 151 -53 -122 54 -127 9 -27 75 101 -57
7453e7P0J7l32J76K49k27M4r0M0K93j64M7j04LJ8J90j89RJ1LQ0n3j37Q8J38m6
$$ -57 13 30 -302 -126 123 -104 -60 -150 -110 183 19 66 -38 -35 -17 173 -16 -7 4 7 87 34 -103 -15 123 77
7479G7l29R3K46O6k6M2p0j86MK33j83Q6j93J64p8P5p5P6J2j43L98l7l91K92k00
$$ 77 -252 -159 87 153 127 169 99 -87 -83 150 -33 53 -140 24 -54 21 -54 22 34 -109 289 252 -139 153 -47
7504d7L12l38J12r3M7K28l09l5L12l96Q4K22J01j71j19P2K87j76m5m4L97n31J00
$$ -47 265 -73 39 -54 -7 221 -88 -123 189 -207 -123 99 200 29 -90 -18 269 93 48 4 401 -130 -30
7527c0K05k22K39l94K30k7L8m7J63k51J84M7q0j37J20j6p3J09j83J82J28J10m49
$$ -30 175 -47 192 -202 28 1 39 -8 155 -96 88 135 55 -82 38 22 -51 58 -125 57 185 295 -154
7550a54J33L5m76L80N8J88j88K8r6Q4m8QR0K6m7n9l8J89J3j10N8ROQ9k93N5k03
$$ -154 -21 14 -462 -82 -24 164 -24 4 -92 -8 -56 -48 42 68 21 -38 -76 113 126 16 74 83 89 178 -115 -60 -263
7577b63M98l01J60l7j41P1l6j0P8L2k6K08k43P6k83R5J39O8p8q6K8J46K96o20
$$ -263 235 -66 94 57 -84 -13 -49 -59 19 51 25 233 -10 66 -217 -122 17 85 7 -79 -51 95 391 -229
7601b29L89j76Q7Q3l20L90l39J33%p5p7O6J65j04O0l42L62l22M22j2n14K02K33
$$ -229 160 -16 71 154 -166 224 -115 18 18 -57 -134 -68 97 -7 53 -289 73 -249 173 161 -353 -151 82
7624H2j18l20M83lj68L4j10J87k05Q7q7K69k08J45%j44K8p7J90j42J47l95M61
$$ 82 -36 -356 127 124 -44 -10 -120 67 -138 -51 -138 131 -77 68 68 -76 -48 -125 65 -77 70 -325 136
7647A36p2j94L51k28J00k16O3k4L7J38P6j16p9J41j23j98M4L0J78n8pR1j58r4
$$ 136 64 -130 221 -7 93 -123 -60 -84 -47 91 167 51 -28 113 -10 -208 -164 -134 44 -14 -21 70 -88 -182
7671a82L60J60l47J0P3k0j81K53o2L5k42L8J22L9l21J64n4J19l0R8O1k53K96l7
$$ -182 178 338 -9 1 74 54 -127 126 64 99 -143 -105 17 56 -265 -101 -155 -36 -66 32 93 -160 136 99
7695I9l4J45k25oJ16k16L02p2j56r8j92L37Q3j15j71K93Q5o6j72J19M7j3K44l13
$$ 99 65 210 -15 -21 95 -121 181 109 -47 -145 -337 0 83 -32 -203 90 175 109 -63 56 103 90 334 21
7719B1k06K70J75l36J18N4L2Ql13K75k43J36L2j35L02M5m00P4L51j80j68p2J50
$$ 21 -185 85 260 -76 42 96 128 136 -177 98 -145 -9 23 -112 190 235 -165 -91 260 80 -88 -160 -10
7742a0p1Q5N8k38J90O9M4r0j76K30O0l12k5L15k18J08K27l23J00J1j36J23J87
$$ -10 -81 4 62 -176 14 83 127 37 -139 91 151 -161 -186 129 -89 19 246 -77 23 34 -102 21 208
7765B08k36M3k4K07k21K33l07J76J35P7k31k47K14n6L35j44k15R4l25L17j13R9
$$ 208 -28 15 -9 198 -23 210 -97 79 214 291 60 -187 27 -29 306 162 -53 41 -284 33 -80 19
7787A9k0PK12k16j3J4K1q6J14j13J52k13J51J49j74J6K03q2J4m02K25R8o2J06
$$ 19 -1 6 218 2 -11 3 24 -62 52 -61 91 -122 29 178 4 20 223 141 155 -247 -22 76 14 120
7811A20N2K3l37kL98n47L29k46m5K96J1R6j70J04j19N1k02K24n6K47k31J00k68
$$ 120 172 195 -142 -144 254 -293 36 -210 -255 41 52 148 -22 82 -37 14 -188 36 -20 227 -4 96 -172
7834a72J01j22J79K19R9l29kJ6r2j4Q5r3J19j16j36J24K45j66j0j30K85j85J45
$$ -172 -71 -193 -14 205 304 -25 -27 -11 -103 -117 -32 -125 -6 -122 -258 -134 111 -55 -65 -195 90 -95 50
7857E0j45K48k51K28k90J14J59L7R0j61j50J64J02j63lj53J59L05q6k63J19kl1
$$ 50 -95 153 -98 130 -160 -46 113 150 240 79 -71 93 195 32 29 -124 35 340 254 -9 110 108 77
7880G7j88l26M15K80o50K79J53k07J33J0o3K9N8J69n80O0M86j15j87r4L81q7j54
$$ 77 -111 -437 -22 258 -392 -113 40 -167 -34 -24 -87 -58 0 169 -411 -351 135 20 -167 -261 120 33 -121
7903a21J57P4j64L0q6Q4j54M69n31M05R4k73J09l27K34j07O7J59k24L8j06r9K34
$$ -121 36 110 -54 -24 -110 -26 -180 289 -242 163 257 -16 93 -234 0 -107 -40 119 -105 -67 -173 -272 -38
7926c8L7k0m1L14k09M3P4j41j13K47j02K99l98R2j25k30K94n4j8J09n9j13J67
$$ -38 -1 -21 -62 252 43 86 160 19 -94 153 51 350 -48 44 -81 -311 -17 -71 -89 20 -39 -152 15
7949A5m4l5P1Q1l18K92j21Q0j41L6L2m5K28j49p0K6j5R9k6j24J49o2j39M23k53
$$ 15 -29 -64 7 88 -230 62 -59 21 -120 -84 -52 -97 131 -18 -88 -62 -77 22 -4 -128 21 -41 -180 243 -10
7974a0r2J31j81P8J72q0p6K54j80n9j86J92J68j91J3J11j87J63J32l11R1rj52
$$ -10 -102 29 -152 -74 98 18 -58 196 16 -43 -229 -37 131 -60 -47 64 -123 40 172 -139 -48 -57 -209
7997b09K37r7J63l87J12P6J15L68l72O5M4jj74P7j10K86k35j37M0J01K09k98J89
$$ -209 28 -69 94 -293 -181 -105 10 378 6 71 115 114 -60 17 -93 193 -42 -179 -139 -38 171 -127 62
8020F2r4J63k02k6l7Q8K17j78j03J84j02K70p8k55K13k24J41m5J09k14NL35j71
$$ 62 -32 131 -71 -97 -134 -46 171 -7 -110 74 -28 242 164 -91 122 -102 39 -6 103 -111 -106 229 58
8043E8m3M0j23N5J4j6n5K69k65L61l41M6K3J82k37q0J56j65L87l42K50k73J83
$$ 58 15 55 -68 -13 1 -15 -70 199 -66 295 -46 0 23 205 -32 -112 44 -121 266 -76 174 -99 84
8066H4p6j57L47l51L2K50j80n6J26j96K57k47P8M32j07l15N4r8J69j34J80j00
$$ 84 8 -149 198 -153 -121 129 -51 -107 19 -177 80 -167 -89 343 236 -79 -25 -123 46 -88 92 -8
8088hPJ50k26K93j84Pn9j4m7K2r3O64n53k08L20P9P9k13J5N9m0P4k14r4M25j82
$$ -8 -1 149 -77 216 32 39 -20 -34 -81 -59 -152 512 -41 -249 71 150 229 16 31 90 50 124 -90 -184 241 59
8114E9K6J24M9n87M18j67J88j72R3J16J19k08r1J15k85L57k84J42J6N3Rj96K99
$$ 59 85 209 258 -329 89 -78 110 -62 31 147 266 58 -33 82 -203 154 -130 12 28 81 90 -106 193
8137A93k42K4k05L17j38j20K33j63L10j53J4j46j14Qk3L21j59j69M19j34k48J95
$$ 193 -49 -25 -230 87 -51 -171 62 -101 209 56 70 -76 -190 -182 -205 116 -43 -212 207 73 -175 20
8159B0o7k88N76k17q2j0K37j61J31m1m7J35j43k9j75K02j9J2m3n5L08l77K24k82
$$ 20 -47 -335 241 24 -58 -68 169 8 139 98 51 186 43 14 -161 41 22 34 -9 -64 244 -133 91 -191
8183a91R8j16K64l9J94L1l15k8
$$ -191 -93 -209 55 16 210 241 -74 -102
8191a02
$$ Imaginary data points
##PAGE= N=2
##DATA TABLE= (X++(I..I)), XYDATA
0@%%%%%%%%%%%%%%%%%%%jRj6J6j6J6j6K0k8L2l2L7m5N0n6O3p0Q0r1J00j12J27
$$ 0 0 0 0 0 0 0 0 0 0 0 0 0 0 0 0 0 0 0 0 -1 8 -8 8 -8 8 -8 12 -16 16 -16 21 -24 26 -30 33 -37 43 -48 52 -60 67
41F7j38J51j69J86k05K29k52K77l07L38l71M09m52M98n52O14o84P65q63R83j130
$$ 67 -71 80 -89 97 -108 121 -131 146 -161 177 -194 215 -237 261 -291 323 -361 404 -459 524 -606
62f06J316j558J896k402L220m783Q821l7396j07513L3407R1792O6842L413l3212
$$ -606 710 -848 1048 -1354 1866 -2917 5904 -31492 -139005 -105598 -13806 53036 56449 23237
76B3237l2709N445L2409J2046m4873n8256n917O6137P2092k85o1574m7636o486
$$ 23237 -9472 -4027 28382 40428 -4445 -62701 -68618 -2481 69611 69326 7752 -39884 -46370
89d6370K3682L4652J8819j8034l0998M656L4111L350l6867l0529J0056M0555L0524
$$ -46370 -22688 11964 30783 12749 -18249 -13593 20518 23868 -12999 -43528 -33472 7083 37607
102C7607k109k3578k9463j5904J3667K8892P077k0128o555K7956J9571j7161l0843
$$ 37607 35498 11920 -17543 -33447 -19780 9112 16189 -3939 -10494 17462 37033 19872 -10971
115a0971j9613J676J8906K4226J1665j2297k1507k923J6567Q180j8687k1128P779
$$ -10971 -30584 -28908 -10002 14224 25889 13592 -7915 -10838 5729 13909 -4778 -25906 -18127
128a8127K0686R386M71o229j2677p568Q638J6159q05j6181o783J0701J3553j043
$$ -18127 2559 11945 12416 6187 -6490 -14058 -5420 10739 9934 -6247 -13030 -2329 11224 10181
142A0181j1711j901N628J061J276J574o582j0245J952J4322M538j1659o961O357
$$ 10181 -1530 -3431 2197 3258 4534 6108 -474 -10719 -8767 5555 10093 -1566 -8527 -2170
156b170R251P91r439p026J055K049N006N359k413r501j797J5378J0694j1142j4460
$$ -2170 7081 7872 -1567 -8593 -7538 -5489 -483 4876 2463 -7038 -8835 6543 17237 6095 -8365
171h365j875O065O221K110m55k302k947M357Q979p57j4950j4058O307J7219L247
$$ -8365 -10240 -4175 2046 4156 3701 1399 -1548 2809 11788 11031 -3919 -17977 -11670 5549 8796
186H796o724k493j75j159N18L475k086j0378n45J3435R211n960j3261k790R329
$$ 8796 2072 -421 -596 -1755 -1237 2238 152 -10226 -10771 2664 11875 5915 -7346 -10136 -807
201h07M912j039O96j077m516j85P541K877j2173r013R866J2553J018q221n304
$$ -807 4105 3066 3762 2685 -1831 -2016 5525 8402 -3771 -12784 -2918 9635 10653 2432 -2872
216b872M89j147K00N977L06p704l546R182R079p052j1340J192P338J341p57R74
$$ -2872 -2383 -3530 -3330 2647 2953 -4751 -8297 885 9964 2912 -8428 -7236 102 1443 686 1660
232A660Q85n130k214P408M446p500n879O614Q900l610q766J270L780k476j396
$$ 1660 2545 -2585 -4799 2609 7055 -445 -6324 290 9190 5580 -3186 -1916 1864 -612 -2008
247b008L621J467n410k678Q172L457q198p864L796R046l12n888J295K618k883
$$ -2008 1613 3080 -2330 -5008 3164 6621 -1577 -9441 -5645 3401 3089 -2799 -1504 1114 -1769
262a769j36N433M70r038m920J0823R240m228p069q6L560r14k508K212R6m926J97
$$ -1769 -1905 3528 3998 -5040 -9960 863 10103 5875 -1194 -1280 2280 1366 -1142 1070 1166 -3760 -3563
279c563Q809M963q517r938L281O999k397l071K817J923k424q12M745k91q373k335
$$ -3563 5246 10209 1692 -8246 -4965 2034 -363 -3434 -617 1306 -1118 -1930 2815 2524 -5849 -8184
295h184Q519P021k944p031O59M018k214j557L366J203l316n60P651K400j0493
$$ -8184 335 7356 4412 -2619 -1960 2058 -156 -1713 1653 2856 -460 -1020 6631 9031 -1462
310a462p700L533O088J696j202K263J235m928k635K431p47n893k073Q472R055
$$ -1462 -9162 -5629 459 2155 953 3216 4451 -477 -3112 -681 -1428 -7321 -9394 -922 8133
325H133k163n290k40l21m257j521M969M628k719r88M359J091n826m582L273M355
$$ 8133 5970 680 440 119 -4138 -5659 -690 3938 1219 231 4590 5681 -145 -4727 -1454 2901
341B901k230j842L787J357m329l693J570L121j719n09M827Q27n322n295J979M752
$$ 2901 671 -1171 2616 3973 -356 -4049 -2479 642 -1077 -1586 3241 4068 -1254 -6549 -4570 182
357A82j299j456M500L162k916l024O27l25l259p82O761M552k698l454p7K411l178
$$ 182 -1117 -2573 1927 5089 2173 -851 -224 -549 -3808 -4590 2171 6723 4025 571 494 2905 -273
374b73m512K047L397j9k74L037R54n570m512L399L690l462k718J875N282P06j819
$$ -273 -4785 -2738 659 640 366 3403 4357 -1213 -5725 -2326 1364 -2098 -4816 -2941 2341 3047 1228
391A228k63r96l688m54M844M493l126n387L098N322j160m756r85J025n47Q70M903
$$ 1228 965 -31 -3719 -4173 671 5164 2038 -3349 -251 5071 3911 -845 -1830 -805 -1352 -482 4421
408D421J493o716m727K795N012j03n120r0L888l16j428O78P00l555k380N602N657
$$ 4421 5914 -802 -5529 -2734 2278 2175 -2945 -3035 853 537 -891 -213 487 -3068 -5448 154 5811
425E811l367m929Q26L823p32m014J358L170n76m76K560J034m734n519L397N351
$$ 5811 2444 -2485 -1659 2164 1432 -2582 -1224 1946 1370 894 3454 4488 -246 -5765 -2368 2983
441B983j654l432J491L913p71m458K03R70l228j570N702N172l057n747J676M831
$$ 2983 1329 -2103 -612 3301 2530 -1928 -1725 -755 -3983 -5553 149 5321 2264 -3483 -1807 3024
457C024k593l866J768L225n01j604K816K121m698l653L862M594k092m719J715
$$ 3024 431 -3435 -1667 1558 1057 -547 2269 4390 -308 -3961 -99 4495 2403 -2316 -601
472f01L905k928l774K168K462j640j552L684J875n925m454M466M727j607l603
$$ -601 3304 376 -3398 -1230 1232 -408 -1960 1724 3599 -2326 -6780 -2314 2413 806 -2797
487b797J599M390j207k641J027j83m005o61O319N426m175n840K321L596j536k607
$$ -2797 -1198 3192 1985 -656 371 188 -3817 -4478 1841 7267 3092 -2748 -427 3169 1633 -974
503i74J72P63k387j32N886K033n834m408K842M599j645m131O32K278p81L2K901
$$ -974 -802 -39 -2426 -2558 3328 5361 -473 -4881 -2039 2560 915 -3216 -2584 -306 -1087 -1055 1846
520A846J348m570k591N193L288m121l810J662L853q4j648J664p1k757j71L489
$$ 1846 3194 -1376 -3967 1226 4514 393 -3417 -1755 2098 2014 366 2030 1959 -798 -969 2520
536B520J049m701m186L638M738p53l207n68R56q89OK779J93m800j786M148M584
$$ 2520 3569 -1132 -5318 -1680 3058 2305 -902 -1470 -514 -1403 -1397 1382 1575 -3225 -5011 -863 3721
553C721j173m089J98K262k09l86J204p38k821j090M522L939k319l902j40J934
$$ 3721 2548 -1541 -1343 919 710 324 1528 790 -2031 -3121 1401 5340 3021 -881 -1021 913
569I13n08j724O26R40j931m56L512J972l011m110P70L461P5j417J92J125o40j393
$$ 913 405 -1319 -693 247 -1684 -2140 1372 3344 333 -3777 -3007 454 529 -888 -696 429 -211 -1604
587a604J950K237k521k605K503L490m68m161o52K188N26o09K156R43l295l226
$$ -1604 346 2583 62 -2543 -40 3450 2982 -1179 -1831 357 883 274 2430 3373 78 -3148
603c148J668L694j946l885N42M234J592r09j175n98l640k216M533M814j240m771
$$ -3148 -1480 2214 268 -3617 -3075 1159 2751 1842 667 69 -3571 -5787 -1254 3560 2320 -2451
619b451J88N216N04k908j226m73j077Q65M691K983m350o615J371N666J544l652
$$ -2451 -2263 2953 3457 549 -677 -1150 -2227 -1362 3329 6312 1962 -4653 -3282 2384 3928 276
635B76k455J295R6k04L026O83m945l650M051O669j140o470j349K865J769J46P89
$$ 276 -2179 -884 -788 -992 2034 2717 -2228 -5878 -1827 4842 3702 -2768 -4117 -1252 517 663 1452
652A452J31l837j436N654M508m358o639L00O531K498l188j560j176j453R26M943
$$ 1452 1583 -2254 -3690 1964 6472 2114 -4525 -4225 2306 4804 1616 56 -1120 -2573 -1647 3296
668C296J693o085n587L667P218K93n316l405J367J336J520L281p52o103k000N841
$$ 3296 4989 -1096 -6683 -3016 4202 4495 -821 -4226 -2859 -1523 -3 3278 2526 -3577 -5577 264
684B64O124l215p452p32M721K849Q71j12k349l885k55N771L086n511n796K132
$$ 264 6388 3173 -4279 -5011 -290 2559 3430 3318 969 -2916 -3171 2600 5686 175 -5621 -3489
700c489O304J439l464j992n97o91J736L604m57n264l220M551O090j882m831r63
$$ -3489 2815 4254 790 -1202 -1799 -2490 -754 2850 2393 -2871 -6091 -1540 4550 2668 -2163 -3126
716c126K759J859N77L36j897m216N55N922K999l749n179Q27M671R48k504j966
$$ -3126 -367 1492 2069 2405 508 -3708 -3153 2769 5768 2019 -3160 -2333 2338 3286 782 -1184
732a184j063o69J736M283J230m748m327K411M188k11l915j202K464J726R73J293
$$ -1184 -2247 -2916 -1180 3103 4333 -415 -4742 -2331 1857 1646 -2269 -3471 -1007 719 1692 2985
748B985j304l696j646L175L592j513l157J85L232R84j901j248O33j380K71J969
$$ 2985 1681 -2015 -3661 -486 3106 1593 -1564 -1379 1853 2837 936 -312 321 -1059 -788 1181
764A181O15k281k932K201L881o90l242m81J403N13q68j72J36r63l10L245K698
$$ 1181 1796 -485 -3417 -1216 2665 1975 -1267 -1748 -345 168 -700 -872 -736 -1699 -2009 1236 3934
781C934k135l951K2L178O52k087n03J391J14j59J463Q89k819k878J504L196r55
$$ 3934 1799 -2152 -2130 1048 1700 -387 -890 501 615 456 1919 2808 -11 -2889 -1385 1811 856
798H56k994M92K510N75j791k64O69q36j263J301K271j594k972K120L685p30k760
$$ 856 -2138 -1646 864 1439 -352 -616 53 -783 -2046 -745 1526 -68 -3040 -920 2765 2035 -725
815g25o40K148O03j451N46N27k109l63J994L053j541m431N50L226J17j893o97
$$ -725 -1365 783 1386 -65 481 1008 -1101 -1464 530 3583 2042 -2389 -1839 1387 1504 -389 -1086
832a086R99n41r78K403J513l224k959J819L760M08l756k52K205P31j176O85P19
$$ -1086 -87 -628 -1606 797 2310 -914 -3873 -2054 1706 2114 -1642 -1894 311 1042 -134 551 1270
849A270j267j856K308K848k187l908J121L649P52k660n30R44r73o24J282J034
$$ 1270 3 -1853 455 3303 1116 -2792 -1671 1978 2730 70 -460 484 -489 -1113 169 1203
865A203k366k613K914M322r20m300j250J999J023l23Q43N36k260r23L291L089
$$ 1203 -1163 -3776 -862 3460 2540 -1760 -3010 -1011 12 -311 532 1068 -1192 -2115 1176 4265
881D265k210m746j07M136J351j807q84q5j019q1K668K007k711m011J349L537j7
$$ 4265 2055 -2691 -2798 1338 2689 882 -2 -87 -1106 -1187 1481 3488 777 -3234 -1885 1652 1635
898A635k846r19J259Q08j97J785K13k771k304K005L628j106l051Q01K743L67j685
$$ 1635 -1211 -2130 -871 -63 -260 1525 1738 -1033 -3337 -1332 2296 1190 -1861 -1060 1683 2050 365
915C65r4R0j556p13K995K483k249l104M25K859m37k318L15J192m70n08J889O17
$$ 365 271 361 -1195 -1908 1087 3570 1321 -1783 -1358 1501 1064 -1254 -939 253 -217 -725 1164 1781
933A781k436l000J907L043m59j236m41J165j16j196J266J384j491j596J188K229
$$ 1781 -655 -3655 -1748 1295 836 -400 -841 324 208 -988 278 1662 171 -1425 -237 1992
949A992m04k584P75J284j031l72Q70J473j525k317Q24J752n70j413K50J364j88
$$ 1992 1588 -996 -221 1063 32 -340 530 2003 478 -1839 -1015 737 167 -1246 -996 368 180
966A80j043R27J160j750j916R69K313K55j273L26Q79n96o99M54R69j148j341J346
$$ 180 -863 64 1224 -526 -2442 -1473 840 1095 -178 148 1027 431 -268 186 1155 7 -1334 12
984A2K407p49j967j85Q96J54j438M19J005o51j093J052J415j016k179L4K485K92
$$ 12 2419 1670 -297 -482 414 568 -870 -451 554 -97 -1190 -138 1277 261 -1918 -1884 601 893
1002H93j373k2N01j9o52P79J492j208j776P46K263k5j988p64J835J55o68M01O12
$$ 893 -480 -502 -1 -20 -672 107 1599 391 -1385 -639 1624 1599 -389 -1153 682 837 169 570 1182
1021A182q02k096N52K493o81k398L85K194K02j924l1J253m66j577Q47J667m00
$$ 1182 380 -1716 -1164 1329 648 -1750 -1365 829 1031 -893 -924 329 -137 -1714 -867 800 400
1038D00j406O98J997k53k687L85K114rj806j30J740j65j277J082J247j570k369
$$ 400 -1006 -308 1689 1436 -1251 -866 1248 1239 -567 -697 1043 878 -399 683 1930 360 -2009
1055b009M71L008m04k362L3J339N83q37k85R92j234k145K054L040j014k738j73
$$ -2009 -1538 1470 1066 -1296 -1263 76 659 -178 -463 529 -705 -2850 -796 2244 1230 -1508 -1681
1072a681K937L8j852M56Q61o46l38Q71J598j709l015J290L241j41k515m86J433
$$ -1681 1256 1294 -558 -102 759 113 -225 646 2244 535 -2480 -1190 2051 1910 -605 -1091 342
1089C42m20p83R50Q91j628j621J851K724j278l586J87K517R03p88K71K67j249
$$ 342 -78 -861 89 980 -648 -2269 -418 2306 1028 -2558 -2371 146 1049 261 532 799 -450
1106d50q14K109J478k359k196J223L180M65k403r87P24n42k1J595M42j828j926
$$ -450 -1264 845 2323 -36 -2232 -1009 2171 2636 233 -754 -30 -572 -593 1002 1444 -384 -2310
1123b310J800K457j087k584k51J693O84n23M18K77j503n90J656J328r01k297J140
$$ -2310 -510 1947 860 -1724 -1975 -282 402 -121 297 574 -929 -1519 137 1465 564 -1733 -593
1140e93K230P8j728p01O42L8m8J231P61k104j245J498J362o65k625N4K004O93
$$ -593 1637 1715 -13 -714 -72 -34 -82 1149 1910 -194 -1439 59 1421 756 -1869 -1815 189 882
1158H82o67j90j43r89m78J745J615j577k240N65K288N39j233p72R68l17J23Q73
$$ 882 215 25 -118 -1107 -1585 160 1775 198 -2042 -1477 811 1350 117 -655 313 -4 119 992
1176I92M23j396k028J235K662N4k091q83O02O45n82j23J087j176p72J539J463
$$ 992 1415 19 -2009 -774 1888 1942 -149 -1032 -430 215 -367 -490 597 -579 -1351 188 1651
1193A651j287k272k38K372Q69j094l93M67n42m14J267R79o15j963P04K321k84
$$ 1651 364 -1908 -2146 226 1095 1 -392 75 -467 -881 386 1365 750 -1213 -509 1812 1528
1210A528k001j135J246J010k03N70N97j686j769M74J849J35k074r1J986P67p71
$$ 1528 -473 -1608 -362 648 445 1015 1612 -74 -1843 -1369 480 615 -1459 -1550 436 1203 432
1227D32p49K62q94j280J414K728l69k152m86J987N79j839k18J218l98q67J396
$$ 432 -317 -55 -949 -2229 -815 1913 1544 -608 -1094 893 1472 -367 -585 633 235 -632 764
1244G64J042j307k175K17K403K27j355j71N72k85j265N99J738j052j241Q03K249
$$ 764 1806 499 -1676 -1459 944 1171 -184 -355 217 -68 -1333 -734 1004 -48 -1289 -486 1763
1261A763l65k670p78J720K44l47J045Q85q81j846J194J854p27k384k31K098R14
$$ 1763 1398 -1272 -2050 -330 -86 -433 612 1497 616 -1230 -36 1818 1091 -1293 -1524 574 1488
1278A488j003l35O8o63j193J881J612j338k359j82K383K54o04l73L69o12o1J047
$$ 1488 485 150 218 -445 -1638 243 1855 517 -1842 -2024 359 613 9 -364 5 -607 -668 379
1296C79J293j733k289J042K638J016j779r57K04J74k38J184J60j140j498J237
$$ 379 1672 -61 -2350 -1308 1330 2346 567 -390 -186 -12 -250 934 1094 -46 -1544 -307
1312c07K511q78k608o68J457Q05j76L7n8r96j097J741J480j084j612L83K120N00
$$ -307 2204 1326 -1282 -1950 -493 312 136 173 115 -881 -1978 -237 1243 159 -1453 -1070 1050 1550
1330A550j514o89L23k1J46J176J157j510j864P88J617k13j372o35J109O31j52
$$ 1550 36 -653 -330 -351 -205 971 2128 618 -1246 -458 1159 946 -426 -1061 48 679 527
1347E27q0O3j397q67J280J772l61k014m2J301L19q84L8K66J72l05O06J115j337
$$ 527 447 510 -887 -1754 -474 1298 937 -1077 -1119 182 501 -383 -345 -79 93 -212 394 1509 172
1366A72j323K92J420O90j343K91N27j01q31j90M33L9q68R65Q32q39j187L08J349
$$ 172 -1151 -859 561 1251 -92 199 726 625 -206 -396 37 76 -792 173 1005 166 -1021 -713 636
1385F36R1j484k62J260L7l98J05K25l09o18Q67J294n42j754k04J179Q07p66j39
$$ 636 727 -757 -1019 241 278 -120 -15 210 -99 -717 150 1444 902 -852 -1056 123 930 164 25
1404B5L65j82j17n0P15n56j555K63K029J93j672n75J032O04r12M4N30q02n98R29
$$ 25 390 208 91 41 756 200 -1355 -1092 937 1130 -542 -1117 -85 519 -393 -349 181 -621 -1219 -290
1424b90J416l76j743j73J611R17j049o79J24M9o6Q87Q71r38j825L36K160J42j706
$$ -290 1126 750 -993 -1166 445 1362 313 -366 -242 -193 -259 628 1499 561 -1264 -928 1232 1374 -332
1443c32j396P70J402l74L38J17q81r79P20J875l65k014l96J602J015m92j111M16
$$ -332 -1728 -958 444 70 408 525 -356 -1335 -615 1260 895 -1119 -1515 87 1102 610 -501 -85
1461h5j92k94J282R17p49j950L24K096O6k021n29J331P52p39k18K05p44j270J237
$$ -85 -277 -571 711 1628 879 -1071 -747 1349 1415 -606 -1135 196 948 209 -9 196 -548 -1818 -581
1480e81J709j33j891r57J992R64j196o20P3M5P6J201J067j116k304M22K454J69
$$ -581 1128 995 -896 -1853 139 1103 -93 -713 -640 -595 -519 682 1749 633 -1671 -1249 1205 1374
1498A374j412q07Q26M83k87L49J09r60r47P29K108j98k450m60J251Q98n41j61
$$ 1374 -38 -845 -19 464 177 526 635 -325 -1272 -543 1565 1367 -1083 -1543 -292 606 65 -96
1516i6q9m60k59J289J144j020j924K61J993M90j354m44L25K77L45M02N34j253
$$ -96 -185 -645 -904 385 1529 509 -1415 -1154 839 1329 -25 -469 -144 133 478 880 1414 161
1534A61j773J034J714l16j330o64J017R55o61j32k20o99n28J010J906n71k049
$$ 161 -1612 -578 1136 820 -510 -1174 -157 798 137 5 -215 -914 -1442 -432 1474 903 -1146
1551a146KJ214P13o14o52O8K16j99R59R85j147j241J64J247M95q84n22N75J09
$$ -1146 -1144 70 783 169 -483 -415 -199 -398 561 1546 399 -842 -678 569 1064 180 -342 233 342
1570C42n63K05L33k74o88J48J270m54j086l17Q50L67n71l2P35K44q07L16L74n90
$$ 342 -221 -16 317 43 -645 -497 773 319 -767 -1084 -234 133 -438 -470 265 509 -298 18 392 -198
1590a98m15K12R82N67j099R5J94r5m91j26O50P6o03J08Q11k57j148m09J112J78
$$ -198 -613 -401 581 1148 49 144 338 243 -248 -374 276 352 -251 -143 668 411 -737 -1146 -34 144
1610A44n84m52R69J08k64n71O09K27n12J30R52o3j138j24R21M42j033j28P37L38
$$ 144 -440 -892 77 185 -79 -650 -41 186 -326 -196 756 693 -445 -569 352 794 -239 -367 370 708
1630G08p31j46O21J50j822O64J247O9j191m32N87Q40o38l94P16j62p15Q2J275
$$ 708 -23 -169 452 602 -1220 -556 691 760 -431 -863 -276 564 -74 -468 248 86 -629 -547 728
1649G28k3j143m88J143M28m62l91O15K32j200L58J110m3j207l14J115K75j011
$$ 728 705 -438 -926 217 645 183 -208 407 639 -561 -203 907 864 -343 -657 458 733 -278
1667b78k36J100k64r14K00O99L5r77j46J139J80r01QO88K44r97o4R46J51j213
$$ -278 -514 586 322 -592 -392 307 342 -635 -781 358 538 -363 -355 333 577 -420 -484 462 613 -600
1687f00K87J017P9j136k97J307j15q28K20R07o1j461J55R15j40q59j19J243k28
$$ -600 -313 704 783 -353 -650 657 542 -286 -66 841 780 -681 -526 389 249 -610 -729 514 286
1706B86k30m85P19n78r91N94J215M19j396Q6P43j04n26J22N14k86l86P7J337m4
$$ 286 56 -429 290 -288 -1279 -685 530 949 -447 -361 382 278 -248 -126 388 102 -284 -207 1130 1086
1726A086j635J13N34M63k62l76M52m47n88L50N88n00n86k02J489k6n61m26L02
$$ 1086 -549 -436 98 561 299 -77 375 -72 -660 -310 278 -222 -808 -1010 479 453 -108 -534 -232
1745b32J85k87J10N14k4o76L90Q72l21q93k41P78L10l8k30J72l81k62r1R11l04
$$ -232 -47 -334 -224 290 266 -410 -20 852 531 -362 -603 175 485 447 217 389 8 -254 -345 566 262
1766B62q85o4J139K79o99o69L77j3k12K40O03k92q05L87R70K03r60l79M61K35
$$ 262 -623 -687 452 731 32 -637 -260 -273 -485 -245 358 66 -739 -352 618 821 -139 -518 -57 178
1786A78L02m40K38q0n69M21R86n64q46l9N34L94o68n8J01J34l41J48M30j18n12
$$ 178 480 40 278 198 -371 50 1036 472 -374 -413 121 515 -153 -211 -110 24 -317 -169 261 143 -369
1807c69k79J094N8p70m27N46O68m70k1L08l02j54J4O79J99r49n27J033M55p19
$$ -369 -648 446 504 -266 -693 -147 521 51 30 338 36 -118 -104 575 774 -175 -702 331 786 67
1827F7j9j14p8l65L36Q32o1j299j96R43O18o13n98J36M09m75L33O90j02j151j04
$$ 67 48 -66 -144 -509 -173 659 598 -701 -897 46 664 51 -547 -411 -2 -477 -144 546 444 -707 -811
1848h11J201K63q52m94P23N18n59j01N45k21o85J26O10N79r93p98P57K36l08k59
$$ -811 390 653 -199 -693 30 548 -11 -112 433 212 -473 -347 263 842 -151 -949 -192 44 -264 -523
1868e23N75J62p19J18R63l56o76l71R44L90n78k60L99L53n06J33N27k2p26k25
$$ -523 52 214 -505 -387 576 220 -456 -827 117 507 -71 -331 68 421 -85 48 575 553 -173 -398
1888c98J005K32p74l71N65j61l50O7O25j39j006J95Q84L25j099l16Q55K72q07
$$ -398 607 839 65 -306 259 98 -252 -185 440 301 -705 -510 374 699 -400 -716 139 411 -396
1907c96L25N53j68n35%O60K42r25J46M91L96o40k41K10L42o88n3N99j98l71j21
$$ -396 -71 482 314 -221 -221 439 681 -244 -98 393 789 149 -92 118 460 -228 -281 318 120 -251 -372
1928c72P57j10o36j33N70k3m34o0M91R2p46K28M56Qo85L2Q95O0k20k74K1J48q6
$$ -372 385 275 -361 -494 76 53 -381 -441 50 142 -604 -376 80 88 -597 -565 330 390 170 -104 -83 65 -21
1951b1pO50J19j134l5N14J55l52l24O16o6m95J88L42M5p17O4N42J57m34J53M52
$$ -21 -28 622 741 -393 -428 86 241 -111 -435 181 115 -380 -192 150 195 -522 -458 84 241 -193 -40 412
1973D12j54j06k67K39J72l79K08L1J53m74q9N38n7j28l67O34ql64l44L07J68l83
$$ 412 258 152 -115 124 296 -83 125 156 309 -165 -254 284 227 99 -268 366 358 -6 -350 -43 125 -258
1995b58n0O05m11k53j01M78J29k19m64M18L50j53o5K00l2l74j79M36L10l26l03
$$ -258 -308 297 -114 -367 -468 10 139 -80 -544 -126 224 71 6 206 174 -200 -379 57 367 41 -262
2016b62O69J53j87l85K15Kl56j20K24K68m22j73O82N3n50k18o5N47j61J29n2K31
$$ -262 407 560 373 -12 203 205 -151 -271 -47 221 -201 -374 308 361 -189 -407 -472 75 -86 43 -9 222
2038B22q48M15O64n6m87n95O42P36m05k30k64L39l57K94O08k51r23j41O87L67
$$ 222 -626 -211 453 397 -90 -685 -43 693 288 58 -206 133 -224 70 678 427 -496 -637 50 417
2058D17k10p51K93J51K41P4K05l97n83L0N55N76o07m78L24M26p2k10J64j21n73
$$ 417 207 -544 -251 -100 141 215 420 23 -560 -530 25 601 -6 -484 -160 266 194 -16 148 27 -546
2079e46L67Q60j76p26l44M35P49l80o53L7M18j65K85L62l54j027R6J136N47q93
$$ -546 -179 681 505 -221 -565 -130 619 239 -414 -377 41 -124 161 523 169 -858 -762 374 921 28
2099B8n68K60K02K56j68L79l72l63O24O10k20p77o47M85O21O6m27J66k55n0J98
$$ 28 -540 -280 -78 178 10 389 17 -346 278 888 668 -109 -756 -271 350 416 -11 155 -100 -150 48
2120D8M13l26q30Q2P81N31n95m13q7K75m07O30L20n10n92K47J053J20o76l32J91
$$ 48 461 135 -695 -613 168 699 104 -309 -396 -121 -528 102 422 -88 -680 -433 620 740 64 -268 -77
2141g7K64Q5k99J93j06n39N85R16p07q25J16N18K88k69m39J12j98J51J13M03m01
$$ -77 187 272 -27 166 60 -479 106 1022 315 -510 -394 124 412 143 -296 -184 -382 -231 -118 285 -116
2162a16o55K35P01K61p75k01M87K03J37j26K92n04j83l1P44j44k90l32K06M21
$$ -116 -771 -536 165 426 -349 -550 -63 140 277 151 443 -61 -244 -275 469 325 35 -297 -91 330
2182C30j75m96L66m37L14j34L87l48k39j45P22J72n09J57l92N65j16N1N1Q7k65
$$ 330 155 -341 25 -412 -98 -232 155 -193 -432 -577 145 317 -192 -35 -427 138 22 73 124 211 -54
2203e4j28N10k79k72q6O95L48m35l99O9k00K31k41M11L2m49j1K51K39l89l89M73
$$ -54 -182 328 49 -223 -309 386 734 299 -100 -31 -231 0 -241 170 202 -247 -258 -7 232 -157 -546 -73
2225g3K15k90j00J18K14k22o3J71L20l30k4M98R0m79l41J90M20k36k84L01Q5j14
$$ -73 142 -148 -248 -130 84 -138 -201 -30 290 -40 -64 434 524 45 -296 -106 314 78 -206 95 180 66
2247F6j70L92M99j062k94N41K88Q5p06J56K22m58K38L20J33n98Q3J82L74k49l69
$$ 66 -104 288 787 -275 -569 -28 260 345 -361 -205 17 -441 -203 117 250 -348 -265 -83 291 42 -327
2268c27R1J93J35j93N31j02n38k56N44K19j30o01N53L33m94j60L66k85l24n8P85
$$ -327 -236 -43 92 -101 430 328 -210 -466 78 297 167 -434 119 452 -42 -202 164 -121 -445 -503 282
2289B82Q5m90k89J57M54k62p1n1K96l09Q6P02j93o12j40N06L49n93QK16j01m04
$$ 282 367 -123 -412 -255 199 -63 -134 -185 111 -198 -112 590 397 -215 -355 151 500 -93 -85 131 30 -374
2311c74M25K28j86k33j54N17J96m83m03J11K97l6j45N17K8n21r8L45R0M9n48K95
$$ -374 51 279 93 -140 -294 223 419 -64 -467 -356 -59 -95 -240 277 305 -216 -314 31 121 170 -378 -83
2333h3K60k5l11L24J51l93r9M79K40p32k60O26k1l08o5K91J79o34L09k46K91j62
$$ -83 177 152 -159 165 316 -77 -176 303 543 -189 -449 177 156 -152 -217 74 253 -381 -72 -318 -27 -189
2355a89k54M58R3k75l17P11l25J48j9K84j99j07j53L48on9m27M29k9J3p6P0o5
$$ -189 -443 15 108 -167 -484 227 -98 50 31 315 116 9 -144 204 198 139 -288 141 112 125 49 119 54
2378E4k27p9K65J54k63k73L44J23J71k52o3j7k77q9P55O8k67l25L25K02n39K01
$$ 54 -173 -252 13 167 -96 -369 -25 98 269 17 -46 -63 -340 -429 326 394 127 -198 127 329 -210 -9
2400iJ34J25k29Mq1L1L42n60M20N4m85r3L37o7k62J28M87m3l50R7K26pk11j04
$$ -9 125 250 21 25 -56 -25 317 -243 177 231 -254 -347 -10 -77 -339 -211 276 233 -117 -20 206 199 -12 -116
2424a16R2M38l78k9j10N00j67k36J16L9k99J48M1L33L9n31J47K65l71m6J4L19
$$ -116 -24 414 36 7 -103 397 230 -6 110 149 -150 -2 39 372 411 -120 27 292 -79 -125 -111 208
2446B08l41o4M80j55j74j56j0N01k55k08O9O7j27r3M19J33l92k84P00O7k02l40
$$ 208 -133 -197 283 128 -46 -202 -212 289 34 -174 -105 -38 -165 -258 161 294 -98 -382 318 385 183 -157
2468a57K58K27m44j26L19K14o67Q8K79L89k32n44L41L74o66L38k2L11j89l04K35
$$ -157 101 328 -116 -242 77 291 -376 -288 -9 380 148 -396 -55 319 -347 -9 -31 280 91 -213 22
2489B2J18l15k84K78K61L5k66L02O7l44m2L03P1l62j41L45K44k14j71j15K83k89
$$ 22 140 -175 -459 -181 80 115 -151 151 218 -126 -168 135 206 -156 -297 48 292 78 -93 -208 75 -214
2511b14o4K31J89m03J77J29K61l84p5L37m8l8Jp3J68l48j26N18j62j04n9L89j71
$$ -214 -278 -47 142 -261 -84 45 306 -78 -153 184 136 98 99 26 194 -154 -280 238 76 -28 -87 302 131
2534A31l11k10M69J57k45p1J62N2q7j82L83l05J52l62L86N7lm31L13O5j14l66
$$ 131 -180 -390 79 236 -9 -80 82 134 47 -135 248 -57 95 -267 119 176 173 -258 55 120 6 -360
2556c60M72J22m30J5K05M05m57m3K7K45k08L79k51p5q2k26K65R4j48k86K54K95
$$ -360 112 234 -196 -181 24 429 -28 -71 -44 201 -7 372 121 46 -36 -262 3 97 -51 -337 -83 212
2578B12n99K87P4Q4j95J38J98q6k38j8L70j05M0K7k42j3J83R9J58k51l85J39M9
$$ 212 -387 -100 -26 58 -137 1 199 113 -125 -143 227 122 162 189 -53 -66 117 216 374 123 -262 -123 -74
2601g4K05k18j67J62K87j28k50J77j07K1Q0O2M70o99j22N27k62J96r7j83O4J3
$$ -74 131 -87 -254 -92 195 67 -183 -6 -113 -92 -12 50 520 -179 -301 226 -36 160 63 -120 -56 -43
2623d3K35pj39K6m43L67O02o90J96j97j15K28o7j3N6j35J63K21j62j27n52L57
$$ -43 192 185 46 72 -371 -4 598 -92 104 -93 -208 20 -47 -60 -4 -139 24 245 83 -44 -596 -239
2645b39L39K00j21m75M46L6k97n8J68k65q0M63L76q0n34p3K40J76o0p4l1k33J50
$$ -239 100 300 179 -296 150 186 -111 -169 -1 -266 -346 117 493 413 -121 -194 46 222 162 88 57 -176 -26
2668b6J02K46k98m83q6P56k44n0J54j78J77m09N13K80l96l02R4N70M5p84J08K03
$$ -26 76 322 24 -459 -545 211 -33 -83 71 -107 70 -339 174 454 58 -244 -150 420 465 -319 -211 -8
2690hJ35J52Q9k85q9k90N23K64n47j09j18N22j97J2j57j4k60J94N76nm27n24N32
$$ -8 127 279 368 83 -6 -296 227 491 -56 -165 -283 239 42 54 -103 -117 -377 -183 393 388 -39 -563 -31
2713c1M14n38J17qK2j24M18k9R6m22k86N61L15m28n19L49L43l41L16j86L7l54
$$ -31 383 -155 -38 -46 -24 -148 270 241 337 -85 -371 190 505 77 -442 -93 250 -91 225 39 76 -278
2735b78J87N22k87k50l76N18k1L30k90m9Q8l17J76R5K03k77n5K31J53o7k27k35
$$ -278 -91 431 144 -106 -482 36 15 345 55 6 94 -223 -47 48 251 -26 -81 150 303 236 9 -226
2757b26L09mr0J1Nl34K19M3M16o55j00J89L12o43M95P8k12J35J43o6Q0m03q9M49
$$ -226 83 79 -11 0 5 -329 -110 -67 349 -306 -406 -217 95 -548 -53 25 -187 -52 91 25 105 -298 -387 62
2781F2j00M23m12j17J63l6l7J78J57n10K40RL42l55o1r1K28J24l62J16rJ41p1
$$ 62 -38 385 -27 -144 19 -17 -54 124 281 -229 11 20 362 7 -54 -145 83 207 -155 -39 -48 93 22
2804B2M9j05k33L7L58j87N6l11K65K16R9k68K4K18l19L41L0J53m17k29J46k3J20
$$ 22 71 -34 -267 -230 128 -59 -3 -314 -49 167 266 -2 22 240 -79 262 292 445 28 -201 -55 -78 42
2827D2o1p9K68j15P8k42j26moM09L01k64n93J16K38J82L4K4K8k05n5J63N2l95
$$ 42 -19 -98 170 55 133 -109 -235 -239 -245 164 465 201 -392 -276 -38 144 178 202 230 25 -30 133 185 -210
2851b10j5J40L64j25k08n2K02r9k7L10j56j04j88L93j14K43n68j78L20P3m0Rj43
$$ -210 -225 -85 279 154 -54 -106 96 -3 -30 280 124 20 -168 225 111 354 -214 -392 -72 1 -39 -30 -173
2874a73j09L14j07K57k10J11j30J41J37k73kJ7J01k66K66j21J20j66L09J5r6k11
$$ -173 -282 32 -75 182 -28 83 -47 94 231 -42 -44 -27 74 -192 74 -47 73 -93 216 231 135 -76
2896g6J10j7Q1j42Q0Kj61j41K61K8J12k38L08l37M0K71L9P5l97q9K11K46k36r6
$$ -76 34 17 98 -44 36 38 -123 -264 -3 25 137 -101 207 -130 -90 181 220 295 -102 -191 20 266 30 -66
2920f6k3K48O0l06lJ13K7l9k1J52k50n8k56Q05l47j48o3R4J63k37M3N14m55k64
$$ -66 -89 159 219 -87 -90 23 50 11 -10 142 -108 -166 -422 383 36 -112 -175 -81 82 -155 -112 402 -53 -317
2944c17L27M08l54l35L66j53K25j4j50K66n30N5L16m9j23p2L01j93J0J19j64J24
$$ -317 10 418 64 -271 95 -58 167 153 3 269 -261 -206 110 61 -62 -134 167 -26 -16 103 -61 63
2966F3p4j95L63k36L8n7K11J5k02K8J77k61J82k48N24j23k35k76L20J87k73ro7
$$ 63 -11 -206 157 -79 -41 -98 113 128 -74 -46 131 -130 52 -196 328 205 -30 -306 14 201 -72 -81 -148
2989a48J64J11l14J30K68j60l80N60j01l57N4K17K58l29r7K39l45K61j51j01M20
$$ -148 16 127 -187 -57 211 51 -329 231 130 -227 -173 44 302 -27 -124 115 -230 31 -120 -221 199
3010A99j41k39L3J54K87m14P7J32o8P5o8j1j19J9j28M20m15M8K17K26j66l36O7
$$ 199 58 -181 -148 6 293 -121 -44 88 20 95 27 16 -103 -84 -212 208 -207 -159 58 284 118 -218 -151
3033a51k6n8J26jL70l99l15L17K75P2j25k06P4QJ40N9o4k80j32L45L0q8k0n5J74
$$ -151 -177 -235 -109 -110 260 -139 -454 -137 138 210 85 -121 -47 -39 101 160 96 -184 -316 29 59 -29 -49 -104 70
3058G0j41n4K65j90Mj44L32L0j66j77qL17j57J66k98R2L33k28K81k4k33o6j03
$$ 70 -71 -125 140 -50 -46 -190 142 172 6 -171 -179 138 -19 147 -151 -59 274 46 327 303 70 4 -99
3081i9J69K47l53p2J93j34m02M60j29J7j89L67N7Q5l08J17Q3j13NrK37l53J15
$$ -99 70 317 -36 -108 85 -49 -451 9 -120 -103 -292 75 132 217 -91 26 109 -4 1 -8 229 -124 -9
3104iK8kn9k28J46K74l23J96j2r3N07o28J07OK34k0j40N1m1k0P5M5o6k35K2L6
$$ -9 19 17 -42 -270 -124 150 -173 23 11 -82 425 -203 -96 -90 144 124 -16 35 -6 -26 49 94 28 -207 -185 -149
3130a49N7RJ23j30j87L39J40j4j46j25K17j8o0RN9j01J30k84J82j98J32J81l25
$$ -149 -92 -83 40 -90 -277 62 202 188 42 -83 134 116 56 65 124 23 153 -131 51 -147 -15 166 -159
3153a59r4J24K40l20K41j61q1R2M32n39R5K87J3k64J92k94K96l3j09J02l0k99
$$ -159 -253 -129 111 -209 32 -129 -210 -118 314 -225 -130 157 170 -94 98 -196 100 67 -42 60 30 -269
3175b69N9K20L5k06R6L32o8k00J42l4j63MJ25m0O6k40Kj48J87J17k33J74Q5o5
$$ -269 -210 10 45 -161 -65 267 199 -1 141 107 -56 -52 73 33 99 -141 -139 -287 -100 17 -216 -42 43 -22
3199b2j55K22J7j20J08j74L16n2L8k21rK53k40J69k36r4J21M6J1J51k51J36J94
$$ -22 -177 45 62 -58 50 -124 192 140 178 -43 -52 201 -39 130 -106 -200 -79 -33 -22 129 -122 14 208
3222B08k94j3K3q8R3n0K07MJ10j31j21L78l28J8J73q8n6J33m4K26n5l07n5J51
$$ 208 -86 -99 -76 -164 -71 -121 86 90 200 69 -52 326 -2 16 189 101 45 178 134 360 305 -2 -57 94
3246I4k96K72j80Q4j09kO6k24K92k31J15M24j25p6l91N1J81j26Pl1L30k93J13
$$ 94 -202 70 -110 -26 -135 -137 -71 -295 -3 -234 -119 305 180 104 -287 -236 -55 -181 -174 -205 125 -168 -55
3269e5K66n3n44L22j23k0L76k75K38j65q2K17L4k9j83j26J65L89l01j53R4m5k2
$$ -55 211 158 -386 -64 -187 -207 169 -106 132 -33 -115 102 136 107 -76 -202 -37 352 51 -102 -8 -53 -75
3292g5K52j45j47l1M8kj24K95r7O4j16J53j13J06j01p6K09j5o9k03K62J41n18
$$ -75 177 32 -115 -146 -98 -100 -224 71 -26 38 -78 75 -38 68 -33 -109 100 85 16 -187 75 216 -302
3315c02m6M19j06P9K58k70K47m61J25K15pl96K74r0M7J69k88L6J23J27r1O7j7
$$ -302 -348 71 -35 44 302 32 279 -182 -57 158 151 -245 29 -61 -14 155 -133 -97 26 153 62 129 112
3338A12m4J31m14K90j89J17J06J4j17k83L24m3l13NJ33M49k75M0p5J20k26J14
$$ 112 68 199 -215 75 -114 3 109 123 6 -277 47 4 -309 -304 -171 278 3 43 -32 88 -138 -24
3360b4K14j29j37P5K54J34l37k61K67k5R2N8p3m8m33M98J57l87n0k01L51K12N2
$$ -24 190 61 -76 -1 253 387 50 -211 56 31 123 181 108 60 -373 125 282 -105 -155 -356 -5 207 259
3383B59l00r2M0n8M28l50J79k53j63L11K45k18r0L37k8j5k37j11J40K19O1j80
$$ 259 -41 -133 -93 -151 277 -73 106 -147 -310 1 246 28 -62 275 247 232 -5 -116 24 243 304 124
3405A24Q2n36M15q5K42J21l57J02j10K29m24K20m1j07J55K03k72R1k67p3L16j67
$$ 124 206 -330 85 0 242 363 6 108 -2 227 -197 23 -18 -125 30 233 -39 52 -215 -288 28 -139
3427a39Q0l0J7K4J55K6k69M95n22J36Q3L49n61M2K25o8j15o1m4Q0J75n8lk34L11
$$ -139 -59 -89 -72 -48 107 133 -136 359 -163 -27 56 405 -156 -114 111 43 -72 -133 -177 -97 78 20 17 -217 94
3452I4j33N7J45m0o3l84N54r3J15j98k90K89k7J62n0n7k04K57j70K90r8k67o6
$$ 94 -39 18 163 123 60 -324 230 137 252 54 -236 53 26 188 138 81 -123 134 -36 254 156 -111 -177
3475a77L88j2p3j49j38J86O9k1j5o5l1j62K37J54P0k98l9J11K91l65rJ20O4k09
$$ -177 211 199 126 -23 -161 25 94 73 58 -7 -38 -200 37 191 261 -37 -76 35 326 -39 -48 72 136 -73
3499g3K03j15J1l43J13M17j29J47n36K15M1j9NN8M6j39j57K31J43k21P7J12K14
$$ -73 130 15 26 -317 -204 213 84 231 -305 -90 -49 -68 -63 -5 41 -98 -255 -24 119 -102 -25 87 301
3522C01l36j21L27k71P3K65p0j71k56J95L6J00k1j4J5m64M02K21k49L19m61K35
$$ 301 -35 -156 171 -100 -27 238 168 -3 -259 -64 -28 72 51 37 52 -412 -10 211 -38 281 -180 55
$$ [...]
8191I0
##END NTUPLES=NMR FID
##END=
