##TITLE=1H_Ser DHA N2
 CDCl3
 8 sc, 
 16.2.2023
##JCAMPDX= 6.0         $$ Bruker NMR JCAMP-DX V2.0
##DATA TYPE= NMR FID
##DATA CLASS= NTUPLES
##ORIGIN= UXNMR, Bruker Analytische Messtechnik GmbH
##OWNER= root
$$ XWIN-NMR		Version 3.5
$$ Thu Feb 16 13:53:36 2023 Russian Standard Time (UT+4h)  she@DPX200
##.OBSERVE FREQUENCY= 200.13135
##.OBSERVE NUCLEUS= ^1H
##.DELAY= (6, 6)
##.ACQUISITION MODE= SIMULTANEOUS
##.ACQUISITION SCHEME= undefined
##.AVERAGES= 8
##.DIGITISER RES= 18
##SPECTROMETER/DATA SYSTEM= spect
##.PULSE SEQUENCE= zg30
##.SOLVENT NAME= DMSO
##.SHIFT REFERENCE= (INTERNAL, DMSO, 0, 15.7039)
##AUDIT TRAIL= $$ (NUMBER, WHEN, WHO, WHERE, WHAT)
$$ ##TITLE= Audit trail, XWIN-NMR		Version 3.5
$$ ##JCAMPDX= 5.01
$$ ##ORIGIN= Bruker BioSpin GmbH
$$ ##OWNER= she
$$ F:/spectra/data/she/nmr/H-F/1/audita.txt
$$ ##AUDIT TRAIL=  $$ (NUMBER, WHEN, WHO, WHERE, WHAT)
(   1,<2023-02-16 13:52:17.07 +0400>,<she>,<DPX200>,
      <created by zg, POWCHK disabled, PULCHK disabled
       configuration hash MD5:
       00 E9 B6 7A A2 85 ED C7 34 08 36 98 17 FE 4E 26
       data hash MD5: 16K
       07 DD 21 F4 77 75 20 6C 20 EB 33 43 08 06 CB 7E>)
$$ ##END=
$$ 
$$ hash MD5
$$ 1D 1E 79 07 59 BC DC B6 B6 22 3B 7D CD BA A7 6A
##$RELAX= 
##$RELAX= 
##$RELAX= 
##$RELAX= 
##$RELAX= 
##$RELAX= 
$$ Bruker specific parameters
$$ --------------------------
##$DU= <F:/spectra>
##$EXPNO= 1
##$NAME= <H-F>
##$PROCNO= 1
##$TYPE= <nmr>
##$USER= <she>
##$AMP= (0..31)
100 100 100 100 100 100 100 100 100 100 100 100 100 100 100 100 100 100 
100 100 100 100 100 100 100 100 100 100 100 100 100 100 
##$AQSEQ= 0
##$AQ_mod= 1
##$AUNM= <au_zg>
##$AUTOPOS= <>
##$BF1= 200.13
##$BF2= 200.13
##$BF3= 200.13
##$BF4= 200.13
##$BF5= 200.13
##$BF6= 200.13
##$BF7= 200.13
##$BF8= 200.13
##$BYTORDA= 1
##$CFDGTYP= 0
##$CFRGTYP= 5
##$CHEMSTR= <none>
##$CNST= (0..31)
1 1 145 1 1 1 1 1 1 1 1 1 1 1 1 1 1 1 1 1 1 1 1 1 1 1 1 1 1 1 1 1 
##$CPDPRG= <>
##$CPDPRG1= <>
##$CPDPRG2= <>
##$CPDPRG3= <>
##$CPDPRG4= <mlev>
##$CPDPRG5= <mlev>
##$CPDPRG6= <mlev>
##$CPDPRG7= <mlev>
##$CPDPRG8= <mlev>
##$CPDPRGB= <>
##$CPDPRGT= <>
##$D= (0..31)
0 1.2 0 0 0 0 0 0 0 0.06 0 0.03 0 0 0 0 0.0002 0 0 0 0 0 0 0 0 0 0 0 0 
0 0 0 
##$DATE= 1676541136
##$DBL= (0..7)
120 120 120 120 120 120 120 120 
##$DBP= (0..7)
150 150 150 150 150 150 150 150 
##$DBP07= 0
##$DBPNAM0= <>
##$DBPNAM1= <>
##$DBPNAM2= <>
##$DBPNAM3= <>
##$DBPNAM4= <>
##$DBPNAM5= <>
##$DBPNAM6= <>
##$DBPNAM7= <>
##$DBPOAL= (0..7)
0.5 0.5 0.5 0.5 0.5 0.5 0.5 0.5 
##$DBPOFFS= (0..7)
0 0 0 0 0 0 0 0 
##$DE= 6
##$DECBNUC= <off>
##$DECIM= 32
##$DECNUC= <off>
##$DECSTAT= 4
##$DIGMOD= 1
##$DIGTYP= 9
##$DL= (0..7)
0 120 120 120 120 120 120 120 
##$DP= (0..7)
150 150 150 150 150 150 150 150 
##$DP07= 0
##$DPNAME0= <>
##$DPNAME1= <>
##$DPNAME2= <>
##$DPNAME3= <>
##$DPNAME4= <>
##$DPNAME5= <>
##$DPNAME6= <>
##$DPNAME7= <>
##$DPOAL= (0..7)
0.5 0.5 0.5 0.5 0.5 0.5 0.5 0.5 
##$DPOFFS= (0..7)
0 0 0 0 0 0 0 0 
##$DQDMODE= 0
##$DR= 18
##$DS= 0
##$DSLIST= <SSSSSSSSSSSSSSS>
$$ [...]
##$SUBNAM2= <"">
##$SUBNAM3= <"">
##$SUBNAM4= <"">
##$SUBNAM5= <"">
##$SUBNAM6= <"">
##$SUBNAM7= <"">
##$SUBNAM8= <"">
##$SUBNAM9= <"">
##$SW= 18.05172834244
##$SWIBOX= (0..15)
0 0 2 0 0 0 0 0 0 0 0 0 0 0 0 0 
##$SW_h= 3612.71676300578
##$TD= 16384
##$TD0= 1
##$TE= 0
##$TE2= 300
##$TE3= 300
##$TEG= 300
##$TL= (0..7)
0 120 120 120 120 120 120 120 
##$TP= (0..7)
150 150 150 150 150 150 150 150 
##$TP07= 0
##$TPNAME0= <>
##$TPNAME1= <>
##$TPNAME2= <>
##$TPNAME3= <>
##$TPNAME4= <>
##$TPNAME5= <>
##$TPNAME6= <>
##$TPNAME7= <>
##$TPOAL= (0..7)
0.5 0.5 0.5 0.5 0.5 0.5 0.5 0.5 
##$TPOFFS= (0..7)
0 0 0 0 0 0 0 0 
##$TUNHIN= 0
##$TUNHOUT= 0
##$TUNXOUT= 0
##$USERA1= <user>
##$USERA2= <user>
##$USERA3= <user>
##$USERA4= <user>
##$USERA5= <user>
##$V9= 5
##$VALIST= <valist>
##$VCLIST= <CCCCCCCCCCCCCCC>
##$VD= 0
##$VDLIST= <DDDDDDDDDDDDDDD>
##$VPLIST= <PPPPPPPPPPPPPPP>
##$VTLIST= <TTTTTTTTTTTTTTT>
##$WBST= 1024
##$WBSW= 4
##$XGAIN= (0..3)
0 0 0 0 
##$XL= 0
##$YL= 0
##$YMAX_a= 105056
##$YMIN_a= -226584
##$ZGOPTNS= <>
##$ZL1= 120
##$ZL2= 120
##$ZL3= 120
##$ZL4= 120
##$ABSF1= 10
##$ABSF2= 0
##$ABSG= 5
##$ABSL= 3
##$ALPHA= 0
##$AQORDER= 0
##$ASSFAC= 0
##$ASSFACI= 0
##$ASSFACX= 0
##$ASSWID= 0
##$AUNMP= <proc_1d>
##$AZFE= 0.1
##$AZFW= 0.1
##$BCFW= 1
##$BC_mod= 2
##$BYTORDP= 1
##$COROFFS= 0
##$CY= 11.3945322036743
##$DATMOD= 1
##$DC= 2
##$DFILT= <>
##$DTYPP= 0
##$F1P= 2.36226072786647
##$F2P= -0.459571619588291
##$FCOR= 0.5
##$FTSIZE= 0
##$FT_mod= 4
##$GAMMA= 1
##$GB= 0.15
##$INTBC= 1
##$INTSCL= 1
##$ISEN= 128
##$LB= 0.24
##$LEV0= 0
##$LPBIN= 0
##$MAXI= 10000
##$MC2= 0
##$MEAN= 0
##$ME_mod= 0
##$MI= 1.114404
##$NCOEF= 0
##$NC_proc= 0
##$NLEV= 6
##$NOISF1= 3.799351
##$NOISF2= 2.8
##$NSP= 1
##$NTH_PI= 0
##$NZP= 0
##$OFFSET= 15.70392
##$PC= 1
##$PHC0= -19115.1
##$PHC1= 21.80078
##$PH_mod= 1
##$PKNL= yes
##$PPARMOD= 0
##$PSCAL= 0
##$PSIGN= 0
##$REVERSE= no
##$SF= 200.130013532006
##$SI= 16384
##$SIGF1= 3
##$SIGF2= 2
##$SINO= 400
##$SIOLD= 16384
##$SREGLST= <1H.CDCl3>
##$SSB= 0
##$STSI= 0
##$STSR= 0
##$SW_p= 3612.71676300578
##$SYMM= 0
##$S_DEV= 0
##$TDeff= 0
##$TDoff= 0
##$TI= <>
##$TILT= no
##$TM1= 0
##$TM2= 0
##$TOPLEV= 0
##$USERP1= <user>
##$USERP2= <user>
##$USERP3= <user>
##$USERP4= <user>
##$USERP5= <user>
##$WDW= 1
##$XDIM= 8192
##$YMAX_p= 0
##$YMIN_p= 0
$$ End of Bruker specific parameters
$$ ---------------------------------
##NTUPLES= NMR FID
##VAR_NAME=  TIME,          FID/REAL,        FID/IMAG
##SYMBOL=    X,             R,               I
##VAR_TYPE=  INDEPENDENT,   DEPENDENT,       DEPENDENT
##VAR_FORM=  AFFN,          ASDF,            ASDF
##VAR_DIM=   8192,          8192,            8192
##UNITS=     SECONDS,       ARBITRARY UNITS, ARBITRARY UNITS
##FACTOR=    0.0002768,     1,               1
##FIRST=     0,             0,               0
##LAST=      2.2672688,     0,               0
##MIN=       0,             -226584,         0
##MAX=       2.2672688,     105056,          0
$$ Real data points
##PAGE= N=1
##DATA TABLE= (X++(R..R)), XYDATA
0 0 0 0 0 0 0 0 0 0 0 0 0 0 -8 8 -8 8 -9 16 -16 24 -24 32 -40 41 -49 57 -70 80 -92 105 -121 137 -158 177
34 177 -200 227 -254 286 -319 355 -396 440 -488 540 -599 659 -729 804 -887 976 -1075 1184
52 1184 -1305 1441 -1593 1763 -1954 2177 -2435 2738 -3100 3546 -4103 4830 -5816 7244 -9498
67 -9498 13620 -23659 105056 47321 -141214 -58364 -61012 -42323 42229 96508 18310 -16219
79 -16219 -2956 -13769 -26044 -6384 -45280 -9806 87918 53228 -44768 -21688 -2365 -53546
91 -53546 -41529 56550 53921 -24066 -5535 32531 -16884 -36382 -14315 -1610 23057 31444 6799
104 6799 3324 9856 -18441 -45041 3757 40562 -10573 -11711 48304 17763 -42176 -31702 -4288
117 -4288 1301 4284 18863 21335 -177 -19803 -30883 -10976 20764 -2165 -13129 33110 30012
130 30012 -18393 -24702 -6657 -5085 -9789 14048 38780 18001 -11155 -21828 -16497 5868 1037
143 1037 -7097 23113 24206 -11813 -19573 -4291 -3873 -16223 -1880 26736 14122 -8545 -11308
156 -11308 -14349 -5473 -300 -5106 14327 22901 -2426 -14389 -1275 5909 -12145 -10907 21507
169 21507 16362 -8195 365 6122 -571 -6476 -11251 1226 11781 1545 -4268 3730 9223 -12472
183 -12472 -27431 6018 19373 -7754 -4893 12137 3528 -13160 -14636 3407 9264 -1257 818
196 818 8746 11767 -2698 -22291 -2462 16703 -3169 -3993 16990 12317 -10827 -17425 2909 7537
210 7537 -7916 -280 11552 5812 -5693 -16879 -4951 8812 -6228 -6900 13839 13251 -8147
223 -8147 -17054 2435 7869 -12728 -3928 18245 11054 -3481 -7480 1265 5970 -8825 -7762 12479
237 12479 13957 -1408 -10513 3974 10060 -15597 -13581 13800 10077 -7147 -5905 5111 3423
250 3423 -14553 -10741 9837 8845 -1769 -5481 3695 8580 -12259 -15109 11100 12559 -3795 -2974
264 -2974 10986 8811 -13861 -11869 11256 7205 -4725 -54 8023 6226 -10477 -12839 5856 6166
278 6166 -5961 -3806 7033 7510 -12338 -14213 8686 5930 -9401 -1708 10960 6755 -10790 -9866
292 -9866 9413 4353 -8513 540 11539 8365 -7486 -9451 9217 5835 -9725 -2772 10786
305 10786 8643 -9040 -10727 9434 4707 -13710 -4718 10403 6147 -9361 -8794 8072 2418 -13414
319 -13414 -2853 10548 6349 -5063 -6174 7792 3768 -11244 -2513 10890 7322 -4812 -4864 10226
333 10226 5228 -12878 -3580 10611 2656 -8132 -3321 10256 2691 -13180 -2080 8283 -460
346 -460 -7297 -3925 6926 3339 -9920 -2827 8249 1941 -6792 -3786 9613 6439 -10308 -1614
360 -1614 10592 512 -7076 276 9790 3919 -9000 -955 7734 -708 -5824 -2474 5419 4386
374 4386 -9254 -4609 7852 502 -8327 -4228 6521 3479 -9752 -2050 9043 -350 -6609 -1694
388 -1694 4972 3971 -5029 -1219 8731 2788 -5318 -3055 4815 4894 -6446 -1989 10120 1729 -7072
403 -7072 -2177 3566 1634 -7266 -2808 7872 1037 -7172 -3572 3593 3370 -7653 -4875 9502 2455
418 2455 -8356 -1956 6653 3550 -6542 -2416 10081 3156 -6349 -1676 5567 4686 -6524 -5388
432 -5388 9988 4455 -8818 -2054 8113 2443 -10730 -5431 9027 1024 -9003 89 6868 931
446 931 -8605 -5949 7732 4162 -7832 -1324 8415 3551 -9623 -4672 12615 3766 -10267 1773
460 1773 9997 -222 -8282 -777 9612 543 -9240 1294 7952 87 -8012 -3686 8205 225
474 225 -11841 748 10080 -1904 -10017 -724 9298 -1000 -10436 3265 8972 -1644 -6521 733
488 733 8970 311 -10143 2919 10977 -818 -7042 1169 7667 -2286 -9799 3516 8573 -3193
502 -3193 -6565 -170 5857 -794 -9260 392 7153 -3789 -7705 2141 8438 -2400 -10191 3482
516 3482 7807 -4341 -2849 4823 3877 -2169 -5184 2832 7266 -182 -3883 839 5477 129 -8091
531 -8091 2035 8151 -5606 -6548 5691 4885 -4743 -6433 2038 3187 -4128 -1384 2465 1221 -479
546 -479 -5495 -361 7864 -389 -6408 889 6332 -327 -5063 4126 7092 -5297 -4244 4459 3616
561 3616 405 -2553 -1510 3189 -746 -4048 227 3756 137 -7796 -1716 7641 -1902 -7191 2340
576 2340 3221 -2554 -3672 1526 5166 -1800 -4068 2139 3882 2228 -3179 -1353 6782 37 -6468
591 -6468 2937 6204 -1154 -5281 1445 6224 -2936 -6660 1659 2709 -1338 -3149 -263 5155 -1464
606 -1464 -8526 389 5916 -707 -5483 237 6538 -2134 -7086 4090 6513 -1218 -3936 1293 6165
621 6165 -169 -6301 1792 5847 -843 -4536 819 6892 -1464 -9224 1593 5552 -2805 -4413 1532
636 1532 4941 -2635 -7183 2032 4488 -3161 -4155 1906 6459 -593 -7136 2222 5458 -3795 -3457 4901
652 4901 7236 -1538 -7003 2098 5136 -3304 -2554 4092 5722 -2785 -8338 1442 5893 -4449 -4763
667 -4763 3690 4890 -3375 -7174 1706 3984 -4835 -3586 4517 6318 -393 -6981 716 5516 -3840
682 -3840 -4448 6339 7927 -1625 -6295 2829 4808 -5969 -4140 5076 4652 -1053 -3904 1806 3371
697 3371 -5522 -6331 2324 5511 -624 -5157 2845 4947 -7553 -7219 5601 5079 -3021 -1810 5323
712 5323 3685 -6756 -4677 4118 3930 -88 -625 4255 5408 -5937 -7977 3530 5321 -1953 -2458
727 -2458 5768 4341 -8818 -7056 4511 1710 -3837 91 4647 2722 -5990 -5900 2054 2103 -1641 -874
743 -874 4790 6128 -4759 -6592 4336 3156 -4402 -722 6705 4638 -4850 -3069 4500 25 -5177
758 -5177 -893 3684 3310 -2433 -3167 2588 288 -5619 -2897 3135 4269 -2543 -3320 4229 423 -6915
774 -6915 -1816 4864 4213 -1103 -67 4863 -754 -6185 -1346 3106 3453 678 -603 3986 888 -5779
790 -5779 -3927 1841 3031 -891 -1383 4344 1563 -7067 -4053 1586 1412 -907 -356 4062 1489 -4985
806 -4985 -2933 1133 2270 424 -775 4026 3563 -3996 -3267 1642 2230 -570 -1506 4901 3738 -4546
822 -4546 -3347 1485 562 -2584 -1891 3560 3223 -3419 -3267 1078 15 -2566 -3116 3488 5178 -2648
838 -2648 -2941 2654 1098 -3635 -2981 4905 5958 -2501 -1446 3708 -138 -4772 -3090 4453 5516 -2156
854 -2156 -1737 2976 -346 -5568 -4466 3826 5394 -3177 -2524 4333 -52 -6336 -3979 3844 4252 -2815
870 -2815 -997 5099 600 -5614 -3132 3418 4294 -2322 -304 6116 833 -5644 -2737 3042 2937 -3406
886 -3406 -526 6097 279 -5742 -2547 2215 1242 -4090 -654 6363 569 -5740 -2197 2580 599
901 599 -4358 246 7106 801 -4848 -726 2484 -87 -3377 687 6884 1817 -4089 -630 2181
916 2181 -338 -4612 -724 6482 899 -4492 -62 2132 -2056 -4691 -971 4940 851 -3436 150
931 150 1149 -1293 -3959 -933 4949 2312 -2907 1091 2609 -1221 -3630 -822 4412 1441 -2164 1737
947 1737 2845 -1061 -3077 -1314 3116 1257 -2648 1198 2718 -1601 -4129 -1946 2723 614 -2964
962 -2964 1387 2612 -1478 -3310 -1616 2786 1490 -2397 1173 3779 202 -3014 -1420 3201 978
977 978 -3010 1858 4199 -400 -2527 -1425 1277 439 -3106 -70 3111 678 -2676 -2358 1883 655
993 655 -4897 -424 4639 35 -2799 -107 2058 -449 -3352 556 3660 862 -758 -611 2186 1319
1009 1319 -3528 -915 4627 1005 -3165 114 3673 -323 -5429 -105 3940 -1332 -2083 1570 2024
1024 2024 -539 -4445 -1726 3050 539 -2659 289 3915 864 -5072 -294 4999 -1028 -3195 2825
1039 2825 3911 -425 -3315 -212 2795 -174 -1762 1140 2682 918 -4573 -1606 4672 -465 -4563
1054 -4563 933 3211 -1274 -3543 630 3438 -2021 -2758 967 2000 841 -1932 -647 3555 176
1069 176 -3874 1071 4400 -231 -3693 1276 4590 -1895 -3730 2341 2132 -1458 -1928 521 2571 -1120
1085 -1120 -4044 141 2720 -534 -3952 -6 4495 -1336 -5223 2043 3547 -2738 -2347 1786 3291
1100 3291 -671 -2117 1610 1750 -512 -2102 126 4486 668 -4371 1339 3436 -2312 -3001 1540
1115 1540 3016 -2245 -3234 1829 1624 -2628 -1702 641 2053 -394 -3132 1223 3342 -2003 -3052 1292
1131 1292 3142 -1427 -3143 3312 3071 -2806 -1581 1942 1468 -1136 -2177 2004 2990 -1941 -2631 483
1147 483 2129 -1479 -3231 2842 3055 -3776 -2799 2205 1152 -1528 -1519 1959 1830 -2109 -1485 1411 1898
1164 1898 -831 -2678 1862 3753 -1702 -1500 2528 1200 -1876 -1544 2112 1948 -1964 -486 1069 107
1180 107 -601 -1941 81 2355 -1233 -2151 1230 1379 -2193 -2445 1836 2193 -2322 -846 2299 -21
1196 -21 -1352 -610 640 1940 -537 -1043 1512 1653 -874 -2390 699 2556 -1396 -1954 2532 1266
1212 1266 -1697 -1871 435 1478 -1510 -1537 1032 1239 -304 -1798 -573 2312 -1011 -2386 1888 2731
1228 2731 -797 -1772 808 2158 -1344 -1817 2592 1814 -555 -1297 125 2203 -1050 -2447 1584 2228
1244 2228 -955 -2480 349 2118 -2100 -2947 1888 2112 -1579 -1538 940 1829 -1602 -2928 2065 2689
1260 2689 -1285 -1065 1743 2445 -1763 -3099 2211 2540 -1716 -951 2084 2522 -2087 -3085 1659 1886 -2178
1277 -2178 -1595 2159 2040 -2217 -3484 1897 2037 -2777 -1393 2761 2066 -2187 -2628 2115 1939 -2728
1293 -2728 -786 2732 2067 -1734 -2051 2386 2138 -2596 -1085 2957 1665 -1994 -1688 2291 1376 -3461
1309 -3461 -1093 2396 937 -2186 -1876 1815 1113 -3235 -1189 2982 766 -2104 -1034 2415 808
1324 808 -3054 -454 3254 802 -1379 -623 1990 1177 -2527 -871 2973 547 -1653 -697 2030 886
1340 886 -3065 -776 2347 -115 -1857 -247 1587 368 -2827 -926 2026 279 -1156 -302 1547
1355 1547 828 -2269 -937 2485 556 -1334 44 1846 1096 -2352 -823 2187 250 -1283 115
1370 115 1560 582 -2060 -982 1559 292 -1717 -490 1076 652 -2363 -1351 1960 442 -1830 -105
1386 -105 1377 589 -1765 -692 2316 413 -1483 132 1642 855 -1210 -1025 2065 572 -1687 -414
1402 -414 1394 513 -1815 -1178 1802 434 -2041 -197 1366 531 -1867 -1187 1555 458 -1986 -42
1418 -42 1634 521 -1033 -1134 1637 638 -1629 196 1856 890 -1615 -691 2061 611 -2221 -170
1434 -170 2024 195 -1757 -773 1574 -179 -2537 -120 1730 -340 -1742 -992 1563 76 -2281 -296
1450 -296 1772 792 -1276 -856 1930 955 -2649 27 2846 295 -1695 -281 1600 -136 -1987 265
1466 265 1926 51 -1296 -749 1123 603 -2330 -766 2040 0 -1854 -667 1522 181 -2750 365
1482 365 2243 -440 -1219 374 1481 281 -1604 -2 1638 186 -1021 -169 2098 805 -2440 -226
1498 -226 2687 -397 -1846 710 1818 -753 -2539 12 1561 -815 -1242 -130 1181 118 -2132
1513 -2132 -579 2247 114 -2037 406 2009 -64 -2453 198 2379 -397 -1147 1076 1328 11
1528 11 -1533 -231 1831 88 -1709 304 1679 235 -2348 -259 1941 -1366 -2115 896 1313 -452
1544 -452 -1402 245 1185 -988 -1281 729 1507 310 -1494 -139 1730 -668 -1930 1367 1968 -525
1560 -525 -1441 492 1100 -1153 -1715 1025 935 -561 -775 -96 1430 -683 -2431 585 1437 -843 -1504
1577 -1504 902 1841 -857 -1898 1194 1181 -801 71 811 1331 -212 -1221 179 855 -56 -414 488
1594 488 1387 -595 -1887 770 1284 -945 -883 661 855 -757 -1565 494 401 -699 -575 559 1158 -142
1612 -142 -1498 161 1144 -579 -755 948 1788 -85 -1298 466 959 -838 -515 730 1282 48 -1109
1629 -1109 189 1071 -976 -1010 405 1352 239 -1352 70 860 -1123 -1193 206 1395 87 -1605 165
1646 165 1296 -907 -1627 658 1298 -293 -964 1033 1458 -1013 -1377 444 976 215 -885 459 1454
1663 1454 -1100 -2238 261 1408 -611 -1509 721 1551 -1303 -1806 682 584 -829 -772 983 1481 -997
1680 -997 -1232 485 1233 -134 -1047 1070 1884 -1257 -1640 1316 1226 -1372 -1103 1228 1477 -1551 -1265 987
1698 987 297 -1348 -1039 679 1456 -928 -1507 689 965 -1403 -1070 1215 1535 -1222 -1220 1438 415 -1150
1716 -1150 -310 1341 1169 -590 -644 1197 238 -1075 -578 1149 969 -831 -1151 1002 176 -1688 -541
1733 -541 1202 639 -871 -448 1232 215 -1310 -415 850 886 -876 -713 1045 450 -1475 -396 967
1750 967 602 -558 -740 1035 407 -1212 -126 825 459 -754 -900 678 353 -1317 -575 549 186
1767 186 -985 -558 705 315 -928 -63 765 269 -514 -582 1001 540 -969 -137 739 441 -521 -579 958
1786 958 834 -926 -405 735 145 -725 -710 508 542 -863 -382 540 -26 -588 -738 651 768 -1000 -374
1805 -374 879 55 -650 -347 1049 681 -575 -215 1203 347 -521 -446 904 1003 -760 -243 697 319 -846
1824 -846 -461 798 628 -1031 -533 897 54 -890 -194 913 293 -936 -385 920 98 -779 -435 846
1842 846 766 -848 -351 1183 424 -660 -515 709 787 -866 -535 1037 164 -1025 -665 683 328 -906
1860 -906 -633 833 300 -1053 -450 467 542 -745 -476 1369 259 -765 -361 489 400 -823 -355 1600
1878 1600 417 -1038 -86 919 380 -729 -516 1358 149 -911 -37 628 436 -937 -337 1088 199
1895 199 -1165 -133 686 -149 -1001 -294 1188 78 -1027 262 855 -22 -637 -292 1443 422 -1058
1912 -1058 168 1242 -99 -1102 -97 1269 293 -1225 110 956 -288 -1049 -202 1032 82 -1072
1928 -1072 57 872 49 -818 -172 1048 -4 -1160 140 997 -70 -863 -161 1414 481 -1140 630
1945 630 1154 -325 -776 -7 970 -146 -863 51 1199 -16 -991 -258 853 -41 -1076 426 752 -634
1963 -634 -1132 -42 812 -195 -697 616 932 -312 -788 118 525 -167 -778 485 1264 -412 -690 240
1981 240 574 -363 -972 327 1079 -846 -554 287 336 -373 -664 357 711 50 -647 142 535 -337 -1064
2000 -1064 209 1117 -738 -337 533 692 -237 -495 338 653 -147 -417 399 430 -184 -999 85 836 -397
2019 -397 -674 581 301 -565 -804 -11 574 -561 -506 208 279 29 -748 -133 435 -172 -439 349 582 -171
2039 -171 -790 188 524 -203 -547 299 517 -337 -237 -23 714 174 -869 114 624 -73 -671 -75 668 -476
2059 -476 -1117 292 639 -72 -527 -225 397 -189 -618 478 916 -326 -193 62 854 -36 -766 766 806
2078 806 -243 -417 205 287 -146 -717 217 548 -306 -665 -168 704 -285 -1265 273 731 -602 -826 729
2097 729 877 -769 -710 627 664 -394 22 589 348 -190 -746 468 404 -473 -665 414 1043 -659 -1021
2116 -1021 666 505 -1104 -389 419 324 -621 -454 125 300 -531 -377 330 454 -350 -659 352 512 -908
2135 -908 -417 887 348 -405 -363 542 293 -639 -119 681 275 -105 -523 311 283 -783 -524 875 289 -726
2155 -726 -364 690 115 -991 23 637 51 -108 7 281 295 -258 -324 504 392 -446 -209 528 491 -709
2175 -709 -328 680 -175 -354 -59 553 261 -596 -254 61 173 -130 -240 360 555 -653 -626 597 188
2194 188 -565 -133 437 377 -220 -166 402 116 -228 -151 285 282 -282 -530 706 338 -480 -140 102 265 -688
2215 -688 -331 632 -27 -645 -68 155 86 -594 -403 97 129 -438 -170 386 636 -700 -299 782 -59 -636
2235 -636 -179 310 286 -669 -48 583 160 -511 -265 76 153 -533 -312 500 219 -465 -182 232 53 -390 -326
2256 -326 599 174 -704 -106 464 134 -484 -225 489 288 -459 2 377 130 -432 -30 198 131 -851 -112
2276 -112 814 16 -543 -43 423 346 -594 -133 625 -35 -404 -414 712 88 -630 176 837 -188 -642 -240
2296 -240 454 496 -358 355 715 258 -431 -212 449 78 -400 -17 631 -31 -378 -120 368 -79 -759 65
2316 65 558 99 -351 89 184 -34 -470 -108 641 140 -692 195 367 -75 -560 246 739 -1 -346 -35 562
2337 562 -240 -874 212 837 -63 -602 261 279 -261 -698 -274 672 -171 -394 119 480 -123 -555 31 502
2357 502 6 -419 481 491 -73 -641 243 686 -166 -436 519 361 -213 -650 -1 632 -410 -580 286 375
2377 375 -287 -451 111 230 -340 -27 551 437 -559 -446 246 390 -427 -363 480 522 -211 -153 183 753 -210
2398 -210 -270 218 285 -254 -88 -154 148 -347 -636 640 207 -329 -98 107 76 -57 -373 194 305 35 -217
2419 -217 -76 360 -447 -482 392 300 -56 -284 63 114 -219 -320 383 517 -147 -109 127 169 -240 -528 231 359
2441 359 -155 -326 -93 280 -416 -495 115 263 -190 -114 268 373 -282 -393 157 368 -65 103 -266 482 -274
2462 -274 -458 68 389 -186 -447 342 581 -280 -423 -50 -49 -307 -205 207 441 -98 -622 58 291 -154 -289
2483 -289 584 505 -279 -349 45 417 -322 -451 183 319 60 -345 16 377 -507 -333 411 580 8 -269 465
2504 465 498 -396 -205 241 276 -363 -216 339 470 -457 -335 183 391 -250 -487 75 584 -830 -377 654
2524 654 123 -400 -267 535 548 -474 -374 563 362 -284 -267 409 329 -523 -483 462 254 -413 -388 350 151
2545 151 -377 -167 345 39 -340 107 -22 279 -525 -438 516 488 -461 -206 155 208 -489 -172 356 282 -520
2566 -520 165 291 110 -290 -240 446 58 -356 -408 66 4 -356 136 436 -131 -615 130 532 260 -314 68
2587 68 442 -196 -92 317 194 299 -308 -394 670 98 -546 81 385 284 -218 135 274 3 -585 11
2607 11 489 121 -354 -35 341 -36 -373 -442 348 140 -226 -190 615 145 -453 -27 255 -167 -360 72 254
2628 254 114 -314 -50 380 -188 -65 -401 325 195 -410 14 375 62 -490 103 599 -193 -381 134 317
2648 317 -379 -565 -173 464 55 -383 -7 667 144 -243 -102 477 -35 -439 183 173 -131 -335 -244 274 -193
2669 -193 -288 -58 172 188 -376 -42 368 -132 -64 93 -113 -157 -385 -67 22 -98 -119 301 135 54 -273 -140
2691 -140 276 407 -237 -72 396 -171 -224 52 114 44 -241 36 308 12 -477 -204 357 181 -260 295 678
2712 678 70 -729 39 506 81 -329 18 462 -206 -323 98 142 -128 1 117 575 -161 -397 -317 350 34
2733 34 -635 132 751 -92 -403 232 98 97 -281 -115 20 -213 -422 136 409 -232 -147 -39 571 -83 -326
2754 -326 289 313 -45 -209 181 524 -258 -485 390 357 -487 -440 29 366 -55 -310 -59 146 -361 -309 -15
2775 -15 314 -182 -364 329 216 -192 -474 191 322 -77 -157 341 87 -302 -331 238 265 -22 -472 382 129
2796 129 -112 -230 -144 -84 -237 -420 -67 155 -372 -152 95 125 -261 -165 70 285 -537 -87 -82 201 -52 13
2818 13 408 438 -274 -122 -49 437 -197 -111 325 288 -95 -206 240 -138 -95 -128 -31 104 -374 -403 345 -31 -195
2841 -195 -80 52 271 -256 -247 142 172 -362 -478 100 272 -160 -246 31 116 48 -333 234 388 -271 -168 44
2863 44 448 -447 -178 359 105 -591 -377 -23 213 -90 -415 94 474 -176 -183 198 183 77 -161 303 504
2884 504 -38 -282 267 403 -239 -259 -43 439 -128 35 518 298 10 -208 220 154 -510 -518 584 378 -280
2905 -280 -151 251 314 -250 -249 408 86 -358 40 107 278 -249 -249 484 419 -602 -365 462 266 -210 -357 644
2927 644 32 -512 89 98 -49 -400 -379 380 170 -245 -131 142 407 -475 -314 318 52 -467 136 538 425
2948 425 -182 0 486 51 -262 58 463 183 -418 -183 342 15 -692 -71 55 -92 -71 -322 370 25
2968 25 -612 -274 642 -47 91 315 293 -19 -490 177 434 192 -201 -96 269 374 -182 -23 169 138 -154
2989 -154 -169 429 89 -337 -67 179 65 -223 -126 263 -1 -667 -65 116 174 -243 -36 405 76 -514 -19
3010 -19 444 100 -73 71 559 204 -341 44 318 0 26 -43 436 152 -389 -5 369 115 -141 -135 478 -47
3032 -47 -518 -111 589 41 -327 -87 330 106 -227 -270 220 -158 -66 -135 259 40 -17 180 77 69 -527 -172
3054 -172 404 -39 -220 38 471 -128 -284 234 405 -104 -182 -53 173 251 -476 -102 181 140 -339 -99 357
3075 357 44 -278 -74 205 47 -328 91 350 -33 -360 62 62 113 -200 -102 383 0 -82 -60 237 -93 -297
3097 -297 -366 661 -12 -461 146 420 -308 -445 198 355 103 -25 247 328 53 -106 122 508 -88 -424
3117 -424 21 333 14 -422 54 376 -33 -427 226 101 -238 -342 131 495 -67 -413 -41 612 -146 -297
3137 -297 -9 446 220 -165 289 220 -160 -280 20 359 272 -489 247 416 -302 -359 -219 531 -158 -542 98
3158 98 249 -99 -488 209 97 -158 -227 235 541 42 -192 -155 226 -69 -428 73 499 -13 -88 151 448
3179 448 -30 -321 301 589 -487 -381 191 200 26 -15 236 270 -297 -461 387 88 -285 -466 431 359 -277
3200 -277 -395 262 279 -140 -461 265 161 -13 -69 345 107 132 -145 8 356 -347 -183 -16 82 -260 -167 102
3222 102 124 -377 -16 195 -26 -277 -162 129 -12 -281 -98 310 248 -51 -19 337 312 -198 -252 398 197 -286
3244 -286 -163 -12 434 20 -337 312 365 -240 -196 182 265 -153 -300 194 205 -447 -323 86 113 -191 -231 413
3266 413 382 -111 -218 161 293 -347 -381 61 199 -148 -275 206 296 -306 -252 506 137 -182 -121 9 37 -442
3288 -442 -436 296 320 -286 -61 337 240 -296 -117 286 134 -304 -218 281 341 -72 38 347 7 -166 -55 279
3310 279 408 -619 -319 582 386 -457 -355 317 17 -275 -382 374 -27 -284 -258 461 126 -298 -394 -183
3330 -183 448 -319 -544 394 75 -275 -418 471 87 -289 12 426 2 -358 -54 440 257 -552 -105 422
3350 422 71 -405 -106 434 178 -530 -112 553 196 -476 54 184 50 -379 -55 4 104 -508 -162 157
3370 157 23 -239 -38 440 249 -404 -42 84 326 -219 -179 214 -63 -407 201 138 103 -693 -330 75 -23
3391 -23 -116 -117 343 177 -238 214 383 -1 -244 -84 248 159 -251 -162 360 -126 -335 -19 436 -18 -110 -36 299
3414 299 -39 -106 41 99 -19 -246 -80 380 -268 -82 211 212 -32 -446 -146 640 278 -442 -51 494 385
3435 385 -166 -260 509 7 -434 -39 227 51 -120 -116 190 -90 -479 -187 95 207 -424 -208 374 218 -342
3456 -342 113 327 236 -53 23 318 -122 -429 37 535 -96 -192 -87 383 193 -408 31 247 -120 -185 -107 177
3478 177 169 -402 -9 289 20 -381 -222 310 -107 -645 51 447 -19 -32 -46 369 42 -366 193 302 93
3499 93 -244 276 432 -14 -397 47 354 102 -310 49 90 58 -147 -277 18 -61 -218 -213 232 113 -261 -11
3521 -11 236 18 -281 -292 367 -223 -240 -162 324 -165 -579 -105 228 225 -146 -126 139 -68 -240 155 104 -41 -420
3544 -420 219 520 -281 -366 79 180 21 -438 123 393 -413 -219 -218 379 140 -302 -101 588 -50 -432 -114
3565 -114 482 -20 -461 203 324 -224 -196 86 429 -122 -385 187 305 -282 -350 -136 165 -323 -414 226 77
3586 77 -145 -311 123 274 -292 -395 7 307 -376 -111 66 335 -197 -297 223 506 -97 -389 446 402 -422
3607 -422 -293 23 41 -165 -425 367 68 -23 -269 277 40 -130 -455 373 56 -205 -193 291 223 -241 -27
3628 -27 336 28 -195 -189 -47 396 131 15 -3 157 153 -229 13 207 -374 -196 426 360 -312 -79 251 293 60
3651 60 -433 121 270 -8 -109 153 68 83 -119 80 218 71 -335 126 331 -208 -212 565 360 -309 35 -237
3673 -237 -108 -129 -291 -374 341 -59 -162 426 89 -304 -423 14 504 -195 -215 22 304 -29 -49 4 261 59
3695 59 -23 444 145 -278 -301 223 75 -354 -376 27 49 -293 -261 32 222 -249 -403 202 163 -197 -280 144 409
3718 409 -231 -193 156 237 -232 -113 215 231 5 -338 245 9 -105 -278 259 214 -152 -488 514 122 -356
3739 -356 -93 382 450 -378 -117 180 2 -73 -155 99 321 -388 -123 1 366 -151 -259 458 287 -444 140
3760 140 97 8 -258 -31 371 4 -233 -236 270 179 -146 -73 183 111 -346 -158 128 34 -416 -80 285 238 -472
3783 -472 -188 591 211 -245 139 198 30 -210 -134 313 -115 -209 -2 201 190 74 93 256 96 -355 -221 257
3805 257 -42 -36 -306 224 2 -429 -76 385 131 -335 -62 14 55 -129 -66 327 159 -283 -18 115 102 -204
3827 -204 -130 247 78 -312 -144 -64 -32 -41 -143 374 170 -274 -64 271 72 -194 -4 -49 90 -173 -217 483
3849 483 62 -205 -129 247 -71 -244 127 299 87 -552 -176 65 107 -231 -6 364 -19 -406 -197 362 96
3870 96 -297 -3 271 90 -462 -271 95 96 -47 -283 216 280 -263 30 491 -177 -278 126 227 197 -47 -154
3892 -154 322 50 -317 -202 338 266 -282 3 6 -89 -630 93 151 53 -258 -327 449 102 -446 -97 -111 122 -152
3915 -152 -101 230 -36 -274 -288 379 -77 -415 -26 342 13 -268 -331 370 113 198 43 501 114 -447 196
3936 196 175 69 -298 -11 398 102 -133 145 135 -83 -57 -374 320 218 -162 66 235 22 -106 -63 279
3957 279 128 -341 148 68 65 -119 50 353 254 -470 -164 536 -180 -271 -25 364 -27 -411 128 456 -60 -186
3979 -186 48 267 -110 -251 262 76 82 -452 246 448 115 -245 165 467 48 -79 -154 244 -123 -485 245
4000 245 166 -33 -53 -149 152 5 -362 82 273 157 -119 -219 45 6 -433 -209 520 -106 -159 211 246 239 72
4023 72 174 538 -91 -66 132 97 -91 -92 110 151 -318 -163 242 -12 105 -44 78 307 -200 -173 175 148 -19
4046 -19 -387 189 436 -12 -193 29 98 -107 -257 6 270 -99 -378 179 107 -238 -139 178 -84 -143 -107 -75
4068 -75 75 -205 -315 54 319 -66 -262 -24 4 73 -68 71 470 69 -299 193 178 -161 -91 172 213 -198
4090 -198 -305 -11 70 -252 -333 -65 342 -133 -41 99 364 -172 -32 -54 228 105 -332 -152 285 -332 7
4111 7 -21 -5 -32 -252 140 430 -192 -240 -60 399 49 -165 147 164 83 69 -37 63 225 -452 402 272 -227
4134 -227 -148 104 102 -242 -377 -69 304 -661 -141 302 108 -269 -525 89 314 -74 -134 127 284 -64 -211
4155 -211 389 198 -360 -43 249 135 -80 -276 71 444 -405 -187 405 218 -46 -212 24 429 -133 -100
4175 -100 14 467 -188 7 226 457 82 -328 283 38 -69 -266 159 -34 -48 -5 -16 -38 -239 -134 118
4196 118 215 -312 -393 219 264 -329 -24 406 51 -164 -292 318 30 -171 114 248 306 -231 -508 471 286
4217 286 -154 -246 159 109 -297 -49 353 220 -453 -75 255 359 -311 -118 214 157 -241 -251 380 154 -591
4238 -591 -301 148 25 -57 165 213 359 -3 13 41 -91 -343 -324 149 -104 -86 -24 25 277 -94 -92 -119 66 -264
4262 -264 -322 233 87 -64 -50 128 14 197 209 141 -35 -394 -74 210 289 -38 81 233 90 0 -91 45
4284 45 -16 -400 54 240 75 -289 -106 154 181 19 -359 142 506 -219 -227 -67 -185 -156 50 136 485 -304
4306 -304 -173 126 138 -114 -297 171 322 -157 85 135 301 -176 55 135 240 -397 -235 45 -220 -309 -60
4327 -60 263 150 -227 47 462 87 -177 -163 337 123 -258 -254 419 -16 -277 -59 -112 265 -309 -4 311 -24
4349 -24 -198 -68 78 280 -351 -4 186 32 -176 -17 269 261 -508 -139 187 145 -213 -36 94 126 -141 16
4371 16 412 -49 -144 -44 345 82 -145 -34 207 40 -228 -33 77 253 -84 -126 258 -85 -114 -66 140 -41
4393 -41 -281 -21 352 -153 18 29 -152 -278 -8 -112 158 94 -39 112 99 1 -185 -40 199 -54 -391 -72
4415 -72 317 137 -369 55 299 242 -60 -64 138 -52 -135 174 389 41 -309 470 -127 -146 -54 -143 517 -59 -289
4438 -289 193 72 -24 -167 -18 -74 -2 -83 17 173 -26 92 -122 371 138 -297 -138 202 29 -27 -23 52 -128
4461 -128 -249 206 90 201 -18 -298 178 -180 -14 194 331 -230 -299 -28 260 503 -508 -36 208 375
4481 375 -270 13 71 94 -350 -63 270 38 -170 -22 336 -50 -369 -6 178 -65 59 -130 139 73 -168
4502 -168 21 286 -128 -227 -182 179 11 -128 26 232 36 -539 -92 -69 186 -449 44 339 17 -548 25
4523 25 222 57 -270 -84 142 -70 -48 138 118 -96 -499 -75 189 -356 -250 135 178 78 -50 145 305
4544 305 -458 -507 159 365 -196 -480 28 281 -352 -44 250 20 -196 -108 84 310 130 -391 53 246 -105
4565 -105 -38 100 400 -202 -263 343 106 -193 -218 273 76 -218 -36 85 -18 106 -160 171 445 -124 -13
4586 -13 181 254 -243 -208 57 329 -352 -268 59 112 -166 -26 55 358 -17 -235 354 59 -57 -123 431 185
4608 185 -119 -56 211 457 -272 -256 -63 47 -52 41 339 206 -184 -220 90 435 106 -126 258 314 -40 -206
4630 -206 64 167 -415 32 371 46 -30 47 134 238 15 -376 -31 139 -407 -179 311 294 -134 -196 49 145
4652 145 -359 -82 78 -163 -231 -167 115 89 -26 -221 150 140 -258 -235 481 65 16 -95 182 218 -229 1
4674 1 -17 263 -158 137 20 12 71 -79 255 57 -153 -302 176 170 -154 -423 254 91 48 -176 170 76 136 90
4698 90 78 -38 -57 -70 -121 142 -296 144 86 112 -397 -250 306 262 -290 -70 129 107 -173 -340 2 19 -164
4721 -164 111 291 -42 62 -285 355 -124 153 -108 55 -121 -92 -128 76 146 -112 -267 78 444 -314 -169
4742 -169 153 139 -127 -137 28 85 124 21 367 127 -279 19 221 -115 -47 48 143 133 -231 -212 126 152 -33
4765 -33 58 196 -1 -96 -111 64 31 -450 62 180 -133 -218 -36 114 314 -203 -250 272 222 -350 -142 192 50
4788 50 -406 -119 159 -93 38 0 258 -52 -359 152 73 -170 -232 90 -6 13 -169 127 43 17 -136 -164 -21
4811 -21 -122 46 -205 192 252 -106 -191 296 -149 -199 168 195 35 -464 124 433 181 -317 -128 432 -93 -402
4833 -402 107 177 11 86 -110 342 -89 -321 174 491 -19 -526 60 39 59 -84 -181 297 -112 -23 152 180
4855 180 -224 -122 -73 137 -23 -271 144 -28 -181 -106 -227 126 -113 -37 160 64 -65 -254 -62 246 279 -325
4877 -325 66 263 418 -302 -27 417 -1 -314 110 89 28 -255 229 151 243 18 -228 -53 57 -163 -124 202
4899 202 -186 -223 -108 136 7 96 -198 141 -61 -190 80 -311 -55 -66 -121 126 -227 -170 24 535 -35 -34
4921 -34 137 62 55 -15 160 183 176 67 -67 41 161 -330 117 162 -35 -298 -132 251 -318 -136 256 484 146
4944 146 -245 187 292 83 -269 66 194 -108 -16 225 158 -12 -75 7 170 -14 -187 -115 175 -246 -359 -59
4966 -59 267 48 -214 100 -40 0 -248 72 229 -32 -69 42 -22 -139 -420 -283 125 109 -15 79 -2 -23 -26
4989 -26 247 296 -62 -131 -154 85 -63 -369 -138 121 -73 -320 -158 114 -18 -39 -46 11 -211 18 182 12 -109
5012 -109 -59 255 300 157 -36 230 374 -123 17 -53 169 -28 -288 28 83 -194 -375 76 153 -19 -88 -80 -26
5035 -26 -111 -411 180 79 -209 -240 96 12 -192 -325 16 -40 83 -347 361 -108 11 -167 -4 163 45 -24
5057 -24 307 175 -509 157 -23 255 -101 54 253 -13 -116 -294 -163 -16 -176 -422 140 264 -144 -158 -34
5078 -34 100 -14 -41 286 64 147 184 204 198 -184 -16 1 171 -229 50 54 550 -78 -220 274 240 -82 -244 27
5102 27 368 21 -272 320 30 -61 -117 394 95 -102 -12 301 140 -307 -29 70 304 -127 -285 41 -8 -215
5124 -215 -67 312 218 -299 -24 160 -27 -422 -135 181 88 -11 -247 -121 288 -28 3 49 156 91 -173 203
5146 203 353 -169 -254 14 161 -74 -50 -143 420 -169 22 228 217 -105 18 291 244 -162 -163 427 31 -84
5168 -84 -199 77 200 -335 90 2 87 -229 -53 156 240 -142 22 203 -49 -84 -151 121 24 -250 -186 250 12
5191 12 -182 -50 208 227 27 -41 94 -109 -146 -49 248 -25 -139 -180 182 -112 -145 201 267 150 -440 71 30
5214 30 -96 -152 -30 215 268 -285 -202 173 -92 -109 -86 45 25 -238 39 -149 316 -255 -11 76 72 231 -69
5237 -69 255 253 -272 -115 -56 -116 -218 224 393 -172 -94 53 209 -54 136 219 105 -240 -206 16 262 -9 -203
5260 -203 37 -28 42 -121 -217 -11 16 -41 48 -198 2 -231 64 256 73 -238 -461 100 37 -215 149 401
5282 401 -144 -187 250 4 233 -16 -252 -169 2 -112 70 -1 111 -107 -111 -78 -23 -31 -383 410 5 -64 -59 288
5306 288 -390 -194 -114 185 66 -19 -29 386 287 111 -15 185 66 -262 -136 234 14 -211 138 -61 56
5327 56 -193 -279 178 -174 -108 -337 66 -33 -285 71 247 2 -37 -92 237 -30 -287 117 145 -32 -59 -93 63
5350 63 195 -130 -83 68 17 -204 -9 -66 8 -238 32 43 -105 -152 -303 -76 -163 -64 -220 159 53 -104 212
5373 212 121 61 -159 -40 247 28 -63 -52 153 -172 -266 201 177 -118 -178 -182 -13 -157 -191 -116 18 -74 -85 6 181
5398 181 -55 -143 -52 48 120 -215 51 40 -3 -152 160 121 -174 -114 118 86 -180 -19 83 -18 -45 1 88 39
5422 39 -100 88 226 298 -130 -322 116 40 41 13 111 275 -151 -304 -33 231 17 -82 29 237 141 -68 -8
5445 -8 -14 -286 -86 -183 -30 -190 -111 -112 326 -186 -58 187 4 -173 -11 245 167 -66 -134 -137 207 -37 -140 216
5469 216 134 -2 -41 442 44 117 -261 -5 44 -390 33 93 -17 -189 -81 -2 251 -9 -189 7 257 80
5491 80 -35 17 -30 -53 113 87 257 -225 5 16 351 -112 -156 230 69 162 -364 362 461 -312 -207 -33 263
5514 263 -122 -346 -5 304 1 -93 256 57 -126 -205 -85 159 54 -64 -57 -19 64 -42 195 106 -193 90
5536 90 260 197 -5 -280 211 66 -119 -259 14 -39 -177 68 -51 83 -369 -154 -227 -43 -22 -125 191 362
5558 362 -232 -41 -180 17 -246 -277 350 312 74 -10 226 -129 172 -163 250 158 -101 -158 329 351 -262 49
5580 49 52 -107 -381 -100 44 347 51 -133 140 -171 11 -192 263 17 49 -81 124 -257 -74 -61 329 95
5602 95 -215 -140 71 352 -232 72 151 151 74 -141 75 108 -56 -379 200 83 -277 -32 266 54 -166 50
5624 50 126 58 -28 -141 127 89 -42 -148 327 36 -92 234 -82 128 -439 -78 72 186 -283 -286 78 -263
5646 -263 -1 -248 170 160 -229 -215 73 214 -81 -34 172 -81 -146 49 210 -91 -151 -49 1 -16 63 -388 -155
5669 -155 -60 -269 -259 83 336 -199 49 287 150 90 -168 200 -133 -18 -239 67 21 -93 1 75 -79 -63
5691 -63 23 -82 -271 -63 -351 13 -56 24 -75 360 17 31 -182 -263 -96 -81 -313 120 -151 -464 237 190 -222
5714 -222 -399 -148 249 139 -74 -117 152 219 -49 -277 153 380 -46 -100 -78 252 -61 117 78 -37 25 -40
5736 -40 196 -38 -276 -180 273 85 -248 -6 -34 154 -154 139 -66 13 -46 9 -48 197 -35 -309 147 43
5758 43 -41 -84 349 -87 17 10 265 109 -289 199 93 -60 -92 87 186 -209 -243 -5 -58 12 -120 -14 -5 -128
5782 -128 -149 190 29 -288 -198 55 254 28 -158 22 38 221 29 126 80 -102 -80 53 -6 127 -135 -44 247
5805 247 -116 -239 -50 141 259 76 167 17 338 -64 -115 187 69 -139 -56 139 -185 -168 53 382 28
5826 28 -70 -106 45 -74 -191 26 145 131 -330 -3 -30 43 -424 221 77 -83 -188 40 66 -140 11 127
5848 127 91 -10 -96 103 -114 92 12 82 181 48 31 -116 235 -142 -92 -108 86 -368 -129 -75 48 106 60 237
5872 237 84 -73 -115 -126 -15 -60 -189 -48 -228 74 -11 104 -15 -40 2 67 174 -31 40 139 -104 -331 -282
5895 -282 45 214 -69 128 29 270 -176 61 -118 2 -279 -168 214 362 -150 -246 177 -120 -185 -96 35
5916 35 40 -139 -1 228 110 41 -388 33 254 -72 85 74 240 -26 -266 29 203 -197 -338 -15 -25 -272
5938 -272 -178 70 191 -286 1 -113 41 -62 -305 240 75 -226 148 -166 -38 -148 -125 111 240 -43 -348
5959 -348 184 228 174 -312 33 -37 252 -212 280 13 107 -221 -109 130 -87 19 85 -138 -199 -240 -38 228
5981 228 -201 -117 -134 118 -31 -304 26 74 -72 -336 321 15 103 -252 50 105 -163 -178 8 44 -237 -198 207
6004 207 189 -230 -117 199 -57 -33 178 -119 273 -157 64 234 38 -27 -267 18 160 -128 -209 224 -87
6025 -87 -162 43 183 87 -4 98 180 287 -258 -218 -59 134 51 -110 56 -16 -40 -84 332 198 -43 21 22 26 -199
6050 -199 29 -172 272 73 -106 -17 131 -259 19 94 -130 -37 -7 276 74 108 87 -5 147 -54 -102 36 194
6073 194 -303 -127 3 -69 -160 -9 228 61 -143 -6 176 4 -52 -57 102 -206 27 131 60 41 -124 -61 166
6096 166 56 -169 -47 6 55 40 -124 226 63 111 -194 -43 -54 -70 51 -92 -149 49 -104 293 199 17 -110
6119 -110 -6 146 -136 46 14 284 -57 -265 291 168 -470 64 -68 56 132 -254 78 303 -104 -170 258
6140 258 171 -53 13 91 135 -208 121 44 161 -95 -118 -11 -101 -18 69 152 -367 -7 172 184 17 -455 -133 -179
6164 -179 -81 -192 -16 201 170 -119 255 -151 -14 -25 -180 97 111 -134 -173 107 -150 78 200 199 135 18 20
6187 20 306 29 -123 -43 240 162 -153 -114 351 -92 -125 -279 310 343 -111 -245 195 81 -205 47 204 -169
6209 -169 -225 -56 121 -96 -5 11 107 12 124 -136 207 37 -212 -111 123 61 -237 185 -18 -204 -12 -277
6231 -277 375 -108 -8 100 -166 -99 -164 159 77 56 30 87 -9 97 -260 112 59 -32 -231 61 101 -72 -63 282
6255 282 -222 -299 55 -195 75 -122 -121 -478 101 -161 -157 263 194 73 -3 201 206 -13 70 38 505 141 -98 131
6279 131 204 -211 -248 -24 101 -151 -107 -14 114 0 -53 101 -20 -40 -227 3 188 33 -273 138 82 -288
6301 -288 32 -41 -212 35 99 80 255 7 48 240 101 80 -244 101 64 -425 -4 -177 -212 -19 -112 204 31
6324 31 -219 -210 77 259 -91 -295 -74 72 -195 147 2 38 -28 103 193 103 109 -131 13 246 46 -134 310
6347 310 92 10 -214 140 -81 163 -215 44 130 13 -258 -21 -103 -101 -3 64 -176 -220 -105 7 484 -27 -165
6370 -165 -55 -18 -79 23 135 35 18 -213 181 58 -64 51 53 247 -99 -51 -96 128 -153 -513 36 -24 -78
6393 -78 -10 249 38 -20 -212 101 295 103 42 42 60 -267 -265 439 -63 -296 -396 221 181 -174 -217 48 132 -116
6417 -116 -218 -180 -31 5 66 87 -158 -316 -256 151 64 -189 -7 30 -133 -183 -120 185 13 -135 84 241 23
6440 23 -126 86 -19 146 -13 -104 59 -91 -236 80 209 -39 22 -113 83 126 -118 29 94 37 -30 -239
6462 -239 140 125 -118 38 382 290 124 -240 252 1 -276 94 100 44 -24 102 121 2 2 12 95 44 -92 -20
6486 -20 161 -188 35 29 186 -90 -167 2 172 129 56 -100 67 312 -62 -32 93 -83 -84 126 394 19 227
6509 227 157 186 1 -106 6 75 -111 -63 -336 -119 19 -103 -68 -145 37 -149 -249 31 90 -128 23 159
6531 159 -54 220 -138 41 67 -89 -232 115 -146 -128 148 205 103 57 102 80 62 153 -69 168 10 -160 109
6554 109 36 40 66 -281 61 50 -50 147 -191 385 -179 18 -120 373 -55 -200 284 56 16 -90 23 -100
6576 -100 -158 361 -174 126 -207 -105 427 -89 36 -73 26 27 -141 -10 133 85 27 -51 288 26 -134 9
6598 9 145 30 -73 -1 284 60 -89 86 62 88 -40 155 66 299 -70 44 208 176 -79 228 -23 -158
6620 -158 -95 105 -66 -31 -216 -37 251 -87 77 173 234 133 -130 -25 62 29 -309 36 -121 138 -303 -89
6642 -89 86 139 -48 -91 162 124 -64 -33 194 82 128 408 282 33 -124 -20 366 96 -118 59 43 41 -155
6665 -155 -9 239 -10 -31 190 79 182 -148 204 227 -22 129 -209 -139 -277 -115 68 143 23 -163 -48
6686 -48 0 -275 33 222 135 -16 56 217 106 12 -9 -49 -9 -14 -91 -63 226 115 -87 164 196 -65 -202 1
6710 1 207 -7 -18 -14 175 131 -209 52 256 199 -147 -172 -39 2 -184 21 315 14 134 105 36 249 -138 -17
6734 -17 229 380 -28 328 201 40 0 292 54 240 -52 -77 490 8 14 82 148 -178 -115 -25 254 -89 -221
6757 -221 207 285 223 -81 101 168 22 -93 89 3 334 67 28 209 366 -454 -78 71 -91 -511 -278 21
6779 21 156 -64 -248 227 -138 75 -200 -1 207 166 -136 -53 58 -42 144 243 -95 -193 23 163 127 -179
6801 -179 42 193 79 97 -10 60 -22 -131 -17 -28 40 -111 62 149 -65 92 110 280 -82 -178 88 -15 106
6824 106 -502 48 85 128 71 -61 91 -18 -266 91 214 -96 -88 150 -35 113 1 124 -108 -132 -30 -56
6846 -56 63 110 -241 33 211 110 -30 29 47 -57 -75 277 -129 34 -48 -17 61 71 -26 168 268 -16 127
6869 127 -12 14 13 -120 397 9 -156 154 -51 2 92 -46 100 95 12 -56 231 61 236 -172 277 -96 86
6892 86 -89 -176 -141 -170 -146 -53 -87 -75 198 25 104 -157 -23 29 -60 -113 49 46 214 -44 -112 -69 -203 179 -105
6917 -105 20 214 80 -228 -15 180 -35 90 286 99 -59 323 -27 142 -222 -296 223 251 146 87 38
6938 38 223 55 -222 124 306 231 -115 2 21 -14 -56 -53 56 -128 55 202 197 80 -72 190 212 -41 -247
6961 -247 141 106 -358 34 125 27 -126 -204 -90 -126 -71 -151 -51 249 -290 -180 -82 -2 -199 -230 4 53 16 34
6985 34 -4 87 37 -11 169 -52 0 214 96 -33 -255 23 113 316 -25 -157 236 43 -123 42 186 -63
7007 -63 -184 -43 -62 174 23 -135 57 -140 -283 55 -44 224 -157 -14 230 -187 -124 -231 -299 101 -93 -163
7029 -163 210 43 -242 -53 174 60 -99 -209 270 37 40 -96 -59 -17 -4 -71 99 150 -138 -68 36 -83 -118
7052 -118 215 271 161 -36 -174 186 -63 -54 128 99 195 -9 -20 24 -180 -10 -101 12 19 -137 311 -105 -115 37
7076 37 -95 -22 -95 -27 -38 323 -66 5 -225 -47 37 -222 41 77 -196 -141 -247 240 -117 -161 205 9 96 -17
7100 -17 -210 -44 124 -118 95 -359 36 -11 210 268 165 -130 -70 253 -40 -177 159 115 -165 -97 37 161
7122 161 -165 -24 239 -101 -130 -108 -69 188 115 -54 -218 212 310 -105 25 62 -329 -198 51 145 -88 -115 -202
7145 -202 189 46 -412 -20 204 -85 -152 188 56 -90 -255 -173 412 124 -163 260 88 -3 -337 -120 -147
7166 -147 -311 15 40 149 -190 -175 -81 166 -15 -172 -3 12 129 -88 120 61 39 -214 116 86 -45 147
7188 147 40 191 353 -135 51 260 -126 -152 -116 145 -18 -96 246 105 115 225 75 112 204 67 152 214 -5
7211 -5 230 -95 186 -259 -169 51 431 44 -232 210 122 91 -52 -151 230 75 -206 396 103 -15 -158 32
7233 32 172 69 -252 -83 95 -23 122 -7 -66 -48 -274 -27 -145 -126 140 -111 241 -143 -228 51 89 -189
7255 -189 58 -6 190 90 11 -35 -71 102 -123 -57 33 -161 -295 212 10 -2 82 188 -187 -180 -200 191 273 -87
7279 -87 69 56 270 -59 -51 -189 236 103 -25 6 2 -41 -312 19 28 126 -184 337 -149 13 -256 82 228 -119
7303 -119 -87 126 -14 -139 -226 -129 65 -100 183 321 222 56 -131 -11 131 -268 107 -51 186 26 118 94
7325 94 120 158 154 34 -51 -22 51 -15 -111 68 -476 87 -138 -179 160 104 109 164 -47 119 106 -121 -214 143 69 -28
7351 -28 9 -197 267 -52 -104 -107 115 -31 -46 -6 132 -63 -42 -194 -98 -186 -151 293 70 69 10 32 31 1 34 171
7377 171 170 18 -100 34 -74 -145 -61 19 -17 89 -197 122 -46 5 15 323 84 115 47 -71 -52 -145 -48 66
7401 66 -178 -244 -66 39 88 -290 102 141 -159 -70 -65 36 276 -605 155 -43 -56 61 -107 28 67 34 -148
7424 -148 11 122 -93 -246 -43 77 -289 -220 -15 -126 -232 -45 79 99 -83 -67 73 -80 -26 -28 226 -77
7446 -77 60 82 -83 95 6 -235 41 -102 -367 170 252 79 -27 -155 199 -185 188 84 330 -24 -90 -45
7468 -45 203 -31 6 -159 115 -173 74 -69 113 -21 -17 202 -129 40 -263 -94 295 55 -172 3 -11 98
7490 98 44 -23 93 -12 47 99 210 268 122 123 -22 188 163 -50 23 224 -82 0 196 266 -525 113 118 85 -133
7515 -133 -95 -73 16 -214 -15 248 -185 -187 -141 220 241 139 -101 126 -34 -320 228 204 -174 -288 2 -208 -86
7538 -86 -7 -78 86 -97 -26 117 206 -131 -227 150 83 114 -226 -48 277 10 -79 -286 156 81 -401 -22 -2 74
7562 74 -1 -121 -18 -147 48 -14 -22 76 -67 -31 68 56 -66 -110 175 235 205 177 161 -112 -247 151 -4 -19 -66
7587 -66 108 -3 35 -148 72 170 -102 -58 -39 -40 -33 -35 129 242 -103 141 -177 194 -72 -302 -52 319 -2 154
7611 154 269 160 232 -405 -114 340 14 -146 -175 -38 -133 -92 -93 -159 22 -44 -134 -39 -236 -269 5 170 -123 -167
7635 -167 11 36 81 -176 123 340 -69 -152 -187 -65 -89 -63 163 68 283 -12 276 401 -217 -28 -27 -83 52
7658 52 -96 335 138 34 53 102 42 15 -278 135 144 -106 -53 293 -6 34 85 216 98 -115 80 -163 248
7681 248 -299 -22 95 55 97 -110 -269 289 86 -31 -28 -109 32 10 -157 25 -231 52 201 87 -14 100
7703 100 -20 120 69 -112 11 -263 6 50 182 69 112 133 -132 115 157 260 -12 154 55 -380 190 77
7725 77 93 11 -34 48 335 -115 -67 0 -119 -144 247 -210 35 -128 -417 90 -23 162 95 -145 -7 -49 -116 10
7749 10 -164 247 119 55 -35 91 279 41 32 -97 -4 -19 -222 1 93 -48 -107 36 359 -87 -6 -244 110
7772 110 131 98 7 -204 101 -228 -104 -17 145 -200 229 -10 220 -225 -245 95 -80 -16 91 -30 80 -21
7794 -21 -158 208 75 32 -115 -142 63 -235 -177 207 279 -214 34 18 -7 26 -72 155 -171 -106 2 177 -1
7817 -1 -130 59 195 72 20 -242 288 -175 -221 -15 -121 287 32 17 -25 128 -36 4 22 -152 -139 -182 126
7840 126 93 -162 207 184 -28 13 -163 -39 -79 -179 386 116 -43 -163 73 -87 9 -10 -237 124 -229 -164
7862 -164 131 -58 272 -240 158 76 284 -25 34 96 106 -4 98 -61 170 -160 20 142 95 -202 65 122
7884 122 -29 152 -49 186 -56 -104 -75 137 184 -22 -101 44 -59 -115 29 179 110 -37 -34 -24 176 -230 -69
7907 -69 -136 -69 202 260 113 10 -3 -117 -102 -143 134 27 32 -129 -81 158 25 312 97 -65 -194 91 -294
7930 -294 -12 58 54 -15 -241 341 -134 126 -29 413 182 -118 -40 307 -203 -265 101 -177 23 -85 -224 -65
7952 -65 170 108 -117 99 -39 -8 125 -196 72 14 75 389 134 -137 -92 56 167 77 25 8 -9 65 -71 -11
7976 -11 122 -92 -125 -12 68 155 108 -2 187 78 170 -234 4 64 -132 -68 150 112 61 -47 147 -340 177
7999 177 13 -160 -216 -293 -74 -107 202 166 125 -36 26 133 -47 -63 -17 81 215 64 -13 -110 67 24 -178 -298
8023 -298 -35 -4 -14 -138 142 223 -220 -51 7 -248 -2 52 208 88 -251 -7 -139 -114 -98 -132 112 -8 -114
8046 -114 -165 206 181 -85 -38 104 77 -187 274 124 -58 26 80 106 106 -47 -124 206 75 -116 -226 203 -80
8069 -80 -424 111 0 60 248 174 150 -114 -38 150 98 -116 76 -156 245 37 -178 -68 186 26 108 -115
8091 -115 250 111 -144 206 172 -120 -167 33 153 45 -11 -114 -111 -146 -229 62 106 -208 180 -179 172 -105 -187
8114 -187 -240 -87 36 5 174 254 -18 -41 52 235 110 -107 -28 220 -169 28 107 180 -44 -28 82 92 -24
8137 -24 -92 -8 98 -49 65 -57 39 -64 -277 121 210 -49 52 94 -253 8 -129 141 -94 -216 207 -20
8159 -20 258 100 -126 178 -61 -53 -187 42 -166 195 114 151 385 -54 -240 43 118 -55 -74 3 -263 138 208
8182 208 37 -1 -49 -21 -91 -111 -49 -249 217
8191B17
$$ Imaginary data points
##PAGE= N=2
##DATA TABLE= (X++(I..I)), XYDATA
0 0 0 0 0 0 0 0 0 0 0 0 0 0 0 0 0 -8 8 -8 8 -8 8 -16 16 -16 24 -24 31 -32 40 -41 49 -56 64 -72 81 -90 103
37 103 -114 128 -143 158 -175 194 -215 238 -263 289 -319 352 -387 427 -471 520 -574 633 -704 782
57 782 -875 981 -1111 1268 -1461 1713 -2048 2521 -3235 4441 -6842 13449 -68246 -226584
71 -226584 -73269 16427 18534 72689 93673 -4051 -56527 -19092 -6382 -19579 8640 317
83 317 9578 79142 37347 -75594 -48989 10051 -19757 -15347 63881 55156 -40164 -36323 20862
96 20862 -17399 -42121 1242 19933 24326 23100 -8159 -18085 -5446 -16232 -28533 13911 51589
109 51589 1328 -21677 32806 12635 -50845 -26500 19964 22138 12724 14250 9208 -14835 -28006
122 -28006 -20195 1030 28144 9456 -15616 18178 18127 -34195 -34609 497 8913 3061 15061 28756
136 28756 1458 -30132 -24359 -5549 15629 16251 -170 16652 18722 -19159 -23830 1803 7938
149 7938 -1755 5364 25466 9003 -21493 -16808 -7964 -508 8791 1885 8572 13868 -12618 -23875
163 -23875 -4175 6735 -5118 -7108 19449 16478 -15027 -7756 6854 -2012 -5003 -3441 6606
176 6606 16148 3317 -5750 1520 5059 -8285 -18469 10662 26536 -6446 -12166 8469 69
189 69 -15764 -11442 6606 12381 -2415 -3850 4034 2014 -8552 -19768 -1019 21875 2095 -7846
203 -7846 12498 7856 -14742 -15320 7537 15763 -2045 -717 12403 2594 -9563 -12424 -854 13954
217 13954 940 -6609 10849 8135 -14269 -18565 1777 11224 -8160 -5720 17031 6398 -12776
230 -12776 -11106 -543 5802 -4208 -5504 13816 13092 -5113 -11158 2171 11108 -8079 -10086 17790
244 17790 13815 -9484 -7316 4809 3862 -10364 -7702 13042 10019 -6575 -8203 -551 4088 -10033
258 -10033 -13680 11944 14325 -7498 -7579 5886 4450 -13002 -10911 14462 11748 -6151 -1115 7017
272 7017 3302 -8459 -9503 10178 11569 -4215 -3277 6713 5011 -10604 -12849 9700 10224 -9556
286 -9556 -3802 8816 1944 -12904 -10870 8980 7042 -9468 -999 9807 3096 -9581 -9881 8379
300 8379 8877 -8683 -2019 12063 6584 -8374 -9304 10116 9324 -10870 -3292 13014 4995 -9574
314 -9574 -8713 7548 5065 -12109 -2753 11949 3344 -8548 -8397 4310 4021 -10806 -3304 11628
328 11628 4549 -6765 -6167 7031 5757 -11325 -3504 13572 4235 -7401 -1990 9906 4284 -11414
342 -11414 -1741 11454 764 -7341 -2071 6135 3436 -9689 -4652 8167 970 -8097 -3594 6680
356 6680 4461 -11083 -4881 10369 455 -8471 457 8696 2882 -8670 -2007 9645 522 -5180
370 -5180 715 6321 4991 -6440 -4171 9510 2375 -8114 -2139 6701 3686 -9016 -4200 8654
384 8654 -686 -9317 -1158 4248 2430 -5339 -3727 6687 1260 -7566 -2488 5063 4930 -4437 -2762
399 -2762 9882 2476 -8394 -1015 5747 2933 -4123 -1213 8707 2407 -7760 -2236 4339 3148
413 3148 -5976 -4853 8274 2257 -10804 -2772 5937 1415 -7229 -3851 8287 2413 -8911 -1833
427 -1833 5536 2865 -4883 -4191 9642 6339 -8924 -2465 8895 3097 -8262 -3793 10862 4365
441 4365 -8804 111 7549 -965 -8318 -5091 7441 4891 -8590 -3343 6613 893 -9841 -4948
455 -4948 10835 4197 -11876 -950 10332 -1248 -8379 304 9749 1952 -8652 1716 9629
468 9629 64 -7026 -1596 8417 2793 -9946 699 11090 -2094 -10542 -206 8722 -609 -10853
482 -10853 1370 8976 -3683 -8616 260 6895 -367 -10218 1353 11049 -1435 -8258 1430 7795
496 7795 -448 -8001 3941 10635 -2944 -6438 2314 6046 363 -7459 650 8392 -2528 -7740
510 -7740 2665 6976 -2979 -10439 1733 8685 -4965 -6000 4151 2418 -3935 -4679 2458 6647
524 6647 -1699 -4960 1023 4852 758 -5949 1645 9563 -2849 -6368 6293 5830 -4622 -5617 3032
539 3032 4902 -3419 -2317 2937 -172 -2051 -4179 -1533 6210 -919 -8627 -17 5560 -888 -5656
554 -5656 1545 6322 -4686 -5517 5882 4373 -1453 -2080 -649 3667 1639 -2648 1594 4127 631
569 631 -5710 -1399 7881 -88 -7887 1752 4503 -3227 -4100 823 3417 -2534 -5240 1461 3641 -604
585 -604 -3492 -2422 4652 1143 -6365 2437 7232 -1257 -4740 1884 6584 -1223 -6088 2925 5108
600 5108 -1093 -2144 514 3716 -881 -7534 708 6893 -1151 -6016 -820 4806 -1842 -8054 2892
615 2892 6542 -3404 -5094 790 4913 -145 -6112 1557 6818 -747 -3822 1571 6187 -487 -7719
630 -7719 2359 8302 -1981 -4236 2975 4242 -2382 -6789 1785 5763 -3211 -4788 2325 4381 -1742
645 -1742 -7911 607 5756 -3359 -4094 4509 4822 -3108 -7622 1564 6848 -1856 -2842 4486 4812 -2546
661 -2546 -6576 2189 7786 -2614 -4274 4805 4621 -3635 -6619 1896 5354 -3871 -4107 4416 3810 -3291
677 -3291 -7564 -889 5665 -2862 -4589 5792 6212 -3742 -7420 1687 5770 -3966 -3610 7239 5093
692 5093 -2089 -3392 1110 3867 -3561 -4772 4823 6266 -1251 -5546 717 4449 -6392 -6890 6868
707 6868 5998 -4209 -3848 2844 1379 -6952 -4680 5808 4635 -1432 -1556 1570 2962 -5155 -6498
722 -6498 6009 7763 -1439 -2792 4130 3480 -7352 -6108 7408 5089 -3400 -393 3402 381 -6484
737 -6484 -5448 3428 4024 -1792 -1258 2610 2571 -5763 -7661 4202 4877 -4015 -904 6178 3152 -5330
753 -5330 -4204 4732 1894 -4376 1032 5452 2876 -1935 -3596 2416 1657 -4354 -1330 4630 3893 -2813
769 -2813 -4795 2278 605 -6790 -1453 5962 2897 -3123 -2775 1752 -957 -5767 68 5080 3208
784 3208 -247 -1805 1636 823 -4931 -2035 4986 4743 230 -1478 2767 1229 -6689 -2835 4270 3247
800 3247 -471 -1227 1944 50 -5891 -2935 2513 2364 -71 -1591 1034 1840 -4584 -3782 2905 3353
816 3353 -31 -1242 3244 3142 -4685 -3588 3316 2226 -822 -461 3924 3144 -3998 -3902 1779 636
832 636 -1748 -1542 2893 4038 -3617 -4951 1836 1099 -3617 -2252 4388 5000 -3806 -3830 2637 53 -4164
849 -4164 -383 5467 5797 -2456 -3817 2497 662 -3807 -1242 5289 5663 -2949 -4314 3171 236 -5890
865 -5890 -2255 5051 4324 -3496 -3202 3469 -747 -6443 -1892 4378 4155 -2354 -2353 4048 466 -5943 -1580
882 -1580 4752 3855 -2352 -1257 5246 717 -6162 -1271 4347 2540 -2580 -419 5435 158 -7019
897 -7019 -2045 3367 1184 -3047 -503 5333 -336 -7097 -1463 3020 171 -2447 478 5751 611
912 611 -5647 -1304 3162 505 -2633 744 6492 1576 -5410 -70 3191 -1143 -3149 897 5413
927 5413 1354 -4723 -1120 1516 -1859 -2921 -173 4549 1613 -4384 -1205 1634 -1775 -3045 -28
942 -28 4493 1443 -3145 490 2628 -1515 -2453 243 3782 2227 -2518 623 3135 -1313 -3068 -331
958 -331 3715 1686 -2746 138 2255 -2041 -3402 -603 2690 1453 -2884 -424 2793 -1137 -3803
973 -3803 -1150 3113 1697 -3035 802 4187 -716 -3141 -291 2161 1896 -1614 359 3864 570
988 570 -2749 -1519 2089 1303 -3511 -416 5143 -188 -4462 -688 1469 -1009 -3288 399 3619 -505
1004 -505 -2265 -787 838 1061 -2789 -1057 4812 1361 -3530 353 3501 -157 -4372 293 5107
1019 5107 -51 -2429 1708 1667 -1104 -3365 -1036 3689 838 -3111 -526 2721 -346 -5357 -1249
1034 -1249 5381 -324 -3962 2031 3200 -2088 -3553 -196 3558 665 -1939 1208 2580 173 -3305
1049 -3305 -1034 4854 1145 -4433 1370 3586 -1430 -3430 634 3312 -1858 -3784 977 2009 -509
1064 -509 -2114 -1506 2288 272 -4156 838 4152 -665 -3958 828 4249 -1060 -3779 2910 3264 -1696
1080 -1696 -1462 1383 2375 -512 -3246 519 3443 -202 -2931 112 3834 -735 -5548 1422 3776
1095 3776 -3023 -3247 1865 2563 -1273 -3397 685 1946 -1162 -1664 646 3391 557 -4087 573 4151
1111 4151 -1372 -2763 2280 3217 -1671 -3007 2140 2771 -2181 -1833 1049 1361 -499 -2871 498 2948
1127 2948 -2219 -3677 1103 2927 -1463 -3604 2128 3258 -3127 -2266 2624 1738 -1104 -1306 2049 3157
1143 3157 -1757 -2426 1654 2832 -475 -2261 2008 3243 -3413 -2904 2829 1759 -1585 -1633 1592 1527
1159 1527 -2593 -2192 1441 1199 -946 -2276 1029 3170 -2175 -2563 2402 1540 -1918 -1034 2239 2303 -1661
1176 -1661 -1022 2167 561 -563 -454 648 2325 -724 -2228 1570 1309 -1791 -1710 1810 1997 -2355
1192 -2355 -1974 2159 -216 -2143 -373 785 1223 -593 -1837 1060 1615 -829 -1870 873 3009 -770
1208 -770 -1975 2636 1921 -2114 -1125 862 1569 -756 -1488 1382 1174 -1025 -1642 -484 1324 -466 -2895
1225 -2895 1395 2574 -1669 -2451 337 1796 -1030 -1836 2250 2004 -1515 -1140 529 1692 98 -2023
1241 -2023 1364 3107 -1228 -1919 958 2122 -1053 -2565 1732 2770 -2145 -1832 920 1378 -1449 -2659
1257 -2659 1579 2556 -1832 -2058 1574 1678 -1762 -2946 1981 3220 -1707 -1259 2191 1742 -1827 -2682
1273 -2682 2218 2913 -1900 -1080 2380 1693 -1988 -2985 2149 3001 -2244 -1819 2655 1100 -2654 -2862 1619
1290 1619 1977 -2508 -1407 2393 1347 -2179 -2391 1586 2256 -2504 -1276 3046 1290 -2641 -1554 2535
1306 2535 1977 -2659 -786 3349 995 -2166 -891 2281 1290 -2706 -1060 3047 609 -2418 -1287
1321 -1287 1723 645 -3016 -958 3023 601 -2428 -748 1511 921 -2269 -928 3153 1083 -2067
1336 -2067 -321 2087 1068 -2293 -829 2988 610 -2096 39 1476 303 -2521 -775 2611 157
1351 157 -1792 -134 841 128 -2418 -1277 2486 741 -1965 -187 1431 249 -1843 -627 2633 615
1367 615 -1684 543 1400 447 -1603 -654 2326 1013 -1541 -26 1180 140 -1660 -1392 1670 589
1383 589 -2280 -411 1292 195 -1856 -1279 1762 392 -2117 -148 1589 328 -1392 -987 1814 1124
1399 1124 -1640 -57 1788 479 -1566 -830 2166 1274 -2060 -126 1465 18 -1492 -1323 1758 820
1415 820 -1914 -532 1460 -155 -1416 -1020 1343 552 -1963 -484 1771 91 -1500 -733 1756 744
1431 744 -1848 269 2848 161 -1807 -467 1636 774 -1954 187 1945 -168 -1543 -387 1280
1446 1280 606 -2243 -827 1946 187 -2216 -869 1299 640 -2228 -169 2527 -123 -2130 48
1461 48 1704 397 -1771 348 2118 166 -1156 85 1099 956 -1657 -752 2281 350 -2023 -902
1477 -902 1820 178 -2430 -525 2328 -673 -1673 174 911 -80 -1519 -394 1536 78 -1273 129
1493 129 1476 724 -2169 -602 2695 345 -1910 894 2028 -634 -1910 348 2150 27 -1228
1508 -1228 333 956 -399 -1600 -813 2317 262 -2259 148 1660 -452 -2599 62 2509 -388
1523 -388 -1878 1188 1023 -563 -1301 -181 1930 569 -1802 790 2001 0 -1982 -56 2256 -459
1539 -459 -2043 1269 1470 -959 -1581 -51 1135 -809 -1450 646 1402 -475 -1539 -253 1597 -175
1555 -175 -2226 1212 1929 -918 -1313 902 1651 -593 -1329 1466 1314 -764 -624 250 1002 -381 -1940
1572 -1940 676 1803 -678 -1491 571 1238 -1076 -2148 1031 1264 -1247 -705 518 679 -490 -1274
1588 -1274 330 1449 206 -373 496 1182 -289 -1776 834 1706 -781 -566 1097 1012 -659 -1381 424
1605 424 880 -533 -586 549 712 -705 -1533 -334 1247 -639 -871 760 1129 -216 -1629 200 1250
1622 1250 -462 -515 687 1029 27 -1046 -2 1103 -811 -1171 769 1308 240 -1478 -502 1067
1638 1067 -681 -1093 1015 1330 -228 -1695 -556 1460 -520 -1516 558 1139 -165 -1023 198 1302
1654 1302 -1172 -1424 876 1347 479 -668 334 1184 -687 -1675 1327 1810 168 -1483 385 1352 -1312
1671 -1312 -1858 1206 1173 -904 -795 525 821 -1170 -1861 776 1373 -388 -1041 408 1569 -1070 -1587
1688 -1587 1308 1419 -1155 -1045 1202 1504 -1240 -1280 1377 560 -1063 -631 954 1479 -827 -1932 1062
1705 1062 1230 -1181 -945 1152 1068 -1222 -1531 1215 662 -1493 -372 1279 918 -774 -806 845 541
1722 541 -918 -279 1375 1298 -474 -999 1010 629 -1218 -221 1357 704 -985 -827 973 479 -1647
1739 -1647 -527 1445 713 -932 -964 964 378 -1421 -353 1103 390 -774 -529 1043 458 -973 -83
1756 -83 1038 643 -502 -638 756 596 -1193 -267 1028 -64 -703 -404 804 315 -1159 -330 751
1773 751 -13 -557 -379 679 492 -921 -502 532 274 -606 -569 911 545 -939 -406 933 461 -574
1791 -574 -165 674 599 -938 -250 963 415 -440 -330 568 743 -949 -829 886 -96 -908 -348 649 560
1810 560 -1128 -563 848 -12 -760 -216 503 983 -376 -544 1045 90 -627 -21 793 438 -828 -695
1828 -695 816 353 -949 -219 723 792 -971 -748 871 328 -963 -478 527 415 -826 -764 1011 306
1846 306 -1037 -293 550 602 -583 -461 1133 553 -1031 -256 999 606 -469 -516 1137 189 -1278 -206
1864 -206 773 289 -940 -634 893 262 -1062 -462 648 513 -603 -679 1073 128 -1127 -301 1068 307
1882 307 -592 -187 1369 325 -1265 -147 1237 316 -665 -251 1149 282 -1121 -316 864 20 -998
1899 -998 -385 839 100 -1301 -212 610 -371 -865 -202 1113 269 -1352 -174 1069 -140 -862 -127
1916 -127 1381 578 -1022 -5 941 149 -722 44 1024 281 -1153 -5 897 -297 -1064 -136 634 95
1934 95 -1172 -20 1292 -435 -1151 119 1010 319 -919 262 974 -422 -904 184 852 170 -801
1951 -801 28 942 -278 -1002 375 1058 140 -911 393 1251 -399 -945 258 769 -242 -659 333 911
1969 911 -552 -859 121 298 9 -583 381 1082 -338 -1028 288 419 -377 -629 628 959 -358 -996
1987 -996 456 263 -255 -374 303 972 -390 -583 -133 467 -248 -812 302 1007 -400 -1032 279 243 -386
2006 -386 -157 607 726 -185 -336 59 387 106 -594 193 927 225 -538 424 511 -199 -131 489 595 -147 -369
2027 -369 295 201 -488 -327 -5 498 152 -593 115 571 -501 -484 85 538 -152 -909 553 575 -232 -632
2047 -632 133 376 58 -786 314 666 -100 -750 221 651 -283 -891 359 632 -604 -330 40 516 -60
2066 -60 -909 -134 734 -98 -712 99 605 -234 -918 286 1141 -422 -751 413 395 -87 -401 226 908 -108
2086 -108 -307 63 562 13 -865 518 1010 -640 -711 616 626 -577 -799 420 693 -631 -301 329 127
2105 127 -448 -442 222 730 -250 -596 609 507 -434 -987 954 671 -864 -484 665 385 -798 -721 363
2124 363 259 -380 -253 505 562 -530 -796 387 565 -862 -416 855 474 -624 -290 592 89 -560 66
2143 66 662 158 -24 -507 49 586 -361 -276 583 355 -550 -470 431 333 -699 -192 707 148 -529 -81 456
2164 456 120 -342 -289 502 46 -9 -569 310 463 -604 -242 799 304 -588 -55 248 326 -634 -263 416
2184 416 246 -386 -153 366 345 -182 -780 590 -26 -436 -278 487 -66 -530 -240 210 182 -507 -21 212
2204 212 282 -389 -697 459 552 -307 -134 606 335 -471 -374 865 73 -645 -128 421 9 -440 -205 436
2224 436 402 -454 -310 486 303 -696 -333 369 359 -549 -369 695 249 -725 -187 427 214 -795 -348 417
2244 417 183 -216 -100 294 466 -635 -141 432 -75 -565 -426 419 106 -328 -230 249 268 -452 -518 654
2264 654 110 -588 156 694 286 -334 32 631 170 -768 40 674 30 -448 -207 537 555 -417 -89 409
2284 409 -151 -341 -216 521 66 -684 -136 541 -344 -537 -106 502 243 -801 -73 484 19 -531 75 533
2304 533 345 -633 134 699 131 -392 -39 631 368 -510 99 575 -123 -460 -2 344 144 -614 44 558
2324 558 -95 -740 -302 434 -54 -253 -121 676 -19 -505 294 359 -228 -436 217 662 -76 -631 310 326 -98
2345 -98 -614 109 765 22 -774 430 238 -336 -529 245 625 -237 -747 218 521 -537 -309 9 688 -302
2365 -302 -361 295 380 -213 -210 228 661 -327 -307 372 206 -503 -209 273 429 -57 -461 367 321 -298 -250 164
2387 164 405 199 -338 299 512 -257 -357 88 290 -237 -104 372 202 -8 -322 82 368 -140 -343 263
2407 263 420 -179 -118 354 62 -324 -279 516 215 -368 -433 348 181 -269 -549 163 331 -452 -204 -63 263
2428 263 -405 -381 -21 301 -112 -158 13 -29 66 -178 60 515 128 -418 54 123 -161 -537 295 456 -252 -76
2450 -76 -53 137 -389 -579 286 378 -17 -227 -85 209 -411 -774 -139 690 -479 -77 115 51 -440 -419 147
2471 147 595 -273 -263 47 118 -488 -234 -137 354 -119 -267 637 368 -425 -613 41 327 -361 -318 538 252
2492 252 -244 -701 -127 244 -387 -475 393 249 -197 -620 443 638 -340 -244 790 218 -349 -70 55 43
2512 43 -420 -244 726 387 -185 -139 188 249 -419 -582 417 267 -374 -173 363 114 -324 -475 257 504 -244
2533 -244 -168 272 198 -195 -324 504 613 -406 -274 179 369 -541 -204 242 85 -302 40 84 178 -242 -128
2554 -128 510 265 -654 249 385 463 -412 -75 371 -169 -306 267 247 -170 -270 -258 376 -13 -88 -245 349
2575 349 143 -210 -354 214 253 -360 45 295 37 -561 -158 583 5 -389 -125 24 -16 12 -318 348 42
2596 42 -720 73 150 134 -388 -154 443 86 -427 324 687 15 -381 -129 -114 -7 -213 -344 450 16 -343
2617 -343 -93 305 -71 -589 14 634 -215 -132 55 306 210 -449 153 472 200 -262 268 278 133 -667 -221
2638 -221 565 -49 -310 225 51 -13 -423 -99 210 20 -326 67 331 399 -390 -258 502 198 -334 63 419
2659 419 247 -435 -129 360 -110 -189 -9 216 -141 -254 -142 252 42 -118 -98 59 287 -180 90 313 -252
2680 -252 -558 160 80 -145 -242 12 311 -127 -395 -11 267 204 -329 14 92 -65 -472 329 521 15 -308
2701 -308 89 154 39 -418 -77 339 -45 -333 -51 333 -246 -622 -100 402 -123 -188 -68 251 -72 -236 320
2722 320 255 -118 -384 48 497 49 -435 254 563 20 -336 122 166 -259 -296 252 243 -120 -244 -94 333 63
2744 63 -512 72 351 -166 -284 120 475 -180 -682 210 405 -52 -442 -3 452 -38 -308 173 369 -296
2764 -296 -119 84 343 -32 -108 107 469 -386 -540 404 232 -57 -381 66 396 -290 -341 251 152 146 -192 135
2786 135 184 -220 -131 511 381 -94 -212 319 470 -163 -119 258 323 -96 -221 470 118 -294 -44 176 394
2807 394 -99 -384 138 108 -402 -324 249 143 -15 -285 166 71 -343 -141 296 208 -21 -74 439 306 -273 -467
2829 -467 376 201 -143 -84 187 414 -99 -127 96 271 1 -275 130 206 -145 15 185 -59 -444 -281 146
2850 146 226 -230 -139 257 307 -32 -150 216 272 124 -311 181 171 -155 -216 158 390 -109 -323 101 440 -256
2872 -256 -346 -32 175 -344 -427 342 13 -169 -235 346 124 -213 -510 331 189 -298 -574 16 488 -409 -52
2893 -52 205 408 -188 -257 278 166 -368 -421 156 283 -317 -561 253 -145 -223 -295 320 214 -191 -142 154 324
2915 324 -283 -434 278 267 -340 -78 314 395 32 -236 466 224 -169 -11 376 286 -362 -350 332 281 -380 -369
2937 -369 261 -46 -516 -33 201 120 -342 -220 251 101 -545 -262 566 65 -488 125 204 390 -317 -270 207
2958 207 208 -234 172 548 114 -523 -19 423 -89 -241 68 425 -200 -141 -217 173 187 -351 -28 191 173 -309
2980 -309 8 274 109 -544 78 306 -175 -235 -130 582 15 -402 -1 220 27 -53 -115 181 -75 -207 68
3001 68 29 -7 -534 -31 193 116 -287 -22 412 -337 23 145 550 98 -532 165 202 -140 -441 332 296 -57
3023 -57 -347 281 412 -49 -310 -128 52 -33 -151 -256 387 -202 -149 263 300 55 -99 -324 373 -90 -123 -44
3045 -44 379 113 -375 -105 295 -180 -449 8 386 -3 -243 -127 303 -76 -186 101 402 95 -296 -48
3065 -48 563 85 -355 11 300 -122 -550 11 375 -39 -518 -4 277 -118 -198 -140 422 -62 -247 -66 534
3086 534 64 50 -4 320 -101 -221 112 247 -78 -390 -31 305 227 -475 42 197 -55 -515 -166 296 -104
3107 -104 -192 -35 205 84 -294 174 485 182 -409 -78 421 124 -248 4 99 81 -264 89 571 -149 -356
3128 -356 193 376 -10 -193 -5 234 11 -658 32 329 59 -472 148 316 -181 -131 117 427 13 -418
3148 -418 256 108 -343 -323 262 419 208 -283 335 662 -325 -293 194 -83 -11 -244 181 378 -295 -196 -67
3169 -67 108 15 -307 149 509 -258 -344 292 292 -308 -114 227 415 -242 -205 395 -8 95 -493 210 363 -218
3191 -218 -352 330 -63 -281 -364 85 516 -229 -452 189 189 -96 -104 218 361 -88 -33 102 161 -183 -19 68 414
3214 414 -135 -131 337 160 -177 -22 155 284 31 -246 254 223 82 -171 -74 153 -226 -389 46 226 -281
3235 -281 -270 221 -79 -246 -149 480 266 -265 -29 163 202 -152 -100 422 495 -190 -285 176 430 -193 -167 240
3257 240 373 -343 -259 158 327 -33 -145 304 137 -59 -271 -7 100 76 -173 304 132 20 -187 83 156
3278 156 -151 -253 499 344 -220 9 126 161 -90 -100 281 371 -179 -237 205 -339 -60 -221 179 460 -551
3299 -551 -70 245 88 -252 -214 159 491 -227 -216 284 393 -354 -57 355 356 -335 -5 224 359 -336 -128
3320 -128 343 160 -280 -298 251 201 -375 -188 421 129 -277 -610 210 185 -154 -94 100 499 -185 -68 318
3341 318 -250 -306 -215 333 254 -145 -103 420 160 -191 -178 301 318 -345 -37 217 161 -293 20 214 -180 -351
3363 -351 -134 169 -46 -288 -133 -2 -12 -212 -263 592 -36 -543 201 323 276 -411 -20 638 301 -102 349
3384 349 547 180 -310 -240 127 29 -413 -108 135 52 -159 -304 404 8 -530 39 -76 -89 -156 -77 514 -161
3406 -161 -204 -23 514 337 -400 -147 400 160 -307 -36 316 129 50 -140 285 98 -191 -295 -10 118 -221
3427 -221 -74 295 144 -308 85 213 10 -229 279 -55 510 -516 -157 313 357 -45 -16 533 268 -333
3447 -333 -234 404 -117 -56 -392 261 132 -120 -33 281 -31 -217 83 -89 71 -572 50 546 -53 -159 43
3468 43 177 -60 -281 -74 381 -29 -367 -266 -36 186 -328 -83 441 49 -167 91 171 -11 -389 -238 468
3489 468 1 -115 142 249 -130 -451 -193 342 -59 -389 -58 424 537 -263 -232 301 196 -265 86 223
3509 223 144 -34 92 780 182 -159 -24 335 -38 -176 -210 582 -292 -649 93 174 -266 -327 -26 398 -120
3530 -120 -486 50 32 60 -394 -19 541 -105 -345 82 288 36 -579 268 849 -211 -447 242 470 -286
3550 -286 -419 47 526 116 -468 -31 480 -211 6 -142 575 3 -412 199 438 -65 -288 86 386 -109
3570 -109 -291 145 122 -237 -297 201 318 155 -571 343 311 -212 -331 -90 404 -430 -360 1 254 -276 -169
3591 -169 107 287 -323 -429 86 305 -17 -440 -143 131 -279 -561 567 180 -78 -103 -1 212 -121 -97
3611 -97 283 325 -263 -229 173 357 -78 -360 -134 264 -570 -267 399 142 -273 -215 214 166 -271 -77 625 126
3633 126 -69 -441 381 257 -288 -414 429 92 -88 -303 314 419 -366 -172 284 -14 -266 -233 -156 82 -148
3654 -148 97 211 -12 70 -407 -63 431 -244 -328 383 325 -53 10 123 521 -94 -139 50 367 -361 -360 188
3676 188 289 -222 -448 37 293 167 -232 189 159 -35 -251 129 -231 -302 -330 133 189 42 -327 133 137 -102
3698 -102 -196 130 564 23 -89 234 501 -191 -290 72 379 -224 -306 271 314 -122 -498 238 246 -247 -470 395
3720 395 35 -157 -261 -39 244 -244 -387 486 337 -102 -229 351 214 -87 -353 64 3 -498 -116 421
3740 421 321 -7 -402 349 90 -190 -75 210 138 -148 -208 170 381 -424 -293 55 188 -344 -122 659 282
3761 282 -245 203 385 218 -117 -260 477 287 -297 147 437 191 -99 -391 365 242 -378 49 -82 396
3781 396 118 -8 83 133 -162 -105 374 89 -148 -111 310 481 -340 -15 310 79 -229 -162 134 119 -328 -183
3803 -183 273 90 -301 -93 143 -36 -109 -95 383 -109 -228 148 1 73 -594 72 345 256 6 -37 223 157
3825 157 -118 -110 429 90 -19 -244 119 266 -53 -53 491 -82 -72 -39 36 -14 -523 -185 -67 207 -180 -177 151
3848 151 -12 -351 -288 329 -110 -209 93 112 149 -320 -248 464 13 -227 -51 -61 242 -263 -206 422 175 -244
3870 -244 -188 341 145 -297 -373 407 69 -285 -285 252 -130 -271 -110 1 404 -556 -177 68 482 -306 -174
3891 -174 411 -128 -184 280 156 164 33 94 197 -150 -226 -62 408 163 -88 -244 99 246 -385 -336 20 126
3913 126 -180 -297 418 -31 -30 268 438 188 -177 -55 443 12 -193 165 248 286 -353 8 283 -47 -361
3934 -361 -52 0 -144 -255 -86 219 -22 -257 -328 106 18 -258 -135 471 300 -453 -10 215 95 -216 -151
3955 -151 97 156 -74 -112 279 -92 -249 226 504 253 -332 176 416 -157 -250 55 120 42 -486 -343 102 -218
3977 -218 -293 15 119 34 -313 -56 263 -346 -227 107 429 -199 -408 -113 353 39 -248 62 174 59 -198
3998 -198 -89 224 -152 -479 53 158 254 -236 -22 102 -120 -295 16 121 -160 -84 63 80 -278 -318 136
4019 136 274 128 36 280 177 -188 -314 391 307 -144 61 33 242 -88 -70 223 291 -63 -284 -73 490 -56
4041 -56 -282 206 105 -331 -14 -34 407 -138 -375 -18 273 -96 93 125 225 -82 -117 -113 79 -206 -62 189
4063 189 342 -132 -108 146 236 -174 31 27 68 -205 -389 28 -145 23 -205 209 60 85 -88 224 101 -86
4085 -86 -19 291 383 -57 -146 87 115 -239 -30 156 244 -257 -279 -49 185 71 -354 24 284 -144 -402 101
4107 101 342 -353 -114 -119 136 280 -23 5 46 -10 -126 106 209 -63 -410 -18 186 11 -242 236 189 -121
4129 -121 -184 5 460 85 -152 158 217 -146 -167 -150 305 111 -262 -8 206 33 -126 290 471 -223 -175 136
4151 136 500 -278 -105 337 661 -249 -61 204 287 -88 -100 291 282 76 -267 152 12 -83 -191 306 189 14
4173 14 -336 293 146 -121 -497 53 310 -158 111 92 182 -13 -206 76 192 -372 -133 258 -12 -405 -137
4194 -137 260 44 -167 -331 47 202 -113 -337 263 204 -189 -54 152 -4 -487 -232 140 362 -15 -368
4214 -368 106 199 -230 -229 357 431 -15 -44 251 -40 -387 173 -1 105 31 -228 179 232 -483 -59 85 221
4236 221 -275 -208 62 99 -363 -104 158 -181 -262 -130 217 -55 -314 -308 147 -89 -17 -271 -81 545 -157 -92
4258 -92 162 18 45 13 -58 131 -23 -221 19 68 -27 -189 193 93 -329 -230 241 206 -99 -154 146 20 -161
4281 -161 18 133 -157 -137 -297 294 163 -54 189 136 64 -8 -171 93 62 -304 -18 187 40 -266 -189 123
4303 123 112 -260 45 -42 -90 -262 -136 105 181 -493 153 255 149 -485 -144 202 243 -328 -224 139 -64 -208
4325 -208 -212 15 136 -404 17 207 -140 -283 -75 367 124 -54 -127 325 190 -129 5 -10 286 -132 -200 343
4347 343 -2 -14 -77 154 196 -233 -15 141 -58 -294 -78 221 72 189 -156 181 226 -139 -218 -40 216 -278
4369 -278 -189 275 71 -299 -308 387 -2 5 -147 373 75 -364 70 404 -112 -280 -45 371 120 -382 -84 157
4391 157 34 -322 -106 266 -95 -181 53 506 287 -95 197 370 117 -356 430 204 155 -473 137 187 257
4412 257 -67 194 225 -84 -126 138 50 77 -121 144 205 -40 -64 387 222 -423 -466 -136 161 61 -147 -7
4434 -7 129 -50 -175 -110 421 122 -159 11 285 -102 -298 -121 144 30 -172 80 385 26 -386 -73 30
4455 30 -39 -212 -125 267 -145 -39 144 272 -60 -132 156 122 147 -390 34 221 -128 -190 -139 301 26 -123 87
4478 87 456 20 -236 199 319 -7 86 -56 276 62 -326 -186 -125 -194 -137 4 -246 -98 -95 7 -176 60
4500 60 -166 -212 69 -1 139 166 -1 -277 -131 -13 425 -278 -199 449 178 180 -23 -281 326 -103 -291 118
4522 118 245 -276 -300 -55 162 -192 -212 150 -19 -209 -399 71 419 116 -423 -80 219 103 -178 156 275
4543 275 -131 -2 64 124 -225 -40 -134 148 -176 -361 184 -6 -20 -97 256 225 171 -310 84 93 -203 -85 -81 177
4567 177 -209 -335 147 66 -216 -27 156 317 -247 -35 170 251 125 -117 -189 113 197 -215 93 236 -318
4588 -318 -3 118 61 -82 -107 289 129 -172 -321 66 171 3 -221 173 15 38 -36 254 94 -83 -299
4609 -299 105 -113 -140 -64 394 -49 -15 -28 -77 126 -173 -59 401 221 -190 -376 6 81 -332 -144 187 -43
4631 -43 -68 -187 195 -98 -21 73 153 -49 -18 -115 190 403 -163 -342 287 327 -275 -276 -75 442 17 37 145 158
4655 158 -219 -233 55 81 -52 -277 161 39 -77 -341 138 267 -318 -65 335 43 -73 -153 155 201 -34
4676 -34 -224 290 108 -255 15 169 298 -470 -311 58 178 -391 -245 23 -85 -87 -260 259 137 -130 -122 176
4698 176 287 -97 -130 381 -39 -319 -32 427 377 -312 -174 162 224 -201 -224 213 -184 -82 -244 121 291
4719 291 -22 -192 -111 134 -453 -164 47 75 -237 200 267 136 -272 4 57 404 -31 -99 289 59 119 83
4741 83 242 377 123 -168 88 86 -169 -223 172 127 -319 113 -10 150 -339 -164 342 47 -287 -151 190 -4
4763 -4 -200 -148 215 -182 -184 62 373 133 -98 -103 138 190 -356 -292 95 188 -125 76 103 137 -227 -301 208 -53
4787 -53 -79 -88 188 -83 -315 -170 343 103 -111 -131 163 395 -457 -110 256 26 123 -89 244 150 -580 -30
4809 -30 83 81 -205 93 334 171 -397 175 538 2 66 107 64 -83 36 -46 105 107 -247 47 54 172 -278 19
4833 19 -87 -66 -93 -167 163 56 97 -123 -19 -66 -120 -56 -128 -103 -9 -178 228 54 -105 42 442 174 -362 -249
4857 -249 340 -75 -118 -90 366 63 138 17 113 -189 -217 286 136 205 -46 -135 60 194 -65 -227 93 80 -120
4880 -120 -4 55 276 -290 -67 268 -3 107 277 197 154 -40 -53 344 179 -24 144 127 -20 -284 25 1
4902 1 170 -218 4 139 277 26 -41 91 -71 -69 220 114 30 -311 -17 179 -85 -251 -207 167 -38 -233
4924 -233 4 81 14 -249 -68 245 134 -476 21 233 -344 -240 253 111 -13 -385 -25 -121 -107 -289 -60
4945 -60 100 -113 -246 -35 299 231 -361 9 202 -124 -264 65 57 104 -387 -226 210 -181 -302 -85 110 -159
4967 -159 -51 -136 162 105 -222 -36 257 1 -210 -58 294 -91 1 -83 476 -246 34 67 487 41 -96 215
4989 215 -30 -2 -30 118 95 93 -156 119 315 -152 -370 237 143 -11 -141 -9 218 -182 -313 78 44 -123
5011 -123 -63 -31 313 58 -29 243 78 -152 -186 219 287 -232 222 270 230 -431 108 103 157 170 -122 226 295 99
5035 99 -72 -49 277 -273 -387 218 269 -121 -240 281 -53 -40 -306 187 191 329 37 73 303 -203 -167 93 148
5058 148 -134 -73 55 -99 -64 -158 242 335 -88 -320 80 54 -32 -28 104 70 -254 -32 179 -108 -222 87 396
5081 396 137 -95 -277 -59 131 37 -172 109 210 -254 -94 -61 95 -152 -118 33 -43 -126 -116 226 144 -166
5103 -166 -90 161 250 -242 -129 399 100 37 -151 120 165 -82 -421 55 133 -4 121 -7 146 -123 -160 98
5125 98 157 -312 -42 359 201 -326 -26 135 67 -28 -93 205 83 84 -154 250 192 -155 -157 -163 56 -126 7 93
5149 93 200 -389 -312 252 427 -5 76 231 302 -4 -221 46 66 74 165 49 -5 -152 44 -7 185 -211 -51
5172 -51 156 215 -92 -236 35 325 -253 -172 63 130 -49 48 146 80 -349 296 385 42 -346 -270 111 43 63 -138
5196 -138 -48 73 -11 -111 379 255 -104 144 386 103 -62 198 -15 -198 -181 27 47 83 -341 -153 -52 169
5218 169 -377 222 185 28 -349 73 128 144 -288 226 11 251 -164 189 322 -24 -115 -123 333 -67 -269 77
5240 77 192 -59 -266 -6 374 -81 -165 -133 265 -33 -69 -280 225 189 -447 43 120 122 -54 238 353 -65 -196
5263 -196 33 122 270 -268 -122 137 52 -277 -242 92 -140 -234 -229 52 113 -55 121 90 102 -228 -195 39 -38 -101
5287 -101 -11 486 126 86 66 8 203 -128 150 160 65 -98 -100 143 -58 64 -156 191 29 -394 62 -280 261
5310 261 68 -108 340 -41 -111 123 -79 252 -355 81 -198 24 81 65 21 -107 -146 -303 456 352 -140 -31
5332 -31 118 -62 -40 -5 212 -3 124 -7 178 2 -177 -146 148 213 116 -298 -60 -149 -38 -8 182 182 -220
5355 -220 61 286 -10 -48 63 253 -154 -148 -286 184 -8 -295 -149 122 -135 -321 26 -31 -94 -141 102 425
5377 425 97 -43 -81 264 109 -22 155 363 18 -121 -33 -41 60 34 98 259 -179 -39 -255 93 -88 -308
5399 -308 156 30 -82 -126 242 20 -75 119 78 182 -67 -269 64 238 -26 -88 115 42 -23 -48 156 -92
5421 -92 -331 -252 4 207 116 -54 232 228 -197 -272 48 325 139 -78 49 216 -169 -159 93 245 -226 -297 131
5444 131 -21 146 -45 23 235 -162 -309 -19 68 85 22 -189 266 -237 -117 -132 330 -218 -12 23 -47 -330
5466 -330 -1 -64 417 -59 54 -46 102 -213 -55 241 262 -114 -556 270 121 79 -135 -124 169 187 50 -4
5488 -4 264 53 170 51 98 -201 4 367 -108 149 -163 -221 158 -101 -333 117 92 53 154 222 113 -60
5510 -60 -66 31 207 -170 -201 39 -4 -64 -343 255 3 132 -246 -75 30 11 57 -148 153 65 -320 97 197
5533 197 -189 -149 -86 214 -139 -35 21 249 -58 133 80 32 284 -89 -58 288 9 -155 133 -212 -333 -111
5555 -111 -72 -65 35 -288 162 182 -195 -133 -27 -47 44 -26 -19 315 136 -239 -36 38 -8 -219 75 -143 -77 266
5579 266 148 -37 66 -466 100 -42 -365 -168 279 43 87 -8 118 310 -64 -102 184 -4 -52 -79 110 8
5601 8 -299 -208 71 186 -236 -168 276 -20 -125 -9 65 286 -221 -202 3 118 -144 -179 103 -15 -42 -239 -12
5624 -12 -56 -97 -35 175 37 -42 -7 363 -241 -103 168 260 221 -92 20 155 269 -294 40 -11 100 -48 -312
5647 -312 -29 241 -170 -102 197 -124 -21 216 -1 48 -95 -95 337 -151 -241 70 366 315 -196 -149 90 -195
5669 -195 -187 2 -133 51 56 52 178 -76 -37 -214 75 -14 -359 -175 109 42 -289 -148 142 -18 -190 113 310
5692 310 -47 -329 194 188 -271 -198 -38 -74 72 91 -72 -121 402 46 -181 -308 108 -285 205 132 10 56 154
5715 154 364 101 -113 -93 38 287 -13 22 82 57 39 -100 96 -4 -12 60 -74 -297 -115 127 143 5 -86
5738 -86 171 276 99 -7 57 451 107 -160 57 278 73 -203 33 314 119 -276 -13 155 -62 -258 -8
5759 -8 323 -130 51 -213 28 121 -29 -21 232 49 -67 -29 -237 -104 -285 283 170 -16 50 -5 263 72 -186
5782 -186 43 113 132 -361 113 196 -45 -167 100 37 -176 -341 -182 9 84 94 141 -75 -84 -245 155 213 23
5805 23 -274 160 312 102 -322 18 87 40 -314 33 379 7 -216 43 -247 -179 -165 -198 177 18 97 181 0
5828 0 -31 0 -66 166 -69 -114 -1 -163 142 69 197 346 55 -256 -117 157 -132 -98 94 235 -48 -244 212
5851 212 92 24 186 53 237 -311 -156 -115 -161 109 -176 -81 123 -61 -263 146 -125 -185 26 404 -1 -230
5873 -230 -25 -85 -14 33 -338 -84 -57 -63 -482 118 2 -34 29 6 126 -223 -142 -68 89 -87 -141 65 198 -55
5897 -55 -117 37 56 -115 -111 -60 -16 -65 -147 -25 -15 -240 -216 -7 -36 -128 -164 -206 -48 24 -32 143 -184 -145 -210 -220 -93
5924 -93 -163 -214 -139 -113 -148 98 67 -34 28 -58 -13 166 -33 -112 135 99 -103 -360 129 196 -381 -147 104 217
5948 217 -52 -152 -237 1 131 -96 -77 221 -220 -85 117 26 -144 -475 130 -21 199 -130 251 128 -262
5969 -262 214 94 156 -135 117 -38 340 -120 51 120 127 -108 -173 -104 45 71 -237 281 41 -244 -276 255 240
5992 240 -159 83 -49 98 -236 -36 131 212 -141 -213 226 1 -114 -142 136 11 -102 -127 314 -121 -17
6013 -17 -242 101 116 -351 55 106 -116 -203 -83 88 213 -277 -351 194 59 -139 -29 210 88 -133 65 331
6035 331 191 121 -48 83 61 -39 -133 -59 -125 -119 -22 153 123 -199 -14 182 -144 -136 43 181 -2 42 24 114 -64
6060 -64 -34 47 -152 187 -11 -227 79 -62 -112 -94 210 354 -93 -21 55 -106 5 -1 50 48 64 -175 0 50 -151
6085 -151 -79 223 10 68 -7 200 246 90 -140 83 34 -3 -159 116 158 112 170 42 153 -424 34 327 -71
6108 -71 -352 -187 127 -138 -384 157 186 17 109 -22 138 -161 67 -55 400 240 -133 -244 19 80 -157
6129 -157 72 -83 -34 -135 -17 224 -47 121 -62 120 -183 -192 -139 50 131 -84 -96 183 60 -66 -150 107
6151 107 -11 86 290 1 -63 -140 -62 84 42 -254 -126 266 -184 -311 -177 -29 138 9 105 153 71 -440 87
6174 87 20 114 -251 -69 102 120 -380 -126 66 -89 -368 -189 133 265 -131 -279 167 73 78 13 91 7 -116
6197 -116 -122 304 236 60 105 91 15 -152 -21 43 61 38 -141 -140 -13 -238 362 100 61 9 -32 115 -100 -351 163
6222 163 62 32 74 -42 180 -155 -78 67 -17 -322 210 256 267 -64 -231 -81 -104 -267 -223 56 189 -33 66
6245 66 234 46 -153 -72 7 317 -244 -74 14 -39 72 240 -4 169 -189 -181 -99 309 -82 -250 -25 338 124
6268 124 136 117 -38 -38 73 4 64 -7 -6 73 318 -61 -129 208 332 -124 -415 -151 121 174 -51 149 -18 18
6292 18 -168 -233 45 117 -105 237 333 -79 -32 33 142 -166 -327 -10 -19 23 185 -187 73 -130 -20 -186 192
6315 192 -386 160 48 -88 103 -44 245 47 130 -118 -34 82 -191 -357 -12 185 -197 -307 13 475 -22
6336 -22 -97 11 134 -92 -83 -101 230 123 -217 -3 129 -277 58 50 -41 57 65 29 83 103 -19 107 163 -116 -314
6361 -314 224 23 -47 -389 -122 339 132 -320 104 280 4 -21 126 243 269 -307 -46 418 145 -165 -35
6382 -35 220 -121 -265 -89 105 -54 -76 -258 145 22 -242 -69 295 -182 -299 -67 56 -271 -279 93 308
6403 308 36 -90 -80 61 -65 -76 136 96 70 -71 98 -1 127 -189 144 438 -231 -188 64 -177 137 6
6425 6 151 232 -255 -174 -82 -38 -246 -212 -60 26 -242 76 -21 -49 -111 64 274 -11 8 -180 -65 103 -198 -320
6449 -320 217 -301 -18 -404 223 30 -26 -13 119 220 -279 73 40 124 -356 -189 158 88 -272 0 -97 187
6471 187 26 -22 -1 -62 -88 -108 81 162 -55 254 -6 6 0 -40 -74 -157 -228 -250 212 154 52 -59 34 54 -139 215
6497 215 -8 16 -38 73 -2 -122 204 -44 205 -7 282 -120 -7 -13 -1 -406 26 252 103 -283 62 88
6519 88 264 51 135 194 -49 -228 51 105 -377 143 -2 145 51 -125 115 147 228 253 -53 8 -176 -229 185
6542 185 156 76 -61 58 -184 -80 -191 178 321 94 32 -52 94 6 -174 380 15 -241 69 253 69 27
6564 27 -183 -18 179 -175 143 120 63 -72 -305 -37 -35 -39 -28 4 185 -239 -28 259 -68 -89 33 265 -78
6587 -78 -193 -149 140 184 -365 -131 56 22 101 -191 -11 439 -157 121 210 17 -156 -330 185 59 -116 -54
6609 -54 136 44 -165 -92 90 18 -331 129 52 277 154 -5 132 -117 99 -360 270 -2 144 -14 24 -50
6631 -50 -254 64 270 250 -341 -134 184 33 -77 0 126 95 -219 -39 15 120 158 -134 406 119 -338 98
6653 98 67 -30 -15 136 60 246 -165 101 96 125 -24 93 47 -79 -42 106 58 3 -111 -14 190 211 62 14 96
6678 96 406 30 -87 -3 -51 -67 45 17 -1 -1 56 363 89 -425 -40 239 161 -137 40 -132 18 -93 -3 142
6702 142 -62 42 -354 250 -1 -81 95 107 70 -156 148 361 -2 -106 -287 -80 1 -222 -73 162 -176
6723 -176 -187 -119 49 -24 164 234 170 24 -293 -56 228 -40 -123 33 124 -46 -246 128 -75 117 -77 -130 195
6746 195 -84 -177 81 236 100 84 -243 98 189 -307 95 212 -85 134 82 131 -108 -205 -116 163 -159 -349
6768 -349 -149 185 248 84 184 81 -79 -82 162 123 114 97 -12 96 -178 -235 -54 -106 121 -336 56 367 -80
6791 -80 -178 107 -1 9 -87 118 351 -37 228 -101 137 -123 -37 56 241 -158 -175 35 -29 35 -116 105 71
6814 71 -114 -389 152 36 132 -11 -104 102 -134 -95 -29 79 -37 -136 -106 436 -242 -151 241 -129 -67 -254 17
6837 17 121 -103 -34 186 -19 -18 -142 174 393 -52 -12 12 133 -12 -62 -83 153 194 -114 69 351 -247 -61
6860 -61 109 59 150 -440 106 168 -102 41 -186 -226 -209 -233 43 -20 309 161 142 96 -226 -330 -307 130 -173 148
6884 148 71 145 45 69 167 246 40 -70 172 63 202 25 41 141 148 -124 82 -17 34 -39 18 -31 -352 -123
6908 -123 227 16 -240 -66 299 158 -154 -381 0 -168 -228 -288 153 -11 19 -366 109 27 -195 -56 -83 252
6930 252 -36 -88 -30 120 35 -275 262 145 -176 -111 121 61 -10 -93 133 284 -125 -98 155 118 -249 -42 -226
6953 -226 70 -159 126 164 -203 -273 188 -161 -308 35 -167 251 34 109 -230 -108 133 -182 -269 97 187 -194
6975 -194 -221 0 21 -62 -50 54 -52 -229 -49 28 47 135 -155 -78 -44 -42 -51 15 -231 103 34 53 -60 -212 164
7000 164 125 151 -316 -32 -78 6 -29 12 -78 104 -19 -31 38 169 127 157 97 252 51 -277 175 45 -228 250
7024 250 414 -96 -153 66 326 92 59 254 259 -52 -29 80 -179 93 60 -128 44 179 -268 -219 188 -31
7046 -31 -22 106 23 -13 19 -209 -74 110 -430 96 -40 -161 -173 -220 172 143 -329 95 337 184 -204 -26 -67
7069 -67 30 -78 -93 192 12 -159 230 194 -9 87 -241 29 249 -62 -29 121 216 -176 106 -57 -230 -89
7091 -89 -59 -25 112 -301 -26 167 -202 -162 193 -18 -208 104 -120 242 190 125 59 180 -10 -189 -177 32 168
7114 168 -197 -33 -85 66 -111 98 69 -91 -84 195 193 12 15 87 196 120 -9 -202 167 148 -208 155 211 160
7138 160 91 -19 2 -58 -371 -256 -31 197 -108 -57 -31 86 -97 -131 154 -290 -168 18 -22 134 -211 -65
7160 -65 332 -65 50 305 -122 88 -85 -149 2 135 -11 -94 47 132 -83 125 27 55 -65 -106 14 72 44
7183 44 -218 240 -72 -135 36 133 -54 -112 39 405 51 50 46 -45 4 -150 146 93 142 45 98 203 -115 99 169
7208 169 93 185 -90 -162 151 27 8 119 324 -42 -219 225 -83 -1 -335 35 43 3 -168 -19 384 -85 -389
7231 -389 -104 -215 97 -153 -38 300 -29 -141 -253 -28 65 21 19 -13 71 -377 45 -3 -141 -223 -233 48 18
7254 18 -42 237 -41 212 86 69 -104 -366 -44 -53 116 41 6 -92 189 47 -133 101 153 211 -44 281 60
7277 60 -107 -200 303 -215 95 25 59 26 -21 64 94 64 51 43 11 25 -397 -3 193 -5 -195 -312 -34 241 -71
7302 -71 -228 66 22 9 -219 -190 161 -32 -308 -32 -24 11 -74 203 124 161 -56 102 46 98 -29 195 -149 51
7326 51 37 330 -78 36 -10 264 71 -83 -34 299 -246 153 3 256 65 -102 -147 143 128 138 -298 118
7348 118 266 -283 -160 -42 108 -16 15 69 166 -231 -114 73 50 -186 117 209 104 206 -122 -76 -66 51
7370 51 -73 68 225 -81 60 91 151 97 161 -37 -11 120 16 -84 170 -166 -167 228 141 -64 -58 325 -162 -312
7394 -312 -149 27 104 12 -55 179 187 126 -170 16 228 -140 119 175 -29 -62 -2 -139 30 -189 20 -82 149
7417 149 -64 84 103 122 -21 66 165 -208 -12 40 47 118 -121 97 242 -38 292 81 109 -142 -258 -307 160
7440 160 14 -280 -184 159 2 -118 -1 -42 62 -165 -86 -56 248 129 128 257 225 38 159 299 173 49
7462 49 -36 161 124 -144 4 135 87 116 -60 -169 -107 -62 -1 212 82 -96 -88 97 -198 203 30 138 94 -135
7486 -135 -37 267 2 -67 -113 16 -102 -95 136 182 -131 68 -239 32 83 209 120 16 90 -18 -177 -106 -271
7509 -271 -323 -162 -181 78 -80 -89 -38 -81 7 24 2 79 -65 -54 -211 97 -18 255 76 -118 -29 -67 -117 230 -105
7534 -105 171 258 -13 43 -145 -19 118 -106 210 367 54 53 -186 6 21 -84 52 -218 -324 -40 12 137
7556 137 107 14 -14 -160 142 -129 11 148 31 -221 -96 190 15 44 54 425 -91 41 101 163 36 128 -105
7579 -105 -83 231 -382 -95 131 -71 187 -131 68 288 -155 -177 58 322 -29 77 -36 123 -254 -89 -93
7600 -93 -297 -180 -179 136 92 8 7 -5 -13 -22 212 185 61 -78 156 104 102 -335 -135 9 7 16 -159 -41 139 4 -79
7627 -79 -221 25 -82 -10 50 146 -287 172 74 117 -105 -90 119 -283 63 -48 10 35 -35 170 400 -7 -369
7650 -369 253 -104 -21 -177 -76 182 -69 -36 23 182 -73 -39 -222 13 -160 1 111 -82 19 -284 -111
7671 -111 246 -353 -57 270 -47 25 51 -81 -14 107 -192 195 304 12 -48 11 43 -148 -67 277 85 0 9
7694 9 -80 165 -105 57 -18 -15 174 -88 -57 29 53 -163 112 78 -95 236 -1 196 195 -140 10 -57 32 -289 -41
7719 -41 121 -294 116 123 -119 55 239 -350 207 68 -294 -146 122 113 -102 123 12 66 -114 -18 7 -159 -240
7742 -240 -77 16 141 82 6 66 -150 -220 -146 57 117 63 -53 19 -121 -10 82 161 136 -76 53 -212 266 179
7766 179 34 337 -384 228 -183 152 107 117 -63 16 -363 86 450 -30 -263 -165 273 200 -58 -55 -144 121 -10
7789 -10 59 113 -1 -334 -188 426 262 86 -102 279 185 -21 35 67 193 -221 61 113 103 11 101 136 -21 -171
7813 -171 -234 -100 19 -233 5 -158 57 204 -243 271 -14 128 -19 230 182 -20 158 -18 128 -110 85
7834 85 -50 -162 -185 -125 8 142 -112 189 -155 116 20 -87 170 170 -130 -177 69 0 -116 0 -222 63 -204
7857 -204 -224 -144 30 -204 -284 252 201 -147 -16 -29 -33 95 -295 116 -118 -162 -33 242 169 63 -65 81 78 61
7881 61 -244 -139 -92 -96 -51 120 -5 -301 59 316 -26 68 -42 30 81 139 131 194 88 -125 125 411 231 -111
7905 -111 15 -85 42 -104 98 392 30 -229 39 -92 50 105 204 -59 75 -137 149 -53 99 101 -44
7926 -44 128 -24 -198 65 159 14 208 -95 -87 -71 -62 244 22 67 189 -180 -61 -143 241 -297 -47 -2 -429
7949 -429 -183 -151 -128 -97 -66 -3 122 231 -41 164 107 -68 -81 -2 -15 -203 -111 189 -21 -292 135 17 69 217
7973 217 -78 216 179 -4 -105 -139 139 -49 -5 -75 86 -140 -254 71 -49 -337 -101 352 36 -219 -17
7994 -17 -174 -71 86 -32 73 -63 -23 102 69 114 116 -75 147 3 -68 43 -191 -94 -51 103 -223 -151 115
8017 115 100 96 -189 -159 -22 214 176 34 -46 201 -137 -348 -132 113 201 81 6 113 21 56 -140 -58 -141 -123
8041 -123 144 -33 283 -150 -22 54 -192 -13 -290 -79 122 -99 -117 160 -143 -259 122 -11 -52 74 308
8062 308 198 127 -99 -197 -43 78 -48 183 13 -168 1 -102 -98 -125 166 48 204 -278 11 22 281 -183
8084 -183 -179 -142 273 45 -139 38 -6 13 -289 8 -24 -2 -68 45 90 -102 138 -99 195 -115 -140 -113 -128 -59
8108 -59 -84 121 72 57 -84 -51 65 -63 -10 -150 3 -548 -359 306 0 -77 52 191 90 -29 -301 129
8130 129 4 118 -65 170 -122 -107 71 -203 -10 -41 -275 -11 14 -205 -75 176 65 40 7 229 83 94
8152 94 73 -57 -57 -211 -82 -44 117 -178 -257 -110 207 375 29 23 200 -86 101 -10 66 319 186 -84 67
8175 67 34 224 276 100 -105 -289 -39 17 -59 -110 -360 -5 20 -61 -112 290
8191B90
##END NTUPLES=NMR FID
##END=
