##TITLE=1H_Ser DGA-N-5
 CDCl3
 64 sc, 
 17.2.2023
##JCAMPDX= 6.0         $$ Bruker NMR JCAMP-DX V2.0
##DATA TYPE= NMR FID
##DATA CLASS= NTUPLES
##ORIGIN= UXNMR, Bruker Analytische Messtechnik GmbH
##OWNER= root
$$ XWIN-NMR		Version 3.5
$$ Fri Feb 17 14:36:06 2023 Russian Standard Time (UT+4h)  she@DPX200
##.OBSERVE FREQUENCY= 200.13135
##.OBSERVE NUCLEUS= ^1H
##.DELAY= (6, 6)
##.ACQUISITION MODE= SIMULTANEOUS
##.ACQUISITION SCHEME= undefined
##.AVERAGES= 64
##.DIGITISER RES= 18
##SPECTROMETER/DATA SYSTEM= spect
##.PULSE SEQUENCE= zg30
##.SOLVENT NAME= DMSO
##.SHIFT REFERENCE= (INTERNAL, DMSO, 0, 15.7039)
##AUDIT TRAIL= $$ (NUMBER, WHEN, WHO, WHERE, WHAT)
$$ ##TITLE= Audit trail, XWIN-NMR		Version 3.5
$$ ##JCAMPDX= 5.01
$$ ##ORIGIN= Bruker BioSpin GmbH
$$ ##OWNER= she
$$ F:/spectra/data/she/nmr/H-F/1/audita.txt
$$ ##AUDIT TRAIL=  $$ (NUMBER, WHEN, WHO, WHERE, WHAT)
(   1,<2023-02-17 14:35:08.09 +0400>,<she>,<DPX200>,
      <continue with go, POWCHK disabled, PULCHK disabled
       configuration hash MD5:
       00 E9 B6 7A A2 85 ED C7 34 08 36 98 17 FE 4E 26
       data hash MD5: 16K
       C3 6D 8C CF 01 E2 10 81 93 FF E3 26 AD AD C1 CD>)
$$ ##END=
$$ 
$$ hash MD5
$$ 7F 22 3C C3 8D 04 89 9E 55 32 BC E5 17 73 D5 C3
##$RELAX= 
##$RELAX= 
##$RELAX= 
##$RELAX= 
##$RELAX= 
##$RELAX= 
$$ Bruker specific parameters
$$ --------------------------
##$DU= <F:/spectra>
##$EXPNO= 1
##$NAME= <H-F>
##$PROCNO= 1
##$TYPE= <nmr>
##$USER= <she>
##$AMP= (0..31)
100 100 100 100 100 100 100 100 100 100 100 100 100 100 100 100 100 100 
100 100 100 100 100 100 100 100 100 100 100 100 100 100 
##$AQSEQ= 0
##$AQ_mod= 1
##$AUNM= <au_zg>
##$AUTOPOS= <>
##$BF1= 200.13
##$BF2= 200.13
##$BF3= 200.13
##$BF4= 200.13
##$BF5= 200.13
##$BF6= 200.13
##$BF7= 200.13
##$BF8= 200.13
##$BYTORDA= 1
##$CFDGTYP= 0
##$CFRGTYP= 5
##$CHEMSTR= <none>
##$CNST= (0..31)
1 1 145 1 1 1 1 1 1 1 1 1 1 1 1 1 1 1 1 1 1 1 1 1 1 1 1 1 1 1 1 1 
##$CPDPRG= <>
##$CPDPRG1= <>
##$CPDPRG2= <>
##$CPDPRG3= <>
##$CPDPRG4= <mlev>
##$CPDPRG5= <mlev>
##$CPDPRG6= <mlev>
##$CPDPRG7= <mlev>
##$CPDPRG8= <mlev>
##$CPDPRGB= <>
##$CPDPRGT= <>
##$D= (0..31)
0 1.2 0 0 0 0 0 0 0 0.06 0 0.03 0 0 0 0 0.0002 0 0 0 0 0 0 0 0 0 0 0 0 
0 0 0 
##$DATE= 1676629861
##$DBL= (0..7)
120 120 120 120 120 120 120 120 
##$DBP= (0..7)
150 150 150 150 150 150 150 150 
##$DBP07= 0
##$DBPNAM0= <>
##$DBPNAM1= <>
##$DBPNAM2= <>
##$DBPNAM3= <>
##$DBPNAM4= <>
##$DBPNAM5= <>
##$DBPNAM6= <>
##$DBPNAM7= <>
##$DBPOAL= (0..7)
0.5 0.5 0.5 0.5 0.5 0.5 0.5 0.5 
##$DBPOFFS= (0..7)
0 0 0 0 0 0 0 0 
##$DE= 6
##$DECBNUC= <off>
##$DECIM= 32
##$DECNUC= <off>
##$DECSTAT= 4
##$DIGMOD= 1
##$DIGTYP= 9
##$DL= (0..7)
0 120 120 120 120 120 120 120 
##$DP= (0..7)
150 150 150 150 150 150 150 150 
##$DP07= 0
##$DPNAME0= <>
##$DPNAME1= <>
##$DPNAME2= <>
##$DPNAME3= <>
##$DPNAME4= <>
##$DPNAME5= <>
##$DPNAME6= <>
##$DPNAME7= <>
##$DPOAL= (0..7)
0.5 0.5 0.5 0.5 0.5 0.5 0.5 0.5 
##$DPOFFS= (0..7)
0 0 0 0 0 0 0 0 
##$DQDMODE= 0
##$DR= 18
##$DS= 0
##$DSLIST= <SSSSSSSSSSSSSSS>
$$ [...]
##$SUBNAM2= <"">
##$SUBNAM3= <"">
##$SUBNAM4= <"">
##$SUBNAM5= <"">
##$SUBNAM6= <"">
##$SUBNAM7= <"">
##$SUBNAM8= <"">
##$SUBNAM9= <"">
##$SW= 18.05172834244
##$SWIBOX= (0..15)
0 0 2 0 0 0 0 0 0 0 0 0 0 0 0 0 
##$SW_h= 3612.71676300578
##$TD= 16384
##$TD0= 1
##$TE= 0
##$TE2= 300
##$TE3= 300
##$TEG= 300
##$TL= (0..7)
0 120 120 120 120 120 120 120 
##$TP= (0..7)
150 150 150 150 150 150 150 150 
##$TP07= 0
##$TPNAME0= <>
##$TPNAME1= <>
##$TPNAME2= <>
##$TPNAME3= <>
##$TPNAME4= <>
##$TPNAME5= <>
##$TPNAME6= <>
##$TPNAME7= <>
##$TPOAL= (0..7)
0.5 0.5 0.5 0.5 0.5 0.5 0.5 0.5 
##$TPOFFS= (0..7)
0 0 0 0 0 0 0 0 
##$TUNHIN= 0
##$TUNHOUT= 0
##$TUNXOUT= 0
##$USERA1= <user>
##$USERA2= <user>
##$USERA3= <user>
##$USERA4= <user>
##$USERA5= <user>
##$V9= 5
##$VALIST= <valist>
##$VCLIST= <CCCCCCCCCCCCCCC>
##$VD= 0
##$VDLIST= <DDDDDDDDDDDDDDD>
##$VPLIST= <PPPPPPPPPPPPPPP>
##$VTLIST= <TTTTTTTTTTTTTTT>
##$WBST= 1024
##$WBSW= 4
##$XGAIN= (0..3)
0 0 0 0 
##$XL= 0
##$YL= 0
##$YMAX_a= 349040
##$YMIN_a= -677415
##$ZGOPTNS= <>
##$ZL1= 120
##$ZL2= 120
##$ZL3= 120
##$ZL4= 120
##$ABSF1= 10
##$ABSF2= 0
##$ABSG= 5
##$ABSL= 3
##$ALPHA= 0
##$AQORDER= 0
##$ASSFAC= 0
##$ASSFACI= 0
##$ASSFACX= 0
##$ASSWID= 0
##$AUNMP= <proc_1d>
##$AZFE= 0.1
##$AZFW= 0.1
##$BCFW= 1
##$BC_mod= 2
##$BYTORDP= 1
##$COROFFS= 0
##$CY= 11.3945322036743
##$DATMOD= 1
##$DC= 2
##$DFILT= <>
##$DTYPP= 0
##$F1P= 2.36226072786647
##$F2P= -0.459571619588291
##$FCOR= 0.5
##$FTSIZE= 0
##$FT_mod= 4
##$GAMMA= 1
##$GB= 0.15
##$INTBC= 1
##$INTSCL= 1
##$ISEN= 128
##$LB= 0.24
##$LEV0= 0
##$LPBIN= 0
##$MAXI= 10000
##$MC2= 0
##$MEAN= 0
##$ME_mod= 0
##$MI= 1.114404
##$NCOEF= 0
##$NC_proc= 0
##$NLEV= 6
##$NOISF1= 3.799351
##$NOISF2= 2.8
##$NSP= 1
##$NTH_PI= 0
##$NZP= 0
##$OFFSET= 15.70392
##$PC= 1
##$PHC0= -19110.64
##$PHC1= 12.40078
##$PH_mod= 1
##$PKNL= yes
##$PPARMOD= 0
##$PSCAL= 0
##$PSIGN= 0
##$REVERSE= no
##$SF= 200.130013532006
##$SI= 16384
##$SIGF1= 3
##$SIGF2= 2
##$SINO= 400
##$SIOLD= 16384
##$SREGLST= <1H.CDCl3>
##$SSB= 0
##$STSI= 0
##$STSR= 0
##$SW_p= 3612.71676300578
##$SYMM= 0
##$S_DEV= 0
##$TDeff= 0
##$TDoff= 0
##$TI= <>
##$TILT= no
##$TM1= 0
##$TM2= 0
##$TOPLEV= 0
##$USERP1= <user>
##$USERP2= <user>
##$USERP3= <user>
##$USERP4= <user>
##$USERP5= <user>
##$WDW= 1
##$XDIM= 8192
##$YMAX_p= 0
##$YMIN_p= 0
$$ End of Bruker specific parameters
$$ ---------------------------------
##NTUPLES= NMR FID
##VAR_NAME=  TIME,          FID/REAL,        FID/IMAG
##SYMBOL=    X,             R,               I
##VAR_TYPE=  INDEPENDENT,   DEPENDENT,       DEPENDENT
##VAR_FORM=  AFFN,          ASDF,            ASDF
##VAR_DIM=   8192,          8192,            8192
##UNITS=     SECONDS,       ARBITRARY UNITS, ARBITRARY UNITS
##FACTOR=    0.0002768,     1,               1
##FIRST=     0,             0,               0
##LAST=      2.2672688,     0,               0
##MIN=       0,             -677415,         0
##MAX=       2.2672688,     349040,          0
$$ Real data points
##PAGE= N=1
##DATA TABLE= (X++(R..R)), XYDATA
0 0 0 0 0 0 0 0 0 0 0 0 0 0 0 0 0 8 -64 64 -64 64 -64 127 -128 128 -185 192 -219 256 -319 324 -386 449 -514
33 -514 578 -643 724 -827 912 -1030 1149 -1278 1416 -1575 1741 -1928 2132 -2352 2596 -2859
49 -2859 3152 -3472 3826 -4216 4650 -5142 5688 -6311 7026 -7862 8838 -10014 11447 -13260
63 -13260 15613 -18809 23427 -30761 44167 -76899 349040 121911 -482054 -37065 95158
74 95158 -123509 -139421 247737 239332 -95925 -216576 89379 200695 -88712 -307150 8301
85 8301 221664 -73481 -232874 98461 178098 -152304 -212023 126814 144298 -185998 -150593
96 -150593 240563 241424 -117910 -199375 73680 150452 -60398 -68307 186667 168120 -153022
107 -153022 -202220 126411 190095 -151572 -193653 142474 151794 -131766 -115466 97823 45247
118 45247 -155318 -108707 90015 84778 -91338 -101031 110190 158515 -92148 -153501 96720
129 96720 120179 -95157 -50563 153721 84389 -128975 -80564 119531 97452 -77361 -86670
140 -86670 64918 88438 -81373 -116229 67497 90396 -87966 -93660 75845 75643 -91275
151 -91275 -85317 90378 82157 -89534 -95007 58424 92911 -29575 -59830 59597 71645 -67072
163 -67072 -79047 73530 97197 -80288 -115261 84064 122681 -65656 -88598 68258 67295
174 67295 -78056 -75929 66455 68240 -70449 -75885 78856 115756 -56846 -129050 44393
185 44393 103822 -73298 -97214 81076 84459 -87685 -78989 93457 80505 -98748 -99147 71289
197 71289 95860 -54515 -91996 61114 91810 -69738 -77997 92585 91434 -83696 -84229 100956
209 100956 103293 -83478 -87104 75999 71858 -73258 -67045 71789 56760 -91735 -72259 79354
221 79354 57703 -99520 -87988 80737 79287 -90582 -78985 85229 58869 -88921 -44583
232 -44583 112905 71302 -92739 -54993 106365 78033 -71294 -59565 85280 77309 -74824
243 -74824 -64031 83324 55236 -94197 -69789 69636 42808 -97699 -64483 77802 45070
254 45070 -89508 -69100 55160 45365 -69525 -39530 87146 47568 -78207 -31835 106544
265 106544 73239 -76486 -54017 90902 66566 -63540 -35647 85302 53287 -85872 -63048
276 -63048 76409 45751 -99238 -76383 65767 56652 -83901 -76153 61611 43832 -86458
287 -86458 -55335 75160 49362 -76687 -40895 104200 66060 -77804 -42764 95196 64671
298 64671 -70855 -37620 104043 54666 -95567 -43447 102164 43528 -113880 -67282 98104
309 98104 50233 -113792 -67954 81713 34609 -108789 -58011 94923 43849 -106443 -39806
320 -39806 112637 52697 -96133 -44270 102453 49591 -83893 -11252 116407 32708 -101443
331 -101443 -22969 111665 28155 -114243 -25059 108046 13763 -114977 -25526 101280 2808
342 2808 -129142 -20127 112257 5484 -116076 -12442 108657 6590 -113711 -3521
352 -3521 117679 13151 -94145 4912 104869 2231 -101483 8512 111229 -2208 -96103
363 -96103 11369 98891 -10483 -100637 8044 87963 -25204 -94652 17884 88603 -16902
374 -16902 -91426 11857 80782 -24469 -84748 18443 81822 -12991 -76275 21160 82378
385 82378 -20359 -76722 20107 69063 -20703 -65618 26502 70763 -21265 -62638 21563 57430
397 57430 -20462 -62020 15559 65240 -12271 -56994 22683 58925 -22959 -63342 17683 61904
409 61904 -16878 -57242 12912 48010 -13067 -50821 4533 46878 -13300 -58324 4770 52723
421 52723 -4364 -53173 2389 53322 -5242 -50587 14521 57986 31 -46270 4953 53178
433 53178 1731 -45453 8735 56900 3803 -54407 -8878 53809 2441 -66999 -10247 54597
445 54597 -2144 -64628 -5753 55705 -7766 -67149 -5822 52242 23 -52017 -17 67296
457 67296 17976 -56485 -976 69910 6300 -60333 14232 80748 -2290 -70555 13691 70062
469 70062 -12045 -68423 2428 59885 -12387 -78653 -4834 62868 -14238 -81611 240 71556
481 71556 -14335 -86242 8599 82166 -6680 -65534 17804 70102 -9676 -51398 37446 76969
493 76969 -16252 -63067 18902 69746 -5901 -60184 16561 63683 -29428 -75528 22734 63784
505 63784 -42996 -84886 25512 60912 -43989 -70550 28136 57773 -25364 -58847 24574
516 24574 64125 -21618 -57474 39346 79370 -20769 -64191 37682 73342 -25530 -46526 40964
528 40964 47632 -38663 -52214 27587 43712 -36700 -54527 26465 45408 -41310 -67074 23380
540 23380 54938 -35592 -57468 35120 49471 -41644 -48465 51460 66929 -35299 -53490 35071
552 35071 54279 -17281 -32788 34695 50378 -30235 -53980 31239 56155 -30170 -58821 26064
564 26064 44007 -46015 -51972 40353 40763 -39556 -44156 26013 32965 -36058 -43617 40854 55027
577 55027 -33858 -54978 39091 59750 -36310 -44915 51570 46728 -50857 -41644 49529 46949 -39688
590 -39688 -43316 37930 39080 -42221 -44193 38797 46728 -40138 -50213 38965 41038 -49693 -40351
603 -40351 52727 43556 -52373 -44417 47673 33811 -48007 -26220 50572 31422 -47921 -38576 44406
616 44406 38773 -43394 -36102 47598 34591 -51901 -32319 61543 33413 -57669 -26153 51397
628 51397 20308 -44780 -14707 49221 20310 -49927 -26110 45174 24007 -46844 -26647 49150
640 49150 20621 -58598 -23206 49392 12794 -50892 -13402 47045 11307 -47790 -10364 47061
652 47061 18847 -35397 -13522 38214 17309 -34393 -6773 46177 14231 -40138 -11401 41477
664 41477 12307 -42242 -12462 33703 2039 -37594 -12320 25997 2331 -35445 -13368 29877
676 29877 8462 -37050 -17539 35290 22852 -27895 -10871 34990 12932 -23504 -911 34820
688 34820 15376 -25037 -11043 30479 21466 -20695 -17450 20145 13167 -30130 -21254 24145 7969
701 7969 -38874 -21308 25578 12068 -34741 -21948 27182 18032 -26931 -15984 30999 23730 -27132
714 -27132 -17999 39066 31645 -26352 -18188 38573 31856 -29439 -24607 33935 22418 -35415 -25642
727 -25642 27678 17298 -37066 -27691 29396 15015 -43865 -30336 29935 19840 -37551 -20500
739 -20500 41480 19117 -42340 -14116 49150 22325 -41048 -14160 52084 26435 -37988 -11946
751 -11946 49460 18630 -47630 -19239 47431 15946 -51659 -19501 42574 10289 -50111 -17523
763 -17523 42340 7964 -51679 -15217 43079 7627 -44352 -6439 49473 9825 -43751 -297
775 -297 52142 6946 -44845 38 51071 6647 -45425 1964 50242 -189 -48505 -2547
787 -2547 44581 -3278 -50908 -2128 44828 -3720 -47255 -1107 41050 -4808 -47285 1206
799 1206 41604 -3249 -38578 7383 42174 -3677 -39550 9198 43353 -5384 -38598 7594
811 7594 39797 -4788 -37542 8259 38395 -9979 -37641 10452 38874 -9093 -40812 4502
823 4502 37442 -7810 -35499 6028 33190 -7643 -34635 8428 36168 -9544 -37065 7163
835 7163 34390 -5489 -34349 5070 32841 -8175 -31427 9938 32418 -9116 -33663 8154
847 8154 35682 -7420 -32960 9348 34617 -4512 -30155 8084 32224 -9583 -32748 11009
859 11009 32006 -10022 -33741 8355 32383 -11806 -36097 5004 27685 -11003 -31147 9608
871 9608 30861 -14118 -33247 14042 34093 -10938 -31588 10603 34774 -6262 -26307 16951
883 16951 32502 -12735 -28284 17350 33669 -13496 -33856 11176 27800 -13946 -30060 9726
895 9726 24844 -18449 -33175 12506 23882 -21138 -29201 15634 27172 -15154 -25229 18429
907 18429 26965 -13502 -20821 19034 28772 -11505 -19873 23115 29210 -17445 -25692 16496 25225
920 25225 -15360 -24246 14854 17818 -21329 -24698 11527 15235 -19858 -26125 12110 18906 -15203
933 -15203 -20107 13132 19662 -12185 -16507 19353 23434 -12222 -12768 20922 22288 -11528 -16177 15656
947 15656 19170 -11873 -16470 11049 16211 -13440 -23839 6669 17588 -15926 -25212 7615 15980
960 15980 -15700 -22736 10193 20076 -8776 -16640 9312 17790 -3906 -13173 12478 24464 -7151
973 -7151 -19974 13267 26639 -6291 -19466 11066 19554 -13980 -21707 13394 18183 -15336 -25508
986 -25508 8368 20259 -15631 -27075 9023 23459 -11955 -27224 10028 27373 -10911 -23311
998 -23311 18331 27922 -15094 -24936 17811 28818 -10067 -19961 15611 21992 -13374 -22020 15290
1011 15290 24991 -17432 -28846 17502 24910 -22987 -28287 20558 24087 -24808 -23816 22217 19168
1024 19168 -22378 -19443 23586 23301 -22855 -26013 22084 27034 -19846 -21204 23601 21333 -27657
1037 -27657 -21282 29251 21456 -26289 -18063 24556 14459 -24781 -14692 25525 14317 -25428
1049 -25428 -15609 23729 15825 -24421 -14739 28174 15302 -31093 -15650 29411 12181 -28515
1061 -28515 -10155 27629 6129 -28574 -7609 25738 9751 -22742 -10453 22664 10489 -25077
1073 -25077 -7668 29210 11499 -25340 -7549 27575 6519 -24709 -1374 24742 1672 -23180
1085 -23180 -4000 20733 4740 -20936 -6507 18057 2514 -24047 -8669 21067 4992 -23896
1097 -23896 -4793 21507 818 -21373 -798 23656 4677 -16789 46 18273 4773 -12490
1109 -12490 -539 20072 5645 -19840 -5236 20533 6798 -19509 -5546 16851 -257 -22633
1121 -22633 -4564 15228 -1122 -19052 -5341 13427 3776 -16360 -7415 17175 7533 -15371
1133 -15371 -3613 20355 8244 -15412 -286 22391 5152 -15638 -823 17210 4466 -14536
1145 -14536 -3820 15204 985 -20343 -8045 15288 3707 -22116 -7888 16861 196 -23168
1157 -23168 -4688 19744 3444 -18367 -1920 19108 4159 -14236 811 19625 6289 -14381
1169 -14381 -2795 20376 6957 -16205 -1691 18394 522 -19744 -2386 18376 -2385 -21251
1181 -21251 -2279 14419 -3590 -19413 -2392 16173 -109 -19517 -1693 18131 1958 -17911
1193 -17911 713 22323 3132 -17034 2318 20300 890 -14037 2240 16944 506 -15577
1205 -15577 3 13655 -1103 -15973 -2293 13663 -2194 -18507 -629 14196 -3060 -17261
1217 -17261 1340 14853 -2681 -15695 3163 16604 -968 -13524 1830 15894 2179 -12260
1229 -12260 2850 17308 -972 -16799 -1062 17137 2173 -16169 -717 14486 -1857 -15016
1241 -15016 -86 12836 -1075 -15329 -546 15403 363 -15315 -2405 14193 975 -15286
1253 -15286 -167 16145 -1239 -15950 2334 17247 12 -17974 919 18170 573 -15658
1265 -15658 542 15620 -1320 -17249 2048 19495 -1352 -19242 2045 18940 -870 -18800
1277 -18800 463 17628 -2124 -17209 3083 17709 -3857 -18474 2612 18845 -4479 -20218
1289 -20218 2623 18555 -2675 -17987 3646 17612 -6444 -18513 8355 20069 -5457 -18408
1301 -18408 7279 19689 -5232 -16242 6678 16904 -6808 -16241 8656 17738 -10243 -18728
1313 -18728 7675 16531 -9451 -18345 6559 13879 -10545 -17285 9290 13523 -11671 -14926 11604
1326 11604 15506 -9961 -13059 12816 15557 -8696 -10859 13058 13696 -9021 -10448 12766 11511
1339 11511 -11572 -11388 10843 10384 -12624 -13435 8526 7519 -13572 -10666 9432 7459 -13805 -10334
1353 -10334 11688 10027 -11333 -8735 11508 10236 -8039 -5664 12289 9679 -9083 -4836 11875
1366 11875 9183 -7815 -6983 9377 6341 -9900 -7326 6774 4254 -9732 -9247 6337 3502 -10664
1380 -10664 -6502 6832 4067 -8530 -5808 8872 7317 -6752 -5080 8197 8245 -4472 -4084 9114
1394 9114 8396 -6011 -4928 9246 7797 -5807 -8191 4946 6119 -7444 -8815 3855 5433 -7582
1408 -7582 -8854 4717 6277 -8124 -8661 5798 7200 -5866 -7649 6918 8884 -4555 -5561 8013
1422 8013 8345 -4994 -6720 8129 9337 -6718 -9031 7606 8437 -6044 -8792 5458 6838 -9709
1436 -9709 -8598 7539 6600 -9713 -9514 6773 8962 -8159 -8954 6402 7104 -6875 -6538 8530
1450 8530 7366 -8247 -7585 10947 8007 -9083 -6506 7984 6424 -8436 -5978 9002 6299 -8873
1464 -8873 -6029 8808 6583 -9737 -7891 9907 6903 -9861 -8025 8350 5684 -8479 -4672
1477 -4672 9817 4479 -10348 -5114 8486 5899 -7144 -6173 7649 5408 -8136 -5151 9036
1490 9036 4992 -8908 -4163 9763 3919 -9461 -3159 10150 3506 -8513 -4581 7238 3905
1503 3905 -8630 -3237 8191 3914 -9082 -5588 8789 5197 -9263 -5470 7407 2728 -9470
1516 -9470 -3408 7697 3041 -8634 -2454 8222 4391 -7246 -3849 9037 6806 -8174 -4219
1529 -4219 9744 5209 -7502 -1767 10235 3270 -11318 -3526 8598 3441 -9488 -4836 5750
1542 5750 2687 -9114 -4965 7882 2710 -10417 -4968 9245 3855 -9285 -2744 10466 3684
1555 3684 -8721 -2140 10431 3463 -8139 -368 10124 2408 -9350 -3035 8815 3340 -9965
1568 -9965 -4499 9059 848 -12164 -3342 9900 309 -11352 -1568 8366 -820 -8752 -157 9675
1582 9675 1455 -8809 -850 10205 2495 -7760 2110 11845 296 -10440 1245 11267 -626
1595 -626 -9099 1017 8478 -2323 -10063 21 7443 -2945 -10188 -575 6992 -1908 -8968 11
1609 11 8866 -924 -9192 2738 8204 -2208 -5419 4744 8499 -2008 -6161 2931 7619 -731
1623 -731 -5399 1085 6073 -1528 -7489 2040 6478 -2965 -7787 1722 5702 -4306 -7436 1545 5082
1638 5082 -2763 -5199 1389 5057 -1166 -3491 3582 6217 -1012 -5297 1965 6151 -76 -3969 1942
1653 1942 4971 -2547 -3957 2107 4415 -1183 -4336 49 3114 -1590 -5139 680 3569 -1010 -5049
1668 -5049 976 4226 -663 -4566 1102 4895 -382 -4458 820 4217 248 -3479 625 3668 179
1683 179 -4566 210 5617 543 -5145 -711 4596 -443 -5020 569 5418 -1662 -4601 697 4936
1698 4936 -213 -5519 355 4704 -793 -6688 402 5468 54 -6773 -260 6817 -1283 -5840 507
1713 507 6592 389 -5636 -203 5948 -271 -5197 1173 5891 -343 -5706 749 6924 -732 -6032
1728 -6032 1498 5025 -1327 -5278 1390 5916 -2085 -6352 2109 5077 -2192 -6438 718 4771 -1769
1743 -1769 -5539 2671 4870 -1905 -5191 2580 6833 -1831 -5587 2858 6024 -1140 -3723 2614 4650
1758 4650 -2670 -4157 2220 4902 -2700 -5064 1326 3896 -2663 -5419 1717 4269 -3495 -5692 2206
1773 2206 4357 -2461 -4325 3170 4080 -2521 -3275 2975 4883 -1505 -3379 2798 4988 -1940 -2969
1788 -2969 2878 4721 -2733 -3667 2491 4099 -2931 -4693 2080 3050 -3780 -4876 1787 4347 -3224
1803 -3224 -4803 2292 4037 -1983 -3009 3479 4705 -1385 -2567 2900 4619 -2043 -3792 3324 3965
1818 3965 -1841 -3391 2683 2946 -3720 -3782 2465 3029 -4064 -4382 1611 2677 -3696 -3888 2769 2910 -2913
1835 -2913 -3449 2556 2915 -2226 -2958 2818 4130 -3122 -2936 3712 3789 -1392 -2673 2997 2800 -3341 -2572
1852 -2572 3890 2653 -3781 -2884 1801 2076 -3652 -2479 2454 1446 -4283 -2350 3074 2739 -4278 -3063
1868 -3063 4019 2490 -2343 -1827 3547 2174 -2510 -1579 3626 2409 -3103 -2085 3581 1917 -2626
1883 -2626 -2270 2313 541 -2559 -936 2472 273 -3588 -841 2184 779 -2748 -866 1967 1028
1898 1028 -1922 -300 2406 261 -1947 -452 2981 1374 -3186 -973 2231 1290 -1726 -774 2347
1913 2347 246 -2369 -818 2295 317 -1956 -887 1652 1848 -858 -1295 1139 1308 -1343 -1090 1848
1929 1848 101 -1882 -903 1646 1007 -1161 -849 1615 652 -1088 -569 1043 1595 -1598 -1066 2126 1088
1946 1088 -1314 -1786 1110 2365 -1598 -1091 741 2018 -375 -870 582 803 -1199 -2351 1601 2204
1962 2204 -1106 -1906 303 1336 -1022 -1672 1405 915 -1329 -1762 1635 1537 -1600 -1199 1338 1945 -1064
1979 -1064 -1106 1768 1922 -1422 -1426 2413 1589 -2379 -2053 1686 1681 -2110 -1657 1208 1312 -2013 -2029 1333 1312
1998 1312 -2120 -1547 1599 1550 -1788 -1581 2629 2063 -2074 -1121 2619 2159 -2116 -518 1959 722 -2004
2015 -2004 -1534 2310 1507 -1997 -1822 1793 1547 -2410 -2339 2490 842 -3119 -1643 2980 1104 -2396
2031 -2396 -1004 1904 1154 -1571 -330 2626 891 -1291 -1215 2915 1898 -1838 -1067 2766 844 -2920
2047 -2920 -619 2691 222 -2832 -584 1734 -424 -2697 -1377 1805 476 -1347 -124 1802 208
2062 208 -1749 -799 2628 636 -2051 488 2302 690 -1959 -95 1966 352 -1547 89 744 384
2078 384 -1884 -1024 1296 4 -1997 -632 1822 470 -2501 -396 2343 -495 -1610 726 1372 199
2094 199 -970 369 1749 301 -1400 -741 1754 492 -1632 -287 1314 262 -1591 345 1885
2109 1885 -117 -826 259 960 273 -1385 267 481 14 -1427 -1444 1478 1270 -984 15 1274 464
2126 464 -1502 162 1715 212 -1015 -203 166 -123 -213 -1016 523 61 -550 184 1255 -190 -2059
2143 -2059 -177 1909 387 -488 -272 1373 -265 -1559 615 1190 -185 -894 302 686 222 -1129
2159 -1129 -131 759 -133 -726 -164 372 834 -581 -655 450 -742 -3 169 702 323 -490 -70 -57 632
2178 632 -748 -661 -50 505 -996 266 290 252 -829 -1184 1427 169 20 -148 306 182 37 -1450 -181
2197 -181 895 -213 -395 1145 446 -233 -1401 669 1296 69 -599 641 792 7 -147 435 498 -663
2215 -663 -465 520 1695 -905 -1610 442 1332 -1362 13 334 677 -845 -1085 634 905 -1244 -914
2232 -914 861 1465 -268 -1431 737 1632 -177 -1431 856 572 -546 -591 1504 1422 -1941 -1399 688
2249 688 666 -1201 -418 754 439 -854 -1424 1413 1538 -1938 -1737 1768 1049 -1309 -330 846 624 -376
2267 -376 -868 1359 611 -1510 -771 1794 1071 -1065 -335 1498 1118 -1321 -398 1856 -288 -2107 -234
2284 -234 1727 929 -1455 -508 1567 818 -1337 443 1181 -331 -917 -327 1497 336 -1716 449 1231
2301 1231 660 -1647 280 860 -378 -1268 144 1227 -561 -1771 500 1283 -341 -1628 -179 1163
2317 1163 -700 -994 202 1406 -141 -1525 -352 1131 420 -905 230 2024 207 -1032 477
2332 477 1410 -19 -1214 88 977 -911 -1154 413 765 -301 -507 76 1028 238 -1101 354 1379
2349 1379 -266 -432 377 583 -224 -415 332 591 -62 -483 95 918 703 -612 -19 -401 470 -294 -636
2368 -636 905 106 603 183 448 -7 -304 190 321 326 -917 -272 1001 685 -281 -32 277 38 -1057
2387 -1057 -751 646 446 -520 -483 607 663 -737 -628 770 472 -865 -377 1061 671 -690 -709 26
2405 26 1403 -138 -413 1071 381 -584 -898 1174 1231 -513 -967 338 1311 -1014 -419 615 549 -1178
2423 -1178 -939 1510 243 -1077 -1384 664 612 -577 -1688 973 764 -482 -664 976 745 -1274 -611
2440 -611 1473 1006 -1151 -145 863 1216 -1077 33 597 153 -1320 -228 784 143 -1919 -1079 1344
2457 1344 323 -412 -701 1014 537 -1342 58 1654 190 -1506 -713 1485 1451 -1137 -688 1119 908
2474 908 -352 -234 1707 649 -1332 -804 1525 62 -1543 -650 1720 776 -2058 -222 1081 130
2490 130 -1210 -15 1119 151 -2253 -572 1990 852 -1346 -500 1042 244 -1329 468 1737 235
2506 235 -1459 -1010 830 566 -1229 -343 1573 412 -1761 334 2035 -331 -1901 362 2639 31
2522 31 -1235 280 1327 421 -409 -285 1078 432 -272 -59 1830 626 -1640 435 2057 -107 -2116
2539 -2116 221 1347 -146 -1205 316 1411 -581 -1342 432 1721 -194 -1355 667 1681 -900
2554 -900 -788 210 1199 -413 -1167 826 2205 -848 -1349 406 1041 -151 -450 501 178 151 -89 -47 939
2573 939 -399 -1238 533 945 -655 -865 1522 1311 -172 -71 875 567 -1045 -615 298 644 -382 30
2591 30 119 801 136 -729 211 1345 -700 -624 559 521 -986 -670 856 814 -254 -515 163 1031 439 98
2611 98 -315 -13 -410 -109 259 1140 -23 -231 312 1127 75 -397 -11 37 -27 -512 25 358 488 -947
2631 -947 137 978 753 -1514 -699 1402 122 -520 352 1118 167 -317 96 740 1107 -664 -669 307 805
2650 805 -2117 -580 1147 -106 -1820 -277 1047 -34 -1386 -798 1026 -66 -1633 185 935 699
2666 699 -202 -377 1421 301 -1933 627 2163 -498 -1536 -368 2598 -162 -1568 118 1134 -352
2682 -352 -2115 -69 1541 -2 -1468 288 1430 289 -1483 128 1750 -539 -1559 1158 1797
2697 1797 -504 -1012 470 1890 -1004 -1468 1148 1327 -949 -1832 727 1676 -508 -1935 589 846
2713 846 -1053 -944 530 1158 -1115 -1323 682 618 -571 -1234 1089 1621 -503 -696 1116 1025 -854 -1355
2731 -1355 1111 1641 -1048 -1480 1258 1219 -516 -1302 715 1270 -808 -603 637 1078 -905 -716 886
2748 886 853 -797 -650 956 1205 -1506 -200 881 1378 -264 -998 614 401 -756 -496 1143 353
2765 353 -834 -256 789 1452 -877 -708 1947 1205 -724 -196 1019 1258 -926 -464 1133 226 -1357
2782 -1357 -113 1805 572 -1048 -215 1312 -5 -1554 -629 1240 727 -803 -82 822 -73 -1701
2798 -1701 -591 1230 499 -425 -369 813 611 -1131 -591 315 -148 -464 -476 883 645 -1297 -339 655
2816 655 93 -1781 -604 85 -288 -1212 -429 1020 347 -795 -67 1534 26 -571 207 408 -326 -523
2834 -523 -88 595 552 -764 -124 846 -113 -680 -555 181 550 -1367 378 127 -33 -843 290 998 499
2853 499 -391 236 -113 82 -1081 171 718 623 514 421 -283 61 -403 125 1051 217 -300 -553 505 -315
2873 -315 -65 -450 -249 211 -289 -659 263 106 -655 -1432 576 -26 24 -159 684 694 177 285 941 961 677
2894 677 124 28 309 -143 -727 182 829 -860 -305 144 483 -1299 -656 435 398 -194 -507 1108 26
2913 26 314 132 938 904 -871 -357 1038 292 -639 -826 1300 1010 -382 421 1162 1463 -799 -571 1988
2932 1988 339 -1105 -874 660 740 -88 -337 1143 541 -722 -153 1142 263 -1723 -483 1422 658
2949 658 -822 -598 1293 107 -1069 116 2015 928 -1184 -213 746 -489 -1338 -664 922 222 -1810
2966 -1810 -220 961 -538 -1290 -305 989 -487 -2301 1105 1363 -399 -1192 42 963 -618 -1284
2982 -1284 -369 857 961 -1125 288 799 385 -1690 515 1107 -838 -1083 123 321 -387 -1246 50
2999 50 1535 -639 -893 475 193 -177 -767 558 1259 -525 -952 1202 859 -328 -1278 710 47 -711
3017 -711 -15 1037 205 -57 -378 429 291 -350 -324 697 1052 -434 -667 1118 1042 -895 -284 730 10
3036 10 -416 -80 223 168 416 -498 570 -185 -36 -986 -119 389 -770 -280 985 880 -134 -285 614
3055 614 -295 -283 -66 598 441 -491 -335 468 253 -904 -109 128 -268 -961 -330 102 585 -474 -135 -457
3075 -457 272 -366 -354 509 -304 390 504 -9 446 134 614 -193 813 458 -175 242 354 -854 -362 461
3095 461 -365 -57 -149 -270 294 -43 158 141 393 -463 -751 333 304 -325 11 257 524 1008 -14 724
3115 724 257 -114 -162 -19 435 -281 69 -214 240 -555 -935 141 485 -724 -534 -633 438 -419 -53 48
3135 48 -420 168 320 -147 -482 -356 -193 -16 -329 604 123 449 167 598 391 -69 214 339 172 -131
3155 -131 28 214 -1082 130 248 -291 130 250 791 -704 -407 337 -84 -543 -519 411 -348 -742 -696 458
3175 458 525 -262 -1102 209 15 -447 -949 745 130 -107 -135 -309 265 -763 -295 259 760 -681 -941
3194 -941 665 23 -664 -310 633 -110 -448 -762 -14 494 -1062 -18 1006 -203 -916 -397 637 387
3212 387 -513 -2 1070 247 -739 -548 637 -291 -1628 -243 712 768 -622 284 186 -450 -756 -189 1000
3231 1000 -37 -759 65 783 -43 -1028 -257 657 -891 -1065 -20 525 -109 -311 568 664 -131 -410 437
3250 437 730 -237 -1220 653 356 -553 -1129 568 602 -1104 -913 757 265 -821 -73 905 558 -689
3268 -689 -676 1397 530 -575 -174 480 90 -766 -498 454 302 -850 -384 463 -656 -666 -561 447 451 -1054
3288 -1054 369 650 -13 -430 -52 717 259 -660 220 634 401 -1269 105 366 44 -236 226 1212 702
3307 702 -292 178 986 -871 -536 -301 467 -84 -150 -24 859 470 -396 477 -606 -134 -632 -706 500 -431
3327 -431 94 797 352 170 -76 1004 237 -736 -550 791 1040 18 -124 -62 611 -466 22 815 111
3346 111 107 -993 103 889 -287 -759 -379 639 -601 15 -438 776 -291 -336 284 377 173 308 -5
3365 -5 745 -56 -578 -534 -207 55 -529 -272 450 -375 -50 -324 416 -489 -293 212 165 244 32 -522 656
3386 656 224 -1010 173 465 -884 -998 -52 677 -461 141 -328 305 728 -67 -8 -28 107 -234 -188 381
3406 381 107 -422 -417 327 215 86 -132 218 423 -694 -563 282 -239 -822 -402 540 174 -980 -189 378
3426 378 624 -543 -51 932 -540 -580 151 434 -230 -522 610 -16 458 -455 473 791 -361 -587 -196
3445 -196 860 80 -788 -141 743 -376 -718 326 812 -263 -717 -268 309 555 -488 15 302 233 -678
3464 -678 204 780 -754 -618 631 420 64 -1028 -123 613 -707 -373 333 1291 307 -1174 384 538
3482 538 37 -952 -100 402 -426 -588 672 1273 -303 -827 780 617 -291 -316 914 246 -743 -355 27
3501 27 911 -636 -699 508 1248 -393 -572 462 738 -806 -562 1211 822 -267 -1176 231 411 -1113
3519 -1113 -703 684 1603 -1047 -458 304 727 -1199 -126 1593 580 -577 -439 1325 135 -983
3535 -983 -75 1555 729 -1250 -602 1172 -411 -1847 -347 1412 504 -979 3 1358 714 -1234 -305
3552 -305 173 371 -369 155 1459 247 -881 367 1058 41 -1381 -262 189 241 -824 -317 885
3569 885 56 -863 576 524 -436 -972 -483 739 450 -319 -376 899 675 -627 236 789 -146 -864 129
3588 129 1198 422 -685 421 566 32 -925 517 478 531 -711 84 416 59 -180 -921 936 -133
3606 -133 76 271 53 -57 -464 202 593 -27 -660 70 501 460 -952 -97 590 -52 -430 -602 720 278
3626 278 -471 -374 1034 383 -1460 -181 559 97 -815 -243 133 -25 -1019 103 477 504 -626 -745 1308
3645 1308 77 -749 -471 947 114 -763 -109 794 -311 -568 -124 1050 -186 -681 171 530 -41 -1153
3663 -1153 -915 687 188 -924 -386 1011 -454 -1146 -168 711 298 -694 437 622 688 -929 -469 757
3681 757 378 -1336 -245 1439 -8 -1733 749 1330 -239 -1233 -299 927 -418 -1489 480 1810
3697 1810 -177 -853 -734 874 -942 -846 -372 1766 -916 -1395 -426 1852 -946 -1087 514 767 -6
3714 -6 -1212 456 1114 486 -845 37 1098 285 -1224 -82 484 707 -1241 343 1761 297 -1676
3731 -1676 552 883 -751 -1095 170 974 -417 -1081 81 1289 -357 -683 0 233 -234 -1238 736
3748 736 756 -871 -1266 894 2194 438 -1276 425 1475 -597 -741 435 1915 -788 -1672 -40
3764 -40 530 -602 -1324 1138 713 -836 -891 770 574 -839 -1060 556 1340 -351 -1829 1353 687 -1418
3782 -1418 -344 951 1266 -258 -1588 925 935 -175 -1111 989 996 -890 -1565 967 880 -742 -1234 1084
3800 1084 895 -1158 -1009 1252 1283 -1171 -365 1514 538 -37 -713 1364 879 -867 -577 703 535 -1336
3818 -1336 -472 525 1099 -1869 -871 1418 587 -745 -1244 1302 523 -835 -479 905 496 -1115 -545
3835 -545 1504 468 -698 -647 732 1721 -831 -91 1789 725 -1683 -708 930 27 -1106 -1311 1150
3852 1150 612 -1149 -629 1117 589 -283 -855 566 159 -959 -1260 223 573 -818 -639 443 419 -300
3870 -300 302 1002 32 -805 -515 733 1187 -931 -1121 897 291 -914 -578 973 145 -1088 -607 639
3888 639 652 -1108 -552 643 818 -575 -254 448 853 -483 -1017 647 1422 -897 -333 -40 206 -706
3906 -706 -998 508 429 -726 -1702 1306 743 -1165 -377 1379 1072 -443 -1024 1541 694 -1515 -1079 506
3924 506 -299 -1366 -600 1356 853 -1347 -990 915 907 -1616 -1228 1164 619 -1344 -591 1203 123 -1000
3942 -1000 -127 1068 -349 -594 -1138 2119 382 -1043 -216 1891 654 -1234 -380 957 650 -1550
3958 -1550 -1244 1733 520 -1591 -790 1405 498 -2240 -1065 1469 489 -1668 -73 2269 542 -1223
3974 -1223 -456 1141 247 -1119 -280 1913 480 -1516 49 1352 761 -1585 -294 1456 454 -1017
3990 -1017 -786 1182 -14 -1339 -1028 555 85 -1299 -479 2348 480 -1732 -428 1318 674 -1242
4006 -1242 336 1359 -172 -2099 623 1838 666 -838 257 1338 432 -1306 281 1854 -300
4021 -300 -1404 3 1493 -556 -1832 312 1753 11 -1643 -193 1686 514 -539 -86 1634
4036 1634 450 -1350 -158 1882 478 -1401 161 2264 -464 -1519 169 1391 -289 -1275 206
4051 206 610 -375 -1117 -254 1873 72 -981 210 1750 -723 -1791 460 1532 -346 -1549 399
4067 399 1158 91 -1674 515 1144 -836 -777 179 2089 -370 -1533 1219 1809 -280 -1977 431 1889
4084 1889 -701 -2220 830 1466 -610 -1029 788 1289 -497 -1209 326 1322 -578 -1954 422 1374
4100 1374 222 -1350 973 997 -528 -1050 643 654 -190 -1467 736 1646 -280 -920 420 1341 -1162
4117 -1162 -1334 576 1213 -865 -1745 1091 385 -380 -1973 563 790 -475 -1429 584 771 -553 -769
4134 -769 -408 1323 -332 -1265 310 1279 -365 -1803 526 627 -38 -108 -213 942 -667 -788 266
4151 266 772 -121 -1289 -404 1473 95 -1308 878 1277 -669 -1116 1030 1012 -606 -1308 682 1033
4168 1033 -466 -1560 385 1794 -26 -1340 415 2187 -740 -1138 460 1675 -217 -1412 634
4183 634 1331 -563 -2039 746 1205 -165 -1622 -249 711 -728 -1575 801 1654 292 -1280 521
4199 521 1743 -764 -1521 1296 2098 -203 -1008 963 847 -744 -1221 1207 1065 -1422 -1181 1103 679
4216 679 -862 -1197 1010 2008 -1709 -865 608 1852 -1239 -854 1237 1623 -1299 -1059 1947 1270 -1320
4233 -1320 -1643 1409 1651 -1204 -1086 1840 1639 -2325 -1008 1275 799 -1267 -1268 997 1339 -1695 -1184
4250 -1184 675 949 -1341 -1172 1521 997 -853 -359 2139 1099 -1730 -1043 2129 1189 -354 -815 930
4267 930 1623 -1529 -610 1306 1238 -1458 -106 1234 1380 -1595 -559 867 471 -1262 -1069 1721 840
4284 840 -1379 -966 1181 116 -1312 -286 1659 808 -1368 -520 1762 468 -1308 -462 1332 272
4300 272 -1332 -472 992 758 -1251 -266 1059 387 -584 -493 1403 653 -1044 -423 856 1550 -2199 -823
4318 -823 944 911 -1110 -329 1495 794 -1399 -1423 1057 785 -790 -800 1484 1476 -1765 -898 1680 1207 -827
4337 -827 -498 2013 218 -1811 -417 1006 467 -1317 -172 1179 471 -1255 -47 1616 1313 -1485
4353 -1485 -572 1781 303 -1560 -1143 1175 520 -2027 -492 1693 268 -1340 91 1546 860 -1098
4369 -1098 -425 1745 550 -1526 -628 1427 1205 -1028 -42 497 61 -1306 -425 1168 379 -1154 -350
4386 -350 1106 -13 -1541 312 1232 -605 -1299 -766 1824 270 -852 -272 1082 -152 -963 -372 652
4403 652 251 -1610 -922 1246 54 -2073 -1266 1096 50 -1481 -647 1153 114 -1871 -766 1212
4419 1212 729 -1204 255 1354 -377 -1327 411 1774 1434 -1533 -23 1216 126 -1109 -72 1421
4435 1421 701 -842 -634 914 386 -1445 66 694 354 -1640 -27 1769 185 -1428 -679 2252
4451 2252 568 -1758 -214 1665 1051 -831 -376 2650 374 -1372 -1 1241 -310 -1921 -495
4466 -495 2562 375 -2029 -70 1727 -240 -1967 471 1479 -168 -1902 -274 1615 304 -1811
4481 -1811 155 1586 -141 -1758 -111 1831 -672 -2006 1037 1229 155 -1661 107 1890 -995
4496 -995 -1646 1593 1530 179 -1207 292 1532 -1087 -1852 -11 1927 86 -1969 -362 1133 -125
4512 -125 -1274 695 1065 -756 -1365 962 1530 -1089 -910 675 1594 -912 -1347 815 1481 -926 -600
4529 -600 344 1612 -596 -1780 554 1517 -141 -2344 647 1287 -201 -2136 936 1294 -1263 -1641
4545 -1641 1020 377 -555 -1429 858 2113 -1127 -1677 25 1088 -516 -1014 869 1385 -363 -710 439
4562 439 1132 -1716 -1369 362 1697 -881 -1747 957 1290 -1133 -1283 891 666 -1601 -1502 316 1114
4579 1114 -477 -1495 789 579 -634 -1504 589 670 -589 -614 1159 874 -432 -1525 1298 1242 -1051
4596 -1051 -1090 969 1287 -1060 -1322 180 1045 -887 -1258 565 566 -1054 -1037 421 529 -707 -1400 267
4614 267 1079 -729 -621 750 388 -457 -570 825 813 -885 -730 1098 1437 -919 -1001 495 397 -837
4632 -837 -2034 823 913 -1191 -1554 1045 425 -1082 -962 243 930 -827 -1388 778 1339 -921 -751
4649 -751 1279 2189 -1120 -1188 961 902 -874 -1043 614 522 -705 -845 1051 531 -1195 -609 1181 672
4667 672 -1070 -1632 356 734 -695 -612 1111 1365 -920 -1384 1276 1817 -1463 -528 829 1186 84
4684 84 -914 606 1006 -1344 -1006 817 1078 -1580 -1210 543 784 -979 -846 1118 558 -1144 -1379 996
4702 996 1193 -1449 -883 1322 1337 -932 -706 1122 843 -1218 -392 1960 1592 -1248 -1353 739 303 -1181
4720 -1181 -1161 518 657 -945 -860 1310 630 -1068 -1322 337 945 -854 -357 968 542 -1853 -895 1324
4738 1324 989 -1289 -725 1075 827 -1366 -609 1521 702 -1277 -694 755 1162 -2061 -1300 1518 1149
4755 1149 -1393 -1139 1646 309 -2365 -791 1270 869 -1381 -451 1460 260 -1048 -1365 1237 456
4771 456 -1540 -1190 1458 -49 -2001 -218 1489 29 -1570 -16 1359 35 -1264 -484 1364 -107
4787 -107 -1238 -101 1685 122 -1430 -137 1605 562 -1321 158 1386 -238 -1993 -282 1233
4802 1233 -309 -1379 185 1376 -153 -854 -289 2094 -227 -1149 226 1830 602 -1219 590 1076
4818 1076 97 -1464 -67 1525 479 -1694 -436 1410 -579 -569 256 1331 -312 -1530 344 1544
4834 1544 603 -749 179 1601 -445 -641 367 1526 470 -1323 752 1423 599 -503 295 1301
4850 1301 250 -905 -4 987 92 -861 -440 755 31 -716 285 1119 -199 -1210 -685 795 3
4867 3 -1015 -54 900 -94 -961 184 1684 808 -1706 -118 1251 351 -574 516 1611 -96 -1018 283
4885 283 1227 144 -1301 -17 628 -58 -956 -44 1232 -218 -311 492 1158 -212 -1456 -233 1037
4902 1037 30 -667 407 1536 19 -746 48 1078 205 -910 -416 1538 -330 -1446 247 1532
4918 1532 -286 -876 297 916 173 -928 -140 1349 22 -1765 21 1954 -161 -1238 239 1618
4934 1618 173 -1065 -211 1022 -323 -1479 655 1285 129 -1371 -179 910 -127 -752 -29 789
4950 789 -879 -1701 213 1313 18 -1423 675 621 472 -1190 355 679 -266 -921 366 1083 -246
4967 -246 -1402 803 923 -130 -1087 713 806 -197 -714 990 1399 -719 -1486 127 1198 -1261 -1145
4984 -1145 288 1460 -191 -1086 739 1194 -1046 -987 -2 754 -920 -1677 276 1129 -635 -1003 233
5001 233 940 -1202 -1588 832 1419 -910 -1064 530 1528 -114 -1414 351 1711 -996 -1352 850 839
5018 839 -331 -582 668 1506 -622 -1812 703 1278 -1664 -1578 1065 1382 -1833 -946 463 1832 -1378
5035 -1378 -486 1456 1040 -702 -90 1234 982 -1187 -983 989 852 -1077 -1250 1089 631 -1436 -985
5052 -985 1349 -227 -1410 -1402 1202 791 -789 -822 994 177 -1391 -1087 282 1960 -813 -1000 209
5069 209 1280 -646 -550 1926 392 -406 102 1025 1385 -376 -1199 1001 618 -742 -154 -123 841 -1431
5087 -1431 -1289 1174 807 -1525 -935 1069 253 -675 -1022 563 547 -333 -840 1132 701 -389 -318 781
5105 781 1069 -1374 -122 172 432 -1411 -950 563 364 -764 -1301 1265 476 -1380 -1165 -60 362
5122 362 -725 -829 517 433 -916 -268 974 377 -659 258 858 199 -466 -1318 696 391 -857 -182
5140 -182 830 960 -1003 -1355 428 728 -502 -1292 521 409 -821 -847 400 609 -1277 -1014 283
5157 283 165 -923 -509 959 780 1 -312 558 628 -601 -416 910 845 -1580 -187 1019 755 -1424
5175 -1424 -356 463 568 -897 -883 1695 266 -1061 -169 1240 553 -1344 99 1706 562 -971
5191 -971 -174 607 -97 -1370 -464 1174 -236 -1283 -364 952 586 -530 -718 594 205 -782 -453 989
5209 989 463 -1835 -955 861 477 -1447 -559 1204 -613 -1395 -578 1037 863 -1330 -971 1351 -199
5226 -199 -714 338 599 361 -1639 -261 909 598 -1465 -488 1674 1084 -844 -371 1060 749 -1943
5243 -1943 675 993 572 -1324 -230 1366 -153 -1145 -248 1222 -52 -1113 164 963 -169 -1196
5259 -1196 -222 955 115 -1660 -20 1053 226 -1446 -5 1482 -291 -285 880 1051 77 -579 -487 1183
5277 1183 -550 -788 865 968 -867 -1921 506 1022 -44 -1689 -119 1277 211 -825 38 903
5293 903 26 -1051 -99 1129 -419 -708 397 591 226 -723 376 1448 102 -980 302 615 -896
5310 -896 -392 -83 1221 -12 -1394 -271 898 -565 -1005 579 1230 -190 -1257 847 929 -90 -320
5327 -320 342 888 -132 -1083 -257 1189 28 -198 -267 955 -231 -322 748 1134 -139 -1195 -300 75
5345 75 -254 -873 1273 651 -625 -879 13 1086 1 -876 1174 904 157 -826 1149 1550 -465 -904
5363 -904 329 1088 -167 -361 -286 744 -397 -1003 -104 1243 -38 -757 67 796 165 -800 367 1143
5381 1143 -373 69 -212 1070 266 -1104 -45 1029 -488 -963 65 1410 -523 -475 -37 1626 -379
5398 -379 -685 -85 815 -190 -731 200 705 -690 -1002 -170 1128 -159 -1360 72 758 8 -921 84
5416 84 595 -180 -1490 537 614 -674 -464 230 975 -496 -763 309 1083 -258 -800 403 504 390
5434 390 -1248 337 1077 -131 -788 411 1100 -570 -1263 924 643 -601 -921 932 414 -479 -728
5451 -728 401 1686 17 -1009 1285 1060 -724 -1117 378 672 -592 -1345 473 819 -953 -1113 481
5468 481 989 -871 -338 13 948 -920 -678 1085 1477 -1407 -979 486 660 -880 -176 456 948 -1226
5486 -1226 -868 1338 491 -387 -476 102 1170 -804 -569 1079 523 -72 -1177 724 1126 -531 -605 527
5504 527 989 -526 -157 640 722 -936 -1081 1059 326 -819 -578 1123 806 -786 -649 606 1050 -955
5522 -955 -273 626 1442 -106 -838 1302 372 -353 -456 507 1062 -1279 -1158 591 453 -1515 -749 454
5540 454 520 -112 -249 889 22 -114 -289 917 -398 -840 -240 796 803 -784 0 721 617 -525 -865
5559 -865 1057 11 -313 -877 996 618 -1095 -656 642 573 -817 -552 387 52 -893 -343 1164 91
5577 91 -47 -693 931 851 -297 535 340 633 -1409 -702 609 99 -833 -272 769 -746 -853 -585 1215
5596 1215 670 -533 -946 1118 140 -701 -751 67 -99 -910 -432 914 480 -1084 477 901 837 -1124
5614 -1124 -634 599 709 -376 -343 515 761 -221 -368 989 395 -261 -509 594 597 -845 89 1007 1164
5633 1164 -373 -382 391 491 -570 -569 871 326 -1332 -153 718 936 -539 -1392 131 577 -961 1
5651 1 658 296 -304 -675 1289 -80 -919 -385 1541 562 -921 132 937 592 -428 -445 766 697 -1600
5670 -1600 390 512 616 -878 258 548 352 -594 50 702 29 -891 -516 1375 -325 -1102 283 712
5688 712 188 -527 -891 1726 285 -1457 -397 1464 363 -579 78 332 -95 -699 -388 1154 65
5705 65 -1063 -322 898 -256 -1155 500 416 101 -1445 -22 1274 418 -1274 -132 1280 -134 -2046
5722 -2046 717 1125 -172 -1341 466 681 -32 -1365 -158 1143 -291 -1438 -394 855 -388 -486
5738 -486 -574 954 -650 -424 256 586 -594 -778 49 1051 -140 -987 442 1218 -96 -741 -1 595
5756 595 -64 -1261 249 1305 115 -863 707 434 -493 -25 118 649 -917 -248 526 1175 -490 -1249
5774 -1249 230 742 -667 -815 56 1004 -727 -422 310 1155 -645 -248 966 323 -521 -530 401 540 -605
5793 -605 -579 1056 391 -710 -629 1288 727 -574 -603 334 217 -466 -842 165 1275 -346 -1054 -213 895
5812 895 -18 -683 -421 1119 -210 -1712 1162 725 -742 -851 447 93 -540 105 157 -97 -952 -757
5830 -757 -186 674 -976 -1112 241 129 -1020 -90 351 143 -471 -911 143 319 -335 -670 -268 343 31
5849 31 -193 397 241 -789 -564 108 42 25 -288 850 863 129 -760 58 1294 -711 77 540 296 172
5869 172 -1021 256 1057 -242 -410 128 295 -474 -1047 574 704 -606 -111 624 481 -448 -535 215 578
5888 578 -106 -892 451 638 -240 -303 658 685 104 -1218 733 770 -149 -798 -515 745 -1028 -369 817
5907 817 822 -899 493 1054 856 -903 -383 1508 365 -873 -1396 1023 587 -1203 -1141 438 514 -1076
5925 -1076 -447 810 451 -705 -1163 418 234 -938 -947 497 230 -712 -883 1566 785 -959 -632 736
5943 736 820 -699 -164 652 337 -449 -222 807 159 -1075 -610 821 741 -938 -1618 1049 790 -606
5961 -606 -954 575 640 -1206 -711 247 105 -1140 -441 1367 1160 -464 -822 966 1014 -479 -826 790
5979 790 146 -1603 -457 672 482 -921 -906 811 643 -677 -388 480 -535 -885 -1466 1200 294 -556
5997 -556 179 911 707 -807 42 1651 51 -194 -326 752 437 -1328 992 1039 590 -629 -375 1007
6015 1007 161 -720 -1083 1148 67 -972 568 663 128 -496 -478 1266 -76 -690 70 941 -919 -1194
6033 -1194 481 854 346 -207 -44 1220 -273 -947 405 1359 -326 -1271 912 433 -191 -1274 -233
6050 -233 311 -563 -753 397 -6 -520 -536 1144 1066 -601 -625 -93 442 -35 -728 253 295 786 -499 -197
6070 -197 680 397 -326 59 1264 95 -610 97 623 -142 -548 419 590 -630 166 290 1509 -285
6088 -285 -1174 511 1311 -150 -329 -434 557 -324 -94 419 325 -467 -657 -43 441 -488 -978 70 512
6107 512 348 -690 276 -236 287 -567 -726 672 143 -611 929 414 -589 -194 -297 710 -338 -474
6125 -474 413 886 -1 -705 304 801 -649 -1368 556 1427 -413 -328 -266 1253 -221 -1013 222 952
6143 952 411 -203 106 1303 85 -950 226 762 -368 -780 411 701 -183 -703 758 990 -283
6160 -283 -569 -354 740 290 -786 252 741 180 -470 252 1581 -114 -1578 212 403 -251 -437 114
6178 114 318 75 -918 839 633 -765 -1545 477 850 -36 -335 539 1020 -931 -1131 458 1497 -588
6196 -588 -281 88 840 -693 -372 1088 1403 95 -726 367 469 -627 -371 -119 380 -598 -730 643
6214 643 1294 60 -545 1016 861 -575 -833 802 383 -617 296 1131 1355 -605 -519 494 770 -1021
6232 -1021 -583 482 225 -980 -419 788 887 -898 -667 1095 1198 -527 -1009 360 809 -722 -1036
6249 -1036 415 289 -864 -1009 342 69 -540 -369 285 816 -442 -283 471 181 -248 224 1512 20
6267 20 -14 -315 794 570 -44 439 1955 99 -854 -1061 373 -2 -175 -692 1060 718 -913 -513 465
6286 465 692 -915 -1024 -196 231 -521 -314 37 108 -921 -683 633 1157 -771 17 520 729 -632 -332
6305 -332 1685 797 -1125 92 1197 701 -334 604 284 203 -1107 98 1260 1048 -1203 -848 707
6322 707 -144 -736 -7 822 872 -818 -293 994 284 -1165 -636 709 195 -514 -636 684 272 -702 -378
6341 -378 957 86 257 -811 331 -64 -639 -492 337 896 -603 -234 319 111 -691 -161 -147 28 -31
6360 -31 54 723 -44 513 -555 554 458 -781 -1313 884 85 -990 -615 -58 861 -1011 116 644 152
6379 152 -577 237 220 514 -783 -483 901 -78 -754 -681 516 414 -948 206 1118 -43 -58 -476 908
6398 908 655 -70 288 847 700 -1491 -332 895 -9 -1411 -528 618 -361 -936 -823 365 -33 -595
6416 -595 588 1101 -11 -1116 4 1236 -299 -1327 91 729 174 -1468 277 964 503 -741
6432 -741 -41 784 384 -668 -310 1044 178 -908 -88 1556 -152 -689 -271 788 -701 -663 54 1244
6450 1244 -262 -830 -218 869 -345 -1283 -27 409 275 -1050 122 -21 375 -898 993 585 -473
6467 -473 -710 268 1329 -550 -1242 -514 790 42 -1466 656 562 146 149 62 468 -229 -886 -159 478 -496
6487 -496 -326 432 896 -553 -1096 -29 -192 -57 -1481 744 560 113 -1401 319 819 -831 -201 811
6505 811 544 -321 -412 -275 1113 -984 -634 374 575 -1236 -286 213 199 -326 -431 238 597 -512 -481
6524 -481 417 624 -813 -572 51 176 -278 -733 35 1002 645 -1155 1031 75 -615 -857 -229 609 -574
6543 -574 -583 133 72 -921 -386 177 325 -259 91 366 -135 -542 -443 -157 32 -699 -1085 617 996 -553 -264
6564 -264 740 799 112 -47 447 -128 -1026 -845 188 552 -485 -1579 774 356 -454 -327 686 84
6582 84 -496 -577 528 292 -940 -944 546 1220 134 -815 550 645 271 -993 347 249 -115 -1378 516
6601 516 836 -365 -688 519 569 -568 -1481 277 1262 -1280 -559 1713 -15 -307 17 -136 207 172
6619 172 -324 374 689 -41 -520 1000 1150 187 -41 984 337 -530 -348 774 286 -258 -1094 -139 383
6638 383 -452 507 90 434 -427 -462 638 1961 -517 -882 855 574 -421 -75 829 814 -536 32 196
6657 196 421 -164 -341 300 686 -1610 -538 192 1191 -1123 -632 808 123 -1095 -1059 615 -345 81
6675 81 -1009 367 946 176 528 1116 546 -589 -678 799 88 -374 427 929 -229 -735 -81 1486 491
6694 491 -1157 -459 1230 487 -957 -390 688 211 -949 -166 665 433 -891 -356 982 -464 -1570
6711 -1570 -384 916 10 -856 -628 635 506 -1730 235 1717 418 -678 -258 766 471 -197 -459
6728 -459 1075 266 -1201 751 448 -222 -340 -218 1028 -466 -834 -514 1186 -276 -860 -418 699
6745 699 -549 -938 -611 689 -549 -493 46 791 7 -746 549 1743 735 -1003 637 961 1017 -809
6763 -809 130 965 18 -510 -310 269 227 -408 405 1057 -565 -864 57 394 -40 -715 61 1095 119 -110
6783 -110 -242 680 194 -777 1213 1647 110 -1172 -216 688 224 -289 949 817 -428 -299 57 397
6801 397 -620 -913 21 776 98 -1527 -76 804 -58 -456 11 488 105 -753 1109 1163 -449 -518 225
6820 225 243 -392 -530 277 481 -685 -996 813 894 162 -608 -552 603 -567 -996 -27 535 -808 -699
6839 -699 -541 1090 159 -963 -544 914 -238 -1134 318 850 106 -1141 260 1130 221 -742 -361 342
6857 342 -208 -984 -193 872 118 -639 272 783 -101 -844 -416 391 -578 -964 726 1181 32 -637 187
6876 187 719 648 -61 1078 28 -73 -747 90 703 -417 -1584 438 950 -870 -798 116 1054 120 -507
6895 -507 -226 770 -763 -829 276 122 -294 -1184 403 1172 -574 -538 440 363 -842 -365 -171 1079 -418
6914 -418 -1241 200 1337 -788 -767 643 407 -463 -708 -86 1185 -395 -851 983 970 -1569 -484 1230
6932 1230 409 -713 -824 1040 391 -915 -646 784 1171 -330 235 942 839 -116 -1369 498 1637
6949 1637 -673 -575 670 509 -462 188 734 420 -760 -607 1059 439 95 -607 297 341 -949 -820 502
6968 502 81 -379 -394 167 637 -493 18 643 645 -359 -953 901 409 -924 -150 1019 352 -616 -550 726
6988 726 144 -477 139 1098 218 -1027 -597 391 304 -1334 -13 902 -250 -1139 -83 1153 -110 -938
7006 -938 -210 622 608 -464 384 -15 -94 -1189 -72 1020 314 -774 38 1163 131 -155 -486 -316
7024 -316 694 -1434 -509 681 -290 -631 -313 767 519 -1199 -89 1161 -592 18 319 818 22
7041 22 -1129 -136 1480 321 -586 -721 496 134 -777 -215 278 632 -300 464 1140 -51 -507 -50 867
7060 867 511 -1129 -202 1069 209 -337 -555 1343 103 -997 -403 1065 220 -981 -824 759 -364
7077 -364 -981 -1082 308 449 -927 -133 911 311 -1667 -553 241 870 -894 -431 756 155 -1491
7094 -1491 -211 646 441 -1095 -557 533 113 -659 -180 753 406 -576 304 657 365 -1256 235 707
7112 707 5 -1327 -565 1620 727 -271 257 522 -275 -1285 -397 366 447 -988 -300 604 190 -903 90
7131 90 482 -106 -572 -891 596 56 -1006 -605 925 535 -694 540 783 -587 -1028 427 1054 -227
7149 -227 -703 -51 875 -427 -1186 11 999 34 -238 -429 -69 -555 -1253 597 1146 137 -1336 260
7167 260 1156 267 -141 -179 909 -489 -1407 -255 1004 96 -1134 -219 601 119 -922 122 805 10
7185 10 -566 349 2016 -117 -1181 244 808 20 -1442 777 1468 -282 -1312 31 586 -111 -1123
7202 -1123 573 1087 -839 -655 818 958 -174 -299 579 890 -643 -1098 1206 59 -516 -220 -11
7219 -11 1600 -445 -1057 759 506 -211 -1282 624 -29 -655 -733 26 727 -464 -770 -140 726 -316
7237 -316 -283 437 578 -436 -1613 467 55 -59 5 267 727 -631 -661 266 715 -900 -339 630 1413
7256 1413 -596 -587 1423 1086 -994 -480 -143 180 -293 -655 934 1058 -565 -665 -163 -524 -652 -669 274
7275 274 652 -137 -338 683 98 -81 -1357 636 830 -584 -101 -181 -85 -1303 -615 426 272 -480 -354
7294 -354 778 713 -324 -163 1052 249 -1029 -942 620 86 -169 -710 1219 573 -1160 -399 479 92
7312 92 -966 -300 639 974 -716 -339 1284 407 -631 -629 120 128 -204 -678 365 460 -397 -647 581 96
7332 96 -1162 -512 429 220 -498 -265 1198 823 -634 -855 299 148 -394 -147 -135 1175 -283 -389 138
7351 138 21 -524 -799 1118 749 -135 -633 1067 818 -764 -398 699 426 -440 -349 495 150 -457 -136
7370 -136 258 547 -559 -627 670 621 -396 -1033 956 350 -205 -251 352 109 -653 -115 42 394 -982
7389 -982 -375 1060 757 -698 -230 343 353 -546 -221 1216 -29 -572 -420 389 351 -569 -322 1262 1380
7408 1380 -906 -371 977 357 -480 -611 673 644 -1137 -201 828 -55 -1119 -330 718 56 -1455
7425 -1455 -55 576 490 -897 -225 524 -373 -668 68 939 -134 -666 74 473 -136 -1717 -510 440
7443 440 829 -1050 117 689 -292 -414 -643 55 87 -513 -579 933 590 -1004 -579 461 -47 -440 419
7462 419 676 -18 -1270 -603 1440 -823 -1408 -426 264 315 -1066 -38 1293 625 -1208 -529 653 430
7480 430 -1317 -155 943 -3 -1465 297 467 1371 -687 8 1202 -273 -1564 -235 1206 -492
7496 -492 30 -260 911 447 -767 578 1111 -714 -943 -575 1256 -522 -1071 27 809 -354 -1020
7513 -1020 408 1063 -75 -1017 63 263 -86 -783 -18 1173 199 -751 321 805 -141 -947 13 1281
7531 1281 312 -938 -459 567 -386 -1102 23 1548 -9 -786 89 465 87 -700 347 -51 -453 -806
7549 -806 419 313 -1333 -909 -116 1235 145 -261 25 785 -634 -340 950 786 195 -1335 884
7566 884 644 181 -1044 -402 690 -359 -622 245 748 -237 -946 171 868 519 -1133 -408 308 -329
7584 -329 -346 538 1164 -798 -814 -91 450 93 -1509 261 165 -508 -749 282 1223 -301 -542 481 1088
7603 1088 -727 -1031 509 606 99 -1056 -244 1130 -18 -900 13 1499 -731 -1555 -256 502 -282
7620 -282 -236 844 672 -584 -258 366 1080 -252 -330 935 672 -473 -688 -41 1175 -845 -550 484
7638 484 298 -589 -249 328 203 -714 -1017 -294 1512 -352 -605 271 899 -393 -694 242 1319 219
7656 219 -394 225 410 -209 -1150 950 393 70 -829 859 517 -451 -1298 475 1169 -781 -1316 289
7674 289 473 -346 -341 911 -84 -1511 -282 779 157 -527 -317 75 672 -789 -1079 87 344 -1070
7692 -1070 -375 639 1361 -680 -1176 762 599 -1387 -1060 796 620 -1364 -1005 777 336 -1058 21
7709 21 1131 446 -1338 -579 415 384 -875 -1122 1341 506 -770 -389 893 709 -851 -989 -650 141
7727 141 -655 -1012 968 665 -828 -317 458 884 -838 -547 860 864 -726 -336 120 332 49 -526 1136
7746 1136 263 -534 -619 796 178 -262 86 423 823 -530 -140 727 802 -1241 -239 624 96 -1249 -561
7765 -561 976 368 -547 148 26 373 -339 36 -59 -222 -542 -915 648 471 -929 -658 241 -43 -125 37
7785 37 174 518 -614 68 303 479 213 -781 915 561 -980 -510 964 229 -161 -231 882 -329 -1167
7804 -1167 -90 639 178 -471 -346 956 101 247 -310 477 150 288 -565 595 187 -832 -337 684
7822 684 604 -144 107 537 1010 -168 -1041 661 361 79 -22 1154 683 -421 -463 812 609 -963 -51
7841 -51 51 132 -1236 113 228 -118 -969 -241 309 178 -1050 225 966 89 -794 -117 828 515 20
7860 20 -162 13 343 -386 -163 112 -584 -447 -539 553 -95 -321 383 279 270 -878 -126 429 -263 -27 -103
7881 -103 878 170 -701 -169 955 419 -866 -221 130 986 -782 -366 1063 -865 -1014 -76 274 -316
7899 -316 -1345 217 895 494 -265 743 804 -362 -589 -49 795 625 -473 100 957 33 -1299 676
7917 676 1299 385 -621 551 954 -267 -1240 61 771 -169 -698 315 1084 -607 -777 -9 486 559
7935 559 -1268 12 1224 -342 -722 -317 495 -325 -433 668 959 119 -986 1035 1276 46 169
7952 169 514 378 -67 -325 -657 864 303 -942 342 575 -221 -950 506 1116 -339 -950 -107 512
7970 512 -92 -748 443 68 -256 -655 208 463 -366 -1140 222 336 -148 -1020 430 557 -46 -1132 -137
7989 -137 494 -61 -936 557 285 -1243 -141 407 367 -509 197 572 419 60 -916 380 429 -480 -831
8008 -831 2 759 -530 -206 905 19 -577 -1363 427 871 -261 -34 255 786 -1063 -504 502 1197
8026 1197 215 -707 246 198 -471 -1323 -40 715 -71 -282 -333 137 -260 -229 140 1164 -790 -419 381 272
8046 272 -552 -427 629 392 1 -484 267 538 67 -584 -205 574 47 -473 -545 -494 -273 -574 626 504
8066 504 -378 -347 233 254 42 -584 555 -167 -403 -867 486 -287 1051 -271 631 77 -161 -613 664
8085 664 591 -698 34 -24 830 -687 -639 200 1213 -658 -290 -261 190 -664 -1002 599 882 -805 -609
8104 -609 175 159 -100 -953 60 474 -726 -102 700 337 -499 -422 863 521 -801 -380 899 244 -60
8123 -60 -294 778 80 -1017 -801 -352 899 -638 -708 764 8 -359 297 1408 1098 -58 -170 562
8141 562 406 -21 -1084 584 538 -612 -984 -91 431 -304 305 617 177 -439 -712 151 305 -1071 99
8160 99 253 560 -1180 85 977 -154 -279 -676 59 -225 239 -114 866 172 -875 -456 693 -408
8178 -408 -873 -1123 1275 642 -837 432 738 366 -383 -147 388 905 -623
8191f23
$$ Imaginary data points
##PAGE= N=2
##DATA TABLE= (X++(I..I)), XYDATA
0 0 0 0 0 0 0 0 0 0 0 0 0 0 0 0 0 0 0 0 0 0 23 -64 64 -64 64 -64 66 -94 127 -128 132 -169 192 -201 241 -263
36 -263 297 -332 371 -413 457 -506 564 -625 689 -760 838 -921 1018 -1116 1237 -1360 1498
53 1498 -1655 1835 -2037 2260 -2530 2845 -3214 3668 -4240 4969 -5952 7338 -9454 13010
67 13010 -20158 39941 -197980 -677415 -105306 242160 -5993 -60631 264710 237525 -126526
78 -126526 -202069 117963 219938 -68756 -240236 66887 286219 -19796 -224768 81131
88 81131 184529 -152688 -226913 106800 147416 -179835 -168095 197263 169228 -211106 -250516
99 -250516 75299 173794 -49307 -87305 141369 126268 -162800 -173665 158513 225130 -107582
110 -107582 -162703 179134 198407 -123131 -126680 111391 69694 -136487 -85421 113427 85142
121 85142 -102652 -107471 79202 107806 -124222 -182248 76640 130549 -97051 -81228 127345
132 127345 66093 -140431 -75610 136892 103343 -83217 -76705 82352 99574 -58620 -92262
143 -92262 85210 113160 -75137 -92455 78872 77980 -91408 -90023 80735 72366 -101468 -96006
155 -96006 71000 92643 -43062 -79518 38096 59210 -68542 -76433 70662 89550 -72869
166 -72869 -101991 89877 128562 -70708 -104597 66164 73435 -74601 -69556 74039 74314 -65996
178 -65996 -67039 78586 95902 -68162 -126823 47917 119966 -54972 -96504 81598 93149
189 93149 -83114 -81063 89294 75114 -102449 -93922 82704 95130 -65904 -100394 49341
200 49341 85026 -71172 -89323 77445 81025 -90470 -85979 95989 99126 -85993 -89819 88162
212 88162 89666 -62855 -57912 81638 70330 -74365 -59367 89869 64519 -90612 -75341
223 -75341 85420 78667 -94705 -92532 73584 55968 -99585 -61868 88754 45963 -112505
234 -112505 -69304 98209 68839 -84933 -60989 87692 81568 -64742 -56025 94205 73040
245 73040 -75887 -49601 93378 66577 -74630 -49301 87888 49476 -93330 -68152 58083
256 58083 43046 -76220 -58662 61738 26896 -98573 -52169 82750 44419 -96590 -65929
267 -65929 89746 70402 -64189 -35402 89595 59075 -68885 -41716 97558 69871 -74718
278 -74718 -48842 91903 71592 -73302 -71829 63808 47905 -89105 -65117 64759 35165
289 35165 -91283 -59835 75559 39613 -102507 -61718 83108 53644 -77393 -43487 97357
300 97357 58704 -86313 -32918 114771 59246 -91519 -40752 119499 70026 -100357 -56495
311 -56495 96890 46941 -100693 -54472 91184 39537 -115474 -56387 95064 31133 -118799
322 -118799 -60983 90808 43441 -93743 -28739 103842 24485 -103066 -20079 116252 37767
333 37767 -100250 -13191 123922 30090 -101958 -13913 112119 17450 -116232 -13540 118046
344 118046 6979 -122147 -18315 101415 -451 -121445 -13019 109537 1724 -110787
354 -110787 -8604 95229 -2867 -103310 6815 112617 765 -97311 13894 103276
364 103276 -5235 -94434 13625 99197 -12059 -87566 25162 93301 -17872 -92107 10030
375 10030 82235 -21382 -85514 20597 82314 -17321 -80711 13841 76576 -24322 -82226
386 -82226 19381 72696 -19719 -64849 25379 69976 -23838 -66981 20844 58435 -21918 -59244
398 -59244 17742 65239 -12196 -60704 17156 57394 -21433 -59003 22747 66339 -13824 -56831
410 -56831 18659 54386 -11078 -47980 9116 47407 -9267 -53919 7560 53311 -7666 -56920
422 -56920 -1827 47847 -9361 -57353 5900 50197 -10675 -54789 1055 50580 2164 -45637
434 -45637 9049 57761 3558 -49563 -797 60672 13181 -54631 -1086 66791 7977 -56462
446 -56462 -2147 56821 -6166 -69063 -6229 51798 -5666 -59773 -9456 50796 1036 -70689
458 -70689 -16222 59010 1458 -63950 8592 76074 -1000 -69295 16524 79977 -2736 -58128
470 -58128 17879 73045 434 -62605 7516 73065 -4105 -74193 2762 69401 -16668 -90342
482 -90342 515 73337 -19367 -85474 1584 59964 -18830 -63520 21632 63844 -27019 -67347
494 -67347 23654 74824 -579 -52662 21860 73096 -12236 -59309 35565 76300 -28123 -72266
506 -72266 34073 71181 -39372 -72002 28500 53653 -36523 -68521 12282 50604 -31487
517 -31487 -68194 23399 63382 -33380 -73863 30854 73837 -24216 -51877 43336 55157 -30601
529 -30601 -39603 42976 58420 -23766 -42723 36245 49991 -35226 -57297 28841 57183 -35552
541 -35552 -64746 26428 43863 -46815 -55963 39818 49888 -51380 -66517 31461 53289 -23161
553 -23161 -38681 29424 45419 -26169 -45076 38172 63431 -23819 -51638 32803 55217 -31757
565 -31757 -44681 45150 45544 -42996 -46254 27607 33250 -35565 -43100 33993 43775 -43461 -59998
578 -59998 32855 56061 -38382 -54062 44233 46835 -50722 -40636 54184 48198 -40667 -42274 40628
591 40628 42653 -37722 -38102 43440 46756 -38428 -50454 38701 44708 -45143 -39930 50658 41093
604 41093 -55379 -46918 48411 38833 -48036 -29265 48927 27217 -50888 -35551 46053 38441 -44624
617 -44624 -37490 44520 33986 -49842 -34430 56236 32068 -61556 -30269 55188 23813 -45182
629 -45182 -14994 48035 18404 -47862 -21320 49591 27685 -42608 -22670 49352 24790 -53398
641 -53398 -22285 53233 15512 -52460 -15624 44407 7620 -51356 -15676 43732 10778 -44812
653 -44812 -19606 34503 15621 -35648 -10849 43089 12605 -40031 -9093 45261 18621 -35990
665 -35990 -6966 44390 11471 -31446 -3346 33185 7029 -31948 -11822 28666 5285 -39279
677 -39279 -19838 28963 14162 -36802 -23037 26072 7259 -32711 -8802 28768 8371 -26830
689 -26830 -8757 34126 23366 -19035 -11965 26911 22726 -17692 -11748 32471 17188 -29949 -13769
702 -13769 31022 13139 -35823 -22621 25421 12884 -35357 -25014 21296 12683 -35020 -26061
714 -26061 29709 23020 -33173 -23080 34354 29835 -29407 -21236 38728 31923 -25346 -16080 38479
727 38479 27345 -26881 -18483 34066 21595 -38882 -25883 33298 21470 -38680 -27517 31405
739 31405 12102 -50160 -23327 39275 13658 -48108 -20949 46296 22433 -42589 -15422 49122
751 49122 21276 -42436 -13598 54025 25723 -43768 -12188 51782 18655 -44500 -13525 45425
763 45425 10860 -50386 -15043 43054 5514 -48785 -12896 41008 2783 -51690 -9027 45457
775 45457 1865 -49097 -3122 50863 7541 -45311 2091 52307 2856 -45855 2871 50298
787 50298 4208 -45082 2895 50176 527 -45275 -150 41438 -4081 -47674 -565 42239
799 42239 -5267 -43992 2169 37340 -7979 -41471 5529 41932 -6686 -40791 7257 40667
811 40667 -4456 -37336 7707 39544 -7748 -36129 12863 39448 -8309 -39815 7269 39562
823 39562 -6317 -36305 7147 33813 -7316 -34534 8393 35122 -9217 -36314 8567 36856
835 36856 -6102 -34627 4617 33705 -7202 -32560 7381 29979 -9958 -33829 6795 33459
847 33459 -8640 -34592 8124 33175 -6072 -32409 6997 32461 -7734 -31385 12718 34963
859 34963 -7674 -29895 11207 35447 -8208 -34617 8925 31503 -9141 -30212 9155 28173
871 28173 -15118 -35233 10138 30410 -16059 -36626 8276 31585 -10347 -32043 11866 29511
883 29511 -14216 -27065 17594 34183 -11224 -29278 15979 35133 -8442 -24732 14371 28734
895 28734 -12877 -28835 14941 26715 -19092 -29714 14140 24233 -20242 -31478 11652 21978
907 21978 -20079 -26844 13912 22374 -14588 -22980 19397 27905 -17562 -23654 21523 30637 -9207
920 -9207 -19313 19498 25076 -14628 -18573 18227 19746 -15844 -21636 13848 19161 -17121 -25058
933 -25058 8333 13249 -18106 -23067 10524 15596 -18574 -19064 16976 17869 -15027 -17109 17110 21865
947 21865 -8481 -12478 17263 21500 -7273 -15177 13336 24076 -9611 -21562 11557 19296 -14727
960 -14727 -22885 8949 17128 -14670 -23419 3552 12157 -9727 -18585 5579 18071 -10370 -21421
973 -21421 11859 25080 -5953 -19522 11942 23860 -8432 -16815 18229 23530 -11038 -19848 12843
986 12843 22776 -11457 -24335 10060 23428 -13218 -28520 6132 24110 -13867 -28093 12463
998 12463 23456 -18930 -27662 15616 27026 -12748 -23724 14597 22878 -11767 -18529 16907 26279
1011 26279 -12597 -24694 19446 28675 -19365 -26295 21450 25878 -23125 -25976 21000 20390 -23910
1024 -23910 -20167 21341 20010 -24179 -25610 22064 26879 -20313 -24303 21117 20357 -25377 -20995
1037 -20995 30469 22824 -28094 -19271 25348 16585 -24695 -14392 25678 14731 -26690 -15459
1049 -15459 24932 16292 -23138 -14677 26874 15047 -28999 -14797 29888 13515 -28856 -11980
1061 -11980 27408 7794 -29152 -7413 26007 7454 -25421 -11495 20557 8804 -25103 -10729
1073 -10729 26196 9243 -27431 -9782 26495 8489 -25121 -1594 27478 2876 -22502 -1048
1085 -1048 23536 7911 -19478 -4511 20394 5066 -20965 -5792 22539 5637 -25160 -7568
1097 -7568 19584 -735 -24056 -2846 19546 603 -22493 -3997 16560 2223 -15009 -1057
1109 -1057 17518 4394 -16398 -2762 24005 9368 -16931 -2112 20680 4131 -18268 -762
1121 -762 20137 1906 -18646 -3756 14164 1778 -18257 -9780 13155 4242 -19533 -8986 14989
1134 14989 4610 -19093 -5044 19611 3426 -17626 -1121 19621 6133 -12051 -895 18898
1146 18898 5690 -14711 -1301 20216 7332 -18551 -6722 18064 2100 -22727 -5090 18037
1158 18037 -58 -22781 -6862 15216 -92 -19415 -3791 15812 2057 -17343 -3426 18842
1170 18842 7268 -15228 -588 20802 4406 -15523 1812 22752 2384 -18121 1559 19027
1182 19027 -1091 -17389 -104 15995 -1549 -20385 -3698 16056 -1451 -20566 -3175 18229
1194 18229 -306 -21760 -1009 18539 -482 -15617 2773 18022 1274 -15154 2339 17798
1206 17798 2148 -12831 1774 16016 1545 -15104 388 16003 -2516 -16023 428 13286
1218 13286 -3838 -18338 1113 14906 -4233 -16981 278 14131 -336 -14379 519 15708
1230 15708 -1508 -15935 1842 19544 2981 -15341 42 16235 126 -13932 2422 14455
1242 14455 -160 -14291 -582 16002 -375 -15863 -1787 13931 1086 -15431 -1532 15497
1254 15497 -1063 -16266 1709 16184 -2067 -17565 405 17795 785 -16897 -280 15916
1266 15916 -991 -16844 2474 18349 -1143 -18920 1833 18934 -877 -18587 1177 18727
1278 18727 -598 -17404 3250 17693 -3823 -17889 3448 19542 -4386 -19572 3896 19255
1290 19255 -3623 -19612 1970 17175 -6357 -18293 6609 18075 -7738 -19429 5977 19173
1302 19173 -6072 -18486 6591 17451 -5441 -14428 9948 18371 -7171 -16882 11270 19626 -8646
1315 -8646 -16575 8389 15385 -9173 -16749 8853 13337 -13406 -15511 9590 13099 -12918 -17007
1328 -17007 9930 13722 -11610 -13968 10760 13170 -9770 -10842 12425 13371 -10066 -9326 13469
1341 13469 13514 -9457 -10141 12044 11604 -10346 -9077 10764 7991 -12932 -10759 10272 8043 -14091
1355 -14091 -11959 8838 6938 -11461 -9716 8791 7165 -10291 -6961 11434 8583 -7583 -6253
1368 -6253 10999 10063 -7012 -4388 10403 8654 -6710 -5715 8306 6108 -8508 -6953 7358 4168
1382 4168 -10304 -7750 5600 4390 -10376 -9788 5453 5253 -7663 -6179 6257 7163 -7542 -5469
1396 -5469 9018 9329 -5679 -5245 8057 9437 -3603 -5969 6904 7329 -4615 -6727 5482 7472
1410 7472 -7952 -8725 4639 5877 -7645 -8855 3971 5863 -7595 -7981 5523 5943 -6950 -6939
1424 -6939 7503 9151 -6258 -7261 9272 10331 -6133 -7725 7724 9348 -7368 -6656 8370
1437 8370 7883 -8693 -8376 7580 7913 -7006 -10163 5789 6506 -7598 -7604 7166 6352 -8785 -7915
1452 -7915 9511 7207 -9370 -7001 9220 6497 -7798 -5445 9693 6793 -8698 -5256 9278
1465 9278 7205 -8549 -6767 10611 7517 -10015 -6771 9675 6599 -9703 -6235 9486 3803
1478 3803 -9641 -5326 8554 5056 -8722 -6019 7687 5743 -8148 -5067 8232 3693 -9090
1491 -9090 -4690 9812 4200 -8959 -2871 10206 4018 -9130 -4162 8232 4123 -6910 -2614
1504 -2614 8830 4131 -9241 -4554 9457 6683 -10487 -6005 8156 3663 -9878 -3535 8270
1517 8270 2240 -8909 -3754 7596 2622 -7854 -5129 7845 4985 -8648 -5614 8897 5688
1530 5688 -7552 -2539 10260 3836 -9027 -1936 11145 4945 -8175 -2580 7752 4417 -7063
1543 -7063 -3927 7417 2202 -9971 -4923 8030 2911 -10737 -4485 9141 2135 -10712 -2714
1556 -2714 8518 1355 -7973 -1342 9885 2592 -7909 -1400 10901 5160 -7986 -2902 10735
1569 10735 2773 -9625 -1490 11168 1449 -10469 -1942 8705 -976 -10348 -2112 7259 -601 -11074
1583 -11074 -2630 8852 1525 -9908 -1347 10587 -272 -9530 1258 12266 322 -9019 2392
1596 2392 10945 -77 -7487 2730 9225 -1140 -9150 1058 7253 -1347 -8971 -369 8063 -1924
1610 -1924 -10298 491 7502 -3237 -8414 2512 6188 -3316 -6459 3615 7703 -1464 -5716 1484
1624 1484 7093 -715 -5274 4097 7919 -2202 -5953 2580 7127 -2602 -7587 2694 4739 -2819
1638 -2819 -5339 930 2843 -1252 -4978 970 4514 -2265 -6344 1275 6276 -226 -4516 957 5562
1653 5562 -2046 -3683 3055 5030 -1356 -4058 1849 4207 -958 -4605 266 3936 -795 -4863 -1
1668 -1 4899 -769 -5467 -687 4610 -1164 -5527 341 4673 -450 -4465 0 3843 300 -4368 -278
1684 -278 4764 607 -5548 -210 4987 1394 -3510 309 4746 -347 -5036 760 4829 331 -4765
1699 -4765 271 4960 250 -6098 329 5418 -633 -5891 87 6289 -820 -6605 888 6744 -363
1714 -363 -5970 52 4591 -331 -4546 807 5368 -896 -5490 1087 6765 -512 -5272 720 5868
1729 5868 -540 -4584 2272 5807 -1725 -5702 1938 6103 -2110 -5177 1207 4684 -2022 -6171 1410
1744 1410 4578 -3122 -6319 1844 5292 -3197 -6566 2369 5986 -1528 -4846 2995 4825 -2374 -3960
1759 -3960 2759 5779 -2084 -4411 3085 5165 -1813 -4438 2562 4527 -2461 -5159 2073 4273 -3314
1774 -3314 -4577 1182 3478 -3581 -4551 1688 3589 -2405 -3892 2528 3799 -1861 -3421 2935 4280
1789 4280 -2251 -3883 2678 4766 -1748 -3590 3157 4361 -2499 -3571 2638 3235 -3744 -4425 1913
1804 1913 2744 -3526 -3900 2050 2301 -3302 -4480 2276 3236 -2375 -3784 2607 3947 -2444 -3060 2936
1820 2936 4457 -1409 -3008 3835 3331 -2881 -3362 2542 3837 -2424 -4153 2679 2873 -3164 -3708 2110
1836 2110 2456 -3638 -3612 2279 3036 -3080 -3476 3512 3114 -2240 -2376 2995 3102 -2965 -2241 4161 3538
1853 3538 -2771 -2223 3431 3140 -2587 -2233 2865 1865 -3618 -1729 2840 1863 -4042 -3162 3317 1768
1869 1768 -3866 -2665 2532 1929 -3119 -1562 3793 1726 -3343 -1181 3297 2355 -2100 -1731 3541 2165
1885 2165 -2927 -1541 2865 1006 -2876 -1044 3664 994 -3692 -1580 2518 857 -2631 -1154 2201
1900 2201 849 -2943 -390 3293 1203 -2757 -1316 2612 2188 -2075 -952 2009 1031 -2519 -373
1915 -373 1579 398 -2668 -680 2195 1820 -1326 -1164 1484 1347 -982 -723 1748 789 -1710 -469
1931 -469 2041 916 -1728 -853 1391 550 -1049 -1192 620 24 -1076 -1356 1699 755 -787 -1643 965
1948 965 1235 -526 -770 1013 1456 -1005 -1036 1237 1124 -1262 -913 867 1954 -900 -1403 772 1656
1965 1656 -1069 -1971 969 1602 -1668 -2061 1182 911 -1549 -1798 1175 1495 -1382 -1901 950 2095 -395
1982 -395 -1170 2589 2586 -1635 -2123 2002 3155 -953 -2071 1795 1755 -1863 -1671 1657 1370 -2266 -1222
1999 -1222 1617 1328 -2513 -2324 2126 1870 -2005 -2391 2621 1632 -2271 -758 2319 1833 -1503 -471
2015 -471 2784 2077 -2386 -1315 1721 1285 -1341 -1617 2391 1401 -2978 -2055 2095 963 -2172 -1299 2245
2032 2245 -84 -2342 -640 1445 329 -1867 -1433 1757 1628 -2307 -194 2520 772 -1886 -433
2047 -433 3370 595 -1893 -20 3046 665 -1642 9 1308 823 -1417 46 1092 815 -1758 -1251
2063 -1251 1611 584 -2473 -467 2488 -97 -2243 -232 2929 -620 -2174 128 1718 187 -1390
2078 -1390 290 1297 920 -1539 -1154 1264 708 -1930 184 1188 -64 -2232 -709 1341 428 -1458
2094 -1458 -821 787 -39 -1660 193 1851 163 -1810 -759 1375 262 -1527 237 1863 915 -1113
2110 -1113 174 1075 -3 -1413 887 1324 157 -1222 -667 795 251 -638 -879 1423 73 -1441
2126 -1441 479 1064 -261 -824 508 1370 -941 -256 539 -294 119 -928 -593 35 -414 -1267 -285 1097
2144 1097 -287 -910 -571 1121 -339 -683 -149 240 304 -1253 74 1431 -357 -632 -229 655 287 -607
2162 -607 176 817 392 -973 -163 518 -641 -291 408 793 204 -498 -7 1115 483 -640 84 617 250
2181 250 172 147 1119 779 -1049 -131 503 86 -743 -745 28 -39 -417 -802 -480 1343 -402 -920 -170 920
2201 920 -1175 -477 221 767 -893 -1223 933 85 -223 -96 727 809 -293 -621 -285 1060 -442 -522 442
2220 442 1461 38 -1785 1030 801 -968 -927 544 873 -1009 -462 511 1929 -1043 -1613 130 1372
2237 1372 -812 -1051 900 613 -1152 -466 1694 1634 -1659 -1352 1763 1287 -646 -999 655 696 -626
2254 -626 -1246 933 1092 -1952 -1254 1069 1147 -771 -1292 1317 680 -1135 -542 2108 1057 -1869 -1361
2271 -1361 1904 887 -1229 -418 1457 753 -693 -155 1227 -73 -1724 -1079 1910 1096 -1593 -182
2287 -182 1606 592 -1906 -907 962 251 -2576 -246 1180 20 -1152 199 1458 69 -2051 248
2303 248 2193 340 -1094 663 1469 -427 -1428 238 1463 55 -1837 -135 2265 -312 -1647
2318 -1647 -1145 1021 -169 -1171 -21 832 -689 -1324 828 896 -157 -1223 2 1164 228 -524 -191
2335 -191 878 -165 -996 329 641 -914 -555 229 987 -593 -1758 295 457 112 -409 48 233 -124
2353 -124 -1566 -208 1104 362 -698 -626 417 136 -750 216 -258 -525 -459 -309 181 393 -354 233 810
2372 810 174 -415 -707 288 185 203 -1035 881 -36 -730 -437 1122 1040 -1026 -93 483 813 -510 -689
2391 -689 360 -312 -629 -480 474 322 -961 -767 936 1070 -27 -926 539 1143 -1050 -276 -69 659
2409 659 -674 -515 1337 609 -374 -615 539 750 -300 -1055 1021 820 -1236 -547 234 1157 -1044 -546
2427 -546 1105 160 -1352 -1572 499 283 -174 99 1089 975 -1813 -588 602 716 -1227 -1286 954 920
2445 920 -830 0 341 110 -766 -378 1087 754 -1268 -744 1274 769 -1183 -1672 477 807 -1560 403
2463 403 1452 366 -1645 -552 997 696 -537 -880 1078 919 -1598 -340 1012 332 -1202 -746
2479 -746 1673 -320 -1761 -282 1834 -125 -1203 -648 839 730 -1149 -566 1268 745 -1839 -699
2495 -699 1710 584 -1800 -825 1466 -146 -1161 697 876 -401 -2169 -600 1377 750 -1521 -233
2511 -233 1862 299 -1283 -359 2018 8 -1639 385 1897 -368 -2280 -441 1487 -166 -517 463
2527 463 807 322 -1112 79 1980 -271 -1610 252 2024 262 -1603 802 1452 -264 -1717 948
2543 948 1165 -574 -1398 977 1399 -275 -950 -104 1348 88 -479 576 1536 -284 -938 109 2100
2560 2100 -402 -968 1094 1356 -524 -241 372 1159 -947 -1391 -299 954 27 -1540 873 903 -425
2577 -425 -1542 487 1374 -359 -1073 888 -46 -83 -647 964 602 -365 -367 106 600 271 -333 747 821
2596 821 -1020 -780 107 478 -287 -231 789 52 -710 -191 -249 131 267 198 102 671 2 -95 742 401 -90
2617 -90 -1250 812 271 -588 -95 245 257 520 82 -1006 220 -68 -635 -376 411 -658 -1302 -910 812
2636 812 -211 -1203 147 806 119 -204 9 1199 1055 -510 -314 829 977 -466 -138 1339 400 -1063
2654 -1063 -498 620 -571 -1397 138 1161 155 -1210 -341 1120 -68 -1044 -707 1168 601 -1216
2670 -1216 -58 1792 -473 -1785 -88 1610 -838 -2105 443 1108 -125 -1259 126 1822 -276
2685 -276 -1587 109 1445 -883 -1846 -234 1823 -807 -1691 98 1355 189 -1170 582 1803 -527
2701 -527 -1203 981 1326 36 -1189 737 1655 -137 -950 1227 978 -1067 -1557 1568 1079 -891 -1465
2718 -1465 782 823 -583 -986 819 800 -1111 -449 1481 1992 -871 -1635 1386 1369 -490 -895 1427 1148
2736 1148 -1958 -961 591 711 -982 -723 874 1517 -1638 -1504 585 747 -778 -550 1142 957 -1569
2753 -1569 -491 1125 1023 -650 -1532 755 507 -1107 -711 788 1068 -930 -692 905 1687 -996 -1299
2770 -1299 1206 1154 -843 -938 851 320 -1167 -568 646 510 -1330 -127 1124 321 -1108 -408 1440
2787 1440 766 -761 -714 470 589 -828 -280 1078 363 -710 -120 576 671 -931 -539 409 328 -769
2805 -769 -694 543 511 128 682 1019 187 -293 -186 1021 -93 -962 -767 754 393 -1019 17 810 360
2824 360 -922 -159 346 -336 -542 -498 573 433 -756 -539 1095 -267 -1293 -473 748 172 -46 -421
2842 -421 694 227 -803 123 559 826 -422 -287 631 -310 -539 -587 -149 -329 -681 -1022 90 1342 326
2861 326 0 915 -239 -383 56 608 143 -826 -97 79 313 -477 30 676 -500 -852 -1057 -46 229
2880 229 -1009 -331 -58 -90 -88 -278 93 417 -584 -804 555 -309 -676 -443 858 831 -546 -222 812
2899 812 750 -479 -224 542 904 -347 90 913 537 -387 -1028 434 282 -720 -524 563 1086 -937
2917 -937 -719 911 199 -351 -559 469 549 -480 -736 673 852 -1018 149 1054 967 -1140 -265 865
2935 865 517 -1121 -639 359 -412 -944 -799 229 -339 -1511 -150 918 211 -1093 -668 1082 960 -872
2953 -872 -59 807 -688 -1544 -817 930 724 -865 584 799 -611 -641 -618 1041 338 -1620 280 2240
2971 2240 292 -1470 -36 1583 -769 -255 1211 312 -301 -533 -225 546 -247 -562 745 1332 -464
2988 -464 -1315 265 1307 -750 -1577 228 661 -954 -608 390 513 -725 -1954 75 734 -239 -863
3005 -863 249 1222 -172 -699 125 697 -407 -782 399 309 -283 576 1174 218 -704 471 -48 162 -420
3024 -420 -1029 238 496 -1163 -85 898 1223 -927 -291 1452 408 -906 -295 785 385 107 534
3041 534 303 325 -342 561 -50 42 -251 -620 939 -66 -977 -27 -350 -563 -600 289 301 216 718 176 975
3062 975 509 -40 -215 621 252 -606 118 -273 592 -484 -341 1112 7 -552 -530 -308 -313 -287 -365 -11 -529
3083 -529 -552 -242 450 -165 662 -813 342 537 -426 286 372 377 136 318 283 385 -256 -283 215 261 -666 -991
3105 -991 19 86 -380 -497 -134 475 -363 -456 555 -700 -203 477 463 111 224 -755 473 -802 -360
3124 -360 206 -416 405 -762 -242 164 -119 -620 262 176 94 34 274 251 -654 -727 -320 -3 -195 -183 -205 2
3146 2 503 -96 193 381 351 -530 218 166 168 71 -379 185 143 -705 -120 261 427 -774 -25 732 181 -690
3168 -690 -527 -1 -9 -327 -738 784 173 -84 -524 837 -13 138 -232 361 359 213 751 1054 211 -1082
3188 -1082 -418 829 803 -1239 -463 595 330 58 -660 -89 -172 -200 -639 526 156 -261 62 831 854 -597
3208 -597 -201 643 -350 -1421 524 1490 12 -189 -604 286 -50 -713 551 101 434 -803 112 455
3226 455 -216 -319 -233 246 121 -693 201 213 -509 -1307 -402 1085 -215 -1253 1050 397 10 -675 231
3245 231 145 -658 -650 208 1197 -300 -361 119 412 -109 -837 369 483 -1409 -320 728 149 -893 -717
3264 -717 -371 366 -568 -823 1006 85 -1104 -438 470 770 -490 -339 646 -201 -312 -259 365 772 -104
3283 -104 -100 132 554 -699 102 459 746 -493 -689 349 592 -140 260 -154 -162 -1141 171 900 -125 -759
3303 -759 -41 885 215 30 -390 608 475 1 -341 932 232 -392 -961 269 -938 -778 -141 1067 259
3322 259 -823 -480 523 239 -284 -416 -65 -387 -529 144 527 -262 -227 128 209 -451 -835 -153 64 -204
3342 -204 -435 6 531 -571 -104 1029 646 484 -427 -638 190 333 -502 227 -330 -259 -323 -274 11 480
3362 480 -167 -69 879 -396 224 -359 866 -236 -359 317 966 534 -306 -317 639 -574 -10 95 339
3381 339 -524 -450 -562 842 -317 -197 -324 -29 263 -634 -20 -248 -490 -415 463 677 107 -422 221 292
3401 292 -30 -158 8 823 -510 -920 300 405 -329 -260 -11 699 464 -150 19 256 239 -80 -69 705
3421 705 189 -353 538 562 -81 542 -44 595 -131 -291 74 248 -559 -513 255 217 61 -1216 -86 608
3441 608 174 -374 220 994 -32 -1465 258 570 -480 -699 -258 304 77 -869 768 397 -993 -1180
3459 -1180 302 623 -686 -872 -4 980 -334 -835 64 1386 -716 -792 999 384 -523 -482 1016 535
3477 535 131 -1379 77 1115 -639 -1306 385 692 -540 -226 779 1220 -388 -597 699 954 -22
3494 -22 -374 935 -21 -3 93 561 442 -390 -1085 447 809 -766 -746 482 330 -706 -750 1338 380 -256
3514 -256 -346 954 565 -866 -1488 -204 1149 -690 -249 647 702 -1098 -829 759 752 -704 -558 1014
3532 1014 218 -536 -477 407 60 -689 -206 1502 419 -793 -423 767 472 -940 -263 1418 816 -1223
3550 -1223 -688 866 -120 -1319 -16 698 -387 -1772 -281 884 -327 -1001 -712 1155 -173 -971
3566 -971 -197 721 152 -983 326 1130 309 -1378 564 710 441 -1358 304 885 -332 -946 468
3583 468 729 65 -908 -400 866 -172 -860 -243 934 -381 -493 113 467 213 -1255 -637 221 422
3601 422 -372 -606 653 20 -1182 -286 1157 162 -560 125 1058 -382 -1038 39 933 -787 -628 -164
3619 -164 -122 504 -499 -407 636 -94 102 360 1033 -12 -955 -816 1331 174 -624 532 462 144 -1101
3638 -1101 -79 893 -34 -739 -798 802 577 -605 264 894 508 -985 334 793 203 -279 -204 681 -325
3657 -325 -502 -302 897 216 -889 -306 2069 -399 -1133 103 908 -488 -775 331 1100 -63 -1047
3674 -1047 -83 1097 72 -1069 250 1638 301 -1592 -288 793 -223 -1445 -285 1776 375
3689 375 -1864 583 875 -418 -1026 221 762 442 -1221 -34 739 73 -543 438 1024 -903 -1039 831
3707 831 645 -298 -1234 298 1841 -407 -895 -191 1138 -653 -805 402 1016 -518 -1851 180 805
3724 805 206 -1695 357 561 -16 -1756 643 1690 -538 -1254 994 264 -240 -751 -196 2004 -68
3741 -68 -825 774 1295 -372 -1599 -274 1348 -445 -897 958 1528 -199 -1105 806 1202 -560 -443
3758 -443 530 543 -870 -641 -16 1214 -258 -778 385 1655 -979 -1766 641 618 -1367 -1463 473 1355
3776 1355 -840 -886 457 1162 -989 -1182 1237 1118 -490 -766 1085 1429 -992 -1176 1734 1518 -620
3793 -620 -1450 1058 769 204 -363 1609 693 -983 -1036 1525 510 -932 -920 945 1238 -746 -1339 1110
3811 1110 686 -251 -327 653 804 -433 -469 1661 1201 -1603 -1012 1369 1497 -520 265 1108 242 -703 -397
3830 -397 1429 837 -815 -973 1162 45 -1284 -872 724 875 -847 -671 1178 -279 -1551 -1004 1146
3847 1146 765 -450 -532 758 529 -417 -443 262 1137 -1145 -594 431 1151 -953 -791 704 521 -592
3865 -592 -592 578 -322 -237 -209 1393 814 -662 -481 711 -302 -1026 -421 385 175 -1013 -99 796 882 -261
3885 -261 -506 1047 423 -1202 -492 744 826 -770 -1149 135 -47 -623 -900 1246 819 -521 -441 1280
3903 1280 1254 -1070 -488 738 607 -1397 -988 1273 270 -439 -534 1201 993 -1147 -1018 1155 757 -926
3921 -926 -544 790 1212 -1518 -1199 575 1120 -1317 -1055 1385 1289 -1011 -1065 1088 703 -1370 -950 1250
3939 1250 -435 -827 -380 1685 947 -979 -779 1310 -118 -1555 -515 1169 485 -1187 -552 1531
3955 1531 460 -1147 -364 1823 508 -2299 -776 735 89 -1291 -755 1954 356 -1348 -524 1880
3971 1880 -36 -1643 -715 1094 281 -1249 -173 1784 905 -1704 -404 2024 360 -2313 180 1619
3987 1619 754 -1125 320 1842 892 -1010 -3 1201 -676 -1253 -344 1301 -146 -1430 -494 1212
4003 1212 -262 -2024 236 1442 511 -1367 -505 2153 -637 -1600 -177 2094 281 -1236 232 1486
4019 1486 605 -1572 533 1610 -483 -1369 49 1215 -704 -1542 447 628 -193 -1532 145 1394
4035 1394 54 -1885 445 1427 -617 -1185 45 1511 420 -1863 485 1748 -460 -884 430 867
4051 867 16 -1284 -20 1497 263 -1576 -162 1531 -703 -1226 473 1614 -1156 -1765 517 989
4067 989 -653 -1309 219 1269 -536 -1567 429 2201 -145 -1338 472 1120 -1152 -1883 1033 1414
4083 1414 -433 -778 503 843 -358 -560 483 1116 -829 -1178 1097 1744 -403 -1222 1014 1015 -736
4100 -736 -1113 86 1517 -280 -1513 178 465 -173 -1313 466 878 -949 -1319 242 1796 -392
4116 -392 -1108 471 1942 -173 -1299 1450 1452 -1082 -668 170 1466 -1071 -1267 116 1436 -411 -1237
4133 -1237 265 1110 -191 -1044 562 1153 -183 -941 310 1320 -729 -280 764 337 -382 -1068 412
4150 412 1422 337 -1283 213 1283 -492 -1456 118 1926 275 -1791 -13 681 -647 -1179 -64
4166 -64 972 -668 -374 137 1019 191 -1300 -25 1294 -252 -929 1046 1249 -717 -845 992 1459
4183 1459 -248 -2040 1371 1913 -755 -1342 952 1400 -537 -2353 109 1266 -485 -1620 273 2060
4199 2060 -746 -2013 492 2218 -333 -1627 821 1290 -913 -1241 492 1803 -577 -1196 798 938
4215 938 -539 -1156 1113 1301 -1146 -1764 1135 1486 -935 -1310 1295 1421 -375 -2049 -112 478 -1544
4232 -1544 -1673 1089 1574 -1479 -1685 1435 950 -1633 -1056 1232 1246 -872 -955 1470 1184 -1284 -1504 520
4250 520 251 -1544 -1017 914 841 -1508 -1868 980 622 -2243 -1415 1427 821 -1454 -134 1336 1459
4267 1459 -1248 -558 1464 1240 -973 -547 1286 679 -1115 -1514 1442 897 -1208 -1285 1249 193 -1628
4284 -1628 -1044 1553 403 -989 -950 589 709 -1520 -559 1552 588 -1383 -53 1894 570 -1211
4300 -1211 -856 959 1027 -1709 32 972 770 -970 -1050 1617 711 -1191 -520 1129 1031 -1040 -951 946
4318 946 724 -1461 -597 974 305 -1148 -1005 1071 1058 -1008 -229 1341 1422 -1857 -544 1578 699 -1067
4336 -1067 -75 1306 217 -1074 -554 1535 488 -1111 -666 1323 674 -1235 -477 1061 343 -1240
4352 -1240 -871 1775 179 -1389 -635 1742 280 -1543 -749 1299 -4 -1028 -444 1901 875 -1317
4368 -1317 -447 1218 98 -1582 -107 1680 217 -1633 19 958 1298 -427 -461 1276 424 -784
4384 -784 -523 1510 -209 -1308 -693 493 25 -1558 -712 1092 219 -1119 92 1057 395 -1751 -612
4401 -612 1467 411 -934 209 1382 659 -1469 284 1405 62 -315 -967 825 435 -1354 -542
4417 -542 746 299 -1091 223 1338 -324 -475 -107 1328 -325 -1166 -438 1124 379 -1241 -247 1110
4434 1110 623 -1122 281 1566 852 -1900 35 1726 -248 -1671 -516 992 313 -1474 -724 1096
4450 1096 -64 -1983 103 1472 -72 -1914 724 1587 209 -1373 72 1533 -192 -1005 -232 1540
4466 1540 181 -1340 -18 1415 264 -1595 424 1601 172 -2008 515 1229 -149 -2000 -56
4481 -56 938 -432 -1628 286 1476 -268 -1708 -116 1561 46 -2371 -87 1878 -376 -1694 486
4497 486 1621 -480 -1484 532 1956 -941 -1129 421 1428 -384 -1574 425 2243 -458 -1692
4512 -1692 235 1453 -311 -1727 825 2047 -415 -1563 1271 842 -581 -1765 892 2044 103
4527 103 -1600 607 1494 -782 -1228 738 1309 -909 -1543 818 1665 -433 -838 82 1123 -1080 -1021
4544 -1021 607 802 -1734 -655 1165 1220 -756 -1036 437 1765 -583 -1564 786 982 -906 99
4560 99 610 638 -466 -1446 706 989 -294 -973 626 1510 -767 -829 1194 1601 -524 -1291 685 752 -397
4579 -397 -917 852 981 -369 -489 25 -271 -88 -1183 623 340 -1186 -1236 570 1354 -873 -501 1235
4597 1235 1086 -642 -174 1288 1374 -638 -723 774 759 -681 -867 -78 1057 -377 -2021 1034 761 -1262
4615 -1262 -1414 33 533 -1234 -1398 417 935 -967 -368 759 1108 669 -1158 410 879 -843 -848 1679
4633 1679 1183 -1540 -424 689 1279 -942 -825 1682 741 -1762 -729 149 1196 -417 -1307 362
4649 362 557 -986 -1614 1183 1270 -1436 -293 1028 727 -937 -846 1229 530 -644 -1142 999 1011 -1300
4667 -1300 -1790 457 636 -1341 -1277 830 653 -1230 -989 596 630 -1316 -1197 935 1392 -516 -829 863
4685 863 1236 -1320 -620 1367 938 -1529 -529 1196 912 -1050 -1457 235 604 -280 -179 1050 374
4702 374 -1232 -550 803 1330 -1466 -923 1525 1157 -1230 -367 962 1075 -1737 -677 1971 891 -919
4719 -919 -415 1091 1171 -883 -902 1524 742 -84 -1722 1317 909 -716 -1201 878 1000 -1385 -559 1488
4737 1488 494 -1223 -1168 1551 684 -1920 -969 950 853 -825 -1115 1126 856 -1575 -906 1323 601 -923
4755 -923 -434 1937 448 -1696 -593 1688 -37 -815 -146 1109 244 -1006 -1231 1239 501 -1750 84
4772 84 902 352 -781 116 1614 -71 -1659 -651 1002 -371 -1451 75 582 -600 -820 -379 2107
4789 2107 329 -1474 -311 1433 291 -2317 -55 1117 -376 -963 -115 1180 627 -1542 426 1463
4805 1463 362 -1716 -376 827 -811 -1171 -739 544 319 -1043 153 1306 328 -1038 624 1069
4821 1069 -1005 -652 455 1142 325 -1034 102 2171 119 -1253 -167 912 422 -1301 -61 1486
4837 1486 -531 -1495 82 1146 -668 -1230 -245 809 246 -222 153 438 204 -180 560 1172 341 -1563
4855 -1563 -350 1479 451 -863 -355 285 450 -874 166 658 -53 -1355 72 403 -565 -1339 -25
4872 -25 942 -414 -745 194 1035 -308 -1260 -448 933 -646 -1252 511 1016 721 -474 336 2166 392
4890 392 -1463 284 1507 -261 -1613 -431 581 -477 -1420 337 1685 62 -1471 -660 1575 -70
4906 -70 -1176 -185 1299 495 -552 332 797 67 -1948 389 1397 294 -1360 -220 1526 664 -1870
4923 -1870 154 1515 -458 -2210 -277 814 -302 -2047 -323 1233 -561 -1276 116 1331 -315
4938 -315 -1208 27 888 -78 -1422 -8 1945 461 -1111 85 1238 -281 -334 418 1452 -915 -805
4955 -805 358 1109 -866 -543 -253 756 -642 -1024 558 496 -60 -1169 -249 1607 -537 -896 514
4972 514 1638 -1314 -1546 1021 514 -244 -1731 1258 954 -790 -1270 935 1628 -613 -1288 -403 2014
4989 2014 -513 -1204 1190 904 -444 -1053 968 996 -755 -902 738 669 -307 -1636 372 712 -1105
5006 -1105 -1196 464 1590 -856 -1164 561 1602 -707 -736 1330 1322 -1096 -480 943 1428 -683 -834 977
5024 977 1173 -599 -1016 836 629 -1163 -1100 1076 453 -827 -740 753 646 -499 -1527 328 1180 -1396
5042 -1396 -1144 419 1577 -458 -283 932 1428 -1472 -263 1205 838 -298 -436 1619 801 -564
5058 -564 -1032 553 448 -1554 -873 1136 236 -1478 -816 457 612 -542 -642 158 -306 -1632 -499
5075 -499 1037 443 -159 -250 1683 1242 -1020 -24 1045 32 -1260 -129 675 429 -1207 -669 873
5092 873 196 -325 -584 205 -223 -1047 -783 701 840 -1306 -303 637 1436 -441 -501 1128 1043 -565 -651
5111 -651 1239 1437 -654 -174 729 563 -1549 13 123 265 -446 -541 19 217 -416 -532 -130 1160 -942
5130 -942 -834 658 769 -831 -690 672 448 -993 -377 671 54 -571 -597 730 971 -151 -978 305
5148 305 391 -943 -779 917 823 -1081 -763 1102 1052 -998 -747 376 548 -918 -407 1368 261 -625
5166 -625 -173 950 105 -845 -294 1159 -91 -1065 -880 852 1158 -501 -1002 671 408 -984 -955 680
5184 680 790 -944 -1087 712 707 -1225 -447 833 362 -948 9 1198 784 -1229 -723 980 -177 -1087
5202 -1087 -785 1099 -64 -1411 73 1615 922 -432 -397 744 1273 -1507 352 1072 218 -1276 -12
5219 -12 1856 222 -1427 -594 1174 773 -1465 -140 1707 -641 -2071 -745 716 -99 -1298 -306
5235 -306 1257 392 -982 -163 1216 -226 -1661 -192 728 791 -1868 -328 1364 -137 -838 -299 1141
5252 1141 138 -554 304 1269 331 -1233 -134 567 -185 -1644 -546 1276 194 -1070 -173 654 -408
5269 -408 -1195 547 1200 264 -852 -53 1361 -234 -307 581 828 -401 -858 57 1094 119 -1180 -285
5287 -285 1560 751 -1223 121 1120 -5 -1106 38 942 87 -394 -375 1197 -330 -1041 260 1056
5304 1056 157 -777 353 1598 612 -763 369 392 -205 -1127 693 384 -401 -1055 -173 597 -410 -822
5322 -822 -422 467 37 -799 -529 876 126 -734 151 562 -666 -952 488 -137 -228 -161 251 980 -94
5341 -94 -1083 -17 612 -161 -683 -152 317 -438 -1510 -210 870 -635 -788 -4 1408 -511 -390 608
5359 608 1085 -27 -840 717 642 -97 -1119 233 1199 69 -675 148 490 -504 -862 304 747 400
5377 400 -1440 380 463 -32 -824 -34 1317 -121 -703 565 628 -31 -1114 564 1277 -560 -1334 709
5395 709 945 -6 -385 299 627 -271 -535 378 584 347 -1190 324 777 -145 -1004 -261 687 -634 -1375
5414 -1375 -14 1427 -159 -1196 32 498 -665 -243 787 988 102 -439 200 1533 -582 -847 73
5431 73 919 -56 -894 331 1376 -30 -1504 712 546 -186 -593 159 1243 486 -896 303 1500
5448 1500 -1313 -1043 1382 870 -1275 -1134 710 1391 -243 -1095 769 829 -949 -1202 591 1312 62
5465 62 -814 437 779 -11 -1035 723 1618 -886 -305 1184 1048 -993 -804 443 341 -597 -1874 294
5483 294 547 -688 -227 829 187 -1056 -891 811 483 -941 -86 976 295 -527 -983 861 1287 -334
5501 -334 -633 821 729 -635 -238 519 1479 -154 -749 503 147 -532 -1215 1189 153 -678 -184 979
5519 979 1217 -1212 -287 503 388 -699 12 667 984 -982 -20 353 172 -840 -213 927 -144 -151 -57
5538 -57 910 1105 -724 227 790 260 -849 -619 1138 -190 -748 -627 1016 256 -505 -358 658 379
5556 379 -797 -837 1241 167 -138 200 872 366 -366 -460 248 743 -1019 89 837 120 -420 -638 731
5575 731 482 -394 -116 414 224 -480 -211 461 520 -1301 -30 906 127 -882 -559 52 1171 -372 -928
5594 -928 1073 -94 -281 -743 520 203 -1020 -546 918 673 -216 -602 569 1015 -1199 -460 716
5611 716 685 -503 409 253 539 -365 -570 725 322 -838 -176 735 36 -894 -86 1194 224 -33 -434
5630 -434 914 235 -647 -591 664 558 -217 -492 138 159 -699 -735 789 184 -121 -204 537 -218 -533 -554 218
5651 218 121 -861 -605 803 464 -1055 -1412 679 697 -678 -1337 850 187 -582 316 1296 69 -1172
5669 -1172 226 607 -59 -295 -1090 465 80 -901 -620 875 517 -1613 341 656 -72 -1427 -557 637
5687 637 326 -788 -247 725 240 -991 219 442 26 -816 -140 761 559 -1076 -259 883 227 -763
5705 -763 -218 879 -777 -1269 669 1182 -72 -599 -178 1020 441 -1301 492 1190 -161 -636 230
5722 230 842 134 -966 472 1595 179 -1582 356 1167 -430 -1732 198 787 123 -1224 193
5738 193 1260 -623 -1118 395 301 -209 -1183 787 445 58 -839 510 998 -112 -842 292 384 -17
5756 -17 -1154 1021 1604 -505 -1204 435 1249 71 -479 260 690 -1098 -1025 578 1549 -235 -1122 121
5774 121 832 -501 -989 22 1141 -316 -488 244 718 -322 -272 7 257 192 -481 371 1067 -52 -667
5793 -667 172 392 -522 -1719 106 694 264 -1020 -204 747 -416 -935 1086 734 -211 -801 321 657
5811 657 -707 -559 493 876 -267 -1006 203 505 -321 -161 869 393 -840 -969 -82 687 -539 -622
5829 -622 -239 255 -959 -507 213 805 208 -581 823 93 -859 -559 126 250 -925 -502 692 286 -90
5848 -90 -871 615 181 -526 -623 475 80 -279 -389 665 478 -918 7 -68 366 -682 -357 377 452 -1028
5868 -1028 -278 110 398 -207 -519 180 512 -1366 -192 166 1598 -57 -909 7 234 -1217 -947 95
5886 95 -178 -1466 -569 -29 505 -34 -1262 1006 480 -342 -225 -53 927 -727 -659 299 345 -1002 -1092 644
5906 644 443 -743 -792 646 917 -502 -1058 456 1192 -154 -691 715 1251 -570 -407 1121 1680 -227
5924 -227 -190 748 405 -952 -664 862 817 -319 -59 1182 512 -556 -1205 -37 -351 -658 -505 829
5942 829 -71 -470 289 859 552 -521 -22 1371 1175 -854 -597 467 480 -791 -74 658 231 -680 -869
5961 -869 507 577 -1459 -223 1111 -8 -1404 -790 -31 -87 -679 -271 161 862 -948 -312 394 -54
5979 -54 -513 -556 1913 268 -774 -223 1068 -148 -506 -332 762 628 -728 -233 749 -208 -1064 -241
5997 -241 727 -172 -957 430 859 476 -1158 330 792 488 -574 -210 1208 -253 -731 -293 502 -49
6015 -49 -428 625 1112 189 -1003 231 748 403 -868 73 521 -205 -780 396 746 -390 -1041 -76
6033 -76 1213 203 -259 -77 1515 165 -841 -41 841 30 -691 697 1544 611 -480 92 931 -156
6051 -156 -440 -538 838 208 -628 8 744 -536 -789 210 1047 -561 -995 782 837 -163 -1127 519 111
6070 111 659 -865 -183 1019 598 -759 -372 1526 395 -463 -142 945 -27 -340 104 640 50 -297
6088 -297 -50 720 386 -739 -76 232 -522 -861 -697 815 -855 -1015 340 960 181 -651 -265 495 276
6107 276 18 185 359 -378 -935 165 1178 -260 -396 345 973 115 -426 -307 1373 -161 -741 -541
6125 -541 229 -256 -692 142 431 360 -744 309 868 27 -568 357 837 -19 -799 155 22 201 68 190
6145 190 485 -17 -678 0 829 -374 -1220 554 1152 225 -791 -225 401 -68 -1188 278 648 284
6163 284 -587 645 1006 38 -554 242 706 -374 -759 416 1038 -319 -692 415 1626 -57 -1117
6180 -1117 347 1061 -464 -365 471 597 -152 -1213 97 542 -641 -1025 206 196 52 -1266 646 479
6198 479 -701 -779 415 1099 -520 -371 450 592 -790 -515 33 1062 -350 -866 444 1180 -444 -1212
6216 -1212 667 -68 -1013 -83 496 717 -255 -694 159 609 194 -847 789 1118 -388 -1157 1055 550
6234 550 -411 -854 96 271 -170 146 90 523 -947 267 507 596 -93 -428 960 454 -210 -1169 773
6253 773 737 -423 -759 951 426 181 -691 272 539 -272 -714 835 712 -142 -730 713 1160 -1031 277
6272 277 347 520 -563 -482 876 379 -971 -160 667 7 -772 -136 510 -142 -436 -497 1057 449 -144 -803
6292 -803 -69 362 -765 -566 195 -737 -688 -71 640 1315 -1100 -514 445 941 -1473 -214 618 -106 -305
6311 -305 -634 479 740 -1209 -197 369 132 -961 -515 580 -733 -496 -15 1224 39 -1021 -545
6328 -545 404 311 -258 92 690 -1026 -772 -682 487 471 -171 297 271 455 -488 -247 803 363 -175 -612
6348 -612 681 371 -335 124 439 362 -12 105 411 187 -1124 -495 510 510 -659 -428 392 302 -555 -120
6368 -120 641 39 -910 28 1027 168 -279 -10 1164 624 -664 -545 675 405 -585 -983 765 131 -794
6387 -794 -846 1026 334 -146 -1057 766 -50 -1091 88 753 126 -801 -327 1155 628 -956 -59 526
6405 526 -100 -198 68 823 -449 -563 36 1030 457 -804 -246 796 295 -771 992 249 -24 -1171
6423 -1171 -249 1048 469 -336 -137 328 -499 -536 -654 763 302 -536 -281 997 -441 -580 -394 752
6441 752 237 -119 -465 905 -416 -1436 -144 1205 -395 -884 189 804 -206 -1178 259 945 -608
6458 -608 -1267 -66 1051 255 -857 606 1135 -363 -1414 -38 721 -148 -598 331 1323 -30 -1117
6475 -1117 266 1187 -247 -1026 -154 777 822 -825 56 226 -358 -1355 581 1231 -236 -802 813 1030
6493 1030 -409 -1549 403 1081 -746 -1275 -490 798 470 -902 763 747 -54 -673 -494 662 -274
6510 -274 -41 362 1104 -510 -409 692 1073 -345 -674 283 -28 -610 -879 184 360 -755 -1207 -899
6528 -899 1483 -560 -728 834 661 137 -504 1549 812 -254 -643 752 -66 121 -576 211 1207 -862
6546 -862 -654 1081 967 230 -1388 -24 798 -95 -484 757 498 -688 -796 -10 239 -258 -540 27
6564 27 1049 -460 -291 545 1236 -765 -1131 355 655 -509 -498 901 1501 -176 -453 -153 -434 -548
6582 -548 -63 898 405 -477 106 10 156 -644 -987 1570 228 -727 -284 486 435 -886 -711 536 1142
6601 1142 160 -778 32 1059 202 -422 709 553 -765 -74 -209 629 -775 -846 350 -197 -542 -341
6619 -341 841 -9 -556 -195 36 666 -99 -759 831 541 -709 -437 464 479 -622 -405 247 676 -54
6638 -54 19 236 176 110 -406 193 1284 -1342 -1641 519 246 -719 -121 490 398 -830 -630 790 531 -436
6658 -436 -696 152 164 -446 -431 676 1001 -740 -1004 781 266 -875 -208 -248 -549 -155 -370 381 -259 -782
6678 -782 -229 1428 1483 -608 -13 1047 1112 -308 -356 725 -47 -626 -602 711 544 -226 4 619 306
6697 306 -556 -625 813 98 -1447 -402 514 39 -867 -476 -229 168 -712 62 733 497 -1159 -162 943
6716 943 616 -855 -164 803 1093 -411 -617 1468 790 -1032 -265 710 407 -885 105 1601 26 -887
6734 -887 229 1286 -99 -1101 698 1316 -16 -1706 697 1052 -600 -1297 -517 891 -488 -1065
6750 -1065 56 637 -584 -808 -371 1177 625 -693 269 -85 284 -430 46 704 465 -300 -158 534
6768 534 348 -769 93 1097 -365 -1031 508 516 498 -84 -447 133 -90 -917 -661 1508 -15 -614 -369
6787 -369 711 -134 -674 -140 685 -94 -16 91 716 132 -1212 405 955 -108 -757 69 936 -616 24
6806 24 -66 86 315 -1192 212 72 -855 -933 383 509 -261 -1041 -270 2 -233 -476 191 345 508 -537
6826 -537 198 395 -181 -638 347 1226 -684 -552 -222 -341 364 -463 -173 1090 160 29 -141 1329 117
6845 117 -353 998 620 -271 -1326 758 695 -327 -1144 -172 868 -99 -904 -29 258 -500 -709 -492 793
6864 793 -698 -1336 -241 193 -269 -1771 279 328 51 -632 367 792 -318 -688 321 239 -262 -984 568
6883 568 1091 -758 -1048 448 1083 56 -625 92 935 42 -720 -26 701 -174 -1041 -133 1056 -497
6901 -497 -1154 562 396 -261 -910 111 971 -282 -663 102 550 -516 -743 285 456 -41 -838 378
6919 378 805 -555 -702 591 1001 -147 -317 440 1289 -604 -1327 662 455 -304 -75 365 825 -623
6937 -623 -548 417 961 -604 -777 758 718 -421 -1211 976 1349 65 -617 291 685 -729 -878 650
6955 650 14 -185 -577 327 520 -230 -743 418 765 -904 -788 538 468 190 -412 1094 768 -86 232
6974 232 1233 542 -824 -663 596 798 -519 -566 159 808 -1128 -813 1003 1004 -366 -93 359 822 -1146
6993 -1146 -514 742 482 -350 -220 73 284 -986 -493 744 475 -1097 -2 819 151 -1126 -617 1212
7011 1212 212 -681 -320 952 114 -917 67 673 843 -555 -240 219 408 -780 -642 1155 398 -1566
7029 -1566 -854 1533 961 -111 -349 201 -208 -867 -281 1469 360 -933 -161 507 645 -820 -675 1011
7047 1011 405 -365 335 909 511 71 -408 950 330 -740 -499 56 341 -635 -432 953 261 -728 -375
7066 -375 1989 429 -953 39 507 -140 -366 -520 1523 -624 -1226 -551 760 450 -589 -477 363 352
7084 352 -964 -360 845 216 -1193 -545 458 437 -258 405 797 -292 -287 -297 702 -318 -979 8 787
7103 787 504 -929 677 940 -256 -480 414 854 26 -768 -116 1254 659 -1120 -442 910 461 -1228
7121 -1228 -79 902 351 -1859 -163 269 1304 -828 155 1139 -190 -1479 -36 1006 -395 -734
7137 -734 289 1223 517 -1538 -124 755 -275 -1610 817 504 -338 -998 684 1112 -2 -986 -340
7154 -340 680 -423 -668 -778 330 177 -637 -167 1041 -257 -630 424 449 -604 -859 289 1103 42
7172 42 -801 -23 528 -448 -806 -263 1697 613 -927 -195 715 -142 -727 -363 697 -132 -972 -34 984
7191 984 191 -1457 88 185 -411 -515 299 460 -667 -1462 342 1476 -284 -958 227 536 47 -369
7209 -369 138 488 -756 -574 92 1130 -361 -721 628 1037 -286 -1160 357 1070 -207 -719 583
7226 583 115 -545 -1245 446 486 -282 -508 408 1290 -787 -875 413 882 -526 -60 610 278 -38 -110 214
7246 214 1257 -161 109 1451 682 -400 -858 220 538 -610 -184 382 664 -885 -563 674 562
7263 562 -173 -1600 338 710 -366 -885 786 819 -333 -1000 134 1014 -344 -1372 683 488 -311
7280 -311 39 474 895 -828 -1446 840 196 -622 -1386 369 159 -761 -831 1124 61 -449 -657 528
7298 528 936 -1232 -408 881 1763 -1046 -65 339 403 -657 -296 488 -41 -1538 -412 689 1038 -906
7316 -906 -1582 554 671 -836 -310 1057 1101 -649 -655 977 -237 -589 -941 234 579 -591 -629 312 212
7335 212 -490 -846 767 324 -474 -1244 720 627 -657 -780 -499 473 -568 -720 556 465 -776 -43 463
7354 463 8 -367 -602 779 571 -844 -882 253 857 -1092 -422 107 835 -686 153 767 526 -666
7372 -666 -698 1843 268 -1104 -1122 806 945 -655 6 443 215 -1113 -648 -259 105 -652 -1131 526
7390 526 119 -805 -83 937 835 -609 -445 1259 699 -743 47 804 847 -1153 -332 660 742 -1148 -134
7409 -134 1303 477 -191 3 738 449 -723 -431 1685 482 -1209 314 531 574 -502 -473 899 -259
7427 -259 -934 -608 1268 88 -566 -700 1158 -271 -685 -467 688 409 -258 -114 424 810 -433 362
7445 362 370 686 -1063 425 1595 764 -832 -575 424 770 -1008 -251 1084 606 -469 252 1126 -18
7463 -18 -1009 -50 1108 163 -971 240 719 685 -1147 377 1205 388 -919 -574 716 70 -1172 215
7481 215 891 -405 -433 -222 863 243 -1619 -478 1027 397 -560 564 715 3 -985 -61 1452 290
7499 290 -698 -243 1821 -655 -868 109 1050 400 -1370 527 687 352 -618 110 729 451 -1213 -197
7517 -197 859 280 -848 197 763 -245 -1460 -934 1342 -228 -1177 797 1122 -166 -1445 -261
7533 -261 453 -266 -448 46 721 -460 -1171 -187 737 31 -565 156 1521 -1027 -1828 646 406 307 -1226
7552 -1226 334 673 -312 -827 718 618 -700 -851 1145 749 -224 -1088 260 1023 -197 -777 137 473
7570 473 -619 -899 -85 780 -629 -424 146 166 -154 -1372 -108 653 117 -1193 203 1367 99 158
7588 158 241 164 -87 195 255 592 -827 -936 779 574 89 -1453 52 908 -16 -560 755 608 -59
7607 -59 -963 -131 596 68 -760 -152 796 -279 -902 467 690 -748 -639 99 522 -617 -517 -69 1167
7626 1167 -332 -672 201 379 30 -899 171 34 -125 -766 42 763 -660 -1163 438 1122 170 -791
7644 -791 533 217 -338 -754 847 1196 -748 -1005 249 991 -220 -751 583 1432 -361 -986 409
7661 409 1278 -380 -1100 -3 800 -386 -1006 142 411 -133 -969 158 405 -787 -353 270 495 -518
7679 -518 -637 -132 887 -555 -908 644 860 -261 -337 515 959 -682 -318 704 1037 -808 -480 268
7697 268 401 -211 -1352 -81 601 -576 -396 758 877 -363 140 110 373 -590 -785 753 1197 -524
7715 -524 -696 109 60 -978 -792 910 515 -1008 -464 727 563 -272 -538 632 651 -596 -986 901
7733 901 466 -339 -89 839 830 -544 -523 26 351 -1110 -768 1028 828 -1139 -56 304 160 -702 -470
7752 -470 1118 826 -1014 -34 912 606 -775 291 974 -321 -202 -64 622 593 -1112 -635 114 115 -835
7771 -835 -808 800 -309 -986 -501 1211 220 -1070 -559 1146 659 -982 212 406 34 -1033 -400 79
7789 79 249 -432 427 253 -94 -645 -1350 560 115 -878 320 309 947 -375 -517 372 1049 -740 -409
7808 -409 1071 432 -623 -535 1112 25 -1644 -273 249 248 -803 145 889 643 -843 93 1086 -330
7826 -330 315 154 627 -351 -534 379 520 627 -577 -616 454 635 -123 593 1387 304 -855 -229 1256
7845 1256 1010 -795 -381 316 -185 -1297 173 725 125 -631 -538 683 1063 -305 -304 1077 401 -102 -201
7864 -201 295 -68 -666 -632 103 360 -979 -401 518 -502 -1022 -623 338 641 -454 -372 419 -142 -171 31
7884 31 657 1089 -757 -379 994 6 -65 106 502 1086 -336 122 206 -209 -238 -20 527 281 -824 -500
7904 -500 1097 535 -513 -389 977 424 -758 -102 933 -517 -1017 25 793 -40 -452 437 740 579
7922 579 -871 -17 941 -167 -517 402 60 -437 23 -74 358 205 -391 -39 413 -738 -1016 212 1073
7941 1073 -467 -642 705 422 -499 -841 173 147 186 -634 -123 111 -582 -25 9 1084 -935 -1223 63
7960 63 1745 -426 -420 909 678 -539 -357 480 815 -410 -1050 -229 493 167 -704 346 -66 -320 -1022
7979 -1022 595 1259 -346 -1311 432 851 125 -363 -406 661 867 -1051 445 428 -811 -668 -30 1038
7997 1038 -1106 -204 226 409 -498 -640 -88 99 -412 -342 -231 390 -166 -485 557 266 152 -480 -181
8016 -181 931 112 -675 1258 836 -124 -649 599 676 -510 -727 784 674 314 -750 815 437 -362
8034 -362 -300 -156 73 -633 -821 752 360 -701 -129 17 222 -507 -704 -127 339 -41 1304 711 1242
8053 1242 -345 -648 -138 615 333 -256 286 30 -108 -538 -166 409 -785 -401 712 421 -1042 -1235
8071 -1235 -497 611 -490 -129 177 1028 -1084 -267 523 443 -241 -1034 1129 244 -578 -993 226 1324
8089 1324 -176 -956 -136 1105 -716 -937 698 763 -71 -285 375 162 -660 -865 560 -21 -264 -831
8107 -831 827 592 -312 -526 691 13 -355 -1100 165 1248 403 -88 279 461 -67 -458 179 901 -451
8126 -451 -673 319 254 -545 -462 33 987 -354 -480 918 409 -465 -579 378 826 -190 -279 762 1190 242
8146 242 -5 599 146 -740 -991 783 379 -1149 -192 1468 268 -986 -863 271 219 -362 -368 564 278
8165 278 -727 -884 -11 621 -1193 -229 684 -38 -518 -554 896 -96 -168 -265 141 287 -97 -965 992 845
8185 845 -1365 -905 72 469 -115 -801
8191h01
##END NTUPLES=NMR FID
##END=
