##TITLE=1H_Ser DGA-N-3
 CDCl3
 8 sc, 
 16.2.2023
##JCAMPDX= 6.0         $$ Bruker NMR JCAMP-DX V2.0
##DATA TYPE= NMR FID
##DATA CLASS= NTUPLES
##ORIGIN= UXNMR, Bruker Analytische Messtechnik GmbH
##OWNER= root
$$ XWIN-NMR		Version 3.5
$$ Thu Feb 16 13:58:19 2023 Russian Standard Time (UT+4h)  she@DPX200
##.OBSERVE FREQUENCY= 200.13135
##.OBSERVE NUCLEUS= ^1H
##.DELAY= (6, 6)
##.ACQUISITION MODE= SIMULTANEOUS
##.ACQUISITION SCHEME= undefined
##.AVERAGES= 8
##.DIGITISER RES= 18
##SPECTROMETER/DATA SYSTEM= spect
##.PULSE SEQUENCE= zg30
##.SOLVENT NAME= DMSO
##.SHIFT REFERENCE= (INTERNAL, DMSO, 0, 15.7039)
##AUDIT TRAIL= $$ (NUMBER, WHEN, WHO, WHERE, WHAT)
$$ ##TITLE= Audit trail, XWIN-NMR		Version 3.5
$$ ##JCAMPDX= 5.01
$$ ##ORIGIN= Bruker BioSpin GmbH
$$ ##OWNER= she
$$ F:/spectra/data/she/nmr/H-F/1/audita.txt
$$ ##AUDIT TRAIL=  $$ (NUMBER, WHEN, WHO, WHERE, WHAT)
(   1,<2023-02-16 13:57:14.90 +0400>,<she>,<DPX200>,
      <created by zg, POWCHK disabled, PULCHK disabled
       configuration hash MD5:
       00 E9 B6 7A A2 85 ED C7 34 08 36 98 17 FE 4E 26
       data hash MD5: 16K
       31 DA 99 6A 0A E5 76 F6 7A F4 07 CD 9C 27 DE ED>)
$$ ##END=
$$ 
$$ hash MD5
$$ 7C 68 90 31 66 BE 17 ED EC FD 19 E2 33 AE 1A 54
##$RELAX= 
##$RELAX= 
##$RELAX= 
##$RELAX= 
##$RELAX= 
##$RELAX= 
$$ Bruker specific parameters
$$ --------------------------
##$DU= <F:/spectra>
##$EXPNO= 1
##$NAME= <H-F>
##$PROCNO= 1
##$TYPE= <nmr>
##$USER= <she>
##$AMP= (0..31)
100 100 100 100 100 100 100 100 100 100 100 100 100 100 100 100 100 100 
100 100 100 100 100 100 100 100 100 100 100 100 100 100 
##$AQSEQ= 0
##$AQ_mod= 1
##$AUNM= <au_zg>
##$AUTOPOS= <>
##$BF1= 200.13
##$BF2= 200.13
##$BF3= 200.13
##$BF4= 200.13
##$BF5= 200.13
##$BF6= 200.13
##$BF7= 200.13
##$BF8= 200.13
##$BYTORDA= 1
##$CFDGTYP= 0
##$CFRGTYP= 5
##$CHEMSTR= <none>
##$CNST= (0..31)
1 1 145 1 1 1 1 1 1 1 1 1 1 1 1 1 1 1 1 1 1 1 1 1 1 1 1 1 1 1 1 1 
##$CPDPRG= <>
##$CPDPRG1= <>
##$CPDPRG2= <>
##$CPDPRG3= <>
##$CPDPRG4= <mlev>
##$CPDPRG5= <mlev>
##$CPDPRG6= <mlev>
##$CPDPRG7= <mlev>
##$CPDPRG8= <mlev>
##$CPDPRGB= <>
##$CPDPRGT= <>
##$D= (0..31)
0 1.2 0 0 0 0 0 0 0 0.06 0 0.03 0 0 0 0 0.0002 0 0 0 0 0 0 0 0 0 0 0 0 
0 0 0 
##$DATE= 1676541434
##$DBL= (0..7)
120 120 120 120 120 120 120 120 
##$DBP= (0..7)
150 150 150 150 150 150 150 150 
##$DBP07= 0
##$DBPNAM0= <>
##$DBPNAM1= <>
##$DBPNAM2= <>
##$DBPNAM3= <>
##$DBPNAM4= <>
##$DBPNAM5= <>
##$DBPNAM6= <>
##$DBPNAM7= <>
##$DBPOAL= (0..7)
0.5 0.5 0.5 0.5 0.5 0.5 0.5 0.5 
##$DBPOFFS= (0..7)
0 0 0 0 0 0 0 0 
##$DE= 6
##$DECBNUC= <off>
##$DECIM= 32
##$DECNUC= <off>
##$DECSTAT= 4
##$DIGMOD= 1
##$DIGTYP= 9
##$DL= (0..7)
0 120 120 120 120 120 120 120 
##$DP= (0..7)
150 150 150 150 150 150 150 150 
##$DP07= 0
##$DPNAME0= <>
##$DPNAME1= <>
##$DPNAME2= <>
##$DPNAME3= <>
##$DPNAME4= <>
##$DPNAME5= <>
##$DPNAME6= <>
##$DPNAME7= <>
##$DPOAL= (0..7)
0.5 0.5 0.5 0.5 0.5 0.5 0.5 0.5 
##$DPOFFS= (0..7)
0 0 0 0 0 0 0 0 
##$DQDMODE= 0
##$DR= 18
##$DS= 0
##$DSLIST= <SSSSSSSSSSSSSSS>
$$ [...]
##$SUBNAM2= <"">
##$SUBNAM3= <"">
##$SUBNAM4= <"">
##$SUBNAM5= <"">
##$SUBNAM6= <"">
##$SUBNAM7= <"">
##$SUBNAM8= <"">
##$SUBNAM9= <"">
##$SW= 18.05172834244
##$SWIBOX= (0..15)
0 0 2 0 0 0 0 0 0 0 0 0 0 0 0 0 
##$SW_h= 3612.71676300578
##$TD= 16384
##$TD0= 1
##$TE= 0
##$TE2= 300
##$TE3= 300
##$TEG= 300
##$TL= (0..7)
0 120 120 120 120 120 120 120 
##$TP= (0..7)
150 150 150 150 150 150 150 150 
##$TP07= 0
##$TPNAME0= <>
##$TPNAME1= <>
##$TPNAME2= <>
##$TPNAME3= <>
##$TPNAME4= <>
##$TPNAME5= <>
##$TPNAME6= <>
##$TPNAME7= <>
##$TPOAL= (0..7)
0.5 0.5 0.5 0.5 0.5 0.5 0.5 0.5 
##$TPOFFS= (0..7)
0 0 0 0 0 0 0 0 
##$TUNHIN= 0
##$TUNHOUT= 0
##$TUNXOUT= 0
##$USERA1= <user>
##$USERA2= <user>
##$USERA3= <user>
##$USERA4= <user>
##$USERA5= <user>
##$V9= 5
##$VALIST= <valist>
##$VCLIST= <CCCCCCCCCCCCCCC>
##$VD= 0
##$VDLIST= <DDDDDDDDDDDDDDD>
##$VPLIST= <PPPPPPPPPPPPPPP>
##$VTLIST= <TTTTTTTTTTTTTTT>
##$WBST= 1024
##$WBSW= 4
##$XGAIN= (0..3)
0 0 0 0 
##$XL= 0
##$YL= 0
##$YMAX_a= 55483
##$YMIN_a= -107970
##$ZGOPTNS= <>
##$ZL1= 120
##$ZL2= 120
##$ZL3= 120
##$ZL4= 120
##$ABSF1= 10
##$ABSF2= 0
##$ABSG= 5
##$ABSL= 3
##$ALPHA= 0
##$AQORDER= 0
##$ASSFAC= 0
##$ASSFACI= 0
##$ASSFACX= 0
##$ASSWID= 0
##$AUNMP= <proc_1d>
##$AZFE= 0.1
##$AZFW= 0.1
##$BCFW= 1
##$BC_mod= 2
##$BYTORDP= 1
##$COROFFS= 0
##$CY= 11.3945322036743
##$DATMOD= 1
##$DC= 2
##$DFILT= <>
##$DTYPP= 0
##$F1P= 2.36226072786647
##$F2P= -0.459571619588291
##$FCOR= 0.5
##$FTSIZE= 0
##$FT_mod= 4
##$GAMMA= 1
##$GB= 0.15
##$INTBC= 1
##$INTSCL= 1
##$ISEN= 128
##$LB= 0.24
##$LEV0= 0
##$LPBIN= 0
##$MAXI= 10000
##$MC2= 0
##$MEAN= 0
##$ME_mod= 0
##$MI= 1.114404
##$NCOEF= 0
##$NC_proc= 0
##$NLEV= 6
##$NOISF1= 3.799351
##$NOISF2= 2.8
##$NSP= 1
##$NTH_PI= 0
##$NZP= 0
##$OFFSET= 15.70392
##$PC= 1
##$PHC0= -19111.31
##$PHC1= 14.60078
##$PH_mod= 1
##$PKNL= yes
##$PPARMOD= 0
##$PSCAL= 0
##$PSIGN= 0
##$REVERSE= no
##$SF= 200.130013532006
##$SI= 16384
##$SIGF1= 3
##$SIGF2= 2
##$SINO= 400
##$SIOLD= 16384
##$SREGLST= <1H.CDCl3>
##$SSB= 0
##$STSI= 0
##$STSR= 0
##$SW_p= 3612.71676300578
##$SYMM= 0
##$S_DEV= 0
##$TDeff= 0
##$TDoff= 0
##$TI= <>
##$TILT= no
##$TM1= 0
##$TM2= 0
##$TOPLEV= 0
##$USERP1= <user>
##$USERP2= <user>
##$USERP3= <user>
##$USERP4= <user>
##$USERP5= <user>
##$WDW= 1
##$XDIM= 8192
##$YMAX_p= 0
##$YMIN_p= 0
$$ End of Bruker specific parameters
$$ ---------------------------------
##NTUPLES= NMR FID
##VAR_NAME=  TIME,          FID/REAL,        FID/IMAG
##SYMBOL=    X,             R,               I
##VAR_TYPE=  INDEPENDENT,   DEPENDENT,       DEPENDENT
##VAR_FORM=  AFFN,          ASDF,            ASDF
##VAR_DIM=   8192,          8192,            8192
##UNITS=     SECONDS,       ARBITRARY UNITS, ARBITRARY UNITS
##FACTOR=    0.0002768,     1,               1
##FIRST=     0,             0,               0
##LAST=      2.2672688,     0,               0
##MIN=       0,             -107970,         0
##MAX=       2.2672688,     55483,           0
$$ Real data points
##PAGE= N=1
##DATA TABLE= (X++(R..R)), XYDATA
$$ [...]
1798d74Q00m32j04M2j73M96k28l36O86j63j26O5j11M72m09K55L34n53j92K50j19
1819b0J21k85o6N07k86j53L59j91m5j89J01J77k93k20L58M5k90L14kL17k90j64
1841a95N72n29n2L9R6K57J71o63M52M9l94J61K30o2m34k89Q57k65n41N55l90J98
1863a77K68l84M90n4p12M56K67k07J4l05P14m32k98L83K40k51j32J0P88o08j79
1884a09L87q1l56Q0k62M72k10k64L95J70j83n8k37K4L95l58K58J35k88J19J65
1905A94m3M7j68L46o6o56L58N14n19R3l21N61o4o98L99J12j42J24l05K98O4k76
1927a48J8P7k88K62l22L69l6p5K08M5j28M1Jj7ml2L21k37k71J17J40L8L0l77M25
1952A57l29J56N4j59p9J64j94K93K14m63J13J63k01L0K06R8j85k55L72q2j55K54
$$ y = [-474, 326, -106, -210, -168, -341, 155, -73, -409, 277, 114, -12, 53, -58, 414, 5, 260, 594, 41, -151, 99, -20, 101, -184, -250, 257, -29, -182, 177, -14, -59, -248, -147, 30, -263, -483, -125, -80, -370, -56, -58, 259, -31, -195, 377, -152, -204, -165, -69, 188, 359, -304, 148, 197, -197, -36, 194, 132, -302, -591, 266, 1, -540, 15, -375, -177, 91, -293, 197, 143, -569, -113, 154, -53, -39, -344, 370, -62, -360, 23, 263, 12, -120, -110, 678, 70, -109, 278, 197, -159, -79, -341, 131, -79, -343, 52, 222, 39, -19, -256, -232, 163, -195, 63, 198, -90, 29, 194, 151, 198, 30, 376, 310, -346, 12, 526, 7, 100, -221, 340, 276, -422, -23, 89, -53, 71, -234, 64, 128, -148, -130, -53, -341, -79, -401, -32, -68, -143, 65, 110, -18, 23, 24, 7, 3, -29, 292, 55, -216, -99, 41, 79, 109, -268, 157, -172, -16, 38, -121, -200, -36, -230, 63, 277, -186, -73, 90, -111, -81, 125, 223, 38, -217, 155, 73, -82, 172]
1974A72k14J90K68k71j85K77l10J42k60L90k2o86L63L72m20K62j71j95K71J47
1994A20j42o2j66L20k54J43O8k82R2M95n47K1L70k58m9K64R8Ro63N98L2j08J81
2017B80j94j80J61j02K2J64l16n2r0J48N97q83K75K52j49k39N59m69J66l20J47
2038b23L10k39K49J4n65O95l66J50K01m26j04L68j33J10k4j31O4m52N00M68n51
2059h5p6k1NM77m15J85J68q3j59j37L94n1n19L88K76l50j80M34j84N5l6J54l89
2082a49m3L46k17r3J59m78J67O39n53r9L20J84o0l07L19j07m37N44J20l14J72
2103A13j82k17N11J32m92K47l66J38m1K40M05o95k76P32l65R3L11m42l17M33J98
2124A60j76j86J1J63m3M88m47n7L20j8n55J75J06K05l62K87J18m89K66L18k98
$$ y = [172, -42, 148, 416, 145, -40, 237, -73, 69, -191, 199, 177, -509, -146, 226, -194, 68, -103, -298, -27, 120, -22, -84, -250, 70, -184, -41, 27, -255, -163, 332, -215, -194, 176, -82, -131, 133, 231, 240, -423, 175, 207, 99, 280, 86, -94, 67, -35, -13, 151, -165, -217, -307, -159, 438, -445, -170, 82, -67, -306, 253, -216, -50, -370, -223, 87, -152, 97, 111, -454, 241, -125, 25, 226, -200, -304, 64, -69, 41, 17, -114, -50, -502, -2, 466, -85, -161, -182, -177, 300, -115, 70, 238, 155, -4, -141, 253, 202, -317, 71, 347, -3, -183, 251, 67, 122, 86, 240, -149, -192, 154, -63, -156, 3, -475, -308, 331, -222, -321, -1, 183, 123, -184, 135, 28, -409, 135, 255, -59, 113, -69, -286, 225, 357, -135, 112, -254, -116, -157, 83, 488, -207, -483, 249, -116, -23, 288, -154, -471, -38, 160, -16, -202, -191, -28, -71, 417, -30, -87, 233, 215, -340, -165, -59, 146, -216, 71, 189, -300, -34, 284, -14]
2145a4J30k90l6L60k10L2J11O9j54k52N4M67o25J6K43r1K15J60j46j82n4K05J48
2168A56j26R8j93l0K01m1k88O58o01p7K92Q9J43l91N1J36m05K91M0p6j2J28j37
2191i4J85J10m17M9J45K54k05P1K79n26j27O17j19m37L97J51k76P7k56J75j74
2212a21J23m4J16L1j77m77Q10j71l53L35j9k7k11J15K70j93j48L47l72R1J96q2
2234C9K28l81K34N4j80J42J44k43j2j57k07L33P1N4j1j59L04j96l68M06j53j30
2256a88O1K68m2q3j3j22J17l4N2L8j44q9K44K51o69K35K26J85k50M6j55K91o2
2279A63k84K7N0J54k29lK41k74o0M78j77r8O4k18L93k91J09NM5K9j82l8N1q6N1
2304h0M33j09m24L21q4r7q7J67k94K12K00j47l35L55j8L8J00k04k33O8M11K66
$$ y = [-14, 116, -174, -210, 150, -60, -28, 83, 152, -2, -254, -200, 267, -358, -342, -99, -190, 25, 185, 39, -143, -197, 8, 156, 30, 128, -65, -95, 106, 65, -223, 435, -166, -243, 49, 138, 281, -110, -59, 77, -328, -37, 3, -73, -85, 43, -94, 91, 201, -216, -167, -22, 232, 27, 98, 377, -149, -276, 341, 222, -215, 182, 333, 57, 134, -122, 53, -121, 2, -42, 74, 105, -72, -549, 261, 90, -263, 72, 53, 26, -185, -70, 200, 7, -141, 206, -166, -75, 121, 39, 267, -114, 120, 174, -6, 136, 280, 37, 25, -132, -339, -6, 65, 119, 108, -51, 253, 57, -311, 95, -58, -188, -127, 141, 99, 16, 3, -119, -2, -36, 16, 54, -90, -179, 65, 316, -353, -118, 108, 293, 43, 89, -66, 225, 163, -121, -94, -44, 110, -119, -122, 119, -155, -215, 263, 86, -12, 52, -166, 227, -64, 45, 50, 95, 124, -58, -96, -45, -131, -80, 353, 244, -180, 141, 57, -40, -127, 40, -254, -42, 158, 11, -324, 31, 13, 51, 151, -53, -286, -218, 193, 459]
2326D59n68J84L9K38l55M34j63l45J20O3J74j06k33K59j02j36L24m02J32j06p0
2347a60J62J95l11K71j67J35j9l18M13l77K2K89j02N5R9k83K86oo43O31P6k10
2369C8O1o3K21j22j96k05L93k03K03k73K98m0k76L06k2n09M01J7j2j63L13k70
2391a03J50rn9j20J25J49m11L54K08q9l71K4L00O6l30J73j1L3l16L04k00K05j61
2414h9J66J86o22L68p0j9j5k8J24J18j54l45M53o6K30j36j74K59m77M1L89l74
2436b35Qk3L57On53M66j8k02J16N3J35r0l16L16K78l76J77j54J5K41j07J81j99
2459G6l82K04L06m6l29J02o6l1J20MJ03m08M77j00j8o5rR3J77l39K88L4l29J42
2483Dj69M23R7j23l60n1M2Q4K42m59N69j73j93P2j9k09j9L50K69m37LK39p0k79
$$ y = [459, -109, 75, 114, 352, -3, 431, 268, -77, 43, 106, 280, 174, -59, 200, 98, -38, 286, -116, 16, -90, -160, 2, 197, -114, 157, -10, 125, 106, -212, 201, -176, -154, 135, 33, 88, 187, -96, 190, 184, -459, 172, 248, 38, 99, 36, 257, 135, -61, -266, 127, -76, 127, -146, 152, 112, -164, 142, 120, -389, 12, 29, 17, -146, 167, -103, 47, 38, -21, -141, -16, 133, -278, 76, 284, 195, -176, -152, 148, 214, -116, 57, 46, 79, -237, 67, -133, 72, -89, 77, 263, -359, 9, -61, -80, -95, -123, 1, 119, -35, -380, 73, 7, 237, 101, -73, 186, -291, -250, 139, -235, -227, -250, 107, 113, -440, 26, 8, -194, -78, -25, 110, 20, -296, 20, 298, -78, 99, -55, -40, 201, 94, 275, 76, -306, -102, 204, 158, -171, -69, -135, -166, -46, -42, 61, -347, 130, 30, 12, -53, -62, 31, 208, -131, 157, 191, -138, 4, -165, 258, 355, 232, -128, -179, -137, -53, 189, -270, 299, 126, -67, 5, -14, -223, -242, 108, 377, -60, -57, 182, 112, -167]
2507a67J89O8l03L55k55N36m49J80l75P1M64k62kK5l3j49N3J16J5o4R1m8k32N15
2531C39l11m0K71m3k36n3p6n8J98J22l32j10N16q2l77L05J65l90K35k22K26j58
2553a11J88q4j76K73J08j22m3q1j36P1L85k49k14N39m61m0m8p4K98k49J79J39
2575I2j23L52o43M14o4M01m62j55L15OL7k83K46l04L82rk63Q8l24K20j53N09j45
2598A34j00j75L0K44k70L02m16k51P50j75j71K6j57K95M7q7J19l17J02L09o04
2619c65L00K6K39rj17k43J12M26j05j54j16K03j88O9j44M0n0j28k33L92K79k15
2641A9J47p9Q4k15j07M24l13k24K60k00J99J77k52K5K22k95J78J12k07j7Q4M7
2663F9O3k95J67j04j07Q2K71r0k19L38k34j56J25L16n02M06J49m11P8P9k61K40
$$ y = [-167, 22, 90, -213, 142, -113, 423, -26, 154, -221, -150, 314, 52, 50, 75, 42, -107, -54, 62, 77, 13, 104, 56, -176, 339, 28, -12, 259, 216, -20, -73, -149, -207, -9, 113, -219, -329, 187, 105, -272, 33, 198, -192, 43, -179, 47, -111, 77, -7, -183, 90, 198, 76, 33, -48, -184, -113, 272, 23, -191, 348, -113, -153, -201, -275, 23, -226, -47, 92, -31, 321, -322, 92, 28, 429, -33, -188, 127, 133, 170, -113, 133, -171, 211, 202, -61, 27, -297, -77, -230, 279, 134, 34, -141, -111, 133, -137, 165, -251, -502, 248, 73, -98, -72, -229, 66, 113, 26, 145, -172, -70, 239, -365, -65, -39, 200, 191, 74, -169, -57, 369, 264, 110, -6, 197, 9, 78, -66, -26, -76, -204, -437, -45, 234, 19, 166, 87, 171, -44, -151, 273, -40, -264, -4, -204, -5, 172, -80, -55, 167, -128, 50, 162, -45, -62, 22, 69, 132, -163, 4, -100, -207, -125, 146, 56, -163, 175, -59, -215, -90, 226, -276, 130, 279, -132, -54, 25, -236, 4]
2685DJ57n5k08l6L18k35k67O91m32j81L31K0%j80j00J59o3J2j50k14O03k55k65
2708c46M69P4n8l06L24L0l70k1M13p1k46J0N4m5J33j22O5K78m68l4J97J60k32
2731a12p2ML75j06m12J59j95Q5K32L8Pq1J78j27m5j72J70J03j22K7K12Q0j09J19
2755B36m85M58j50QJ60j25m14M70j99j80J10l2j18J93J29j55J51M3n2k47r6L39
2777D4k32M0K8k11M61j28J06m7l92M37l2L0K04n36J6N67k74Q4j76K8j44K52k10
2800h5L88l23j4Q5p9J22p1j65nQ6k1K44j70P7k58K55k4j58K25j12j25L64m6j81
2824In1j21K94N7k48m0P9O6j15K4j39K68l63J40L98k81J35l54J73oj34J58J47
2847I6L1j64J45k16K30j04r3J75NM8j52P5r9j12K72K23m38j25J05L0Q0J05q4J57
$$ y = [4, 161, 106, -102, -138, 180, -55, -322, 369, -63, -244, 87, 107, 107, -73, -173, -14, -77, -65, -215, -429, 174, -81, -346, 123, 197, 139, -167, 157, 187, -183, -204, 209, 138, -108, -98, -44, -89, 44, -78, -13, 265, -203, -237, -40, 120, -112, -184, -180, 195, 89, -323, -164, -359, -274, -42, -4, 3, -78, 100, -27, -72, -244, -74, 29, -93, -66, 146, 226, 117, 236, -249, 209, 59, 67, 227, 102, -312, 158, -41, -221, -111, -143, -261, -68, 61, -94, 57, 100, 48, -199, -295, 44, -188, -148, -120, -331, 130, 2, 108, 61, -331, 106, 74, 104, 308, -228, -212, 355, 81, 165, -11, 17, -127, 125, -85, 303, -20, -34, 51, -28, 94, 23, -142, -147, -61, -82, 162, -8, 69, -189, 66, 42, -116, 109, -3, -128, 236, 190, 9, -42, -163, 131, 188, -60, -100, -21, 45, -70, -46, -185, 83, -280, -140, 258, -23, 112, -242, -69, -75, -209, -51, 96, 127, -37, 108, -108, 122, 18, -75, 100, 105, 153, 1, 76, -23, -135, 137, 360, -78, -203, -98, -68, 12, 117, 33, 190]
2871A90k98K29k23j10K34J16k31M76m31j4J54j35P7J36j16J2J03k28J06j03n7
2892a13J89k63N46l38k42K92P6j87J4jj39Q5M9J63l90K22j5M7Ll4M1J08j03k11
2916b01K72j10J05K0n11M15K7k44M43o8O1j17k00K04J02k78J60j26k05L04j95
2937a42lL25k34J92j23J60k85K25j44ok20R5N3j05K97k68J07O1j72L42M0l36K15
2960G4n9o4J7O7Q8j65K79j06k7k75r3J17K22J75j88J03l42J45K62r9P5l66j7L49
2984A72k66J12o2Q5nLpK21k82N4P6l83L63Ql14M08j03j61K20m46N98k92j96K88
3008I1k44J58m1J75m39J75L48r0j44o2K00j4l0j97R7j07j6J24l8K76k11q1K99
3031B29j45m4k09K98j60j89M58m98K97j50J23l1m2P8jj14K46k38m43O38J23l58
$$ y = [190, -108, 121, -102, -212, 22, 138, -93, 383, -48, -62, 92, -43, 34, 170, 54, 66, 169, -59, 47, -56, -113, 76, -187, 359, 21, -221, 71, 147, -40, -26, -27, -166, -81, -32, 131, -259, -37, -52, -5, -2, -36, 5, 113, 10, -201, 71, -39, 66, 86, -425, -10, 17, -227, 216, 148, 209, 92, -108, 96, 198, -80, 80, -46, -251, 53, -142, -145, 180, -54, 138, 15, 175, -110, 115, -29, -35, -255, -160, -107, -212, 85, -183, -76, -15, -187, 155, 195, -141, 74, 15, -49, -32, 35, 123, -42, 237, 131, 104, -171, -264, -147, 75, 250, 62, 165, -177, -32, 230, 131, 206, -160, -177, 172, -94, 18, -44, 41, 36, 39, 32, 253, -29, 25, 101, -282, 81, 89, -225, 183, 80, -81, 139, -307, 291, -1, -197, 91, -153, 5, -36, 139, -300, -125, 223, 133, -11, -73, 127, 113, 83, -114, -17, -124, -140, -16, -54, 222, 11, -70, 229, 84, 40, -169, 129, -31, -220, 238, -260, 37, -113, 10, -21, -63, 15, 14, -100, 146, -92, -535, 103, 226, -132]
3053a32J53M1l9K02l26l52M51N5K9k37J71K92m00l3K86k57K27k0J07l22J41L21
3075C58m47J8K15om08L13P5N4l7k38K33P5k72J53N8q3k09J36L19j63l68O3J32
3098b9J48m46K13K29J09l67L75j55k08M26k90J4R5j06k5K5J23l96R2J45j01K57
3120A28k37M9l22K22K4k5K21N0j69ml2r5j1J85q1r9L19k09J38nJ17j32M4P3N5
3145B04k0r9m9P6o6J89Rj57j14J27m1j42J60k08L75k70j96k15M85q5J38J13m48
3168b34K98k7q4J28l8j04mj1K78m15L11j9N8k83R7K34q8l21o8M37j94q7k06M30
3192H8L32l83j38J44J33m61K72J15l6J38l27L13l32J99l6K10j58R4j55j3m6K61
3214B14k08J72M9j24j09O1L1j70j61L25j85K12l99J10J39J99L5j49r5J52Ml50
$$ y = [-132, 21, 62, 23, 225, -101, -453, -2, 53, 82, -155, 16, 308, -92, -125, 161, -96, 131, 111, 218, -104, 37, 358, -89, -71, 144, 138, -270, 43, 118, 172, 135, -103, 130, 205, -67, 86, 144, 61, -148, -12, 307, 144, -224, -161, -29, 119, -327, -114, 115, 224, -143, 232, 77, -131, 295, 5, 19, 114, 8, -17, 8, 131, -265, -173, -28, -129, 128, -109, -60, -382, -160, -136, -161, 60, 110, -59, -63, -95, -190, -201, -16, -97, -196, 123, -86, 52, 47, 164, 32, 76, 149, 204, 184, 85, 36, 112, 46, 235, 244, 87, -27, 100, 59, -83, 77, -131, 244, -26, -222, -437, 48, -37, 101, 214, -234, 64, 37, -47, 81, 43, -61, -65, -76, 202, -213, 98, 79, 137, -146, -49, 185, 97, -224, -292, 145, -49, -136, -342, 88, 420, 37, -101, 43, 176, -285, -13, 102, 66, 204, -123, 190, -142, 57, 21, 231, 73, 167, 12, -1, -47, 214, 6, 178, 227, 103, -6, 55, 86, -84, -245, 80, -105, 107, -292, -182, -43, 156, 191, 42, -53, 99, 103, -247]
3236b47K28P6p0J80k75N4K11j97j6J80nj06J74J50j41m36J70J59k45K42k81K20
3258B5J23l64L21k62K16j11k3o5J43j53n4J59J44r5j20P4Q8k74J57R6j00l2J67
3281F0J6r0m0o1M98j90o0K8O1m7j69J13j26q4K90K5k73J46k76M0K77k85M45l15
3305a7k29J61j63J67K89j90k3N4r1J18j24J10K11l35J8r9K75k72p1K36J38j12
3327E1k29J84j51O9r9J44N1l0k11Q9J60n5m3K08k60L6l16K63o1J3J03P9P0k63
3351a98J43J18l74L12nk1k0L1O9M0o1p8K17q9j84J21m6j8J74j97J62o0L65k42
3375A59k34l0jj53K54J05K92m05j26J31Q8j32L07k00j5o5k03K29j19J83p7k4J28
3398I2o9k41K77M4j76J89P4r8l50K61K9j51N7J11r6n3oJ5L5L7l46N99j05l88K43
$$ y = [-247, -19, 57, -13, 167, -108, -54, 157, -40, -56, 124, 119, 13, 187, 337, 196, -240, -70, 89, -156, 86, -195, 25, 148, -216, 105, -157, 59, -52, -75, -140, 3, -150, -204, -45, 99, 4, -116, -42, 46, -228, -71, 25, -75, -107, 60, 76, -14, -54, -115, 383, 193, 133, 161, 222, 175, 6, 119, -7, -91, 199, 224, -49, 97, -179, -139, 138, -147, 298, -17, -246, -85, -248, -81, 208, 18, -5, 49, -42, 76, -48, 62, 273, -62, -44, -143, 132, -140, -211, 25, 163, 51, -178, 6, -145, -76, -175, -31, 20, -10, -221, -132, 28, -27, -70, 138, -122, -86, -402, -139, -200, -187, -84, -5, 65, -198, -55, 63, -311, 1, -4, -25, -45, -14, 55, 95, 34, -44, 173, 84, -100, 21, -25, -43, 131, -66, 96, 36, 401, 159, -75, -105, -106, -259, -5, 100, 392, -13, -139, -8, 80, -52, 255, 55, 40, -25, -228, 1, -118, 65, -12, -36, 92, 23, -218, 59, 103, -73, 116, 190, 92, -258, 3, 32, -119, -62, 49, -47, -100, -106, -91, -56, -19, -365, 234, 129, -259, -16]
3423a6J98k21L94m93J93Q6k04j36K82j73L13p6j38j8l73K44R3q4K50m8k34J07
3445e4j2K25K5j85J31j96n2O6R8K25k37l20J91J91J26j7k66L68j08n59N54q6o7
3468D1L1j41n0p0J57J98k30J88j64J2P0j69M8J70J2k55J20R3J38l24j15J98o0
3491a02L7L6j9%p0j07L28K4j41J12n8j1K4k19J43N9j51K89k14p3L56l70P5K01
3515A49k14J03j68J83k56M5K2L28l46J45r1K75o9o4k26K25m2K71j53q3M8j45L3
3538c0J93l62L92o0o2k10J35J4k69J09O2J71j83m1J71jj67j0J2K85k69R5J82p
3562A50l56J17J60J12l39J41RLP9k31M0P7L08k75m7n2K48m35P5J20M1J76j64O9
3586B6K91J3k77k23K37k4j71L50k4pl88J92Q1J09l31J67M8LJ1J39j44j92k0Q9
$$ y = [-16, 182, -39, 355, -138, 55, 141, -63, -199, 83, -90, 223, 147, 9, -9, -382, -138, -45, -129, 121, 73, -161, -54, -66, 159, 184, -1, 130, -66, -118, -52, 46, 271, 34, -286, -95, 96, 222, 205, -61, 307, 199, -360, 194, 108, 41, 72, -69, -119, -189, -32, 166, -64, 124, -40, -28, 42, -127, -79, 91, 103, -152, -32, 61, 199, -125, -240, -42, -102, -65, -29, -48, -48, -118, -225, 103, 127, -14, 98, 40, 29, 53, -166, -23, 36, -115, 174, -40, -113, 243, -127, -52, 149, -65, 38, -130, 53, -203, -158, -136, 192, -154, -9, -100, 175, 106, 42, -184, 41, -1, 270, 117, 34, 82, -63, -30, 163, -199, 193, 133, 71, -139, -4, 10, -259, -150, -88, 83, -100, -141, 30, 29, -138, -148, -136, 149, -120, -25, 157, 150, -206, -89, 71, 183, -156, -15, -6, -3, 76, -155, -115, -38, 270, -5, -52, -104, 144, -291, -216, -96, -55, 121, -43, 26, 317, 330, 53, -170, 67, 43, -128, 222, 198, 191, -197, -5, 76, 185, -146, 21, 69, 72, 83, 222, 78, -114, -134, -45]
3610d5K36M0j59k51M63j14l61J69O9m3K09j03p5j39K19n3J62M5j09j07jP8j13
3633A7P4j09j2L7N9j06q6J31k49J74O6m12L56J4mj64J09j10j12J92J18J82Oj83
3657a2K0j64M36l39o6Q7J77n7k46K71k38K93j79J49O9j16QJ38k31pK4q2L8j39
3681a66J40K18j13K58k72m29L05k74L30j02O7K7M7l0J08j13j03j10L6r7M73l37
3703a37n1M3N18l31J1m9K1M1n72M84J27jQk4j39Q6r3R6N5j36J72j21J02K01l04
3728GJ4R6p8r2O6j41J18J30k93K00q8O8k7J66m22L23j61K27J1nJ9k22L33l95K56
3753A10k0k24j02N03j56l2o3J2q9N8j07K79%J7k56Q8J22k48J01Q2N9J4k66L20
3777B02j69j31K74O2j46l12L46o5r5j48J16L97l87n8J46J06N8j11j30j33J18K8
$$ y = [-45, 191, 231, 72, -179, 284, 170, -191, -22, 47, 4, 213, 110, 35, -104, 115, 62, 224, 269, 160, 53, 52, 130, 17, 91, -18, -30, 7, 66, -40, -126, 5, -244, -70, -4, -416, -60, -46, -50, -214, -105, -215, -327, -135, -17, 165, 171, -12, 8, -156, 280, -59, -125, -38, 139, 82, -164, 107, -131, 162, -17, 132, 201, 85, 93, 231, 0, -7, 17, -65, -27, -166, -26, 192, 79, 337, 65, -364, -59, -333, -3, -105, -38, -11, 36, 6, 114, 1, -102, -212, -176, -273, 200, -137, -188, -145, 373, 42, 53, 4, 25, 66, -506, -22, 105, 104, 112, 88, -51, 35, -58, 38, 93, -43, 129, 8, 110, 311, 7, 21, 117, 39, -53, 13, -128, -10, 120, -173, 27, -61, 7, -20, 146, -276, 47, -114, 113, 124, 119, 138, -84, 249, -146, 110, 90, -134, -236, 267, 111, 79, 16, 28, -61, -3, -110, 169, 169, 186, -70, 18, 140, -108, -7, 75, 134, 148, -118, 202, 33, -98, 176, 238, 92, -220, 126, 61, -34, -182, -66, 331, -56, -114, 32, 138, 196, 85, -45, -178, -60, -32]
3799c2K20l15J14n1q9J09K83j92j24m5k8K38j69Q1M0j52J81L48l40k72M61k21
3821D5j40J07J87J04l87L12m31K37N5k49L35k05j33K7K4R4j55J37k86m6M21O1
3843A14k68J56pJ49k54M5k40L13L0j06J86j31oj87J08M4K17k76M16j12j56q9O3
3866Ik4j48K62j13j13j06J89j2J87k31n1K87j77K03p5l22J59kj40K94r6l8O2R8
3890A02K29l69N2M3k26P4L26m9n9n6k05L15k27J62j36J7K81l00j80Q5J27k32K22
3913dN4j11L67m5l14Q2R0J59m28K66l51J61J70j87PNK23M0q8k91J84J3l7K25j50
3938D0p3o1J62J22k02k4j06k5P8J04q8J02J32l1o4L82n80L1J24R0k37j40K53j41
3962a52K77k67R4K9q0k01L68k68K07p7m2J58q4n4m2L69k63O8J92k71J53r0J41
$$ y = [-32, 188, -127, -13, -64, -153, -44, 239, 47, -77, -122, -150, 88, -81, 0, 40, -112, 69, 417, 77, -195, 266, 45, -95, 12, 199, 303, -84, 228, -203, 34, 89, -160, 175, -30, -163, -136, -112, -18, -173, -36, -322, -368, 53, 114, -154, 2, -5, 144, -110, -65, -305, 8, 38, -68, 118, -13, -19, -206, -98, -54, 163, -113, 303, 191, 35, -54, 9, -15, -163, 99, -14, -127, -233, -44, -56, 131, -100, -151, 136, -41, 162, 87, -235, -76, -78, -218, 76, -20, -58, 4, 102, 331, -38, 14, 57, -169, -95, 231, 182, 123, 67, -138, 177, -50, 112, -24, -7, 274, -26, -206, -121, 6, -226, -4, 50, -61, 306, 261, -53, 29, 119, 278, -150, 116, -235, -74, 96, -91, -84, -79, 144, 184, 96, -195, -11, 2, -35, 190, 40, -33, -94, 68, 190, -12, -36, -142, -167, -89, 15, -73, 29, 161, 130, 66, 448, -132, -101, 23, 113, -124, -264, -11, -152, 125, -142, -48, -19, -99, -300, 68, -200, 7, -70, -112, 46, -38, -92, -134, 235, -28, 40, 232, -39, 114, 24, 165]
3985A65o1p0j42J51l49J57Q8K77rj21j48m2R7k34J23j6J79k81J19M6L9j09J00
4008d1J18olJ1j09q3J11l8K22J19n52L85m70M01k23K52J9j1J18n36K16J48j29
4031h1L5J05j54J41k00N9k01M28j6J7r0J32k93R6j1K7j74O0PR3J86k17r9K44p0
4056B4K1J42m86O76j66k59k03M17j77L1j07j03o6L26Q9j46l47O3J19K80k00O5
4078gp1m7j38L24J07n0j96K06j76J69k98R7K5J17l11L20p8K81l25K12k61J59l10
4101b51L10P1m2k13J23qk55L37O6j97K39M3k4l35J62kj26J8K12J35m50M19m55
4124b23J24J43J18k84P7O9j2k23K37k73K80l54L78N6r0r9L18k49l0J02J21j10
4146G6j58L48j93J55r2j50Q5n8M4j1r3q1K66qk12R0j12P1J20j27o9jK92M0j90
$$ y = [165, 104, 34, -108, 43, -306, -149, -61, 216, 207, 86, -62, -104, -7, -241, -118, -134, 45, -236, -117, -71, -32, -141, -41, 77, 71, 68, 79, -30, -113, -2, -40, 182, 301, -251, 134, -336, 65, -158, 94, 113, 102, 220, -316, -100, 48, -81, -46, 59, -95, 46, -154, -95, -296, 132, 116, 133, 43, 175, -118, -22, -33, -6, -180, -120, -113, -20, 166, -51, -150, 94, 24, 45, 187, -299, 377, 211, -48, -251, 166, -11, 20, -87, -190, -256, 70, 159, 13, -334, -271, -152, 128, -72, -7, -78, -125, -263, 61, 168, 118, -78, 128, -48, 121, -177, -80, -55, 62, -249, 71, -7, 274, -51, 161, -100, 59, -251, 59, 130, 88, -125, -2, -10, -265, 72, 138, -59, 180, 223, 199, -136, 26, 24, -102, -84, 128, 263, -187, 232, -223, -99, 44, 162, -122, -45, 24, 12, -211, 26, -247, 33, -321, 57, 113, 23, -76, 242, -7, -37, 65, 186, 76, -82, 266, 73, 228, 136, -14, 71, 13, 57, 46, -47, -128, 138, 130, -82, 8, -104, -33, 87, -40, -109, -110, 182, 222, 32]
4171C2j21lM4P3nK09m89J56K5K4M2j30K98j49j88L28L9m7k73K61n8j78k33L19
4195b4N7j53M2O8m3p2oL9L70k49J44l2O9m2l6j6k21K03k73L45q5j04K0K21j41
4220H1j09K15J91o8o30J33L2L86k34k0q1R8J36N8k83L07L7k91M0j77J78m0K60
4243B19k04K6K25J02l20l8K14j93j74rJ10M8J5l18P69n64J7J71k61N24l86R8j50
4266g9J35Nj96M4J32j18K49n8J33j81M2k45L16k63j43M01j32J10k84J15j17J47
4288A3j90K25K20l36p0J30k13N95l09k80K35L1j91P5J59j38j85K81K5M8k56L72
4310B41m56J71J63j6p1J41k73OJ38J26j65J8K43j49k12J26l5j81K08j29K36k84
4332a54J23J85l31j48L25R1p0p1J78r2M0j15P0N6k40j73M40j26p3o1L23m16L97
$$ y = [32, -89, -92, -48, 25, 20, 229, -260, -104, -79, -55, -13, -143, 155, 6, -182, 146, 185, 138, -135, 126, 68, -110, -343, -24, 33, -120, -78, -10, -53, -125, -131, -92, 278, 29, 173, 141, 210, 168, 132, 116, -105, 98, -175, 170, 85, -19, 1, 222, 81, -28, 187, 378, 310, -320, -187, -155, 231, -3, -23, -104, -6, 130, 188, -95, 212, 249, -42, -2, -179, -1, -41, 219, 15, 41, 266, 368, 48, 10, 224, 31, -143, -152, -42, 6, 21, -297, 472, -92, -75, 96, -165, 359, -27, 71, -79, 56, 61, -135, -91, 41, -77, 172, 114, 247, 66, 108, -137, 179, -84, -227, 174, 42, 152, -132, -17, -134, 13, -177, 48, 268, -68, -138, -8, -221, 374, 65, -215, 20, 51, -140, -65, 94, -44, -229, 52, 77, 125, -131, 241, -215, -44, 119, 103, 32, 173, -100, -94, 44, 170, 5, 23, 266, 117, -95, 31, -4, -185, 23, -106, 130, -154, -31, 154, -177, -325, 0, 91, 21, -50, 128, 36, 76, -39, 31, 87, -153, -326, 114, -12, -85, -146, 177, -239, 158]
4355A58l31L18k39P3k58P9L59jk18R8J70l07J44MK18k38K54l16J46p1q1N5j91
4378a75L8K21L46n30J74j51L1J8J22k67L37p5l30J43O1l6k0K92l10P5m0J61j54
4401f9Ok5K27M5k21P6k31M80m05R7m4J78j11K19l13r6K11l5q8q4J66j04K30k5
4425H4j56j18J58K11j98j93J9K08P1q5L0p9J35k03J88J58k43J34q0j67L45l00
4447h1L1r0L03k00j68Q0l9r5L41j87nJ51M8j05J55k95mK7J55J14m06K94n7o3N2
4472d4n1l9K37j3q7j11J60j03j57N16j01k42j94J22j58K18K60j84j40J10n6J35
4494G8J8k53Q6J11NQ0l21J0O8m1J15J03K6l14J81K1O7J33o79M92O7j69k19L10
4518b5j35l3j22K01J69j84J81J17j2j91J19K6L0l36k3K54m1o3K63j80j25L85j28
$$ y = [158, -173, 145, -94, -21, -279, -200, 159, 158, -60, 38, 208, -99, 45, 49, 267, 29, 283, -33, 113, 42, -39, 16, -175, -137, 84, 430, -100, 74, -77, -46, -28, 94, -173, 164, 89, -241, -98, -37, -73, -93, 199, -111, -36, -76, 85, -69, -63, -88, 139, 184, -37, 39, -192, 288, -117, -20, -64, 114, 3, 222, -91, -187, 24, -11, -99, -183, -17, -121, 109, 84, -72, -190, -32, 179, -19, -212, -193, 15, 86, 1, 31, -48, 87, -116, 72, 230, -13, 121, 41, -126, 219, -81, -50, -140, 163, -37, -205, -125, -164, -259, 82, -105, -110, 41, 89, -16, 139, -156, -160, -133, 22, 136, -270, 24, -33, -96, -44, -95, -134, 103, 90, 3, -108, 52, -51, -208, 308, 207, -35, -229, -107, -265, -47, 213, 29, -111, -1, -57, 78, 96, -157, -71, 40, 45, 125, -196, -186, -118, -159, -44, 59, 85, -229, -48, -27, 40, 173, -506, -14, 53, -116, -335, -25, -160, -193, -315, -114, 55, -129, 52, 169, 157, -34, 85, 111, 141, -195, -218, 36, -5, -68, 195, 15, -110, 275, 147]
4541A47l11L54j59Q0k39j54M84j41J24j81k4m9Q6r6j58L42l19K79QJ0j00k73K53
4564c7o0K11j07M3R7No5j72L43k64L4J8k6J31l6j25J70k80J84n1m2j7m1n2Q9M3
4590gR2j29KJ71j54J47k58MJ37j84L62L6j77j6r6P3J75k46J54oL9j6j85J43R8
4615A59O2l82M49j56m1R9j56J85l27J67j65L15j57o3O2j58PJ48j76j54O59l82
4637eJ93k36O6Q1J03k11K78l11O8K14k64k26L7J99L2r0l6k2P3M80l34q2LJ30j52
4662a2J91J17o2k92K69q8j05J12j97P8j44J2J34J9O5k50P1J24k4r5J79J7j80J38
4686G7j74n6J96J00j15j05R8o9j12K80k90K50L1J66n6o1m62N06j68j09J42l1j97
4709a59K22o6O8j82J09J60l26Q0Q4R1R3J43n45M18K4l96J58J55j06J68o8L4m9
$$ y = [147, -164, 190, 31, 111, -128, -282, 202, 61, 185, 4, -20, -69, 17, -79, -237, 105, -214, 65, 73, 83, -17, -290, -37, -97, 114, 7, 50, 147, 152, 87, -85, 258, -6, 28, 46, 20, 151, 115, -10, 160, -120, 64, 13, -29, -46, -87, -139, -50, -7, 85, -44, -42, 129, -25, 122, -136, -132, 5, -179, 183, 219, 42, 26, -70, 3, 178, -68, 86, 80, 119, 103, -82, 61, 159, 221, -161, 288, 132, 91, 190, 34, 219, -108, 59, -106, 209, 52, -11, 51, -107, -100, 48, -128, -282, 377, -5, 188, -48, 18, 99, 202, -9, 269, -42, 26, 240, -24, -250, -213, -14, 18, -72, -108, -130, -57, 423, 89, 7, 10, 140, -12, 179, 296, 234, -58, 211, 123, 18, 130, -67, 11, -133, -121, 13, 32, 97, -153, -82, 42, 18, -77, 102, 119, -61, 77, -97, -153, 43, 143, 28, -77, 21, -48, -160, 120, -170, 80, 111, 277, 221, 160, -302, 204, 36, -73, 69, 38, -159, 63, -3, 65, -117, -8, 152, -174, -94, -10, 81, 174, 317, -228, 190, 214, -182, -24, 131, 25, 193, 125, 159, 110]
4732A10l56L28r6J83J96m22j05K9J41k26K22r6J09j01J8M9k51N46p2j74J59l58
4754a67L07J4L8qk4l15L47o3j24K0J28j64J37k98L32k96L1K60k84JJ27R8k6J9
4778I0k23J1J29J06l65J88L5P9j21l9J2j75N20l67L31k06J90l47K84l63K67jN8
4801I3j21j6K23J02j60OJ26j78p1l37O64m64P3J0K76k26J4J77j33K06j19k3j18
4824Dj6n0J17Rk15J69J82l99K18j46Q0J22o2k65K05J93j74k38L90l08J88O0l70
4847c06N99k34o9p1j56N00k4j18k66J01K34l15J23lk60J19K73j59Pk6K0N0j06
4870h7J24k51o0K96O1Q4k48l07O14O3k96n6J42j26K43p2P6m02J56J54l07J89n3
4893f3J90j85N1p4N8M3R0n09L75j72J50j51J16O7k9M7j32j1K95l61K56j13J6r2
$$ y = [110, -246, 82, -14, 169, 365, -57, -162, -133, 8, -218, 4, -92, 17, -84, -66, -17, -268, 278, 206, 32, 191, -167, 140, 154, 192, 184, 160, -155, 192, 129, 5, 25, 153, -11, 126, -172, 160, -136, -105, 155, -129, -128, -1, 97, 71, 90, -133, -122, 7, 113, -252, -64, -29, 50, -71, -110, -98, -273, 247, -120, 211, 5, 195, -152, 132, -231, 36, 35, 93, -28, -44, 179, 281, 121, 127, 253, 75, 4, -333, 331, -133, -60, -50, 226, 0, 14, 191, 58, 264, 145, 122, 4, -12, -62, 55, 64, -151, 18, 200, -199, 19, -127, -47, 75, 13, -252, -47, 146, -28, -266, 124, -184, 4, 64, -306, 293, 59, -10, -81, -237, 263, 239, 121, -145, -44, 190, -125, -2, -5, -265, -146, 127, -32, -25, -51, -31, 19, -87, 37, -214, -274, 22, 83, 167, -81, -388, 226, 289, -7, -63, 79, -47, 196, 124, 200, -202, -46, 108, -199, -10, -63, 127, -58, -7, -81, -23, 20, 110, -399, -24, -196, -46, -197, -81, -14, -43, 4, -128, -139, 156, -205, 51, -62, -46, -138]
4917a38l5J86L4l4j93j24L62j1k19J77qM4kK02m02L54j72k0K44m30J76j42J20
4940c1N9MP7k56J02Pl8j52K93n9r5l7m2J46Q6J19l24M52l41oK27j07l87J51K79
4965A27k39L29l09k73M59l4K9J1j71j71J5J67k02L07o9P5j87J66R6q1Q4m7j76
4988i4K80k78P2j64L87q2j04L19m46j9j5J7J61P8J8q0k10M67j26j23J60n9n01
5011c42L95R0j14L4P6j17J62P7j35q0k03J72n8M8k38M2R1J68rj42M4J6l7L53m94
5036b01L9k1K64k14k7K53q1J43m0J77j89m09L21o4N6N8j05l07L42KK23p9j48j1
5060a8J54j90pJ53n7J90K5l13j24p0L69j14J46k9q1j04j4N7L3J64k73J95k33J35
5084fL1M0M7R2k24J6L98m53M8K7k11j01J26R2k4n1r7K19Kk5O6K1K7k12kL70k15
$$ y = [-138, -173, 13, 47, 13, -180, -304, 58, 47, -172, 5, -3, 41, 39, 241, -161, 193, 21, 1, 245, -185, -9, -151, -31, 28, 32, 109, -147, -45, -38, -76, -228, 65, 6, -89, -126, -168, -22, 64, 183, -141, 311, -30, -36, 191, 84, -303, -152, 127, -112, 217, -92, -365, 94, 60, 89, 100, -71, -242, -227, -60, -262, 45, -24, 51, -136, 30, 126, 45, 129, 82, -94, 186, -92, -20, -184, 203, 121, 17, 336, -110, -129, -144, -127, 34, 112, 130, 50, -160, 307, 181, 58, 218, 159, -342, 53, 143, 29, 63, 139, 22, 184, 261, 126, 46, -157, 15, -43, 5, -233, -191, -100, 68, 59, -83, -39, -23, -60, 293, -201, -162, -183, 81, -133, -160, 93, 12, 155, 115, 292, 103, -306, 15, -49, 7, 65, -40, -347, -5, -3, 220, 141, -7, -18, 136, -54, -61, 92, 35, 225, 250, -63, -187, -257, 112, -2, 144, 115, 34, -70, -84, -27, 6, 170, -103, 92, -141, -6, 25, 65, 112, 204, -20, -4, 394, -59, -11, 16, -195, -296, -170, -78, -102, -153, -250, -31, -29, -54, 12, 33, 60, -152, -154, 216, 1]
5111AJ45k42N6p4L60k06k29L2J28rm7K91k31m9j02j19O3K55J43k27J03j6q0K29
5135A75r2j57j35R4J37k2J55k16L6k20K01P8q2j91L84j08q9M1K44l29k5L77k83
5158b7M5p3m3J57L0j53J67k34P5L00j67J2j07J29L1j23j69l5j73M61K50k21j5
5181A17k25K72j20l07J84J14L5j27k9J95k05r5J57J03M8J56n4l09r2K39k55K85
5203H7k3j20K65m53K12K18J88m80n8M06k71J6nk26K35j74K84k05O4J12J86q1k59
5226h2K9RJ24j38j28J44J16O1J05l64j4L56Mk79m0k25J77J29J30J0k03J6L6r4
5250a21K66l56J97K56k66K0J20j95K48O5j83j6J6J93j31m00K65k2r3K15j86q6
5272a94M97k05MJ24j91k72M70o1j42K99m18L83j39k43J86o0Q6k60K30m3M0j37
$$ y = [1, 146, -96, -40, -114, 246, 40, -189, -157, -29, -38, -85, 206, -25, -74, -176, -295, -232, 23, 166, -61, 42, 26, -54, 175, 83, -74, -209, -115, 22, 0, 155, -61, -25, -245, -44, 34, -48, -239, 145, 37, -52, -11, 233, -96, -121, 256, -27, 18, -55, -98, 59, 89, -64, 103, -131, -56, 244, 77, 89, -18, 111, 142, 19, -150, -185, -358, 103, 353, 132, 117, -108, 164, 44, -263, -79, 35, 70, -57, -86, 109, -96, -191, -34, 69, 117, 273, 219, -90, -182, 57, -198, 87, 64, -56, 209, -244, -32, 186, 374, -106, -164, 242, -29, -13, -18, -244, -9, -183, 101, -104, -40, 72, 258, 177, -82, -53, -44, 80, -58, -186, -42, 74, 135, 240, -124, -138, 218, 222, -57, -97, -322, -145, -16, 114, 124, -79, -63, -27, -121, 145, -211, -14, 242, -24, -4, 116, -79, 169, 234, 51, 35, 51, 244, 113, -287, -22, -44, -137, 78, -108, -194, 303, 98, 102, 226, 35, -237, 233, 172, 30, 329, -89, 294, 155, -88, 98, 38, 124, -136, 94, 51, 91, -46]
5294d6M8k00R3J94k6o7p6J12j11J68R7m66M22l8k02k12K33K37L2r4j43J9R5L0
5318I9k45K23j4ok52L32j33J09J55k82J29k9j36r3O6L86l66K12j94m9l7K12Q3
5341A70O0k29O7l85L01Q2O4k3K3K6k91J7L7L73m51L19j72L7p2P4j61L24l59K73
5365A04j43O6K25j91o6j22L4mr5R0M4K0o9N1K55J18k01m2N2j28q8q6J37J43k20
5390a16L53q9j67K83k5j89m8J23o8P9r1MK1k27K50l7J03k08J45n1J21Nl08K35
5414I8K6R9l89J28J69j60J86m12L24N3j08L2j1k2j00M10k85K9j9O3j70Q1R3j21
5438fK58j64o6J95m7j11l31K48K48m7m48L41p9l9o7N27l37k43L59j27J56j63l52
5461b95M73j34j4k42N5L25j12M4k53Q5j05K10m4R5j8Q4Qm8r8P4N2k49R4M5p3J88
$$ y = [-46, 2, -198, -105, 89, 63, -4, -80, 32, -79, 89, 186, -280, 142, 104, -98, -310, -77, 160, 192, 98, -45, -26, 69, 99, -146, 77, 63, 57, -195, 137, 4, 113, 268, -14, 115, 86, -50, -143, -77, 309, -57, 155, -39, -88, -125, 87, 170, 230, 1, 68, -317, -16, 66, 130, 107, 130, 156, -135, -118, -81, 292, -159, 160, -12, 25, -47, 27, -134, 190, -169, 104, -39, 27, 252, 61, -5, -127, -93, -97, -192, -102, -58, -38, -107, -56, 199, 317, 116, 74, 126, -2, -90, -176, -39, 104, -116, 237, 148, -19, 264, 239, 50, 2, 125, 57, 136, 45, 49, 70, -157, 93, 56, 159, -49, 96, 45, 166, 171, -137, 98, 124, 223, -166, -38, 131, -29, 157, -255, 69, 122, 14, 46, 35, 13, -87, 323, 38, 67, 48, 111, -59, 22, 115, -6, 252, 88, 22, 217, 170, 59, -272, -24, 224, 177, -271, 70, -9, -48, -115, 412, 75, -168, 191, 64, 220, 57, -295, 178, 44, 30, -212, -157, 168, 56, 100, -153, -68, -173, 37, -7, 88, 70, 154, 162, 114, 16, 90, 142, -107, -13, 32, -41, 147]
5487A47Kj43L7O1j21k5o6J40l37L16q6L70k96O2n5p0j16Q3n5J14P4L9J80k03K4
5512G6k08L42j76L0J00j56l36M12j93l9k0J79j78N4j71L54M4P7m6k18q6P3K43
5535A57k60J87J49l06j8K85j93j93J7J22k02L33q0O0j14K18l04q6Q1J0J90m0K45
5558B58k18J01j40qL26m7j31l6k8m2k0O1Lp3J47p1j64j8J5m6L69m19J94o2j5k9
5584i3J58J73j44j88J7k0J40k00k9K8L68j31rL1n5l0J40k70o4K89l8l3k49K26
5608A7q7N2j19J99M0l09M7J00k8J65k02j37K6L34r6J46k90L62n55L54l6mK29o1
5632A47k10l0K0p0R2n3R7J9K77l34q5K96k11j40lK61k6P4k20L7j22J91j09J46
5656D4q1l2q2M0K84k82K15k59R9o5P0K03J08j87j61lL6o5R5L5n9j31K31j51N1
$$ y = [147, 149, 6, 43, 104, -17, -42, -108, 32, -305, 11, -75, 295, -1, 61, 6, -64, -180, -97, -152, -38, 36, 75, 255, 52, 76, -132, 210, 34, 64, 164, 8, -328, 84, -109, -148, -168, 11, -167, -113, -284, 70, 114, 191, 145, -73, -159, -86, 157, -103, 84, 233, -73, -91, 194, 1, -192, -175, -53, -255, 78, -2, 58, -56, 162, -142, -228, -147, -137, 53, 13, 258, 40, 141, 1, -7, 319, 272, 141, 105, 77, 35, 15, 76, 79, 6, 153, 82, -82, -100, -85, -131, 238, -181, 13, -49, -64, -93, 65, 238, 94, -94, -77, -97, 43, -157, -186, -158, 210, 79, 70, 101, 46, 16, 156, -114, -178, 111, 73, 40, -209, 17, -70, -18, -137, 62, 102, -207, -160, -60, -88, 77, -125, -262, -236, 98, 2, 148, -142, 220, -335, 19, -17, -21, 208, 147, -63, -93, -73, -143, -51, -104, -7, 12, 289, -45, -130, 166, -45, -185, -188, 73, 47, 121, -99, -62, -184, 7, -102, 44, -37, -69, -151, -111, 173, -109, 106, -153, -54, -119, -49, 154, 262, 75, -86, -89, -53, -118, -23, 12, -47, -178, 53, -98, -47]
5681d7J42J56l58J44r9M3k5j27J14oJ75j32o0Po8L9K05l4j20J04J13k36j93J09
5705a54J35N6l0l64L81M6j69j63M45j93k6J47k83J81J53k63L00j04j39L0m4J55
5727I7J2j1p7j55K87j58k9rL08m00K0K47M2k43j94L54k82K33j52M0J09p9J74o3
5751G1j46K01o9j73JO3O6n4p9K1P2O5k53L12p9N9j21J07J42k15J87j18j27LK59
5776A95l13K38j6j91k8N3K7O8K88k10r8k98K15K97l63j20J56O9J62k83K55k76
5798a73mO4K26n7j86j37K25J67k53K14K06l97K00r5K45l99J04K48k85j59R9M1
5820a06J6K35l46M57m52K40K75o08K93j70L1K66Q6k24k8o7K81l10K51jn10J73
5842b18O4J89l1N4R4l29j32K47L23M4k78Q6k32P5j1M0R0j78J47j67k6L7K20k01
$$ y = [-47, 95, 251, -107, 37, -62, -19, -44, -171, -57, -63, 112, -20, -80, -73, -141, -102, 103, 69, -51, 53, 166, -70, -263, -154, -19, 37, 7, -357, 24, 70, -99, -262, 183, -10, -36, 111, -172, 9, 162, -101, 199, 95, -44, -14, -58, 97, 109, 98, 21, -134, 153, -5, -34, -43, 265, -135, -115, 132, 174, -69, -263, 91, -191, 42, -110, -70, 39, -40, 134, 71, -75, 126, 57, -116, -115, -52, 14, -40, -119, -98, -26, 39, -214, 98, 19, 78, -43, 64, 206, -9, 178, 60, -67, -64, 195, -118, 120, 104, -87, -115, -62, -35, 33, 321, 111, 13, -285, -70, 227, -136, -256, -100, -31, 131, -152, 103, -173, -177, -113, 113, 56, -130, -267, -42, 125, -128, 86, 292, -105, 95, 0, 245, -154, -50, 198, -87, -246, -147, -106, -90, 145, -201, 256, -196, 44, 319, -289, 4, -166, -135, 131, 217, -7, -35, -102, 179, -131, 120, 119, -391, -218, -154, 35, 4, 58, 152, -177, -309, -62, 261, 305, 27, 113, -119, -44, -55, -15, 75, -103, 44, -123, -149, -112, 108, -93]
5866i3o7K08k5J44l99J78P0l01L02o6J0K01O0o5k28L05j15q5j22r1O9j39J96J78
5890A25j59n6J96j43R5Mj75K54l28o3K70K9j54j24J83R5k8R6q4p9P9k0N8k01J60
5915C0jj8m9P4o9J51N5k33jj56J61j60O18m58Q4Qj82Q7k00M17j60J19l46L6J85
5940hj04K18q8j15j15L83k83O7j49q3K69J61k62M90m37J21j68Q4j95K56ok24K51
5963F3L1m1j53L6J85j26l7J08l76L10K61l97k66N00jJ8k00k0J59n15O72oj83M7
5987F9O3jj31j32K99k84J69p0RKL9k15K52R1o5j25N4m9O2p5qJ09Kj9J97j49k1
6014G3q8k49R2K86j13L5K52m02K65Oj43P6j59q9L21k28j06J1K85j34l31L49j94
6037a85K56q4Q4M3k06q4j4K06J03j36P7r4J13J27j44L3R7l07J98O7l7j47K47J1
$$ y = [-93, -160, 48, 23, 167, -232, -54, 16, -285, 17, -49, -39, 162, 222, 157, -71, 234, 119, 34, -88, -179, -110, -249, -53, 125, -34, -90, 106, -37, 58, 62, -113, 141, -187, -250, 20, 49, -105, -229, -46, 49, 21, 117, 33, -46, 33, 13, 71, -130, 30, 29, 11, -38, 36, -33, 118, 173, -60, -61, -217, -56, -216, 402, -56, 28, 36, -146, -59, -259, 158, -2, 117, -229, -193, -8, -112, 106, 18, -97, -212, 171, -112, -45, -194, -277, -8, 153, -109, 381, -56, 65, -103, -19, -214, 42, 36, -188, 63, 94, 53, -100, -64, 121, -5, -42, 66, -310, 0, 261, -136, -402, 98, 97, 115, -85, -105, 54, -461, 211, 205, 22, 69, 132, 131, 0, -132, 167, -117, 52, -18, -9, -7, 32, -183, 69, 160, 95, -30, 24, -25, 37, -38, -46, 63, 65, 46, 243, 94, 73, -15, -264, -172, 114, 1, 36, 288, -114, 151, 157, 14, 90, -69, -158, 163, -65, -171, -160, 125, -9, -340, 9, -185, 71, -13, 71, 114, -92, -176, -190, 16, 119, -17, 60, -34, 79, 206, 62, 95, 192, -115, 83, 150, 113, -34, 213, 224]
6061B24j72J89k88p8n2K83j29j19J68j9k8R3O1j29p6K79j66o8o7K48j77Lp7J1
6085h6K29j37l0L32j60N0k30ONk07K22J53k4j05k48J80M8j43K51p7M3j59k52J96
6109a43J15K28p6j36K65l33K85k70N9l4K18j71J44p3j28q9K46j96P3J2j92q3L04
6132B5J7r6p6L7M3j44J2J86K25l09J37l1n0j14K04r9J0J09M9k65L01m84N46k19
6156A4J68r1q3P8M7l13K30J92j75l18K55k04J38J52k41J02nJ72j87J40Jj40J78
6179A10L21o17R9J67m6J12j61j9L1p9K05o1j79J19K08l46K41l60K02r5J69q6R7
6202C2k77K61j48J61q3P4j34K41m0k34J15M7J15j57J47l4o8j70R2P2K61n0j91
6225C2J23j26Q1j05r7o3J01n6M5ro5K84j85k02O1J77j40L5l1L17k31l0NL8K9j5
$$ y = [224, 52, 241, -47, -125, -177, 106, -23, -142, 26, 7, -21, 72, 133, 4, -72, 207, 41, -27, -94, 154, -23, -20, -97, -86, 143, 6, -24, 308, 148, 198, -32, -26, -21, -228, -6, 147, 123, 18, -230, -50, -2, -145, 106, 29, 72, -87, -339, -143, -28, 200, 124, -12, 253, -80, 205, -65, -6, -40, 178, 7, 151, 78, -50, -139, 107, -89, -16, -4, -196, -279, 25, 42, -54, -130, -93, -50, -194, -182, 4, 229, -80, 57, 26, -24, -138, 66, -33, -23, 86, 135, -130, 171, -313, 233, 14, 182, 91, 8, 86, 133, -180, 50, 242, 67, -251, 4, -200, -62, 90, -151, -49, -54, 118, -69, 71, 72, -68, 110, 431, -186, -87, 80, 34, 146, -15, -34, -3, -82, 123, 62, -117, 2, 210, -136, 105, -255, -53, -148, 21, -65, 32, -245, 16, -132, 29, -54, 20, -114, 127, 87, -147, -32, 15, 130, -27, 120, 86, 18, -152, -60, 12, 273, 223, 32, 155, 29, 110, 5, -92, -155, -54, -110, -65, -74, -139, 145, -40, -242, -181, -4, -144, -109, -140, 177, -54, -84, -79, -41, -12, -27]
6251b7k78M00L5k62K83r2k30M04j59l21M51l24J73j57m0M32k91kj8J8P7J69n91
6274c50R4J37K83l35L83k71n8J42j77K45j08O6k43N4K33k16J11n6J29l04K96Q6
6296A41k32J89J56l36jK77l10J13R1L6j11j15R4r0ok3J67k43J15J29J24k07o1
6319a03j41K78R0k54n5J59J17p2o1K7j23Q2o4J18k04K05k6j54J55qQ2N3K5l9o1
6344B6J09k40L1K6j31K11j94Q0N5K02r2r0L5j30K16Pk52J69j29L3J72k59K16o0
6368A1j78K4J69J87k45k2K1J46r1N6oo2K0q3R3N0k60R1j24K75o0J71l81J86m3
6393e5k6K02j3k19J78r1N7N9k24L34l85K83k02J55o7j50O6P4J14m1k57K81Ln9
6417A7m1J50k17J74J0J25j36l23K13k08J56K86j66j41J42M3k5Q3Jk81L7M2J95
$$ y = [-27, -305, 95, 130, -132, 151, 59, -171, 233, 74, -247, 204, -120, 53, -104, -144, 288, -3, -5, -23, -5, 72, 241, -350, -256, -119, 164, -171, 212, -59, -117, 25, -152, 93, -15, 51, -192, -138, 95, -121, -10, -66, 63, -241, 55, 141, -91, 98, 254, -82, -83, 194, -116, -3, 88, 124, 13, -102, -8, -98, -104, -127, 40, -203, -88, 41, 165, -42, -103, -244, 34, 124, -130, -185, -26, 91, 19, -42, -15, -138, -56, -120, -2, -206, -1, -27, -181, -26, -34, 48, 101, 126, 87, 26, 135, -105, -74, -48, -179, 32, -162, -82, -27, 175, 83, -7, 28, -102, 114, 121, -131, 38, -91, -58, 114, -145, 71, 11, -167, -143, 26, 213, -32, -54, -33, 113, 22, 78, 72, 10, 30, -53, 40, 90, -170, -79, -203, 72, 12, 183, -198, -12, -55, -81, 121, 108, -111, 67, -24, 33, 92, -132, 202, -183, 100, -102, 53, -14, -164, -98, -24, 90, 49, -208, 73, 76, 17, -24, 126, -91, 83, 93, 218, 82, -241, -28, -236, -80, 206, 40, -101, 41, 84, 59, 142, 143, -138, -101, -59, 136]
6440A36j25j29K93k75R4r4K53J13j48q1r6K02k8oM1j18M5l30J01k19K56K41k1
6463A05k04j0L7j66L48k83R3N0P8R0j54J4k06J76J68RJ9n0j35P7K40j90k40J48
6487A4O0j88j7r0K23J43J84j43m69K86K35m38j34K14K40m0M4j60J15n7k00L1O9
6510g8j80M44j22j14L1L8l82L48p8n9L4K84j33J3j10K16j91n8K98j24j88J96j12
6533b7K6j07J9K46j3k85J52k14K27p1P4l3O0r8k58J93J83Mp5o5J0j76K52Q6k42
6558a32m6K62l6k06K20R4k27K37k53N3m78O78k92L48j67l08K79l4P5k45K96N8
6580A76j17k4j06P4k36J11L1j87N10l15PJ52j10L73l35J8J6K56l48J21l91L19
6602eK75l03l5J09r3K03k98K89p7M1q7o6j41K38J30k75J70l32L51l39J84L56k19
$$ y = [136, 11, -118, 175, -100, -6, -100, 153, 266, 118, 37, -59, 143, 115, 109, 150, 32, 77, -253, -152, -371, -115, 126, 105, -99, -109, -72, -238, 110, -173, -80, -30, 48, 138, -16, -2, -208, -32, 136, 145, 164, 114, -21, 56, 296, 106, -134, 14, 74, -114, -131, -221, 2, 145, 329, 186, -283, 3, 238, -200, -334, -120, 120, 80, 124, -36, 79, 22, -178, -147, -78, -258, 186, 64, -50, -19, 19, -363, -15, -93, -152, -118, 166, 33, 46, -64, 152, -39, -97, 201, 77, -111, 85, -27, -1, -108, -89, 157, 144, -141, 11, -203, 24, -47, 27, -6, 54, -44, -302, -109, 74, 78, 3, -62, -52, -228, 24, 110, -132, -178, 84, 48, -158, 62, 156, -71, 166, -87, -34, -512, 166, -126, 222, 55, -253, 26, -8, 67, -178, 118, 176, 59, 35, -71, 3, -233, -122, -91, -278, 232, -83, -76, 76, -34, 339, 4, 22, 38, 294, -54, 67, -324, -5, 270, -33, -68, 41, -52, 151, -147, 142, 65, 106, 19, -47, -188, 50, 180, -95, 75, -257, 94, -245, -61, 295, 76]
6625G6K3k16j27N9K91J5j27k14K64p2k09J02L93j08j55L04k17r9J1P3r1k96M04
6648H4q4j44Q2Q4k15J41k9P8m0J77j34J41k5j60K6q5K05j15L2k6lj67J98J0K99
6673C30k27l50K05K8K75K6j69k12J26j12J93Q4p6j71R6J14l35J07J21P5k45NJ79
6696F7l2n5j63J17K58j65l4N7J04j36J45o7l11J51J12P1k41J80K1o7Ok30L0L08
6720A26k08J06J22j17oJ00k32O5P3j47J16j94K39k25j1L3J28j66M64j86k62L11
6742A29k44K09l84L75J8k17J34J93m30M8O1pK5p4L69l99P6L00l34j9N24k34j83
6765f4O8R0j75O9N3k34K44N1K1j08K06j97j36K50k35mn1K34r6lK62k51J54k05
6789e7K99j80n1J44l1n74L68J21J93k70P4m3O6j54J0J77k73o5J86K22m34k1K39
$$ y = [76, 99, -117, -244, -185, 106, 121, -6, -220, 44, -28, -237, -135, 258, 150, -5, 299, 82, -17, -6, 67, -24, -320, 84, 0, -144, -62, 22, -193, -52, -81, -3, -43, 134, 0, 141, 116, -44, -18, -103, 102, -13, 19, -7, -10, -177, 21, 31, 330, 103, -247, -42, -14, 261, 287, 118, -94, 32, -80, 113, 197, 121, -50, 46, 160, -175, -68, 53, 128, -117, -112, 67, 35, -20, -183, -66, 192, 27, -7, 50, 154, 18, 163, 96, -215, -64, 48, 119, -122, 58, 79, 12, 18, -212, -182, 126, -82, 24, 146, 29, 23, 123, -109, -44, 29, -118, -2, -196, 43, -182, -193, -160, -32, -198, 266, 80, -182, 129, -115, 94, -290, 85, 103, -114, 20, 213, -217, -169, -108, -115, -90, -164, 205, -194, -118, 182, -152, -171, 353, 119, -64, 4, 94, -81, -12, 41, -193, 51, 102, 123, 15, 221, 24, -112, 138, -97, -101, -152, 82, -14, -17, 245, -6, 148, -57, 242, 62, 11, 155, 124, -450, -82, 39, 232, -38, 36, -7, 59, -95, -85, 92, -181, -246, -60, 162, -272, -293, -54]
6812e4jL1q6O4Q8L3j06Q1l1R2j51n5O4j35m6k7L96j90M1k2M0R7n9J14O6k10k71
6839b37J85K2j4k3j35J1K44j80q8K61k15K00j16J45l2j29N6K72O6j63k77K17M
6862G4Km3j22K26j0k03J46P7r6L0j84K40j66O6m8J5l7k7k2O2j78K50p4L3J02k66
6888a53J39p3j1N8m5PJ30j83M37l20j29J60l30O51n42m9K63k63M21O1j33M7k16
6911g3K02k26J45K47k07J83m91N85j70l30J87J4j36P7J9j40N1K14J22l38j84J27
6933a22o8J45j28K00N8k83K25j4o1M9j7L1Nm1j93K52k9J29n6l0J4j20O5J55j50
6958A6O7l06%J87K9L0J07M7j79k44L37j23lj77o7K54K78n26J81L6k3J50p0R8J03
6983B02pl09L18j52M5j41K88k52J48q2O2k17Q7jnQ0J10k7l80M36j67n4l0j28J32
$$ y = [-54, -55, -24, -110, -46, 42, 75, -31, 50, 19, 111, -40, -95, -31, -166, -212, -239, 157, -33, 8, -14, 26, 123, 64, 178, 244, 34, -237, -52, -30, -44, -67, -202, -191, 53, -127, -215, 46, -169, 31, -85, 60, 28, -101, -45, 227, 293, 130, -147, 70, 74, 76, 33, -89, 137, 127, -76, 70, 147, 51, 81, -103, 137, -29, 37, -11, 4, -33, -60, -82, -20, -198, 52, -22, 11, 113, -153, -14, -87, -98, -40, -85, -78, 52, -131, 306, -14, -143, 17, -313, 338, -204, -253, 10, -253, 168, 229, 96, 143, -73, 129, -97, 48, 295, 88, 271, -220, 365, 195, -135, 52, 66, -70, 7, 26, -114, -63, 151, 273, -65, -249, -122, -190, -45, -173, 27, 85, -198, 27, 13, -48, 1, -16, 15, 20, -21, -214, 38, 9, 138, 82, 52, 66, -54, 11, 166, 16, 83, -223, -223, -36, -7, 23, 130, 177, -2, -246, 91, -32, -35, -212, -279, -25, 253, -273, -92, -56, -79, 71, 1, 99, 202, 195, -114, 204, 52, 97, -44, 244, -8, 140, 58, 120, -97, -10, -11, -16, 64, 174, 147, -233, 203, 36, -18, -48, -176, -44]
7008d4N6j27J7J04J09j69NJ12j52j87L56j79L5J1J30L4r0k39L07J40m20J6J56
7031a9l96K20J69O5K3j20m0J16kM3O4k72K64ok06N9p3K93J13k98M5j68k49L17
7055e8K30j77k92K24M7J28j04N8J30k51R0j32nk01J88j91J43J66J04M8j09k6l18
7078c08m8L07k1J11q8K55k12Lq5L03n1k19Q1p7K08k15Q2j54L5K0J73j16J34k40
7102a22K00k04K25j66j66J90qL09l78j6P0j18J1J19K15k66Q1p6J96q5lj24L19
7125B03k84J64J05j08j4M6j36k8j50Q7K7R4J02j76J9j59K74j07j78K41j7Q7R2
7148A84l98J08j04k6L54j32j84K92l2j25K10k15M25l93l5r0K09J1k08o4K80r0
7170b3Lr1J6j32P3K64p7l2KP3j37k1J79j50N7L1L3pNP0o7k11K42p9N8Q2r7O3j66
$$ y = [-44, 12, -115, -98, 6, 115, -54, -49, 63, -89, -276, 80, -99, -64, -53, 77, 111, 21, -218, 89, 229, -191, -175, -19, -415, -195, -26, 39, 62, -58, -98, 18, 16, 59, 123, -149, 115, 109, -97, -38, -111, 182, 295, -3, 42, -126, -375, -58, 172, -5, -297, -73, -26, 102, -2, 56, 186, -65, 25, -107, -112, -313, -125, -316, -173, -7, 97, 145, 36, 10, -308, -356, -49, -70, 41, -47, 208, -4, -1, -86, 217, 166, -53, 28, -49, 159, -56, 26, -128, -93, -73, 100, -16, 118, -122, 78, -126, 99, -67, -233, -43, -51, 258, -120, -136, -66, -184, -173, -54, 161, -105, -24, -100, 96, 11, 8, -116, 203, -81, 83, 188, 80, 66, 112, -24, -52, -202, -115, -88, 6, 108, -68, -49, -208, 66, -41, -219, 22, 5, 92, 184, -214, -106, -210, -236, 118, -14, -198, 94, 62, -63, 147, -68, 357, -36, -71, -161, 48, 59, -149, -213, 67, -23, -20, -111, -95, -227, -154, 110, 33, 1, 3, 76, -61, -82, 97, -53, 4, 35, 68, 61, 66, 136, 69, -142, 100, 21, 79, 161, 64, 127, -39]
7199c9k07N09j32j87l5j30Q1m1L69l90J38j34J30NJ31l8N0J14j43j55J7k5J5p3
7223a70P6M22l21q5j66O5L34K4o5k07J36j10o8K97j9p7n2q6R1J53k06l0J57N3
7247A46n3O4J23k23L3n1q2J22J65r9p1k03Q9K18k29L6J55J16k60J3n7M3K11j98
7271HR5M6N0l71K63R2m18J84O0L8LR9J05l90L80j94P1J30l46P3L0j1J97q6k77
7296a69k4N9L29j82J13Q3j41j21j33J20N3K64k53q9J81j02J31j72Q6k26K45P4
7318A26k51p0L21q8n2Q1P5k16q3O9J59j39J12l3m9J24q5J19j22O2p5j29K36J7
7342A09j38K81l12J48j55l8M07j24l65J70j17J85J04p4Q9j64j8k82K35J18l18
7363b59M07m22L74M2k81L17j34o9k9L3J27p5m9q7J62j49J76J40L7k53k82L54r8
$$ y = [-39, -246, 263, 131, -56, -91, -221, -140, -181, 188, -202, -64, -198, -68, -63, 68, 30, 80, 194, 51, -104, -87, -112, -97, -170, -94, 328, 7, -78, -244, -179, 155, 179, 114, -93, 43, -67, -135, 162, 143, 66, 14, -72, 19, 172, -34, -64, 93, 146, 93, 157, 280, 57, 90, 39, -43, 79, 244, 145, 74, -129, -40, 178, -51, -15, 140, 256, -4, 9, -48, -5, 206, 8, 103, 149, 199, -172, 91, 183, -235, -51, 9, 47, 50, 149, 254, -136, 244, 50, 121, 251, -95, -22, 8, -3, 194, 108, -169, -193, -134, 195, 13, 126, 209, 68, -53, -186, -66, -13, 251, -2, -91, 90, -12, 119, -53, 33, -193, 52, 126, -125, -195, 126, 38, -14, 67, 142, -74, -157, -88, 71, -68, 44, 11, -38, 86, 1, 120, -2, 60, -15, -144, 92, 109, -29, 252, -60, 88, -67, -105, 302, 178, -187, -17, -134, 51, 155, 81, 170, 6, -12, -294, -59, 59, -259, 148, -274, 100, 142, -139, 178, 44, -25, -54, -21, 106, 31, -18, -105, 57, -92, 84, 224, 261, 8, -274, 80, -18]
7386a8J49L1k32K9j3N2qp5J04N6k60K02j61J06j95J04L44l05K19j61L54l90J99
7409A31l08L7l4L46j30J02j73j2q7L0J17p6j43J75J95M3l64J35Q8m5j05r0n5J98
7433b5K46k56j40J48J04J41l4j29P1l05J62J09j08r1M5l5j36K95l55L74MOj40
7456d9J28j86n2P9Mk0n4J25j46K06j07N9J07L4Lp8j50J51K35j26k63K99M4p1m49
7481b77M53l79J1Q5K33j70k52M48k07j25K04r4O5p2j2M8J3j82P2K14J4O0o15M20
7505d5K03k86M5j05K53kK6j25m4L89m50J75Ok48M5l34N43j74J32j1O1k35L98l52
7529a35q2K74j52Q5Q1J29l09r2M05j35J98l72j00K20j17j21O6M8kK78n25J05M63
7552B10j8k17L06k83k44J46k92M10j2j36K23j07Q8p9j25J12L43k10j64O5Q0k05
$$ y = [-18, 131, 162, -70, -41, -54, -2, -10, -85, 19, 75, -185, 17, -144, -38, -233, -129, 215, -90, 129, -32, 322, -68, 131, -177, -140, -174, 172, 42, 144, -29, -41, -128, -98, 19, -57, -200, -25, 170, 213, -151, -16, 72, 27, -78, -168, -223, -25, 221, -35, -175, -27, 77, 218, 184, 55, 126, -179, -17, 92, -16, -107, -62, -97, -233, 62, -293, 81, 85, 91, -49, 79, -107, -159, -80, -76, -96, -150, -25, -171, 35, -72, -13, 94, 128, 131, 53, -97, 54, 289, 163, -100, 199, 243, 172, -277, 176, -203, -192, -107, 126, -44, -296, 152, -55, -180, 24, -70, -5, -77, -89, -41, -28, -210, -138, 76, 90, 150, -465, -45, 158, -128, -83, -188, 65, 63, 89, -36, -80, 309, -141, 34, 40, -208, -163, -497, 46, -128, 4, -7, 54, -181, 217, -135, -217, 57, -95, -10, 71, 200, -109, -201, 204, 69, 267, -105, -205, 15, -102, -223, -157, -109, -111, 167, -358, -253, 210, 192, -25, 281, -2, -246, -100, -392, 18, 6, -130, 93, -14, 74, -5, -130, -18, 325, 115, -49, 16, 96, -109]
7574a09Q0p4j5J9rJ03nL8j31K60l47L32l01Q8J03r4K11j59j53J61q7K46Mr4Q2
7599A49Q3mj90j54K32J89n12p2K86K4K76m23J98r2J10P0l75K04j25J6L9o0N7r5
7623a69J95j33R0o0J25k52J35p2J4j52J58L45k10P7j95l0l0K11J7k27P8J40O7
7646A22j79J68J16l40M8K6P6j22K61L49n16N6j5r5o6L0L0O4r5oJ94l68J95M2J68
7671A43k3r5l7j26p5L36j45J67K3k41K24l61L61J38k58Q8j91J01m2k9j7j1r1M5
7695a16L57l23M80m38M1j58jJ82j86J38J93Oj98j76O9K89j38Jm4K46j86m5k5K98
7719B66o08J72L27M9J3r4P9J0m23K03j51NM31l16K33j28N9J5j08j97n3L43k5j00
7743BJ22j68j18M7K47l20K66M2j07K16l24j7J57j23J34j02K63j50j12R0j28J77
$$ y = [-109, -29, -103, -118, -99, -108, -5, -10, 28, -103, 157, -190, 142, -159, -71, 32, -62, 149, -10, -163, -2, -89, 157, 161, 67, 149, 232, 228, 38, -116, 116, 305, -207, -279, 7, 31, 307, -116, 82, -10, 100, 170, -205, -1, -126, -110, -71, -131, -74, -169, 26, -107, -17, -77, 48, -204, -69, -141, -127, -279, -121, 224, 14, 91, -104, -134, -164, 47, 64, -163, -85, 55, 122, -57, 111, 227, -113, -65, -39, 37, -85, 176, 525, 9, 65, 50, -45, -111, -81, -51, 13, -82, -88, 106, -262, -67, -25, 143, 120, 25, -12, -138, -213, 123, -22, 145, 168, -73, 151, -210, 151, 289, 31, 119, -72, 29, -13, -42, -59, -70, -161, -116, 241, -82, 398, -40, 1, -157, -158, 24, -162, -24, 169, 175, -23, -199, -130, 159, 21, 22, -22, 224, 38, -7, -32, 266, -342, -170, 157, 206, 219, 125, 204, 214, -209, -6, -157, -152, 279, -37, 196, 68, 127, 142, 34, -163, -216, 127, 102, 2, 124, -44, -162, -115, 132, -188, 78, 120, 13, 229, -95, -112, 45, -78, 56, -46, 217, 67, -45, 45, -83, 94]
7765I4j3q0J04l90L41J76l1M3j92j10j00K37j6l0j01J99j40p7p1K61j20q0J14
7788A8j56M09k00k40nL36m67M20l38K50Oj40J09j20k4K62j16M7K3kJ0j27j42L56
7812A69n0j76J59k15o4P9Q6j69K43J40k59R5K11l86L12j95j78K33k7k26M5K36
7834F3k73L74n3j96O5l2K34l84R0J62j89J19O7k09K81k35K32j82J23j84J46k17
7856a98R9l0J81M9k48J42N4K06k88R7j93L51l65J80J36j25k27J92R9P0l54n9J25
7879a06k8J85O6j72k02L22Jk14J97o2J36k70J43N8p2L33j95p4j89l6J65J19N7
7902A62m00O3R4N4J1k04J92m4K1J63K41m91J71K94n92J58J73Q2j45n9L50j15l86
7925b07Q5K85j29J35n3l7j64K59j96J18J10k89j9J1J07j14K22k83j34K89j70J24
$$ y = [94, 81, 1, 105, -285, 56, 232, 201, 244, 52, -58, -158, 79, 63, 33, -68, 131, -9, -86, -157, 104, -16, -96, 18, -138, 271, 71, -169, -174, 162, -305, 115, -223, 27, 33, -107, 2, -118, -142, 120, 4, 51, 74, 72, 82, -45, -187, 169, 119, -57, 102, -113, -177, -98, -12, -181, 62, 202, -57, 38, 249, -137, 175, -20, -198, 35, 8, -218, -173, 63, -210, 164, 111, -85, -20, -52, 182, -202, -112, 50, -139, -20, 47, -162, 119, -116, 116, -66, 57, -127, 19, -198, -99, -129, 52, 101, -147, -5, 49, 255, -33, 64, -129, 222, -143, 37, 173, 48, -179, 13, 112, 182, -172, -231, -106, -134, 51, 117, -55, -257, 65, 66, -148, 49, -13, 123, -147, -4, 54, -18, 315, 120, 46, -143, -179, -14, 105, 162, -238, -175, -81, -27, -16, -220, -28, -72, -51, 112, 353, -138, 33, 327, -265, -107, 66, 148, 3, -56, 294, 179, -207, -122, 163, 34, 169, 116, 79, -85, 174, -22, 96, 206, -83, -102, -91, 16, -98, 124, -159, -293, -4, -174, -50]
7947e0R5k1rj87M52m00l1J66o6K28l32K14o6m3M7P8P6mk6J10l57K09J99k45K0
7972E7l66L06o6Q0J11j28k53K45L94k11k75OJ34l5K50j33q8J31k63O6J41l57J38
7995a16Q8o1J07j25Q9j14O6p8K09q8j6J55k36L96m32K80J59k5Ql99J68L8j31J42
8019H4j48K30n5k42J63L01j78j57j2m9K49m16K65K3k28L49l80L71l27J80k83K59
8041aN4J21k28k19L05k11K91l76J74K1l8M33p18K84j07L21k33J31j9K32k30m0
8063e3KJ76o6O5Rl62M98l34Q2Ol1k86P42l57J30l24J35j5M8L29l50J26Lk63J43
8088E3j02L1J18q8J59j9k25l2O0R1J27k49k49M09k38Q0k00K64RJ1k02J00j86J03
8112a75K45m6J68k74J23j09L4l1m1L12k38kJ03l49L76o1r3j29K46n1J10j98K69
$$ y = [-50, 45, 24, 15, -172, 280, -120, -151, 15, -51, 177, -155, 59, -7, -50, -3, 75, 151, 147, 121, 231, -126, 83, 282, 37, 57, -309, -3, -69, 11, 122, -6, -259, -14, 380, 169, -106, -100, 34, -1, 249, 116, 28, 159, -104, -38, 103, -254, -116, -28, -89, 18, -107, -18, -132, -66, -144, 65, -23, -39, 116, -120, 276, -156, 124, 283, 258, 266, -133, 35, 73, -58, 84, -64, 166, 111, -131, 32, 333, 155, -2, -14, -63, 186, -230, 35, 58, -170, 179, -201, 170, -157, 23, -260, -1, 53, 174, -54, -273, 32, -179, 112, -264, -90, -69, -107, 326, -392, -108, -215, 106, -127, 4, -15, 217, -13, -53, -51, 125, 59, 124, 133, -229, 269, -65, 17, 23, -8, -294, 448, 91, 221, -103, 32, 17, 65, 394, 44, 170, 173, -90, 53, -49, -18, 100, 12, 171, 152, -73, -105, -45, 46, 173, -76, -325, 84, -154, -74, -274, -10, -1, 10, -192, -92, -278, -175, 70, 24, 192, -82, 41, -68, -34, -65, -106, 206, -32, -34, 69, -280, 96, 35, -58, -187, 59, 8, 118, -80, 189]
8135A89j1j16j87J7J52R0J06l13K45O7j02j63L73k81j07j38P3O2J33j08j78Q7
8157a10K14j34n9K5l26K94K66k2m18L08K8K8k69J33n4Q2j92J68J49o5J2o0R0k75
8181a87O4N6K90j8l13K00k56K01l1m2
$$ y = [189, 178, 62, -125, -108, 44, 134, 240, -73, 172, 239, 137, -26, 347, 66, -41, -179, -106, -44, 89, -19, -197, -110, 104, -30, -89, -64, -390, -96, 170, 148, -270, 38, 66, 94, -175, -42, -96, -14, -206, -38, 111, 46, 58, -2, 88, -187, -123, -67, 223, 205, -108, 92, -164, 37, 6, -36]
8191c6
$$ Imaginary data points
##PAGE= N=2
##DATA TABLE= (X++(I..I)), XYDATA
0@%%%%%%%%%%%%%%%%%%Pj5J6j6J6j6J6k4L2l2L6m4M8n5O3p1Q1r0J03j16J28j42
40g5J58j76J96k16K38k63K91l21L53l87M26m70N17n72O33p02P79q68R76j099J247
61F65j433J669j981K410l041M061n973J0720m1972p3095R4422L2582r906K8743
75C7871j5023o6934J5876O7927q801m1131J5496k2054k2815O7626J8453o5358
87a8867P76K5755k2323J927M1354j2751m9561K2633L6100l5135j06K9249k9453
100a0402r931L0614n255j2098J4086K878j9445M217J9178k2098m471L8645j5230
113A0688k8731K3964J583j9190J3527J1548j4570j0932J3466L361j0917J1388
125E185l992j9288K1094Q713k1233Q371O023j6446L153J8974lj8978L520J2821
$$ y = [0, 0, 0, 0, 0, 0, 0, 0, 0, 0, 0, 0, 0, 0, 0, 0, 0, 0, 0, 7, -8, 8, -8, 8, -8, 8, -16, 16, -16, 20, -24, 24, -31, 32, -39, 42, -48, 55, -61, 67, -75, 83, -93, 103, -113, 125, -138, 153, -168, 185, -202, 224, -246, 271, -301, 332, -370, 409, -459, 517, -582, 665, -768, 901, -1080, 1330, -1711, 2350, -3623, 7097, -34875, -107970, -13548, 19034, 9128, 37871, 22848, -44086, -28210, 39717, 30916, -10215, 5281, -16773, -39588, 28038, 46491, -18867, -18091, 7664, -14659, -12732, 28622, 15871, -33690, -11057, 25043, -10092, -10198, 19051, -10402, -20333, 10281, 5026, -7072, 7014, 9892, -9553, -5336, 13842, -8256, -12727, 25918, 10688, -18043, 5921, 7504, -11686, 1841, 13389, -1181, -12113, 1353, 4714, -6203, 5185, 1193, -18095, 2999, 11712, -9521, -1150, 4873, -11573, -8420, 10554, 10551, -8427, -4907, 7914]
139G914j3610N604J5716j9287m345J4364o086L49P280o882q330N969J0373j1445
153b416n254J6927j1639j0871K2430j846j8323O744N448m199m86P189l80r941
167f617Q132L622j1830J0329L145j5795Q705R437j0106j739P466J921j0069O31
181b768J0557j1312l126J4036o468n178O534m683k18L387j637j302j081M274j867
196h52m000J0631m541j0510J1766K416p290K263J667P73j983n03N510m432k675
211a760L175l612N454J457r158M796K933n524J251M9J004k413k655P915j196n292
227c576M283k711R63L008m799L170J271m597M416J709n13j687l563N543M51o149
243b781N926j171l585L214k354J947N76n475K776K002j338j98l503M029J683o707
$$ y = [7914, -5696, -92, 15624, -3663, -8008, 6356, 270, 619, 7899, 1017, -7313, -1344, 9029, -2416, -7670, 9257, -2382, -13253, 9177, 7331, -10992, -4248, 1200, -2999, -3485, 3704, 3324, -6617, 1515, 5137, -6693, 3636, 6781, -9014, -309, 9128, -978, -2717, 4749, 6670, -3399, -2768, 7789, -3523, -6649, 7387, 919, -4259, 2275, -2408, -2626, 761, -876, -2178, -3259, 1015, -852, -4852, 5779, 1238, -9272, 2494, 4910, -2380, -117, 1550, 2323, 340, -163, 5347, 915, -1760, 1415, -2197, 3257, 4714, -4444, 352, 3285, -2239, -988, -939, 65, -2348, -5003, 2912, 1716, -3576, 707, -2004, -1041, 1967, -2832, 338, 1609, -2988, 1428, 3137, 2624, 937, -2626, 2917, 3368, -2781, 3145, 1974, -1611, 1603, -751, 1196, 1772, -3703, -927, 1075, -263, -461, -3964, 65, 1748, -4959]
259d959N094J999o122L012J521J194N7m755L374J236k076L871l354n19K836m486
275b077L620M471o233j587N17K224J256m976K965Q26n784N135J713l443Q46k462
291b989J326K652k383K121j145j977M425k352J487K413o323J956M812k347m91
306A185k087K428J686n730L405K462o210J718J582N62R89n031P28K453k088K582
322F34j501k240L723k649J762L737m670n53J565P25K048l657J549L183o057K656
338B55M247l962q94o58K278J794m992J234K127l549K180l49j119K534m261J075
354b060L717k549r42q14K262M020n823N33M872m262k46L235O53r49m680K950M605
371D522m394N21P46l232K571J47q27K295l881q68J893M63J333m119j82N249m102
$$ y = [-4959, 135, 2134, -3988, -976, 545, 1739, 1796, -2959, 415, 1651, -425, 3446, 92, -427, 2409, -2077, 1543, 6014, -219, -1806, -1289, 935, 2191, -2785, 180, 1006, -4778, 357, 2070, -1373, -527, -2989, -1663, 989, -1394, 727, -418, -2395, 2030, -322, 1165, 3578, -2745, -789, 4023, 1676, 1185, -902, 1526, 3212, -2518, 887, 3349, -2861, -1143, 439, 1001, 1990, -3041, -2313, 140, -1948, 634, -867, -3107, 616, -2033, -271, 3466, -1204, -1757, -192, 533, 2581, -1076, 473, 3656, -2401, 255, 4502, 540, -354, -1012, 1266, 3060, -1932, -698, 1429, -2120, 60, -289, -1408, 1126, -3135, -2060, 1657, -892, -1834, -2648, -386, 3634, -2189, -1656, 3216, -1046, -1292, 1943, 2596, 1647, -3033, -83, 4522, 128, 649, 1395, -1837, 734, 881, 54, 2349, -1532, -2400, -507, -44, 1289, -2830, -3012, 2237, -1865]
388a865l27N260l483k306R79K749J990n374J250L964l426J630J084k595K310k510
404f70m01M105j227k555q16J444L266m817r37N165m212r69L526p60o26k064O31
421a917M004k464o52J342j944J893Jk56L535m369q54M256j661n91J94m79K031
438B069k854Q40K840l251k82L76q92L107l457k135N503j573k775J213J612M91
454H32l279J183M371n457j35M996k003N98j03k999K340J077P6j05j801J287k167
471a289K47O760m916m913M607m46j412J785R17j931m338L119N381l768q97N47
487e47l700M712J552k252J913j451l012J685L469K091n334j800N533k912q23M768
503C892l004k345P6L21K680o58j875M54q77J393j223j213M878l516l488N153O38
$$ y = [-1865, -2192, 3068, -415, -2721, -1742, 1007, 2997, -2377, -1127, 2837, -589, 1041, 2125, -470, 1840, -670, -1071, 3034, 1807, -748, -1564, -120, 3146, -1671, -2608, 2557, -1655, -2624, 902, 142, -484, -2548, -1917, 2087, -377, -1029, 313, -1631, 262, 263, 7, 3542, -827, -1681, 2575, 914, 323, 517, 38, 2069, -785, 55, 2895, -356, -638, -262, -1154, 1953, -1504, -3639, 1864, 291, -2484, -1271, 341, 832, -2447, -1264, 3107, -2350, -2485, 2511, 508, 1106, 1003, -1996, 344, 1421, 1497, 1392, -409, 878, -1289, -1042, 5718, 802, -4111, 496, 50, -1362, 423, 1340, -591, -4929, -1810, 3571, -197, -1094, -547, -4247, 465, 2017, -235, 1678, 227, -2785, -1100, 2369, 4460, -874, -2674, 2859, -53, -876, 3892, 888, -1457, -1381, -1060, 1620, 962, -913, -459, -1336, 57, -1166, -2379, 2499, -1017, -4505, 648, 1286]
520A286j986P23N31N9j959M56L342j593q5Q5k805L296L49k611L418j022m519J608
538a427L545J394m320j612L319l196J24M800k461j579m3j752M031K571l302k322
554b230k82L386p83o60N340m020n085N918J220k517R88j187j016J58K257J297
570B784l355r0M60k871M925P27o537K864K629l734O36L135J50m631K45N135k927
587d55j315N043l395j446L589k142j96K663j104k657L92L794k177k949O086j652
603B079o513M495K034l635R97R71j229j297K150K044m003R58J578l751L439L558
619C875n365k13K747j526J65K056J329m202k026N898r55k646L450k241k541K515
635C20k30N36N61k037r74M33K935o09m076K758P55l889L692K200k797o80J66N97
$$ y = [1286, -700, 23, 554, 613, -1346, -890, 2452, 859, 774, 859, -1946, 1350, 1699, -912, 2506, 1484, -3035, -1427, 2118, 3512, -808, -2420, 899, -2297, -2173, 2627, 166, -1413, -1456, -3208, 823, 3394, 92, -2230, -2512, 874, 91, -569, 4771, 751, -4334, 1584, 2804, 287, 1275, 88, -928, -770, 1487, 2784, -571, -661, -201, -3072, 1853, 2580, -3957, -1093, 1536, -2198, -1562, 1573, 1723, -2908, -2663, 2472, -455, -1770, 3273, -122, -1568, 2021, -121, -317, 2346, 1242, -1415, -1023, 2771, 594, -2355, 3731, 2079, -4434, 61, 2095, -1540, -543, 428, -801, -2098, 52, 2096, -1907, -949, 629, -3122, 317, 3875, -1490, -1703, 1044, -482, -317, 1739, 3068, -1134, -3160, 2738, 1783, -863, 2587, 346, -2195, 320, 90, 626, 1187, -850, -1824, -1391, 1544, 935, -3141, -383, 372, -3517, 175, 2375, -422, -1102, -936, -339]
653c39O18P8J335j829q5J512k516K459K036m183L33K210k497q6J788Q09k405j353
671b115L403r44k502L201j980j119K481j115K83J986j875j567N90K837k60l397
687b093L619P01n218L098L139k937o42K55k5L88K51J409k218p41J970k616J089
704e71K886l884j018L274o95p63O34Q89j290k288M026P78l731J429R46j042J467
721A047n46j75R61j840P04N08M53L70l155J430K581l234j27J446o93J93r64J296
739B55L97k501J064J505j125J19j093Q24J720k245J285J371j930J46N28M60R69
756A749k453O64J607j458O76m61p03J457j675L43J865k518l98J249M25k42k079
773a952J078J627k568J004J689j798O42n08P62J655j966n34J457k25R47j149p35
$$ y = [-339, 279, 357, 1692, -137, -222, 1290, -1226, 1233, 3269, -914, -581, 1629, -868, -954, 834, 1643, -762, -2115, 1288, 344, -2158, 1043, -937, -2056, 425, -690, -407, 1579, -296, -1863, -1273, 1564, 1304, -2093, 1526, 2227, -2991, 107, 3246, 309, -333, -78, -103, 285, 536, 1945, -273, -1014, 956, -1660, -571, 2315, -1569, -2587, 687, -8, -771, -137, 752, -538, -2826, 1200, 1978, -1753, -324, 622, -420, 1047, 501, 326, 1287, -553, 151, 659, 1112, 1482, -1673, -243, 2338, -896, -1023, 423, -270, -77, -1041, 255, 652, -1849, -785, 720, -405, -286, -1379, -555, 1165, -1080, 205, 1576, -354, -208, 320, 780, 1749, -704, -40, 1567, 109, 785, 324, -379, 1078, -597, -254, 1611, -907, -1305, -56, 369, 127, -1952, -874, 753, -1815, -811, 878, -920, -278, -786, -24, 1631, -335, -869, 588, 363, 1310, 161, -574]
790e74K325k174j30K492j087j442m06O41J942j926j37Q14j981R98R84l93O82k011
808a383j79K288p53J37J28q88J009j254P31K729k827n55J427K87L51j000n37J685
826A396j820L30J254j574Q8l31M0K196k130r39J603n51N45n10j16P74r19k19K320
845A437j409k76K01n1J529j063q54J470j405M66J146q73N27j279p7J895j096q37
863e49Q25j145Q08j06k11J096j716l34J826r22L61p10l20K216r45q38J346j023
881c41K34O80n26J535j488o71J749m28k82N8j054J194r82l21J879j325r36Q39
899a86K26O22j206p75J709j439K20J608j076k3J6n52K106p69p50L98l31R59l99
918C58p09J930j683j449K545k25r44j08m3P54o75o84J952j429Q7J30r93J564k81
$$ y = [-574, 1751, -423, -553, 1939, 852, -590, -996, -355, 1587, -339, -476, 338, -1643, -645, 339, -54, 628, -1383, -1562, 726, -27, 110, 238, -650, 359, -895, -164, 2565, -262, -817, 610, 897, 1248, 248, -289, 1396, -424, -94, 1160, -414, -326, -657, -617, 1579, -551, -1490, 113, -438, 107, -403, -519, 255, -664, -883, 1437, 28, -248, -47, -98, 1431, 368, -486, 984, -421, 45, 1191, 318, 845, -434, -511, 1384, 288, -549, 276, -869, -61, -167, -378, 718, -998, -1332, 494, -428, -67, -777, -1097, 1119, 174, -664, 682, -341, -107, 573, 47, 1582, 94, -577, 1172, 744, 462, 520, -534, 660, -322, -643, 1236, -89, -1025, -186, 40, 662, -544, -1319, 390, -1049, -829, 779, -297, -320, -304, -856, 1250, 481, -269, 129, -202, 757, 358, -351, 1579, -104, -1553, 992, 767, -177, -285, -328, 426, -249, -933, 1019, -410, -323, -193, -1186, 378, 97]
937I7j704J957r5o00j05J05J118q55q89K501j257j432J958j64N3k11j023J133
955E87j99p27N22k89K83n44p68K627r89k726J858M85m81M13n88N45p56l04J964
974I13m42j75M8j685K137Q77k216J008O28j390J05P76R15j757j381K747r04j076
992h72J798j379l62J393j253L37K43m49K46l83J431p45k130L156l39k596K263
1009C59J084j763o9J186M07j528j71K066j207k93P68j851J004J514j887K71J085
1026I75j521r36R84J796j163k084K423m22j384J805J10j581R22l86J036M04j076
1043i8P4p27J480O16j678J476q9k671J575J810j312r04k92P10j52l62J648r97
1061A07j018R03j314J530J294k832M00J420q94L4O15J043j585j311K277P09j527
$$ y = [97, -1607, 350, 255, -345, -450, -345, 773, -82, -971, 1530, 273, -1159, 799, 635, 688, 477, -546, 587, 388, -339, 183, -106, 177, -367, -1135, 1492, 503, -2223, -365, 120, -361, 52, -536, 9, -747, -1051, 913, 471, 296, 344, -1341, 796, 1673, -543, 465, 1093, -297, -192, 584, 1499, -258, -1639, 1108, 204, -872, 926, -453, -815, 578, -675, -338, -95, -544, -298, -681, 750, 5, -2125, 1031, 692, -1904, 359, 1443, -320, -389, 797, 1204, -324, -495, 1571, 364, 71, 839, -1012, -8, 1506, -381, -110, 975, -546, -1482, -498, 1298, 135, -1949, 474, 52, -1332, 473, 583, -998, -76, -462, 574, 978, -98, -24, -751, 729, 1345, -333, 1143, 1054, -1617, -42, 1768, 456, -448, -740, -30, -182, -544, 1104, 107, -911, -8, -1322, 208, 1502, -1330, -930, 490, -404, -370, 245, 1288, -297, -1608, 669, 1378, -149]
1078a49R40m48j203J247l38L93R00j003r74k91J381N53k314J425R23l300J674
1095e84K067j181j158o6P58k20m19J881q40j272J022p88J196J774k540q24J566
1112C72q3K27J65P05j612j715J904J581j744P15o78j291J561K21j47j8j170O3
1130i44K6J514L83j860L43R30j751K069Q10j598l39J87M74K78k54K99n32m45J036
1149F26q37M62J215k263q9J843j027l07K74L62j033o09J639L04j347J067k29j001
1167i50J326n23k60Q89m89j24jO43M91j688P73J005k111J120J481j757l88O78
1185A15l1pl70P78o45p93J033l33j34J313k115l9J879k31o20K45O15p95q11J561
1205F15O66j885Q03J42q15J444n97q35Q07k66l42K69O08m21j351Q70J572k045
$$ y = [-149, 791, 343, -860, 387, 49, 442, 1342, 339, -635, -926, 455, 1008, -1306, 119, 1042, -2258, -584, 1483, 302, -856, -922, -164, -384, -803, 1078, 238, -1034, -12, -800, 396, 2170, -370, -1194, 372, 289, 516, 681, 1386, -226, -1941, -37, 1544, -200, 515, -163, -1454, 107, 328, 181, 163, -1007, -944, -918, 596, 979, -881, -538, 392, -1359, 710, 1520, -78, -417, -230, 244, 522, 268, 567, 35, -410, 626, -211, 251, 1466, -797, -886, 957, -70, -377, -103, 259, -774, -1383, 256, 560, -787, 280, 51, -950, 376, -147, -407, 482, -7, -131, -132, 511, 1002, -686, 87, 1092, -1019, 101, 1582, -175, -563, 115, 84, 77, -293, 485, -160, -953, 80, -253, -387, 926, -1189, -1228, 651, 420, -200, 45, 660, -135, -946, 615, 1281, -604, 199, 341, -474, 970, 373, -462, 345, 79, -263, 6, 614, 193, -1158, -288, 1284, -761]
1223g61J21R94q79J31L54J86m4n65J27O90o19J109j087k99J956j193q51J389j40
1242F19q21K35N93L13j526K19J163j155J01K33o31P82j12o06N74k12o6q7J56R21
1262F93j276m06J550m74l71O19l76K66j38k96J217p54k97K01J60L58o97m20J063
1281F22o27k70J057q97k77J36k82J105q08l66O00o97O00L97p87P46o55m78J383
1300E02j30k00k84o1O79j57n14Q16p95J12M66l85L05j58j119J237j52k53L08j078
1320h61P53M7l25O46k88p92P30K05R2j48j97L96j10j97J007q54k97L66k90R06
1340G89l22o63P62l50o22O29m16P22p78o11J307j92o99M33k18M34k25l32P28o39
1360b63n61J066K44k33m41j35P83o2l67M56q6o17N52m43R01o21r52J029Nl18L1
$$ y = [-761, -640, 354, -525, -394, -40, 146, 102, -463, -336, 354, -265, 844, -243, -542, 1414, 221, -630, 759, 619, -202, 33, 626, 939, -587, -368, 795, -360, -259, -26, -657, 125, 13, -593, -19, -231, -297, -384, -228, 693, -583, -989, 561, 87, -284, 335, -41, 225, 87, -209, 1008, 254, -43, 158, 318, 676, -21, -441, 622, -5, -275, 782, -115, -392, -256, -538, 567, -241, -607, -7, -704, -104, 293, -494, 252, -403, -881, 502, 372, 172, -112, -173, 506, 349, -165, 651, -144, -32, 434, 49, 354, 196, -923, 314, 162, -91, 217, -861, -108, -61, -386, 260, -28, -820, -90, 115, 207, 59, -138, 258, 148, -49, 958, 104, -193, 173, -117, 789, 467, -196, 566, 216, -406, 223, -193, 529, -249, -860, 447, 255, -444, -11, -229, 205, -20, -352, 376, -263, -824, 242, 486, 253, -188, -323, 460, 398, 31, 487, 401, -216, 336, -107, 794, 173, -779, 250, 255, -63, -32]
1381c2m93P40n22n60J238j80p29L15J46L07l52n58J071p0o75M86j06L79j29p34
1401d58J057k12n84M20m6L02k56r97J154n4q52P02J70m25k74n8R03p7j254M41
1421c98J71j74O20m78N76l14o43R09N80q07p7M3N97k1r80J304l19r99M08R1K13
1442C02N6j163M59N55m41M28m09J61m7m95R62J09j310K92O30j43J98l51J67O4
1462B4l36Q71k20m16Q1m85Q64L51r95J49O73n77lK90J52k18j280J192J92p97M13
1483g5j4m24O16l61K91L21n66J83l36N22K59q99Q44M23j473N60Q51n67k28K51
1503A78K77m27l98N25j78O7K4o07L74O81j277L27O71n79k2L08J96k67p10P42P02
1524F07j009R66n49l60K54L38m5L58k81o59K32Q02K71j395N68K73j302O96J247
$$ y = [-32, -525, 215, -307, -867, 371, 191, -538, -223, -77, 230, -122, -680, 391, 321, -354, 132, 26, 405, 276, -458, 599, 387, -197, 223, 177, 479, 223, -774, 380, 326, -526, 176, 346, -79, -353, -411, 492, 415, -839, -398, -227, -401, 219, -259, 317, 3, -640, 269, 849, 42, -35, 8, 605, 584, -396, 908, 589, -410, -2, 89, 302, 358, -805, -346, 209, -232, 196, -213, -52, -99, -594, 368, 477, -833, -541, 89, -54, 144, -207, -40, 24, -312, 559, 339, -77, 4, -481, 383, 734, -261, -112, 561, -16, -19, 271, 423, 205, -1075, 117, 309, -488, -75, -89, -513, 103, -258, 33, 354, -212, -29, -365, 157, 416, -483, 361, 784, -689, -129, 722, 155, -73, 178, 455, 28, -370, 155, -23, 44, 68, -539, -165, 516, -761, -434, 237, -342, -364, -56, 140, -127, -837, -95, 607, -402, 564, 15, -345, -91, 247, 202, 560, 279, -380, -148, 654, 925, -470, 98, 371, -931, -235, 1012]
1543A012j001n71M30O0m66J87P68n82o44J102k44l93J138p89q14J062K31n95L7
1562g2N62l96j066J239N75j474P82N09j151N00K44k80N3j72J15n47L58J032j421
1581f10J85R49j273J05J373m10n03l63N20M60m01O26l42p97O31J63m90R12l12
1600D23j156N59M62K0l95L24l61j008Q67O99p03Q2M4n04P98j94p2K70o31M56l14
1621c34M96O10j289j55J238m41L24K63l96q14L64L98K61p39K21Q5o01P28nm16
1641b02N72o24m86P38N07p53J24L35Q2n80L02N16p31k38Q85p36O82N5p20J23m8
1662a97O6Q5L15L45p81k38R01o85r5Q01l07p40j28L29Q18m92Q4k45m45Q67j24
1683A34m58P49m09n94P65L16k67J4l62L1M8J66M83r04J42J08o3P18l30n00J99
$$ y = [1012, 11, -560, -130, -70, -536, -349, 419, -163, -807, 295, 51, -342, 796, 7, -807, 255, 486, -109, -72, 490, 94, -972, 267, 842, -632, 150, 659, -492, 8, 252, -28, 25, -147, -32, -579, -221, 811, -610, -425, 524, -749, -644, 729, 319, -184, -547, -27, 433, 32, 658, 316, -481, 150, 313, -177, 735, 423, -733, -174, 288, 308, -87, 237, -124, -1132, -265, 434, -269, -187, -143, -647, 151, -43, -115, 155, -476, -20, -334, 162, 772, -517, -672, 566, 125, 449, 712, 316, -498, -134, 264, 525, -214, 7, 92, -509, 219, 214, -202, 370, -254, -740, -2, 505, -248, -124, 211, 293, -287, 15, 531, -200, -438, 447, -289, 393, 448, -272, -149, -197, -131, -46, 269, 614, -167, -405, 496, -189, -284, 517, 210, -530, -658, -329, 489, -3, 81, -164, -609, 258, 134, -324, 425, 16, -578, 187, 503, 236, 250, -112, -81, -33, 133, 616, -288, -146, -38, -101, 617, 287, -213, -14]
1704a4q2k40K18J11L23r80J78P95j12n65P29l72n1p7J01L78O9k99j51K15J81J09
1726D64p60P00j1o87K69j3K17l82J77J64n55J50P49k88m38J17l36N44J98n64L99
1747A14Jj62q1O4M80m14n09Q11J28l50L74o31Q5J63J2L30j24o61L24L84j94Mn72
1770d24O19l48J24R9k3k18k53J13N20r0n54O14l14M3N71n98M03N4q22N78M5N6
1792A95j17p8M88m16l31N99k35m26P15l92j33M2n6R6J21k69O4J92j13J84l32J59
1814d3K52n81K62M00J8n41J64L36k48l56N92K42n98K78l6R2j35l10L74J02k68
1835dk76j76M32J65l32K94Q1m48p1R0L34L51q84N57J1k95M95m10M93m07j11O20
1857E09n27m0J43Kk45M9P9M56k11p73O59q7m11L58l32L92K17o03K95L57m24O2
$$ y = [-14, -96, -336, -118, -7, 316, -664, -486, 309, 197, -368, 361, -11, -62, -139, -38, 340, 409, 110, -41, 174, 355, 464, -296, 404, 393, -294, -25, -38, 179, -203, -26, 138, -417, -267, 482, 194, -244, -127, -463, 81, 279, -285, 114, 115, -47, -128, -64, 416, 2, -507, 304, 432, 82, 456, -175, -90, 73, 85, 415, 291, -370, -46, 338, 144, 148, -424, 195, -153, -29, 70, 47, -171, -424, -311, 209, 119, -435, 179, -135, -92, 479, -119, 284, 338, -484, 94, 139, 195, 78, 0, 488, 72, -259, 340, 105, -321, 394, 2, -131, -89, -145, -49, 72, -197, -133, 59, -54, 130, -202, -43, 209, -372, -110, 290, 308, -233, -69, 267, 19, -337, 255, 497, -101, 177, 141, 233, 98, -212, 162, 264, -4, -280, -456, -24, 141, -191, 103, 184, -264, -335, -245, 89, 440, -444, 113, 124, -171, 324, -86, 407, 0, -111, 509, -18, -58, 85, 87, -158, -109, -30, 426, 215, -558, 101, 14, -397, -39, -371, 21, 238, -365, -70, 287, -137, -75]
1879g5K81P0q2n22N81J64n77L21j6j02K31l62Q9K57n36N75m66n7K54m47M68Q9
1901A38o56N96R5l44M3p6N64l46l57K09K42l47M59k75K43L24o42K12P9J0r5k59
1923a83K26J51k43j08J41k92J31J04K08om22J48L22l81J95m6j02P3n6N18j86n65
1945c73M50L08n23R6P1o5L02p3j26J57k55K44k75K75J45p32L15N6j47J11j21K80
1967A20j45m63O40J11j41j10k03P8L69k08J17j77j10K68o8K25r1n37J87L53m24
1988b09J03K22j24o4J96J96m13L7LO05q55J41m0q0M88j45l08L50k3j97K21rL75
2011D70p68O3M80k9Kj15k40K70Ln6K0J07l63j08K4L13p3k40M32m25KM83j97k92
2035b37k09L54K19l69L93r1j78L00r3j16L50n26qN82k24l4L5L5j08n01N71J25
$$ y = [-75, 206, 276, 194, -328, 253, 417, -160, 161, 145, 43, 274, -88, 1, 258, -278, 297, -169, -226, 28, -419, 49, 138, -518, 78, 173, -171, -128, -204, 360, 14, -343, -134, 108, -239, 220, -55, 188, 512, -130, 82, 161, 171, 76, -183, 43, 194, -49, -157, -16, -308, -177, -73, 135, 129, -293, -145, 177, -204, -9, -55, -157, -84, -140, 378, 192, -373, 77, 385, -138, -42, 29, -36, 266, 193, 67, 224, -31, 213, -62, 213, 358, -374, -59, -3, -150, -39, -160, 120, -25, -488, 152, 263, 122, 12, -191, -113, 256, 48, 165, -12, -122, 146, 78, 303, 212, -325, -138, 215, -209, -106, 116, -8, -72, 124, 320, -93, -56, -53, 552, -303, -162, -202, -282, 206, 61, -247, 103, 80, -117, 104, 95, 470, -298, -235, 245, 216, 218, 103, -137, 133, 136, 80, 100, 207, -156, -264, -240, 73, 0, -240, 192, -233, -231, 252, 55, -237, -446, -92, 127, -242, 151, 60, -118, 182, 89, -27, 323, -203, -211, 371, 147, 113, 148, 183, 75, -426, 145, 270]
2057B70m42M2K59l72L86l82j8L93j97J22k43L18O9n78J17N78o22N4N38n1k97K68
2079B12j21J07K3K0j37k16Q3J76j35P02p17o94R46q2k89K21r6P5l63R6M89l81
2101h1p9K46l86K83M91m87K74k93M0K51j77M27p69J19M03q1k25M16j49k70K8k8
2123d7N25m65M7J90n75M25p5m03O37k99m39M54K60l89l6QK52j49J66J19k29k15
2145b38K85k0jN60o07j1j2J13m68M02Q2k03m20N50Rj67K01k66J50k7j81N50k02
2168G9J53n29j6L70J12l85O06l09o86O96K60k58l43J89J29N5k57N72o27K23L02
2189C36m12J84R5j91j09L03k97j12J91N5k40k17N04j25k11J74K24j98j45J65K53
2210B27j7j96K14l07J72O5j55n1O7p7r0M60m62K22j39K58o7m17L78j21l15L95
$$ y = [270, -172, -130, 129, -243, 143, -239, -257, 136, -61, 61, -182, 136, 205, -373, -256, 322, -300, -246, 292, 241, -56, 212, 91, 198, 221, 241, 104, -112, -29, 147, 12, 714, -3, -697, 249, 167, -122, 99, 3, 78, -285, -189, 300, -81, -160, 86, -300, -17, 474, -13, 261, -32, 8, 259, 82, 509, -260, -141, 262, 181, -44, 372, 223, -47, -19, -47, 478, 13, 60, 250, -325, 100, 25, -378, 259, -40, -479, -25, 235, -154, -190, -182, 70, -79, 87, 206, -23, -238, 47, 27, 26, 586, -21, -32, -44, 69, -399, 3, 85, -118, -538, 12, 21, -146, 55, -211, -61, -88, -269, 281, 79, 232, -297, -313, 57, 169, -216, 390, 81, -605, 91, 351, 93, -250, -61, 68, 123, -134, 438, -189, 34, 336, -76, 108, 203, 12, -97, 206, -91, -203, -12, 43, -197, -414, 90, -35, -246, -72, 152, -46, -191, -26, 227, 210, 14, 228, -79, 93, 158, 3, -48, 19, -58, -148, 312, -150, 72, -67, 191, 124, -293, 85, -36, -351, 44]
2232D4m12N78K40m82J76p1j38n7l9L68l9m47K47K47k19K05l59j18L96j63K79l25
2254h9j3j69M0L80j18k97M05j43j73N8K84j5j37l56N69r1l04K71j26L2M06n76
2276a62K69J64k03j05K41k04J9p0O6K20n72L58K21m51K60J25k32J03k17K42j26
2297e4Q9j65J60k32K1J26n3K33k72r7N30k21k5o6M59l23j53J54L4n1o7j01R9j18
2321i3j77J99K75j36l8m21N39j1k05J61Q9j52j19qL4J91j49k2L1k67L86J08m27
2344b12L91k44L24k9k30J33J68n91O3O6J56J80l84J06J81j70Q5j31L93l29j70
2365b44K15K22k88J15K37n32M61l31L51O1l62m2J94k44L54j45k87L52o4k7K77
2386B73j94k2m19J30L91m58J19J09J40j00J2QL71l86k72N44l11L37l98K28Q0m8
$$ y = [44, -368, 210, 450, -32, 144, 73, -65, -122, -161, 207, 168, -279, -32, 215, -4, 201, -158, -276, 120, -43, 236, -89, -102, -271, -231, 149, 31, -266, 139, -4, -177, -119, 165, 150, 13, -343, 226, 135, -169, 102, -24, 8, 414, -162, 107, 271, 68, -37, 204, 0, 19, -51, 15, 235, -337, 21, 242, -209, 51, 176, -56, 47, -170, 72, -54, 35, -130, 30, -202, -181, -55, -108, 125, -147, -244, 286, 65, 40, -26, 433, 110, -43, 111, 145, 94, 27, -74, 25, -93, -270, -71, 204, 68, 30, -391, 148, 137, -68, 93, 182, 30, -89, -97, -63, 128, -21, -43, -12, -279, 107, 215, -212, 179, -65, 259, 230, 0, 133, 301, -290, -227, -161, -5, 175, -209, -103, 78, -92, -7, -138, 255, -74, -244, -29, 193, -95, 20, 257, -275, 186, -145, 206, 267, -95, -137, 57, -187, 167, 22, -265, 87, 23, -4, 273, 79, 57, -362, -232, 159, -299, -180, -71, 69, -31, -19, -11, 360, -26, -298, 246, -65, 272, -126, 102, 182, 134]
2408A34k16N07n74K86k90J80P0l18J59M31m88l17N58k11K47l93J70K66j60j12
2428g1p3p7K98j36j41N52l68q7K31o8J24k96K34M1k53J23O9l68R9K88k61J66o3
2451c7k36L55K1J14n83K58N22n74J14K98l45J85n7q8N13o60q0N00k56L42n60M41
2473A87j86m3J20J35l37J49p6O1m1LM0N1Kr4j48P7K40j48k08L06J5j72Q8k77K99
2498D3L5k3o9k06K93M2j37P6P1l52Q6K71j73q3j59L40R2p4j25J45k95K46j52j12
2522b20L99j62J28q9R4j51J3k04K72l81M27R8m44M40l34k30L70K76o0m62N2K14
2544D6r9j42K84l6k71K51M0Q5j31nJ63l37k20K38LM25r9l40K32k59m9M37k50K31
2568A97k26j00L06k07L8m5M7J61j45j42K48k30j32k2M10P3l49O9K97o8l86K83
$$ y = [134, -82, 425, -149, 137, -153, 27, 97, -221, -62, 369, -119, -436, 122, -89, 158, -235, -65, 201, 41, -71, -144, -221, 77, -59, -200, 352, -16, -103, 128, 60, 184, -112, 122, 163, -90, 33, 102, -266, -167, 121, -140, 26, -37, -273, 82, 103, 217, -366, -108, 414, -160, -46, 252, -93, 92, 35, -53, 460, -200, -280, 220, -36, 306, -254, 187, 1, -42, 78, 213, -124, 25, -51, 10, -31, -28, 12, 63, 65, -29, -177, -100, 140, -8, -216, 90, 105, -67, 21, -256, 43, 78, 55, -14, -220, 73, 115, -22, 54, 125, -227, -141, 130, -43, -126, -285, 55, 147, 73, -52, 93, -202, 44, -108, -220, 179, 17, 145, 56, 150, -1, 12, -192, 80, -301, 126, 224, -220, 220, -114, -344, 26, 302, 242, -220, -168, 46, -53, -195, 89, 53, -218, 33, 73, 158, 27, 22, 185, -152, -372, -134, -131, 294, 195, -145, 87, -172, -221, 216, -34, 197, -29, -129, 177, -30, 8, -37, 10, 171, 26, -116, 132, -98, -230, -252, 158, 231, -118, -49, 248, 180, -206, 77]
2590G7M7k10J00l83P50k28j58k9j66M14j84p4L0J21j91J06J98l45K56q9j43m3
2612a44L56N5l12o1K76n00N83k51j21P7L0n8k25N37k19Nj10q4K43r1O6lj0k21
2636a82L45k21J91j93k18K72%j7N6K3M69p92L85p1k00L9j1o6R9k6K16q0k96L29
2660E1J39J60k58j67m5K69m47M80j2o0P9l45L65m4j04J91k87Q9p9j04k21N49k91
2683i2ll0K98q8p3K06p7m82M80M6k57J02o6m0J57J9M1J06l36j61n9M10P4l64K5
2708a64M05m82J51L09k02J15R3r5M3k93M7J18j71J60j43J00J02j28r4K14j59k7
2730a01J81K06k22l66L06L39m53K00r1j46K29j33P5j0l35L57k5P1j42RJ90J29
2752B68j93q6L25l22k12K64j07L57m08K24J06l94M8K49j52J51r1j3R3l79J10J42
$$ y = [77, 124, -86, 14, -369, 381, 153, -5, -34, -200, 214, 30, -44, -14, 107, -84, 22, 220, -125, 131, 42, -101, -144, 212, 267, -45, -106, 170, -330, 253, 2, -119, -42, -12, -70, -295, 242, 23, 28, -82, -166, 77, -14, 52, 49, 39, -182, 163, -58, 133, -60, -278, -6, -6, -23, 33, 56, 525, -267, 118, 47, -153, -114, -125, -191, -92, -118, 98, 18, -278, 51, 190, 350, 92, -75, -120, 149, -298, 182, 170, 110, 189, -156, 209, 165, 61, 252, -35, 54, -25, -129, -350, 199, -92, -95, -125, 173, 85, 12, 218, 141, -341, 139, 185, -72, 30, -36, -76, 81, 100, 141, 247, -89, -250, -309, 101, 175, -189, -164, 241, -241, -90, 219, 17, 132, 225, 130, 173, -120, -73, 45, -126, 34, -109, -9, 93, -35, -129, 85, -74, -101, 80, 286, 64, -302, 4, 343, -110, 90, -1, -147, 82, -51, 24, 14, -321, 36, 11, 82, -60, -51, 139, 268, 75, -11, 314, -8, -220, 44, -63, 294, -114, 110, 216, -178, -130, 119, -33, 118, 27, 14, 107, -272, -162, -20]
2774b0J3J65k34k38R8J64K98m25J49K49k94J20P1m85L49p5%L26m59N7K27q8J27
2797I5R3k2j24j34Q5jl0n5N2j48L07j10N5K26l40l24J67K24N1k3k24M01l07J75
2821H9J38k79o6N14n21J41j66J31l1r6L51q9Q0k47r3O3J98N3p3l19L30J18l71
2844a45J19RJ4k04L26l89K43K14k64L03l51J30L9q6J80j30Q4R9j36k42K27k25
2866a85O9P7M52k45j29j13nL30l00l5R6j1p0P3K23k92O2j57K53j4p1j16M71m22
2890e9m0M00k87j11Lj71K23O4j17K39K8j43k00K56j82J51k44M42n69M43k09n5
2912a38J04J35m19M46j54J79m70Q8M43l16J92Pj44m0qK38k96J97k39L72j78k5
2934b6L6M2k85P2N39l91o0k54L15O4j66P7k56P4L94k73J93j49j36M66k26l76L73
$$ y = [-20, -7, 158, -76, -314, -216, -52, 246, -179, -30, 219, -75, 45, 116, -369, -20, -95, -95, 231, -228, -171, 56, -32, 95, 188, 166, 42, -92, -7, -8, -38, -93, -41, -189, 118, 8, 63, 289, -51, -375, -208, 16, 67, 44, -180, 221, -86, 89, 227, -52, -118, 396, -125, 16, -150, -19, -50, -146, 205, 116, 196, -51, -144, -81, 117, 170, 97, -222, 108, 226, -145, -26, -17, -3, -207, 119, -270, -27, 187, -77, 226, -125, 5, 44, -42, 138, 8, 92, 191, 55, -187, 40, -185, -116, -39, 413, 168, 39, -74, -79, 251, -49, -84, 12, 1, -69, 4, 227, -65, -3, -160, 93, 79, 8, -108, 363, -59, -99, 301, 14, -97, -94, -265, -42, 22, -95, 144, 172, 29, -171, 85, -97, 54, -190, 252, -317, 126, -83, -138, -34, 101, -318, 128, -26, 153, -317, -229, 214, -102, 90, 97, -47, -87, -95, 143, -153, 44, -195, 177, -1, -26, 10, 52, -233, -161, 378, -13, -73, -327, -12, 52, -114, -37, -293, -219, 175, -98, 95, -54, -190, 276, 50, -326, 47]
2957D7j71J36j52Q1J93N0m04K08pJ36j39P8j04P7k04JR0N2q8K08Ok63r2N12k93
2982d2p5Q1m16M67r9K07l7k04J18K89k75K64l72P2N9M0o4J69o9o9P0l89L03J2
3006D0K67k81p9K37R3k43M9j3j88L57l14r7J06j4p8p1J68J28O4k81K42l46J30
3029a24J65J79j48j5r1J66k30J99O9k34J78J22j88P4k31K06m2R6j17%k64K09l07
3052c28M00J02n6j30R8j41O2o8K29j87mJ55Kk35R4k63J2M11k90K82j90J44o6p6
3076d3K40j36J42l81K34l01k6K8L20p5J2K7j18kK51j22J17j29l01K15K78k62J8
3099a4J39M3j53j65J99k42K55o5J62Mk40l46L5O38k55k49L32L3k28k96M38L5k27
3122a67J84j59k4K86M0j60J07j80j20N8J89j63Q4K96l13q8o2O02n50J69j36K21
$$ y = [47, -124, 12, -140, -59, 134, 184, -220, -12, -19, 117, -22, 56, -48, 29, -175, -174, -84, -32, -120, 88, 94, -169, -261, 251, -42, -117, -36, -452, 15, -84, 123, 86, -118, 0, 289, 14, 278, -94, -22, 37, 77, 13, 182, 113, 44, 114, -275, 28, 40, 307, 26, -53, 184, 277, 34, 83, 70, -118, 239, -75, -172, -66, -80, -158, -229, -61, 67, 131, -150, 92, -254, -124, 41, 220, 72, 57, -34, 132, -98, 101, 170, -64, 114, 236, 48, 122, -109, 97, 55, 151, 34, 34, -230, -21, -328, 72, 174, 118, -12, 86, -55, 7, -61, 168, -19, -23, 132, 134, -101, -7, -270, -258, 153, -137, 145, -45, 99, 33, -43, 197, 61, 203, -178, 56, -245, -271, -243, 77, 2, 14, 41, -77, -79, 172, 50, 167, 38, -263, -48, 230, -32, -14, 125, 168, 15, -150, 49, -193, 62, -3, 159, 163, -77, -423, -388, 250, -5, -254, 78, 111, -117, -413, 25, 60, -167, 17, -142, -166, 120, 160, 0, 107, -73, -193, -135, 54, -109, -25, 271, -42, -130, -192, 410, -140, 29, -107, 114]
3144A14J58k9k07j11K3R6r8J18J82k53p3K58j10K1j02j90m6rJ40N5K0lk2J02L
3169C7kj66L59m20M10j64k07K00j77P2J12m6J30K70n46K06P9j12l9J56l3j26J74
3192A67m32K55q7L28k15j28L23k35j65K72qk19L20m79L29j64P8J25M3m2p4j33
3214a41L64j92K8N9Q6j86j11J67j53N0K3J96q6l23L8J35N1j52K52j52N7o5j30
3237a85L70k25J25M1j00J7M6j3m51L26K92j39o2l36J72K00r9j28L17k60Q3L1N0
3260G2k29L07m2k47o2K83q1k59N02k98M0J36q8j04l8K73j55K2J45p7p9j93L57
3283A85K1J02j16l40L90j30n5j28j18O9J70p8mj93J88P2k34K22r4j53K12Q1j27
3306e8O5J12jl28N7L80j48K39k21M6j36J66n50L10N5J81k84K70j73K3Or6M3K29
$$ y = [114, 272, 243, 36, -75, -52, 44, -54, 64, 246, -7, -80, 178, 68, 89, -13, -203, -249, -258, -118, -63, -43, -46, -68, 34, 37, 35, -131, 228, -192, 218, 54, -153, 47, -130, -58, 54, 8, 138, 408, -138, 68, 147, 35, -4, 152, 119, -7, 167, -265, -10, -97, 231, 16, -112, 211, -24, -189, 83, 75, -144, 176, -303, 26, -138, -60, 65, 108, 66, -8, -141, 223, 31, 59, 118, 204, 18, -93, 74, -79, -29, -6, 190, 104, -219, -181, -46, 5, -147, 105, -47, 10, -55, -185, 185, -40, 85, 126, 26, 43, 89, 76, -375, -49, 243, 104, 42, -294, -122, 78, -21, -149, 168, -92, -9, 22, 72, -157, 150, 108, -139, -201, 82, 1, -258, 244, -54, -14, 122, 34, -70, -108, 165, 10, 32, 177, 100, 21, -172, 185, 206, 308, 192, -148, 242, 112, 57, -71, -189, -120, 50, -28, -32, -225, -37, 35, -199, 23, -71, -224, -12, 69, -58, 7, 119, 118, -210, -153, 227, 79, 318, 97, 143, 7, 173, -377, -67, -12, 169, -115, 155, -18, 5, 11, -85, -42, 187]
3330A87j70k67K66m1Nj16m9K06Ll5nJ1r7R4p2J41k44K53J23K0q3j26Q1j01O0q1
3356c7r1J74M0l7qJ1k21K91o5j57l3M7r1q2K17K42j76m45L03J31p9j49L17o8j40
3381a06j0j39N82m62K20Q7r2j94J06j91J87j91K12j3R9n9n8J61j88K52k52K20
3403A71j9l42K57j56o2J38P9j61K10j22P3r0r4rL00k63n3N3K82M4m44K24J42j44
3427A4p2m4n0J01K12m6j13J26q1Qj67J61r1m0Q9N6j07l3N9K07k37J17J16j62p0
3452d7M3J03j9j86K40j53R3J39k56J02k76J54P1K41m41L24r3K7Q7l91O3K0L3J12
3476a0K06Q3m41O8K28r1L9r4j37N50k93k30j68M42m6p0J04r3O4l99L10k19M46
3499B49l0r5k50O7J43K50j50j32K45j70P2k01J27k09J37k85M59k54j23J09Q1j32
$$ y = [187, 17, -250, 16, -25, -20, -136, -185, 21, 24, -11, -16, -5, -102, -8, -80, 61, -183, 70, 193, 213, 130, 4, 85, -16, 44, -37, -128, 46, 86, 49, 41, 52, -169, 122, 57, -100, -133, -86, -177, -259, -42, 200, 24, -421, -118, 13, -66, -215, 102, 34, -106, -116, -255, 327, -135, 85, 172, 80, -114, -8, -199, -12, -203, 9, -4, 95, 36, -22, 139, -49, 203, -49, 171, 152, -190, 67, -89, -151, -13, 66, -95, 115, -7, 66, -24, -118, -127, 173, -90, -143, -90, 192, 236, -208, 16, 158, 14, -58, -102, -152, -51, 161, 115, 2, 128, 47, 55, -112, 49, -42, -82, 7, 63, -44, -77, -18, 189, -48, 69, 185, 23, -47, -4, 99, 80, -106, 134, -19, 74, 213, -43, 59, -217, -63, 8, 249, -192, 132, 39, 66, 153, -238, -175, -155, -122, -10, 196, 279, -162, -94, 134, 43, 82, -12, -149, 401, 108, -122, -290, 152, 106, 36, 140, 47, 111, -288, 22, -197, 249, 219, 124, -126, -59, 84, 334, 184, 52, 297, 127, 199, -2, 125, -84, 53, -232, 227, -27, -150, -41, 40, -92]
3521i2J06k12K46J46l01Lk50N6J61K64M7k08p4J26J23M4l09k3J51P7k69L18J1
3544A41j38k7Q6o0K45l72l1r2J70N5R3J23l55M0K0M4m6J68k28J78K41m07p2K48
3568B4K2L1J08q1j80J70q3J24k95O2K06M9j94J06J49l15K59k73L16l26K3M4p4
3591a28J25k09O6J94k42n5j5K57P2l8o3m4L5j3J81J93k37k14J24K11k59J13j78
3614a24L30j19m01K08J97n0l22L46q0k24J55j6J47j60n1L46k79K05l10K05m3p0
3636a10j37L46On4J13l15l1j14J81n8P1j20L23l73K23p9j4P5k20L83L6k97J30
3659c5j0j60K50j2K56k33K66l77j10L23q9o0o2N4Q8j42K94j44j47J91k43L1J4
3682e7J63k48j00N31m19k61O24j14m18M12N1j1k1l27K15k00J26j20K00J6N9l90
$$ y = [-92, 14, -198, 48, 194, -107, -104, -354, -298, -137, 127, 174, -34, -108, 18, 141, 185, -124, -147, 4, 81, -188, 130, 141, 3, -24, 62, 2, 247, -125, -156, -248, -78, -23, 70, 193, -162, -122, -102, -58, -104, 64, -164, 14, 255, -152, -224, 24, 46, 77, 185, 104, -76, 94, 11, 135, -160, -98, 108, 157, -37, 69, 218, -97, 162, -111, 205, -121, -98, -54, -128, -3, -212, -146, 48, -194, -249, -264, -7, 65, 27, -36, -80, -45, -58, 123, 316, 79, -135, -11, 200, -59, 54, -124, 206, 87, -314, -106, 91, 41, -281, 65, -15, -239, -84, -100, 47, -113, -164, 182, -97, 108, -202, 3, -40, -110, -247, 99, 105, 51, 164, -151, -182, -296, -115, -173, -102, -222, 101, -272, -49, -128, -142, -67, -287, 96, 132, -165, -35, -45, -205, 45, 33, 289, 56, 322, -55, -165, 158, 69, 9, -53, 1, 89, -53, 241, 97, -50, 141, -102, -71, -57, 106, -142, -242, 289, -130, -391, 233, 119, -299, 113, 164, 153, 132, -195, 20, -180, -54, -174, 26, 42, 101, -289]
3704b89L43K6j71N3J9m2J97j93M04n63K83L3l19j5L24j21n7q3mK42rj16K39m14
3728b33K23K7j25K31n7j39O4K1O3r3N0K73m75K27k50K58m3l61N23l4k60J05m6
3751e1j3L1q5J74N5R3j93Q9k05O5j1L14j18m14J88K69j3J70l96P8J2M2Nk40m2
3776a96L5n2K31K4J31l59J68p4J3J12j53J36N9q5j28K74k37j1k4K14k17J56J00
3799A17p4R2l3K6J33k13l18K31q3M2M43l48J08j31j33J78j94K74j80J09k09M11
3821B48j26j86L46j18M0o0l98L78j26K02k41j88L52J88m47K49P3k99L10l76J81
3842Bm7M6j69L7O4J50j37l9LJ97n9m2j70O7L9l58N15Kj17K90k23k30O0J79p4J96
3868A82j25k55J11J3K16j58O9j69K50k38j0R4K24j02j32J42l02L27k71K00lj17
$$ y = [-289, 54, 80, -91, -38, -19, -61, 136, -57, 347, -216, 67, 100, -219, -234, 90, -31, -88, -171, -175, 67, 58, -58, 181, -233, -10, 17, -108, 123, 66, -73, -9, 12, 75, -18, 32, 305, -170, 57, -193, 65, 22, -339, 184, 150, -110, -5, -51, -64, -33, -118, 56, 111, 204, 11, 100, -105, -40, -51, 263, 145, -269, -81, 188, 175, 345, -51, 27, 39, 81, 86, -154, -196, -161, -213, 18, 42, 173, -186, -18, -92, -79, 33, -120, 16, 75, -10, -138, 136, -101, -112, -136, 78, -139, 17, 117, 43, 135, 102, 128, 261, 48, -270, -39, -122, -80, 363, 15, 123, -8, -141, 37, -157, 117, -63, 46, -163, 248, 122, -64, 282, 164, 204, 144, -254, 124, -2, 200, -41, -229, 123, 311, -136, 113, 186, -113, 197, -179, 2, -45, 1, -168, -131, -67, 83, -54, -93, -90, 107, 48, 6, -164, -97, -58, -416, 99, 101, -16, 274, 51, -179, -119, 60, -14, 182, 57, -198, -87, -74, 142, -16, 53, -116, 134, -104, -114, -20, 204, 102, -30, 112, -190, 137, -134, 66, 63, -54]
3890e4J52Lj56m8j24N40k70j28K06r9M8q0r5R2K23j41n5J46k51K42j09j10O1Q7
3914H0j30N7j79K42P1q9J06m57J78K93N8k64M7J18j14m9p4K70Pj08P4j27l4k41
3938b65J43J51j19J07o0J46j87L7m6O5q6j3o6J39L02m81NL42J63k04j51L3l8K96
3962B13m65L06r4Lj9J4K29k93M0l9J72J28j07k27K71j70o5K28j81o8J91N8k40
3985a15k33L26K6N7l04L59J7n6o1K67j75k30m8J67O4k6K9k83L39j36O7k7K2J65
4009B11j29j03J49k58j7K72j57o5J45k14L62k81m8K20m4k78K40J9K2n3l9L58j41
4032A71j52k99K88K4n5n1o6J78K7J1k36K43l36J35J98J64k13r2N0j15j47L64n7
4055C4q6m5L7NJ7Q7j43K08j31J20o2j93J46L9Q9n7k32J06K65p4q4k25K07M8k69
$$ y = [-54, 98, 101, -55, -103, -227, 313, 43, -85, 121, 22, 70, -10, -105, -13, 210, 69, 14, 160, -91, 151, 42, -68, -7, 80, -50, 7, -172, 70, 141, 52, 158, -299, -121, 172, 230, -34, 13, 131, 17, -32, -106, 164, 171, 63, 137, 10, -24, -265, -122, 29, -90, 17, -43, 103, -84, -47, -93, -28, -114, -127, -193, -54, 248, -233, -228, 114, 277, 73, -78, -45, -83, 213, -252, 54, -40, -37, -56, -42, 187, -106, -66, -105, 67, 195, 88, -139, 132, -38, -103, 125, -56, -124, 67, 125, -115, -348, -22, 4, 61, -243, 116, 133, 77, 16, 283, 108, -122, -170, -3, 61, 35, 64, -219, 120, -16, 51, 24, 46, 211, 82, -21, 128, -130, -147, 125, -32, -97, 48, -166, 196, -85, -133, 87, 43, -235, 5, 24, 46, -7, -46, 312, 171, 19, -280, 8, 32, -23, -74, -140, 38, 65, 76, -160, 83, -253, -118, 80, 244, 31, -61, -11, -126, -273, 91, 34, -52, -97, -60, -55, -38, 49, -94, 114, -17, 103, 41, -152, -6, 33, 122, 65, -167, -61, 204, 130, 46, -179, 28, 76, -193]
4080a93L04k29OL18j83r6r7L06l5O5k05n1L42J05m82k12N10q6j47L8K85m61J76
4103b2L48k38l6J72k80qL00k92j31L35q0q3OM7N2J07k53M8k4R2p5j83J6J30J71
4128A19q2J91k72P7j07N2RK46j08l09j00M9L42k4J8j75j96o7K32N2R9J19k87k76
4152c98M46lq1p6J42j75J09M7l1P6Nk33k6Q3Q6kL7J2j05K09k18K1n5K41j60P9
4178C0j7j77k2O4J19m7J72l5j02QK44l67L11n9J0l40N7J32N8k01J63j68K54j96
4202a09J45p1k02OK41J8J2J06j54j45K6p2K89L4k09J74q5J80o9m0j19K49l23j91
4226c09L29kp2Mp6J18N0j64q9J86j93J82L0J10j75l2L5j29R0J20o3K3M8r5O8K50
4252B44j22nJ4k96J36M2K7R6j91O9j36K72j67N1K1j69k4J35Q5k97o9M94m28K90
$$ y = [-193, 111, -118, -112, 206, 23, -73, -170, 136, 101, 166, -39, -90, 252, 357, -125, -337, 173, 87, -60, -22, 263, -198, -22, 326, 88, 52, 224, -56, -64, 236, -56, -187, 148, 68, -15, -9, 38, 90, 197, -56, -8, -32, 60, -15, -198, -182, -52, 119, 37, 228, -44, 33, -74, -22, -13, 233, 125, -184, -284, -235, 107, 83, 101, -74, -270, -337, -105, -53, 46, 165, -122, -398, 48, 45, -36, -112, 30, -145, -36, 11, -20, 56, 61, -172, -198, -115, -29, -31, 6, 18, -87, 122, -96, -75, -130, 111, -49, 30, 13, -164, -186, -122, -3, -50, 122, 87, -15, -7, 237, -130, 181, 122, 132, -208, -151, -19, 39, -162, 1, -167, 87, -109, 36, -35, -237, -231, 10, 28, 40, 146, -8, -153, -127, -199, 90, 124, -85, 89, 4, 184, 115, 75, -44, 205, -118, -309, 20, 18, -54, -50, -126, -8, 42, -122, -211, -25, -218, -36, -6, 104, -71, -103, -68, -197, -107, 13, -50, -27, 21, -74, -6, 244, 122, 117, 131, -165, -29, 13, 40, 136, -55, 14, -122, 150, -17, 34, 55, -114, -138, -3, 82, -215, -284, 210, -218, 72]
4276G2l99K46L0L48j59N1k00O2J5j69J39J69O7M7m48O1p5L75n1j16L1j06n8j66
4300b34L17q3Jl1j24K77k52J47l3m9L93m07K15mn0L2k91pK19m1j96M72l15Q3m4
4325eo5j20L03j50J34J24l88J30K65l10P4n7R4K56k09j4j05J56j38P0J28O4K7
4348B64n0j78Q8J48j73j3K36j49j55j78k6N1J88k19q6R6M40n36J19J08k03N6J65
4371gl5k9j00K00j66J94K6j7K52nr7k70L8M0l4P4J57j07J69k57j50Q0J88J52l82
4396h6J05j29M91j67k83J77k54K29j25O0K73j69k59L29k07K24l9n2l22J37L4K9
4418dJ86m67L91m40M38j32k21M27k47J65k3j63O5j2OO1j44J07j10N8L43j35k81
4441a32L09j06KK70k49j37rK22j35j89j87K59o0J56j20J09K16l41K65N2J21m91
$$ y = [72, -327, -81, -51, 297, 138, 189, -11, 51, 66, -103, 36, 205, 272, 319, -129, -68, -143, 232, 181, 65, 96, -10, -68, -234, 83, 0, 1, -30, -154, 123, -129, 18, -15, -64, 329, -78, 137, 133, 83, 115, -176, -183, 36, -5, -201, 271, -44, 39, -5, -70, -190, 113, -37, 97, 221, -167, -37, 228, -82, -8, -65, 29, 285, 76, 62, -43, 113, -25, 45, 173, 237, 264, 214, 36, 124, 272, 99, 86, 322, 173, 18, -160, -186, -135, 53, -166, -252, -156, 284, -252, -133, -25, -228, -172, -7, -42, -71, -171, 29, -137, 57, 83, 66, 318, 313, 216, -54, -16, 24, -10, 64, 221, 114, 283, 26, -124, -44, 144, 296, -86, 19, -110, 381, 214, -69, 108, -146, 83, -42, 18, 291, 122, -137, 192, -15, 209, 170, 118, -204, -67, -33, -4, 182, -285, 106, -334, 104, -28, -249, 178, -69, 96, 73, -90, -25, -37, -31, 30, -114, -7, -117, -59, 284, 149, -132, 177, 71, 73, 343, 94, -43, -52, 170, 35, -154, -341, -82, -142, 14, -106, 3, 219, -122, 143, 195, 316, -175]
4463a75j77J56J56J45P8k21P0O0j35M7K08j90j31L32Q8l37Q9p3k64L50J59r9N0
4486A86j54j63OK45R8j90m9p1K74J25k80l9R7j75j33K5L7j8J38L2k35K9J88L12
4510B85l06j59K97M0l08M18m77L30j8k50mL26k21j4J77j42P4o9J4k82M82r2J05
4533B06j05l4j08Q1j32p1O7M1L12m19K63Q2k86l8R4o6J69J8l08K93M9r5Q2j27
4557c2k29K85P3k16J00j65K54J5l27J69J75P7M6j59N7J23l10R7q5M03l21j47K74
4580A57r2p8M0K32l43J71k79J90J86l46K94k01l0J49k00L08k73K28l75J44J22
4601Dk04L28p3j12p6K33r3J10j78K69l00J56k31K40j03J93m30K12P8J00m66K39
4623a04J29J24O4m39L32q5Kj19K01l3M4j37J86k97j4M29P8m94k34K09J02J80N4
$$ y = [-175, -352, -196, -40, 105, 183, -38, 32, 92, -43, 4, 212, 22, -109, 223, 311, -26, 63, -10, -274, 76, 235, 136, 186, 32, -131, -125, 120, 218, 28, -21, -92, 182, 307, 27, -12, 85, -90, -223, -198, -161, -179, -41, -9, -244, -215, -27, 285, -21, -180, 117, 157, -151, 267, -210, 120, 102, -148, -152, 174, -47, -61, 116, -26, 48, -21, -7, -289, 193, 101, 206, 101, 67, -41, 40, -92, -163, -96, -55, 257, -162, 101, 183, -103, -141, -47, -113, 56, 74, -234, 59, 108, 13, 95, -32, -261, 24, 97, -119, -19, -184, 70, 85, -242, -73, 102, 179, 225, 66, 123, 246, -64, 33, -52, 351, 30, -117, 157, 65, -13, 27, 259, -84, 87, -192, -2, 184, -162, 132, -69, -99, 50, -150, 158, -115, 113, -262, -118, 4, -200, 128, 55, -57, -133, 100, 7, 117, -61, 208, -92, 64, -167, 73, -30, 163, -267, -55, 23, 123, -343, -104, 25, 149, 213, -226, 106, 21, 23, -96, 105, 72, 116, -21, 165, -132, -146, 283, 361, -133, -367, -158, -56, 124, 178]
4646A78j69p2j10J84k6K65k48j36N3K40l07j21J52M2j84M35j46J39j89j09Q5J19
4668G5l01L33J1j92m3J71J82j39J15k18O7q6k36L4K63Q9l19K1K90k31nM1J2J35
4692F9j59L7J08R2j84K56j26q5k10K92j39j4J34j16JK75n52J66J21J34P2q9k27
4715a44l91L35Q5j44L79k55J19O3k67L31j17k37L20J08j76p5J6J77J04j11j42
4736b2J62J3j28l33L86r1qq4J38j04qO1j18K70j96Q1j32M2l1k28L12n0j5K12j07
4761B2k15qL96j59o3P8j44J51p6p6j17J06k05J86Q8l5J88j11Q4l77L8J42J96j49
4785f0Q7J2J0j75J3J17P0j43K2Q5J99l15R7r5J73p8m1l1j48L00k11J72j5r6J25
4810G4J91k60Rj12K22l69N23l18j18K85j2J06l38O5j54o3J97J57j8p8j2K46n61
$$ y = [178, 9, -63, -173, 11, -15, 250, 2, -134, -81, 159, -148, -269, -117, -75, -259, 176, 30, 169, -20, -129, -44, 75, -226, 107, 118, -74, -117, 54, 236, 97, 212, -6, 61, -25, -261, -227, 36, 125, -194, -173, 117, -114, -119, -78, -66, 69, -90, -53, 55, 147, -37, 219, 93, 8, -202, 90, -49, -63, 71, -45, -44, 231, -321, -155, -34, 100, 172, 83, -144, -535, -200, -115, -259, 120, -135, -16, 47, -220, 111, -6, -243, 77, 185, 9, -66, -50, 127, 231, 120, -22, 140, 153, 25, -308, 78, -13, -21, -105, 33, -71, -79, -18, -136, 134, -62, 19, -113, -71, -102, -330, -18, -68, -83, 129, 22, -193, -201, 195, 36, -27, 51, -93, 58, -18, -94, -211, -105, -310, -124, -36, -71, 117, 6, 90, -287, -249, -107, 89, -60, 27, 39, 49, -126, -113, 4, 74, -69, -47, 38, 237, -78, 19, -76, 97, 19, -22, -53, -201, 99, -112, 60, 45, -51, 74, 265, 5, 14, -98, 124, -245, 278, -40, -158, 127, 115, 221, -117, -52, -206, -269, -72, 85, 67, -11, -23, 223, -338]
4833c38K67qk7J81j19j00K99k56R1J82k99N2MM00l60M2j15n5j88K38nK03Oj25
4857c0K8qj43J86j19K17J98m6Ko05L95j62J94Pj03k18J59J3L4q4J22L79j85j36
4881I5k56L06R3j87n7o3K16L0k57K87k48J64n9p8p7j8j57K46O5J0J44l15K05k04
4905a15K74J6j64J8m21N48J7l72K78l4N2N1jk52J98J59k36J77k17k9q0j95K22
4928a06n9K88l6j53M05n98J75M1P5O5r3n3J60p2OJ35j10O4j94J15j87K13l0j39
4952h8o6L70k05J16o4l6o6m5J10L2M1j27R4j31J03o9m4j36J26J87J28l57M4J08
4976B5p2l2l1QQ5K59m27L14j70K00k51K06k06L43m02L08l2k4o5j69J5K13J76l34
5000f3kN0K07j2l08J51N9j20k68M37j64K1J7l4j01K79Q1k90J19k65K76o0K81k28
$$ y = [-338, -71, -79, -106, 75, -44, -144, 155, -101, -10, 172, -127, -75, -71, 329, -31, 11, -104, -159, -347, -109, -114, 89, 95, -30, -2, -10, -153, 33, -86, 131, 329, 283, 285, -320, 75, -87, 107, 114, 11, -207, -48, -35, -1, -85, 37, 416, 231, 95, -161, 145, 238, 51, -6, -69, 147, 177, -80, 207, -41, 123, 64, -14, -91, -109, -266, -20, 45, 55, 199, -116, 89, -115, 159, 175, 11, 29, -392, 156, 173, -199, 79, 45, 97, 148, 147, -105, 93, 252, 16, 193, -24, -53, -133, -328, -106, -165, 123, 87, -66, 339, -259, -84, -43, 32, 97, 4, -49, 111, 39, 45, 180, 70, 134, -60, 55, -132, 81, 51, -88, -154, 216, 11, 127, 63, 27, -39, -84, 26, 58, 99, -28, 66, -65, 38, -31, -75, -211, -85, 102, 230, -127, -83, 25, -47, -79, -110, -102, -17, 242, -185, 129, -41, 159, -92, 114, -92, 251, -151, 157, 125, 101, 36, -133, -118, 95, 271, -63, -65, -15, 192, 180, -128, 23, 82, -38, -306, 131, -33, -12, 5, -29, -130, 149, 230, -60, 59, -206, 70, 10, 291, 63]
5024F3k3m62K39K56jO8k50l0M39m9l18J81l3o7k94J32j9qK56n0J44j10l64M07
5048A07k31P9K06j11j25J18j09qJ68k28J67L1J07l47L7K79k58Q8L04k77j32J14
5070b1K03j2j01R5k24K65m46L12k7j94K31j95K02j01q1q2K23l8J4J72k25K04k08
5093c4N3l62K97j20K00k5J74n5l9j76q2R5o1J86L8P3m05L23k83Q3kJ42j74L75
5117B21l58J21n5J07K6k1O3l44J85J62k40K23q8j81M88o2m45M30K6j03m02J02
5139a45J78l5J83o2l65q6J72K28k95L9N1N4M1k2J50p7m7r7K28k9m8K6j93K08J88
5164B45J4k76j03O8K13k53r5J67N1j07J50N0j95J68k11r4L08o6p2k0l1K44k59
5187a04j7K57r8k39M16r6R5j77M9j21j33J30j7J7j82K00j93J52R3R8r6J24JN4
$$ y = [63, 40, -422, -183, 73, 72, 140, -110, -140, 299, 250, -68, 113, 80, 13, -281, -149, -168, -176, 80, 30, 174, 64, -300, 107, -124, -45, 161, 50, -75, 43, -66, -74, 94, -134, 33, 64, 171, -176, -139, 140, -118, -30, 274, -3, -135, -21, 182, 170, 69, 164, -60, 205, -241, 71, 44, -150, 81, -114, 88, -13, -94, -176, 47, 9, 23, 195, -30, 174, -34, 19, -343, -46, -166, 34, 9, 183, 128, 89, -87, -169, -74, -135, 51, 89, 162, -243, 80, -203, -120, -122, 20, -154, 221, -137, -16, -71, 36, 62, 41, 104, -240, -55, 107, -133, 90, 2, -179, 309, 247, -198, 232, 258, 155, -247, -145, 33, -2, 181, 119, -246, -332, -160, 68, -227, -188, -137, -83, -42, -64, 86, 9, -38, -135, 93, 64, 16, 42, -151, 57, 245, 259, -17, -120, -52, 161, -92, -187, -20, 31, -76, 74, 124, -71, 97, -114, -208, 100, 34, -38, -58, -89, 155, -104, -121, 136, 38, -201, 215, 119, 214, 37, 86, -35, -168, -38, -55, -38, -220, -20, -213, -61, 32, 130, 34, 158, 159, 213]
5211B13j51P6N3k75LL13j15k80J71K5l00L23K64m44l9J73j39M08r6k25R9j07o2
5234a12K79j52j56P6o9N0K01J00LJ20l37L1L3j40Q5Q3p2k73L25k44L87K3m65L89
5258A65k38L41j10q9j64j85L45j30J4K86k31K04k90J82N2l34K52k66K23k82K36
5279a9J09J3K3N0j50J41j32l33N50l46P7L7J57k09L9M3l46J77P0O4j8k11J62J66
5303A14j09J34n8l6Q6j43J1rj72K9K33m5K2J85l59J22j48J89q2J03k08P0Q5J14
5327A28j24j58N0Q1R8Q4l16N8J37J36k94J79k01n1L09l8j77N5L5j6n5K81j58k02
5351a59L30k15m55K98M06k01m8J8j22j75L76M8l00K12j33J13J85j73m1k26L16
5372E4N6n11M20J02O4r5j46K10j2j23n6N3j80j56K24N4k69K32J80j97K14m7k8
$$ y = [213, 62, 138, 191, -84, -81, 232, 117, -163, 8, 33, -267, 56, 320, -124, -163, 10, -129, 279, 183, -42, 57, -50, -112, 167, 15, -141, -65, -134, -84, 117, 217, 220, 340, 3, 34, 67, -73, 12, 95, 23, -250, 75, -169, 218, 241, -224, 165, -73, 268, 158, 69, -95, -280, 65, -65, -51, 235, 4, 208, -82, 100, 152, -182, 70, -196, 27, -255, -19, 90, 103, 126, 176, 26, 167, 35, -298, 252, -94, -17, 20, 177, -32, 7, 50, -296, -119, -49, 15, -3, -214, -52, 114, 5, 139, 81, 45, 131, -12, -1, -10, -182, -153, 80, 35, 57, 242, -117, 5, -143, 46, -36, 67, -141, -71, 14, 128, 4, -154, -104, -23, 75, 159, -157, -99, 38, 174, -120, 59, -142, -193, 116, 78, -99, -44, -9, -25, -80, 201, 43, -159, 171, -44, -499, -201, 205, 4, -44, -26, -148, -323, 53, 101, -199, 13, -120, -7, 178, 5, -36, -262, 54, 110, -401, 19, 121, 185, 90, -56, 154, 142, 19, -37, 16, -164, -320, -96, -42, -311, -79, 101, -96, 118, 71, 43]
5395D3N9L3j1J82j25j06j3M0k46K33l93K62K14k59m0J79m24K76j32K39k62K33
5417a8o8K33L8l04K11m67N98l72J04O1l6L7k68J41lJ51J7j90K60k22m7N63o63
5440b44J96J19l1Q1L08m48j4J4J64l16J03j18n7K74m7K0l17J66J13K52l63K02
5462E7m8J1j05J46j23Rm2J70m5j26j67K26n2K56j04j03J29k16N7K22m35K82K8
5485B7L0n5qkm8K50m04J41K24k91M8L01m14J75J57k30J85o6n0j27J55J43j9J15
5509B37l44R2Q8l27K01K70j40j33K41j0j79m5R3J3k94M06r9M1k18K57j62J75j97
5532c4k48L61k88K05J37j33j3j19K20k8j33K13j81l8J15j98J71J2j06o6J1Q3J30
5555G3n7k38M69j24k88J86o2L0L67n35K61m7j3O5J08j35J48n5n3r6J71l68M38
$$ y = [43, 102, 135, 124, 306, 181, 75, 62, 102, -144, 89, -304, -42, 172, -87, -127, 52, -372, -96, -228, 11, -251, -18, -86, 147, 185, -119, 92, -375, 223, -149, -45, 16, -20, 17, -251, -110, -113, 38, 55, -135, 125, -97, -144, 419, -244, -48, 71, 40, 121, 429, -19, -33, -19, 145, -171, -68, -186, -243, 31, -16, 4, -313, -147, -34, 218, -145, 57, 9, 20, -85, 61, -62, -53, -95, 75, 30, -96, -263, -37, -89, 167, 63, -40, 89, -127, -70, 152, -283, -1, 27, 57, 2, -6, -8, -56, 194, -210, -69, 155, -136, -88, 213, -201, -26, 131, -99, 86, 20, -30, -157, -2, 141, 122, 237, -107, -15, 73, -254, -53, 217, 77, -56, 185, 175, -4, -49, 44, 57, -237, 169, 70, 111, -107, 150, -12, 163, -34, -282, 79, -209, -4, 133, 0, -13, -132, 88, 60, -73, 140, -41, -79, 36, -162, 9, 21, -85, -151, -140, -57, 73, 16, -222, 247, 123, -165, 21, -41, -11, 356, -179, 82, 35, 22, 87, 195, 60, 208, 153, 100, 4, 175, -193, 245]
5578B45k32k66L80k65J66k28P0K27q3r8k8K21j51N5K07k29p4J26k27L68n7j39
5600a2m4N3M7K48N6k31J31k90l1J25jp2N2m8m4K22j55J15k79R8O0k81J33J39o8
5625g7j79J35J35K6J0k32M3J24L5J28j25j05m8L55J00l06l1J41m3j19p2J78Kj64
5649h9J44N1k01J08Q3j11K7k70P9M40m1l77j04N68m39j1J03o8K18J4M1j12j55
5672a02J22j7k0M4Q1o4k01K99k78J29r8K8j00J34M9k18J35K45l6k65J90p6p8K24
5696A27r4k60jJ73J58k53L48o5Nl8p1J89k65K41m14M68k84J85k18P3L9j12J12
5719D3K3q9o7J58q9J63k56Q9k0k7K10k0J01q6j74L05l66L21k60K0L68j94k55K29
5743A27j67N8J51l42K42j04J80r9j61j37K69J66k57n5K55j11P1k20N43l62L9j38
$$ y = [245, 13, -253, 127, -138, 28, -200, -130, 97, 14, -84, -112, 109, -42, 13, 220, -9, -83, 43, -184, 184, 127, -12, -56, -3, 44, 292, 348, 117, 248, -42, -73, 52, 51, -21, 31, -17, -61, 161, 6, 121, -158, -60, 0, -281, -148, -9, -77, -256, -121, 14, 40, 50, -182, -139, -15, 20, 148, 23, -82, -130, 225, 325, 19, -12, 129, 86, -33, -105, 73, 75, -89, 55, 106, -95, 13, 96, -15, 12, -258, -179, 261, 220, -157, -261, 307, -132, -143, -40, -108, 110, 124, 165, 53, -102, 20, 3, -17, 27, 108, 44, -157, 142, -136, -7, -105, -77, -177, -43, 6, -212, -77, 168, 132, -133, 57, -19, -97, 127, 33, -227, -228, -55, 103, -150, 198, 133, 138, 100, 29, 218, -47, 194, -220, 248, -36, 149, -69, 4, 43, -69, 43, 66, -23, -90, 68, -21, 142, -114, -25, -45, -72, 138, 118, 219, 133, -41, 264, -102, 219, -41, -21, 347, 153, -102, 127, -40, 18, 169, -173, 69, -35, 145, 46, -115, -252, 17, 183, -74, -129, 126, 15, 86, -134, 409, 47, 86, -52]
5765e2J92j52j25j18K56J35l8k14m8L70p8l14K97K6m4k61L43k06K57k76j73M9
5787a74j8K78N0P4k89%k3m8J07j75J38j13M5K3J17k79J97Q1K82l57k89K56J98
5810H1k47K16J26k02m9N1k9R5n9J3J8q9J15k3q0L30k52n7m6j70J95O8J46m5l26
5835b20K71J31o9j07r2K5l3j2P5q8O7NP4j35J4N8qJ09R6o5r4m9o2P5J68q7k63
5862b16J26K59l58K03l7J09l52K15J54j78n3K82l09N9j0l3J97nj02K14k26N6k03
5885b08J57j3K75l48J81P5k5K33m14o0K50r2o8J45k47J97J09k11K1k0j3N7Q0Q6
5909A47J02m52J58JmoJ59j25L91l47l53L89j54QJ81n5P0r2O1k8j29r7J94q4j36
5934b01N91m33J21J09p0k44J4J0J92j97p7N5Q1M5L58m27n1K29j66L3J9k50J05
$$ y = [-52, 140, -12, -137, -255, 1, 136, 98, -116, -164, 206, 128, -186, 111, 137, 93, -168, 175, -31, 226, -50, -223, -174, -192, 86, 136, 210, -79, -79, -102, -150, -43, -218, -80, -193, -148, -125, -8, -287, -90, -9, 273, -84, -373, -117, 81, -166, 50, 176, -26, -75, -24, -53, 42, -17, -4, 14, -75, 40, 17, -63, 267, 15, -42, -88, -258, -63, 5, 151, 106, -220, 51, 182, 113, 6, -86, -61, -94, -106, -31, -119, -52, -47, 27, -108, -94, -36, -44, 65, 161, 96, 2, -47, -109, -34, 134, 47, -216, -90, 169, -189, 14, -23, 86, -266, -51, 103, -75, -128, 154, -155, -96, -106, -139, 58, 53, -49, 165, -61, -5, -208, -51, -64, 211, -137, 44, 119, 94, 327, -87, -147, 103, 11, -57, 88, -159, 38, 147, -64, -43, -63, -76, -19, 61, 147, 249, -203, -45, -44, -48, -54, 105, -20, 371, 24, -329, 60, -94, -86, 95, 40, 110, 18, 79, 51, -78, -175, 19, -65, -201, 390, -43, 78, 187, 117, -127, -113, -103, 89, -108, -185, -130, -49, -4, 354, -73, -124, 105, -61, -28, -9, -259, -154]
5957a54K45p5J1%j39k33M00Q4j08J06j63K57k71r1LJ00o3J0K84j30l03J52K84
5980B06k49N4j14J13k36L38N6j76J38q9K5o6k06L6K42J2K0j79O3J42l48L94L9
6003B15P5m02r2J63JN9Rj51K17J60n00J61k19L32k32J83J62k79J74J61q9k11k9
6026a32l7K64j72L10k8l25L04j65r5K5J10jk67J54L58k58J25m1k18j2J69P1j70
6049c1P6J82l17J70q6J01k83L42k74J36j44J28j31J59l9o1q9J40Q7j89%J82o4
6072eM5j5p5J7J99r8r6j15r7R9K73j08j9M7j36o0J93j11J83K1Q7j16J00l17P0
$$ y = [-154, 91, 16, 27, 27, -112, -345, 55, 139, 31, 137, -26, 231, -40, -131, -128, -28, -91, -81, 203, 73, -230, -78, 206, -43, 11, -103, 10, -226, 112, 168, -8, 130, 41, 66, 0, -206, -170, 72, 84, 104, -75, -12, 130, -218, 176, 215, 290, -112, -204, -41, -40, 19, 28, -123, 94, 254, -246, -85, -304, 28, -204, -21, 141, -138, 36, 197, 108, -103, -132, -169, 95, -77, 233, 205, -120, 184, 19, -76, -51, 59, 58, -209, -55, 303, 45, 170, 129, -89, -101, 68, 139, -31, 45, 227, -90, 80, -6, 95, -188, 154, -120, 16, -128, 0, -131, 28, -11, -72, -161, -21, 66, -123, -123, 59, -5, 40, 25, -50, -33, 166, 68, -28, -143, -240, -141, 132, 24, 5, 52, -84, -144, 49, -62, 121, 142, 229, 113, 213, -104, -34]
$$ [...]
8191A52
##END NTUPLES=NMR FID
##END=
