##TITLE=1H_Ser DGA-N-2
 CDCl3, 8 sc, 
 29.04.2021
##JCAMPDX= 6.0         $$ Bruker NMR JCAMP-DX V2.0
##DATA TYPE= NMR FID
##DATA CLASS= NTUPLES
##ORIGIN= UXNMR, Bruker Analytische Messtechnik GmbH
##OWNER= root
$$ XWIN-NMR		Version 3.5
$$ Thu Apr 29 15:49:36 2021 Russian Standard Time (UT+4h)  she@DPX200
##.OBSERVE FREQUENCY= 200.131506
##.OBSERVE NUCLEUS= ^1H
##.DELAY= (6, 6)
##.ACQUISITION MODE= SIMULTANEOUS
##.ACQUISITION SCHEME= undefined
##.AVERAGES= 8
##.DIGITISER RES= 18
##SPECTROMETER/DATA SYSTEM= spect
##.PULSE SEQUENCE= zg30
##.SOLVENT NAME= CDCl3
##.SHIFT REFERENCE= (INTERNAL, CDCl3, 0, 15.7039)
##AUDIT TRAIL= $$ (NUMBER, WHEN, WHO, WHERE, WHAT)
$$ ##TITLE= Audit trail, XWIN-NMR		Version 3.5
$$ ##JCAMPDX= 5.01
$$ ##ORIGIN= Bruker BioSpin GmbH
$$ ##OWNER= she
$$ F:/spectra/data/she/nmr/H-F/1/audita.txt
$$ ##AUDIT TRAIL=  $$ (NUMBER, WHEN, WHO, WHERE, WHAT)
(   1,<2021-04-29 15:48:23.51 +0400>,<she>,<DPX200>,
      <created by zg, POWCHK disabled, PULCHK disabled
       configuration hash MD5:
       00 E9 B6 7A A2 85 ED C7 34 08 36 98 17 FE 4E 26
       data hash MD5: 16K
       26 B7 13 6F AB 9F B9 03 63 41 3F 69 36 F3 EB 1A>)
$$ ##END=
$$ 
$$ hash MD5
$$ 78 77 16 FC AB 06 40 A6 E8 40 A9 DD A9 2E CB 16
##$RELAX= 
##$RELAX= 
##$RELAX= 
##$RELAX= 
##$RELAX= 
##$RELAX= 
$$ Bruker specific parameters
$$ --------------------------
##$DU= <F:/spectra>
##$EXPNO= 1
##$NAME= <H-F>
##$PROCNO= 1
##$TYPE= <nmr>
##$USER= <she>
##$AMP= (0..31)
100 100 100 100 100 100 100 100 100 100 100 100 100 100 100 100 100 100 
100 100 100 100 100 100 100 100 100 100 100 100 100 100 
##$AQSEQ= 0
##$AQ_mod= 1
##$AUNM= <au_zg>
##$AUTOPOS= <>
##$BF1= 200.13
##$BF2= 200.13
##$BF3= 200.13
##$BF4= 200.13
##$BF5= 200.13
##$BF6= 200.13
##$BF7= 200.13
##$BF8= 200.13
##$BYTORDA= 1
##$CFDGTYP= 0
##$CFRGTYP= 5
##$CHEMSTR= <none>
##$CNST= (0..31)
1 1 145 1 1 1 1 1 1 1 1 1 1 1 1 1 1 1 1 1 1 1 1 1 1 1 1 1 1 1 1 1 
##$CPDPRG= <>
##$CPDPRG1= <>
##$CPDPRG2= <>
##$CPDPRG3= <>
##$CPDPRG4= <mlev>
##$CPDPRG5= <mlev>
##$CPDPRG6= <mlev>
##$CPDPRG7= <mlev>
##$CPDPRG8= <mlev>
##$CPDPRGB= <>
##$CPDPRGT= <>
##$D= (0..31)
0 1.2 0 0 0 0 0 0 0 0.06 0 0.03 0 0 0 0 0.0002 0 0 0 0 0 0 0 0 0 0 0 0 
0 0 0 
##$DATE= 1619696903
##$DBL= (0..7)
120 120 120 120 120 120 120 120 
##$DBP= (0..7)
150 150 150 150 150 150 150 150 
##$DBP07= 0
##$DBPNAM0= <>
##$DBPNAM1= <>
##$DBPNAM2= <>
##$DBPNAM3= <>
##$DBPNAM4= <>
##$DBPNAM5= <>
##$DBPNAM6= <>
##$DBPNAM7= <>
##$DBPOAL= (0..7)
0.5 0.5 0.5 0.5 0.5 0.5 0.5 0.5 
##$DBPOFFS= (0..7)
0 0 0 0 0 0 0 0 
##$DE= 6
##$DECBNUC= <off>
##$DECIM= 32
##$DECNUC= <off>
##$DECSTAT= 4
##$DIGMOD= 1
##$DIGTYP= 9
##$DL= (0..7)
0 120 120 120 120 120 120 120 
##$DP= (0..7)
150 150 150 150 150 150 150 150 
##$DP07= 0
##$DPNAME0= <>
##$DPNAME1= <>
##$DPNAME2= <>
##$DPNAME3= <>
##$DPNAME4= <>
##$DPNAME5= <>
##$DPNAME6= <>
##$DPNAME7= <>
##$DPOAL= (0..7)
0.5 0.5 0.5 0.5 0.5 0.5 0.5 0.5 
##$DPOFFS= (0..7)
0 0 0 0 0 0 0 0 
##$DQDMODE= 0
##$DR= 18
##$DS= 0
##$DSLIST= <SSSSSSSSSSSSSSS>
$$ [...]
##$SUBNAM2= <"">
##$SUBNAM3= <"">
##$SUBNAM4= <"">
##$SUBNAM5= <"">
##$SUBNAM6= <"">
##$SUBNAM7= <"">
##$SUBNAM8= <"">
##$SUBNAM9= <"">
##$SW= 16.9725357007746
##$SWIBOX= (0..15)
0 0 2 0 0 0 0 0 0 0 0 0 0 0 0 0 
##$SW_h= 3396.73913043478
##$TD= 16384
##$TD0= 1
##$TE= 0
##$TE2= 300
##$TE3= 300
##$TEG= 300
##$TL= (0..7)
0 120 120 120 120 120 120 120 
##$TP= (0..7)
150 150 150 150 150 150 150 150 
##$TP07= 0
##$TPNAME0= <>
##$TPNAME1= <>
##$TPNAME2= <>
##$TPNAME3= <>
##$TPNAME4= <>
##$TPNAME5= <>
##$TPNAME6= <>
##$TPNAME7= <>
##$TPOAL= (0..7)
0.5 0.5 0.5 0.5 0.5 0.5 0.5 0.5 
##$TPOFFS= (0..7)
0 0 0 0 0 0 0 0 
##$TUNHIN= 0
##$TUNHOUT= 0
##$TUNXOUT= 0
##$USERA1= <user>
##$USERA2= <user>
##$USERA3= <user>
##$USERA4= <user>
##$USERA5= <user>
##$V9= 5
##$VALIST= <valist>
##$VCLIST= <CCCCCCCCCCCCCCC>
##$VD= 0
##$VDLIST= <DDDDDDDDDDDDDDD>
##$VPLIST= <PPPPPPPPPPPPPPP>
##$VTLIST= <TTTTTTTTTTTTTTT>
##$WBST= 1024
##$WBSW= 4
##$XGAIN= (0..3)
0 0 0 0 
##$XL= 0
##$YL= 0
##$YMAX_a= 265602
##$YMIN_a= -179463
##$ZGOPTNS= <>
##$ZL1= 120
##$ZL2= 120
##$ZL3= 120
##$ZL4= 120
##$ABSF1= 10
##$ABSF2= 0
##$ABSG= 5
##$ABSL= 3
##$ALPHA= 0
##$AQORDER= 0
##$ASSFAC= 0
##$ASSFACI= 0
##$ASSFACX= 0
##$ASSWID= 0
##$AUNMP= <proc_1d>
##$AZFE= 0.1
##$AZFW= 0.1
##$BCFW= 1
##$BC_mod= 2
##$BYTORDP= 1
##$COROFFS= 0
##$CY= 11.3945322036743
##$DATMOD= 1
##$DC= 2
##$DFILT= <>
##$DTYPP= 0
##$F1P= 15.9154993809931
##$F2P= -4.1035820241983
##$FCOR= 0.5
##$FTSIZE= 0
##$FT_mod= 4
##$GAMMA= 1
##$GB= 0.15
##$INTBC= 1
##$INTSCL= 1
##$ISEN= 128
##$LB= 0.24
##$LEV0= 0
##$LPBIN= 0
##$MAXI= 10000
##$MC2= 0
##$MEAN= 0
##$ME_mod= 0
##$MI= 1.114404
##$NCOEF= 0
##$NC_proc= 0
##$NLEV= 6
##$NOISF1= 3.799351
##$NOISF2= 2.8
##$NSP= 1
##$NTH_PI= 0
##$NZP= 0
##$OFFSET= 15.70392
##$PC= 1
##$PHC0= -11118.35
##$PHC1= 9.40102
##$PH_mod= 1
##$PKNL= yes
##$PPARMOD= 0
##$PSCAL= 0
##$PSIGN= 0
##$REVERSE= no
##$SF= 200.130013532006
##$SI= 16384
##$SIGF1= 3
##$SIGF2= 2
##$SINO= 400
##$SIOLD= 16384
##$SREGLST= <1H.CDCl3>
##$SSB= 0
##$STSI= 0
##$STSR= 0
##$SW_p= 3612.71676300578
##$SYMM= 0
##$S_DEV= 0
##$TDeff= 0
##$TDoff= 0
##$TI= <>
##$TILT= no
##$TM1= 0
##$TM2= 0
##$TOPLEV= 0
##$USERP1= <user>
##$USERP2= <user>
##$USERP3= <user>
##$USERP4= <user>
##$USERP5= <user>
##$WDW= 1
##$XDIM= 8192
##$YMAX_p= 0
##$YMIN_p= 0
$$ End of Bruker specific parameters
$$ ---------------------------------
##NTUPLES= NMR FID
##VAR_NAME=  TIME,          FID/REAL,        FID/IMAG
##SYMBOL=    X,             R,               I
##VAR_TYPE=  INDEPENDENT,   DEPENDENT,       DEPENDENT
##VAR_FORM=  AFFN,          ASDF,            ASDF
##VAR_DIM=   8192,          8192,            8192
##UNITS=     SECONDS,       ARBITRARY UNITS, ARBITRARY UNITS
##FACTOR=    0.0002944,     1,               1
##FIRST=     0,             0,               0
##LAST=      2.4114304,     0,               0
##MIN=       0,             -179463,         0
##MAX=       2.4114304,     265602,          0
$$ Real data points
##PAGE= N=1
##DATA TABLE= (X++(R..R)), XYDATA
$$ [...]
2033G23l07n92K16k76j084J895P41j312r6K77J1q25R21K17m2l5k56n87j33J007
2053D63l80N64O5q88P9K32m54j20J417l79l33m10r0l24L74J546j548J29O89j071
2073d39o80J451N3m87Q90j144n83M50R97o52L16M96j267j73Q16m23JJ508o35j444
2093i49J222p50k52J134M71j477N49P14j466J70J248j98o68J464j435j004J755
2110E28m1o30R79O3j708Q43L61r18J164M63p93j188J692j017m30J713m69j092
2128d80R43k9j401J239K18m27M22Q3r50m61J068rk95N36n77n00Q24j98r56J637
2148F87k70p67K3K35p31O9J332m38m82K96j24r43M52J108q57N95j02n65p90J105
2168a67L28j48L82p05j10l03P36l94Q12M60j277k9K55j67o3J483p44p27N40j8
$$ y = [723, 416, -176, 40, -236, -1320, 575, 1316, 4, -92, 185, 196, -629, 292, 509, 467, 432, 176, -411, -544, 463, 83, 647, 712, -176, -97, 135, -319, -439, 978, 599, 266, -144, -234, -558, -184, 1362, -186, -57, 632, -439, -1119, 332, 385, -102, 788, -356, -939, -489, 508, -144, 172, 668, -599, -772, 44, -379, -378, 1130, 495, -949, 273, -477, -729, 405, 876, -601, -52, 662, -804, -634, 614, 416, -252, 1212, -223, -1227, 528, 487, -143, 836, 899, -809, 34, 395, -523, 641, 1104, 311, -877, 815, -202, -632, 1081, 612, -480, 463, 434, -967, 272, 490, 63, 485, 568, -382, -843, 225, 216, -79, 457, -120, -620, 204, 6, -950, 687, 417, -350, -327, -92, -823, -754, 578, 140, -342, -46, -170, -1113, -661, 447, -410, 185, 83, -482, -1272, -167, 161, 13, 395, -310, -420, -723, 13, -381, 431, 891, -386, -415, -160, -327, -390, 1093, 349, -378, 162, 144]
2188A44p66N13J495j304N7L44p28l94J075K20q84J328o27q46L00M18n41Q33N74
2207A211j781L68O11l21k47J130o18p79J331j237r36K120K92j422J79L57j044
2224g86R59O10j241K94J431j317j255J558n79R2J094m79j685J297L28j283P91
2241a71O82o60j92J044j270o46K015m62n02J13J60r67R05M0n20J134k82p96k92
2260f67Q42l75O13M90j086o3M63j07q75J504K7q28P4J31o97L82J305r07j77L62
2280D11k65p37K48P76k81M31k18j099JJ050q7m69P32m88k45J23k03j39O69P92
2300A002j380k46K85J3j88J001m55p97J107o11o83P38N23m85M93k43q94J35R84
2319B99o8p22R93n17p89J174n79m15J237N07j803N15L31p11J049P8m94n57J049
$$ y = [144, -622, -109, 1386, 82, 139, 483, -245, -639, 436, 656, -228, 1100, 473, -373, -73, 345, -196, 637, 1211, -570, -202, 409, 88, -159, 971, 353, -426, 905, -332, -1268, 852, 1144, -278, -99, 258, -786, 173, 783, -458, -164, 1267, -50, -1305, 253, -326, -234, 860, 381, -1304, -7, 321, -962, -171, 511, -149, -341, 703, -567, -1213, 802, 340, -162, -49, 111, -856, 49, 89, -431, 703, 421, -375, -667, 175, -200, 413, 903, -183, -246, 217, 110, -765, 739, 766, -62, 12, 143, -554, -172, 1133, 226, 49, 411, 146, -591, -343, 433, 152, 583, 365, -734, -733, 317, 230, -239, 493, 5, -240, -117, -320, -459, 210, 1002, -378, -624, -339, -326, -514, 487, 32, -765, 342, -269, -952, -214, 309, -176, 317, 74, -820, -685, 299, 231, -491, 502, -15, -804, 370, -209, -624, 613, 1120, -683, -168, 163, -548, 501, 579, 85, -472, 577]
2338E77p85m64J270j54p80Q21K78j780J382M4p61R44N24j374p8J233j090K4J144
2357I75k07j049K45K51j210J616M33j337L6P14q11J49P00n78L67q9n19m19M74
2376b59O61p01P51j17r15K08M74p45N50R11j575K54L29k78j25R15j52o96K79K86
2396E5n49j80J099l64k65N04j058J18P62K12o54N89j20l72n0J69J95j87J064p72
2416A96j058J255r0q29R43J40q13M27q0l82J11P13Q9j076R48m05m81Q97j13r83
2436e91J146L47j532N80j55j21Q17L87j139o64J291m64o90R86Q83j504P64k20
2454A21j251J428N87j402P5N25m26m60R21l33J2R97l08j791Q84Q08m73L81O72
2473I67k030P29J234k047P47J074p72p4K54l48m10J014O18j251M5P69q19pJ099
$$ y = [577, -208, -672, 598, 444, -336, 485, 763, -1017, 365, 409, -352, 592, 1116, -258, -336, 897, -193, -169, 975, 768, -281, -36, 215, -995, 621, 1054, -283, -247, 467, -344, -195, 505, -73, 294, 205, -314, -733, -259, 402, -299, 452, 335, -580, -372, 102, -643, -93, 818, -757, -503, -174, -452, -577, 338, 186, -510, -231, 55, -494, -674, 425, 61, -204, 300, -758, -640, 122, 334, -320, 269, 149, -223, -273, -104, 91, -96, 968, 196, -862, 393, 303, -526, 417, 557, -256, 171, 91, -291, -180, 533, 622, -454, 494, 89, -392, 505, 392, -591, 555, 902, -630, -50, -205, -326, 491, 878, -261, -925, 366, -98, -788, 198, 1081, -423, 341, 121, -1130, 298, 885, -517, -442, 83, -343, -803, 118, -215, -203, 794, 486, -1305, -421, 387, -86, 295, 967, -1063, -334, 900, -1147, -400, 674, -98, -172, 82, -266, -676, 338, 956, -295, -250, 519, -300, -307, 792]
2492G92j066N09O69j369R2N45j12n3P25m99l62J95O0m86M70R80j240l19R83p35
2512b21k54J107k73o75P92o52j01N7M82k12j81K12m09k59P18o4o78P35L77j059
2532e58M15k84P6K20N76j83q72L72j23m2K60Q84j337L65J77o03M30L62k49K47
2552A33K97j045J9P90k0j25R2N7r88J131K12j161N68J001r85m15R93j011L27R93
2572H63l37o97L64L36j014N98O30p35L81M79j362j4J384q51J09L19n63m80J152
2591E62k34r76R36N43q93l14M65l90K59Q78j079l69Q16j60p32R49k16k10P33q59
2611b91n22L57P92n01q5N26p64J59N21m19m20J416n25o98L24J9j39P9N69o93J64
2632a31M56n35k91O33L33n76L93m01n54O42N06m70J21M54q58j78O75j41j17M80
$$ y = [792, -274, 235, 904, -465, -373, 172, 60, 7, 732, 233, -129, 66, 126, -360, 110, 1090, -150, -469, 514, -221, -475, 632, 359, -316, 476, -176, -277, -220, 262, 50, -131, 81, -328, -587, 131, 67, -611, 124, 501, -558, -143, -427, -351, -131, 445, 262, -610, -238, -361, -403, -143, 741, -596, -231, -54, -657, -227, 135, -114, 133, 430, -615, -596, 194, 174, 49, 141, 198, -790, 341, 553, -608, -40, 961, -24, -439, 554, -457, -130, 863, 526, -171, 193, 529, -485, 113, 743, 8, 389, 868, -494, -508, 876, 25, 134, 453, -110, -590, 562, 328, -648, 288, 831, -62, -376, 89, -301, -42, 836, -243, -612, 204, 44, -688, 261, 45, -165, 568, -291, -813, -456, 336, -165, -250, 276, -488, -329, 192, -227, -647, 769, 244, -454, -130, -111, -250, -171, 398, -295, -131, 325, -210, -501, 132, 465, -111, 282, -119, -673, -31, 475, 5, 126, 580, -278, -456, 219, 78, -39, 441]
2652D41J9j158M88M96m32J54N55n70k55O15p68J62O00L7o46k1K75m53O01J73p03
2673c90L63P41j063n11R96l23J58L73m51q09R77K38j107Q06M12n10l14P68r04
2692e50J02J044n63m78M53j9q03J299l47n79J034l73o54l5J036q91L53O87r93
2711b77k84J107l87q77J329k80o27N07l5m76M83P16p62k05N17n46j65P00n9m83
2731a04J115r86l94K45L53n42O51J05r15L37K71k65k10Q34k00n50N54m50j86N74
2751B37J40o96J54L41p87L87K31M6j36M86p95m03P71om9J73J76p69K16N86m86
2772a83j34M71R4p71M96j10j59N03K72q26k13P72m12k09L33K49k78N24l73r10
2792h64J017M7m34L41L03m63j07O61q01M7Q30k86q03N11K71o44R14J5o87M8N91
$$ y = [441, 460, -698, -210, 286, -146, 8, 563, -7, -262, 353, -415, -253, 347, 384, -262, -283, -8, -461, 140, 313, -390, -27, 714, -349, -860, 136, -187, -29, 344, -107, -916, 61, 299, -808, -2, 410, -100, -414, 354, -550, -448, 596, 33, -445, 8, -11, -814, 485, 138, -441, 593, 220, -434, -469, 567, -324, 29, 716, -277, -561, 546, 159, -718, 611, 331, -296, 211, 176, -300, 183, 899, 137, -68, 449, -97, -262, 438, 379, -104, 1011, 25, -369, -124, 229, -313, 338, 443, -472, -135, 136, -129, -339, 495, 295, -255, 299, -151, -337, 237, 377, -319, -165, 176, -611, -224, 7, 53, -83, 403, -392, -795, -24, -30, -79, 94, 270, -499, -283, 303, -183, -317, 154, 248, -523, -27, -137, -296, 207, 479, -347, -560, 212, -200, -409, -76, 173, -105, 419, 46, -864, 153, 200, -234, 107, 410, -53, -160, 501, -300, -253, 577, 291, -512, -1, 270, -374, 540, 555, -132, -84, 507]
2813E07p41j80Q99m79K03K15n07n98J146j17q48Q15L4o54Q9L59q76M88R49j002
2833b98l60O60M2n61P26j33l50N60k96n29J55R23m84Q0j41m79L73O47o20k35J113
2854G93p58m82M46q3j76O87L68j240J63N18l44O0M33R8p66P64n86j94O89J66n64
2875hn6L81p38M16L51k86j08N09m69m75P35J00m68L15L42p72m2N83p72K26M13
2896A77J28o84L20K19o69P02N8m22j01M86o23J56L88l30J86K20k99o52P42J54
2916A56m13M04l7o26J74O77p86J53Q58p61j78N19l25m09J072k25o35L99L0m59
2936d12K84O01p19M63L31p59l38P23L3k11R88j001m08O35K28p01M65O31j098J91
2956g4M67m27k30J046l70o13M29k47j86K90M01o62K26L39r37N32J72o8k98P05
$$ y = [507, -234, -414, 485, 6, 209, 424, -83, -681, 465, 348, -500, 315, 349, -305, -216, 143, -733, -245, 704, -298, -658, 2, 44, -517, 209, 76, -274, 286, -10, -539, -384, 539, 55, 135, -6, -485, -112, 535, -85, -320, 793, 35, -447, -1, -84, -260, 427, 795, -445, -282, 236, -108, -48, 385, 483, -283, 481, -105, -299, 390, 556, -8, -64, 317, -421, -5, 346, 60, -48, 461, -8, -483, 252, 352, -116, 199, 541, -231, -273, 310, -462, -236, 177, 305, -379, -59, 160, -509, 193, 251, -171, -272, 214, -409, -253, 135, -195, -9, 211, -88, -740, 2, 156, -257, 147, 110, -516, -342, 335, -451, -298, 560, -201, -379, 140, -185, -594, 478, 253, -382, 17, 47, -412, -128, 473, -246, 217, 548, -211, -549, 174, 207, -4, 984, -17, -425, 210, 438, -263, 202, 833, -265, -74, 393, -34, -264, 782, 412, -201, 228, -19, -205, 85, 486, -176, 50, 389, -548, -16, 156, 88, -210, 495]
2976D95o30l30O27k75R3K9K17o98N69p7n92N64M89n57m13O91m62k21O14k46J7
2997i6N5L51j071P21J74k07l01M21J93m50N21l82j89J59O30m79m98N66k97L05
3017A26J93k32m60N67n6m37K47PK15K27j86q22N24P56q37J59L05j66m17O24l43
3038fm49J020l07o18j8O15p80O56M12p09j04O73n25k52N69n0n88O80k65o58N97
3059a07M85q15N36L57q90K09N46m75m97J347p09o04M82K37m83N02M40j118M81
3078g6N26o08q3O89l41l61O53m59k15N80j95k77K43L64o36K17K79k44j56N53n14
3099f1l54R76o29L2L66o9m25L79J69p72O52J83l69j40M69n17j37Q41m92k65M36
3120B73R4q35L42L40m55K78K17r8q57N37J58m55M91J41n57K38M67r93M08M55j50
$$ y = [495, -135, -465, 162, -113, -20, 9, 226, -472, 97, 20, -572, -8, 481, -76, -489, 202, -260, -481, 133, -113, -96, -41, 310, -761, -40, 134, -73, -374, 47, 240, -210, 311, -71, -260, -101, 529, 50, -448, 118, -179, 126, 319, 87, -373, 194, 138, -299, -52, -45, 170, 397, 211, -611, -87, 669, -168, -9, 296, 130, -287, 337, -6, -455, 565, 258, -360, -378, 237, -543, 113, 525, -184, -288, 385, -140, -392, 177, 127, -461, 219, -46, -704, -107, 378, -437, 99, 456, -434, -225, 321, -154, -651, 696, -13, -617, -135, 102, -381, 121, 561, -557, -76, 450, -158, -241, 448, 107, -254, 399, -60, -275, 305, 110, -167, 76, 440, -196, 21, 300, 56, -100, 453, -61, -415, 561, -68, -36, 330, 261, -164, 215, 384, -388, 264, 447, 78, -62, 407, -110, -247, 594, 102, -163, 273, 367, -468, -126, 214, -241, 37, 254, 156, -701, -164, -6, -461, 30, 171, -386, -148, 319, -674, -266, 189, 39]
3141C9l07K08j27r6L41j08l24M33Q5p26J15O82n94L67M73q28M6P34l44m85P50
3162C34j77l03l2L57p00M68O52j053J69O39l56k72P28o39m1Q38o69k68K80O72
3182F27p00J34K82p88N08M53n66k96J116p75l79O34l05k25O32o9m39K26K39n29
3202b20J35M48l71m09R32q22m03R28j61m75M99J13j015R65K3l85J23N81l44o01
3222d59N04k53J04M88n44m75P21Po59Q02j91J2MJ92m80j49P11k17m4m1K13n10
3244b64L25L60p04L80N46n07n10N87k20J84K36l23j06L5L99p24R9O21m94J37L09
3265C66p35M1P53l96m12O81l16j67J26P1q9K61L08p77k58P72l4q00J141o29l43
3286d36O73k68k32L71N94j011N43mp49j46J104q16m03J354q34o78J163n05l06
$$ y = [39, -268, -60, -187, -283, 58, -50, -374, 59, 144, -582, -467, 215, -379, -12, 461, -367, -321, 413, 69, -416, 334, 157, -146, -178, 179, -521, -53, 599, -454, -285, 354, -2, -274, 454, -185, -226, 612, -57, -325, -45, 627, -73, 61, 343, -445, 63, 516, -50, -346, 770, -5, -384, 250, -55, -280, 352, 283, -156, 70, 309, -220, -85, 363, -8, -417, 515, -307, -710, 218, 57, -418, 81, 194, -821, 144, 167, -218, -95, 486, 142, -459, 45, -208, -104, 384, -160, -635, 86, 93, -566, 236, 45, 57, 61, 253, -227, -376, 335, 118, 74, 33, 246, -264, 61, 421, -283, 97, 643, 136, -374, 213, -7, 177, 413, 90, -16, 19, 418, -306, -207, 414, -80, 57, 366, -369, -328, 425, 29, -383, 298, -18, -185, -59, 12, -77, 184, 492, -285, -543, 229, 195, -605, 536, -93, -436, 237, -31, -263, 108, 702, -309, 234, 230, -519, -665, 439, -377, -780, 574, -260, -938, 225, -280, -586]
3305e86K99R64j269L59q5N85k11K25l65k90M68O4n13O08j06m63P51l8q10P37k7
3326B97m16J35M67m31l24N32R4l97L54L05r25K86L59o19N79r2k22OL33o29L18
3347A0M75o69k3K67O5o73Q12J4p69N35L36m14l39O62o69J69M56l86k35J01M15
3368A40k41k5M26l34l28N65l77k74P81m91J7J39l07Q6K15J62l60J49J34m9l28
3389c00M12k45r9P61o37l39O98O2n36L32J59m71K42J91l95j09P76j56o77P73n43
3410a01k36N00J24p17P02Q4p73L88J63m9k35M86l90l10O24r8n07M92N7q00O93
3431I7k4o08M77M74p72Q7M69l21J5L45k49j75L84j7p89P56K75n07l8L73m43p1
3453b62O24n27j60L03K65m95K46O7k70M53K12o37L9O73o14l9N87p43N14n6o6m53
$$ y = [-586, -287, 677, -592, -233, -318, 267, 56, 281, -84, -374, 94, 158, -355, 253, 147, -316, 435, 397, -413, 324, 297, -119, 16, 483, 52, -272, 260, 354, -43, 311, 616, -309, -23, 336, -283, 296, 204, -18, -12, 321, -308, 10, 485, -184, -207, 60, 125, -548, 264, 278, -491, 44, 380, -34, -373, 289, -380, -211, 245, -141, -376, -275, 140, -101, -126, 300, -34, -362, 203, -174, -448, 333, -158, -141, -2, -309, -223, -8, 154, -206, -57, 77, 28, -300, 112, -133, -232, 529, -108, -447, 251, 313, -223, 109, 268, -203, 39, 230, -165, -274, 502, 346, -331, 442, -101, -337, 163, 287, -430, 272, 356, -417, -29, 134, 85, -150, 336, -54, -364, 260, 162, -345, 147, 204, -596, 97, 73, -535, -58, 416, -356, -269, 200, -121, -106, 239, -10, -185, 199, 182, -607, 149, 424, -83, -121, 252, -191, -262, 362, -165, -325, -22, 243, -252, -6, 61, -209, 244, 456, -181, -142, 531, -83, -122, 465, -278, 236, 180, 114, -339]
3475c39L85L88m64J61J51k65k41O55n30K55M59l94l43K00K63m98K94K04m51r8
3495b08O14m14l37P19k00k45K85k89l32M52J59m64M30q4m38J59K29p5k42N76n42
3516b47j43K01J84l94O14k71m93N22p4j61j70O44m91m1L84n30l2N08P6m03L23
3537FK49p77N15K64n40K38M43o44r4O46o52K64L00j04m20N47O9p07L71L86l63
3558cQ5N97q82KQ62o64j00L15J25o56M75K85m87K37j09j50l0N23o55L54J74n61
3580b63K83L82m48k50L08J51j89p6J74l34J25O75q76r5Q57n47l6J82J96l39N18
3601C98k24n01J21M42j45k05K83n6k50J06j4l63N36K74o65K34j25J01k35N14j59
3622F7k1L27l45k16L00J74m79N62p1o54O33L7k93k37N75k59n0j77Q3o8M76j37
$$ y = [-339, 46, 434, -30, 131, 282, 17, -224, 431, -99, 156, 615, 221, -122, 78, 341, -157, 137, 341, -110, -208, 406, -8, -345, 374, 174, -71, 214, -75, -407, 45, 204, -260, 170, 86, -352, -193, 36, -39, -281, 295, -247, -390, -189, -5, -399, 215, -56, -549, -27, -101, -262, -432, 212, -279, -320, 64, -466, -498, 10, 86, -317, 6, 255, -522, -7, 257, -283, -45, 398, -246, -340, 306, -346, -82, 218, 114, -306, 241, 310, -397, -26, 360, -3, 82, 679, -203, -201, 661, -3, -103, 212, 337, -319, 156, 441, -46, 191, 82, -68, -98, 425, -230, 124, 298, -263, 20, 402, -46, -296, 12, 163, -26, -102, 72, -262, -137, 538, -338, -433, 424, -123, -159, 23, 219, -120, 398, 174, -327, -206, 236, 91, -114, 169, 113, -137, -31, -45, -408, 128, 402, -263, -29, -154, -53, -288, 226, 67, 46, 373, 28, -188, 112, 286, -193, 369, 298, -356, 277, 314, 21, -216, 359, 100, 50, -127, -44, -112, 364, 227]
3644B27o07K49L18k65J79K29n91L75J44n03j28M26j82q2K09J77n58L32J08l43
3664b86J2O80o21j03O07p05K57K73l01k07M31K06o26J77L43m44L05M75r36J47
3684c16Q02o83lL85l23k13M01N5m58Q22j62l85j80M51k16J22L13m76q9M24j34
3705A37n25O79j59q6J95j80k46L57M82m27k93K45k37j99L49p2m8N70k38o53M77
3726A28n1J1j33L83m54k0M50l19l19M16J44m87M75j43m20J71K73k59L5J84k06
3747a41oJ18j38j20M60j64l67K44L11m41J36M20p32J43O03o25Q2K92j4l65M20
3768A16j00m01N42L34m42k35Q41p66k49P40n03o0N06k08n96O49Kk66K54j11k3
3789B4j46L82n96M01L67m73k2M25l67k80O55m27l03K46N40n39r2M10k83Q3K70
$$ y = [227, -380, -131, 187, -78, 101, 330, -261, 114, 258, -245, -373, 53, -129, -211, -2, 175, -383, -51, 57, -286, -274, 406, -215, -318, 289, -416, -159, 114, -187, -394, 37, 243, -383, -206, 137, -307, -2, 473, -463, -316, 486, -197, -200, 185, -138, -351, 50, 105, -353, 469, 307, -78, -258, 193, -23, 99, 412, -64, -153, 271, 137, -388, 291, 132, 46, 241, 61, -185, 172, 654, 227, -66, 179, -58, -257, 92, 20, -28, 542, 304, -349, 128, 77, 88, -45, 338, -116, -136, 314, -5, -324, 92, 236, -251, 224, 81, -339, -168, 105, -154, -119, 65, -141, -147, -29, -167, -287, 173, 9, -358, -114, 197, -244, -108, 312, -420, -277, 326, -299, -217, 75, 61, -304, 116, 16, -385, 157, 491, 49, -186, 655, -111, -360, 380, -123, -183, 323, 115, -481, 168, 170, -96, 158, 47, 24, -122, 260, -336, 65, 432, -41, -63, 362, -5, -285, 370, -57, -360, -114, 426, -113, -205, 205, -78, 5, 275]
3810B75l20n89Q57j9l61K54k08j83L38N8m28L90K40k92k09K51N7l59L80k08j80
3831b56M17j08j77J76O0r3j31J89j88O5L3J25l24M13qm99N12n4m26K64L70m61
3853a01L56r8l17K08J13J12n14L86n0l54M28K99o35K01N09p17K26J25j60l56M60
3874A21j22j41L13k10j57K88K23n06K6M90o82J89M14m58j06N41j55o88O81J05
3894A66k75J40K61m93j65N50m83J51M50n16j80N75l14l06O88P0o41K96J27l22
3914b21R0L87m87J82K80j27n48P86j42n30O06k72l18L65N58p13R1K50k66J34k0
3935H5J84m00N19k10m26L72p0j72K72P3l52K50L65p10q6O45m0o48N24k65j29J51
3957f8J32l76L16L20n86k7L38k08K73J60j45n53O08j74j2j92L69j47J1J70o22
$$ y = [275, -45, -634, 223, 204, -157, 97, -111, -294, 44, 102, -326, 64, 304, 12, -197, 54, 111, -248, 132, -76, -256, 161, 53, -124, 52, 112, 19, -112, 77, -111, -46, -13, 112, -212, 201, 193, -306, 206, 152, -274, -10, 360, -101, 255, 157, -160, 48, 161, 273, -241, 145, 95, -259, 169, 468, -167, 34, 543, -174, 52, 177, 17, -339, 121, -1, -142, 171, -39, -196, 92, 315, -191, -165, 325, -357, -168, 246, -212, -318, 223, 68, -620, 61, 166, -109, 31, 292, -201, -366, 184, -299, -148, 302, -214, -394, 181, -133, -439, 249, 319, -322, -26, 101, -221, -131, 256, -231, -49, 231, 104, -444, 342, 200, -330, 276, 4, -314, 51, 609, -104, -13, 237, -29, 105, 85, 269, -131, 388, 178, -248, 124, 54, -118, 154, 227, -125, 125, 490, -220, -306, 339, 299, -349, 175, -90, -219, -68, 64, -312, 4, 324, -262, -289, 49, -159, 114, 274, 129, -424, 184, 10, -2, -194, 175, 28, 39, 209, -413]
3978d13K54L02k6k83K96k07o5K86l08l5J28K57n79K73L83k96J16J61k12k85O35
3999C82k41l81M80m4j82k8L63m28m9N13m87l7N95j66m06K65k89J63Q2J78n67J20
4021a64N95n76N2L75m69J82K74p8o91Q23j10l58m1K52k69N7L01n98L77K42m87
4042c11j51N74j9j39J79l59LK55N2NN4j8n53L98K11n11J80N20l06l70M57k26l4
4065a09K23K03n73K12M67p38K72K67m1n04N42r5l37L02J05j41j14L32k44j33K85
4086A81l58L04K64j97k68K11j60j81M17J32l73O5L13o25J75L32j30p0K5O4n02
4107c81O69l87j07J96K35m81J99K05l33Q3K60m14k20N65Mn26N10o5k87L60J96
4128B81n99K02N28n66K2K16j39k60M80j83m62O70M1k80p4K29m82M63L22m77j3
$$ y = [-413, -159, 143, 117, -166, 130, -77, -142, 144, -164, -199, -71, 186, -393, -120, 263, -33, 83, 244, 32, -253, 382, 141, -240, 240, 196, 14, -14, 349, -79, -128, 385, -102, -139, 456, 290, -116, 149, -140, 23, 105, 283, -284, -164, 431, -145, -93, 282, -187, -5, 269, 191, -500, 323, 213, -145, -186, 66, -203, -146, 155, -443, -66, 176, -311, -462, 112, 93, -46, 133, -226, -223, 32, 84, 89, 143, 125, -428, -30, 181, -330, -150, 370, 64, -306, 151, -75, -109, 114, 317, -256, -44, 423, -315, -43, 224, 183, -321, 221, 126, -211, 91, 196, 55, -59, 273, 29, -104, 181, -177, 127, 391, 194, -74, 137, -23, -204, 213, 345, -28, 37, 350, -275, -100, 232, 102, 32, 57, 121, -381, 288, -99, -206, -10, 225, -256, -57, 148, -185, -102, 158, -256, -476, 89, 93, -433, 77, 12, -275, 85, 281, -318, -116, 412, -154, -132, 84, -55, -315, 165, -18, -480, 190, 231, -49, -123, 106, -376, 87, 409, -68, -81]
4149h1K94j77k80N52l55k77L97Q3m04K66L74o75K51J54k44M3L01l21l99P85k69
4170A8j65J15K62l28M40k64l60L46J72k20k14L01j34r2L28l21p1L01K37q29L49
4191a29M14n55L25J20j58j45M09l63j61N05k94Kk1J77m48J83M61m05k16M20J36
4212B57l71K24n3l91L58k4j75K00K80n18K00k00K19J6L16l39l88O92k65o8J63
4233A33O9k68L95M7p36N14Q9o6j95K08j14j34K44j57k51L51K34n54K43J14k93
4254a27K38K45m77o2M41j83k65K80l53M2L07M6o20K89M36n80J75J82j29L4K37
4275A56k08l10N84m26J60J1L6j11L02k2m56M25k99J56j73M45k76r5L45l44j94
4296b94L74L15o74L71p4j59J74J31q3j65L52o9l15N21l78n7R8o0k49L20j2k37
$$ y = [-81, 213, 36, -244, 308, -47, -324, 73, 156, -248, 18, 392, -283, -32, 122, -122, -79, 222, -99, -498, 287, 18, -147, -32, 230, -98, 342, 78, -282, 64, 236, 16, -198, 103, -31, -123, 205, -116, -187, 114, 351, -478, -129, 285, -270, 55, 175, 17, -128, 281, -82, -243, 262, -32, -30, -51, 126, -322, -139, 322, -83, -299, 121, 257, -114, 110, 57, -334, 24, 0, -175, 25, 305, -213, -13, -213, 6, 22, 338, -1, -389, 303, 38, -30, 133, 202, -66, 329, 376, -360, 154, 243, 177, -18, 190, 76, -58, 186, 29, -222, 129, 363, -191, 52, 166, -127, 111, 356, -121, -183, 258, 75, -190, 90, -263, -221, 86, 132, -488, -199, 237, -343, -168, 14, -115, -81, 156, -52, -362, 222, -204, -44, -33, 3, -108, 194, 172, -284, 141, -158, -2, -175, 270, -6, -101, 244, -100, -294, 80, 395, -279, 92, 18, -141, 33, 164, 81, -84, 268, 199, -116, 405, 27, -30, 68, 8, -241, 79, 67, -170]
4318a70J39K70r2k35J57j74LK94J81m88O5M51o05J16P9R7k82K68j21j39L54j25
4340D3j18P5J75m47L35K47n50L04J05j96k18M25m48K0L52j61m0LJ65k58J01K85
4362A99l70J71M31m78m40O57k85J20J8p1p1J63P7l11R5K24k12kK53o1k15N60n23
4385g1j18M72j61k54Q2L21n26L32J18k00J2L48k32j16N5j17o8L05j45n18N84O6
4407A69k15K66r1l61J60N5q2L0K19l08n1J33K71m79L70N9m82L67K73k51l53M41
4429A40l75K56P9k19n7J77L07q42M08J85k72J82K57k82J2M10n46P4J40N4k1j75
4451a08K31k93L74J44m88J83K41j78l09O26n47J69R7j75q9R3J20j96J15J95k72
4472f7o0L22k06k52O75l61j29J85j46L0J71n8k36L30j38j18j51L82l43n0M68l09
$$ y = [-170, -31, 239, 147, -88, 69, -105, -102, 192, 373, -115, -50, 401, -204, -88, -9, 88, -194, 74, -47, -186, 168, 43, -75, 0, 175, -272, 63, 310, -240, 64, 169, -27, -245, 180, -268, -248, 104, -57, -97, -94, 71, -187, -86, 199, -171, 0, 431, -47, -487, 170, -115, 5, 23, -48, -119, 44, 121, -190, -95, 129, -83, -85, 168, 107, -108, 452, -71, -189, 283, 122, -132, -50, 271, -255, 77, 195, -5, 7, 355, 123, 7, 62, -55, -123, 182, 37, -481, 103, 169, -46, 220, 129, -232, -72, -17, -99, -69, 150, -158, -209, -76, 195, -284, 86, 145, -337, 30, 303, 52, -301, 140, -235, 21, 100, -119, -176, 1, 308, -534, -126, 59, -213, -31, 226, -56, -44, 366, -180, -106, 34, 88, 67, -108, 123, -170, 204, 348, -140, 43, 284, 106, -203, 423, -124, 45, 142, -33, -122, -29, 91, -105, 10, 205, -67, -127, 195, -11, -263, 412, 51, -78, 107, -39, -9, 162, 104, -132, 198, 60, -58, -209, 173, -170, -220, 248, -61]
4494f1q9L60l4m29J22J95j32Q6L3l70K23M23k81k70J86r4j31K97J34m93L05J62
4516A42l09%L12j96J85J37m45J28L51j09n78L12J30m34M65jk79L01K26m01J1L21
4538B69l26K79j38K6j63J6L83n09K59m7j47J32J31n05JM69j11k25J82J31l80L44
4560G1J31m24L71Jk84L8J92Mk78L82j58q9k0J84m18J76M32p6k74J73k01j58L84
4583A59k18k55N24k08j24MK69m23L70Ol11J84K23j93j27M26m07L0J74r3r1K17
4605A36J47k66K67R7l48J49Q5l78O4M71l38k13K11L6j23P6J56n74M22K01l66K2
4627f6L70l38RL98k20l16J93J65m60J85K44l13L21j41j49K06J14m92J64L24l33
4648a35M3R9J23l32K74q9j83J76Q6O7k68K60n28J85L73j52j35J89j14j31K71l13
$$ y = [-61, -150, 210, 176, -253, -131, 64, -68, 18, 51, -319, -96, 327, 46, -224, -38, -132, -263, 34, 168, -325, -20, 142, -167, -167, 145, -51, 134, 271, -174, -46, 305, 196, -382, -70, 60, -374, 91, 90, -189, 112, 338, -63, -52, 269, -57, 222, 84, 110, -53, -37, 346, -163, 96, 49, -98, 34, 165, -340, -339, 130, 19, -206, -24, 107, -273, 71, 202, -222, 149, 150, -134, -96, 96, 100, -178, 204, 46, -43, -63, 121, -297, -121, 311, 235, -39, 134, -67, -225, 159, -59, -314, 210, 2, -122, -118, 151, -272, 98, 104, -207, -23, 200, 7, -120, 306, -101, -71, 103, 10, -81, 136, 283, 17, 284, 381, 33, 182, 267, -111, -47, 424, 86, -127, 84, 120, -3, 73, 229, -345, 77, 278, -88, -66, 304, -34, -25, 373, 153, -163, 30, 195, -265, -80, 164, -149, 172, 31, -118, 88, 202, -290, -126, 198, -135, -92, 7, 130, -202, 72, -17, -200, -24, 62, 129, -139, 121, -407, -222, 151, -1, -136, 53, -61, -192, 79, -234]
4670b34J91j27L28l97r1L20J44k61L53j75j55K62K4l08J00J75L2k99K72j31j87
4691a64L31l04K1K35k9j46J62R6l72K99J2j67j4N3L0N9J46k76J01J29m7k78L28
4714B05q3j28J16j94J11j77M11l15k9J31N6k46K89k25l4J05L54o57K82J59m52
4735c21L23J27j27k7J28l21K8L56j64j99N8J48k7M7L8j31j45M33m22J56J60j94
4757g6m4K13J61m47L48%j26j75L56k85O5K92m89L20q7J23l20L33q9k51M21L4l81
4780a04j9L95k32q1K69l75K54k24j42RK83L1l86L15n6M8k48M69l54jK44m9j77
4803a31O5K53l66K69j29n3K80n3K8l11K83k74o9J26n7j3J59m2j43K14k76J50J35
4826D5O4r5p2J21Pm7j1J32l34K99J73k33Q7O3k36L11k0m59J45L81k99K12O8k98
$$ y = [-234, -43, -170, 158, -239, -330, -10, 134, -127, 226, 51, -104, 158, 182, -126, -26, 149, 181, -118, 154, 23, -164, 167, -137, -116, 119, 90, -56, 106, 202, -170, 129, 141, -26, -40, 13, 43, 102, 248, -28, 73, 202, 155, -123, 205, 122, -6, 110, -84, 27, -150, 261, -54, -83, 48, 104, -142, 147, -78, -112, -7, 347, -310, -28, 131, -321, 2, 129, 2, -25, 103, -218, -190, 166, 2, -197, -139, 9, -18, 29, 67, -64, -209, 224, -198, -42, 118, -76, -120, 93, 254, -193, 155, 155, 29, -146, 210, -75, -10, 282, -207, 113, 26, 149, -171, 162, 73, -178, 243, 277, -104, -123, 272, 40, -41, 228, -147, 107, -117, -259, -250, 33, 64, -322, -7, -63, -15, -263, 206, -148, -149, 95, 46, -131, -66, 187, -179, 90, -39, -92, 188, 135, 163, -148, 135, -139, -208, -82, -139, -152, 7, -35, -178, 36, -240, -90, 45, 109, 14, -58, 63, 70, 23, 12, 144, -190, 109, 282, 49, 136, 199, -37, 274, 254, -205, -60, 321, 22, 234, 302, 4]
4850Do1L34j96k39J66L4r5L0L00n74M18k0j53J54nj99J87M0j02k68L26J27k34
4873b6%Q0j87J18K14l92K55n5m1j68L66j05q7l8J55k65j10M40m24J45M3J00j19
4896a01K15k19j36M31P4l93K38q3j91J91K61l46M6L56k59m00M09N6l66M25r9k21
4918a12J63J60k86o5L56j50k28LJ73k06L02K84m33P7J7n8k4j11K4L38m5k09j28
4941a58M64r5l99L03L4l03K47r0j02k2L38l98%J81l7k90O05j55k22K03j67j39
4963b02K35P1k97J88J35m69J82K70r5j67L98j20l78L56Q7l43K54J65l80J14J74
4984A78J8k23J59j76k7J84K3o2N4k57K31j06J24j30J32J58l00nK29k09l20M74
5006A49l3j81K45j72n6j50L06l32K24L57k09o7j1K9j90M22l86o2J16r4q9O5J68
$$ y = [4, -57, 277, 81, -158, 8, 42, -53, -23, 277, -297, 121, 101, -52, 102, 97, -102, 85, 125, 23, -245, 81, 208, -26, -26, 54, -133, -15, 199, -193, 62, 7, -34, -202, 164, 59, -28, -66, 89, -176, -286, 154, -270, -125, -82, 18, -101, 114, -105, -241, 190, 264, -129, 109, 26, -165, 26, 287, -59, -13, 343, 84, -316, 93, 149, -217, 208, 109, -112, 51, 211, -75, -140, 216, 66, -162, -159, 14, -192, 110, 394, -39, 38, 55, -3, -27, -138, -114, 224, 179, -30, -158, 306, 211, -188, 115, 149, -154, 93, 3, -99, -121, 217, -181, -181, 0, -37, -327, 278, 123, -99, 104, -63, -202, 33, 104, -193, -5, 130, -339, -157, 113, 18, -149, 249, 129, -249, 107, 194, -149, 105, 270, -110, 4, 178, 196, -27, 132, -44, -71, 113, 136, 74, 128, -129, 102, -4, 120, -10, 122, 280, -20, -25, 204, -5, -325, 149, 116, -65, 180, 8, -48, -198, 108, -224, 0, 357, 148, 81, 70, 99, -91, 331, -55, -117, -1, -95, -184, -119, 49]
5029D9k72J08J21J02l35K97j84o7J51J67k68O2l4o9J34L60l38J36j72j56R4K25
5051A11j35j25J75j49J02M2O1k57L35J46k14j43J79kk38K89k9k55J46n5l2N3J90
5074A95k2m6n5Oq4L70k62k99L82l06l6L99k81j86J30M06l78J80R5j99L2J35j65
5097A1k94L45j04p9R3J06l25K04M2K8m4N2j79j07R6J01p7J20J9j95J33J7q9K13
5121H7K47k95j4K72j99k56L10k23l1J75k04J49n4J02K7J31J57l49J5K62O7j80
5143A96K83q16L71R0k00L1r9K57o16M44j21L91j75O47m85%j25m81L97k94L48m02
5165c59j31O06j87J26M9l08J66q3K53j42K04k55n9J06K29l74L20j12k79L26k31
5186a35N3j20K13L9j59K38k52J04J20q7o7K31j31j07oK54l08J07n5o9j58N43r3
$$ y = [49, -223, -115, 6, 108, -227, 70, -114, -181, -30, 137, -131, -69, -103, -172, -38, 322, -16, 120, -52, -208, -114, 111, -24, -149, 26, -123, -21, 21, 82, -175, 160, 306, 92, -51, 128, 126, -112, 177, 148, -107, 39, -16, -48, 5, 195, 173, 127, 72, 78, -6, 364, 102, -197, 185, -121, -157, 242, -39, -225, -95, 311, -67, 113, 208, 9, 41, 176, 11, -283, 62, -42, -121, -28, 78, -247, -43, -1, 27, -17, 35, -144, -251, -155, -54, -131, -11, 8, -187, -54, -37, -126, 87, 334, 39, 25, 297, 98, -158, 152, -71, -102, 73, -131, 18, -36, 66, 93, 224, 381, 32, 47, 309, 376, 196, 479, -337, 34, 124, -76, -45, -144, 113, -503, -59, -180, 211, 36, 683, 198, 198, 73, -408, -11, -305, 43, -359, -490, 116, -71, 55, 104, -204, -38, -121, 132, -10, 194, -61, -120, -14, 215, -159, 161, 49, -230, 96, -135, -82, -202, 11, 50, -109, 129, -123, -19, 101, 14, -53, 178, 47, -60, -66, 188, -120, -13, -68, -137, -295, 248, 155]
5209A55p6nJ77m70J9M08j79K3K36k49k51K54q7O0K12k07l8J76j23K8k5l7p3k9
5233a01J52J10m18M69j66l57L39J43n20K01L48m14L04K88n30n2J91j10M4l7J01
5254a5l9J66K7l64J85J12j26lL1p5%J39n3l7J35k0j21J2R2P0J04k23nj25L23j68
5280B2j1M7r3j20K41j31j79J98K59l58K3J72m37M16J58k04r3J55J6n0r3R4k00
5303a68j18L39k55k2L49j17j48L27k65K2K54k84j01J73P6k35J91j42R7KJ34j96
5325h7L9L38l71oK17m1l17L18p3n8j8L14l08j8P1%k83K51J82j10J61j33k00K31
5349I9j8q4K41j79j67J54J82j59jm7j09p8K56J04l61J25K31l97K50K59k71j6R7
5372A11l0k25M36l79P1J92r1k03Q5K6r9K31j11m06J80M34k38J7K63j44k65J92
$$ y = [155, 79, 74, 251, -219, -200, 208, 29, 52, 288, 39, -212, 42, -45, 15, 227, 20, -18, 158, 35, 63, 38, 1, -72, -101, 51, 161, -257, 212, 46, -311, 28, 171, -349, -148, 200, -214, 90, 378, -152, -204, -13, -123, -79, -116, -15, -54, 112, 139, -225, -40, 72, -54, -57, -26, -101, -101, 38, -15, -52, 83, 63, -58, -46, 46, 116, 220, -3, -8, -133, 190, 22, 11, 58, -35, -155, 86, -45, -224, -26, 233, -125, -102, 70, -367, 49, 207, 3, -90, 65, 81, 31, -62, 32, -168, -286, 53, -202, -224, 125, 8, -140, 187, -78, -56, 198, -86, -187, -14, 62, -173, 18, -124, -27, -25, 109, -87, -48, 290, -81, -87, 130, 89, -228, 90, 17, -41, -59, 255, -53, -71, 0, 0, -283, -32, 150, 40, 201, 68, -132, 99, 81, -3, 238, 59, -108, 46, 228, 69, 68, 21, -88, -166, 90, 194, -167, -42, 189, -208, 42, 301, 30, 14, 111, 81, -144, 292, -87, -16, 176, 85, -118, -33, -7, -106, 125, 14, -392, -212, 222, -16, 1, 264, 120, -145, 47]
5394D7k22R2o3o0J57j09O7N7j53L13k28oM4K1j14J05k9p8J05J17j13K7J89q0k97
5419b11K33K15l42K85P9n50K67l4L7K22l99K52J34k39N8j83k92K82l20Q35l30
5440am58O76M5m51M15K81o51K77j37j64l81R31k73l58L92n0q5J68pq6p9J01k04
5463i9l4L34j08k91M48j66j45j61j37L50j05L46l22p1L56k58r0O08o08J75J79
5484B01l7q7J29j99l1K50l37jJ82j78k12K76K26k90J37J97k24N3k66K43J16r5
5506E3N9l36l58L47L21j77O5o3K03p9nqJ84J95o34M34K07l81J74o8n32N00k51
5529a50M94n06N27l66J93k33K76k97J00J39k60O4J35R23j159R7J04M3j60J89o8
5550H5L49k54k36q1M2k03k27P84l58j42M76K18k94k30j18M60m80Q38o04K2K46
$$ y = [47, -175, -83, -146, -206, -49, -158, -91, -34, -187, 126, -102, -108, -64, -43, -157, -52, -81, -159, -54, 63, -50, -23, 166, 86, -211, 22, 237, -105, 180, 259, -291, -24, -58, -21, 201, -198, 54, 188, -51, 7, -176, -468, -186, -506, 329, -1, -459, 217, 262, -189, 226, 507, -144, 133, -4, -168, -549, 382, 109, -249, 143, 93, 8, 176, 169, 83, 4, 105, -99, -133, 201, 93, -198, 250, 84, -61, -222, -359, -9, -114, 232, -90, -161, 195, -63, -153, 455, -153, 22, 201, 164, 77, 206, 7, -24, 226, -111, -112, 70, -108, -320, -44, 182, -108, 29, 226, 2, 55, -211, 32, 148, 53, 112, -224, -582, -235, 86, -91, -26, -89, 114, 35, 30, 22, 206, 401, -233, 201, 408, 27, 201, 133, -399, 101, -150, 344, -162, 365, -1, 192, -41, 235, -62, 38, 177, -83, -19, 116, 1039, -120, -23, 81, 124, -36, 153, 85, 434, 180, -56, -137, -95, -298, -525, 259, -99, -241, 235, 453, 159, -71, -189, 271, -209, 629, 25, 47, 293]
5571B93O9r76N16J98l9l53L57j67L21j40l77J66K40j61p2K97k29NK82m13J14K43
5593A74L1k9k68M14k24M6K62m40K01P6j99j03J94o9J71m3k32j3J00k20N7K3J95
5616A04r1n0J55l74K13L34m26M7K52j55R3k07J74j80K12j07j09o2L16k44L6o0
5638a29q4J05K79j18k36J40M4k05J16l8j39K98m5K11k99J75J9k53J57J04l50L27
5660G9k47j30K27J40j81M1km5J88J19j14k30Q3K40l63L10M4n7j22K06l76M9K96
5683A55k10n2J02K99k83n1J01k34L83j40j04L9M8j74n3J76p3O5J95j01j19J00
5705F9j06r5J15J82m93L62O8j46N8M9J96j08P1k52j73K13Pq5N6J30j49R5j15o2
5729a13J0L68l80M0J44j51K49k13j0k1K13L4m49L54J32k76J40L5o8K5L10l52p6
$$ y = [293, 362, -614, -98, 100, 61, -292, 65, -102, 219, 79, -298, -132, 108, -53, -125, 172, -57, -52, 230, -183, -69, 174, 205, 176, -92, 322, 98, 144, 406, -34, 167, 243, 44, -59, 135, 66, 237, 194, -38, -51, 49, -171, -114, -91, 104, 13, -37, 118, -256, -43, 291, -135, -88, 164, 9, 102, -105, 69, -111, 101, -6, -115, -177, 139, -105, -69, -129, -213, -108, 171, 53, -183, -43, 1, -204, -88, -126, -265, 33, -12, 199, -100, 75, 94, -159, -2, 102, -248, 79, -168, -298, -71, 69, -112, -71, -73, -118, 70, 189, 75, -155, -72, 168, -195, 115, 159, 102, -20, 186, -190, -141, 155, -55, -107, -5, 294, 11, -40, 61, -173, 210, 70, -34, 5, 53, -121, -174, 2, -71, -6, 189, 88, -31, 69, -37, -132, -17, 165, -328, 34, 102, -44, 14, 63, 259, 151, 222, -30, -203, 10, 17, -68, -12, 118, -31, 64, -51, -113, -103, 265, -115, -75, 69, -82, 167, -46, -56, -77, 136, 170, -279, 75, 207, -69, 71, 106, 38, 63, 373, 21, -55]
5752e5J57K1j86j63K96k03Q7K30n0k88K37k41J0mL01l40J31K61l17j8N8J84k28
5775a20L5q1J56l0o1o6L43j45j93J06k5R7J9k64K0K22J26k48R0K25j35oN5k9l27
5800b36L74j59Jl6Q8j86L00J01l28Q0R5Q6l17J86j25k9J40J5N5j54L17m53K0K09
5824D4P3p6pJ25k41K34L1k45l7L81k13p1J73j34j0O9N0j31J61j37j58K09P1j6
5848A45K2j7j02j51K3L7l8K7J08j32J72O8k28J12q9M2o3L4L6j23K4J4l4K31q2
5873C6j52K02j86j9K85j38p7J35K16k76L3J01l01J49O0j33j79K76P2j14J02j40
5895d8K40K1j54k03j85O05k58j97K80l2k58M96m11Q7K7Q8p2j74J18j83J16M02
5917C05l01r1K43k86m2J54J19l11M04r3k55J60J28m11L71k1J4l75L13R3l35L38
$$ y = [-55, 102, 123, -63, -226, 70, -133, -46, 184, 134, -154, 83, -158, -148, -152, 149, -191, -60, 201, -116, -134, -76, 108, -120, -85, -166, -10, -40, -101, -167, 176, 31, -162, -56, -81, 16, 35, -229, -209, 13, 139, -109, -19, 206, 71, 65, 120, 91, -236, 138, -21, -20, -56, 32, -154, 146, 247, -81, -1, 94, 180, -137, 49, -76, -105, 35, 50, 105, -49, 268, -185, -165, 44, 117, 41, 34, 159, -82, 152, 183, -62, -99, 282, 69, -2, 171, 37, 27, 96, 146, 15, 176, 39, -119, 90, 161, 145, 167, 150, 48, -103, -80, -43, -81, -54, 54, -78, 94, 162, -66, 46, -43, -1, -64, -30, 6, -117, -93, -79, -113, 118, 36, -116, 86, -100, -119, 166, 28, -49, 86, 302, 26, 59, 160, -141, 8, 68, -65, -244, 32, 104, -10, 92, -48, 192, 213, 59, -144, -329, 276, 18, -179, 101, 69, -189, 307, -104, -17, 10, 98, 26, -148, -30, -213, -97, 305, 4, -87, 156, -130, -172, -18, 101, -210, 194, 101, -154, 6, 134, -277, 94, 73, 87, -288, 25, 118, -217, 121]
5939A21k00j17l1M03l67K08Q0j45J14J4k13M0M6m2j9R1N5o1K41p7k96M3L65k66
5963a3j0J78k24l5L40j35k25J49R8l45K83R8j25rJ23j12n6J82j01q7j18K02j7
5986D1K33j27m0k09K02m8k59M85l45j45K21Qj14K46J76o55L14j8j00R1K03l52
6008a92J50L2M4j61K18pk94J97K63k74n6q3J52J2L4j36J77n5j72m0M06l55J18
6031b2p3K62l06J29K88l92nK34j47j87K72J6N3L9Q8j76J57p4j45L0Q7l07K24M2
6055H7j21j06L78k46O5J5K0l53K16M5o6O3k2q1J40M8p5r8M4n2P1O5J4R8j81J13
6081H1j48Q3nJ06j57J79j24k19J94N0k59K45p0O2R4L2k32N6P3O8j33j56K59l23
6105b44L20L3j26k8Q1j50J26J00k84K41N2j19j60J90L2k32J75K51m24L11J7k63
$$ y = [121, -79, -196, -227, 176, -191, 17, 97, -48, 66, 80, -133, -93, -47, -89, -108, -17, 38, -23, 218, 141, -155, -112, 253, -13, -23, 155, -69, -104, 236, 101, -124, 25, 123, -222, 61, 159, 34, 25, 148, 36, -20, 162, 61, -26, -144, 58, 41, 274, 147, 107, -102, 100, 52, -207, 278, -67, -212, 9, 17, -97, 149, 325, -330, -16, -34, -134, -43, 160, -192, -42, -10, 34, -127, 91, 84, -210, -13, 250, -24, -80, -163, -11, 1, 35, -101, 76, 21, -151, -191, 215, -140, -22, -95, 167, -139, -10, 278, -114, -119, 115, -32, -219, 53, 69, 122, 161, 249, 73, 230, 156, 11, 41, 128, -179, 45, 87, -34, -140, 238, -8, 57, 72, 92, -261, -45, 0, -66, -3, -25, -106, 34, 82, 7, -91, -47, -99, -28, 37, 51, 149, -32, 81, -67, 16, 11, 117, -40, 139, 15, -204, -10, 40, -219, 26, -44, 18, 112, 144, -88, -32, 41, 109, -24, -180, 79, -244, 76, 109, -17, -45, 36, -114, 12, 112, -172, 69, 121, 2, -158, 32, 64, -168, 7, 258, -166, 145, 162, -101]
6127a01J66l8j91K15j34O6m1O3j16J3K39p8o9J75o1l17J49J50k31J83N5k54K6
6150a31K0M1j75L45j50k69J29K34j34J13J98k23O2j58r4L07jj48j97L61j95k7
6172i2J21J8l03K53J55k18n8J01j7K6K44m13J7K18l1j46m6K67j82qJ41j32k5J55
6196D5k37J91J08n9l7N6j6k90M05J46k58J5J21j79l2J71J46m77L34m8j73J73p8
6219B7k34J67K29j84K37k17k00K90R1k00o0Q9Qq6J60Rk31P5K02l34P7O8j5k6Q8
6244C0n4j69K70j07J54j43K51k80jJ71k20j06J72J33j29J56j35m1N2J92l53J64
6266GK06l72K43M1q2j08JJ39p7J11o5j21Q9J17j69p9L53m65K75J72l47J14J88
6289A71k12j08L06l07K77o0n6P4MNj95n7J39J75j35K10j30k67M35l47n2J25J6
$$ y = [-101, 65, 27, -164, 51, -83, -17, -58, 5, -111, -98, 141, 63, -6, 169, 108, -209, -60, 90, -141, 42, 97, -157, -131, -111, -70, -245, 100, -50, -319, -190, 44, -90, 23, 221, -2, 60, -98, -192, 115, 114, -34, -231, 130, -65, -92, 29, 47, -256, -3, 152, -66, -124, -23, -40, -14, 230, -183, -166, 52, 21, -125, -171, 96, -86, -94, 47, -85, -110, 45, -192, -1, 107, 48, 11, 67, 51, -239, 166, 312, 54, 69, 190, 11, -21, 150, 296, -181, 153, 105, -68, 105, 27, -207, -40, 189, 5, 242, 25, -175, 115, 206, 6, -54, 35, 43, -43, 117, 126, -105, -30, 172, -162, -85, -17, -32, -58, 30, -24, -193, 77, -30, 124, -19, 232, -48, -49, 122, -98, -204, -32, 101, -28, 128, -7, -48, 4, 196, -157, 7, 213, -159, 84, 125, 43, -65, -64, 75, -2, 109, 44, -77, 12, 129, -40, -119, 234, -231, 44, 216, -131, -17, 171, -41, -149, 157, -150, 127, 67, 11, 85, 89, 94, -101, -158, -19, 156, 21, 231, 101, -166, 269, -78, -130, -5, 11]
6312A1M9r0K41l43R2J91j86q5J27j25l4K20j65RK0K85l40J05Q9j69N7K29k47l1
6336i0K57r9j58K13o2o2O8q8j29J60K40m48J97J12lj52K09Q7m43L17llo0L8r7
6361AK19nk27J27M2j37P8n0j26j23J84M1L4j68J61k79K63m2j22Q3Q2M1jK54m42
6386a12q2J02J54j58n7K63l60N8K18j99R4J89Qj20J25j19j2J51q9k15J92J02k36
6409a03l0J89j15J68k4j18j83J64K76k08K3J50l01L1K34m3j56K0J5P5p1k2o7J09
6433A3l3k83L95k04J5M2J85j23K2n0K0j56L1J71j53J5K20l42J54j39R5l9L9K0
6457h5J51J9j27l3J84j40J32j17j8j33R9J07m7j07J59k15l2L20j65J21j04N5n4
6480c0N0L5o8N8J87l60J3K32l18j07L63k1L5Q8j68Q3j17L98m58Q3L01m04P4K44
$$ y = [11, 60, -30, 211, -132, -40, 151, -35, -120, 7, -118, -152, 68, -97, -88, -68, 217, -123, -18, 71, -98, -41, 188, -59, -90, 167, 68, -90, 123, 61, -1, 67, -21, -150, 10, 250, -198, -1, 111, 108, -44, 165, 252, -191, 126, 123, 120, 60, 98, 1, 220, 215, -12, 115, 157, 20, 98, 48, -78, -201, -17, 24, 58, -110, 51, -228, 35, -7, -129, -46, 36, 77, 76, 330, -112, -194, -92, 62, -96, -153, 110, -250, -192, 26, -173, -79, 110, 118, -2, 123, 4, -8, 143, 54, -161, 31, 133, -103, -133, 56, -59, 109, 85, -33, -216, -52, 224, 16, 39, 189, -112, -81, 153, 110, -46, -26, -11, 64, -7, -29, -96, 13, -20, -303, 92, -112, -97, -55, 130, 7, 29, -21, -1, -157, -126, 45, -108, -93, 127, -215, -61, -200, -105, -144, -105, -85, 66, 85, -42, -75, 109, -31, 101, -16, -34, -167, -68, 39, -8, -115, 44, -171, -203, 117, -48, 73, -31, 24, -30, 20, 55, -13, 45, 232, -128, -115, 117, -201, -308, 55, 34, 69, 157, -11, 72, -45, 353, -105, -22, 279, -125, -51, 193]
6504A93r3k24K05k61P0J63jk6J38J01k70P8j3l9j33K54j28j30L15k66J79j45J63
6527A30l39k1L91k90PJ8K07k47J06J72m06K67J0j30%J31j70J43K49l16K07l23
6549b04J06O6J23l29o9L97l05R9Q6K23l41K34J12n61N13j07J65m19L59k70J71
6570D9j92P9J51j25J11j33R3j2j96K37j4p0n5K34q1j67j4R1K4k2J71m06K84NN4
6595I6o6m6m1JJ12N0K8j69J55j20J7p0N0M7J90k80J31k0j0p2n8p4J8L10k00m7
6621f8K71j56p1k6J36L6l13K90j85K7Q0p1j26J30J1p3Q5k2LL6J31k49n8K38m9
6646Gj9P0j83o5K40J41l66L12p1K57p18L95k8j94L28j19J1J35J06l89j8J09Q9
6669C0Q9Ol44J40J09k9J46l74J02R0K8k9r8K10O6j58j3K17k00p7J39P8k08M5P
$$ y = [193, 100, -124, 81, -180, -110, 53, 52, 26, 164, 265, -5, 73, 60, 21, -112, 142, 14, -116, 199, -67, 112, -33, 130, -209, -230, 161, -129, -122, -104, 103, -144, -38, 134, -272, -5, 5, -125, -125, 6, -164, -21, 228, -88, 119, -204, -98, -32, 91, -238, -307, 90, -215, -116, -30, 193, -148, 86, 198, -363, 150, 43, 208, -211, 148, -122, 49, -143, -64, 87, -38, 73, -60, 33, 21, -175, 62, 48, -22, -77, 157, 76, -91, -105, -14, 10, -12, 159, -247, 37, 42, 96, 30, -16, -57, -56, 56, 106, 134, -35, 120, 0, 17, -53, -3, 44, 234, -46, 85, 65, 55, -17, -75, -149, -131, 179, -21, -68, 203, 47, -24, -50, 86, 122, -191, 99, -86, -59, 21, -50, -176, -46, -35, -108, -23, -45, -42, -6, 125, -124, -182, 56, 7, -12, 58, -125, -190, 50, 191, -175, 137, 66, 323, -395, 0, -28, -222, 106, -13, -2, 133, 239, -150, -168, -59, 30, 119, 125, -219, -79, 30, 1, 147, -227, -125, -35, -7, -36, -134, 76, 142, -16, -29, 188, -12, -89, 50, 128, -80, -35, -28]
6694b8M3j98K23j35M51k89k66R8K03R0k88L40k47P1N4k51PL01r0j07P6j45J22
6717C5q0J48m1J8J29j79k7L0K7j19K86j88M3o3J2j40K2K59j00o2J30l24J08K41
6741A65j51j21K64j91p2J86r9K2p3J86l59J73J83j20M3j3m2j12J28J94m24K61
6763B8m1L3j45J97k24M9K21Jk91K60n2q4R5j83r1J73k1R4pR4m5k07j2mP7rJ18
6790B4l05L38jj70J44Qm7j13J92j17q6K25o9q4N9O4j38N7j4n7L4K15r7r6K20k77
6816i1Q7L9o1P2L3j5k33j13L56J11k21J50k29oL51j70n3j28R6O3p8o6j1K63n3
6841I3j43K40J0j86j05j11K29k80L99J17n22J69K67j94k05K13k16J89J49k81K69
6862A01J1j32k4J03K07l87L75r4n4j19J22j59J97j35J16j17P7j11j58L29nk94
$$ y = [-28, 15, -183, 40, -95, 356, 67, -199, -101, 102, 192, -96, 244, -3, 68, 122, -129, -122, 179, 89, -18, 58, -87, 35, -45, 103, 62, 80, 209, 30, 3, 33, 60, -59, 227, 39, 82, 19, 31, -109, -87, 172, 72, 10, 140, -184, -76, 165, 14, -107, 157, -34, -106, 80, -19, 3, -70, 116, -243, -70, 113, -7, 36, 23, -19, -131, -3, 191, -233, 28, -13, 20, -125, 72, -152, -103, 118, 119, -172, 88, 36, -48, 47, -136, -227, -54, -75, 19, 12, 106, 61, -146, -158, -162, -85, -94, 24, -281, 57, 56, -114, 30, 38, -9, -122, 70, -47, -133, 92, 23, -61, -2, 62, -76, -19, -33, -90, -56, 159, 62, -34, 186, -91, -4, 35, -26, 46, 79, 64, -169, -282, 74, 185, -36, 114, -115, -121, 230, 60, 7, -121, -25, 38, -40, -106, -117, 146, 93, -50, 190, 200, 14, -91, -202, 27, -253, 146, 263, -259, -90, 177, -17, -222, -9, -225, -36, 113, -168, 101, 112, -20, -44, 59, 266, -121, 254, 160, 106, -13, 109, -50, 147, 12, 128, 11, 88, -23, -181, 148, 143, -151]
6884a51L1K41n4o4R1j85R2O1O6k64K64l1j64K42k9j75j16O9m9P7j4N6%O2k93J48
6910h9J03J4l6J74j60J0J13j9l03L54K1j25q9J72m9j36J4J46k7j84P8k38J64R6
6934DJ54p9m4k85J21K14j01k7k2K11k42J82O2j13J39n7J2j64J49j56J62k9k4j41
6958g4K10Mj54K5K41k96J66J53l41nK21l46K24O4q0o4J19k4L2q6j33J93l5N9k42
6983a69q4J64P6N5N3p1k81K65r2N4o2J17m7J0J99j38j66k1K40l33K25J85j97p7
7007i5N1j23K05M4j31j3J4n4K44j08J08l30K16m9j56K47N0j09J20J06k49k57L97
7030A28o7l9L5k03R6K16k43J52M2M8p1j33K1Nk3J62j30K21k23Q2j79J6R5n9M3
7055hK09l17R4K50k55N6J18j77j5J38j21j32J45M4j09jK76m64L32L4n0l30L42
$$ y = [-151, -120, 121, 67, 3, 94, -91, 1, 62, 128, -136, 128, 97, -67, 175, 146, -29, -145, -76, -125, -48, -62, -6, -6, 56, -237, -89, 14, 28, -8, 166, 6, 16, 129, 110, -193, 161, 182, 57, -32, 140, 91, -45, -31, 115, 88, -96, -18, -256, -92, 4, 158, 79, 35, -250, -129, 85, -16, -43, -65, 146, -96, 86, 148, 35, 174, 117, 129, -35, 114, -42, 120, 91, 67, -74, 136, 140, -14, 11, 252, -44, 122, 275, -66, -71, 150, -196, 28, 92, 12, -52, 67, 43, 75, -11, -144, 49, 14, 73, -169, -253, -89, -13, 42, 95, 24, -257, 8, -84, -30, -92, 25, -22, -12, 187, 49, -117, -138, 102, -231, -6, 179, -18, -95, -44, -167, 38, 82, -49, -62, -48, -102, 142, 34, 142, -188, 28, -21, -177, 70, 120, 11, 131, 237, -12, -269, 128, 61, 22, 57, -146, -50, 166, -77, 75, 117, 165, 94, -39, -18, -13, -36, 126, -4, 217, -6, 76, -103, -87, 8, -51, -8, 201, -116, -22, 228, -27, 29, 147, -30, -45, 93, -28, -160, -15, 29, -80, -81, 195, -269, 63, 97, 47, -283, 59]
7078E9j89M6L1L6L4L6l4j55N2J80j59J02M2j79J47j18l4M7J89m4n1J13j08N1k01
7103a07K84j91Q3J09r1r7L31q6m29L34j59j55J31J41k49J78J55o0j54K90l34Q6
7125A0k40K99k39K22L8k60J40P9j81J9K89j77ll6k7J90k01r8R8J73l5l79L54%
7149C5l07L22j21k7N4N6J00j89K40k39L6N5k00M6J83J00k0j52K33m03J37K29l01
7172a33l7O8J19q9J43Mj75J2K01l66J12L34j17j57J42J79k58o0R8J46l5j01P1
7195A01J0m1k4j68J78n3M1j30Q4j35K11J51j39q1O5j73m9J57q2o3L79j96q6J48
7219A05j03r2J43n0j06O4k7j23J71K4j25lM5j91P3N50l25q1K37j53o8Q1j0M6m0
7244D2Q6q3k14L27k83N9m2J03p6l4J32j25m8K15n4L5k1j99K68M6r2o1O1Lk13J71
$$ y = [59, -130, -84, -53, -17, 17, 53, 19, -136, -84, 96, -63, 39, 81, -98, 49, -69, -103, -56, 133, 89, 38, 151, 43, 94, -107, 177, -14, 69, 178, 87, -10, 321, 235, -194, 140, -19, -174, -43, 98, -151, 27, 182, 122, -32, 258, -76, 10, -230, 69, -170, 52, 90, -170, -30, 49, -132, -113, 176, -1, -4, -40, -67, 123, -78, -176, -78, 95, 60, -319, 35, 35, -272, 50, -71, -98, -44, 12, 112, -77, 163, -76, -40, 15, -185, -139, 44, 144, 124, -28, 205, -198, -61, 168, -133, -170, -102, 17, -72, 71, 75, -100, -88, 113, -253, -141, 193, 76, -81, 61, 240, -18, -78, 20, 166, 131, 30, 101, 111, 70, 46, -122, 56, 3, 44, -86, -2, -137, 74, 225, 86, 5, 70, -103, -152, 5, -77, -140, 239, 43, -43, 105, 2, -90, 53, 3, -103, -39, -66, -189, -18, 6, -119, -122, -77, -268, -195, 355, 30, -51, 186, 33, -35, 46, 36, 82, 42, 128, 45, -169, 158, -125, -66, -108, -5, -81, -115, 17, -108, -156, 59, 5, 40, 19, -180, 88, 134, 42, -19, 42, 45, -168, 3]
7270Cm6P7J9l6j18J49J64k76M6J4m6m7K05j28K23k16J46l77J61m7R2j4J39j30
7294d3%%K01k34R6j25K81q8j69p1j14K46J16pr5m8K2p6R5k20K29R2j42m9J26j55
7320a32K18Lk21OL11m5k08P2Q7k15J18M4L1j3K0k55K55j4j04n5K86j66p9L48l34
7345d2J28j26j3K19k01j06J58N6P2k83P6K4K49k12J09k08K1Q9l6M5j23N6j74J66
7369e6j00M5J17O9nk49L51j84j08o8K32j11J37J86m70R4qK43k36J27J8j03J64
7392H5p3j21L6R3j71M4L08j96J27j52L8j20J91q1L8J35n5j70p9K04k59K2M25l02
7416c3M1j8l3M4o5J45q2q3J88j06p5j06J23J02m3j0K64j84j43O4J17k5j18M0Q2
7441H6k34L04j79j09J65j25Q5j53J66j83P8q9L33k12r4J40J17j14Mj4L6k3O0j71
$$ y = [3, -43, 34, 53, 17, -101, 48, 212, -64, -18, -4, -50, -97, 108, -20, 203, -13, 133, -244, -83, -130, -38, -52, 87, -43, -43, -43, 158, -76, 20, -105, 176, 88, -81, -152, -266, -20, 96, 89, -6, -54, -32, -108, -13, -233, -4, 88, -54, -103, 23, -132, 86, 89, -132, -126, 185, 140, -68, 4, 91, -124, -6, 38, 69, 56, 76, -179, 76, 62, -42, -97, 189, 23, -56, 292, -42, 86, -40, -53, 166, -35, -141, 17, 73, 145, -138, -62, -38, 211, -1, 108, -100, -79, 10, -26, 19, -104, -48, -222, -56, -156, -111, 6, 75, 70, -179, 172, -12, -120, -188, 44, -67, 70, 256, -214, -120, -128, 115, -121, 6, 24, -79, 85, 12, -109, -73, 20, -151, -107, 201, 5, 132, -20, 18, -102, 89, 8, 46, 181, 126, -44, -123, 81, -178, -156, 269, -33, 8, -10, -43, 1, -64, 81, -1, -84, 104, -2, -77, -183, -60, 42, -1, -11, 253, 69, -74, -10, 107, 82, -36, 4, 86, -148, 156, -23, -132, 33, -92, -7, -160, 6, -177, -99, -188, 145, -67, -161, -21, 96, -18, -14, -28, 8, -15, 45, -126]
7465a26K53m5j67K03j03r3K29o9n8j75L45l0j63J65l3r7K73k50n2J18j38J56j98
7488e5K20n2k6k9n0j0K7p2J44Ml5P8L2K9j75L1m1j02Q9l2J50k11N6%n7J49j28
7515f6N9j8k7j49J39Q4m3j10J26j16K11K0k45O8m2L8j05L3J15j47M7J80j84RP0
7540e3J1J25J9j81o7K79M8k67J31l9n6l6Q5k05K67N1J3j70K29n8k13J73p4r2o
7565h6K04k15P9J68k72Q3J0K1k02R1L49j89np2L0o0P3k9J1J16r8k9M2k9n4J91
7591A28l12J05J34p3r6K4P0o6Q1k2R5j91J50j84J99N0j23J80l23K16j23J02p1
7614e0k9j5N8J0j09K67k6o5m8J72J7l92L32j29M4j8J27j60n0J6j33L52j06j52
7638h7J26m1m8M5J96k25O4J10p4J24n2pp1rp0M6k1K53l42Q1r2j31L27M1j81J34
$$ y = [-126, 127, 82, -85, 118, 15, -78, 151, 82, 24, -151, 194, 164, 1, 166, 133, 36, 309, 59, 7, 125, -13, 143, -55, 165, 113, 87, 58, 8, -2, 25, -47, 97, 101, 66, 144, 176, 205, 30, 61, 20, -82, 7, -25, 125, -86, -30, -30, -87, 62, -66, -7, -25, -52, -201, -62, 22, -21, -131, -5, -121, 90, 110, -135, -67, -109, -71, -176, -143, -28, -175, -128, 52, -132, -123, -53, -42, 83, 102, -79, -146, 133, 181, -86, 45, 6, -50, -86, -1, -206, 61, 112, 125, -45, 184, 126, -87, 86, 12, -80, -86, 118, -97, -18, 150, -122, -39, -29, -8, -210, -119, 230, 41, 36, -36, -6, -66, 7, -22, -11, 105, 7, -22, 20, -9, -63, 128, -184, -79, 55, -18, -114, -90, -20, -86, -5, -27, 68, -123, 27, -157, 42, 92, -31, 149, -174, 42, -81, 21, -50, -79, -94, -36, -26, -135, 132, 106, 41, -7, 165, 182, -210, 122, -7, 37, 19, 146, -14, -64, -48, -181, 171, 65, -87, 39, -2, -50, -5, 191, -34, 30, 140, 66, 190, 138, 131, 60, 51, -19, 27, 6, 259, -83, -2, -94, -225, 102, 143, -38, 96]
7664I6j32R2j24K04r8r7j2P1M5q9J86k49J2q5J49N9k8k21K48j63PK18k04M4J56
7689H5q5l3m3q8M38l53L8l7j26K83k3j16l6M4J73n2mJ02k13r2K34j21QJ80j67
7714dj6k0J29l7o8J00k39J50J65j84q4M7r7K32Q7j35J13N3l64M7J72J93k53o8
7738h1J18Q7k75K22J35m44L08j10J7q6J49n4o6R1l23L18Nq4k1M6K3j62J87j31
7762a31l1L3J22p5K70j97j81K08L13m45L7Q4P1k71J81m4J66op0j79K62N0k37J11
7786D1L3r4j32Q7J75j10qJ7%R6k43O4Q2J79k01N1J59k43j29J02M7J18ML2k09J15
7812C3Q0j08k4l86L30P9K26l62l7J85r4r8K51j27k3Q6L4k90K38J7O3j50K21K2
7836A66j11k2Q5k53K64j04q4K26k04P7R6j85o7Q9O2K17m29K79M1q8K2j57j42K58
$$ y = [96, -36, 56, -68, 136, 38, -59, -71, 0, 45, -44, 142, -107, -95, -180, -31, 28, 0, -221, 27, -136, -129, 89, -115, -71, 85, 0, -33, -76, -164, 274, -79, -41, -78, -204, 79, 56, -60, -96, -52, 121, 69, 65, 167, -46, -138, 96, -25, -17, 163, -4, -20, -40, 89, 52, -16, 84, -155, -5, 160, -24, -108, -61, -158, 74, 161, 26, 139, 192, -172, -125, 47, 240, -13, -81, 37, 124, -151, 71, 206, -238, 70, -40, -23, -109, 40, -14, -80, 11, -312, 6, 11, -73, -94, -48, -25, -187, 0, -131, -162, -129, -7, -82, 188, -9, -190, 18, 331, -114, -77, 7, 78, -193, -12, -56, 110, 104, 34, -145, 117, 167, -70, 41, 74, -20, -152, -65, 110, 0, -8, 9, 9, 105, -138, -74, 8, 187, -14, 37, 196, -47, -176, -74, -27, 91, 95, 127, -82, 33, 113, 5, -19, -405, -75, 4, 230, -132, -169, 16, -78, -176, 75, -52, -75, 11, 45, -245, -7, 10, 73, -77, 144, 166, 55, 33, 118, -135, 129, 25, -59, 167, -37, 40, 136, -49, -116, -27, 35, 252, -177, 102, 143, 55, 77, -80, -222, 36]
7860C6N1q4qJ33j92J91j30l7k1J90J05j91O2p0lk1r1p6J82m9J29j5l1j32J28Q8
7886A44K1j90Rl9rJ58M1j26P7l1j50M3J5P9j08J34p7l0Q6j44j55L35n5j23J80
7911H5L3k90JK58j73K3J0O8nK3j44k27L87p0M8j08J90l21J62n4J02%NN7r3K1J33
7938A21K5p9j54J91lp7j07j06J41n6J06o7Q5k51M06r7j54K70k80J48j05PR6j90
7962a30L25l38oj06L72J8j82K45k73j9N80o77Q2M99m20M60n31J25k49M6J96o5
7984d8J57m2j55p8K91j40j71L91k74O2N8O6k14J34m8K8j35K03k24J92J08r3L1
8007I9k53J02J5J38k07l7L82j99j29j87L15j75J12J29r1j91k9K53j43K75l29J97
8029D7j63nR2o7K34J2k41J86m6k6R5L8j52j17J86k56M02q9j34k7J81q3j07J16
$$ y = [36, 87, 3, -5, 128, -64, 127, -3, -40, -61, 129, 234, 43, 105, 35, 32, 11, -80, -156, 26, -23, 106, 91, 60, -72, 56, 144, 165, -25, -16, -55, -64, 94, 135, 9, 86, 55, -95, -52, -37, 42, -66, 68, -9, -39, 47, -97, -252, 83, 28, -95, 85, 118, -172, -171, 87, -86, -63, -53, 15, 10, 33, -111, -338, 49, -21, 27, -81, 109, -212, -50, -104, -2, -2, 3, 60, -33, -12, 121, 146, 67, -87, 104, 101, 24, -83, -189, -48, -104, 2, -65, 20, -231, 175, 78, -76, 194, -86, 62, -43, -36, 60, -130, 195, -143, -149, -255, 117, 135, -47, 198, -75, -94, 486, -191, -109, 390, -30, 430, -101, 24, -225, -179, 17, -48, 109, 67, -88, -166, 125, -15, -186, 205, -69, -7, 51, 117, -97, 37, -11, 17, -118, 85, -139, 53, 161, 68, 99, -154, -52, -37, 101, -106, -143, 239, 40, -89, -276, 39, -136, -24, 105, 14, -177, -206, 47, -96, 179, -150, 47, -116, -121, -29, -96, 138, 150, -91, 95, 49, 23, 118, 156, 4, -113, 73, -183, 219, 130, -4, -31, 150, 67, -40, 76]
8053G6k17L7K14K7k11j20L47k74J96j63Q9j87L47l15J2J89o2j83J15P3q2K8o3
8076a27J30j7K22l61PK95l04Q9J20L6r8o5J79j6Lj82j30L87k3k17J45j00O7l0
8100A0O5j30j18K82n7Kp9j4m2J25R2j48J36j41k23J00K67k5j32J31n7k44K19m9
8124c0N1O6K61m10O5j6M6Om7q0qJ37p7j05j0J70l6L7l4J46k44K58M7l58J60P1
8150F6k48J98K5j99LK40k23O8J43m8OJ35k74J61k7K06l08n7Q7o5K71K29m81j56
8174b48K05N7n0pK8r2k9L00j94N5K0j83J83O9o8k79K42
$$ y = [76, -141, -104, 110, 137, -74, -194, 153, -121, 75, -88, 1, -186, 161, -154, -142, 47, -15, -198, -83, -10, -92, -64, -127, 3, -14, 208, -153, -146, 149, -155, -66, 54, 90, -8, -73, 106, 90, 93, -89, -219, 168, 145, -72, 73, -27, 40, 10, 75, -55, -173, 109, 52, 54, -25, -39, -81, 44, 136, -12, 124, -17, -240, -140, 127, 102, -30, 101, 44, -200, 19, -30, 21, 87, 348, -62, 3, -13, 33, 39, -8, -88, -96, 41, -36, -141, -151, 19, -17, 20, -14, 132, -112, 146, 193, -165, -5, 66, -182, 16, 41, -158, -155, 85, -138, -70, 73, 25, 31, 166, -108, 53, 26, 232, -76, -133, -46, -111, 160, 389, -92, -248, -43, 14, -36, -43, -15, -107, -136, 164, -30, 25, 45, -138, 45, 114, 46, -233, 9]
8191I
$$ Imaginary data points
##PAGE= N=2
##DATA TABLE= (X++(I..I)), XYDATA
0@%%%%%%%%%%%%qJ6j6J6k4L2l2M0n3O1p2Q8j04J20j41J65j90K20k52K87l27L72
34A98m21M76n37O03o76P54q39R34j037J151j276J411j559J721j899K091k302K539
52A332k798L082l400L757m161M619n145N759o482P350q416R764j1533J3969j7569
67i872K3534l5857J09305j68731r7842J08995K3185J72686l2731p1202k9564n2714
79f0808K851L6940L1755R3260q0360o7916J9794o030L2069K0254k2214Q501J1711
92A9807l6367k639K0852m4763L3630O1718k0129m5442j7881j1651J9473L5407
104A2015M0002k7935m8009K6533o1515P761J01854j6844p444k8869m7692L1620
116a8523O903J0267M1078k9278M076k2633n0112O2549L205J032K8010l9644m396
$$ y = [0, 0, 0, 0, 0, 0, 0, 0, 0, 0, 0, 0, 0, -8, 8, -8, 8, -16, 16, -16, 24, -29, 32, -40, 48, -56, 64, -77, 88, -102, 118, -134, 153, -174, 198, -223, 253, -284, 319, -357, 397, -442, 492, -545, 606, -670, 741, -818, 903, -996, 1095, -1207, 1332, -1466, 1616, -1784, 1973, -2188, 2431, -2714, 3045, -3437, 3913, -4503, 5261, -6272, 7697, -9872, 13662, -22195, 87110, -81621, -179463, -70468, -47283, 125403, 92672, 21470, -8094, -60808, -57957, -21017, 10738, 103998, 23638, -44278, -24484, -30514, 1555, 21809, -405, 8096, 19807, -16560, -19199, 1653, -43110, -9480, 52238, 32109, -13333, -31214, -42865, -23392, 12015, 52017, 24082, -23927, 2606, -58909, -51148, 50706, 33862, 26418, -2451, -50143, -18523, -11620, -1353, 39725, 10447, 14523, -8110, -58222, 4327, 7532, 8564, 36574, -3070, -7466]
129g466N898k2666N925L1931J7482l189l0632j5241j2910J0669M9886L908j7658
142A5937j8507q792j5562R476L4893M86J2893j2645m6014j1846L0921K4925L916
155B0081p6p268k6916j4589J9405p074L8039K5036m9879p725r034r137K3982K4661
169A9506J0575j6396k7614p887q420K5458L7712l0242J0236J010n0020J1744K5473
182A135M294J3964N932l1605j7273J0261N748L058K6410J2294m2834q151Q133
195h634q607J6303K7901j1125j5289P952l1401j798L4620O163l790K610j0739
208D166k1546R86J2068J3284R465R647l0810k3203K4028p853J0462K4753j0452
221A4995j3721o764j5204N004K6236P991n232j4569J109j5265n772K7932R49L040
$$ y = [-7466, -1568, -24234, -18309, 13622, 31104, 27915, -2717, -17958, -30868, -20199, 29687, 33595, 15937, -2570, -11362, -26924, -17448, 17445, 17931, 30824, 18179, -27835, -39681, -8760, 16165, 20081, 20005, 12737, -14179, -28768, -9363, -16437, 21602, 46638, -3241, -10966, -20000, -29137, -5155, 19506, 30081, 13685, -13929, -21816, -30236, -4778, 32934, 2692, 12928, 13938, -36082, -24338, 1135, 5429, 19393, 25325, -6280, -23553, -13292, -7544, -4486, 21924, 34218, -8616, -16767, -8634, -17241, -938, 26963, 15838, 549, 8501, -22900, -24698, 9922, 16085, 12295, 14905, 4166, -17380, -16394, -4326, 8958, 18423, 28070, -2740, -25943, -1915, -9768, 694, 25447, 14995, 1274, -5490, -20694, -15690, 10546, 18537, 13305, -1264, -155, -15420, -21192, 6740, 7689, 10729]
235A0729O987k1484k4903J4672J2357N726J5560p684j8634j6096R944O797M199
248a830J9648J340k4938j5915N526K66K4734J2256j4350p843j1060p051K288K2108
262E179J3406k894j4420j4377j1196J4276K4476j0029Q834O63k8370m754J6055
275c151K798N054J8261j2342j9850m120Q216j475J2384K1149k0985r235K500j4945
289a5741J309L0836L124r806j471k4735p91J9988Q435o013P520J412k6689l433
303a6055J2492L524J0202J7239k7926j9190J9880o765j909K0622M890j6702j122
316h20o327j2646J5677J8295l947r233N745j8717p687K1450j45J506J3004j0094
330F061k3530O339K843L897J9617J357j7001j3634N993k971P644J9952k732j3694
$$ y = [10729, 17716, -3768, -28671, -13999, -1642, 4084, 19644, 11960, -6674, -22770, -12826, -6029, -1830, 17818, 19158, -5780, -21695, -16169, -15903, 8831, 21087, 6737, -1106, -12166, -19217, -16929, 5179, 18585, 15691, 1271, -13106, -24302, -10026, 14450, 4421, 13255, 13918, -14452, -19206, -3151, -353, 4701, 22962, 10620, -9230, -13350, -5134, -6609, 5775, 26924, 5939, -3296, -796, -15741, -14432, 16404, 19528, 9722, 8251, -16484, -17275, 2713, 11148, 5135, 12655, 14067, -12622, -16055, -3563, -39, 10163, 27402, -524, -19714, 166, -6599, -8508, 12114, 17004, 302, -820, -7147, -19793, -4116, 14179, 10232, 999, 6744, -11973, -19660, 1790, 1645, 3151, 16155, 6061, -17469, -11130, -8287, -4390, 15227, 16584, -417, -14051, -8058, -11029, -3385, 16567, 13835, 141]
344A41m130p557p259K4498P179o131K387j0331j3626K005J4848M262N913r4j1834
359B71j5809N128J1889r24J4962j772j7139o276J636J673Q317J2639k762j0569
373A264j0505J376j841J1134J3527p820j993p788j2290J266J8174O262j556k364
387F846j4196q079N844J3405l55N393K294j9054q485J0620N392r04J4606p702
401E625j2513L174o461r85J3956J0755r033n871l415o249J799J4679J135n721
415H75J1953j7919j2440J5903K998J21J0720k545j8555J496N043k187N573J6158
429A7194q189j4779O291j1710O61K2528M717j2364k610n497j0624J3929R229k774
443F002L518J156j8714o963J4652M046M478N580p379j8282O011M741o187J8247
$$ y = [141, -3989, -11546, -18805, 5693, 12872, 6741, 9128, -1203, -14829, -12824, 2024, 6286, 12199, 12105, 271, -15538, -10410, 1479, 555, 15517, 13745, -3394, -9670, -8034, -6361, 1956, 14595, 11833, 1264, -9241, -7865, -9706, 1428, 14955, 7135, 5142, -2646, -14936, -13670, 4504, 10766, 9210, 6846, -7350, -15429, -9585, 3820, 3465, 8858, 11152, -7902, -16387, -5767, -375, -1279, 13327, 5625, -6888, -3714, -10175, -11160, 2796, 13551, 4518, -1353, -4768, -11017, -9218, 5461, 6596, 875, 12828, -5091, -17531, -1628, 1370, 1491, 12211, 9666, -8889, -7393, -2350, -4537, 1036, 17194, 9005, -5774, 517, -11193, -10532, 11996, 16713, 4349, 1739, -3758, -14382, -453, 8776, 6002, 9520, 10676, -8038, -15001, -349, 3697, 8175, 13755, 6376, -11906, -5895, -1154, -7341, 10906]
457A0906M511j3612o612l512k861J1451J0598j901p919n184qr994J2137J0822
471H822n474N320q552j4782L943J1086J127M622J049q067q268j234N994J369J3245
486A0200P61j4729o797K871L828K925R387n129m025J720p277o130J0335J1917
500I857l205k738o139o353m67J3333Q94o306J2114r152j1168M450K079K877R911
515I987J104j1985o475K363M419j612J2035j590r749N388j0184o238J3743R861
529A1067n137O39o828j4427Q208J2039j247l60P334j4803q940R900n8K786J0540
544A0713j70j8576O95M235n363J1816Q948q851o242N94r208M168J3465K274o123
559B375l41l304j5318J3472J0063o615P971j522j6455N69R621k421O239N086n217
$$ y = [10906, 15417, 1805, -4807, -8319, -11180, 271, 10869, 8968, 1049, -4135, -4143, -14137, -2000, 8822, 3348, 8668, 116, -14666, -10723, 363, 1490, 6112, 7161, -906, -9174, -10408, -4414, -3045, 10200, 10961, -3768, -10565, -7694, -3866, -941, 8446, 3317, -708, 1012, -6265, -12395, -2060, 9857, 6652, 3914, -2225, -8578, -9045, 4288, 5182, -1124, 10990, 1838, -9330, -4880, -2801, 76, 9987, 11091, -894, -7369, -5006, -587, -2199, 9836, 8246, -1503, 3885, -6299, -12537, 1206, 11067, 5930, 6569, -259, -14686, -6478, 5561, 4314, 3954, 11288, -3515, -12455, -2555, -2613, 173, 10713, 10543, -8033, -7338, -3103, -8466, 3350, 12298, 3447, -2795, -2201, -11409, -7241, 6224, 8498, 2375, 2034, -1270, -16588, -3116, 6947, 332, 8303, 6781, -9674, -9105, 516, -1905, 4334, 9420, 4203]
574D203r255j162L475j884J2094L499r218m279j610l211O800J0352n596j094r25
589B189p156j696Q693K179k139N528m274p631k638O671O93K646Q187j0272o655
604e675K351k00R37P900J402l228m645n367J205k87J1975J603p506k80o577k890
620i282Q274M410k592N348l441j0437k457N847O679J131M761q537j0573M570N444
635h55j903N599P180j1521l441k40l569P509J0329l035p487m84n095P48O949N363
651F047k942J671j603j5714O645J0667k870L574L504j3590k668R229l813J689
665a74Q115K54j1163J1K974o562R548Q217q708m159M552r117N72J2285k436p00
681C509Q26n535p372P332M992k288L200m3p118l312O222m305L905R985q184n018
$$ y = [4203, -5052, -6214, -2739, -4623, 7471, 10970, 1752, -2527, -4137, -7348, -548, 9804, 4208, 3114, 2189, -4967, -6663, 2030, 4209, 2070, 7598, 3324, -4307, -6945, -274, 419, 3065, 11252, 980, -5675, -3324, -3524, -2587, 5313, 6715, 3487, -1158, -6525, -5320, -5607, 6368, 7971, 465, 185, -6392, -9282, -1008, 3402, 810, 6158, 2717, -7720, -10177, -4330, 2349, 3480, 8241, -296, -10869, -6299, -855, -2758, 2841, 10021, -1500, -4941, -5181, -8750, -1241, 9088, 6053, -1434, -1918, -7013, -6265, 684, 6047, 3105, 4776, 3173, -12541, -5896, 4771, 1901, 5475, 8979, -4611, -7279, 1950, -1863, -174, 7941, 8195, -2968, -2957, 17, -6545, 3003, 11220, 2512, -1647, 2905, -6212, -5640, 6645, 4209, 3509, 4335, -1200, -8572, -1240, 3752, 1464, 4664, 4621, -2497, -5809, 413, -3892, 13, 9998, 1814, -3204]
697c204J899l951m83J1016p27l940L92l113m322J47J0838j112j867J654p915l804
713h492Q059J958k576P098l290n562k411k1M063M577M374n829n995K7O31j68Q190
730D633K354p046J746n006m078N963O848j37k861r67m843k612M152P617l946K165
746C982J548j2016R01N351P48L048M038p336m700R31P09L320K824L023p377j179
762b185J244n775N506P735m574k040L892j1258j08R981l18o10J622k230q273L705
778c686M628k623K926O062q370o664P857m171K436Q190m898l813L031l421m488
793g004P816K937j385k15j215p175k20J1718l215r88M548o283n716O751k8j907
809a581Q817k201n949k682J372J145K832N189m146k491N77l802k652R633J969
$$ y = [-3204, -1305, -5256, -5739, 5277, 4550, 610, 1002, -2111, -6433, -6286, 4552, 3440, 1573, 3227, -4688, -8492, -433, 1525, -1051, 6047, 2757, -2805, -5216, -5237, -1174, 3403, 7777, 1948, -4047, -4020, -3389, -3557, 4633, 6987, -59, 1687, -3319, -7397, -1434, 5414, 5277, 2416, 1449, -3394, -6006, -1854, 5763, 1817, 3982, 5530, -6486, -5585, -234, 514, 3562, 7600, 264, -4436, -3505, -2796, 524, 3348, 6371, -1006, -2185, -941, -6716, -1210, 6525, 1951, -89, 3803, -7455, -7563, 2418, 2100, 1490, 3112, 882, -7391, -3686, 942, -1681, 1245, 7307, -1063, -7727, 130, -4041, -1605, 6585, 1687, -2126, 905, -2516, -7004, 812, 3749, 2364, 2149, 934, -6241, -6461, 5257, 2042, 1054, 5602, -681, -6397, 354, 326, -1581, 7236, 5035, -914, -3596, -2224, -1079, 1753, 6942, 2796, 305, 882, -2920, -5572, 4061, 6030]
824F030l394K148p580l612O067M267k257J680J003n785l374J762M650j14M719
839F210k274r054J570K153k31K704M085l544j949l648j657L299M435M203o165
854A37k361m82k498L041M901k039j84K980p598k366L501M453J025L08j393p497
870f072K138M401j177P2N788l360n478K583l093J971P029k79o382J116L69l837
886d211L622K964j18m72K911p855m462R404R88j555M037l635p324N516N99k753
902b344O733R93n334k854L044l388J382Q085l568m293L699k912o400R003J971
917C817l587L677k240p388P46P276j823J430K422n089m217K459J794r17O908j519
933C749o790O45M13k187N475L890n784K150j440n198Q29N493L433l436J028l365
$$ y = [6030, 2636, 4784, -2796, -6408, -341, 3926, 1669, 3349, 4352, -1433, -4807, -3045, 1605, 1491, 6210, 3936, -5118, -3548, -1395, -1626, 1078, 5163, 1619, -330, -3978, -5635, -2336, 2099, 6302, 137, -2224, -2706, -5204, -2163, 2738, 699, 515, 3495, -4103, -6469, -2968, 1485, 2510, 2818, 1425, -6072, -3934, 467, -710, -638, 5150, 1790, -3688, -1105, -4198, -2227, 4802, 4523, -1859, -743, -374, -4211, -589, 2375, 2257, 1785, 4696, -3159, -7621, 1783, 2771, 1216, 5253, 1618, -5706, -190, 409, -2344, 4389, 5382, 48, -2806, 238, -3150, -1768, 6317, 2749, -1544, 2155, -757, -7157, 1846, 3817, 230, 3907, 1667, -5721, -4975, 2301, 478, 1908, 4330, -759, -4976, -2517, -723, -1640, 5268, 3749, -3041, -2396, -1983, -4170, 1305, 5195, -589, 1561, 121, -5077, -4248, 1245, 4678, 1242, 2270, -1095]
949a095n324M686N889l863J614K361p071L00N13J725K183K128p39n048r46R68
965a719J430K248L166m239j581J195l462J732L930M02k097J273l674k991M169
980b18K276K34j700J968l489k919L837L6j130N033L28p899J339l7J45M292J166
997C262k322l813K233k080r30N180J258l438J617k467n597O792J816j454J871
1012A928m83m833j711N172j323J653M580l674o792L008K258l014O993K32n700
1027a706R37J017n832L773P302l590p17r10k506j627N356K219l899L667n63o862
1043c941M84N470k015M404R52q103L59J980P21M56K528k57l231M34j342k489M225
1060F35N566n272n40O4m340K943K754m93l45J913l038l620J323L080J367n20Q02
$$ y = [-1095, -6419, -1733, 4156, 293, 1907, 4268, -2803, -2503, -1990, -265, 1918, 4046, 3307, -1741, -2687, -1719, -289, 1959, 5125, 886, -695, 500, -2962, -1230, 2700, 3102, 1005, 2278, -1396, -4387, -218, 2058, 2292, 592, 2560, -929, -3848, -11, 25, -1105, 3928, 4256, -3643, -2304, -2341, -2196, 2096, 3262, 940, -2873, -640, -2720, -3650, 1530, 2788, -650, 967, -1500, -7097, -305, 1511, 57, 1928, 1445, -3388, -5099, 73, -1250, 403, 4983, 1309, -5483, -2475, -217, -3231, 3762, 3994, -1706, -769, 248, -5584, -1811, 5491, 1901, 1184, 274, -2232, -3859, 1497, 3716, -183, 3484, 2921, -3941, -3457, 2013, -2, 4402, 5354, -2749, -2390, -410, 311, 767, 3295, 3038, -193, 241, -1101, -3590, 635, 6201, 929, 389, 453, -3887, -944, 1810, 1317, 972, 2885, -153, -3773, -2450, 630, 1997, 1477, 2279]
1077B279m650J01K396j785L87L770l60l236K51k793J524K997J820j474k752J576
1093E1k483p95M042J397k323K511k505n081L587K023J626k49l48k369k514L176
1109b54r2j97L974Q42p051O19Q83j183N955L69l719j090J594l644Q38M915J21
1126B880j922O8j249n002N425K674l244L072K23o110j47L971k034L771J963m976
1142f37k323J714P83k325N638N64n591J445N89n256M497O066o313R55J546m465
1158c113l95M192N06j802K770j376m198O24L643j642J892K852o413P44J734k140
1174b122J707L620k528j252K132l454m75K259L008j617J07J75n159J814L911r50
1190A176n16L249m103k068K447j041J840J658N42l416j013O41m24J657L127j160
$$ y = [2279, -2371, -2270, 126, -1659, -1272, 2498, 2138, -1098, -847, -3640, -2116, 881, 2701, 1227, -1525, 51, -2432, -3227, 815, 2212, -111, 2400, -105, -5186, -1599, 424, 2050, 1801, 1453, -916, -3430, -254, -346, -543, 3431, 4273, -2778, -2159, -1276, -2459, 3496, 3865, 146, -944, 650, -2994, -2156, 2759, 2880, 958, 1026, -223, -5225, 200, 2874, -370, 2702, 2925, -3185, -3332, 639, -1395, 2376, 4339, -637, -2960, -1246, -463, -2788, 2850, 3414, -2177, -732, -143, -5399, -902, 5164, -1149, -194, 1352, -3113, -3508, 684, 1190, -612, 2158, 782, -3416, -2792, 851, -791, 1101, 3953, -2460, -1716, 18, -2122, -415, 3205, 677, -575, 1557, -1897, -2372, -113, 2895, 1278, 1385, 1560, -3599, -1785, 2126, 1176, 660, 3909, -194, -2262, 185, -856, 984, 2642, 3184, -232, -1245, -604, -1028, 629, 3756, 2596]
1206B596l893K133j846j330L552P62J37p81j667k916J155L650J245k518k95Q17
1222H01l871J958J014m26K494K22m014j383K118m56K383J006j082k809N54O01
1238h90k514M352J940l398n91J072l908K084M891l176j5R11j492k348K336J214
1254D68r59K759j29m703l75M335k659J838L219m623O3J167k652m7N503m83l363
1271f41J074l94k094J527L711l423Q04L122n027j708L985l39k97L709l917k552
1287b460K010K1j08J195K047k257r38K07k536J827M717j495l284J568k379o54
1303b519L425l43j53Q53r58l339K22K814J240n19J432k429l208L144k89o17K961
1320A717j8k298n3n58j209K429J879K32k965l7L42k110L230J930j873M7N39m004
$$ y = [2596, -1297, 836, -1010, -2340, 1212, 1974, 2111, 1330, -337, -3253, -2098, 1552, 2797, 279, -16, 801, -3070, -1112, -98, -524, 1970, 2192, -1822, -3205, -1087, -1543, 840, 1846, 764, -2045, -1491, -890, -3404, 948, 2888, -510, -1101, -29, -3937, -1853, 3038, -138, -153, 758, -734, -3082, -746, 468, -491, 2268, 2139, -2564, -2939, 1396, -1263, 575, 3794, -829, -766, 401, -2251, -2298, 3205, 2722, -641, 433, 39, -2055, -528, 3183, -240, 564, 3686, -1341, -3049, 936, 597, 300, 4009, 92, -2460, -450, -429, -537, 658, 2705, 448, -490, -283, -2819, -992, 3725, 2230, -1054, 514, -1865, -2519, 906, 563, 410, 1263, 305, -3034, -2812, 2, 1242, 723, 2155, -274, -3482, -338, -627, -1244, 1717, 1699, -599, -652, -1210, -2419, 10, 1889, 2121, -844, -881, -539, -2649, 581, 2511, 638, 685, 1224, -2780]
1338b780Q83L306J60M31j214p51j878J252J848j217J025J598l043j172K576k948
1354a924K316L134k963q20K82j089q54L543R0k192O73J007l337n95N311k744L61
1371A99K286l893j694L565o58j433M134j707k108j9J19q30J867L554m013j350
1387a981J969j836p53N234k067k406M294l764k496K902K116j042O06L40k953K
1403a835J834l92l44M449k346l624J942j343J177L382q13l049J322k01k000J740
1419a01J594N49j413R67k665j617L998O83r63P16q07l144K491P1q52K630j97j190
1437G50k474P53O93Q55J478n46k878Q97J415l225K299J538l99j90j613j050K4
1454a673K267P44j068p90J631k526r53K540n52J727j52j941j301J401N06l20J393
$$ y = [-2780, -1897, 1409, 1569, 2000, 786, 35, -1843, -591, 1257, 40, 1065, 2663, -380, -1552, 1024, -1924, 392, 3526, 563, -257, 25, -1064, -1918, 1625, 1715, -477, 196, 1203, -2134, -2729, 2582, -162, 199, 2485, -1408, -3102, 463, -195, -1628, 2506, 799, -1309, -1328, -1209, -2039, -172, 3382, -631, -1981, -12, -1848, -2601, 2633, 566, -1840, 2454, -1310, -3806, -904, 1212, 170, 776, 1116, -1837, -1835, -1, -393, -737, 3712, 1366, -2258, -316, -1659, -482, 2900, 2087, -962, 360, 159, -1841, -101, 1493, 2042, 629, 1596, -1069, -2686, 1312, 1995, 1032, 1748, 941, -2203, 288, 359, -493, 2137, 1940, 750, -1724, -971, -278, 577, 2055, 1509, -1369, -472, 943, -2282, 17, 1555, 1156, 966, -647, -1697, -1673, 594, 1338, 270, -520, 1111, -1415, -2368, 172, -380, 1347, 1195, -746, -2047, -646, -140, -460, 933]
1471I33n5q22j101N49j658J383L660k397j605J292j165j325L955r96j452K617
1487A813j514k036j2K744l36k2J480k766j493K598m15j566M640j747k668J872
1503E72j912o17L020K185l291m47J013k061J60L241p39j914K983k662k558K902
1519a25R38q14J087J40l320J091O94p10J203J604j323k534J473q28K55K909n32
1536A208k625J459j30k298K355R81p42J83k14j252p27K038N4k51J070J99l401
1553b093J114J395j134K187j42j366m31M98j041N93J953J24j285o35M47j642J596
1570A38J730j379K37L51j432j236K271L87l2N45j196j535O0K282r57K94J166j263
1588D31j566J493o16j037L520r74j728J70m26p92J401J795j522j94L91j638j231
$$ y = [933, 878, 56, -1045, -496, -2154, -771, 2889, 492, -1113, 179, -986, -2311, 1644, 648, -804, 1813, 299, -1737, -1749, 995, 659, 637, 2117, -649, -2142, 456, 41, -1525, 3115, 1368, -1300, 572, -1340, -1957, 1063, 3248, -43, -490, 523, -1538, -1378, 1863, 1124, -790, 2193, -469, -3027, -125, 813, -1, 1086, 1226, -2094, -1003, -309, -1019, 184, 1788, 465, -2069, -596, -1424, -1169, 1740, 1208, -1417, 42, -88, -2386, -31, 950, 208, 391, 177, -1075, -1802, 236, 290, 39, 1109, 1308, -2093, -979, 416, -718, 1469, 1327, -39, -470, 28, -1013, -420, 1533, 1657, 372, -263, 184, -1458, 138, 1868, 489, 726, 1077, -355, -1591, 680, 1067, 1035, 1580, 384, -1151, -1091, 1191, 234, 528, 1694, 431, -1135, 358, -258, -1295, 2225, 1251, -477, -307, -733, -1525, -124, 1671, 149, -45, 346, -1292, -2523]
1605b523L173O65j721J796k140j717J733J332j597J890R76l574J22J008l92N54
1621d15K736k201k094K199q29j323K420J141k251R27R7k992K134K173r68j355
1637f01J357j335m28J537o94o96K703Q7l670J340L81q92K163N74k045m50J851
1654A182j816l12J711L55m62M4m63k305K325J018q94J65K63j502J2R20j288J538
1672D91J302j389j294j0O24l99J906J9j529k66J016j538n01K818m25m35o52k36
1690d98r37Q19J765r85J23K64q24j803J962Q19l72R28j457r01J45J199o31J241
1708H57N42j702l35M91k30k72K500p60k017J259k01j368J394J600j799O31O26
1725A216k260j27J611P41j174J281j340j251J263P07j338J404R12k708J071J57
$$ y = [-2523, 650, 1315, -406, 1390, -750, -2467, -734, 598, -999, 891, 1867, -1707, -1585, -577, -969, -415, 2321, 120, -1974, 225, -604, -1927, 493, 1634, -617, 310, 407, -2585, -451, 1722, 754, -601, 756, -579, -1007, 530, -164, -860, 1843, 1930, -1740, -400, -19, -911, 1252, 1826, -219, -669, 1182, -634, -946, 765, 1120, 658, 702, 239, -2066, 259, 1277, 383, 548, 811, -691, -679, 241, -1047, 491, 1793, 404, -890, -900, -276, -675, 1231, 1250, -279, -545, 471, -1067, -1568, 1250, 825, 390, -262, -498, -1435, -616, 1149, 164, 287, 551, -273, -2076, -114, 705, 333, 1261, -196, -1097, -952, 247, -384, 857, 1399, -303, -638, -147, -377, -649, 1851, 1091, -926, 333, 132, -1236, 158, 1758, -41, 590, 1216, -1044, -1171, 440, 1181, 7, 1288, -52, -1303, -40, 667, -671, 733, 1645, -1063, 8, 165]
1741A65j613J275K197j852j088J734j781n88J996O14k098J434Q73l827J397J694
1757E32j016L81J398k142r86J999p73L30P53J75j410K26K36j318J852J212j608
1774a59p11J121j706N62J976j214K6Q84p16j438J080L29J17J312n76j928k83J979
1792F55q29R3J708j166o18J65p40p7K185N44j679q00N62J17o65J967p35m67O99
1811I19o33j654J128J491o58O85j023r84N4J164j08o12J359l49j437J5N85o98
1829g56J537R40k456J61N46m85j89J217j54n32N85j289q64J331J963j866J46O23
1847D58j904J112N33q91N68J792j844j322J384j34J29R84k3j936J547J82k191
1864a556R07J943n86r44J179k304nK503k21j135Q55j68j473J031L3l41J269J018
$$ y = [165, -1448, -173, 2024, 172, -916, 818, -963, -1551, 445, 1059, -1039, 395, 1268, -2559, -1162, 532, -484, -103, 1295, -847, -1833, 166, -607, -277, 476, 651, -759, -533, -297, -1615, 237, 1449, -159, -870, 251, -1455, -893, 1083, -131, -105, 779, 63, -1375, -295, 34, 151, 1463, 887, -1041, -1324, 655, -174, -81, 1627, 461, -157, 8, -732, -809, 1376, 1920, 241, -559, 3, 120, -545, 1422, 687, 220, 919, 286, -1368, -240, 1251, 593, 1278, 255, -729, -675, 489, 381, -231, 1128, 779, -658, -643, -58, -756, 781, 1721, -735, -574, -28, -513, -702, 515, 361, -171, 414, -875, -1739, -408, 1555, -311, -165, 458, -1446, -334, 199, -692, -124, 1668, -176, -1498, -114, -248, -119, 865, 842, -1094, 453, 635, -1556, -649, 1294, 708, -236, 943, -1361, -1366, 1137, 916, -219, 636, 468, -1005, 26, 59, -282, 987, 2005]
1882B005k648j069K135p02N02J319j394q73J130p65j119K030M09l91p72K2r38
1899a119N06J598r88J33qn14p32J036J16m88J490p59j351K61P71n01L84J153j056
1918f8k42j44K28j143J805Q47j586L8j6j41Q4J060k82j27j24j86o91K0J614o12
1938C34L38k63r82M25N09k10J0J421j272o45N84m7n33J000J027k137N02N40q53
1957b52k86J481k67r35J417j396p79J248M08n41Q31k45k068J108M23m19M22J270
1975A420j587j152J781j219n69K287J50k212R82k68j294J813N33r55r1J275k100
1992a206m35K334n36k65Q06r52j648K173q2j285J903n6j650L3J005j089Q19J056
2010I25q64m91K6K86r78J931K4j262Q53j31j241K39J438p62R95n21j094J95P66
$$ y = [2005, -643, -1712, 423, -279, 223, 1542, 148, -725, 405, -360, -1479, 551, 960, 569, -203, -181, -1119, -613, 985, -3, 130, 122, -392, -1124, -88, 28, -460, 1030, 271, -1080, -819, -48, -549, -165, 988, -68, -310, -454, -226, -1369, 436, 1283, -303, -265, -281, -422, -338, 722, 440, 313, 189, 3, -688, -668, 946, 334, 672, 409, -573, -148, 361, 151, 161, 1582, 310, -335, 249, 202, -331, 669, 1696, -441, 61, 601, -252, -538, 943, 676, -259, 1158, -238, -1017, 231, 639, 98, 929, 684, -1384, -276, 147, -272, 150, 1420, -167, -1319, 462, -757, -1326, 961, 1111, -1101, -119, -387, -1681, 132, 665, -290, -381, 894, -1206, -1641, 693, 157, -108, 698, -254, -1902, 271, 189, -1096, 807, 751, -899, -866, 139, -950, -131, 925, 61, -430, -404, -118, -1096, 835, 859, -403, 450, 319, -922, -683, 755, -7, 988, 467, -627, -432, 334]
2029C34K33j176J456J50j200N8l0l93R78J137j821J09K31p4k58M05N31n28M0l68
2049a86m07J8J362o37J4L26r58q6N47m2k29R05J38j426P1K7M61J49R97j164o04
2070g24J069p20o54J263P50j180M10n61q31J076Q49m15o47J076j211k49J198j71
2088C28m12J113m43j996J414J71n82J022L33j226j73J338j221j89J530j81j103
2105b77O91l99j356J982M53j418O57L78j433L11J332j320N17O89r24r70J187J93
2123B93j251J799j98j464J98Q44j263Q92R38j090L78k21n81l36J344L12r23K74
2141e5m89m77L58Q28q20Q08P29j779L91M39l38j43J262l51j069L44K93l48o0J447
2161I70o87l59K64p72j14R91P34p66K0m23j47J53L92J93k59Q71j365j68O81J85
$$ y = [334, 567, -609, 847, 997, -203, -145, -175, -568, 410, 1547, -274, -165, 66, -8, -266, 139, 670, 142, 182, -186, -593, -575, 787, 150, 164, 490, -468, -554, -7, -49, -278, 627, 765, -661, -590, -563, -102, 47, 1044, -120, -724, 345, -375, -1029, 234, 984, -196, 214, -347, -1178, -102, 747, 332, -315, 761, -450, -699, 499, 328, -84, 1029, 586, -1410, 4, 175, -407, 615, 948, -278, -451, 887, -334, -523, 1007, 826, -277, 414, 15, -1341, 641, 1094, -324, 333, 711, -722, -411, 921, -399, 118, 807, -117, -1087, 100, 293, -958, 841, 643, -821, -623, 221, -1042, -150, 788, -302, 76, -145, -726, -1062, 282, 594, -329, -55, -544, -1021, -663, 165, -655, 153, 882, -897, -506, -67, -405, -548, 714, 363, -706, -362, -69, -417, -477, 970, 283, -76, 188, -584, -698, 293, 1027, 261, 281, -142, -289, -136, 256, 449, 190, 1061, -304, -472, 209, 394]
2181C94l88R23j77j461R98l0n43N41R43q22r03J067r11K03P29L90j442P33O3j217
2201i10P40O08l32J84M87j700l7J572o53j02O24j12j180J011j75j248J800N32
2219A109j544n98J240j029P47Q38j211j20J151m95j706J826K29q28R20j84j679
2236a334Q51J204j518O20R58p69n95P95k69r01J834Kj257J99K03n12N33Q09j169
2255c16Q02J5q76l46J267j12k2L57j045k58P18L54r35O61Q65j713N10Q9k31R1
2275a25J147p67r45Q07k60p1q9R59n41j95p5o42J01J033J62q88O14m50k63K52
2295b36r5K10L82N06j230k37M66L25l8M74l42j007J085r5n58K84Q61p56k7K25
2315A97r01N84P51m2q18M28K16j191J142J36q86J033N50j793J2J251p35M67K64
$$ y = [394, 6, 929, 752, -709, 289, 259, -284, 257, 1200, 378, -525, 542, -369, -166, 563, 953, -489, 244, 307, -910, -170, 438, 106, 290, 777, -923, -960, 612, -41, -143, 481, 369, -811, 200, 25, -1223, 577, 1109, -435, -1033, 207, -822, -75, 763, -448, -568, 583, 88, -1618, 208, 437, -391, 529, 345, -1334, -483, 721, -797, -177, 781, 12, -583, 212, -57, -958, 876, 878, -379, -180, 23, -489, 44, 853, -316, 486, 501, -375, -721, 546, 434, 412, 769, -276, -534, 184, 538, -397, 264, 1129, -584, -74, 15, -216, -125, 1022, 255, -690, 117, -143, -214, -303, 656, 115, -80, -155, -797, -696, 337, 499, -389, 225, -225, -488, -236, -331, -121, 261, 767, -463, -700, -234, 91, 53, 527, 185, -822, 263, 168, -390, -106, 755, -1, -28, 197, -704, -120, 631, 589, -229, 199, 415, -776, 366, 502, -384, 649, 1199, -594, -582, 669, -66, 401, 665]
2334F65n33q40J211j58j063J377O4p75l03J043j615M60J507j196L96K86r68l95
2352h37J378n51n89J221j56j049j48J049p73L42J015j487q1Q30m59p48J599l52
2370B04l04M7m62m7K19Q03o79J39J97j013J63J104n94k64J477j330l63P68j83
2389a18k4L28M53j306N37M06k68m11R46J62j022O45n00r0R71Qn95n6K37n88L41
2410E6L1L30l09O44l94j299J083L88q43N08O67j399N01M36p29N47O6L73j055J04
2430b94N80q75P25N30j108L33Q69j350k4Q67m55Q14o9p82n82R60K58j063O95N74
2450F03r63l34J278j228J55J680j526l57J288m02j128J840r28J69m2K24j418N12
2468e77J487j146O08K05j054J1J092m75N6P70r99m12M65k7l60Q48M58j225l29
$$ y = [665, 132, -708, 503, 345, -718, 659, 723, -52, -355, 688, -927, -467, 1040, -156, 240, 526, -442, -837, 541, -10, -599, 622, 466, -583, -731, 318, -455, -113, 902, -585, -666, 164, -295, -1043, 556, 204, -100, -53, -515, -562, -343, 460, -219, -80, 117, -896, -733, 371, -223, -487, 990, -340, -703, 65, -118, -142, 186, 639, -667, -130, 276, 8, -403, 543, 705, -317, 328, -172, -262, 709, 717, 122, 66, 303, -285, 56, 87, 417, 108, 752, 358, -941, 142, 530, -313, 195, 862, -537, -36, 400, -329, 218, 284, 657, -398, -294, 286, -589, 136, 666, -442, -109, 760, -590, -614, 253, -202, 612, 543, -239, -821, 139, 397, -666, 29, 603, -360, -694, 584, -644, -489, 1191, -335, -692, 596, 194, -934, 906, -22, 147, 105, 329, -1089, -577, 910, -236, 372, 577, -477, -466, 626, 151, 207, 977, -22, -434, 31, 4, -356, 492, 950, -275, -604]
2487f04P61k18k23J076q14q2P50j258j73J086o7m79N40k93q13N31M07k60j0Q86
2507G43j254m01J168m09j84N59K52j209O63j08l21L83j41N70o82M34l80k77Q35
2526B41O7p77M95K14j037O73K36j98J20J43L1q99O69J99k64L01O92j075k54O91
2546B68n99M33L36j65j74L47o19k28Q76J68l13k56J47n38M20P43j275M97R62o74
2566C56j120J156j20m57Q59l41n77P0P05q46J16Q66o23p5M46p93p07J931n37r46
2586f37P88m78j45O82N7j142P23Q19j080k76P43J01n01J196j083q62J217n3p93
2605g24O68L29o89O04m92l92N41O90k37o85N57l72K5L61k30k90Q87m4j181L43
2625c31K91Q9r2O29p20k67P56k81k91N57J87p48J11K57o86P58J93l47k61N42n39
$$ y = [-604, 157, -61, -284, 792, -22, -104, 646, -612, -785, 301, 234, -245, 295, 2, -811, -280, 127, -133, -143, 743, -511, -912, 256, -153, -337, 222, 474, -735, -72, -180, -501, -118, -259, 311, -371, 63, -317, -594, 241, 308, -469, 26, 240, -797, -124, 112, -86, 34, 177, 208, -691, -22, 177, -87, 214, 906, -169, -423, 268, -331, 102, 438, 273, 99, 446, -173, -401, 475, 643, 330, 74, 221, -317, 103, 846, -429, 68, 1030, 356, -764, 392, 272, -185, 674, 333, -244, -174, 531, -315, -199, 667, 44, -31, 415, -378, -1085, 846, 309, -637, 151, -327, -472, 210, 267, -875, -152, 667, -413, -689, 54, 155, -346, 850, -233, -1095, 122, 69, -724, -56, 273, -416, 188, -304, -696, -155, 535, 298, -387, 170, -202, -177, 184, -46, -336, 551, 507, -674, -331, -40, 49, -43, 586, -134, -401, 355, 74, -217, 340, 527, -221, -110, 147, -539, 219, 412, 65, -196, 346, -193]
2646a93k50P28j96K26l70K95r06L78O79m35k92P24l02q68J015l47k98R53k14o70
2666c43k67L99J39nL72n43K8O07m46r52J515k06k47K77m85n83O24P20j093M35
2686e4O83m98p54P98j33m47J260m21p13M70J48n79N63K79j152R68J74j016K10
2705b14P48m52l61R00n31p14R67J82j337J282M89j575N23K67l75K39O66n61n61
2724d18P98o27m7L87M50q23M09l49k38M95K42o91J84P62r32q2O41l19k98O35K39
2745D18j239N53K8j58L64K47n09n8O12p76L4K67K74p8J96n18n19R81L43k95m24
2766b57L32l78J3P04m84k41M76K38q97L40N55n91N71J90n18m21P47n0m65N52j09
2787C07K9o1L9q33O66P32q55j85O39j97q50J154l08l70Q18n63o31L81L35n45M03
$$ y = [-193, -443, 285, 89, 315, -55, 240, -666, -288, 391, -44, -336, 388, 86, -782, 233, -114, -412, 541, 327, -343, -610, -211, -72, -77, 295, -248, -220, 387, -59, -1011, 504, 298, 51, 328, -157, -740, -116, 604, -489, -54, 629, 131, -623, 175, 42, -405, 855, 434, -279, 191, 339, -240, 323, 602, -550, 418, 592, -424, -214, 534, 82, -279, 621, 90, -624, 343, 525, -812, 470, 959, -616, -93, 174, -201, 38, 704, 143, -418, 380, -247, -294, 93, 543, -280, 129, -220, -458, 37, 279, -412, -228, 534, -398, -480, 161, -158, -456, 179, 418, -821, -268, -240, -398, -34, 213, -296, -354, 258, -518, -484, -217, 57, -21, 175, -343, -862, 119, 462, 167, -257, 75, -303, -290, 414, -70, -311, 165, 403, -494, -154, 401, -190, 381, 571, 53, -368, 379, 329, -136, 416, 307, 336, 275, 314, -519, 147, 879, 24, -161, 478, 281, -569, 585, 277, -93, 725, 162, -469, -88, 247, -298, 105]
2808A05L34q51J89M86k63p16J087k33l12L86l08p23J032M25j386Q96O1p75J65
2827d01N74k29j85J100j048p49R05L44o01O03J70j013O00j4p98N24P96l50o81
2846d53O67m26P5P80m24q00Q67J94j157O33K28j08L29J64j065M4Q17m6k24J32
2866B27J66p88M65l4m35O81J70o59O3K78o09M17M31m43j77K85n1p59P29J88m92
2887c47L59K58m18m92R84o57l9M19p3n63R3N36m59N12M1l20l11O20l63j53P03
2908C30o27N09J75l15o47O22M66p85M14J53p70M1J044p13j67J054o63o17N91K75
2928C70n22O27J93r02K99K71k91k85Q89n64l43Q55o67m56R06J32r79J114l87j029
2948g69N84N85m42j50R83r82j82M57j10l24P92r6q56N58r9l24M82J41n55J08M11
$$ y = [105, 439, -412, -223, 263, 0, -716, 371, 138, -174, 212, -96, -819, 213, 638, -748, 148, 209, -566, -401, 173, -56, -241, 859, -189, -938, -33, 311, -290, 313, 483, -530, 70, 56, -742, -218, 578, 228, -453, 214, -212, -137, 643, 219, -581, 286, 480, -677, -44, 184, 76, 405, 569, -496, -452, 365, 319, 95, 227, 393, -395, 70, 36, -399, 282, 452, -207, -144, 134, -475, -58, 373, -70, -247, 38, -13, -772, -43, 145, -347, 12, 270, -148, -640, 344, -313, -352, 67, -6, -569, -476, 60, -399, 113, 154, -166, -477, 143, -220, -373, 330, -297, 212, 387, 72, -575, 47, 513, -272, 142, 295, -475, -434, 610, -103, -270, 784, 121, -496, 95, 370, -152, 475, 668, -234, 65, 336, 45, -240, 649, 85, -258, 597, -70, -526, 380, 512, -467, 647, 260, -769, -185, 400, -42, -192, 791, -191, -373, 84, -26, -350, 442, 346, -510, 48, -51, -375, 107, 248, -307, -199, 212]
2969B12q28N03K32r8j85K27k47n43Q40L1o41L99J80m96J18M20n36L84L06l96k36
2990c54K93L21p06O77L8k89J2Lm07L93O89m63n04L72L08o23L54Q2m95N54L30m76
3012A09o26O64M2m2M07o82j42K25K74n20L57K93k69J35l65j47K0R07n86l34K81
3033Aj4l05L91P6n84O11m1p57J01N78o8j38P17r53N8M73j19n60P72K53j105O04
3055iL6l49L10P20p23l67J078r78n4P50k94n77R56k62r78J037J07j96j64N82p83
3076a58m6P90p57j45Q10k43o41O03k11l07O55l7o24L23O00p74K4O34k50l04M00
3097C42l38n56R55k39n26O37j31n30L50Mm97M73L16l38j79R0P8m71Q80j24p20
3118e24M29kl36p2O68m46rL40r4q06O28M46o05L2P80o35j58N22m91K39N60o13
$$ y = [212, -616, -113, 119, 21, -164, 63, -184, -727, 113, 144, -497, -98, 82, -414, -296, 124, -412, -28, 278, -118, -354, -61, 260, -446, 231, 269, -20, -8, -5, -412, -19, 670, 207, -297, 75, 383, -240, 114, 196, -299, 255, 585, 109, -517, 147, 189, 147, 554, -128, -270, -45, 229, -291, 66, 359, 90, 225, -140, -287, -267, 640, 54, -280, 1, -13, -318, 73, 149, -435, 176, 135, -622, -521, 57, -11, -149, 568, -385, -327, 146, 27, -533, 239, 492, -613, -9, 27, -322, -12, 708, -15, -382, 696, -282, -336, 414, 120, -457, 499, 237, -741, 296, 403, 207, 43, 625, -158, -204, 586, -171, -316, 494, 251, -390, 213, 2, -305, 350, 313, -311, 12, 612, -162, -138, 496, 246, -58, 342, 4, -552, 403, 164, -362, 275, 144, -386, -36, -32, -529, -56, 260, -78, -257, -167, -89, -560, 320, 196, -524, -95, -97, -433, -505, 163, -283, -292, 48, -46, -852, -224, 222, -383, -351, 429, -206, -364, 158, -333, -94, 466, -147]
3140a47O4l0K58m80N82pl26K03L24m60m19J128n63r3N29r19JQ26j82m28M50J9
3162C30m32L56J18j35k59P33p16j43M77k78l10O26k2q91J239m98p29P00J50k91
3182B5r7M29p42J24O87l83l64N08K35q90N30r0k04N52m7o27j9O49n95R5N54l16
3204A4l51P26l23q79J068j23l86L14J50p74P33J53p28L77J68N1m65J43L81m21
3224a72P05k59n61N04K72p41K45L38l72K23j09k67j1O47Po29L75J44k95l20N50
3245B74m74K96M27m33n61M74L61l41J54m35O7J33M10l58k42P65n56j53n6J75l08
3266c81P93k29p72P23K32o64J41M04m70L1P09n88n89R14j38q92P13L85q42R22
3286D02m75l79J54Q40o69j44no05M11O56Q5o97N76N45j615Q77N52o22N55M13j317
$$ y = [-147, -83, -113, 145, -335, 247, 240, -86, 117, 441, -19, -438, 690, 127, 34, 563, -356, -355, 471, 289, -139, 311, 330, -102, 254, 372, 237, -22, 711, -5, -148, 329, 51, -259, 367, 345, -546, 693, 195, -534, 166, 316, 25, -72, 357, -385, -261, 426, 43, -321, 187, 422, -468, 62, -28, -232, 320, 273, -354, -373, 276, -319, -224, 330, 14, -337, 389, 66, -813, 255, 132, -254, 60, 210, -564, 169, 322, -406, -29, 139, 190, -275, -132, 249, -172, 533, 274, -287, 217, 489, -252, -7, 331, -41, 182, 73, -194, -205, 442, 449, -180, 195, 339, 44, -276, 274, -200, 96, 523, 90, -471, 3, 364, 23, 177, -258, -191, -58, 352, -6, -248, 517, -39, -192, -248, -73, -381, 412, 183, -589, 134, 366, -298, -157, 247, -223, -192, 517, -71, -660, 254, 116, -776, -63, 322, -520, 402, -73, -452, -298, 542, -127, -271, -276, -881, -470, 186, 271, -426, 150, 695, -920, -43, 509, -113, 442, 855, -462]
3307d62k5R21p47J60K07m2l10O42k39l06N93L03r73L28N92j053N14K78n01J32
3327A2L74l18n00Q43k53j98l1L41p37J27Q60q41Q0O51n75L6L65p48M82M75q26
3348c81K8K89O6m60L33O58q18P8O07n49l30R48m68j10M05k82m26K40M93m58lL98
3370B58l08l64L96J46n29Q04o7n39K02j76J28J18K65m80O1K41m3l76M35J58n98
3391b68P85k17p09P02N4k70l4K61n00K44L14n22k2K62J4n26M70J85o15L58M26
3412C92q18M57L18q67L45K99K3k55M67k84l99O05k13k62K2N76q92L15N24p20M90
3433A23L36o44j69P21k44m52N44k05m38K16M39p13M72M82o24p5N51k44k03N70
3453D43n20j65P16k76j26l79P49n23J65L24m33M1M38k98m58P29n89R6M30m13k82
$$ y = [-462, -487, 434, -313, -153, 54, 12, -298, 344, 105, -201, 392, 695, -278, 50, 642, -411, 103, 381, -120, 12, 386, 68, -432, 411, 158, -40, -71, 270, -467, -340, 520, -321, -241, 410, -165, -129, 236, -512, -30, 445, -381, -353, -64, 2, -458, -125, 533, -285, -207, 400, -149, -479, 469, 1, -109, 296, 14, -412, -172, 321, -137, -140, 258, -50, -414, -18, 128, -401, 403, 336, -203, -1, -177, -49, 69, 334, -146, -85, 156, 113, -263, 172, 330, -268, 517, 300, -409, 293, 347, 77, 43, 304, -196, 48, 362, -160, -182, 80, 94, -432, 38, 223, -392, -34, 392, -426, 31, 349, -518, -173, 126, 149, -106, 361, 77, -322, 283, 70, -192, -170, 406, -486, -171, 353, -367, 123, 459, -185, -354, 367, 123, -329, 215, 10, -428, -212, 227, -486, -14, 468, -156, -231, 320, 76, -127, 443, -77, -242, 474, 198, 72, -307, 442, -81, 84, 408, -25, 16, 454, 156, -302, 427, -162, -66, 364, -49, -331]
3474c31M34N62o92n7Q6J46m62N74l7o02N87k47l95K32R7o9J36K46o26J15K37j52
3496b18p7K81J90p76O83m52M1L79J86q50L67L18m34K24J99J55m35N03j48n14M51
3517G3J58m34L69L29r02L21L96p30K58N22j94m39P39n30k53P25J49q32J87P85
3537F97j020M53N03o72P6N51n89l81P57k65j68L45k45k50L67J83p46M65L13m34
3557f0k47O85l63m09R86n00l28M18Q9o41K22N05o09J79K07k99q3K30j29j48M99
3578B04m02J51J81k82k21N80Rn27L34o6j3l08O78m71j14O01l21n75L33N31n32
3599b30O30n55r1Q8M46J16p09N86j19j71J96j71j83K48N12r60M15P8j02r6J90
3620A18R1m41M23l38o7L78K57n38k8L11o45O72K84n85k93O07q0l47M00k37k21
$$ y = [-331, 103, 665, -27, -84, 2, 148, -314, 260, 223, -379, 208, -39, -434, -202, -105, -174, -38, 208, -418, -303, -66, -218, -295, -14, 176, -600, 83, -369, -328, 51, 237, -613, -246, 72, -362, -138, 61, 216, -219, 284, 136, -378, 73, 231, -203, 166, 495, -407, -86, 310, -420, -162, 360, 166, -273, 466, -64, -317, 408, 557, -275, -88, 697, -323, 130, 633, -39, 37, 588, -1, -382, 375, 110, -58, 287, 42, -208, 159, 342, -404, 61, 374, -60, -307, 378, 15, -394, 592, 92, -236, 182, 271, -370, -148, 357, -252, -73, 134, -165, -248, -18, -147, -295, 204, -198, -47, 134, -148, -369, 211, 220, -307, 27, -39, -52, -360, 318, -153, -267, 334, 13, -562, -229, 302, -230, 400, -155, -246, -158, 288, 404, -305, 281, 162, -9, 187, 16, -167, 81, 593, -367, 48, 126, 24, -72, 118, 209, -232, 191, -147, -214, 164, 421, -117, -145, 166, -479, 193, 477, -108, -401, 206, 126, -221, 179, -58, -279]
3641b79M91j43l90J7O65o15J89L29m90K0N38m74m31Q17k17p4O0K15n52L80L52
3662D08o70r7Q48m53o11Q75k58k29M18l97l4K82J92m67M12J18l19r8L18l28l20
3683d10R40m52l05N47k42j70M06j10m82N07L8n07J72N29m1p02O36k59k73M21n5
3704A88m45K82L66o73N49k59l56J16O66l59l68M46j39L4j3O7m43K89L77r15L84
3725b06L80k36l28N89j90l39N83m38j78J78L77o16K83L58o93K45M77k42k20K00
3745a6j46J79J19k29k47L57K48n66J63M38m06k0L87m86Q3Q68q16p1N34j42m89
3766b58L31K91n99K73M43o17k32O76k93l41P78n08p6J28J77o26M40L65m96L22
3786A78r6k28n6M25l78q1N29k85k75J44J70o10Q87k36n83N44k4k37k39O38Ll70
$$ y = [-279, 212, 69, -321, -304, 361, -254, -65, 264, -226, -206, 332, -142, -573, 244, 27, -47, 13, 228, -324, 56, 408, -262, -359, 489, 36, -575, 300, 42, -187, 231, -166, -200, 82, 274, -193, 219, 337, 18, -80, 238, -90, -410, 530, 78, -227, 320, 78, -92, 314, 204, -278, 229, 267, -240, -68, 461, 420, -282, 354, 95, -178, 243, 188, -257, 25, 391, -282, 267, 8, -348, -232, 434, 75, -293, 153, 14, 48, 35, 102, -341, -52, 325, -590, -206, 174, -62, -390, 199, 9, -330, 253, -185, -363, -185, 192, -424, -141, 217, -476, -231, 246, 4, -216, -16, -162, 17, 136, -93, -340, 17, 265, -301, -138, 300, -106, -126, 261, -225, -142, 726, -90, -161, 373, 231, -258, 73, 364, -235, 38, 481, -136, -368, 308, 15, -326, 452, -56, -132, -4, 173, -453, -13, 352, -144, 178, 82, -146, -202, 223, -155, -236, 293, 8, -267, -123, 47, -563, 324, 88, -495, 49, 25, -212, -451, 187, 190, -180]
3808a80M86m71l90P85J79n25K56J4m78M91j96j56L66J03k77k59M07j22k79N47
3828C01m1o90N50J40n10J50M90m99m6L01k50J20J75J6p7j21L85n52K87J8j58K5
3850A4L63n69j66M81k21K56k74K38l36J06K00l52M7N98l10n69Q02o36m6M64l21
3871b31R8L22k18k53O5L36m27J76K40k97k03N80k96k66M81r2k57L64m2o06O00
3892G4K49l62M6O7j33l31N27j61k69N73q9m47L11K79o03O33Q0o65nN10j81j10
3914gN26o16m5L41J3m80M65K11o76N05l2r7n2L06n18j14O26m14j46M42k16k55
3936b33N20J2n07J41J14j68mL72k73n4L45m22q9M78Pm94L10J02m49M26J07o20
3958c79J8N78p70K41K26n4l1K23N4l36M68k7n09J48L16k17p8L94m69N6M42k75
$$ y = [-180, 306, -165, -555, 230, 409, -116, 140, 154, -324, 167, -29, -185, 181, 284, 7, -252, 155, 33, -246, 301, 260, -430, 120, 260, -250, -100, 390, -109, -155, 146, -104, 16, 191, 207, 130, 9, 394, -158, 129, 147, -11, 14, 377, -192, -358, 123, -98, 158, -116, 122, -214, -108, 92, -260, -213, 385, 75, -494, 308, -328, -374, 90, -231, -133, 189, -29, -282, -217, 119, -308, -132, 108, -189, -392, 188, -108, -374, 107, 15, -242, 122, 80, -526, 74, 323, -39, 7, 74, -59, -390, 137, -24, -293, 280, 191, -256, 55, 334, -269, 364, 444, -221, -226, 284, 103, -7, 519, -97, -142, 199, 212, -268, 197, 408, -268, 237, 205, 108, 56, 362, -156, -270, 356, -58, -204, 238, 22, -233, 287, 299, -208, -67, 47, -121, -125, 247, -26, -80, 265, -157, -246, 232, 239, -255, 55, 157, -292, 134, 241, -379, -361, 217, -553, -312, -86, -140, -171, 52, 106, -230, 238, 211, -298, -150, 166, -51, -129, 265, -204, -148, 294, 19]
3980A9j31P9K84l30K39Mk42N7j31q2R8M09l20O6o4jo1K53j51l15M26M08n36j59
4004a81L02k77j78P92m26k92O19k30l57L24J51l87J31m3k83q8O80m01k44O15l49
4025a22j47K76K4l29M17Q2o27J44L24k22lN50o02l0N93k25l20K66j1k46L98J8
4047B08m25J87K56k09j58K99l16J82K0q5j5L97j10n43O14k12k20L53J19l42M1
4068D1L98m62j02L39p5j13k47N80m27K42k2j48j39M62k77k42L14k44M0K51K9m12
4090b14J01R7j18J88p9j14k04O21n36j49N87m6k79j34M33n52K32J67k38K75k0
4111A8j92j88M44l16J54K73m57K42O3J09m50M70J52n57J44J95o13L44P85p43j17
4132b40N20j89m61M77J75m61L19K36m83n9L18k71K16L01m91n5M54j11l54M56q4
$$ y = [19, -112, -33, 251, -79, 160, 164, -78, -21, -152, -234, -136, 273, -47, 19, -45, -46, -107, 146, -5, -320, 106, 514, -22, -181, 121, -156, -334, 458, 32, -260, 359, 129, -228, 96, 247, -140, -9, -52, -335, -423, 257, -144, -388, 227, -122, -269, 7, 31, -298, 119, 201, -426, -282, 42, -180, -183, 367, -235, -265, 328, 103, -217, 49, 38, -208, 190, 208, -217, -30, 226, 17, -141, 158, -158, 24, 44, -41, -56, 341, 231, -312, 302, 90, -130, 223, 342, 0, 41, 439, -23, -125, 214, 139, 26, -221, 359, -68, 174, 152, 4, -135, 327, 50, -192, 122, -122, -82, 169, 198, -214, -113, -16, -134, 54, -25, -139, -343, 278, -258, -407, 180, 134, -145, -279, 154, -398, -166, 1, -237, 38, 18, -174, -362, 82, -234, -80, 193, -264, -22, 41, 150, -300, 170, 322, -235, -91, 104, -509, -165, 620, -123, -240, 280, 91, -370, 107, 282, -179, 140, 376, -107, -166, 152, -119, 97, 398, -93, -148, 306, 195, -159, 297, 213]
4153B13m93N77r1n76K90M14m21j66L04j9Q6N5j68j48K32mm48L86j83M6j2K42m67
4176c51J31L94k86k27M35m9k80K57j81j24L68K06m09k48O21m46J0M48l65J7J07
4197B8Ll70O07q3m27L08K09l63j56N27m84J64K80k72q2J72J35k55M42j80p9n5
4219F9l3J81l27K02O3K4L9k39l02N80k28k78J95R4k06J73K04m11J33L90m66J2
4241a31K16K9m95N16l9n39K49L19k76p5L49k01J32N6n33K6N65q6m83L39j9k24
4263c05M71j78j94J46M32n82p9L58r1k16N09l81k34O54j8m06l6M92k88j6K05m62
4285b19K93K18j63q3O5o8k62M23k97jK01R0l99K31K65l43m0L25j7l55K22K85n52
4308a81K66J91m02L16O9l52j38M95m04J43L64l76k22K88J0j89L03k2n45J57N69
$$ y = [213, -280, 297, 206, -370, -80, 334, -87, -253, 51, 32, 118, 173, 5, -143, 89, 85, -363, 23, -160, -114, -126, 116, -351, -220, 174, -112, -339, 96, 47, -233, 24, -157, -281, 87, 293, -116, -364, 257, -189, -179, 269, -96, -79, 28, 31, -339, 268, 185, -242, 66, 275, -88, -244, 283, -201, -37, 243, -29, -111, 61, 196, -59, 383, 203, 124, 69, 36, 217, -110, 92, 155, 179, 218, -21, -323, 257, 29, -249, -54, 40, -166, 7, 211, -200, -67, 323, -143, -131, 85, 114, -381, 135, 96, -443, -194, 125, -151, -226, 123, -78, 54, 110, -423, -397, 168, 82, -401, -62, -81, -305, 166, -12, -206, -60, 372, -210, -289, 69, -22, -238, 271, -110, -344, 310, 292, -114, -150, 342, 54, 38, 243, -219, 74, 292, 129, 46, 111, 43, -219, 204, -93, -94, 107, 197, -202, 29, 294, -49, -89, 236, 219, -136, 86, 371, -181, 85, 276, -126, 190, 259, -93, -231, 264, -140, 3, 367, -9, -231, 57, 67, -122, 181, 159, -386, -229, 340]
4329C40n46j22N84k82k17L84j11m77N36l9l29K27j1K6o6K61l38K55j1j68J2J85
4351I3j96j51M84m03j45L55K7j94N4L16l42q6O31m26k46M64p9l18L20k8j47o2
4373g9N31n36Q5K24n04K7J31J98j40J69m7m13M31J4l28L50m5l15K06J28l33J16
4395a30L73q2n62M77j68n1j30K91k12L3O27p43O6K82n9o9J64j03k96L06J29n08
4417c65M13J42j65k52M14k88J63N6l9k23J28r4o9L96r6j10J23K09o42M0N08l30
4439h1J64J54l64j24O82k09k67J66k7j65P4K31r6J5J7k28l8K02q4j40L82j7k16
4462C1J72k7j74j86M75k01j55J81j92k03L91L2n94O09j83j41KK32j38R8J17l78
4484b32K61J7j89M3K38o0l87M07j9l61M15Q9n08L2O05m89J28K31m33j00M22j3
$$ y = [340, -206, -328, 256, -26, -243, 141, 30, -447, 89, 50, -279, -52, -63, -37, -103, 158, -180, 75, 64, -104, -92, 93, -103, -254, 230, -173, -318, 37, 64, -130, -76, 240, -102, -188, 443, 17, -229, 235, 156, -162, 158, 130, -17, -79, 452, -84, 1, 225, -279, -252, -121, 77, -63, 106, 59, -354, 77, 91, -237, 113, 68, -247, -41, 87, -246, -130, 243, 161, -401, 76, -92, -143, -273, 18, -194, -161, 466, -277, -211, 71, 12, -57, 107, 4, -292, 14, 143, -365, 48, 190, 25, -227, 187, -101, 62, 118, 79, -144, -16, -110, -179, 217, 121, 11, 134, 343, -299, -259, 249, -81, 83, 237, -127, -251, 431, 222, -45, 121, 94, -71, 3, 234, 138, 153, 170, -58, -96, 106, 22, -118, 264, 247, 31, 203, 176, 2, -184, 291, 90, -65, 116, -76, -279, 112, 144, -450, 159, -24, -165, -163, 69, -69, 29, 146, -232, 29, 46, -143, -100, 138, 78, -309, 98, 79, -282, 133, 222, -286, -254, 351, -138, -10, 221, -212, -312, 110, 97]
4506I7k47N9K67j82N4R1l41K24J74k63j07L98k61J06N7m9k35L11j5l70K87L74
4528D29m47O6K4l31K43K46k47j56M97O9o15K2J71J4o8K78m15K13K07k87M9N8l1
4551a1l48N95r4n05L96k8J74j65K4j79Q3L24m43r7M19p7l18L98ml19J86J05l02
4574a86J26L05k77R4O6J08l63K64r2j08L07j09l59L62J86m45J03K13k02KJ49J52
4596B96m74M96j78l05M91k60l53N06J18n48J77K66m06j9J91j05m6M00k08j18K92
4617B13l10NJ21J38n41L64K20k72o9L23k67l08O44l18k52M92M9n07j14M96l03
4638a96J37J59k27m2P6l1j85M83j68k32L93j33j36L5N1k62L43K3j22m4M48m26
4660e6j63L19j76L2K25j45l49L06J94l42J33K42n2j89M65k74m30M08p5j16m6K77
$$ y = [97, -150, -91, 176, -6, 48, 139, -202, 22, 196, -67, -174, 224, -37, 69, 126, 77, -158, 153, 138, -232, 55, 429, -18, 48, 72, -259, -16, 230, -17, -173, 324, 393, -222, -200, -29, -15, -83, 195, -220, -7, 200, -87, -38, 20, -11, -359, 236, 142, -363, 33, 5, 179, 14, 38, -141, -58, 266, -177, -274, 145, 68, -250, 148, 144, -175, 11, 116, -186, -60, 245, -32, 62, 128, 236, -127, 137, 45, -63, 244, 135, -224, 138, 324, -121, -18, 195, -7, -5, 144, 296, -178, 318, 140, -165, 326, 66, -287, 219, 337, -211, -34, 232, -174, -193, -2, -107, -153, 247, 39, -79, 213, -97, -92, 29, 167, -374, -10, 210, -62, -131, 192, -75, -383, 261, -57, -309, 183, 232, -275, -389, 107, -196, -59, 100, -127, -169, -93, -124, -309, 174, 6, -226, 167, 34, -102, -67, -16, -278, 65, 88, -34, -78, 370, -56, -219, 100, -76, -44, 181, 36, -313, -7, 187, -155, -22, 220, 168, -21, 444, 170, -260, 148, 73, -43, -89, 188]
4682A88m15L86J66k41j56J39j30q2L59j76m3J25J2j63J78K8m16L08L1l33J95K94
4704B54k34l53L18J15k55J68J28l10L8M03o18M53Q5l70J80J10l7l45L69k36L5
4725a02J11J16j53j74N72n65J77K00k79k57M86L9l07L57k72J87j60K66k75N0J13
4746A30k18K14J13m07J32J17J25l46L19j93J68l02L04n36M62L22m54j08L71k50
4766c7l23O88n37J54J21j48m7K55j76J7j09J48j78o6L82l02o9L64k28o6J99m7
4788ek19L99j6l55N51Rm64J16j67J13l21O45k71l15M11J66m35J09K7k26K26j3
4810c5K98l29K05J78m83L16o3j56K32k1m12L45L21m96J87K75k76r1L04n38Q6L18
4832A65j85K1L1L02l18j25K01l84J91L75l14j27K58k00pK60j16k27J65K00l32
$$ y = [188, -227, 159, 325, 84, -72, 67, -63, -145, 214, 38, -5, 120, 132, -31, 147, 175, -241, 67, 98, -235, -40, 254, 20, -333, -15, 100, -155, 13, 141, -169, -131, 272, -346, 107, 192, -178, 2, 112, 75, -270, 99, -137, -102, 9, 125, -28, -202, 370, -195, -18, 182, -97, -354, 132, 171, -136, 221, -51, 136, -24, 242, -33, 17, 130, -88, 126, 239, -168, -36, 81, 206, -140, 179, -14, 154, -148, 156, -380, 82, 404, -50, -158, 213, -37, -360, 328, -209, -55, 66, -82, -129, 126, -50, -33, -142, 6, -172, -238, 144, -158, -227, 137, -91, -157, 42, -5, -224, 175, 159, -196, 355, 364, -100, 16, -151, -38, -359, 286, 15, -300, 111, 277, -158, -49, -22, -248, -22, -35, 263, -66, 139, 317, -166, 150, 87, -69, 163, 142, -270, 75, 396, -100, 87, 362, 86, -5, 299, -239, -153, 165, -20, 1, 32, 334, 16, -109, 92, -292, -101, 274, -40, -167, 91, -109, -116, 144, 28, -199, -34, 166, -166]
4853a66PK56l99Q3J75l35J22M47k68j92L47m1J01j81Lj45m4L43j10j92K56j38
4875g1l1J77j90qJ92J09m20K69Q4j64O3j09J30k12L67j26k88L08k3%R3j40k26
4898b16L37j23n5K02n2q8r1P1l6j32M22k09l15L76J19l11N9K24m00J91J54j34
4920gr1K63o2n1J6j16j85K77O1m96M26l2k27J00M8J25j66M57m97J67K22Ql76M7
4944h9K00n5k25L04l61Q8M21k11k91L77k08N8J11k9j32J48J61n05K35Q8j14k28
4966b57M99l00j39M53l09J55J1P7n38L87J26n78M12K50j77l21M10j38k7J97k74
4987h1n2L05q1k55K04R4j50n2K69m79J24M09l04l26L15K20l40K75M8m06L51P7
5009A65k68P6J26j20R9q0K1m8J78k08j94K68j5k41K56O8k60K16K90l55j66K65
$$ y = [-166, -159, 97, -302, -219, -44, -379, -257, 190, -78, -270, 77, 36, 137, -44, -41, -186, -230, 113, 3, -189, 67, -71, -102, 75, -115, -123, 69, 178, -242, 27, 111, -53, 10, -99, 31, -181, 186, 60, -228, 80, 57, 57, 150, 10, -216, 121, -2, -57, 145, 93, 5, -86, -15, -51, -183, 239, 30, -285, 91, 210, -101, -42, 182, -218, -27, 127, -7, -98, 165, 103, 52, 68, -48, -233, 44, 105, -391, 35, 3, -224, -124, -76, 49, -117, 340, -157, 10, 232, 240, -136, -89, 111, 56, -169, 135, -226, -138, 283, 72, -219, 158, -50, 8, 119, 90, -42, 106, 267, -238, -3, 85, -29, -257, 242, -58, -197, 256, -53, 102, 113, 190, -348, 39, 165, -413, -1, 249, 72, -249, 161, 23, -4, 193, -81, -133, 172, 91, -164, 40, 134, -16, -68, 201, -278, -154, 255, -49, -375, -60, 160, -180, 95, 143, -263, 88, 165, -103, -27, 99, -21, 78, -2, 19, -29, 149, -59, -253, 15, 0, -241, 15, 83, -177, 39, 329, -26, -192, 73]
5031G3%k73K37J69k68J60ok08J70J71j79j23J16K79l83J57j43j12L44o9k69L37
5053A80j09j14J86L9k48NM82n30j36L90l6j16J51L0n54O18j04k28J79Q9j19k32
5075a77K34l23J08J55q7j03J73M7k74L84k19j66J06K68k42j64L67j42J0K9k8K3
5097b1P1L9m64J19L06j97J0K46j03NJ76k24J12L2o1k63M73k88NN1k0p0J42J09
5121A85l70M85l47j6J95L2M1j85j05J85j46m35N90k53J07K81l64Q6K75l28k94
5142c81M79p3l20P40j073K54k3L71PK12n1L18r02R44n04K94l60J01q0O55m22m13
5164b27q5O94k44n4N12q25J3J74L2o3K21r9j03N4J72j89J88P0k99P4J54k45J68
5187I3m7J20l24K91J2o9O8j68k01K36K04k72j15K44j43k09N22j57l71N73p6k38
$$ y = [73, 73, -200, 37, 206, -62, 98, 92, -116, 54, 225, 46, -77, 39, 318, -65, 92, -51, -163, 181, 112, -157, 180, 71, -43, 143, 182, -66, -61, 421, -109, -245, 145, 109, -7, 144, 174, -380, 238, 134, -94, 85, 174, 55, -177, 57, -266, -158, -3, -90, -193, -20, 27, -247, 137, -82, -248, -142, 126, -116, -280, 87, -55, -45, -16, -44, -21, 50, 89, -375, -256, 50, -147, -137, 109, 6, 11, 187, -37, 75, 107, 46, -217, 256, -32, -27, 24, 4, -66, 76, 185, -185, 300, -47, -63, 132, 164, 205, 20, -85, 100, -46, -481, 109, -144, -37, 244, -120, -34, 241, -87, -381, 98, 25, -295, 445, -628, -374, -397, -26, -19, 193, 142, 460, -442, 502, -2, 292, -68, 33, -47, 608, 186, -227, -312, 382, 138, 84, 596, -229, -216, -42, -10, -73, 148, 49, -54, 0, 172, -17, 171, 241, -58, 16, 170, -75, 93, 46, 166, -158, 133, 145, 76, 144, -24, -225, 11, 215, -57, -172, 72, -71, -280, 242, 85, -286, 287, 211, -27]
5209b7J09J95l00O1K57k65k87O49l88j06j4L30m47L37J04l93K12J91k58j07M00
5230B53m25J46P9k21L1R7J09m05K31J38l01L41j67J8k10M51l95J59M9o8j24J91
5252b3J36j86J28k14J58k9K08k78R5L16m80J56Q5R5k30J21J18n9j51J54j52m7
5274g9M02m41K44j0j46p1J45K4k37L73j7m17L23K76m49n4L64k35k04M39k69o4
5296a03j2M15l67R4J15j73J31M3k65pK51q5k65K21K8q0J95k54o8L65q7l31J42
5319i7K58k49L3J58k16L2J78J55m20L30N9k82J10k1j45J80R9k11P7K8Q0r4n5j31
5343a44J4J83K2j74J73J85k58J33Q3l73K39R9j20j00J52lk58K31k1j64J52N7j87
5366g9j21M18l92q7K24l1k6J83j58R8J45j62j73J46K47l57lL44k75k34N07k94
$$ y = [-27, 82, 277, -23, 38, 295, 30, -257, 392, 4, -102, -116, 214, -233, 104, 208, -185, 27, 218, -40, -147, 253, -172, -26, 53, -168, -137, -40, 69, -336, -105, 33, -268, 73, -94, -76, -286, 165, -230, -71, -22, -90, -214, -23, 113, -73, 55, -159, -1, -30, 178, -100, -5, 311, -169, -13, 72, 167, -63, 58, 176, 117, -34, 120, -32, -79, 323, -118, 126, 116, -30, -101, 44, 68, -169, 204, 187, -230, 93, 369, -80, -134, 230, -5, -209, 230, -39, -103, -115, 300, -67, 27, 142, -31, 100, 143, -122, -129, 122, 37, -228, -7, 21, -59, 136, -118, -186, 179, 92, -239, -97, 161, -88, -55, 103, -113, -81, 97, 252, -168, 162, 221, -61, 49, 28, -117, 63, 162, -49, 28, 56, 136, 42, -13, -144, -130, 53, 75, -99, 74, 259, 1, 134, 217, -156, 83, 182, 62, -38, 114, 111, -147, 84, 63, -101, 51, 108, -79, -200, 218, -174, -261, -37, -68, -94, 89, -69, 29, 174, 12, -161, -15, 232, -125, -128, 216, -59, -293, 214, -80]
5388h0j69L46j58k37L06n1j42J9K57k15j06K02j21j93L80n5k03M10o6k70K95L2
5410A81j11M5O5j51j02K28n39M82L35j86K02p24R8k23O12r9K82n00M07m07L03
5431A98l5j59j63J58J36k13N42p23p0O81k54J8R1k70j12k97P09l70o3L09K41p56
5453d02O68l59k35J03K80J6k8N3n10L90K13j54k81M32j4j35jj46J20j04j31L56
$$ y = [-80, -249, 97, -61, -298, 8, -43, -185, -166, 91, -124, -230, -28, -149, -342, 38, -17, -220, 190, 124, -146, 149, 181, 70, 115, 180, 29, -73, 155, -384, 98, 433, 247, 449, -275, -177, -400, 212, 113, 395, -105, 302, -105, 198, 163, 4, -159, -1, 135, -78, 464, -259, -329, 352, 98, 116, 207, -63, -175, -472, 237, -133, -196, 113, 354, -402, 266, -93, -328, -225, 55, 71, 43, 96, -414, -24, 189, 35, -246, 186, 172, 37, 36, -110, 10, -94, -225, 131]
$$ [...]
8191g7
##END NTUPLES=NMR FID
##END=
