##TITLE=1H_Ser DGA-N-1
 CDCl3, 8 sc, 
 29.04.2021
##JCAMPDX= 6.0         $$ Bruker NMR JCAMP-DX V2.0
##DATA TYPE= NMR FID
##DATA CLASS= NTUPLES
##ORIGIN= UXNMR, Bruker Analytische Messtechnik GmbH
##OWNER= root
$$ XWIN-NMR		Version 3.5
$$ Thu Apr 29 15:58:52 2021 Russian Standard Time (UT+4h)  she@DPX200
##.OBSERVE FREQUENCY= 200.131506
##.OBSERVE NUCLEUS= ^1H
##.DELAY= (6, 6)
##.ACQUISITION MODE= SIMULTANEOUS
##.ACQUISITION SCHEME= undefined
##.AVERAGES= 8
##.DIGITISER RES= 18
##SPECTROMETER/DATA SYSTEM= spect
##.PULSE SEQUENCE= zg30
##.SOLVENT NAME= CDCl3
##.SHIFT REFERENCE= (INTERNAL, CDCl3, 0, 15.7039)
##AUDIT TRAIL= $$ (NUMBER, WHEN, WHO, WHERE, WHAT)
$$ ##TITLE= Audit trail, XWIN-NMR		Version 3.5
$$ ##JCAMPDX= 5.01
$$ ##ORIGIN= Bruker BioSpin GmbH
$$ ##OWNER= she
$$ F:/spectra/data/she/nmr/H-F/1/audita.txt
$$ ##AUDIT TRAIL=  $$ (NUMBER, WHEN, WHO, WHERE, WHAT)
(   1,<2021-04-29 15:57:14.84 +0400>,<she>,<DPX200>,
      <created by zg, POWCHK disabled, PULCHK disabled
       configuration hash MD5:
       00 E9 B6 7A A2 85 ED C7 34 08 36 98 17 FE 4E 26
       data hash MD5: 16K
       D6 A5 42 E8 7E 7B F8 AF B4 0E 1A 13 B8 8F 13 EA>)
$$ ##END=
$$ 
$$ hash MD5
$$ 0C 43 28 8E 1B 71 57 CB E2 26 6E DD A5 63 AA D3
##$RELAX= 
##$RELAX= 
##$RELAX= 
##$RELAX= 
##$RELAX= 
##$RELAX= 
$$ Bruker specific parameters
$$ --------------------------
##$DU= <F:/spectra>
##$EXPNO= 1
##$NAME= <H-F>
##$PROCNO= 1
##$TYPE= <nmr>
##$USER= <she>
##$AMP= (0..31)
100 100 100 100 100 100 100 100 100 100 100 100 100 100 100 100 100 100 
100 100 100 100 100 100 100 100 100 100 100 100 100 100 
##$AQSEQ= 0
##$AQ_mod= 1
##$AUNM= <au_zg>
##$AUTOPOS= <>
##$BF1= 200.13
##$BF2= 200.13
##$BF3= 200.13
##$BF4= 200.13
##$BF5= 200.13
##$BF6= 200.13
##$BF7= 200.13
##$BF8= 200.13
##$BYTORDA= 1
##$CFDGTYP= 0
##$CFRGTYP= 5
##$CHEMSTR= <none>
##$CNST= (0..31)
1 1 145 1 1 1 1 1 1 1 1 1 1 1 1 1 1 1 1 1 1 1 1 1 1 1 1 1 1 1 1 1 
##$CPDPRG= <>
##$CPDPRG1= <>
##$CPDPRG2= <>
##$CPDPRG3= <>
##$CPDPRG4= <mlev>
##$CPDPRG5= <mlev>
##$CPDPRG6= <mlev>
##$CPDPRG7= <mlev>
##$CPDPRG8= <mlev>
##$CPDPRGB= <>
##$CPDPRGT= <>
##$D= (0..31)
0 1.2 0 0 0 0 0 0 0 0.06 0 0.03 0 0 0 0 0.0002 0 0 0 0 0 0 0 0 0 0 0 0 
0 0 0 
##$DATE= 1619697434
##$DBL= (0..7)
120 120 120 120 120 120 120 120 
##$DBP= (0..7)
150 150 150 150 150 150 150 150 
##$DBP07= 0
##$DBPNAM0= <>
##$DBPNAM1= <>
##$DBPNAM2= <>
##$DBPNAM3= <>
##$DBPNAM4= <>
##$DBPNAM5= <>
##$DBPNAM6= <>
##$DBPNAM7= <>
##$DBPOAL= (0..7)
0.5 0.5 0.5 0.5 0.5 0.5 0.5 0.5 
##$DBPOFFS= (0..7)
0 0 0 0 0 0 0 0 
##$DE= 6
##$DECBNUC= <off>
##$DECIM= 32
##$DECNUC= <off>
##$DECSTAT= 4
##$DIGMOD= 1
##$DIGTYP= 9
##$DL= (0..7)
0 120 120 120 120 120 120 120 
##$DP= (0..7)
150 150 150 150 150 150 150 150 
##$DP07= 0
##$DPNAME0= <>
##$DPNAME1= <>
##$DPNAME2= <>
##$DPNAME3= <>
##$DPNAME4= <>
##$DPNAME5= <>
##$DPNAME6= <>
##$DPNAME7= <>
##$DPOAL= (0..7)
0.5 0.5 0.5 0.5 0.5 0.5 0.5 0.5 
##$DPOFFS= (0..7)
0 0 0 0 0 0 0 0 
##$DQDMODE= 0
##$DR= 18
##$DS= 0
##$DSLIST= <SSSSSSSSSSSSSSS>
$$ [...]
##$SUBNAM2= <"">
##$SUBNAM3= <"">
##$SUBNAM4= <"">
##$SUBNAM5= <"">
##$SUBNAM6= <"">
##$SUBNAM7= <"">
##$SUBNAM8= <"">
##$SUBNAM9= <"">
##$SW= 16.9725357007746
##$SWIBOX= (0..15)
0 0 2 0 0 0 0 0 0 0 0 0 0 0 0 0 
##$SW_h= 3396.73913043478
##$TD= 16384
##$TD0= 1
##$TE= 0
##$TE2= 300
##$TE3= 300
##$TEG= 300
##$TL= (0..7)
0 120 120 120 120 120 120 120 
##$TP= (0..7)
150 150 150 150 150 150 150 150 
##$TP07= 0
##$TPNAME0= <>
##$TPNAME1= <>
##$TPNAME2= <>
##$TPNAME3= <>
##$TPNAME4= <>
##$TPNAME5= <>
##$TPNAME6= <>
##$TPNAME7= <>
##$TPOAL= (0..7)
0.5 0.5 0.5 0.5 0.5 0.5 0.5 0.5 
##$TPOFFS= (0..7)
0 0 0 0 0 0 0 0 
##$TUNHIN= 0
##$TUNHOUT= 0
##$TUNXOUT= 0
##$USERA1= <user>
##$USERA2= <user>
##$USERA3= <user>
##$USERA4= <user>
##$USERA5= <user>
##$V9= 5
##$VALIST= <valist>
##$VCLIST= <CCCCCCCCCCCCCCC>
##$VD= 0
##$VDLIST= <DDDDDDDDDDDDDDD>
##$VPLIST= <PPPPPPPPPPPPPPP>
##$VTLIST= <TTTTTTTTTTTTTTT>
##$WBST= 1024
##$WBSW= 4
##$XGAIN= (0..3)
0 0 0 0 
##$XL= 0
##$YL= 0
##$YMAX_a= 106475
##$YMIN_a= -64352
##$ZGOPTNS= <>
##$ZL1= 120
##$ZL2= 120
##$ZL3= 120
##$ZL4= 120
##$ABSF1= 10
##$ABSF2= 0
##$ABSG= 5
##$ABSL= 3
##$ALPHA= 0
##$AQORDER= 0
##$ASSFAC= 0
##$ASSFACI= 0
##$ASSFACX= 0
##$ASSWID= 0
##$AUNMP= <proc_1d>
##$AZFE= 0.1
##$AZFW= 0.1
##$BCFW= 1
##$BC_mod= 2
##$BYTORDP= 1
##$COROFFS= 0
##$CY= 11.3945322036743
##$DATMOD= 1
##$DC= 2
##$DFILT= <>
##$DTYPP= 0
##$F1P= 15.9154993809931
##$F2P= -4.1035820241983
##$FCOR= 0.5
##$FTSIZE= 0
##$FT_mod= 4
##$GAMMA= 1
##$GB= 0.15
##$INTBC= 1
##$INTSCL= 1
##$ISEN= 128
##$LB= 0.24
##$LEV0= 0
##$LPBIN= 0
##$MAXI= 10000
##$MC2= 0
##$MEAN= 0
##$ME_mod= 0
##$MI= 1.114404
##$NCOEF= 0
##$NC_proc= 0
##$NLEV= 6
##$NOISF1= 3.799351
##$NOISF2= 2.8
##$NSP= 1
##$NTH_PI= 0
##$NZP= 0
##$OFFSET= 15.70392
##$PC= 1
##$PHC0= -11126.38
##$PHC1= 18.80103
##$PH_mod= 1
##$PKNL= yes
##$PPARMOD= 0
##$PSCAL= 0
##$PSIGN= 0
##$REVERSE= no
##$SF= 200.130013532006
##$SI= 16384
##$SIGF1= 3
##$SIGF2= 2
##$SINO= 400
##$SIOLD= 16384
##$SREGLST= <1H.CDCl3>
##$SSB= 0
##$STSI= 0
##$STSR= 0
##$SW_p= 3612.71676300578
##$SYMM= 0
##$S_DEV= 0
##$TDeff= 0
##$TDoff= 0
##$TI= <>
##$TILT= no
##$TM1= 0
##$TM2= 0
##$TOPLEV= 0
##$USERP1= <user>
##$USERP2= <user>
##$USERP3= <user>
##$USERP4= <user>
##$USERP5= <user>
##$WDW= 1
##$XDIM= 8192
##$YMAX_p= 0
##$YMIN_p= 0
$$ End of Bruker specific parameters
$$ ---------------------------------
##NTUPLES= NMR FID
##VAR_NAME=  TIME,          FID/REAL,        FID/IMAG
##SYMBOL=    X,             R,               I
##VAR_TYPE=  INDEPENDENT,   DEPENDENT,       DEPENDENT
##VAR_FORM=  AFFN,          ASDF,            ASDF
##VAR_DIM=   8192,          8192,            8192
##UNITS=     SECONDS,       ARBITRARY UNITS, ARBITRARY UNITS
##FACTOR=    0.0002944,     1,               1
##FIRST=     0,             0,               0
##LAST=      2.4114304,     0,               0
##MIN=       0,             -64352,          0
##MAX=       2.4114304,     106475,          0
$$ Real data points
##PAGE= N=1
##DATA TABLE= (X++(R..R)), XYDATA
$$ plain form
0 0 0 0 0 0 0 0 0 0 0 0 0 0 0 0 -8 8 -8 8 -8 16 -16 16 -24 24 -32 34 -40 48 -56 64 -72 81 -96 105 -120 136
36 136 -152 169 -186 209 -233 257 -283 315 -347 384 -422 468 -514 564 -622 686 -755 834 -923
55 -923 1022 -1136 1268 -1423 1604 -1826 2101 -2448 2910 -3549 4488 -6016 8886 -16104 71644
70 71644 106475 -45283 8477 -59114 -25149 60153 -539 10079 25958 -36288 20584 -14885
82 -14885 -12772 60286 -35217 -1494 29915 -41899 37549 27531 -44301 11396 -4084 -15436
94 -15436 50230 -7590 -5793 -6087 -35869 33457 6711 -2041 23881 -41822 -14482 33930 -22860
107 -22860 14701 19333 -42336 14442 -7627 -15041 23576 -11311 4176 -2936 -26513 15599 -357
120 -357 -15803 26175 -25539 -11523 28089 -26286 7230 5385 -20984 11530 497 -5365 6494
$$ packed form
0@%%%%%%%%%%%%%%qJ6j6J6j6K4l2L2m0M8n6O6p4Q8j04J20j36J53j77K01k25K56
36A36k88L21l55L95m42M90n40N98o62P31q06Q90r82J078j186J308j441J589j757
55i23J945k158K404k691L027l430L927m549N358o459Q037j0504J4902k4990Q7748
70G1644L4831j51758N3760o7591L3965Q5302o0692J0618J5879o2246N6872l5469
82a4885K113P3058r5503L3723L1409p1814P9448j0018p1832N5697j5480j1352
94a5436O5666n7820J797k94k9782O9326k6746q752K5922o5703K7340M8412n6790
107b2860L7561M632o1669N6778k2069p414L8617l4887J5487p112k3577M2112j5956
120c57j5446M1978n1714J4016L9612n4375L3516j845k6369L2514j1033n862J1859
$$ plain form
133 6494 -13174 3351 7690 -16192 20615 -7601 -14465 22745 -12977 -411 15250 -10253 422
146 422 8556 -6883 6744 1230 1281 10733 -12704 10431 847 -9158 19710 -587 -7733 12649
160 12649 -3659 -7863 14926 -3584 3598 7958 -4540 1084 -8650 8860 6859 -4584 7869
173 7869 -3261 -14357 10964 3879 -10711 13839 -5145 -7673 4187 -3770 -2185 -2045 5204 -1492
187 -1492 -6445 981 -1397 -11763 7585 2885 -12976 9672 -4828 -9915 2054 -1253 -4034 1924
201 1924 4128 -6098 -4561 -1178 -2 -6484 8145 2731 -11309 6491 -3434 -6525 5908 5797
215 5797 -4539 2129 1647 -6463 2213 4595 4277 -4248 5788 1234 -6747 8350 2460 -3134 5082
230 5082 6338 -5890 4106 3626 -3933 4353 4038 3335 -3473 4564 31 -4300 6370 3801 -3094
$$ packed form
133F494j9668J6525M339k3882L6807k8216o864L7210l5722J2566J5661k5503J0675
146D22Q134j5439J3627n514N1R452k3437K3135r584j0005K8868k0297p146K0382
160A2649j6308m204K2789j8510P182M360j2498N624r734J7510k001j1443J2453
173G869j1130j1096K5321p085j4590K4550j8984k528J1860p957J585J40P249o696
187a492m953P426k378j0366J9348m700j5861K2648j4500n087J1969l307k781N958
201A924K204j0226J537L383J176o482J4629n414j4040J7800r925l091J2433j11
215E797j0336O668m82q110Q676K382l18q525J0036m554p981J5097n890n594Q216
230E082J256j2228R996m80p559Q286l15p03o808Q037m533m331J0670k569o895
$$ plain form
245 -3094 1484 4978 -8116 3032 3949 -3114 2330 1373 -819 -6365 3535 481 -2376 2306 925
260 925 -6540 -3437 4667 -6388 2681 2420 -5712 -4245 -647 -794 -3899 4664 -2426 -5264 -1947 1175
276 1175 -4705 -1182 5330 -7230 -72 2167 -3572 -3527 3446 -498 -4570 5713 -1398 -3459 -192
291 -192 3700 -3423 1197 7270 -5702 646 3040 -1033 -2209 7614 1586 -3228 5505 -1454 -1949
306 -1949 3106 7416 -2341 1745 4269 -6064 2088 5909 1642 -1939 6100 -2506 -4072 6507 862
321 862 -1177 1759 3719 -6044 2259 4406 -4989 732 3274 -1255 -3545 5384 -4383 -4740 3856 -484
337 -484 -2280 571 1149 -8679 715 2327 -3901 497 1412 -4693 -5952 4245 -3720 -1439 3191 -2237
353 -2237 -4905 -1217 1735 -5082 3422 2093 -4357 -2328 1634 -2209 -1850 6576 -2933 -1574 1731
$$ packed form
245c094M578L494j3094J1148R17p063N444r57k192n546R900l054k857M682j381
260I25p465L103Q104j1055R069k61q132J467L598j47l105Q563p090k838L317L122
276A175n880L523O512j2560P158K239n739M5O973l944m072J0283p111k061L267
291a92L892p123M620O073j2972O348K394m073j176R823o028m814Q733o959m95
306a949N055M310r757M086K524j0333Q152L821m267l581Q039q606j566J0579n645
321H62k039K936J960r763Q303K147r395N721K542m529k290Q929r767l57Q596m340
337d84j796K851N78r828R394J612o228M398R15o105j259J0197p965K281M630n428
353b237k668L688K952o817Q504j329o450K029L962l843L59Q426r509J359L305
$$ plain form
368 1731 -509 -1616 2331 3480 -3479 2569 1833 -572 -514 3831 -976 -971 7209 -1304 -115 1960 483
385 483 -1042 4360 4217 -2241 1846 582 -362 -538 6266 321 -2650 4411 -2355 -1430 2976 2397 -3103
402 -3103 2262 1047 -3933 595 957 -11 -2778 3597 -2152 -4455 2892 -1677 -3216 1567 1059 -6219
418 -6219 1660 -189 -4550 493 403 -1599 -3417 2806 -3322 -4344 2240 -166 -3505 1918 1124 -7861
434 -7861 2638 1035 -3053 1740 1039 -2323 -2365 3922 -1842 -1334 3014 950 -3804 2645 2831 -5207
450 -5207 5198 1775 -3037 2255 2554 -1931 406 5227 -929 434 2170 1039 -2988 4229 4206 -4117
466 -4117 4487 1138 -3435 1805 4506 -2119 1117 3204 -3274 746 1472 1221 -3082 1910 2156 -4176
482 -4176 2473 596 -4128 239 3846 -4469 195 1323 -4941 427 70 146 -3082 788 -139 -4765
$$ packed form
368A731k240j107L947J149o959O048p36k405N8M345m807NQ180q513J189K075j477
385D83j525N402j43o458M087j264r44j76O804n945k971P061o766R25M406n79n500
402c103N365j215m980M528L62r68k767O375n749k303P347m569j539M783n08p278
418f219P879j849m361N043r0k002j818O223o128j022O584k406l339N423p94q985
434g861J0499j603m088M793p01l362m2O287n764N08M348k064m754O449J86q038
450e207J0405l423m812N292K99m485K337M821o156J363J736j131m027P217k3q323
466d117Q604l349m573N240K701o625L236K087o478M020P26k51m303M992K46o332
482d176O649j877m724M367L607q315M664J128o264N368l57P6l228L870r27m626
$$ plain form
498 -4765 -265 945 -3070 -272 3866 -6168 -1092 1471 -3591 954 669 -266 -3106 174 -288 -2046
514 -2046 128 2400 -1783 -1885 4273 -4766 197 3783 -1742 609 1779 120 -1490 2360 593
529 593 344 1041 3842 -842 -2712 5073 -2251 1468 5455 -1525 -1663 3131 335 -1251 3700 488
545 488 534 17 2632 -1051 -2310 5648 -1790 -543 3728 -2077 -3724 4121 -284 -2360 3495 -2314
561 -2314 -1059 -765 1545 -1741 -1998 3572 -3053 -3154 2203 -1376 -4318 4389 -2370 -4340 3657 -2172
577 -2172 -2240 -1103 685 -1806 -637 2008 -3296 -3007 2159 707 -4037 4504 -2152 -4554 4020 -1274
593 -1274 -1153 1883 1088 -2570 593 1204 -483 -527 2384 1685 -3797 4689 -187 -3063 4997 695 -1418
610 -1418 3044 1447 -2486 2403 845 1092 887 1420 1866 -3680 3788 1225 -2540 3589 1570 -2774
$$ packed form
498d765M500J210m015K798M138j0034N076K563n062M545k85r35k840L280m62j758
514b046K174K272m183j02O158r039M963L586n525K351J170j659j610L850j767
529E93k49O97K801m684j870P785p324L719L987o980j38M794k796j586M951l212
545D88M6n17K615l683j259P958p438J247M271n805j647P845m405k076N855n809
561b314J255K94K310l286k57N570o625j01N357l579k942Q707o759j970P997n829
577b172o8J137J788k491J169K645n304K89N166j452m744Q541o656k402Q574n294
593a274J21L036p95l658L163O11j687m4K911o99n482Q486m876k876Q060m302k113
610a418M462j597l933M889j558K47k05N33M46n546P468k563l765O129k019m344
$$ plain form
626 -2774 2096 791 -3549 3665 301 127 -665 -840 892 -2467 1967 909 -3063 611 1663 -4973
642 -4973 1029 1877 -4443 2394 -856 -2177 -786 -724 -235 -1971 317 507 -2717 -1861 2463 -4593 395
659 395 3391 -4936 761 346 -2731 -8 1432 -962 -635 -210 404 -862 -1329 4046 -3154 288 4560
676 4560 -4003 259 3043 -1805 394 3987 -2269 215 1772 403 787 -268 4023 -1767 -123
691 -123 4042 -2063 -206 5043 -1688 -1321 4791 -2846 223 2414 -451 524 443 1743 -2168 -475
707 -475 2244 -1046 -1156 3646 -2462 -3243 4685 -3342 -844 2728 -1867 -1614 775 -351 -2525 83
723 83 287 -441 -2214 1857 -2414 -3844 3808 -2397 -1644 2000 -2160 -3142 1711 -497 -1907 1529 -1002
740 -1002 -570 -1750 1936 -393 -1938 2980 -1414 -1560 1915 206 -2517 3389 189 -1489 2437 -516
$$ packed form
626b774M870j305m340P214l364j74p92j75J732l359M434j058l972L674J052o636
642d973O002Q48o320O837l250j321J391O2M89j736K288J90l224Q56M324p056M988
659C95K996q327N697m15l077K723J440k394L27M25O14j266m67N375p200L442M272
676D560q563M262K784m848K199L593o256K484J557j369L84j055M291n790J644
691a23M165o105J857N249o731L67O112p637L069K191k865R75q1J300l911J693
707d75K719l290j10M802o108p81P928q027K498L572m595K53K389j126k174K608
723H3K04p28j773M071m271j430P652o205P53L644m160r82M853k208j410L436k531
740a002M32j180L686k329j545M918m394j46L475j709k723N906l200j678L926k953
$$ plain form
756 -516 312 -302 2406 335 -775 2243 118 -1169 2128 1973 -2403 3483 858 -1450 2237 178
772 178 219 266 2276 -128 -292 808 305 -939 1393 2317 -3383 1976 312 -2342 1452 1177 -1259
789 -1259 -994 1325 -2117 -874 409 227 -2016 55 1173 -3953 805 205 -2505 243 1493 -2497
805 -2497 -1724 1413 -2926 -370 541 98 -2082 196 681 -3593 1253 899 -1715 -226 2052 -2704
821 -2704 -607 2829 -1892 658 1574 104 -1964 1576 1060 -1662 2259 1137 -1112 48 2863 -1706
837 -1706 447 3256 -1267 404 2056 283 -1435 2406 581 -931 2351 926 -1002 -52 2668
852 2668 -1735 632 2227 -1860 -290 1498 123 -1609 2197 -578 -1534 1487 1 -1388 -592 1522
868 1522 -2464 103 1104 -1718 -1033 744 -330 -2248 1420 -1014 -1999 388 56 -1512 -544 1270
$$ packed form
756e16Q28o14K708k071j110L018k125j287L297j55m376N886k625k308L687k059
772A78M1M7K010k404j64J100n03j244K332R24n700N359j664k654L794k75k436
789a259K65K319l442J243J283j82k243K071J118n126M758o00k710K748J250l990
805b497P73L137m339K556R11m43k180K278M85m274M846l54k614J489K278m756
821b704K097L436m721K550R16j470k068L540n16k722L921j122k249J160K815m569
837a706K153K809m523J671J652j773j718L841j825j512L282j425j928R50K720
852B668m403K367J595m087J570J788j375j732L806k775r56L021j486j389P96K114
868A522l986K567J001k822O85J777j074j918L668k434r85K387l32j568R68J814
$$ plain form
884 1270 -2932 -257 484 -850 -740 599 -266 -2203 1736 -584 -1127 519 1048 -1589 -74 1717
900 1717 -2071 663 1279 -60 -847 1492 334 -1022 2167 885 -633 409 2106 -1158 586 2392
916 2392 -1287 767 1937 74 -1181 2097 120 -561 2164 603 -467 -61 2039 -1530 420 2419
932 2419 -1419 -312 1055 -721 -1553 2281 -500 -1425 768 -354 -1011 -363 1431 -2649 -365 1366
948 1366 -1956 -1181 1216 -1172 -2031 2177 -1402 -1595 740 -696 -1361 44 770 -2293 -40 869 -1533
965 -1533 -1200 1469 -765 -1800 2872 -1494 -1560 1731 264 -1011 976 916 -1722 1009 808 -114 -524
982 -524 2240 -262 -1604 2934 -518 -126 1989 596 -1270 1457 949 -1189 1947 592 175 -357
998 -357 1733 75 -1164 2327 -179 -507 1311 517 -2206 1227 608 -1261 1161 -244 -361 -740 1149
$$ packed form
884A270m202K675P41j334J10J339q65j937L939k320n43J646N29k637J515J791
900A717l788K734O16j339p87K339j158j356L189j282j518J042J697l264J744J806
916B392l679K054J170j863j255L278j977o81K725j561j070M06K100l569J950J999
932B419l838J107J367j776q32L834k781r25K193j122o57O48J794m080K284J731
948A366l322P75K397k388q59M208l579j93K335j436o65J405P26l063K253R09k402
965a533L33K669k234j035M672m366o6L291j467j275J987o0k638K731k01r22m10
982e24K764k502j342M538l452L92K115j393j866K727n08k138L136j355m17n32
998c57K090j658j239L491k506l28J818p94k723L433o19j869K422j405j17l79J889
$$ plain form
1015 1149 -740 -1262 1364 1 -1117 -139 460 -2488 1310 679 -1908 -25 -503 -999 -1194 1038 -856
1032 -856 -1252 159 -334 -1741 36 1073 -2641 756 289 -1852 293 489 -674 -869 1300 -895
1048 -895 -540 828 280 -1362 303 1855 -2010 1152 712 -980 753 1612 -454 -484 2001 -542 159
1065 159 969 919 -546 1117 1915 -2104 982 1405 -847 586 2058 -1238 -297 2247 -731 467 809
1082 809 580 -1295 719 1282 -1799 1021 846 -1401 -390 1944 -1994 -665 1659 -1802 136 45
1098 45 -179 -1516 386 318 -1764 338 606 -1680 -1139 1404 -2183 -140 1555 -2023 -596 418 -510
1115 -510 -1292 806 -202 -978 188 359 -982 -1073 2037 -1739 -222 1682 -1553 -497 1116 -88
1131 -88 -571 1481 -351 -403 454 866 178 -644 2203 -758 11 1934 -645 -310 1901 152 -811 1876
$$ packed form
1015A149j889n22K626j363j118R78N99k948L798o31k587J883m78m96j95K232j894
1032h56l96J411m93j407J777J037l714L397m67k141K145J96j163j95K169k195
1048h95L55J368n48j642J665J552l865L162m40j692J733Q59k066l0K485k543P01
1065A59Q10n0j465J663P98m019L086M23k252J433J472l296R41K544k978J198L42
1082H09k29j875K014N63l081K820j75k247J011K334l938J329K324l461J938r1
1098D5k24j337J902o8k082K102K68k286N41K543l587K043J695l578J427J014r28
1115e10p82K098j008p76J166J71j341r1L110l776J517J904l235J056J613j204
1131h8m83K052j832n2Q57M12o88q22K847k961P69J923k579L35K211j749r63K687
$$ plain form
1149 1876 -458 353 526 601 112 -518 1803 -316 -529 1002 250 -1297 2008 -210 -1750 1555 -631
1166 -631 -137 205 344 -601 -847 604 -644 -788 558 108 -2493 988 -410 -2097 1801 -504 -1503
1183 -1503 -263 16 -1077 -287 231 -779 -842 506 452 -2531 1160 180 -1751 1454 -12 -1704 301
1200 301 760 -1600 679 764 -290 -25 138 430 -1391 1734 1027 -1534 1270 644 -1208 1042 1791
1217 1791 -1719 1854 826 -656 465 536 877 -537 1888 330 -1190 648 1289 -1306 1026 1895
1233 1895 -2236 1184 331 -1107 469 771 -178 -740 799 -344 -734 -42 1004 -1339 215 1378
1249 1378 -2189 237 461 -1491 74 753 -1175 -775 106 -968 -248 -389 849 -1284 -335 1027 -1888
1266 -1888 7 663 -698 -604 1028 -1274 -693 669 -482 333 -524 652 -730 -7 1220 -780 -35
$$ packed form
1149A876k334Q11J73P5m89o30K321k119k13J531p52j547L305k218j540L305k186
1166f31M94L42J39r45k46J451j248j44J346m50k601L481j398j687L898k305r99
1183a503J240K79j093P90N18j010o3J348n4k983L691r80j931L205j466j692K005
1200C01M59k360K279Q5j054K65J63K92j821L125p07k561K804o26j852K250P49
1217A791l510L573j028j482J121P1L41j414K425j558j520J838O41k595K332Q69
1233A895m131L420q53j438J576L02r49n62J539j143l90O92J046k343J554J163
1249A378l567K426K24j952J565O79j928M00Q81j074P20j41J238k133R49J362k915
1266a888J895O56j361R4J632k302N81J362j151Q15q57J176j382P23J227k000P45
$$ plain form
1283 -35 1173 -411 -631 1640 -685 -240 1474 -110 454 310 973 -735 369 1122 11 61 1350
1300 1350 -76 -890 1849 -284 -396 1520 -156 -415 616 936 -693 471 669 -306 -690 870 -141
1317 -141 -1326 1797 -732 -1124 988 -251 -1323 604 601 -1498 133 -142 -780 -723 758 -580 -1648
1334 -1648 1274 -799 -1333 761 -206 -1559 834 189 -1726 481 -162 -619 -279 1039 -281 -848 1094
1351 1094 -453 -670 1018 363 -1514 964 128 -1265 1181 238 -509 143 993 -419 -96 1074 59
1368 59 -113 967 722 -1368 1317 700 -763 1194 591 -429 348 1102 -506 65 851 -107 -167 517
1386 517 641 -1238 817 412 -808 544 442 -857 -335 1009 -1151 -27 262 -376 -577 41 19 -1044
1404 -1044 457 166 -816 -320 526 -899 -616 772 -1256 -136 351 -360 -779 302 287 -1047 342
$$ packed form
1283c5J208j584k20K271k325M45J714j584N64j44O63j708J104P53j111N0J289
1300A350j426q14K739k133j12J916j676k59J031L20j629J164J98r75l84J560j011
1317a41j185L123k529l92K112j239j072J927lk099J631k75o38N7J481j338j068
1334a648K922k073n34K094r67j353K393o45j915K207o43m57L40J318j320n67J942
1351A094j547k17J688o55j877K478q36j393K446r43p47O52Q50j412L23J170j015
1368E9j72J080k45k090K685o17j463J957o03j020P77P54j608N71P86r58o0O84
1386E17J24j879K055m05j220J352j02j299N22J344k160J124K89o38k01O18k2j063
1404a044J501k91r82M96Q46j425K83J388k028J120M87p11m19J081j5j334J389
$$ plain form
1421 342 -64 -702 -252 850 -548 -435 828 -1028 -161 768 -27 -747 797 358 -561 818 202 -166
1439 -166 -138 1218 -447 21 1326 -575 -45 1238 537 -712 1227 301 -767 843 665 -42 87
1456 87 1359 -831 -142 902 -151 11 690 276 -1215 989 70 -1001 756 266 -791 -172 650
1473 650 -1115 67 486 -676 -803 363 -210 -1193 626 -580 -905 361 328 -1178 -315 489 -1374
1490 -1374 297 485 -596 -738 267 -78 -984 593 -158 -753 269 659 -1040 145 1043 -1033 583
1507 583 596 -693 -83 909 117 -653 712 148 -137 337 834 -634 458 1211 -582 326 633 28 -14
1526 -14 1180 -85 -280 682 -42 145 102 766 -656 -36 839 -839 -38 894 85 -427 958 -429 -275
1545 -275 721 -346 -111 -193 296 -772 -296 601 -699 -630 678 -424 -1151 754 -842 -706 716 -207
$$ packed form
1421C42m06o38M50J102j398J13J263j856Q67R29p95p20J544m39r19J379o16l68
1439a66K8J356j665M68J305j901N30J283p01j249J939r26j068J610j78p07J29
1456H7J272k190O89J044j053J62O79m14j491K204r19j071J757m90j057O19Q22
1473F50j765J182M19j162j27J166n73r83J819j206l25J266l3j506Q63Q04j863
1490a374J671J88j081j42J005l45r06J577p51n95J022L90j699J185Q98k076J616
1507E83J3j289O10R92p92p70J365n64k85M74M97j468J092P53j793R08L07o05m2
1526a4J194j265j95R62p24J87m3O64j422O20Q75j678Q01R32q09n12J385j387J54
1545b75R96j067K35q2M89j068M76Q97j300O9J308j102p27J905j596J36J422r23
$$ plain form
1563 -207 -486 -249 23 -938 -26 50 -614 -571 529 -277 -1212 1267 -655 -711 694 -65 -455 526 261 -726
1583 -726 495 249 -119 -231 814 -80 -570 1518 74 -540 888 242 -653 864 605 -598 759
1600 759 325 -104 -2 852 60 -752 1163 198 -582 709 421 -937 869 265 -893 833 28 -276
1618 -276 -7 346 -304 -415 582 -83 -837 211 139 -1215 580 -24 -1199 281 -255 -703 -249 389 -603
1637 -603 -506 43 -230 -466 176 335 -1452 438 400 -831 580 206 -918 -89 397 -448 19 225 140
1656 140 -317 90 547 -908 517 719 -599 264 692 -575 287 804 -496 225 310 339 -7 172 818
1675 818 -527 496 811 -503 59 1160 -558 -34 897 -589 279 204 -48 -169 335 373 -401 -42 409
1694 409 -548 -59 1085 -788 -441 778 -1002 -176 404 -328 -580 393 11 -477 -192 115 -391 -734 1028
$$ packed form
1563b07k79K37K72r61R12P6o64M3J100q06r35K479j922n6J405p59l90R81k65r87
1583g26J221k46l68j12J045q94m90K088j444o14J428o46q95J517k59j203J357
1600G59m34m29J02Q54p92q12J915r65p80J291k88j358J806o04j158J726q05l04
1618b76K69L53o50j11R97o65p54J048p2j354J795o04j175J480n36m48M54O38r92
1637f03R7N49k73k36O42J59j787J890l8j231J411l74j124Q29M86q45M67K06q5
1656A40m57M07M57j455J425K02j318Q63M28j267Q62N17j300P21Q5K9l46J79O46
1675H18j345J023L15j314N62J101j718N24R31j486Q68p5k52j21N04L8p74L59M51
1694D09r57M89J144j873L47J219j780Q26N80p32k52R73l82m88K85L07n06l43J762
$$ plain form
1713 1028 -994 -378 838 -917 -435 404 -495 -356 418 -412 -282 35 243 -159 -481 701 -724 -368
1731 -368 1140 -606 -493 822 -176 -530 894 -306 29 491 85 103 -432 1001 -193 -153 946 -49
1749 -49 -415 1449 -160 -683 1040 -135 38 735 -66 -225 180 386 -314 -10 529 178 -567 794 -56
1768 -56 -978 1300 -306 -513 285 -95 -591 196 -38 -461 -25 -213 -25 -939 366 -19 -1080 705 -318
1787 -318 -827 166 -61 -830 258 -347 -561 -196 -156 -64 -632 504 169 -946 407 112 -895 398 637
1806 637 -875 594 111 -531 310 118 224 -21 388 282 -376 455 654 -658 432 763 -874 690
1824 690 659 -536 278 500 7 -101 667 126 -16 454 523 -461 215 698 -923 359 694 -632 135
1843 135 484 -463 -7 570 -322 -131 -150 165 -610 37 557 -924 94 476 -744 -294 680 -744 -284
$$ packed form
1713A028k022O16J216j755M82Q39q99J39P74q30J30L17K08m02l22J182j425L56
1731c68J508j746J13J315r98l54J424j200L35M62m06J8n35J433j194M0J099r95
1749d9l66J864j609n23J723j175J73O97q01j59M05K06p00L04N39l51p45J361q50
1768e6r22K278j606k07P98l80m96P87k34m23M36j88J88r14J305l85j061J785j023
1787c18n09R93k27p69J088o05k14L65M0R2n68J136l35j115J353k95j007J293K39
1806F37j512J469m83o42Q41j92J06k45M09j06o58Q31J99j312J090L31j637J564
1824F90l1j195Q14K22m93j08P68n41j42M70O9r84O76M83j621J282L35j326P67
1843A35L49r47M56N77q92J91j9L15p75O47N20j481J018L82j220M50R74j424M60
$$ plain form
1862 -284 366 -523 -213 -177 -116 -662 11 446 -641 52 260 -747 -396 879 -688 -53 542 -518 -54
1881 -54 92 156 -312 452 368 -357 -114 422 44 -228 953 -400 -176 515 -118 141 469 196 -207 550
1901 550 283 -194 143 428 124 -193 808 -375 -59 511 30 -56 611 342 -246 484 -77 -214 -92 421
1921 421 -140 -452 400 -345 -195 410 -332 -689 385 9 -823 207 -196 -488 -176 225 -368 -318 232 -162
1941 -162 -540 206 63 -798 308 -54 -424 229 -5 -419 -188 370 -551 -95 530 -236 -184 416 -8 -729
1961 -729 622 350 -516 464 164 -121 167 561 -260 286 588 -244 -65 398 310 -500 922 295 -441 598
1981 598 311 -457 378 652 -465 423 617 -167 -78 458 196 -488 438 -213 -515 229 312 -447 85 539
2001 539 -608 60 155 -248 -275 424 -272 -665 253 -84 -560 -8 231 -614 -36 194 -762 -21 195 -205
$$ packed form
1862b84O50q89L10L6O1n46O73M35j087O93K08j007L51J275j567O35N95j060M64
1881e4J46O4m68P64q4p25K43N36l78k72J181j353K24O91o33K59L28k73m03P57
1901E50k67m77L37K85l04l17J001j183L16N70m81q6O67k69n88P30n61j37J22N13
1921D21n61l12Q52p45J50O05p42l57J074l76q32J030m03k92L12M01n93N0N50l94
1941a62l78P46j43q61J106l62l70O53k34m14K31N58r21M56O25p66N2O00m24p21
1961g29J351k72q66R80l00k85K88L94q21N46L02q32J79M63q8q10J422o27p36J039
1981E98k87p68Q35K74j117Q88J94p84Q9N36k62o84R26o51l02P44Q3p59N32M54
2001E39j147O68R5m03k7O99o96l93R18l37m76N52K39q45N78K30r56P41K16m00
$$ plain form
2021 -205 -479 221 -168 -472 373 -265 -335 -15 309 -450 -71 420 -539 -149 532 -130 -232 599 -45 -285
2041 -285 428 205 -76 68 443 -303 330 343 -100 27 82 184 -348 629 166 -12 641 17 -465 234 512
2062 512 -289 163 378 -241 63 285 19 -491 632 71 -535 176 175 -489 -18 255 -742 51 248 -359
2082 -359 -204 284 -71 -478 79 -337 -692 184 227 -790 134 476 -740 43 155 -391 -171 151 -243 -273
2102 -273 420 2 -207 -13 341 -474 52 444 -791 322 710 -367 -52 752 -122 -83 568 -15 -84 338
2122 338 233 -523 244 688 -441 223 320 -214 -114 855 -376 -74 574 -4 -37 209 270 -357 229 364
2142 364 -301 71 547 -461 -439 494 -483 -18 614 -318 -256 112 -71 -440 225 -195 -369 -6 247 -354
2162 -354 -390 403 -404 -348 404 -224 -335 378 -251 -358 195 -213 -125 -222 195 -117 -261 539 -364 -346 406 -32
$$ packed form
2021b05k74P00l89l04Q45o38p0L20L24p59L79M91r59L90O81o62j02Q31o44k40
2041b85P13k23k81J44L75p46O33J3m43J27N5J02n32R77m63j78O53o24m82O99K78
2062E12q01M52K15o19L04K22k66n10J123n61o06P11jo64M71K73r97P93J97o07
2082c59J55M88l55m07N57m16l55Q76M3j017R24L42j216P83J12n46K20L22l94l0
2102b73O93m18k09J94L54q15N26L92j235J113L88j077L15Q04q74L9O51n83o9M22
2122C38j05p56P67M44j129O64R7n34J00R69j231L02O48n78l3K46O1o27N86J35
2142C64o65L72M76j008K2R33r77M65O32r32O2L68j83l69O65m20j74L63K53o01
2162c54l6P93q07N6P52o28j11P13o29j07N53m08Q8r7M17l12j44Q00r03J8P52m38
$$ plain form
2184 -32 -421 414 -45 -148 372 11 -54 33 314 11 -25 407 -149 -187 202 55 -579 650 255 -632 440
2205 440 14 -172 151 151 -200 -262 336 -94 -297 393 239 -653 644 167 -429 581 70 -293 35 375
2225 375 -234 -114 307 -93 -118 166 162 -784 420 107 -588 365 -45 -659 154 208 -513 -59 97 -450 -405
2246 -405 -30 85 -537 293 189 -437 210 210 -495 284 247 -614 294 185 -50 -134 121 223 -299 328 372 -302
2268 -302 280 314 -453 330 488 -548 355 299 -96 245 208 338 -249 265 397 -61 200 583 -248 -12 677
2289 677 -611 353 195 -171 -13 316 -250 -30 -57 179 -144 34 477 -493 -294 420 -611 -9 190 -600
2309 -600 19 262 -254 -9 -150 -32 -316 -402 202 -580 12 463 -473 -245 452 -256 -523 502 -455 -107
2329 -107 335 -54 -281 -47 269 -195 44 385 -2 -51 562 -115 -374 823 -31 -95 284 125 -268 158
$$ packed form
2184c2l89Q35m59j03N20l61o5Q7K81l03l6M32n56l8L89j47o34J229l95q87J072
2205D40m26j86L23%l51o2N98m30k03O90j54q92J297m77n96J010n11l63L28L40
2225C75o09J20M21m00k5K84mr46J204l13o95R53m10o14Q13N4p21M54J56n47M5
2246d05L75J15o22Q30j04o26O47%p05P79l7q61R08j09k35q4K55J02n22O27M4o74
2268c02N82L4p67P83J58j036R03n6l95L41l7J30n87N14J32m58K61L83q31K36O89
2289F77j288R64j58l66J58L29n66K20k7K36l23J78M43r70J99P14j031O02J99p90
2309f00O19K43n16K45j41J18k84q6O04p82N92M51r36K28O97p08k67J025r57L48
2329a07M42l89k27K34L16m64K39L41l87m9O13o77k59J197q54o4L79j59l93M26
$$ plain form
2349 158 445 19 165 592 111 -166 861 -165 -239 923 -189 -319 520 85 -278 165 159 -182 0 82
2369 82 -243 -234 518 -9 -387 463 -40 -319 295 -2 -470 297 -179 -485 103 11 -269 -166 368 -220 -476
2390 -476 409 -135 -396 147 25 -763 163 -30 -267 64 33 -488 -123 276 -97 -208 170 153 -499 58 151
2411 151 -693 590 179 -274 126 230 -131 86 251 -28 -143 195 204 -164 401 330 -120 529 554 -368 189
2432 189 513 -239 43 572 -183 109 303 -184 -239 27 164 -273 215 252 -320 46 382 -230 -177 329 -301
2453 -301 -218 154 -245 -264 44 125 -501 -71 181 -458 -459 428 -446 -150 307 -265 -256 -6 150 -298 167 -124
2475 -124 -494 132 291 -243 -41 222 -712 -132 565 -87 -112 289 41 -297 390 -50 -355 442 251 -238
2495 -238 92 448 -288 245 702 -64 18 490 78 -256 413 117 -58 372 508 -370 110 420 -127 -93 370
$$ packed form
2349A58K87m26J46M27m81k77J027j026p4J162j112j30Q39m35l63M43ol41J82Q2
2369H2l25RP52n27l78Q50n03k79O14k97m68P67m76l06N88r2k80J03N34n88k56
2390d76Q85n44k61N43j22p88R26j93k37L31l1n21L65L99l73j11L78j7o52N57R3
2411A51q44J283m11m53M00J04l61K17J65k79j15L38Rl68N65p1m50O49K5r22N57
2432A89L24p52K82N29p55K92J94m87n5K66J37m37M88L7n72L66L36o12N3N06o30
2453c01Q3L72l99j9L08Q1o26M30K52o39jQ87q74K96M57n72RK50J56m48M65k91
2475a24l70O26J59n34K02K63r34N80O97o52k5M01k48l38O87m40l05P97j91m89
2495b38L30L56p36N33M57p66Q2M72m12l34O69k96j75M30J36q78M80L10n47L4M63
$$ plain form
2516 370 -88 -352 503 55 -319 116 -45 -405 84 55 -263 32 229 -489 -75 189 -273 -223 344 -351 -448
2537 -448 274 -122 -347 8 6 -371 90 335 -354 -185 184 -160 -301 288 -99 -404 243 150 -386 -113 -10
2558 -10 -415 -62 409 -369 88 223 -125 -386 349 91 -242 366 208 -344 196 393 -246 95 329 -127
2578 -127 117 388 170 -153 340 32 -128 392 106 6 -1 433 -205 175 313 -219 -2 282 -407 -327 373
2599 373 -119 -223 305 -122 -332 149 128 -488 -141 331 -251 -295 240 -224 -303 291 -62 -209 156 58 -539
2620 -539 196 66 -457 22 154 -12 -232 315 -265 -348 330 -102 -331 193 168 -375 415 159 -308 151 217
2641 217 54 -16 303 -113 -122 263 200 -158 353 235 -238 645 438 -66 305 190 -150 -121 422 -15 -97 161
2663 161 235 -256 172 261 -349 380 97 -313 65 55 42 46 164 -74 -58 155 198 -283 -27 299 -523 251 169
$$ packed form
2516C70m58k64Q55m48l74M35j61l60M89k9l18K95J97p18M14K64m62N0N67o95r7
2537d48P22l96k25L55kl77M61K45o89J69L69l44j41N89l87l05O47r3n36K73J03
2558a0m05L53M71p78M57J35l48k61P35k58l33O08j58n52N40J97o39L41K34m56
2578a27K44K71k18l23M93l08j60N20k86j00pM34o38L80J38n32K17K84o89Q0P00
2599C73m92j04N28m27k10M81k1o16L47M72n82m4N35m64p9N94l53j47L65r8n97
2620e39P35j30n23M79J32j66k20N47n80q3O78m32k29N24k5n43P90k56m67M59O6
2641B17j63p0L19m16rL85o3l58N11j18m73Q83k07n04L71j15l40K9N43m37q2K58
2663A61P4m91M28Q9o10P29k83m10L78j0j3MJ18k38J6K13M3m81K56L26q22P74q2
$$ plain form
2686 169 -201 54 -34 -489 -195 9 -345 -175 147 43 -510 61 291 -599 128 81 -309 -54 324 -432 17
2707 17 232 -242 -163 136 -10 -305 183 195 -127 130 432 -253 -66 487 -220 -22 448 -218 33 278 221
2728 221 -275 201 171 -133 173 344 -197 -84 406 -376 168 543 -427 -112 275 150 -354 294 -89 -220
2748 -220 -82 107 -174 -92 391 -560 -42 264 -262 -153 329 -118 -296 300 -327 -140 -43 87 -159 -79 292
2769 292 -336 -349 317 -270 -295 347 -251 -32 437 -257 -194 -56 353 -227 -44 98 -43 -221 468 -125 -376
2790 -376 513 -71 -233 296 -81 -104 192 166 64 87 144 -84 -159 417 237 -278 458 -125 -218 322 173 -217
2812 -217 146 60 -44 160 239 -2 -205 308 137 -437 382 -113 -298 361 83 -414 -75 -133 -418 162 -63
2833 -63 10 -149 -55 -67 -454 138 100 -564 82 21 -513 -7 193 -470 63 71 -211 -326 -16 -31 -437 225 3
$$ packed form
2686A69l70K55q8m55K94K04l54J70L22j04n53N71K30q90P27m7l90K55L78p56M49
2707A7K15m74P9K99j46k95M88J2l22K57L02o85J87N53p07J98M70o66K51K45n7
2728B21m96M76l0l04L06J71n41J13M90p82N44L75r70L15L87j25n04O48l83j31
2748b20J38J89k81Q2M83r51N18L06n26J09M82m47j78N96o27J87R7J30k46Q0L71
2769B92o28j3O66n87k5O42n98K19M69o94O3J38M09n80J83J42j41j78O89n93k51
2790c76Q89n84j62N29l77k3K96k6j02K3N7k28p5N76j80n15P36n83r3N40j49l90
2812b17L63q6j04K04P9k41k03N13j71n74Q19m95j85O59k78m97L39n8k85N80k25
2833f3P3j59R4j2l87N92l8o64O46o1n34N06K00o63N33Qk82j15L10j5m06O62k22
$$ plain form
2856 3 -313 -3 143 -503 38 231 -513 138 159 -122 0 124 -121 -379 253 162 -48 257 415 -155 98
2877 98 313 -264 423 275 -309 181 311 -23 53 137 -149 -50 132 114 -313 231 437 -327 168 393 -344 -201
2899 -201 610 -227 -274 108 -167 -119 77 118 -365 0 255 -418 -63 283 -389 -121 323 -612 -312 53 -229
2920 -229 -255 -179 -81 -234 -165 140 -181 -244 222 -398 -472 181 -372 -123 295 -186 -203 225 67 -195 256 352 29
2943 29 -157 380 -68 -180 329 -37 -63 437 141 -376 509 241 -36 196 273 -13 -41 211 -170 -101 425 -32
2965 -32 -268 347 119 -420 257 -26 -206 255 7 14 31 319 10 -164 250 -154 -256 -23 119 -487 162
2986 162 86 -448 192 -1 -205 -68 3 -338 -95 71 -293 -178 210 197 -389 175 87 -423 162 53 -388
3007 -388 -31 126 -28 -12 357 -147 -262 111 230 -427 176 312 -374 61 244 6 146 437 -148 55
$$ packed form
2856Cl16L10J46o46N41J93p44O51K1k81J22J24k45k58O32r1k10L05J58n70K53
2877I8K15n77O87j48n84M90J30l34P6Q4k86R9J82j8m27N44K06p64M95K25p37J43
2899b01Q11q37m7L82k75M8J96M1m83L65K55o73L55L46o72K68M44r35L00L65k82
2920b29k6P6R8j53O9L05l21o3M66o20p4O53n53K49M18m81j7M28j58k62M51R6l23
2943B9j86N37m48j12N09l66k6N00k96n17Q85k68k77K32P7k86k8K52l81O9N26m57
2965c2k36O15k28n39O77k83j80M61k48PJ7K88l09j74M14m04j02K33J42o06O49
2986A62p6n34O40j93k04J37P1l41K43J66l64J15L88j3n86N64q8n10N85j09m41
3007c88L57J57j54J6L69n04j15L73J19o57O03J36o86M35J83k38J40K91n85K03
$$ plain form
3027 55 320 -9 -14 201 130 -366 170 35 -137 71 338 -319 155 422 -273 -46 273 -13 -79 269 86 -197
3049 -197 -7 -58 -281 -90 222 -95 -100 180 -188 -307 60 40 -188 135 29 -136 90 28 -461 -211 318 -448
3071 -448 -13 305 -188 -123 59 -169 -470 287 12 -273 -20 75 -106 -106 174 -167 -77 127 -19 -117 99 -72
3093 -72 -206 147 25 -53 180 115 -200 109 437 -150 76 228 -226 -121 392 -220 -261 331 60 -167 231
3114 231 152 -201 50 321 -313 98 365 -86 -172 215 -99 -330 200 131 -276 173 156 -300 -39 132 -360
3135 -360 74 258 -414 -121 261 -325 -260 24 -348 -115 40 4 -401 93 68 -351 -42 192 -293 -201 401
3156 401 -155 -232 58 -6 -192 123 217 -379 77 191 -133 22 354 -124 -166 295 -47 -64 469 -76 -72 57
3178 57 188 -176 -38 112 42 -17 371 -78 -38 574 -116 -25 256 210 -34 220 270 -322 65 264 11 -211
$$ packed form
3027E5K65l29nK15p1m96N36j35j72K08K67o57M74K67o95K27L19k86o6L48j83k83
3049a97J90n1k23J91L12l17nK80l68j19L67k0k28L23j06j65K26o2m89K50N29p66
3071d48M35L18m93O5J82k28l01P57k75k85K53R5j81%K80l41R0K04j46r8K16j71
3093g2j34L53j22p8K33o5l15L09L28n87K26J52m54J05N13o12m1N92k71k27L98
3114B31p9l53K51K71o34M11K67m51q6L87l14k31N30o9m07M49j7m56K61J71m92
3135c60M34J84o72K93L82n86O5K84l72K33J55l6m05M94k5m19L09K34m85R2O02
3156D01n56p7K90o4j86L15R4n96M56J14l24J55L32m78m2M61l42j7N33n45MJ29
3178E7J31l64J38J50p0n9L88m49M0O12o90R1K81m6k44K54N0n92L87J99k53k22
$$ plain form
3200 -211 339 5 -350 331 -150 -351 331 -194 -186 46 -42 -294 208 107 -397 -238 227 -198 -310 132 -134
3221 -134 -291 87 158 -438 130 160 -339 78 131 -128 -271 176 -142 -270 216 -30 -254 197 -76 -528 97
3242 97 -139 -234 364 50 -157 87 127 -32 -196 39 19 -40 527 181 -304 445 -9 -343 141 338 38 79
3264 79 215 -128 -1 251 182 -147 202 -8 -339 252 220 -256 205 93 -152 84 217 -283 50 -1 52 -148
3286 -148 -55 184 -213 123 27 -426 0 203 -318 20 282 -333 -93 174 -108 -137 138 79 -291 17 63 -306
3308 -306 30 311 -283 2 117 -422 -57 375 266 -83 154 -125 -168 57 189 -201 63 298 -120 14
3328 14 335 -192 -1 278 -166 -204 211 43 52 94 243 -21 -58 237 -320 -73 88 -78 -186 205 -36 -173
3350 -173 337 66 -192 163 63 -113 -153 68 -154 -256 424 -67 -15 255 -153 -257 221 -107 -274 -12 87
$$ packed form
3200b11N50l34l55O81m81k01O82n25QK32q8k52N02j01n04J59M65m25j12M42k66
3221a34j57L78P1n96N68L0m99M17N3k59j43M47l18j28M86k46k24M51k73m52O25
3242I7k36r5N98l14k07K44M0j59j64K35k0n9N67l46m85P49m54l34M84J97l00M1
3264G9J36l43J27K52o9l29L49k10l31N91l2m76M61j12k45K36J33n00L33n1N3k00
3286a48R3K39l97L36r6m53M26K03n21L38K62o15K40K67k82k9K75n9l70L08M6l69
3308c06L36K81n94K85J15n39L65M32j09l49K37k79m3K25J32l90K64K35m18J34
3328A4L21n27J91K79m44l8M15j68RM2J49k64l7K95n57K47J61j66j08L91k41j37
3350a73N10k71k58L55j00j76m0K21k22j02O80m91N2K70m08j04M78l28j67K62R9
$$ plain form
3371 87 -206 -170 302 -342 -73 137 -375 -318 280 -72 -205 222 -226 -126 190 -60 -349 -103 99 -108 38
3392 38 16 -25 -402 392 -137 -108 260 73 -288 206 95 -116 210 139 -16 117 168 36 -48 326 110 -78
3414 -78 318 -59 -275 -30 367 -302 254 152 24 232 200 -45 -41 390 30 -183 160 32 -316 224 127 -368
3436 -368 79 -145 -411 -127 113 -157 -112 65 112 -141 -12 231 -361 -11 59 -349 62 180 -177 116 19
3457 19 -181 97 226 -252 -408 226 87 -192 241 249 -429 126 105 -144 122 62 -36 -19 201 -37 23 103 15
3480 15 -187 55 362 -362 89 368 -139 -9 286 40 -13 406 96 4 13 33 -355 106 95 -297 209 326
3502 326 -185 -15 354 -343 30 271 -168 -19 41 209 -374 -93 -163 -81 19 132 -350 -81 291 -332 -221
3523 -221 267 -114 -169 189 192 -199 26 81 -58 -274 101 -83 -36 285 -216 -105 271 -120 -224 326 -89 -7
$$ packed form
3371H7k93L6M72o44K69K10n12N7N98l52j33M27m48J00L16k50k89K46K02k07J46
3392C8k2m1l77P94n29K9L68j87l61M94j11k11L26p1j55J33N1j32q4L74k16j88
3414g8L96l77k16K45L97o69N56j02j28K08l2k45MM31l60k13L43j28l48N40r7m95
3436c68M47k24k66K84K40k70M5J77M7k53J29K43n92L50P0m08M11J18l57K93r7
3457A9k00K78J29m78j56O34j39k79M33Qo78N55k1k49K66o0r8J7K20k38O0Q0q8
3480A5k02K42L07p24M51K79n07J30K95k46n3M19l10r2RK0l88M61j1l92N06J17
3502C26n11J70L69o97L73K41m39J49O0J68n83K81p0Q2J00J13m82K69L72o23J11
3523b21M88l81n5L58Ll91K25N5j39k16L75j84M7L21n01J11L76l91j04N50m15Q2
$$ plain form
3545 -7 185 44 -97 9 181 -48 -10 377 -204 153 157 -220 -171 210 74 -92 240 -5 -84 103 41 16 98
3568 98 359 -34 -133 257 180 -87 227 167 -299 325 4 -217 173 234 -182 -149 181 -250 -114 208 -126 -425
3590 -425 329 76 -131 55 156 -339 108 10 -240 -241 -4 -292 -285 12 61 -151 172 -149 -67 119 201 -124 90
3613 90 12 -293 44 273 22 -288 130 173 -268 192 128 -215 28 124 -255 -103 494 -139 35 139 -6 -68
3635 -68 281 9 -44 218 163 -219 197 133 -299 239 344 -210 -45 300 58 -198 161 -6 -129 264 131
3656 131 -20 -22 68 -136 -216 207 -290 -51 -8 -237 -150 202 -135 -138 115 -172 -367 121 46 -383 15 -154 -334
3679 -334 -86 130 95 -309 74 -165 -247 169 -37 -214 65 221 -289 -159 282 -178 -77 156 -158 -20 56
3700 56 21 -293 149 272 -243 156 199 -280 140 280 -47 83 368 288 108 179 -3 -22 17 275 -261 100
$$ packed form
3545gJ92j41j41J06J72k29L8L87n81L57Ml77M9L81j36j66L32k45p9J87o2k5Q2
3568I8K61l93r9L90p7k67L14o0m66O24l21k21L90O1m16L3L30m31J36L22l34k99
3590d25P54k53k07J86J01m95M47r8k50jK37k88PK97M9k12L23l21Q2J86Q2l25K14
3613I0p8l05L37K29k51l10M18M3m41M60o4l43K43R6l79J52N97o33J74J04j45o2
3635f8L49k72n3K62n5l82M16o4m32N38J05n54J65L45k42k56L59j67j23L93j33
3656A31j51kR0k04q0M23m97K39M3k29Q7L52l37lK53k87j95M88p5m29L98j69j80
3679c34K48K16l5m04L83k39q2M16k06j77K79J56n10J30M41m60J01K33l14J38P6
3700E6l5l14M42J23n15L99M3m79M20J40l27J30K85q0j80P1j82j9L9K58n36L61
$$ plain form
3722 100 86 -220 281 161 16 -19 162 -228 -35 293 81 -204 68 259 -136 -79 106 -306 -156 153 -186
3743 -186 -216 75 16 -219 67 -144 -62 89 1 -238 -32 -66 -192 -45 217 -140 -45 216 36 -145 237 -126
3765 -126 -128 162 44 -259 70 56 -141 -218 130 -190 -212 235 -190 -120 286 -129 43 159 -17 -41 -105 248 -38
3788 -38 -25 105 53 -38 250 -45 -42 150 190 -201 85 -16 -146 45 256 -86 2 146 13 -21 43 -112 -172 419
3812 419 -40 -276 66 -84 -180 -86 114 -215 -207 147 66 -45 91 47 -168 13 -49 -395 283 -148 -288 -72
3834 -72 62 -102 20 77 -28 -75 -3 -201 -373 227 157 -241 -51 -38 -144 -8 322 -39 90 147 20 -47 204
3857 204 -19 -54 49 95 -289 -91 126 -5 278 -87 -241 32 422 -85 -113 204 -61 -10 91 148 -317 27
3879 27 79 -120 137 170 -455 155 270 -206 43 -43 29 -13 74 37 -127 80 70 -196 -86 104 -152 -129 235
$$ packed form
3722A00j4l06N01j20j45l5J81l90J93L28k12k85K72J91l95N7J85m12J50L09l39
3743a86l0K91n9k35K86k11Q2J51q8k39K06l4j26J47K62l57R5K61j80j81L82l63
3765a26kK90j18l03L29j4j97p7L48l20k2M47m25P0M06m15J72J16j76k4o4L53k86
3788c8J3J30n2r1K88k95LJ92M0l91K86j01j30J91K11l42Q8J44j33l4O4j55o0N91
3812D19m59k36L42j50r6R4K00l29QL54q1j11J36m4k15J81o2l46O78m31j40K16
3834g2J34j64J22N7j05m7P2j98j72O00p0l98J90J3j06J36L30l61J29N7j27o7K51
3857B04k23l5J03M6l84J98K17j31K83l65j54K73L90n07k8L17k65N1J01N7m65L44
3879B7N2j99K57L3o25O10J15m76K49q6P2m2Q7l7j64K07j0k66J10J90k56K3L64
$$ plain form
3902 235 -319 -127 40 -172 -27 -28 -8 -8 15 50 -405 256 168 -214 38 156 -49 119 187 139 -133 21 -52 -248
3926 -248 131 83 -147 -47 219 18 163 234 -135 -166 267 -77 -104 203 137 58 138 32 50 30 177 -188 7
3949 7 229 -110 -151 281 52 -4 125 18 4 166 -45 -130 67 105 28 48 -30 -268 -116 115 -143 -34 339
3972 339 -302 -227 -129 -78 -118 85 -25 5 -24 209 23 -262 324 -109 -128 286 16 -270 127 -52 -86 -57 106
3995 106 -9 56 183 -89 -69 178 -132 -170 200 67 26 230 -17 -316 -19 -10 85 127 247 -54 16 110 94 97
4019 97 272 298 -184 265 1 -147 -55 122 -238 51 19 34 -19 253 51 -57 3 208 -189 70 50 -254 2
4042 2 73 -45 -124 47 33 -172 -18 -161 -16 119 -31 -163 -6 67 -415 40 223 -251 -223 194 -249 85
4064 85 33 -17 -153 89 -96 31 -67 15 -158 136 228 -323 49 202 -189 -21 107 100 48 254 -22 -44 89
$$ packed form
3902B35n54J92J67k12J45jK0%K3L5m55O61q8l82K52J18k05J68O8m8k72J54p3j96
3926b48L79m8k30J00K66k01J45P1l69l1M33l44k7L07o6p9Q0j06J8k0J47l65J95
3949GK22l39m1M32k29n6J29j07j4J62k11q5J97L8p7K0p8k38J52K31k58J09L73
3972C39o41P5R8N1m0K03j10L0k9K33j86k85N86m33j9M14k70k86L97j79l4K9J63
3995A06j15O5J27k72K0K47l10l8L70j33m1K04k47k99K97RR5M2J20l01P0R4j6L
4019I7J75K6m82M49k64j48R2J77l60K89l2J5n3K72k02j08O0K05l97K59k0l04K56
4042BP1j18p9J71j4k05J54j43J45J35j50j32J57P3m82M55J83m74K8M17m43L34
4064H5n2n0j36K42j85J27r8Q2j73K94R2n51L72J53l91J68J28pn2K06k76k2J33
$$ plain form
4087 89 43 -118 157 59 -332 197 203 -256 -114 387 -153 -247 251 -11 -73 40 78 -210 -24 49 -84 53 317
4110 317 0 8 394 -85 26 120 14 -383 25 26 -176 157 130 -230 73 336 -212 -169 40 -190 -99 111 99
4133 99 -223 69 -98 -46 -215 81 -289 64 191 -198 48 12 -72 -211 253 -88 -89 42 30 -80 -75 80 -214
4156 -214 31 148 -166 -45 217 -184 35 292 24 -58 200 -47 67 61 37 54 -64 -30 62 -17 134 -17 -33
4179 -33 171 16 -36 270 172 -63 66 126 -42 107 428 -163 -81 179 -138 -236 116 -101 -244 114 38 -280
4201 -280 47 72 -326 -80 241 -232 -93 -82 -337 -199 31 8 -129 -164 -103 6 61 99 -92 -102 -27 -155 33
4224 33 260 84 -3 233 -7 35 93 247 88 74 -21 -292 70 100 -178 -9 226 95 -61 36 26 -64 173
4247 173 248 -81 179 161 -100 -29 172 -156 -272 43 141 -147 199 -77 -202 55 9 -96 60 105 -38 -143
$$ packed form
4087H9m6j61K75r8l91N29Om59J42N01n40r4M98k62o2J13L8k88J86P3j33J37K64
4110C17l17QL86m79J11R4j06l97M08Jk02L33k7l60L03K63n48M3K09k30R1K10j2
4133I9l22K92j67N2j69K96l70L53J27l89K46l6q4j39M64l41jJ31j2j10NJ55k94
4156b14K45J17l14J21K62m01K19K57k68q2K58k47J14ok4J7j18L4R2p9J51j51j6
4179c3K04j55n2L06r8k35J29O0j68J49L21n91Q2K60l17r8L52k17j43L58p6l18
4201b80L27K5l98K46L21m73J39J1k55J38K30k3j37l5O1J09N5L8j91j0P5j28J88
4224C3K27j76q7K36k40M2N8J54j59j4r5k71L62L0k78J69K35j31j56R7j0r0K37
4247A73P5l29K60j8k61P1K01l28j16L15R8k88L46k76j25K57m6j05J56M5j43j05
$$ plain form
4269 -143 106 -98 -103 150 -59 -21 210 -17 -70 -58 28 -100 119 252 -88 23 84 2 -279 88 -145 -43 93
4292 93 83 -359 -8 64 23 -23 137 -35 57 182 -240 -108 38 120 -50 93 103 -123 150 85 -120 127 23
4315 23 -131 6 248 50 -56 206 -99 -96 11 82 -334 29 -72 -38 25 147 -54 103 161 -206 183 57
4337 57 -102 -143 123 46 40 100 54 95 131 67 -97 50 -15 -83 -109 108 -87 -108 101 -112 -181 72 -27 -172 153
4362 153 123 -50 179 -102 -145 128 97 -140 -43 230 -47 38 104 -100 -184 -21 -29 -221 96 45 25 -90 85 -70
4386 -70 -164 182 -39 -14 189 260 -73 172 -76 -32 57 226 -130 -112 167 48 -9 50 26 -58 275 39 -136 -127
4410 -127 184 -204 30 105 -28 -152 92 -158 -103 190 -103 -90 80 -58 -122 -65 177 -160 -131 -60 -196 -178 144
4433 144 -67 -191 42 5 -216 72 262 -43 233 4 -215 -95 124 -87 -246 297 -92 -160 165 132 -246
$$ packed form
4269a43K49k04nK53k09L8K31k27n3J2Q6j28K19J33l40J11O1q2k81L67k33J02J36
4292I3j0m42L51P2m1m6J60j72R2J25m22J32J46Q2j70J43J0k26K73o5k05K47j04
4315B3j54J37K42j98j06K62l05LJ07P1m16L63j01L4O3J22k01J57N8l67L89j26
4337E7j59m1K66p7oO0m6M1L6o4j64J47o5o8k6K17j95k1K09k13o9K53r9j45L25
4362A53l0j73K29k81m3K73l1k37R7K73k77Q5O6k04q4J63qj92L17n1k0j15J75j55
4386g0r4L46k21K5K03P1l33K45k48M4Q9J69l56J8K79j19n7N9k4q4L33k36j75R
4410a27L11l88K34P5j33j24K44k50N5K93k93J3J70j38o4N7K42l37K9P1j36J8L22
4433A44k11j24K33l7k21K88J90l05K76k29k19J20K19k11j59N43l89o8L25l3l78
$$ plain form
4454 -246 10 118 -383 150 -8 18 189 -69 95 12 255 154 -57 136 48 -194 150 115 -79 181 117 113
4476 113 -89 56 69 157 65 50 -94 -28 162 -121 -18 244 -301 118 90 -186 14 70 -152 -127 -29 -189 29
4499 29 18 -83 -91 45 3 -33 176 0 -118 -10 142 -125 116 81 -192 -182 99 55 -228 69 123 -263 51
4522 51 41 -200 -118 142 -21 -145 24 -34 24 98 11 12 -9 26 -154 262 191 140 -51 108 -12 -24 196 -192 -113
4547 -113 313 -95 -117 245 31 -140 40 141 -6 144 221 -212 -87 169 -20 -111 108 1 -154 -41 27
4568 27 -129 80 19 -41 29 219 126 -232 157 -189 -313 57 -342 -218 58 -6 -164 1 -190 -37 9 -28 -268
4591 -268 29 151 108 -56 277 -96 -90 244 -1 132 95 -22 -82 50 14 83 -97 32 -6 -375 28 -1 110
4614 110 217 78 -55 12 186 -231 52 54 -96 -252 202 20 -58 168 52 7 121 230 -110 17 29 -58
$$ packed form
4454b46K56J08n01N33j58K6J71k58J64q3K43j01k11J93q8k42L44l5j94K60o4m
4476A13k02J45J3Q8r2j5j44O6J90k83J03K62n45M19k8k76K00N6k22K5R8j60K18
4499B9j1j01qJ36m2l6K09j76j18J08J52k67K41l5k73J0K81m4k83K97N4l86L14
4522E1j0k41Q2K60j63j24J69n8N8P4q7Jk1L5j80M16p1n1j91J59j20j2K20l88P9
4547a13M26m08k2L62k14j71J80J01j47J50P7m33J25K56j89r1K19j07j55J13O8
4568B7j56K09o1o0P0J90r3l58L89l46j24L70l99J24K76o4j58J65j91J53M6l7k40
4591b68K97J22m3j64L33l73OL34k45J33l7j17o0J32l6O9j80J29l8l69M03k9J11
4614A10J07j39j33O7J74m17K83Kj50j56M54j82p8K26j16m5J14J09l40J27J2q7
$$ plain form
4636 -58 19 -34 -257 71 -48 94 68 93 114 -116 57 89 -172 89 192 -289 -119 123 -313 -313 68 44 -172
4659 -172 -164 -13 -114 -178 163 15 103 174 -257 121 -145 -53 88 106 28 -136 23 -1 32 -46 95 -41 79 116
4683 116 -34 159 79 -98 -69 264 -34 -176 221 22 -195 -93 -6 -116 -13 117 8 177 141 -46 105
4704 105 198 -198 -139 119 118 -161 37 179 -209 100 -118 -27 -139 24 34 -15 209 -58 -163 150 -140 -202 -112
4727 -112 -11 -234 -11 130 -226 -51 -29 -114 -72 236 -118 -49 84 77 -2 20 -17 -7 131 -110 -205 -71 159 18
4751 18 -32 53 25 104 240 56 -100 108 60 -201 -1 -130 64 -156 186 -105 -107 196 -41 41 157 25 -37
4774 -37 275 114 -92 39 -32 -64 124 67 -143 124 29 -67 -78 -38 -103 -166 -26 228 -251 -110 159 -139 -34
4797 -34 145 -144 163 67 6 -132 -59 -140 -95 41 40 -49 -85 -124 -249 -50 36 17 -45 61 -93 -165 69 104 -127
$$ packed form
4636e8P7n3k23L28j19J42k6K5K1k30J73L2k61K61J03m81J70K42m36%L81k4k16
4659a72QJ51j01o4L41j48Q8P1m31L78k66R2J41J8p8j64J59k4L3p8J41j36J20L7
4683A16j50J93q0j77K9L33k98j42L97j99k17J02Q7j10J03J30j09J69l6j87J51
4704A05R3l96N9K58jk79J98J42l88L09k18R1j12J63J0m9K24k67j05L13k90o2R0
4727a12J01k23K23J41l56J75K2q5M2L08l54O9J33pp9K2l7J0J38k41r5J34K30j41
4751A8n0Q5k8P9J36j84j56K08m8k61K00j29J94k20L42k91kL03k37Q2J16j32o2
4774c7L12j61k06J31p1l2J88n7k10K67r5r6j1M0o5o3J40K54m79J41K69k98J05
4797c4J79k89L07r6o1j38P3q1M5J36jq9l6l9j25J99Q6j9o2J06j54p2K34L5k31
$$ plain form
4822 -127 0 203 -77 -11 209 -88 97 288 -120 -5 172 23 -135 55 -54 -173 144 22 -89 -235
4842 -235 155 -111 72 111 50 -100 293 117 -142 331 -54 -120 129 141 -15 118 -4 -304 -159 166 -85
4863 -85 -65 157 -61 -215 -17 -144 -132 -54 35 -107 69 -45 -56 -29 -82 -239 3 -217 32 22 -40 32 -128 127
4887 127 -45 -224 166 -104 -111 104 129 7 -119 189 -145 -243 -1 27 -136 332 -66 203 180 68 -120 -31
4909 -31 63 -137 -33 94 -126 -88 75 62 -97 98 287 -79 -53 94 185 225 155 -50 -5 114 -146 -10 129
4932 129 -195 4 112 -71 -138 200 57 -336 165 -155 -15 -48 -153 -38 -167 162 -108 -127 -103 69 -137
4953 -137 8 58 -206 255 33 -32 -88 273 -205 177 -46 16 -109 115 5 -136 115 -88 -31 -67 279 -183
4975 -183 -119 -150 -48 -106 -129 -168 45 -115 79 -8 -564 37 -148 -29 329 -34 -127 245 -118 -142 -52 -191 -204
$$ packed form
4822a27J27K03k80O6K20k97J85J91m08J15J77j49j58J90j09j19L17j22j11j46
4842b35L90k66J83L9o1j50L93j76k59M73l85o6K49J2j56J33j22l00J45L25k51
4863h5K0K22k18j54J98j27J2P8Q9j42J76j14j1K7n3j57K42k20K49j0o2P2j60K55
4887A27j72j79L90k70pK15K5j22j26L08l34r8K42K8j63M68l98K69k3j12j88Q9
4909c1R4k00J04J27k20L8J63j3j59J95J89l66K6J47R1M0p0k05M5J19k60J36J39
4932A29l24J99J08j83o7L38j43l93N01l20J40l3j05J15j29L29k70j9K4J72k06
4953a37J45N0k64M61k22o5n6L61m78L82k23O2j25K24j10j41K51k03N7l6L46m62
4975a83O4l1J02n8k3l9K13j60J94q7n56O01j85J19L58l63r3L72l63k4R0j39j3
$$ plain form
4998 -204 143 114 -116 61 7 113 -46 169 -145 79 147 -112 -110 58 -143 -359 11 -13 -106 90 104 -77 21
5021 21 96 -153 -51 189 -240 -137 73 72 65 -22 46 -54 -13 -134 70 -115 2 -40 109 -53 61 75 302 108
5045 108 113 135 106 167 76 86 -97 -155 71 -136 -161 -41 138 9 23 106 -191 280 -62 -8 321 -185 -103 61
5069 61 128 103 12 39 -32 -144 135 77 -31 316 122 -161 74 51 -116 57 84 -229 33 81 21 -20 -18 195 -61
5094 -61 -125 86 -78 82 -1 30 -9 119 -75 -29 -155 209 11 164 -64 -217 161 38 -137 -243 70 -197
5116 -197 -153 198 -93 174 -63 71 -106 26 73 -47 73 134 3 -78 382 -92 197 2 -124 31 302
5137 302 175 -95 119 34 229 -78 4 -192 50 246 -4 -19 185 -89 -16 70 -154 20 170 9 -10 194
5159 194 92 30 -80 -42 -239 -19 79 -171 -209 -61 -155 -6 114 -1 -11 -2 33 -49 -273 262 -156 -45 12 -72
$$ packed form
4998b04L47k9k30J77n4J06j59K15l14K24O8k59KJ68k01k16L70k4r3J96J4j81R8
5021B1P5k49J02K40m29J03K10jpq7O8j00M1j21K04j85J17m2J49j62J14J4K27j94
5045A08NK2k9O1r1J0j83n8K26k07k5J20J79j29J4Q3k97M71l42N4L29n06Q2J64
5069F1O7k5r1K7p1j12K79n8j08L47j94k83K35k3j67J73K7l13K62M8o0m1KK13k56
5094f1o4K11j64J60q3L1l9J28j94M6j26L64j98J53k28j53L78j23j75j06L13k67
5116a97M4L51k91K67k37J34j77J32M7j20J20O1j31q1M60m74K89j95j26J55K71
5137C02j27k70K14q5J95l07Q2j96K42J96k50j5K04k74P3Q6k24J74J50j61j9K04
5159A94j02o2j10L8j97K20R8k50l8J48r4J49J20j15j0RL5q2k24N35m18J11N7q4
$$ plain form
5183 -72 -101 71 -82 -15 238 -81 -170 136 112 -131 190 46 -161 -37 31 167 -154 207 57 -169 259 45
5205 45 110 72 110 -244 84 -120 -154 63 129 144 -158 252 13 53 257 -167 -96 147 18 -74 188 56 -160
5228 -160 -21 206 -50 -12 338 -42 -60 43 -100 -198 -39 120 -121 96 149 -83 -86 125 136 -11 79 175 -63
5251 -63 -32 98 30 104 -37 -383 -6 42 60 25 62 11 -30 52 -72 -36 -39 -57 -285 28 -39 -87 23 -15 -108 -36 122
5278 122 -152 -129 -8 -65 -109 94 4 -17 241 48 -38 -72 -18 -140 89 197 -154 -67 275 -52 42 -42 209 -33
5302 -33 100 134 -273 -209 50 78 -48 148 -44 17 55 -237 -10 115 24 -184 -39 -217 -128 -31 131 49 -101
5325 -101 228 -47 -57 -32 -33 -33 -37 81 -46 -17 255 -213 -90 -10 -147 -134 -39 -83 -57 -59 -51 -71 34 -74 -107 112 17
5352 17 -212 108 233 -126 -64 180 -116 38 -41 297 -179 113 -173 -277 242 1 -19 -70 129 -211 32 268
$$ packed form
5183g2k9J72j53O7K53l19q9L06k4k43L21j44k07J24O8J36l21L61j50k26M28k14
5205D5O5l8L8l54L28k04l4K17O6J5l02M10k39M0K04m24P1K43j29r2K62j32k16
5228a60J39K27k56L8L50l80j8J03j43r8J59J59k41K17N3k32lK11J1j47R0R6k38
5251f3L1J30o8P4j41l46L77M8J8l5L7n1m1Q2j24L6lj8k28L13o7m8J10l8r3P2J58
5278A22k74K3J21n7m4K03r0k1K58j93q6l4N4j22K29J08l51Q7L42l27R4q4K51k42
5302c3J33L4m07O4K59K8j26J96j92O1L8k92K27J25r1k08J45j78Q9R7J62q2j50
5325a01L29k75j0K5j%mJ18j27K9K72m68J23Q0j37J3R5m4K6kQk0J05j08l3K19r5
5352A7k29L20J25l59O2K44k96J54p9L38m76K92k86j04N19k41k0n1J99l40K43K36
$$ plain form
5374 268 43 9 164 64 -112 94 -46 -130 -56 196 31 -52 129 -192 -4 182 -247 -134 277 -74 -56 -46
5396 -46 165 -287 87 -111 28 -61 148 -151 -54 70 -224 -143 -3 -22 -84 7 -170 -107 -29 -34 -33 44 -17 -29 -92 -75
5422 -75 -19 -161 13 -12 -88 -84 -69 -29 209 14 -58 110 -7 -80 160 237 -101 -51 52 60 -14 200 101 56 87 57
5448 57 -158 -29 22 13 88 136 5 -265 70 -30 -128 83 30 -168 87 7 -85 250 93 -157 50 166 221 -189
5472 -189 183 -89 -157 4 -67 -84 122 154 -330 185 -98 36 -104 40 21 -128 154 -174 -120 262 -1 -81
5494 -81 -8 -15 -226 -32 -146 -104 -72 127 -168 -128 170 -149 -79 -77 239 -123 262 -97 -125 268 -61 -42 -222 -37
5518 -37 -214 -44 30 -119 -99 136 47 -8 136 -87 -29 248 23 -204 103 -37 -301 144 124 145 -159 -36 134
5541 134 -120 59 -57 -154 -93 183 -263 -114 271 -69 -151 58 -26 -59 23 96 -214 84 153 -117 -142 95 126
$$ packed form
5374B68k25l4J55j00j76K06j40q4P4K52j65q3J81l21J88J86m29J13M11l51J8J0
5396d6K11m52L74j98J39q9K09k99R7J24k94Q1J40j9o2R1j77O3P8nJP7o1j2o3J7
5422g5N6j42J74k5p6MJ5M0K38j95p2J68j17p3K40P7l38N0J03Qp4K14r9m5L1l0
5448E7k15J29N1rP5M8j31k70L35j00r8K11n3j98K55q0r2L35j57k50K07J16N5m10
5472a89L72k72o8J61p1j7K06L2m84N15k83J34j40J44j9j49K82l28N4L82k63q0
5494h1P3pk11J94j14M2L2J99k95M0K98l19P0KL16l62L85l59k8L93l29J9j80J85
5518c7j77J70P4j49K0K35q9n5J44k23N8K77k25k27L07j40k64M45k0K1l04J23J70
5541A34k54J79j16r7O1K76m46J49L85l40q2K09q4l3Q2P3l10K98O9k70k5K37L1
$$ plain form
5564 126 36 122 -168 -170 -145 -15 -201 150 -54 19 71 189 -92 84 183 -166 -78 84 -94 -112 34 49 -155 16
5588 16 103 -103 -11 58 -152 28 98 11 94 162 -1 38 55 -173 -76 174 94 32 137 60 -106 -3 9 -119 -110 233
5614 233 51 94 159 -228 -75 27 -53 -138 46 -80 -5 104 30 -148 -53 224 -213 -172 235 -19 -105 140 66
5637 66 -13 49 -9 3 -109 147 -201 -105 40 -101 -53 57 26 -100 168 -148 -65 85 87 -10 112 209 17 139
5661 139 143 -82 99 119 183 37 156 -7 -197 163 -30 125 148 118 -138 48 96 -327 0 83 108 -128 175
5684 175 38 -35 83 49 -127 -67 87 -290 -73 -106 -17 -84 128 -14 -93 79 -84 7 90 -15 -183 5 -24
5707 -24 -126 86 91 35 -125 -41 155 -240 62 24 37 43 157 -23 27 -12 18 56 337 -144 -205 -112 63 -165 -14
5732 -14 166 -192 -10 107 -74 -108 108 -147 -74 81 11 -87 260 -164 121 87 157 -14 -65 177 -117 326 269
$$ packed form
5564A26r0Q6k90kK5J30j86L51k04P3N2J18k81J76R9l49Q8J62j78j8J46J5k04J71
5588A6Q7k06R2O9k10J80P0q7Q3O8j63L9J7k28R7K50q0o2J05p7j66J03J2j28RL43
5614B33j82M3O5l87J53J02q0q5J84j26P5J09p4j78R5K77m37M1M07k54q6K45p4
5637F6p9O2n8J2j12K56l48R6J45j41M8J10l1j26K68l16Q3J50Kr7J22R7j92J22
5661A39Mk25J81K0O4j46J19j63j90L60j93J55K3l0k56J86M8m23L27Q3K5k36L03
5684A75j37p3J18l4j76O0J54l77K17l3Q9o7K12j42p9J72j63R1Q3j05j68J88k9
5707b4j02K12Nn6j60Q4J96l95L02l8J3OJ14j80N0l9L0L8K81m81o1R3J75k28J51
5732a4J80l58J82J17j81l4K16k55P3J55p0r8L47m24K85l4P0j71n1K42k94M43n7
$$ plain form
5755 269 9 71 39 35 -158 133 -138 97 78 -73 -208 17 220 -113 75 264 35 -251 142 20 -10 204
5777 204 4 -35 74 137 -60 15 138 -146 9 -52 -73 -52 102 -13 -187 204 -136 -167 -81 -43 -14 25 -41 -141
5801 -141 208 122 -122 -29 179 -12 94 18 -95 -85 196 6 -140 48 -82 -82 72 192 -113 -110 33 -53 -180
5824 -180 27 99 -24 71 178 -217 -27 64 5 160 -115 -116 -57 -7 38 -224 246 22 -204 126 -152 -76 93
5847 93 -69 -281 76 -124 -205 131 23 -200 -103 157 13 -56 38 -77 -36 33 54 -241 -110 196 -111 -27 -31 -118
5871 -118 -223 -58 153 -2 211 -185 -187 -53 53 -85 -154 97 -82 -224 65 -58 -214 105 41 -58 -82 4
5893 4 -16 -48 122 6 205 54 71 -76 173 139 -33 155 -6 -57 206 41 -209 6 93 122 -75 40 -96
5916 -96 -19 92 31 -74 101 126 -152 -100 -24 -42 52 -74 -211 -179 48 -157 -56 -3 -57 -16 73 71 -86 -27 65 -126
$$ packed form
5755B69k60O2l2mj93K91k71K35j9j51j35K25K03l33J88J89k29k86L93j22l0K14
5777B04k00l9J09O3j97P5J23k84J55o1k1K1J54j15j74L91l40l1Q6L8K9L9o6j00
5801a41L49q6k44R3K08j91J06p6j13J0K81j90j46J88j30%J54J20l05LJ43q6j27
5824a80K07P2j23R5J07l95J90R1n9J55k75jN9N0M5k62M70k24k26L30k78P6J69
5847I3j62k12L57k00q1L36j08k23R7K60j44o9R4j15M1O9K1k95J31L06l07Q4mq7
5871a18j05J65K11j55K13l96kJ34J06j38o9K51j79j42K89j23j56L19o4r9k4Q6
5893Dk0l2J70j16J99j51J7j47K49l4j72J88j61n1K63j65k50K15Q7K9j97J15j36
5916i6P7J11o1j05J75K5k78N2P6j8R4j26j37L2K27k05J01N3n4M1Q9kj57N9R2j91
$$ plain form
5942 -126 -75 99 -26 -148 -87 -1 73 -4 -160 -76 200 59 -92 137 -44 -37 54 136 -100 -28 -125 -156 -97 96 13
5967 13 -51 69 -50 52 -187 -36 -63 69 143 -121 -72 155 -16 80 19 99 -117 168 67 -253 129 110 -144
5990 -144 15 155 -64 148 87 91 72 190 180 -100 65 97 -265 157 58 -119 -178 35 40 95 126 -10 67 127 -5
6015 -5 -222 7 -150 -70 37 -40 -106 7 29 78 71 -19 165 -268 65 -201 -150 170 -36 22 121 -42 -209 -49
6039 -49 176 -132 19 122 29 133 200 167 -68 106 216 -5 93 106 -90 43 113 72 -32 75 -160 -318 159
6062 159 -12 -210 57 100 -111 19 -164 -118 91 -40 -135 6 -107 -308 -164 249 16 -7 -119 -68 -206 -68
6084 -68 -10 -54 -33 -66 187 31 -214 -52 -184 154 11 21 -27 -107 -364 -75 169 -284 100 178 -87 -25 376
6107 376 -109 -90 -90 -34 -217 35 94 -201 153 111 -208 132 27 -108 -70 120 184 251 231 266 139 -1 -170 -170
$$ packed form
5942a26N1J74j25j22O1Q6P4p7j56Q4K76j41j51K29j81PR1Q2k36P2r7l1N9J93q3
5967A3o4J20j19J02k39J51k7J32P4k64M9K27j71R6o1Q0k16K85j01l20L82j9k54
5990a44J59J40k19K12o1Mj9J18j0k80J65L2l62M22r9j77n9K13NN5L1j36P7O0j32
6015ek17K29j57Q0J07p7o6J13K2M9pr0J84m33L33k66N1L20k06N8R9j63j67J60
6039d9K25l08J51J03r3J04O7l3k35J74J10k21R8J3j96J33P0m1j04J07k35j58M77
6062A59j71j98K67M3k11J30j83M6K09j31r5J41j13k01J44M13k33k3j12N1j38J38
6084f8N8m4K1l3K53j56k45J62j32L38j43J0m8q0k57K89K44m53L84P8k65O2M01
6107C76m85J9%N6j83K52N9k95L54m2l19L40j05j35L8J90O4O7k0L5j27j40j69%
$$ plain form
6131 -170 89 577 21 176 502 -448 -129 -409 67 -34 -138 -494 -27 -133 -3 -328 -491 -235 -465 738
6151 738 -3 42 -147 590 216 -47 29 -143 573 187 -89 -306 -2 358 173 -132 19 -96 106 272 -139
6172 -139 31 622 122 284 756 -89 15 103 343 59 182 269 450 40 53 682 245 239 -237 151 173 52
6194 52 -350 -70 112 -87 54 77 -6 155 246 -12 -51 121 138 -32 -3 -83 -170 102 144 -168 78 101 357 -63
6218 -63 198 -61 -71 266 -5 -46 -81 -18 -175 51 -22 99 116 -37 208 54 318 6 40 -140 -114 -194 479
6241 479 145 151 365 395 39 435 92 111 -40 490 -293 159 -22 -135 -259 332 -139 -327 401 -113 8
6262 8 153 107 28 -112 275 -186 -43 55 18 -188 -25 -4 -228 49 -24 72 30 128 -271 144 57 190 28 32 6
6287 6 -9 194 117 42 69 49 -176 4 218 7 -64 166 161 -127 -58 -76 -224 5 71 -103 -20 116 -203 -49 -106
$$ packed form
6131a70K59M88n56J55L26r50L19k80M76j01j04l56M67j06J30l25j63K56k30J203
6151G38p41M5j89P37l74k63P6j72P16l86k76k17L04L60j85l05J51j15K02J66m11
6172a39J70N91n00J62M72q45J04Q8K40k84J23Q7J81m10J3O29m37om76L88K2j21
6194E2m02K80J82j99J41K3q3J61R1k58l9J72J7j70K9q0q7K72M2l12K46K3K56m20
6218f3K61k59j0L37k71m1l5O3j57K26p3J21J7j53K45j54K64l12L4j80K6q0O73
6241D79l34OK14L0l56L96l43J9j51N30p83M52j81j13j24N91m71j88P28n14J21
6262HJ45m6p9j40L87m61J43R8l7k06J63K1k24K77p3R6m2R8l99M15q7J33j62Mk6
6287Fj5K03p7p5K7k0k25J80K14k11p1K30nk88O9j8j48K29O6j74Q3J36l19J54n7
$$ plain form
6312 -106 -43 86 182 -37 -26 -47 -23 12 -72 50 7 23 90 -23 186 -38 -5 74 0 83 -85 -73 -132 -61 139 -42
6338 -42 141 -49 157 18 10 126 111 109 -86 -10 -84 96 177 -165 -126 41 -10 -111 186 -171 33 -21 5 -113
6362 -113 -96 56 -67 218 6 41 2 55 -40 183 32 29 44 127 30 -15 113 -200 -413 53 -193 -88 167 120
6386 120 -98 40 13 28 -134 -14 11 107 -47 30 -114 -83 27 -118 -127 183 -138 163 170 -87 -49 137 -105 -22
6410 -22 223 -186 -139 152 -87 1 -12 -15 -146 -174 101 -86 -23 33 -93 13 171 -126 40 112 -106 -69 130 1
6434 1 -142 257 17 -39 99 11 -52 125 55 113 -116 77 124 -107 -207 91 -35 34 90 -232 -64 46 -168
6457 -168 126 166 -255 -195 163 -34 -244 200 -96 -74 117 105 -156 -157 -103 103 -6 -10 -18 -33 94 100 -52 136 -107
6482 -107 -143 -153 17 -75 -240 -86 -136 -206 203 82 -98 -215 214 -251 27 182 -336 15 -173 42 -16 168
$$ packed form
6312a06O3J29R6k19J1k1K4L5q4J22m3J6O7j13K09k24L3P9p4Q3j68J2n9P1K00j81
6338d2J83j90K06j39qJ16j5kj95P6p4J80Q1l42L9J67n1j01K97l57K04n4K6j18
6362a13J7J52j23K85k12L5l9N3r5K23j51lJ5Q3r7m5J28l13k13M66k46J05K55m7
6386A20k18J38k7J5j62J20K5R6j54P7j44L1J10j45rL10l21L01Pk57L8J86k42Q3
6410b2K45m09M7K91k39Q8j3lj31k8K75j87O3N6j26J06J58k97J66P2k18L7J99j29
6434Aj43L99k40n6J38q8o3J77p0N8k29J93M7k31j00K98j26O9N6l22J68J10k14
6457a68K94M0m21O0L58j97k10M44k96K2J91j2k61jN4K06j09mqj5J27Oj52J88k43
6482a07l6j0J70r2j65J54n0p0M09j21j80j17M29m65K78J55n18L51j88K15n8J84
$$ plain form
6504 168 -18 -160 -49 -44 -160 50 52 127 21 -37 -10 50 22 -123 98 38 115 -197 53 -32 -107 194 156 10 134
6529 134 -157 45 62 -68 22 -63 76 76 -3 91 247 -211 -84 -90 -40 50 -15 -7 -72 -150 -131 -68 76 2 68 -137 -27
6556 -27 -122 22 270 -203 57 1 -144 -45 -13 -74 69 83 -19 -254 217 34 -59 -83 22 60 173 152 -87 -73
6580 -73 86 -161 1 127 154 177 89 92 -30 20 -56 1 -16 145 -192 91 107 -47 0 102 -113 -227 -54 97
6604 97 -95 299 -43 -5 -45 -99 -53 23 -94 -154 -24 -20 -57 -261 47 -150 -198 -83 -119 109 57 44 1 -36 212
6629 212 -178 -172 -110 -80 -94 8 60 -227 -12 34 -193 40 422 -35 89 45 19 89 181 -91 -95 203 26 206
6653 206 -21 81 43 -73 101 -197 -155 50 -53 -140 1 44 -12 325 -87 -116 13 57 -108 147 -14 -166
6675 -166 55 -86 40 -90 246 -86 98 -100 104 84 -64 -41 -37 -156 -62 -77 -121 -19 -93 -68 -207 -109 86
$$ packed form
6504A68j86j42J11Nj16K10KP5j06n8K7O0k8j45K21o0P7l12K50q5p5L01l8j46J24
6529A34k91K02J7j30R0q5J39%p9R4J56m58J27oN0R0o5Qo5p8J9O3J44p4O6k05J10
6556b7r5J44K48m73K60n6j45R9L2o1J43J4j02k35M71j83r3k4J05L8J13k1k39J4
6580g3J59k47J62J26K7K3q8Lj22N0p6N7j7J61l37K83J6j54M7J02k15j14J73J51
6604I7j92L94l42L8m0n4M6P6j17o0J30Ml7k04L08j97m8J15l6K28n2j3m3l7K48
6629B12l90OO2L0j4J02N2k87K15M6k27K33L82m57J24m4k6P0R2k72mK98j77J80
6653B06k27J02l8j16J74k98M2K05j03q7J41M3n6L37m12k9J29M4j65K55j61j52
6675a66K21j41J26j30L36l32J84j98K04k0j48K3Mj19R4j5m4J02p4K5j39R8J95
$$ plain form
6698 86 -75 -48 -232 283 237 -145 -104 65 -135 -40 -168 -32 -52 -13 -29 -130 80 111 96 -44 122 -180 202
6721 202 -10 -208 86 82 -19 -72 82 -202 24 91 -65 156 28 71 179 184 -119 -228 96 24 98 78 258
6744 258 36 -179 15 81 -100 -12 -24 7 -78 -137 -90 -16 -1 -173 38 -77 -133 78 171 -38 101 -174 218 -65
6768 -65 18 91 -23 292 -6 -106 -127 149 -104 -77 92 68 -3 206 112 -136 72 -17 -103 -108 -4 40 -217 59
6792 59 -52 52 27 -18 131 32 98 21 153 119 -103 14 30 -141 272 30 8 140 89 -90 174 54 89 108
6816 108 46 -67 100 -108 172 -92 -47 19 -53 -279 127 -20 23 -269 -120 -84 38 20 44 99 -8 -45 -134 198
6840 198 -5 -42 102 9 -127 168 -100 -149 34 -85 -186 56 -11 -131 133 97 113 44 79 -29 12 190 -54
6863 -54 -4 -135 -134 -3 -55 55 -84 59 53 -188 -62 -38 13 79 71 218 41 -113 65 29 68 113 -32 -17 171
$$ packed form
6698H6j61K7j84N15m6l82M1J69k00R5j28J36k0L9j6j01K10L1j5j40J66l02L82
6721B02k12j98K94mj01n3J54k84K26O7j56K21j28M3J08Nl03j09L24p2P4k0J80
6744B58k22k15J94O6j81Q8j2L1q5n9M7P4J5j72K11j15n6K11R3k09J39k75L92k83
6768f5Q3P3j14L15k98j00k1K76k53K7J69k4p1K09r4k48K08q9q6nJ04M4k57K76
6792E9j11J04k5m5J49r9O6p7J32l4k22J17J6j71M13k42k2J32n1j79K64j20L5J9
6816A08o2j13J67k08K80k64M5O6p2k26M06j47M3k92J49L6J22j8K4N5j07l7q9L32
6840A98k03l7J44r3j36K95k68m9J83j19j01K42o7j20K64l6J6o9L5j08M1J78k44
6863e4N0j31JJ31n2J10j39J43ok41J26K4N1O6qJ47j77j54J78l6L9M5j45J5J88
$$ plain form
6888 171 -27 36 81 -19 8 175 168 -146 -64 118 114 114 4 60 174 164 -138 -40 -73 165 -166 5 -77 -43 -158
6913 -158 271 -28 -45 166 -145 -101 -68 -30 -8 46 -43 -109 -147 1 -35 22 27 -11 -78 97 -127 -147 139 -91 58
6938 58 12 -6 70 -101 116 -155 64 51 -12 3 173 30 -34 124 135 -131 327 34 235 144 -60 53 -66
6961 -66 156 64 -187 0 -15 99 -36 -171 -66 139 -17 -8 145 -20 -263 -28 14 -122 -152 48 -210 -110
6983 -110 118 -19 123 17 49 -46 -71 46 119 62 61 138 66 218 -72 -22 155 -58 22 -100 55 -25 -27 202 187
7008 187 107 132 79 -128 137 -228 58 283 -91 121 -153 -45 19 119 -22 -155 -30 107 -20 -105 -2 -102
7030 -102 71 87 -207 176 -69 -44 -83 27 -11 -155 61 -96 120 33 -24 26 -59 54 40 7 82 89 -152 17
7054 17 111 -175 97 -68 -81 29 -59 -59 -160 -60 -72 -87 78 -41 15 102 11 -140 37 -47 87 -57 183 50
$$ packed form
6888A71j98O3M5j00K7J67pl14Q2J82m%j10N6J14j0l02R8l3K38l31J71q2L4j15
6913a58M29k99j7K11l11M4L3L8K2N4q9o6l8J48l6N7Nl8o7J75k24k0K86k30J49
6938E8m6j8P6j71K17k71K19j3o3J5J70j43o4J58J1k66M58k93K01r1k04J13j19
6961f6K22r2k51J87j5J14j35j35J05K05j56RJ53j65k43K35M2j36l0K00k58J00
6983a10K28j37J42j06L2r5k5J17P3n7jP7p2J52k90N0J77k13Q0j22J55q0kK29j5
7008A87q0K5n3k07K65l65K86K25l74K12k74J08O4J00j41j33J25J37j27q5J03j00
7030a02J73J6k94L83k45K5l9J10l8j44K16j57K16q7n7N0q5J13j4l3P5Pk41J69
7054A7R4k86K72j65j3J10q8%j01J00j2j5J65j19N6Q7r1j51J77q4J34j44K40j33
$$ plain form
7078 50 -26 65 -175 -103 -43 -85 -105 53 -127 -77 74 -173 192 -8 65 -87 -33 -41 -121 -12 41 0 -4 130 78 -49
7104 -49 -20 -309 -68 -164 75 -65 -61 -123 104 -76 -107 -229 -145 19 53 198 114 81 102 139 60 71 314 161 62
7129 62 93 88 -32 -53 81 -38 -90 99 -12 -157 -63 -34 130 -69 18 12 -35 17 22 -91 27 131 26 -28 114
7154 114 -142 22 37 -169 134 -33 -42 -182 161 27 -6 108 261 -107 2 64 -157 157 -212 132 -11 117
7176 117 57 22 96 -77 -9 -7 197 -136 -107 -98 -70 82 209 17 -98 18 52 2 88 38 -25 208 -39 -81 -66 36
7202 36 -3 8 -15 -179 -68 74 -2 -32 -79 -289 -6 32 -115 -95 68 36 -174 129 55 -165 -71 -94 -192 -6 119
7227 119 -100 12 27 57 -110 138 81 -50 56 -58 250 -212 63 -13 -178 9 163 11 -69 91 11 264
7249 264 19 -53 -22 -94 125 -215 -131 -204 45 -37 0 -48 95 -116 -19 154 -79 -160 32 -56 -17 -31 -109 -102 -24 123
$$ packed form
7078E0p6R1k40P2O0m2k0J58j80N0J51k47L65k00P3j52N4qq0J09N3m1mJ34n2j27
7104d9K9k89K41r6K39j40Mo2K27j80l1j22Q4J64L4J45q4l3K1L7p9J1K43j53r9
7129F2L1nj20k1J34j19n2J89j11j45R4K9J64j99Q7om7N2Nj13J18J04j05n4J42
7154A14k56J64J5k06L03j67rj40L43j34l3J14J53l68J09O2k21L14l69L44j43J28
7176A17o0l5P4j73O8KK04l33K9RK8J52J27j92j15J16L4n0Q6n0o3K33k47m2J5J02
7202C6l9J1k3j64J11J42p6l0m7k10K83L8j47K0J63l2k10L03p4k20R4k3r8J86J25
7227A19k19J12J5L0j67K48n7j31J06j14L08m62K75p6j65J87J54j52q0J60q0K53
7249B64k45p2L1p2K19l40Q4p3K49q2L7m8J43k11R7J73k33q1J92q8L9j4p8PP8J47
$$ plain form
7275 123 1 69 -89 -12 -116 -69 -28 -50 -21 189 -92 -43 -195 -121 -31 -87 -103 -203 76 124 -125 61 -62 -112
7299 -112 14 -142 -30 59 -29 64 152 30 -2 -176 -39 14 -15 -34 -130 115 -31 16 -266 -167 49 -56 17 -152
7323 -152 111 3 42 158 -15 49 9 -11 -165 123 -141 31 17 5 155 -141 -57 -77 24 -10 131 -100 -97 81
7347 81 -69 155 44 17 122 97 -99 -105 25 96 -45 105 -4 -41 288 -98 -272 -19 -30 57 58 -62 106 -72
7371 -72 195 -16 7 -118 -176 -47 156 -205 22 48 25 83 -84 -32 -70 57 153 -51 25 43 -6 -143 42 104
7395 104 -17 129 139 97 -111 -112 -26 -64 139 69 64 58 -52 -141 101 -3 48 -146 -75 49 44 82 -16 198 62 -30
7421 -30 274 64 14 11 -17 45 -7 -5 -162 113 65 122 105 -15 -69 -43 -79 180 140 74 -80 -190 13 129 101 -83
7447 -83 165 -125 24 -60 -79 98 236 -159 -137 -80 222 -375 -18 55 50 0 21 -21 127 39 -155 -96 -140 -133 107
$$ packed form
7275A23j22O8j58P7j04M7M1k2K9K10k81M9j52P4R0n6j6j00K79M8k49J86j23n0
7299a12J26j56J12Q9q8R3Q8j22l2j74J37N3k9j9r6K45j46M7k82R9K16j05P3j69
7323a52K63j08L9J16j73O4m0k0j54K88k64J72j4j2J50k96Q4k0J01l4J41k31LJ78
7347H1j50K24j11k7J05k5j96oJ30P1j41J50j09l7L29l86j74K53j1Q7Jj20J68j78
7371g2K67k11K3j25n8J29K03l61K27K6k3N8j67N2l8J27R6k04P6J8m9j37J85O2
7395A04j21J46J0m2k08jQ6l8K03p0noj10q9K42j04N1j94P1J24nL8r8K14j36r2
7421c0L04k10n0lk8O2n2Kj57K75m8N7j7j20n4K6l6K59m0o6j54j10K03J16k8j84
7447h3K48k90J49q4j9J77J38l95K2N7L02n97L57P3nn0K1m2J48q8j94N9m4PK40
$$ plain form
7472 107 -9 -63 28 -26 201 82 79 -47 63 -53 40 50 68 3 173 -11 -153 -41 163 -84 -68 215 -112
7495 -112 171 22 -126 245 -163 19 -107 -144 -341 70 28 -13 -156 29 -37 -96 187 -40 -85 108 -17 44
7517 44 -7 2 -33 228 -5 -101 -32 145 -130 9 152 87 43 69 -68 -43 -69 -75 -263 -23 -20 -89 -28 46 32 -30 -172
7544 -172 -176 -110 103 -29 -231 76 120 46 -32 109 55 89 16 28 239 -13 180 -29 -126 166 -124 116 -74 -16
7568 -16 -86 -113 6 22 97 26 -83 112 5 -197 -38 3 13 33 -156 17 16 31 48 -7 -218 -226 -115 6 68 109
7594 109 73 85 -179 -160 77 -79 -40 111 67 -107 268 69 -11 6 -200 -21 82 -11 -74 25 -170 -19 -11 74
7618 74 -103 118 93 -204 200 52 16 -39 -31 64 18 -215 -134 146 -114 -89 -66 -149 56 -143 -60 108 -13 -101 113
7643 113 -67 89 120 39 -100 -130 25 110 -1 283 -104 89 -140 -83 23 141 58 -14 95 -193 -19 199
$$ packed form
7472A07j16n4R1n4K27j19lj26J10j16R3J0J8o5J70j84j42J12K04k47J6K83l27
7495a12K83j49j48L71m08J82j26l7j97M11m2m1j43J85o6n9K83k27m5J93j25O1
7517D4n1Rl5K61k33r6O9J77k75J39J43o5m4K6j37K5k6oj88K40Lo9O1P4j4o2j42
7544a72mO6K13j32k02L07M4p4p8J41n4L4p3J2K11k52J93k09r7K92k90K40j90N8
7568a6p0k7J19J6P5p1j09J95j07k02J59M1J0K0j89J73jJ5J7n5k11qJ11J21O2M1
7594A09l6J2k64J9K37j56L9J51m4j74L75j99q0J7k06J79J03r3o3R9j95J51QQ5
7618G4j77K21k5k97M04j48l6n5QR5m6k33Q1K80k60K5K3q3K05j99Q3J68j21q8K14
7643A13j80J56L1q1j39l0J55Q5j11K84l87J93k29N7J06J18q3p2J09k88J74K18
$$ plain form
7665 199 5 -244 2 -19 58 -122 -59 224 28 -154 -129 -10 155 -45 231 228 -12 -60 -169 -42 -138 178 -68
7688 -68 58 18 -16 -8 84 181 117 7 -85 91 -129 118 -4 124 -68 -101 117 -271 41 -29 6 179 20 116
7712 116 -36 -179 -193 101 1 32 -123 -61 12 -297 -38 192 34 67 -58 -88 9 81 207 25 75 70 -50 1
7736 1 56 92 53 6 40 76 67 62 -29 -6 40 35 -88 147 -148 51 28 -130 39 44 -44 175 -150 -122 81 -156 -35
7763 -35 -72 -125 92 -95 184 -44 -121 72 -15 4 45 -88 7 25 -76 -60 93 33 21 50 -110 -84 109 -24 104
7788 104 53 -89 79 18 168 -2 37 -55 40 -130 -1 165 -91 99 -4 83 29 -82 144 1 -49 -11 -144
7811 -144 -66 -29 -245 149 -61 -117 -68 77 -20 -3 182 116 -50 -134 -87 53 52 346 35 -161 -45 -112 36 -87
7835 -87 -43 110 18 74 98 -29 -2 89 -61 172 -66 29 71 41 -12 161 70 -18 -27 26 46 -4 70 -23 11 16 -79 52
$$ packed form
7665A99j94k49K46k1P7j80O3K83j96j82K5J19J65k00K76lk40m8j09J27r6L16k46
7688f8J26m0l4QR2R7o4j10r2J76k20K47j22J28j92l3K18l88L12p0L5J73j59R6
7712A16j52j43j4K94j00L1j55O2P3l09K59K30j58L3j25l0R7P2J26j82N0nj20N1
7736AN5L6l9m7L4L6rnr1K3M6nj23K35k95J99k3j58J69Nq8K19l25K8K03k37J21
7763c5l7n3K17j87K79k28p7J93q7J9M1j33R5J8j01J6J53o0j2K9j60K6J93j33J28
7788A04n1j42J68o1J50j70L9r2R5j70J29J66k56J90j03Q7n4j11K26j43n0L8j33
7811a44P8L7k16L94k10n6M9J45r7J7J85o6j66q4M7J40jK94l11j96J16o7J48j23
7835h7M4J53r2N6K4j27K7R1j50K33k38R5M2l0n3J73r1q8rN3K0n0P4r3L4Nr5J31
$$ plain form
7863 52 94 99 -17 -68 47 86 96 75 -13 62 -13 67 158 150 -41 53 12 188 -35 -11 26 -23 17 -11 -229 106 28 -41
7891 -41 -96 -108 10 -25 -3 -41 -152 -30 -3 35 55 -28 1 -131 -199 -101 -94 59 88 -24 91 45 -67 66 113 -109
7917 -109 89 55 20 53 13 -156 79 -90 211 125 58 51 -137 153 91 -110 -157 51 -100 61 162 -196 -49
7940 -49 -60 -65 6 -93 -193 -52 -11 -215 -61 -121 55 103 -84 -10 66 209 6 -139 4 -124 110 -54 -119 3
7964 3 -154 -61 63 8 251 108 -150 -160 26 -58 -123 -4 28 -66 -43 -74 74 -83 34 -6 -82 -28 -4 34 120 -70
7990 -70 -160 -6 41 -205 7 -111 15 53 -161 15 46 6 -106 -23 -141 -34 119 -220 -159 56 139 195 -68
8013 -68 -10 -12 23 -81 -57 -4 9 -161 67 -100 149 -132 4 221 -204 -4 -147 23 19 -241 73 -80 -5 -22
8037 -22 -177 -189 131 5 36 43 -13 -109 52 -114 -17 83 165 -58 -27 286 -35 92 49 -48 -103 -136 -165 -121 15
$$ packed form
7863E2M2Nj16n1J15L9J0k1q8P5p5Q0R1qj91R4m1J76k23K4L7m9M0k8k18L35p8o9
7891d1n5j2J18l5K2l8j11J22K7L8K0q3K9j32o8R8PJ53K9j12J15m6j12J33M7k22
7917a09J98l4l5L3m0j69K35j69L01q6o7pj88K90o2k01m7K08j51J61J01l58J47
7940d9j1nP1r9j00J41M1k04J54o0J76M8j87P4P6J43k03j45J43j28K34j64o5J22
7964Cj57R3J24n5K43j43k58j0J86q4o5J19L2r4K3l1J48j57J17m0p6N4K4L8Q6j90
7990g0r0J54M7k46K12j18J26L8k14J76L1m0j12Q3j18J07J53l39O1K15Q3N6k63
8013f8N8kL5j04K4N3J3j70K28j67K49k81J36K17m25K00j43J70mk60L14j53P5j7
8037b2j55j2L20j26L1Pn6r6J61j66R7J00Q2k23L1L13l21J27m3r7n5l3k9M4J36
$$ plain form
8062 15 88 -14 -86 37 59 -51 166 -52 -32 -30 -86 44 108 67 10 -56 184 106 -30 -17 135 33 188 -204 -66
8087 -66 -67 -96 40 -82 122 -61 39 29 -68 126 53 -25 4 69 -85 166 45 -182 -18 -30 61 -127 -10 -128
8111 -128 124 95 7 78 62 108 42 -78 -29 -30 259 30 -51 -114 -8 45 -360 -14 55 21 31 132 53 47 -83 34
8137 34 -47 105 153 -42 233 58 4 65 -4 86 4 -86 37 -87 -89 62 -8 150 37 -29 65 33 -51 39 -37 7
8163 7 25 32 67 78 16 -46 29 170 86 54 -80 -111 -103 97 250 -40 114 40 98 7 73 30 -39 218 -144 18 78
8190 78 -129
$$ packed form
8062A5P3j02p2J23K2j10K17k18K0Kn6J30O4m1n7o6K40p8j36J3J52j02J55l92J38
8087f6jk9J36j22K04j83J00j0r7J94p3p8K9O5j54K51j21k27J64j2R1j88J17j18
8111a28K52k9q8P1j6M6o6j20M9jK89k29q1o3J06N3m05L46O9l4J0J01p9oj30J17
8137C4q1J52M8j95K75j75n4O1o9R0q2r0J23j24kJ51p0J58j13o6R4l2q4R0p6M4
8163GJ8PL5J1o2o2P5J41q4l2j34l1QK00J53k90J54p4N8r1O6m3o9K57l62J62O0
8190G8k07
8191a29
$$ Imaginary data points
##PAGE= N=2
##DATA TABLE= (X++(I..I)), XYDATA
$$ plain form
0 0 0 0 0 0 0 0 0 0 0 0 0 0 0 0 -8 8 -8 8 -8 16 -16 16 -24 24 -32 37 -40 48 -56 64 -74 87 -97 112 -125 141
36 141 -159 179 -199 223 -248 277 -308 341 -378 418 -461 509 -560 616 -680 750 -825 910 -1004
55 -1004 1109 -1228 1366 -1522 1704 -1920 2179 -2502 2907 -3447 4191 -5306 7179 -11198 42050
70 42050 -64352 -53783 -5148 -32709 79258 12921 -22992 18993 -30947 -7207 20524 -29677
82 -29677 49315 -14400 -39443 42638 -29238 2994 39803 -52655 -8525 22533 -21413 32554
94 32554 1489 -39945 5906 -26249 22653 24703 -26931 10455 -26157 -26607 42850 -6440 -14345
107 -14345 27135 -39498 -3526 20286 -23010 23511 -1894 -12596 6944 -20611 9753 17218
119 17218 -20006 16661 -2605 -25043 35999 -10975 -10414 22433 -18967 8517 13215 -9095 6961
$$ packed form
0@%%%%%%%%%%%%%%qJ6j6J6j6K4l2L2m0M8n6O9p7Q8j04J20j38J61j84K09k37K66
36A41l00L38l78M22m71N25n85O49p19P96q79R70j069J176j296J430j575J735j914
55a004K113k337K594k888L226l624M099m681N409o354P638r497J2485j8377N3248
70D2050j06402J0569M8635k7561J11967o6337l5913M1985m9940K3740K7731n0201
82b9677P8992o3715k5043Q2081p1876L2232L6809r2458M4130L1058m3946N3967
94C2554l1065m1434M5851l2155M8902K050n1634L7386l6612m50O9457m9290p905
107a4345M1480o6633L5972K3812m3296M6521k5405j0702J9540k7555L0364P465
119A7218l7224L6667j9266k2438O1042m6974N61L2847m1400K7484M698k2310J6056
$$ plain form
132 6961 -2460 -2037 17355 -11069 9150 10239 -22047 22584 1121 -11276 19518 -5937 -5941 12641
146 12641 -3529 272 7664 -5440 9031 -8294 -830 10969 -13237 12705 4204 -16027 6962
159 6962 1649 -12820 10871 1524 -8477 7573 -9500 -3130 -3687 1711 9338 -10217 -865 -1582
173 -1582 -14243 5233 10287 -14930 5263 1357 -15676 5985 -2178 -2946 -330 2437 -281 -8033
187 -8033 -356 1719 -6864 2950 9923 -13070 4426 3915 -11960 5833 3674 -1236 2060 5481
201 5481 -4151 -3437 3472 4054 -283 4413 8313 -11100 4187 5472 -5783 8058 7938 -3209 -1552
216 -1552 5545 -4564 2922 7006 2550 -2697 352 5382 -7294 6062 5354 -5343 2052 5155
230 5155 -5523 -1827 6465 -5819 1816 2784 -805 -4205 -1259 2415 -6805 3835 2568 -5556 -3302
$$ packed form
132F961r421M23J9392k8424K0219J089l2286M4631k1463j2397L0794k5455mJ8582
146A2641j6170L801P392j3104J4471j7325P464J1799k4206K5942q501k0231K2989
159F962n313j4469K3691r347j0001J6050j7073O370n57N398P627j9555R352p17
173a582j2661J9476N054k5217K0193l906j7033K1661q163p68K616K767k718p752
187h033P677K075q583R814O973k2993J7496n11j5875J7793k159m910L296L421
201E481r632P14O909N82m337M696L900j9413J5287J285j1255J3841j20j1147J657
216a552P097j0109P486M084m456n247L049N030j2676J3356p08j0697P395L103
230E155j0678L696Q292j2284P635R68l589l400K946L674r220J0640j267q124K254
$$ plain form
245 -3302 3128 -6559 -2866 6550 -6070 -835 -385 -2920 -5758 638 3030 -4809 515 -852 -5078
260 -5078 -4438 5935 -2910 -2290 5037 -6635 -3256 1232 2650 -2068 3371 725 -5591 1361 2592
275 2592 435 -1517 7176 -3222 -2356 6373 -1802 -742 3930 4026 -3838 5305 2586 -3820 2273 4319
291 4319 992 -955 8218 -3169 -2097 5805 113 -772 4902 3776 -6575 3596 901 -2903 3156
306 3156 4941 -1830 -4359 4414 -5429 -724 5885 -531 -4535 939 -613 -7636 5209 1176 -4477
321 -4477 -975 1136 -5038 -3026 5377 -6275 -2284 2797 -1815 -4794 2204 -1371 -7378 4628 337
336 337 -3092 -961 1201 -5705 -1423 6330 -3591 -398 1667 -2652 -4736 5153 1898 -3308 5112
351 5112 -1208 -3051 306 4828 -1343 1795 5369 -4247 -664 3289 2115 -1394 6459 540 -3836
$$ packed form
245c302O430r687L693R416j2620N235M50k535k838O396K392p839N324j367m226
260e078O40J0373q845O20P327j1672L379M488J418m718N439k646o316O952J231
275B592k157j952Q693j0398Q66Q729q175J060M672R6p864R143k719o406O093K046
291D319l327j947R173j1387J072P902n692q85N674j126j0351J0171k695l804O059
306C156J785o771k529Q773r843M705O609o416m004N474j552p023J2845m033n653
321d477L502K111o174K012Q403j1652L991N081m612k979O998l575o007J2006m291
336C37l429K131K162o906M282P753r921L193K065m319k084R889l255n206Q420
351E112o320j843L357M522o171L138L574r616L583L953j174l509P853n919m376
$$ plain form
366 -3836 4261 680 349 1966 4562 -2451 580 4034 -1171 -75 2375 1555 -2977 5834 -192 -3922
382 -3922 2327 -89 -750 1362 3346 -4662 -1378 719 -1405 -747 2411 620 -6768 2102 -1381 -3905
398 -3905 2175 946 -3625 -1720 1798 -5331 -215 1069 -840 -2635 517 98 -6339 2670 0
413 0 -3248 983 1802 -4708 -716 3364 -4397 1354 1625 -674 -1997 2192 679 -4229 4041 2174
429 2174 -2049 1221 3800 -4940 1534 6126 -3087 2381 2438 -909 -1227 4412 1529 -1825 3714 1553
445 1553 -2515 1004 5531 -4010 2277 5162 -4389 1503 2988 -1340 -1058 4750 -733 -2310 1986
460 1986 -46 -2097 752 4604 -5423 -14 2449 -5440 626 3381 -2313 -2988 2719 -4125 -1639
475 -1639 1612 -771 -2627 -1409 2587 -5039 -653 1605 -4252 -693 3535 -3087 -3351 3046 -4450
$$ packed form
366c836Q097l581l31J617K596p013L031L454n205J096K450q20m532Q811o026l730
382c922O249k416o61K112J984q008L284K097k124O58L158j791p388Q870l483k524
398c905O080j229m571J905L518p129N116J284j909j795L152m19o437R009k670
413@l248M231Q19o510L992M080p761N751K71k299j323M189j513m908Q270j867
429B174m223L270K579q740O474M592r213N468N7l347l18N639k883l354N539k161
445A553m068L519M527r541O287K885r551N892J485m328K82N808n483j577M296
460A986k032k051K849L852j0027N409K463p889O066K755n694o75N707o844K486
475a639L251k383j856J218L996p626M386K258n857L559M228o622k64O397p496
$$ plain form
490 -4450 -328 1961 -734 -1515 -947 1654 -3574 295 2935 -1092 -916 3935 -2571 -2803 5468 -1802
506 -1802 1298 2492 -278 -1033 525 2676 -726 1271 2989 461 -2415 4513 -835 -1644 6362 -1003
522 -1003 -137 2077 534 -1170 1846 1955 -446 1431 1621 161 -4196 3977 448 -2163 5041 -2215
538 -2215 -3346 1663 1269 -2909 2246 109 -2456 -538 -406 -109 -4545 3413 -548 -4374 2323 -1974
554 -1974 -4645 2154 1307 -5027 1909 -1525 -3399 140 32 -99 -3111 2746 -1182 -3913 2366 639
570 639 -3713 2502 1470 -5732 4209 400 -3073 1150 1068 481 -784 2566 -1304 -1835 3200 3299 -2984
587 -2984 2617 2404 -5433 4901 1996 -1661 2619 1582 -1430 294 2892 -73 594 1467 2484 -2921
603 -2921 1941 3074 -4709 4319 1980 -2875 1771 1807 -3062 856 2079 -1301 881 -902 819 -3291
$$ packed form
490d450M122K289k695p81N68K601n228L869K640m027J76M851o506k32Q271p270
506a802L100J194k770p55J558K151l402J997J718k528k876O928n348q09Q006p365
522a003Q66K214j543j704L016J09k401J877J90j460m357Q173l529k611P204p256
538b215j131N009l94m178N155k137k565J918J32K97m436P958l961l826O697m297
554a974k671O799q47o334O936l434j874L539j08j31l012N857l928k731O279j727
570F39m352O215j032p202R941l809l473M223q2n87j265L350l870n31N035R9o283
587b984N601k13p837J0334k905l657M280j037l012J724K598k965O67Q73J017n405
603b921M862J133p783R028k339m855M646L6m869L918J223l380K182j783J721m110
$$ plain form
619 -3291 704 2832 -4102 1185 1380 -4190 -871 1915 -4039 1259 1381 -3399 -498 -2239 618 -1639
635 -1639 -139 1424 -3685 -832 1599 -3406 -1562 4206 -4128 347 1514 -3153 484 -116 494 -1138
651 -1138 436 1593 -1186 -1702 3324 -670 -1480 5586 -3523 -393 3534 -1593 913 2568 472 -576
667 -576 1233 657 1073 -834 3563 133 -2248 5545 -2424 -1292 4707 -650 -996 3826 -1144 -1881
683 -1881 2809 -259 771 -780 1966 -470 -2802 3601 -1456 -2249 3534 -733 -4190 3590 -1316
698 -1316 -3207 3338 -1868 -1038 -571 84 -1847 -1943 1905 -1046 -2511 1449 -791 -5019 3771 -735
714 -735 -3586 3463 -1763 -2464 647 287 -2138 398 867 -505 -1272 681 368 -3931 4212 836 -3281
731 -3281 2775 -421 -2273 2407 2020 -1862 2280 288 -522 333 1380 2099 -1982 3042 522 -1930
$$ packed form
619c291L995K128o934N287J95n570L319K786n954N298J22m780K901j741K857k257
635a639J500J563n109K853K431n005J844N768q334M475J167m667L637o00O10j632
651a138J574J157k779n16N026l994q10P066r109L130L927n127K506J655k096j048
667e76J809n76M16j907M397l430k381P793p969J132N999n357l46M822m970p37
683a881M690l068J030j551K746k436k332O403n057p93N783m267l457P780m906
698a316j891O545n206Q30M67O55j931r6L848k951j465L960k240m228Q790m506
714g35k851P049n226p01L111l60k425K536M69j372p67J953l13m299Q143l376m117
731c281O056l196j852M680l87l882M142j992q10Q55J047P19m081N024k520k452
$$ plain form
747 -1930 2582 1732 -2046 2220 2451 -2584 2231 182 -558 793 1419 1347 -1916 1646 443 -1506 932
764 932 2037 -2396 605 2046 -3372 1260 79 -1235 -379 574 -341 -2223 351 -538 -1248 -638 1698
781 1698 -3350 -963 1644 -3442 640 655 -1706 -1650 686 -1390 -1396 1117 -345 -1148 -1055 1809 -2685 -592
799 -592 2242 -2102 232 1945 -1085 -2182 2588 -603 -526 2252 126 -794 -154 2464 -1805 994
815 994 3012 -1234 -8 2282 -432 -1571 3956 -312 6 2447 -172 -1185 901 2543 -1485 1543
831 1543 1806 -1349 -322 2377 -173 -1551 3333 -1386 -1158 1742 -57 -1585 725 1407 -2473 1084
847 1084 448 -2113 -1034 1362 -972 -1915 2133 -2137 -1468 912 -258 -2582 430 380 -3050 798
863 798 69 -1567 -992 1288 -1289 -1352 1976 -1835 -890 661 492 -1934 597 538 -2493 1211 877 -634
$$ packed form
747a930M512q50l778M266K31n035M815k049p40J351O26p2l263L562j203j949K438
764I32J105m433L001J441n418M632j181j314Q56R53r15j882K574q89p10O10K336
781A698n048K387K607n086M082J5k361N6K336k076oK513j462q03R3K864m494K093
799e92K834m344K334J713l030j097M770l191P7K778k126r20O40K618m269K799
815I94K018m246J226K290k714j139N527m268L18K441k619j013K086J642m028L028
831A543K63l155J027K699k550j378M884m719K28K900j799j528K310O82l880L557
847A084o36k561J079K396k334r43M048m270O69K380j170k324L012n0l430L848
863G98p29j636N75K280k577o3L328l811R45J551j69k426K531n9l031L704l34j511
$$ plain form
881 -634 -478 1853 -1204 -378 2204 -331 63 772 1217 -1372 1730 1369 -1127 1189 1324 -88 -528
898 -528 2813 -588 180 2434 -470 -339 810 1364 -1167 1585 1193 -1280 128 1225 -300 -1133 2548
915 2548 -1408 -609 1568 -422 -1507 724 721 -1858 1311 226 -1681 -1003 1125 -791 -1657 2305 -1933
932 -1933 -1815 771 -785 -1958 1307 15 -3117 949 -370 -1250 -713 1096 -1317 -1661 2198 -1451
948 -1451 -1254 1028 203 -2330 1799 269 -2552 1905 268 -681 258 1315 -936 -297 2125 -799
964 -799 -705 1628 1093 -1593 2347 625 -1941 2712 879 -510 548 1651 -1130 584 1942 -378
980 -378 -40 1182 1072 -1983 2229 652 -1589 1790 149 -1372 378 1532 -1778 659 796 -1052
996 -1052 -415 393 357 -2108 1357 323 -1628 437 158 -2217 -215 1508 -2394 63 -167 -1419 -758
$$ packed form
881f34J56K331l057Q26K582k535L94P09M45k589L102l61k496K316J35j412m40
898e28L341l401P68K254k904J31J149N54k531K752l92k473J408J097j525q33L681
915B548l956P99K177j990j085K231lk579L169j085j907O78K128j916q66L962m238
932a933J18K586j556j173L265j292l132M066j319q80N37J809k413l44L859l649
948a451J97K282q25k533M129j530k821M457j637r49R39J057k251O39K422k924
964g99R4K333n35k686L940j722k566M653j833j389J058J103k781J714J358k320
980c78L38J222j10l055M212j577k241L379j641j521J750J154l310K437J37j848
996a052O37Q08l6k465L465j034j951K065k79k375K002J723l902K457k30j252O61
$$ plain form
1013 -758 -14 -92 -2173 878 -21 -1408 -426 593 -1561 172 1703 -2575 -98 108 -598 -386 1037
1030 1037 374 -1393 653 228 -538 63 1828 -1209 -71 2032 -1726 633 1234 0 -469 1647
1046 1647 671 -817 1410 477 -36 142 2662 -1092 43 2108 -1223 430 1683 -2 -1006 1883
1062 1883 173 -767 1145 357 -325 -163 1848 -1934 -383 2061 -1408 -453 1118 -1075 -1748 2067
1078 2067 -935 -1123 623 -407 -1249 -525 1303 -2015 -476 702 -1685 -1038 1287 -1053 -1891 1808
1094 1808 -1337 -1129 834 -575 -823 -362 1056 -1496 237 1087 -935 -1120 1599 -541 -1133 2574
1110 2574 -1366 -745 1304 75 -512 961 1062 -840 626 805 105 -557 2287 225 -1101 2446
1126 2446 -816 -538 1747 764 -541 1241 387 -668 997 659 489 -998 1541 147 -1225 1696
$$ packed form
1013g58P44p8k081L051q99j387R82J019k154J733J531m278K477K06p06K12J423
1030A037o63j767K046m25p66O01J765l037J138K103l758K359O01j234m69K116
1046A647r76j488K227r33n13J78K520l754J135K065l331J653J253j685j004K889
1062A883j710r40J912p88o82J62K011l782J551K444l469R55J571k193o73L815
1078B067l002j88J746j030q42P24J828l318J539J178k387O47K325k340q38L699
1094A808l145K08J963j409k48M61J418k552J733Q50k022j85K719k140n92L707
1110B574l940O21K049j229n87J473J01j902J466J79p00o62K844k062j326L547
1126B446l262K78K285r83j305J782q54j055J665l38j70j487K539j394j372K921
$$ plain form
1142 1696 -331 -980 1183 304 -1737 1181 -166 -1016 752 -499 36 -1165 1044 -227 -1422 593
1158 593 149 -1458 346 538 -2705 1096 -199 -1480 345 -363 -482 -1101 377 -464 -1056 353 465
1175 465 -1884 21 1276 -2172 1326 639 -1829 284 538 -630 -12 1061 -541 -296 442 1265 -1214
1192 -1214 323 2118 -1740 1347 1150 -1453 749 1609 -614 492 1728 -413 224 280 889 -682
1208 -682 715 1694 -1731 583 1376 -911 44 1986 -1617 40 1692 -1568 81 406 557 -532
1224 -532 424 399 -1885 -67 1025 -908 -741 1609 -2266 -852 1205 -1875 84 462 -392 -1146 126
1241 126 -407 -1114 -113 415 -781 -1057 1672 -1922 -791 1308 -1377 -7 905 -591 -1182 875 -396
1258 -396 -190 204 651 -218 -1021 1581 -1031 -263 1705 -475 -281 1363 -271 -863 1882 -65 285
$$ packed form
1142A696k027o49K163q79k041K918j347q50J768j251N35j201K209j271j195K015
1158E93m44j607J804J92l243L801j295j281J825p08j19o19J478q41n92J409J12
1175D65k349J905J255l448L498o87k468K113K54j168O18J073j602K45P38Q23k479
1192a214J537J795l858L087j97k603K202Q60k223J106J236k141O37N6O09j571
1208f82J397R79l425K314P93k287R55J942l603J657J652l260J649L25J51j089
1224e32R56k5k284J818J092j933J67K350l875J414K057l080J959L78q54p54J272
1241A26n33p07J001N28j196k76K729l594J131K099k685J370R12j496n91K057j271
1258c96K06L94M47q69q03K602k612P68J968k180J94J644j634n92K745j947L50
$$ plain form
1275 285 580 292 137 -384 1615 -284 -370 1280 269 -827 1529 315 -1026 1657 -47 -46 200 410
1293 410 -211 -264 1326 -455 -734 583 281 -1603 1434 205 -1710 1048 -462 -1118 119 395 -929
1310 -929 -583 273 -914 -752 -26 375 -1665 896 -146 -2198 821 -163 -1148 5 685 -1378 -21
1327 -21 615 -818 -253 351 289 -1409 1087 406 -1285 1009 472 -985 474 1455 -1277 470 907 -408
1345 -408 461 871 309 -1130 1176 408 -537 1017 976 -1033 177 1431 -1351 908 1022 -535 -3
1362 -3 1004 -32 -636 1046 359 -362 738 624 -1254 122 1181 -1174 361 551 -895 -274 678
1379 678 -524 -790 636 -413 -631 -13 401 -1317 -273 595 -1319 -102 250 -797 -822 607 -765
1396 -765 -591 738 -606 -639 -289 368 -1020 16 467 -706 -237 602 -328 -696 1049 -381 -437 991
$$ packed form
1275B85K95k88j55n21J999j899q6J650j011j096K356j214j341K683j704JK46K10
1293D10o21n3J590j781k79J317l02j884L037j229j915K758j510o56J237K76j324
1310i29L46Q56j187J62P26M01k040K561j042k052L019r84r85J153O80k063J357
1327b1O36j433N65O04o2j698K496o81j691K294n37j457J459R81k732J747M37j315
1345d08Q69M10n62j439K306p68r45J554m1k009J210J254k782K259J14j557N32
1362cJ007j036o04J682o87p21J100j14j878J376J059k355J535J90j446O21R52
1379F78j202k66J426j049k18O18M14j718J044Q68j914J217L52j047k5J429j372
1396g65J74J329j344l3L50O57j388J036M51j173M69Q39r30l68J745j430n6J428
$$ plain form
1414 991 -32 -206 473 920 -608 287 660 -288 384 1164 135 -767 1363 -158 -279 982 171 -270
1432 -270 578 997 -724 533 627 -329 61 1073 -184 -925 1275 -311 -468 926 265 -795 470
1449 470 417 -1362 501 502 -540 -330 347 -760 -707 1026 -489 -731 298 346 -1241 156 479 -1536
1467 -1536 251 230 -1040 -729 607 -806 -561 1110 -616 -746 125 268 -1108 324 481 -1077 442
1484 442 515 -774 -373 1186 -458 -50 952 -849 -215 530 496 -434 1040 416 -578 368 698 -320
1502 -320 -279 1226 -406 20 996 -363 229 751 470 -649 682 315 -323 290 587 27 -378 1385
1520 1385 -656 -432 950 -113 -384 603 -217 -958 554 -183 -463 -108 50 -187 -608 738 -947 -441
1538 -441 610 -130 -946 416 -240 -1137 623 -162 -600 -281 166 -501 -849 503 -425 -545 220 164 -1354
$$ packed form
1414I91j023j74O79M47j528Q95L73r48O72P80j029r02K130j521j21J261q11m41
1432b70Q48M19j721J257R4r56L90J012j257p41K200j586j57J394o61j060J265
1449D70n3j779J863Jj042K10O77j107N3J733j515k42J029M8j587J397L23k015
1467a536J787k1j270L11J336j413K45J671j726j30Q71J43j376J432J57j558J519
1484D42P3j289M01J559j644M08J002j801O34P45l4r30J474o24r94R46L30j018
1502c20M1J505j632M26R76j359N92N22k81j119J331l67o38O13K97n60m05J763
1520A385k041K24J382j063k71R87q20p41J512p37k80L55J58k37m21J346j685N06
1538d41J051p40q16J362o56q97J760p85m38L19M47o67l48J352r28j20P65n6j518
$$ plain form
1557 -1354 753 137 -1102 723 78 -562 -8 417 -304 -110 682 33 -358 546 707 -842 1038 605
1575 605 -1004 1092 360 -204 440 804 -619 432 840 154 -98 582 538 -790 1075 676 -1114 714
1593 714 403 -787 597 1069 -1028 54 267 -485 -69 378 164 -781 526 -24 -981 344 315 -1123
1611 -1123 81 393 -1426 256 244 -701 -151 176 -246 -814 334 -249 -669 126 405 -1115 61 695
1629 695 -1320 456 474 -538 73 119 -268 -535 445 136 -272 48 650 -856 226 1239 -610 474
1647 474 528 -302 28 789 -141 37 494 8 68 71 904 -345 327 1178 -697 59 849 -317 -283 1043
1667 1043 -397 77 449 -128 116 -175 693 -452 -142 753 -509 -452 699 -193 -727 1003 -570 -341
1685 -341 496 -533 -368 -146 581 -518 -289 309 -435 -638 802 -309 -1031 982 -752 -720 423 -231
$$ packed form
1557a354K107o16j239J825o45o40N54M25p21J94P92o49l91R04J61j549J880m33
1575F05j609K096p32n64O44L64j423J051M08o86k52O80m4j328J865l99j790J828
1593G14l11j190J384M72k097J082K13p52M16M47k14r45J307n50r57J325k9j438
1611a123J204L12j819J682j2r45N50L27m22n68J148n83m20P95K79j520J176O34
1629F95k015J776J8j012O11M6l87k67R80l09m08L20O02j506J082J013j849J084
1647D74N4q30L30P61r30J78M57m86O0LQ33j249O72Q51j875P56P90j166L4J326
1667A043j440M74L72n77K44k91Q68j145L10Q95j262N7J151q92n34J730j573K29
1685c41Q37j029J65K22P27j099K29N98p44k03J440j111p22K013j734L2J143o54
$$ plain form
1703 -231 -468 308 104 -458 -200 273 -68 -663 603 -123 -1046 1120 -372 -501 785 76 -602 538
1721 538 -23 -536 711 297 285 -465 516 252 -300 1416 -155 -375 940 562 -698 995 234 -428
1739 -428 794 -45 30 -185 610 171 -443 714 164 -789 555 361 -1125 557 197 -835 498 -262
1757 -262 -311 -370 250 -428 -456 -51 18 -803 -117 536 -1135 533 107 -1089 432 -39 -572 45 108 -632
1777 -632 -149 -34 -61 -387 -102 467 -798 404 427 -785 70 563 -449 151 549 -610 281 171 294
1796 294 -102 147 755 -463 350 650 -346 52 1103 -552 12 996 -609 464 359 265 13 127 247
1815 247 -210 278 676 -202 0 945 -735 -39 910 -669 -75 355 -146 -305 274 -62 -491 70 272
1834 272 -514 -644 725 -1011 -236 746 -726 -429 492 -405 -578 391 -334 -665 -29 239 -421 -560 732
$$ packed form
1703b31k37P76k04n62K58M73l41n95J266p26r23K166j492j29J286p09o78J140
1721E38n61n13J247m14j2p50R81k64n52J716j571k20J315l78j260J693p61o62
1739d28J222q39P5k15P95m39o14J157n50r53J344j94j486J682l60j032J333p60
1757b62m9n9O20o78k8M05O9q21O86O53j671J668m26j196J521m71n33O17O3p40
1777f32M83J15k7l26K85N69j265J202K3j212Q55M93j012O00L98j159Q91j10J23
1796B94l96K49O08j218Q13L00r96L98J051j655N64R84j605J073j05r4k52J14J20
1815B47m57M88L98q78K02R45j680O96R49j579N94M30n01j59N79l36m29N61K02
1834B72p86j30J369j736P75R82j472K97R21q97j73R69p25l31O36K68o60j39J292
$$ plain form
1853 732 -660 -235 652 -738 -545 551 -297 -469 838 -310 -278 114 455 -266 -119 583 -385 -190 770
1872 770 -52 -346 649 -32 -411 945 -77 -159 859 129 -113 302 773 -349 100 543 -11 -353 789
1891 789 36 -608 801 -198 -165 434 159 -94 93 57 -272 -99 295 -148 -599 360 -196 -665 451 -72
1911 -72 -530 106 137 -760 107 17 -533 -45 -120 -166 -678 236 -207 -622 149 121 -417 -110 275 -754 183 241
1933 241 -374 67 320 -15 -579 399 32 -369 241 207 -541 332 674 -422 442 472 -209 36 473 -39
1953 -39 -392 799 87 -283 372 291 -326 384 616 -520 454 217 -277 58 424 -85 -255 485 -183 -330
1973 -330 341 457 -490 316 588 -754 152 450 -390 -349 778 -487 -435 657 -373 -344 125 167 -567 -64
1993 -64 231 -707 269 174 -397 -221 296 -528 -265 560 -551 -66 290 -29 -710 354 240 -571 342 232
$$ packed form
1853G32j392M25Q87j390J93J096q48j72J307j148L2L92L41p21J47P02r68J95R60
1872G70q22k94R95o81l79J356j022q2J018p30k42M15M71j122M49M43n54l42J142
1891G89p53o44J409r99L3N99k75k53J87l6l29J73L94m43m51R59n56m69J116n23
1911g2m58O36L1q97Q67r0n50M88p5m6n12R14m43m15P71k8n38L07L85j029R37N8
1933B41o15M41K53l35n64R78l67m01O10l4p48Q73L42j096Q64L0o81K45M37n12
1953c9l53J191p12l70O55q1o17P10K32j136R74k37m94L35L66n09j70P40o68j47
1973c30O71J16r47Q06K72j342R06K98q40M1J127j265N2J092j030K9M69M2p34N03
1993f4K95r38R76r5n71J76N17q24K63Q25j111M85L56l19o81J064j14q11R13j10
$$ plain form
2013 232 -245 -309 714 -242 -46 514 -23 -73 362 258 -570 479 176 -251 447 526 149 23 630 -186
2033 -186 -77 563 55 -342 293 358 -509 435 161 -149 249 333 -205 -59 517 -181 -11 538 157 -491 159
2054 159 311 -563 337 16 -547 -144 266 -292 -267 350 -523 -281 114 21 -690 104 -25 -588 12 97 -315
2075 -315 -276 341 -623 -197 466 -590 -119 143 -93 -361 343 3 -438 130 291 -421 40 659 -384 -29
2095 -29 447 -307 -52 592 -9 -402 537 155 -119 261 231 -154 -101 735 -259 17 757 -347 -103 590 -187
2116 -187 -368 649 -8 -376 23 195 -326 51 532 -373 -129 520 -198 -378 654 -123 -663 598 -131
2135 -131 -393 238 12 -307 -100 370 -472 -169 144 -171 -468 465 -376 -755 506 -358 -372 -92 -162 -456
2155 -456 -14 361 -239 -48 113 -78 -516 408 -42 -445 599 -112 -125 356 -131 -190 186 355 -207 14
$$ packed form
2013B32m77o4J023r56J96N60n37n0M35j04q28J049l03m27O98P9l77j26O07q16
2033a86J09O40n08l97O35O5q67R44k74l10L98Q4n38J46N76o98J70N49l81o48O50
2054A59J52q74R00l21n63M03M10n58K5O17q73K42L95r3p11P94j29n63O00Q5m12
2075c15L9O17r64M26O63j056M71K62k36k68P04l40m41N68J61p12M61O19j043L55
2095b9M76p54K55O44o01l93R39l82k74L80l0l85N3Q36r94K76P40j104K44O93p77
2116a87j81J017o57l68L99J72n21L77M81r05K44O49p18j80J032p77n40J261p29
2135a31k62O31k26l19K07M70q42L03L13l15k97R33q41l79J261q64j4K80p0k94
2155d56M42L75o00J91J61j91m38R24m50m03J044p11j3M81m87n9L76J69n62K21
$$ plain form
2175 14 265 270 -258 647 65 -193 579 350 -404 326 555 -476 543 107 -217 45 409 31 -307 534
2195 534 256 -262 254 272 -546 238 416 -843 235 328 -367 -245 125 -208 -276 399 -20 -336 50 96 -540
2216 -540 6 324 -754 87 293 -407 -141 130 -304 -203 342 -273 -401 100 182 -571 11 456 -680 155
2236 155 244 -501 -69 675 -311 158 267 -230 -62 -8 462 -167 257 655 -432 133 490 -394 94 776
2256 776 -269 -50 678 -67 -27 134 252 -342 173 375 -558 -58 589 -140 -137 579 -365 -39 629 -226 187
2277 187 60 33 -371 254 235 -211 -30 336 -259 -462 543 -453 -357 482 -102 -184 259 -123 -332 82 -19
2298 -19 -282 -210 220 -146 -355 681 -244 -240 302 -327 -255 301 -95 -531 51 26 41 -269 208 15 -391 476
2320 476 -127 -302 514 62 -294 631 100 -132 562 8 -115 133 335 -50 41 394 40 -281 428 307
$$ packed form
2175A4K51Nn28R05n82k58P72k29p54P30K29j031J019m36l24K62L64l78l38Q41
2195E34k78n18N16J8q18P84J78j259J078R3o95J22L70l33o8O75m19l16L86M6o36
2216e40N46L18j078Q41K06p00K66K71m34J01N45o15j28N01Q2p53N82M45j136Q35
2236A55Q9p45M32P44r86M69J09m97J68N4M70o29M24L98j087N65L57q84M88O82
2256G76j045K19P28p45M0J61J18n94N15K02r33N00O47p29LP16r44L26O68q55M13
2277A87j27k7m04O25j9m46J81L66n95k03J005r96R6Q39n84q2M43l82k09M14j01
2298a9k63P2M30l66k09J036r25MN42o29P2N56l96m36N82k5J5l10M77j93m06Q67
2320D76o03j75Q16m52l56R25n31k32O94n54j23K48K02l85R1L53l54l21P09j21
$$ plain form
2340 307 -670 597 237 -623 493 -11 -126 222 510 -262 -43 189 23 -258 284 121 -529 611 97
2359 97 -475 315 157 -465 118 284 -532 38 135 -194 -200 178 140 -546 213 78 -582 59 212 -543 -4 306
2381 306 -510 14 -154 -83 -70 204 -122 -379 67 210 -376 74 291 -536 -53 523 -388 161 368 -197 16
2402 16 262 88 -119 296 155 -71 102 522 -145 162 717 -196 134 349 -54 48 235 104 -73 262
2422 262 69 -341 194 295 -285 29 288 -335 -180 275 -241 -451 216 -153 -330 149 -103 -251 -33 145
2442 145 -353 -228 17 -483 -193 350 -207 -425 439 -296 -402 342 40 -293 126 275 -581 -213 348 -374
2462 -374 -205 342 -14 -295 455 47 -294 278 69 -346 128 207 -295 312 397 105 103 473 -188 -283 756
2483 756 -178 -250 390 186 -190 258 446 -283 260 514 -73 -155 416 48 -361 653 -12 -69 332 280 -456
$$ packed form
2340C07r77J267l60q60J116n04j15L48K88p72K19K32j66k81N42j63o50J140n14
2359I7n72P90j58o22N83J66q16N70R7l29oL78l8o86P59j35o60O41J53p55N39L10
2381C06q16N24j68P1J3K74l26k57M46J43n86M50K17q27M83N76r11N49K07n65K13
2402A6K46j74k07M15j41k26J73M20o67L07N55r13L30K15m03J02J87j31j77L35
2422B62j93m10N35J01n80L14K59o23J55M55n16k10O67l69j77M79k52j48K18J78
2442A45m98J25K45n00K90N43n57k18Q64p35j06P44l02l33M19J49q56L68N61p22
2462c74J69N47l56k81P50m08l41N72k09m15M74P9n02O07Q5k92kL70o61r5J039
2483G56r34p2O40k04l76M48J88p29N43K54n87q2N71l68m09J014o65n7M01n2p36
$$ plain form
2504 -456 82 233 -421 68 196 -162 -150 296 -171 -298 297 -222 -418 167 126 -542 297 -58 -388 92 255
2525 255 -322 -152 378 -146 -62 256 -80 -172 351 104 -287 205 190 -515 53 278 -31 -258 535 -205 9
2546 9 390 16 -169 49 324 -156 462 192 -33 156 551 -52 -22 530 -71 -170 356 139 -99 391 141
2567 141 -226 187 264 -149 17 374 -15 -151 315 -102 -179 413 180 -292 292 80 -373 152 68 -353 -85
2588 -85 314 -144 -230 269 -104 -199 69 -139 -366 279 -83 -538 91 -51 -532 -223 372 -227 -177 186 -97
2609 -97 -361 234 79 -445 163 88 -361 327 155 -81 40 324 -168 -45 406 36 -161 277 39 -172 496
2630 496 182 -271 384 162 -397 247 344 -307 56 487 -79 -143 379 39 -287 336 145 -285 239 359 -369
2651 -369 281 468 -99 165 41 -56 -214 13 -167 -335 100 -24 -315 189 428 -570 91 218 -465 -151
$$ packed form
2504d56N38J51o54M89J28l58J2M46m67j27N95n19j96N85m1o68Q39l55l30M80J63
2525B55n77J70N30n24Q4L18l36r2N23k47l91M92j5p05N68K25l09k27P93p40K14
2546IL81l74j85K18K75m80O18k70k25J89L95o03L0N52o01r9N26k17k38M90k50
2567A41l67M13P7m13J66L57l89j36M66m17p7N92k33m72N84k12m53N25q4m21K68
2588h5L99m58q6M99l73r5K68k08k27O45l62m55O29j42m81L09N95n99N0L63k83
2609i7k64N95j55n24O08p5m49O88j72k36J21K84m92J23M51l70j97M38k38k11O68
2630D96l14m53O55k22n59O44R7o51L63M31n66o4N22l40l26O23j91m30N24J20p28
2651c69O50J87n67K64j24r7j58K27j80j68M35j24k91N04K39r98O61J27o83L14
$$ plain form
2671 -151 196 -110 -177 183 -72 -312 26 88 -245 -95 171 -475 -170 322 -449 65 150 -51 -93 192 -186
2692 -186 -108 324 107 -185 51 293 -290 140 430 -367 142 360 3 -159 525 -160 -77 231 387 -223 70
2713 70 213 -146 -41 571 -9 -208 506 -188 -164 482 -142 111 215 207 -253 6 272 -342 163 226 -123 -293
2735 -293 455 -91 -427 532 -425 -296 380 -2 -403 179 95 -516 85 -10 -165 -231 398 -244 -366 500 -155
2756 -155 -161 298 -9 -364 446 -182 -245 -39 228 -167 -392 362 -173 -201 284 277 -92 291 159 -382 250 22
2778 22 -204 138 324 -63 -130 359 61 -198 364 178 -323 368 292 -493 383 108 -302 252 274 -81 -146 146
2800 146 -95 -204 92 204 -275 218 324 -479 299 80 -368 105 192 -51 33 159 -228 -130 63 88 -292
2821 -292 -44 224 -432 64 109 -450 83 48 -542 -29 201 -291 -160 9 110 -351 -167 298 -502 68 234
$$ packed form
2671a51L47l06o7L60k55k40L38O2l33J50K66o46L05M92p71N14Q5k01m2K85l78
2692a86P8M32k17k92K36K42n83M30K90p97N09K18l57j62O84o85Q3L08J56o10K93
2713G0J43l59J05O12n80j99P14o94K4O46o24K53J04qm60K59K66o14N05O3l49j70
2735b93P48n46l36R59r57J29O76l82m01N82q4o11O01r5j55o6O29o42j22Q66o55
2756a55oM59l07l55Q10o28o3K06K67l95k25P54n35k8M85pl69L83j32n41O32k28
2778B2k26L42J86l87o7M89k98k59N62j86n01O91p6p85Q76k75m10N54K2l55o5K92
2800A46k41j09K96J12m79M93J06q03P78k19m48M73Q7k43Q4J26l87R8J93K5l80
2821b92K48K68o56M96M5n59N33l5n90N13K30m92J31J69J01m61J84M65q00N70J66
$$ plain form
2842 234 -326 -22 200 -335 4 325 -126 153 212 54 -48 351 284 -232 109 277 -130 -79 377 -298 -20
2863 -20 463 -200 23 61 -159 65 206 176 -148 32 124 -64 -123 584 -317 10 486 -324 -184 374 -322 -155
2885 -155 266 86 -243 -5 310 -225 -134 394 -459 -155 325 -325 -182 165 30 -296 166 -259 -286 -80 67
2906 67 -341 4 245 -171 -109 368 -240 -315 409 -182 -252 373 -112 -74 160 14 -131 -175 -29 -63 -129 381 41
2929 41 -496 385 -159 -155 338 145 67 64 180 -18 191 -8 -20 -215 269 176 -439 407 83 -186 148 248 -310
2952 -310 -9 177 -490 -59 315 -164 8 113 194 -305 316 124 -471 176 139 -320 22 264 -367 -15 232
2973 232 -268 -231 122 -33 -403 281 -44 -365 37 68 -482 79 74 -386 156 266 -108 -247 304 -234 -234 341
2995 341 39 -177 14 215 -258 107 202 -252 50 232 -107 139 412 -98 -51 383 218 -168 261 463 -261
$$ packed form
2842B34n60L04K22n35L39L21m51K79N9j58j02L99o7n16L41J68m07N1M56o75K78
2863b0M83o63K23L8k20K24J41l0l24J80R2j88n9P07r01L27M76q10J40N58o96J67
2885a55M21j80l29K38L15n35R1N28q53L04M80o50J43L47j35l26M62m25k7K06J47
2906F7m08L45K41m16O2M77o08p5P24n91p0O25m85L8K34j46j45m4J46l4o6N10l40
2929D1n37Q81n44MM93j93p8lJ16j98K09j99j2j95M84r3o15Q46l24k69L34J00n58
2952c10L01J86o67M31L74m79J72J05Q1m99O21j92n95O47l7m59L42K42o31L52K47
2973B32n00L7L53j55l70O84l25l21M02L1n50N61nm60N42J10l74j39N51n38%N75
2995C41l02k16J91K01m73L65R5m54L02J82l39K46K73n10M7M34j65l86M29K02p24
$$ plain form
3016 -261 89 269 -206 -34 292 -331 -92 515 -61 -178 310 100 130 122 80 -214 -28 79 -89 -95 199 -282
3038 -282 -236 405 -131 -180 122 -156 -216 53 99 -309 32 130 -397 1 240 -61 -309 198 -398 -112 299 124
3060 124 -334 159 88 -296 60 186 -151 -140 236 -181 -199 426 -25 230 75 -60 -61 169 177 -173 266 148
3082 148 -161 104 410 -60 -30 308 -110 -243 261 295 -148 127 200 -185 340 238 -191 40 414 -254 -148
3103 -148 292 -131 -187 261 -14 -398 58 99 -182 222 156 -77 116 150 -190 -186 454 -170 -7 297 62 -338
3125 -338 156 103 -166 36 182 -271 -123 176 -205 11 163 -58 -210 85 35 -358 237 26 -319 25 132
3146 132 -198 -72 193 -108 26 189 80 -1 270 -25 -354 383 116 -222 -78 342 -300 70 457 -252
3166 -252 60 222 20 -171 482 225 -210 215 135 -245 150 252 -61 -74 324 -8 35 284 -69 -220 276
$$ packed form
3016b61L50J80m75J72L26o23K39O07n76j17M88k10L0qm2k94J86J07j68oK94m81
3038b82M6O41n36m9L02k78o0K69M6m08L41R8n27L98K39l01k48N07n96K86M11j75
3060A24m58M93p1l84L56J26l37J1L76m17j8O25m51K55j55j35jK30Ql50M39j18
3082A48l09K65L06m70L0L38m18j33N04L4m43K75P3l85N25j02m29K31L74o68J06
3103a48M40m23n6M48k75l84M56M1k81M04o6k33J93L4l40MO40o24J63L04k35m00
3125c38M94n3k69K02J46m53J48K99l81K16J52k21j52K95n0l93N95k11l45L44J07
3146A32l30J26K65l01J34J63j09q1K71k95l29P37k67l38J44M20o42L70L87p09
3166b52L12J62k02j91O53k57m35M25q0l80L95J02l13j3L98l32M3K49l53j51M96
$$ plain form
3187 276 11 -370 389 -44 -55 -55 -8 -246 -156 48 -265 -367 166 43 -334 107 60 -363 76 -80 -291 53
3209 53 328 -256 -110 91 -204 -267 202 302 -320 332 -9 -326 220 26 -397 42 -22 -335 63 116 -213
3230 -213 -166 285 -99 -271 122 181 -210 97 417 -551 172 365 -187 205 257 29 -29 -48 -97 -236 55 295
3252 295 -156 189 357 -203 86 169 -537 194 103 -237 -166 207 -68 33 141 -58 -236 34 271 -128 23
3273 23 356 -347 -316 18 -480 37 266 -457 -229 44 -32 -75 124 160 -285 -45 135 -313 -94 375 -218 -221
3295 -221 192 -274 20 198 62 -141 138 102 -32 148 292 39 -102 322 28 -21 136 -67 -107 413 37
3316 37 -67 -8 159 -22 26 221 -6 -4 362 -27 -239 384 -195 -179 228 43 -216 133 173 -76 -6 183 -146
$$ packed form
3187B76k65l81P59m33j1%M7k38R0K04l13j02N33j23l77M41m7m23M39j56k11L44
3209E3K75n84J46K01k95o3M69J00o22O52l41l17N46j94m23M39o4l13L98N3l29
3230b13M7M51l84j72L93N9l91L07L20r68P23J93n52L92N2k28n8j9m9j39K91K40
3252B95m51L45J68n60K89Q3p06P31r1l40P1L73k75J01J08j99j78K70K37l99J51
3273B3L33p03L1L34m98N17K29p23K28K73p6m3J99L6m45K40J80m48K19M69n93l
3295b21M13m66K94J78j36k03K79l6j34J80J44k53j41M24k94m9J57k03m0N20l76
3316C7j04N9J67j81M8J95k27KL66l89k12O23n79J6M07j85k59L49M0k49P0J89l29
$$ [...]
8191h6
##END NTUPLES=NMR FID
##END=
