##TITLE=1H_Ser DAH-4
 CDCl3
 64 sc, 
 17.2.2023
##JCAMPDX= 6.0         $$ Bruker NMR JCAMP-DX V2.0
##DATA TYPE= NMR FID
##DATA CLASS= NTUPLES
##ORIGIN= UXNMR, Bruker Analytische Messtechnik GmbH
##OWNER= root
$$ XWIN-NMR		Version 3.5
$$ Fri Feb 17 14:27:13 2023 Russian Standard Time (UT+4h)  she@DPX200
##.OBSERVE FREQUENCY= 200.13135
##.OBSERVE NUCLEUS= ^1H
##.DELAY= (6, 6)
##.ACQUISITION MODE= SIMULTANEOUS
##.ACQUISITION SCHEME= undefined
##.AVERAGES= 64
##.DIGITISER RES= 18
##SPECTROMETER/DATA SYSTEM= spect
##.PULSE SEQUENCE= zg30
##.SOLVENT NAME= DMSO
##.SHIFT REFERENCE= (INTERNAL, DMSO, 0, 15.7039)
##AUDIT TRAIL= $$ (NUMBER, WHEN, WHO, WHERE, WHAT)
$$ ##TITLE= Audit trail, XWIN-NMR		Version 3.5
$$ ##JCAMPDX= 5.01
$$ ##ORIGIN= Bruker BioSpin GmbH
$$ ##OWNER= she
$$ F:/spectra/data/she/nmr/H-F/1/audita.txt
$$ ##AUDIT TRAIL=  $$ (NUMBER, WHEN, WHO, WHERE, WHAT)
(   1,<2023-02-17 14:26:13.10 +0400>,<she>,<DPX200>,
      <continue with go, POWCHK disabled, PULCHK disabled
       configuration hash MD5:
       00 E9 B6 7A A2 85 ED C7 34 08 36 98 17 FE 4E 26
       data hash MD5: 16K
       6E 1B 9B 7D 9D 81 3B 1A C0 9E 52 97 87 E8 4B C1>)
$$ ##END=
$$ 
$$ hash MD5
$$ 9B CA 07 D4 2F BF 5B 95 24 47 A9 37 6A 56 88 03
##$RELAX= 
##$RELAX= 
##$RELAX= 
##$RELAX= 
##$RELAX= 
##$RELAX= 
$$ Bruker specific parameters
$$ --------------------------
##$DU= <F:/spectra>
##$EXPNO= 1
##$NAME= <H-F>
##$PROCNO= 1
##$TYPE= <nmr>
##$USER= <she>
##$AMP= (0..31)
100 100 100 100 100 100 100 100 100 100 100 100 100 100 100 100 100 100 
100 100 100 100 100 100 100 100 100 100 100 100 100 100 
##$AQSEQ= 0
##$AQ_mod= 1
##$AUNM= <au_zg>
##$AUTOPOS= <>
##$BF1= 200.13
##$BF2= 200.13
##$BF3= 200.13
##$BF4= 200.13
##$BF5= 200.13
##$BF6= 200.13
##$BF7= 200.13
##$BF8= 200.13
##$BYTORDA= 1
##$CFDGTYP= 0
##$CFRGTYP= 5
##$CHEMSTR= <none>
##$CNST= (0..31)
1 1 145 1 1 1 1 1 1 1 1 1 1 1 1 1 1 1 1 1 1 1 1 1 1 1 1 1 1 1 1 1 
##$CPDPRG= <>
##$CPDPRG1= <>
##$CPDPRG2= <>
##$CPDPRG3= <>
##$CPDPRG4= <mlev>
##$CPDPRG5= <mlev>
##$CPDPRG6= <mlev>
##$CPDPRG7= <mlev>
##$CPDPRG8= <mlev>
##$CPDPRGB= <>
##$CPDPRGT= <>
##$D= (0..31)
0 1.2 0 0 0 0 0 0 0 0.06 0 0.03 0 0 0 0 0.0002 0 0 0 0 0 0 0 0 0 0 0 0 
0 0 0 
##$DATE= 1676629335
##$DBL= (0..7)
120 120 120 120 120 120 120 120 
##$DBP= (0..7)
150 150 150 150 150 150 150 150 
##$DBP07= 0
##$DBPNAM0= <>
##$DBPNAM1= <>
##$DBPNAM2= <>
##$DBPNAM3= <>
##$DBPNAM4= <>
##$DBPNAM5= <>
##$DBPNAM6= <>
##$DBPNAM7= <>
##$DBPOAL= (0..7)
0.5 0.5 0.5 0.5 0.5 0.5 0.5 0.5 
##$DBPOFFS= (0..7)
0 0 0 0 0 0 0 0 
##$DE= 6
##$DECBNUC= <off>
##$DECIM= 32
##$DECNUC= <off>
##$DECSTAT= 4
##$DIGMOD= 1
##$DIGTYP= 9
##$DL= (0..7)
0 120 120 120 120 120 120 120 
##$DP= (0..7)
150 150 150 150 150 150 150 150 
##$DP07= 0
##$DPNAME0= <>
##$DPNAME1= <>
##$DPNAME2= <>
##$DPNAME3= <>
##$DPNAME4= <>
##$DPNAME5= <>
##$DPNAME6= <>
##$DPNAME7= <>
##$DPOAL= (0..7)
0.5 0.5 0.5 0.5 0.5 0.5 0.5 0.5 
##$DPOFFS= (0..7)
0 0 0 0 0 0 0 0 
##$DQDMODE= 0
##$DR= 18
##$DS= 0
##$DSLIST= <SSSSSSSSSSSSSSS>
$$ [...]
##$SUBNAM2= <"">
##$SUBNAM3= <"">
##$SUBNAM4= <"">
##$SUBNAM5= <"">
##$SUBNAM6= <"">
##$SUBNAM7= <"">
##$SUBNAM8= <"">
##$SUBNAM9= <"">
##$SW= 18.05172834244
##$SWIBOX= (0..15)
0 0 2 0 0 0 0 0 0 0 0 0 0 0 0 0 
##$SW_h= 3612.71676300578
##$TD= 16384
##$TD0= 1
##$TE= 0
##$TE2= 300
##$TE3= 300
##$TEG= 300
##$TL= (0..7)
0 120 120 120 120 120 120 120 
##$TP= (0..7)
150 150 150 150 150 150 150 150 
##$TP07= 0
##$TPNAME0= <>
##$TPNAME1= <>
##$TPNAME2= <>
##$TPNAME3= <>
##$TPNAME4= <>
##$TPNAME5= <>
##$TPNAME6= <>
##$TPNAME7= <>
##$TPOAL= (0..7)
0.5 0.5 0.5 0.5 0.5 0.5 0.5 0.5 
##$TPOFFS= (0..7)
0 0 0 0 0 0 0 0 
##$TUNHIN= 0
##$TUNHOUT= 0
##$TUNXOUT= 0
##$USERA1= <user>
##$USERA2= <user>
##$USERA3= <user>
##$USERA4= <user>
##$USERA5= <user>
##$V9= 5
##$VALIST= <valist>
##$VCLIST= <CCCCCCCCCCCCCCC>
##$VD= 0
##$VDLIST= <DDDDDDDDDDDDDDD>
##$VPLIST= <PPPPPPPPPPPPPPP>
##$VTLIST= <TTTTTTTTTTTTTTT>
##$WBST= 1024
##$WBSW= 4
##$XGAIN= (0..3)
0 0 0 0 
##$XL= 0
##$YL= 0
##$YMAX_a= 268428
##$YMIN_a= -337212
##$ZGOPTNS= <>
##$ZL1= 120
##$ZL2= 120
##$ZL3= 120
##$ZL4= 120
##$ABSF1= 10
##$ABSF2= 0
##$ABSG= 5
##$ABSL= 3
##$ALPHA= 0
##$AQORDER= 0
##$ASSFAC= 0
##$ASSFACI= 0
##$ASSFACX= 0
##$ASSWID= 0
##$AUNMP= <proc_1d>
##$AZFE= 0.1
##$AZFW= 0.1
##$BCFW= 1
##$BC_mod= 2
##$BYTORDP= 1
##$COROFFS= 0
##$CY= 11.3945322036743
##$DATMOD= 1
##$DC= 2
##$DFILT= <>
##$DTYPP= 0
##$F1P= 2.36226072786647
##$F2P= -0.459571619588291
##$FCOR= 0.5
##$FTSIZE= 0
##$FT_mod= 4
##$GAMMA= 1
##$GB= 0.15
##$INTBC= 1
##$INTSCL= 1
##$ISEN= 128
##$LB= 0.24
##$LEV0= 0
##$LPBIN= 0
##$MAXI= 10000
##$MC2= 0
##$MEAN= 0
##$ME_mod= 0
##$MI= 1.114404
##$NCOEF= 0
##$NC_proc= 0
##$NLEV= 6
##$NOISF1= 3.799351
##$NOISF2= 2.8
##$NSP= 1
##$NTH_PI= 0
##$NZP= 0
##$OFFSET= 15.70392
##$PC= 1
##$PHC0= -19101.2
##$PHC1= 8.600782
##$PH_mod= 1
##$PKNL= yes
##$PPARMOD= 0
##$PSCAL= 0
##$PSIGN= 0
##$REVERSE= no
##$SF= 200.130013532006
##$SI= 16384
##$SIGF1= 3
##$SIGF2= 2
##$SINO= 400
##$SIOLD= 16384
##$SREGLST= <1H.CDCl3>
##$SSB= 0
##$STSI= 0
##$STSR= 0
##$SW_p= 3612.71676300578
##$SYMM= 0
##$S_DEV= 0
##$TDeff= 0
##$TDoff= 0
##$TI= <>
##$TILT= no
##$TM1= 0
##$TM2= 0
##$TOPLEV= 0
##$USERP1= <user>
##$USERP2= <user>
##$USERP3= <user>
##$USERP4= <user>
##$USERP5= <user>
##$WDW= 1
##$XDIM= 8192
##$YMAX_p= 0
##$YMIN_p= 0
$$ End of Bruker specific parameters
$$ ---------------------------------
##NTUPLES= NMR FID
##VAR_NAME=  TIME,          FID/REAL,        FID/IMAG
##SYMBOL=    X,             R,               I
##VAR_TYPE=  INDEPENDENT,   DEPENDENT,       DEPENDENT
##VAR_FORM=  AFFN,          ASDF,            ASDF
##VAR_DIM=   8192,          8192,            8192
##UNITS=     SECONDS,       ARBITRARY UNITS, ARBITRARY UNITS
##FACTOR=    0.0002768,     1,               1
##FIRST=     0,             0,               0
##LAST=      2.2672688,     0,               0
##MIN=       0,             -337212,         0
##MAX=       2.2672688,     268428,          0
$$ Real data points
##PAGE= N=1
##DATA TABLE= (X++(R..R)), XYDATA
$$ [...]
$$ plain form
2996 3917 1490 -4202 -1466 3017 1572 -3925 -1418 4404 1256 -4316 -1018 3943 781 -2682 -929
3011 -929 4262 1790 -3367 -1380 3503 960 -4113 -1679 3315 1125 -3709 -1308 4139 -55 -4012
3026 -4012 -1341 3618 683 -4213 -559 2905 74 -3855 -185 4208 231 -3592 -159 3976 163
3041 163 -3236 -475 3879 1345 -4188 -393 4026 -339 -3282 -284 2930 -619 -3740 -424 3735
3056 3735 -858 -3759 39 3179 -352 -3749 313 4167 -299 -3356 465 3690 450 -2698 307
3071 307 4078 -819 -3452 1021 2762 -21 -3441 509 3222 -599 -3458 1133 3285 -333 -3285
3086 -3285 363 2956 -603 -3519 -21 3234 -1155 -3602 145 3013 -824 -3032 847 3429 -1163
3101 -1163 -2208 579 3839 -851 -3426 1253 4004 -1485 -3247 1248 2814 -1370 -3699 1078 2547
$$ packed form
2996C917k427n692K736M483j445n497K507N822l148n572L298M961l162l463J753
3011i29N191k472n157J987M883k543n073K434M994k190m834K401N447m194l957
3026d012K671M959k935m896L654L464k831l929L670M393l977l823L433M135l813
3041A63l399K761M354k534n533L795M419m365k943K998L214l549l121L316M159
3056C735m593k901L798L140l531l397M062L854m466l057L821L225l240l148L005
3071C07L771m897k633M473J741k783l420L950K713l821k859M591K152l618k952
3086c285L648K593l559k916L498L255m389k447L747K868l837k208L879K582m592
3101a163j045K787L260m690k575M679K751n489j762M495J566m184k329M777J469
$$ plain form
3116 2547 -1318 -3589 716 3128 -1019 -3392 1252 2919 -1113 -3581 985 2771 -1913 -2633 2096
3131 2096 3200 -1684 -2594 1982 2773 -1374 -2870 2505 3747 -1387 -2736 1971 2474 -1759 -2476 1907
3147 1907 2540 -2242 -2347 2415 2710 -1639 -2424 2459 2799 -2191 -3243 2280 2884 -2061 -1824 2633 2498
3164 2498 -2155 -1526 2215 2693 -2088 -2062 2533 1799 -2871 -1736 2461 2183 -1918 -2344 1519 2167 -3150
3181 -3150 -2583 2262 1352 -2857 -2586 2698 2150 -3428 -1679 3200 1711 -2624 -1105 3083 2313 -2150
3197 -2150 -1990 3019 1924 -2376 -1859 2966 1896 -2436 -935 2763 1581 -2894 -1572 2833 849
3212 849 -3384 -688 3447 355 -2710 -1513 2600 1438 -2772 -1504 3344 1059 -3022 -869 3065
3227 3065 1502 -3300 -591 3361 599 -2846 -773 3161 975 -2819 -942 3471 1234 -3049 -885
$$ packed form
3116B547l865k271M305K412m147k373M644J667m032k468M566J786m684p20M729
3131B096J104m884r10M576P91m147j496N375J242n134j349M707N03m233p17M383
3147A907O33m782j05M762K95m349p85M883L40m990j052N523O04m945K37M457j35
3164B498m653O29L741M78m781K6M595p34m670J135M197k78m101m26L863O48n317
3181c150N67M845r10m209K71N284n48n578J749M879j489m335J519M188p70m463
3197b150J60N009j095m300N17M825j070m332J501L698j182m475J322M405j984
3212H49m233K696M135l092l065J197M113j162m210J268M848k285m081K153L934
3227C065j563m802K709L952k762l445K073L934k186l794J877M413k237m283K164
$$ plain form
3242 -885 3491 350 -3072 -765 2866 46 -3796 -1 2905 136 -3510 -270 2477 422 -3026
3257 -3026 158 2745 538 -2186 126 3450 628 -2838 -287 3452 66 -2678 60 3329 -685
3272 -685 -3285 476 2936 20 -2906 -457 2316 -495 -3096 144 2698 -361 -2386 476 3684
3287 3684 2 -3161 310 3884 -554 -2342 532 3136 -655 -2948 1199 3080 -452 -2711 1139
3302 1139 2768 -926 -3117 1382 2938 -799 -3379 1544 2879 -784 -3285 869 2021 -1691 -2474
3317 -2474 959 2100 -1519 -3058 836 2526 -732 -1993 1260 1946 -759 -2428 1037 3193 -863
3332 -863 -2145 1934 2551 -1007 -2688 1002 3229 -1383 -2140 1654 1613 -1475 -2541 1123 1808 -1524
3348 -1524 -1879 1932 1940 -1076 -2451 1502 2795 -2153 -2142 1488 2935 -2010 -2010 1629 2808 -1837 -2270
$$ packed form
3242h85M376l141l422K307L631k820l842L795K906k769l646L240K747k055l448
3257c026L184K587k207k724K312L324k822l466K551L739l386k744K738L269m014
3272f85k600L761K460k916k926K449K773k811k601L240K554l059k025K862L208
3287C684l682l163L471L574m438j788K874K604l791k293M147J881l532k259L850
3302A139J629l694k191M499J556l737k580M923J335l663k501M154J152l712p83
3317b474L433J141l619j539L894J690l258j261L253O86k705j669L465K156m056
3332h63j282M079O17l558j681L690K227m612p57L794m1l088j066L664O85l332
3348a524l55L811Ql016j375L953J293m948J1L630J447m945%L639J179m645m33
$$ plain form
3365 -2270 1894 1627 -1284 -1822 1424 2178 -2153 -1652 1762 1734 -1972 -1918 2165 1119 -990 -1835 1805
3382 1805 1946 -1893 -2094 1973 2107 -2292 -2486 1958 1878 -2154 -1443 2032 1408 -1813 -1322 2574 1531
3399 1531 -2218 -2226 1800 2447 -1719 -1703 1881 641 -2283 -746 1600 1398 -2223 -1377 2814 1331 -2709
3416 -2709 -1084 1756 1060 -2639 -1469 2040 1128 -2196 -1120 2319 1566 -1757 -800 3004 1080 -2148
3432 -2148 -61 2567 618 -2239 -680 2247 985 -2248 -248 2131 774 -1627 -1652 3098 1190
3447 1190 -2790 -567 2562 367 -2051 -130 2266 189 -2413 -179 2156 307 -1613 -401 2598
3462 2598 475 -2397 -588 2070 457 -2346 -359 1811 395 -2436 -236 2837 525 -2203 468
3477 468 2787 -525 -3070 369 2757 -66 -1669 670 2332 -640 -2112 278 2452 -830 -2441
$$ packed form
3365b270M164k67k911n38L246P54m331N01L414k8l706N4M083j046k109q45L640
3382A805J41l839k01M067J34m399j94M444q0m032P11L475o24l221M91L896j043
3399A531l749qM026O47m166J6L584j240k924J537K346k02l621Q46M191j483m040
3416b709J625K840o96l699J170L509r12l324J076L439p53l323R57L804j924l228
3432b148K087K628j949k857J559K927j262l233K000K379j357k401k5M750j908
3447A190l980K223L129k195k418J921K396k077k602K234K335j849j920J212K999
3462B598k123k872J809K658j613k803J987K170j416k831K200L073k312k728K671
3477D68K319l312k545L439K388k823j603K339J662k972j472K390K174l282j611
$$ plain form
3492 -2441 188 2166 93 -2210 550 2600 -424 -1721 -70 2529 -754 -2406 119 2315 -1101
3507 -1101 -2840 1051 2116 -773 -3400 530 1888 -861 -1991 973 2242 -1332 -2936 1400 2607
3522 2607 -682 -1721 1557 1539 -385 -3010 40 2134 -511 -2774 1223 1910 -1041 -1765 1170 2722
3538 2722 -1414 -1765 405 1304 -1162 -1921 843 1455 -1905 -2141 596 2243 -1758 -2459 683 2034
3554 2034 -1246 -1418 1857 1869 -1080 -2112 728 2749 -1923 -1977 1771 1825 -1528 -1959 1217 1030 -1920
3571 -1920 -1837 1893 2183 -2327 -1411 1865 1736 -1672 -1660 1163 1649 -1724 -1066 1828 1242 -1722 -1674 2016
3589 2016 1877 -1276 -1198 1442 1456 -1117 -1133 1541 1280 -2142 -1544 1170 1238 -1252 -1033 1577 838 -2148
3607 -2148 -1181 2106 1113 -1352 76 1960 628 -1720 -914 2794 832 -1462 -1038 2216 1005 -1774
$$ packed form
3492b441K629J978k073k303K760K050l024j297J651K599l283j652K525K196l416
3507a101j739L891J065k889k627L930J358k749j130K964J269l574j604M336J207
3522B607l289j039L278j8j924k625L050K094k645k263L997O87k951p24K935J552
3538B722m136l51K170Q99k466p59K764O12l360k36K737J647m001p01L142J351
3554B034l280j72L275J2k949j032K840K021m672n4L748N4l353m31L176j87k950
3571a920Q3L730K90m510R16L276j29l408J2K823M86l373O58K894n86k964M8L690
3589B016j39l153P8K640J4k573j6K674k61l422N98K714O8k490K19K610p39k986
3607b148R67L287r93k465J428J884j332k348Q06L708j962k294M24L254j211k779
$$ plain form
3623 -1774 -459 2304 613 -1705 -1074 2462 205 -2185 -638 1986 -162 -2306 -489 2539 962
3638 962 -1539 -414 1536 479 -1839 -300 2017 821 -2280 -568 1985 314 -1648 -243 2299
3653 2299 57 -2327 813 1420 355 -2822 20 1568 965 -2718 -937 2002 -320 -1943 -690
3668 -690 2503 -201 -2334 224 1518 -885 -1575 391 2296 -345 -2202 401 2364 577 -2449
3683 -2449 -263 2214 396 -1410 -130 2344 123 -1934 170 1897 -266 -2106 477 2515 -621
3698 -621 -1782 236 1994 -6 -1340 328 1682 -1024 -1966 -410 1546 -538 -1800 872 2110
3713 2110 34 -1959 198 2272 -586 -1282 908 2371 -1272 -1895 602 2020 -616 -1966 536
3728 536 2355 -537 -2075 1576 1755 -487 -1640 480 2160 -1371 -2048 1206 2021 -1270 -1450 1395
$$ packed form
3623a774J315K763j691k318O31L536k257k390J547K624k148k144J817L028j577
3638I62k501J125J950j057k318J539K317j196l101J712K553j671j962J405K542
3653B299k242k384L140O07j065l177K842J548o03l683J781K939k322j623J253
3668f90L193k704k133K558J294k403o90J966J905k641j857K603J963j787l026
3683b449K186K477j818j806J280K474k221k057K104J727k163j840K583K038l136
3698f21j161K018J758k000j334J668J354k706r42J556J956k084j262K672J238
3713B110k076j993K157K074k858o96K190J463l643o23K497J418k636j350K502
3728E36J819k892j538L651J79k242j153K120J680l531o77L254Q15l291j80K845
$$ plain form
3744 1395 2117 -541 -1426 692 2353 -655 -1557 1759 1536 -1666 -2115 832 1741 -1305 -2184 1263 1412
3761 1412 -1056 -1993 857 1943 -1795 -2120 1034 1922 -1861 -2064 1364 1622 -299 -1704 2268 901
3777 901 -1373 -570 1666 1516 -1771 -1501 1353 1154 -1492 -1693 1719 1016 -1443 -1727 1381 1238 -1540
3794 -1540 -1877 1449 1363 -1990 -1318 1724 1035 -1703 -694 1582 1147 -1596 -956 2266 1086 -2353 -982
3811 -982 1408 618 -1282 -1700 1306 1624 -1591 -984 1596 1192 -1309 -471 1700 536 -1429 -1175 1602
3828 1602 792 -2009 -1046 1963 312 -2040 -640 2120 605 -1543 -599 2402 604 -2074 -401 1848
3844 1848 871 -1788 -230 1849 1018 -1960 -470 2569 697 -1308 237 1363 -317 -1937 302
3859 302 1494 -280 -1461 -335 990 332 -2333 -800 2087 554 -2532 261 2423 94 -2070
$$ packed form
3744A395P22k658q85K118J661l008r02L316k23l202m49K947R09l046q79L447J49
3761A412k468r37K850J086l738l25L154Q88l783k03L428K58j921j405L972j367
3777I01k274Q03K236j50l287K70K854j99k646k01L412p03k459k84L108j43k778
3794a540l37L326q6l353O72L042o89k738J009K276m35k743O40L222j180l439J371
3811i82K390p90j900m18L006L18l215O07K580m04k501Q38K171j164j965K54K777
3828A602q10k801R63L009j651k352J400K760j515k148R44L001j798k678J673K249
3844A848r77k659J558K079q31k978J490L039j872k005J545J126j680j620K239
3859C02J192j774j181J126J325o58k665J533K887j533l086K793K162k329k164
$$ plain form
3874 -2070 -287 2213 261 -2254 561 2230 575 -1624 -139 2072 -512 -2023 353 1381 -586
3889 -586 -1543 114 1699 -436 -2041 -192 2758 262 -2116 285 1979 -513 -1671 162 2038
3904 2038 -82 -1751 680 2136 -396 -1921 768 1621 -371 -2314 1398 1532 -370 -2199 410
3919 410 1800 -248 -1727 99 1726 -566 -1611 -64 1428 -953 -1719 417 1139 -1698 -1491 654
3935 654 2493 -414 -1510 937 2046 -709 -1065 643 1601 -151 -1400 569 1537 -1009 -1257 474
3951 474 1307 -428 -1684 843 1503 -1107 -1176 807 1243 -1074 -1665 103 1311 -592 -2001 1090 1313
3968 1313 -557 -864 1201 2558 -1608 -2127 1149 1276 -819 -692 681 1379 -1297 -1550 2220 1074
3984 1074 -1297 -1758 1152 1451 -1014 -1200 1208 395 -1215 -1626 843 923 -710 -684 1638 776 -1779
$$ packed form
3874b070J783K500j952k515K815J669j655k199J485K211k584j511K376J028j967
3889e86r57J657J585k135j605J849K950k496k378K401J694k492j158J833J876
3904B038k120j669K431J456k532j525K689Q53j992j943L712J34j902j829K609
3919D10J390k048j479J826J627k292j045J547J492k381p66K136P22k837K07K145
3935F54J839k907j096K447J109k755l56J708R58j752j249J969R68k546k48J731
3951D74Q33j735j256K527O60k610o9J983M36k317n91J768J208j903j409L091K23
3968A313j870l07K065J357m166n19L276J27k095J27J373O98k676k53L770j146
3984A074k371m61K910K99k465j86K408q13j610m11K469Q0j633K6K322q62k555
$$ plain form
4001 -1779 -526 1470 1456 -1459 -622 852 338 -1290 -1328 1518 362 -927 -88 1992 357 -1445 -1294
4018 -1294 2161 1479 -1305 -649 1736 -16 -1177 -166 1820 1074 -1732 -1699 1151 995 -1526 -113
4034 -113 1694 749 -1128 -476 1130 1026 -1191 -117 1232 8 -1315 -1140 1828 79 -1623 -176
4050 -176 1547 498 -1413 -1035 1264 372 -1806 174 1297 -105 -1575 -257 1499 734 -1676 -258
4066 -258 1572 554 -1154 -454 2006 -212 -1078 -48 1020 490 -1910 -94 2027 0 -1384 -57
4082 -57 1991 822 -1952 318 1437 682 -2156 128 1393 -163 -1324 -240 1331 -337 -2035 -85
4098 -85 1174 -731 -1130 445 1560 -223 -1459 634 1282 -633 -1018 -411 1386 256 -1343 -158
4114 -158 1511 -909 -2090 -70 1919 -1098 -1445 848 2250 -760 -1599 463 1419 -726 -1814 476
$$ packed form
4001a779J253J996j4k915Q37J474n14j628l8K846j156j289Q39K080j635j802J51
4018a294L455o82k784O56K385j752j161J011J986p46k806L3K850j56k521J413
4034a13J807r45j877O52J606j04k217J074J349j224j323J75K968j749j702J447
4050a76J723j049j911L78K299q92k178J980J123j402j470J318J756p65k410J418
4066b58J830j018j708P00K460k218q66J030J068n30k400J816K121k027j384J327
4082e7K048j169k774K270J119p55k838K284J265j556j161J084J571j668j698J950
4098h5J259j905l99J575J115j783j236K093O48j915l85O07J797j130j599J185
4114a58J669k420j181K020J989l017l47K293J402l010q39K062R56k145j088K290
$$ plain form
4130 476 1891 -504 -1604 654 2304 -909 -1502 305 1008 -285 -1312 702 1105 -1453 -1342 696
4146 696 1010 -1486 -1298 320 1398 -1055 -1612 802 1949 -719 -1637 771 1064 -979 -1126 1078 1151
4163 1151 -516 -1466 825 1495 -777 -1725 435 1459 -1064 -770 894 1081 -1121 -180 1384 692 -1089
4180 -1089 -1417 1070 500 -651 -1232 739 1152 -759 -929 820 953 -1859 -1410 1977 1091 -1842 -748
4197 -748 1406 1257 -795 -1361 319 187 -1131 -759 1210 287 -1643 -1365 1158 793 -909 -1241 1196
4214 1196 796 -1439 -181 923 181 -1664 -697 607 820 -704 -815 728 521 -1674 -1194 1326 744
4231 744 -711 -1013 636 1501 -1067 -727 865 697 -1060 -712 1001 152 -1641 -157 1753 128 -674
4248 -674 -296 1768 613 -1395 -477 1130 1012 -1510 -557 1068 488 -1807 -552 735 394 -1727 -276
$$ packed form
4130D76J415k395j100K258J650l213n93J807P03j293j027K014M03k558J11K038
4146F96L14k496J88J618J078k453n57K414J147k668r18K408K93k043j47K204P3
4163A151j667r50K291O70k272r48K160J024k523K94J664J87k202R41J564o92j781
4180a089l28K487n70j151n81J971M13j911j70J749J33k812M49L387q86k933J094
4197g48K154j49k052n66J680j32j318L72J969r23j930K78K523l65j702l32K437
4214A196m00k235J258J104p42j845R67J304K13j524j11J543k07k195M80K520n82
4231G44j455l02J649Q65k568L40J592j68j757L48J713q49j793J484J910j625q02
4248f74L78K064j155k008R18J607j18k522R53J625n80k295J255J287l41k121J451
$$ plain form
4265 -276 1797 415 -1660 586 1596 569 -1349 -361 1895 -279 -988 -1016 1197 -51 -1544 -569
4281 -569 656 66 -1729 -292 1772 -315 -1188 183 1256 361 -1136 -245 827 340 -670 -95 1321
4298 1321 268 -1195 442 1741 543 -925 114 1304 266 -547 296 1256 -79 -1247 -116 1686
4314 1686 -22 -1409 1038 691 -634 -1666 537 1863 -326 -1765 789 182 -246 -1006 356 1260
4330 1260 -487 -1116 -26 825 155 -833 1832 1602 -406 -1062 99 1186 -145 -1276 -95 1477
4346 1477 -177 -184 294 1239 -109 -345 467 1079 -423 -1363 885 1267 -764 -1688 504 817 -888 -2019
4364 -2019 1197 1358 -1013 -322 717 1274 -1010 -1592 520 1107 -1755 -1124 818 935 -1296 -2042 1248
4381 1248 839 -950 -778 305 859 -779 -1138 1294 529 -618 -867 1320 759 -1113 -1326 498 332
$$ packed form
4265b76K073j382k075K246J010j027j918R88K256k174p09k8K213j248j493R75
4281e69J225n90j795J437K064k087q73J371J073q95j497Q91J072m87j010N75J416
4298A321j053j463J637J299j198j468J039J190j038q13Q43R60j335j168J131J802
4314A686j708j387K447l47j325j032K203J326k189j439K554o07m28p60J362R04
4330A260j747o29J090Q51o70r88K665k30k008o56J161J087j331j131J181J572
4346A477j654pM78R45j348k36Q12O12j502r40K248L82k031r24K192L13j705j131
4364b019L216J61k371O91J039N57k284n82K112N87k862O31J942J17k231p46L290
4381A248m09j789J72J083N54j638l59K432p65j147k49K187n61j872k13J824j66
$$ plain form
4398 332 -1552 -897 735 502 -161 -402 526 652 -958 -632 1117 -262 -110 203 861 847 -1351 -439
4416 -439 569 920 -995 -359 911 111 -495 -333 911 370 176 -14 1517 791 -578 -628 701 344
4434 344 -1016 -100 973 -375 -1017 -303 1076 102 -1092 6 919 435 -1349 -412 900 964 -1312
4451 -1312 -280 1195 -103 -869 -627 1186 722 -1285 -607 1036 209 -1545 -908 1363 -58 -1325
4467 -1325 -693 1506 250 -1278 -799 832 -120 -352 711 1586 -118 -954 -117 803 114 -693 -523 877
4485 877 -595 -1616 235 1086 -15 -1084 574 645 -185 -746 -133 1203 132 -1176 530 874 -25
4502 -25 -711 -161 1228 -300 -1289 49 1054 5 -1104 -64 1408 -682 -614 395 1364 61 167
4519 167 88 1242 -828 -556 873 784 -547 -517 860 1060 -600 -1041 561 1231 -715 -1414 193 1623
$$ packed form
4398C32j884O55J632k33o63k41R28J26j610L26J749j379J52L13O58j4k198R12
4416d39J008L51j915O36J270q00o06J62J244n41j94j90J531p26j369n0J329l57
4434C44j360R16J073j348o42P14J379r74j194J098R13m84j784R37J312O4k276
4451a312J032J475j298p66K42J813m64k007O78J643q27j754O37K271j421j267
4467a325O32K199j256j528M79J631r52k32J063Q75j704q36Q37R20o89q07J70J400
4485H77j472j021J851Q51j101j069J658P1q30n61O13J336j071j308J706L44q99
4502b5o86N50J389j528r89J338J005j049j109J040J472k090O8J009R69j303J06
4519A67p9J154k070K72J429q9j331L0J377K00j660m41J602O70j946o99J607J430
$$ plain form
4537 1623 183 -826 258 377 -423 -135 536 765 -182 -1192 1103 237 -508 -249 835 1538 -1036
4554 -1036 -1154 643 594 -1027 -1417 343 933 -348 -970 1075 1152 -799 -559 688 1109 -897 -844 986
4572 986 1246 -587 -556 714 262 -1034 -336 1102 532 -735 -268 1299 1148 -484 -941 1072 508 -1095
4590 -1095 25 -149 375 -771 -188 1023 614 -269 -453 712 464 -646 -877 896 756 -841 -917 -341
4608 -341 479 -1182 -668 1164 474 -843 -347 603 343 -202 -134 828 -277 203 -815 349 260 -222 -20
4627 -20 237 843 -1255 43 948 449 -626 -156 1083 807 -632 -69 1136 -199 -566 -428 256 -210
4645 -210 -504 -542 1161 -372 -201 -95 873 -525 -1374 441 869 -277 -935 -161 731 -271 -1529 187
4663 187 1036 162 -579 234 676 162 -399 -94 356 93 -1204 40 1116 267 -1289 518 468 -423 -1368
$$ packed form
4537A623j440j009J084J19q00K88O71K29r47j010K295q66p45K59J084P03k574
4554a036j18J797m9j621l90J760N90j281o22K045P7j951K40J247M21k006N3J830
4572I86K60j833L1J270m52j296O98J438n70j267M67J567j51j632m57K013n64j603
4590a095J120j74N24j146N83J211m09q83j84J165k48j110k31J773j40j597p6N76
4608c41Q20j661N14J832o90j317M96R50k60n45O8R62j105M80j018J164q9m82K02
4627b0K57O06k098J298R05m99j075M70J239k76j439N63J205j335l67J38O84m66
4645b10k94l8J703j533J71J06R68j398q49J815M28j146o58P74Q92j002j258J716
4663A87Q49q74p41Q13M42n14n61L05M50k63j297J244J076q49j556J807n0q91r45
$$ plain form
4682 -1368 290 1250 -802 -695 -152 1020 227 -866 268 668 -565 -1400 623 1168 98 -1811 -258
4699 -258 1387 -288 -540 623 755 -898 -535 434 548 -481 -504 303 719 -322 -953 524 776 -161
4717 -161 -506 3 520 -510 -440 616 905 -1510 -607 515 734 -781 -1046 -822 1107 -335 -1484 209
4735 209 1027 -221 -935 1024 662 -218 -1215 625 283 -164 -455 632 488 175 -664 566 1069 -1139
4753 -1139 -330 646 276 -772 -448 350 515 -502 -942 699 435 -111 -1323 388 627 -485 -481 612
4771 612 376 -268 -647 1134 828 -1103 -899 812 821 -365 -196 1179 939 -695 -109 1025 493 -948
4789 -948 -96 648 -153 -382 -323 1169 644 -359 -410 1091 -82 -1066 16 631 126 -1117 -1507 1597
4807 1597 337 -511 498 695 198 -691 -354 826 -181 -974 -798 1011 11 -1118 -205 839 740
$$ packed form
4682a368J658R60k052J07N43J172p93j093J134M00j233q35K023N45j070j909J553
4699b58J645j675k52J163J32j653L63R69J14j029k3Q07M16j041o31J477K52r37
4717a61l45N09N17j030P0J056K89k415R03J122K19j515k65K24J929j442j149J693
4735B09Q18j248p14J959l62q80r97J840l42m47k91J087j44l13q39J230N03k208
4753a139Q09R76l70j048L24P98J65j017m40J641k64n46j212J711K39j112MJ093
4771F12k36o44l79J781l06j931K04J711Rj186J69J375k40j634N86J134n32j441
4789i48Q52P44q01k29N9J492n25j003n1J501j173r84J082O15n05j243l90L104
4807A597j260q48J009J97m97q89L37J180j007p93J76J809j000j129R13J044r9
$$ plain form
4824 740 -1331 80 609 -465 -1496 -607 617 192 -676 -7 673 300 -1251 -100 -87 -736 -1083 -691
4842 -691 556 -580 -423 -378 679 -720 -653 -144 820 -689 -913 121 368 -90 -1185 -410 811 -531
4860 -531 -564 -182 1204 -108 -384 200 347 10 -536 197 1247 -260 -941 26 1202 -306 -1080 -420
4878 -420 646 -673 -1047 241 754 -239 -894 693 572 -165 -295 361 443 -313 -1057 -82 1161 -746
4896 -746 -1062 -92 752 -744 -985 1099 -66 -184 -401 395 777 -775 -479 745 1214 -721 -1006 1057
4914 1057 532 -279 -1243 47 995 -207 -466 639 71 -814 -1856 -421 258 -745 -1132 510 688
4931 688 -373 -222 158 1488 -757 -805 770 289 -249 277 141 1662 -1064 -344 854 682 -508 -331
4949 -331 73 414 -211 -841 727 462 -545 -1201 1378 305 -934 -119 1424 9 -612 -468 639
$$ packed form
4824G40k071J411N29j074j031Q89J224m25q68O69O80l73j551J151J3o49l47L92
4842f91J247j136J57M5J057j399O7N09R64j509k24J034K47m58j095P75J221j342
4860e31l3L82J386j312k76N84J47l37n46P33J050j507o81R67J176j508p74O60
4878d20J066j319l74J288N13r93o55J587j21p37j30O56Q2p56p44R75J243j907
4896g46l16R70Q44j496k41K084j165j18k17P96L82j552K96J224M69j935k85K063
4914A057n25q11r64J290R48j202k59J105n68q85j042J435O79j003l87J642J78
4931F88j061J51L80J330k245m8J575m81n38N26j36J521k726P20J198j72j190J77
4949c31M04L41o25o30J568k65j007o56K579j073j239Q15J543j415o21J44J107
$$ plain form
4966 639 340 -504 -303 1047 1056 -712 -1122 852 456 -617 -737 741 646 -1079 -108 515 685 -1020 -32
4985 -32 524 -59 -1712 -243 1029 849 -775 468 832 607 -940 16 1030 -108 -536 -448 979 915
5003 915 -209 -269 1204 -1 -1320 -177 608 584 -132 518 1414 -257 -706 -492 -112 419 -1124 -410
5021 -410 1545 -28 -959 374 769 -292 -640 -843 739 230 -1016 -629 326 -455 -962 297 373 636
5039 636 -928 -655 817 -57 -626 452 1177 -110 -1093 393 583 -373 -879 669 862 -11 -683 257
5057 257 1107 -578 -930 416 250 -76 -260 651 1473 -546 -1301 745 1206 -796 -823 21 333 -227 -307
5076 -307 569 594 -874 -849 528 1269 -438 -1583 470 1283 -34 -918 142 717 -797 -1106 -35 811
5094 811 -550 -1095 722 566 -945 -348 584 489 -593 -824 159 840 -124 -744 352 811 -234 -602
$$ packed form
4966F39k99q44K01J350Rj768m10J974l96j073j20J478r5j725R71O23J70j705R88
4985c2N56n83j653J469J272j80j624J243L64k25j547R56J014j138m28Q8J427o4
5003I15j124o0J473j205j319J143P85k4p16O50Q96j671m49K14L80N31j543P14
5021d10J955j573r31J333L95j061l48k03J582n09j246L87R55p81n07J259P6K63
5039F36j564K73J472q74n69J078P25j287r83J486J90r56n06J548J93q73o72R40
5057B57Q50j685l52J346j66l26j84R11Q22k019p55K046M61k002k7Q44L12n60q0
5076c07Q76K5j468K5J377P41j707j145K053Q13j317q84J060N75j514l09J071Q46
5094H11j361n45J817j56j511N97R32r5j082k31R83O81r64o20J096M59j045l68
$$ plain form
5112 -602 588 1188 -56 -675 48 836 -75 -396 809 918 -634 -116 546 914 -1088 -913 152 262
5130 262 -453 -80 754 -44 -520 -674 487 705 455 -623 616 630 -345 342 -48 742 -860 -405 1000
5149 1000 762 -524 -310 710 328 -483 -711 877 345 -494 83 591 614 -301 -450 1099 395 -764
5167 -764 -321 984 208 -649 -374 1094 -431 -725 -497 593 885 -1196 -105 946 -9 -495 -207 611
5185 611 400 -1290 326 -81 114 -1019 -33 493 324 -1302 79 1010 67 -623 215 1081 -340 -1170
5203 -1170 -453 733 339 -953 636 831 -105 -582 -187 620 -181 -1109 176 1217 -226 -762 -313 878
5221 878 -258 -621 -530 506 76 -631 -49 -27 622 -1542 447 994 -452 -1752 509 587 692 -1081
5239 -1081 640 959 -288 -596 -594 404 298 -1432 502 823 -589 -1107 245 597 -255 -874 209 517
$$ packed form
5112f02J190O00j244o19P23P88r11l21J205J09j552N18O62L68k002J75J065J10
5130B62p15L73Q34p98m76j54J161K18k50j078J239J4r75O87l90P90j602M55J405
5149A000k38j286K14J020l82q11k28J588n32q39N77N08K3r15j49J549p04j159
5167g64M43J305p76q57K75J468j525k94K28J090K92k081J091J051r55m86K88Q18
5185F11k11j690J616m07J95j133R86N26j69j626J381R31r43o90Q38Q66j421q30
5203a170P17J186l94j292J589J95r36m77L95Q07q01r28J285J041j443n36M49J191
5221H78j136l63R1J036m30p07N82K2O49k164J989N47j446j300K261P8J05j773
5239a081J721L19j247l08KR98j06j730J934L21j412n18J352L52q52o19J083L08
$$ plain form
5257 517 196 -645 405 404 -545 -1190 103 672 -558 -590 -238 380 -516 -540 322 862 -958 -369 535 997
5277 997 -530 -1076 135 1349 -16 -266 247 1624 -197 -958 789 1011 -857 -929 535 675 -648
5294 -648 -669 292 683 205 -192 370 788 -172 -1014 722 1283 81 -856 609 -95 -554 -1477 609 -142
5313 -142 -445 -343 151 823 -1403 -349 -43 1137 -1164 -719 647 863 -979 -359 102 824 -478 -1209
5331 -1209 655 757 -709 -114 792 117 -487 -555 570 653 -768 -90 217 292 -532 -1011 565 234 -1138
5350 -1138 -1236 341 194 -788 -770 652 -227 -1067 -4 734 569 -469 -942 900 640 -1247 86 759
5368 759 767 -801 -136 268 -30 -1691 -340 970 -457 -786 -600 1067 194 -890 -132 1002 33 -1037
5386 -1037 -771 1088 691 -1022 -191 854 154 -654 165 794 81 -550 -114 990 -545 -475 -589 849
$$ packed form
5257E17l21q41J050jr49o45J293N69j230l2L52O18q96k4Q62N40j820N89R04M62
5277I97j527n46J211J214j365k50N13J377j821p61J747K22j868p2J464J40j323
5294f48k1R61L91m78l97N62M18r60q42J736N61j202r37J465p04m59r23K086p51
5313a42l03J02M94O72k226J054L06J180k301M45J366K16j842O20M61P22j302p31
5331a209J864J02j466N95R06o75o04o8J125Q3j421O78L07P5q24m79J576l31j372
5350a138r8J577j47r82J8J422q79q40J063P38j65j038m73J842k60j887J333O73
5368G59Qj568O65M04k98j661J351J310j427l29J86J667q73j084P58J134r69j070
5386a037K66J859l97j713Q31J045p00q08Q19O29p13o31M36J104j535P0j14J438
$$ plain form
5404 849 639 -644 -42 1156 423 -834 130 1072 -193 -251 -556 1075 212 -979 -71 1412 -584 -807
5422 -807 -226 713 -247 -953 495 1144 -530 -522 -80 831 653 -1099 -109 140 -113 -905 622 597 -280 -945
5442 -945 -263 714 87 -901 33 888 -114 -664 235 464 -144 -532 276 -193 -679 -1060 184 1244 -705
5461 -705 -1136 887 541 -89 -517 54 1133 -145 -633 524 281 -223 -1497 781 388 -1325 -1416 437
5479 437 491 -628 -235 484 600 -546 -115 256 591 -500 -1065 374 1053 -380 -641 246 197 -631 617
5498 617 -169 604 -401 -1374 431 583 -225 -1236 126 499 -940 -790 414 397 -904 -1511 295 380
5516 380 -361 -1008 368 377 -424 -876 735 972 153 -523 920 979 316 -305 876 1000 104 -609 375 1109
5536 1109 -119 -911 915 682 -899 -463 -347 502 -817 -923 435 215 -256 -708 201 875 -1005 -181
$$ packed form
5404H49k10j283O02J198p33j257R64R42j265n8l05J631q63j191R08J483j996k23
5422h07N81R39r60p06J448O49j674QM42R11j78j752R90K49k53p92J527k5q77o65
5442i45O82R77o27r88R34Q55j002n50Q99K29o08l88Q08m69m86l81J244J060j949
5461g05m31K023l46o30m28N71J079j278m88J157k43n04j274K278l93j713r1J853
5479D37N4j119L93P19J16j146M31L71L35j091n65J439O79j433k61Q87m9q28J248
5498F17p86P73j005r73J805J52q08j011J362L73j439J50J204j7j301o07J806Q5
5516C80p41o47J376Rq01m52J611K37q19o76J443N9o63o21J181J24q96p13R84P34
5536A109j228p92J826k33j581M36J16Q49j319j06J358k20m71m52R09O74j880Q24
$$ plain form
5554 -181 737 355 -407 -230 934 637 -797 -435 1151 561 -1370 -336 669 101 -783 154 223 444
5572 444 -666 -970 292 -93 -768 -641 496 -396 -577 -284 645 204 -962 -227 167 900 -992 211
5590 211 937 -610 -978 -398 1046 398 -925 -728 927 371 -827 -7 1288 -10 -929 -725 668
5607 668 -80 -1222 -248 1483 -6 -1342 -347 926 -48 -645 -590 845 -49 -262 388 683 8 -1081
5625 -1081 -284 363 163 -938 317 394 -211 -1023 874 488 -317 -1216 -529 308 -103 -918 342 685 -499
5644 -499 -879 -385 1195 -436 -994 532 309 171 -926 63 1156 -467 -899 509 565 142 -1236 424
5662 424 1406 -1063 -792 434 1024 -778 -1678 391 479 -1065 -1159 569 577 -378 -604 241 837 232 -583
5681 -583 569 933 336 -1385 264 769 -82 -751 458 813 -548 -794 193 135 -455 -1443 -186 202
$$ packed form
5554a81R18l82p62J77J164k97j434L62J586n90j931J034J005n68q84R37O9K21
5572D44j110l04J262l85o75J27J137q92j81K93R29m41j166P35L94P33j892J203
5590B11P26j547l68N80J444o48j323J97J655n56j198Q20J295j298r19K04J393
5607F68p48j142R74J731j489j336R95J273r74n97N5J435q94k13O50K95o75j089
5625a081P97O47k00j101J255P7o05q12J897l86q05q99O87Q37m11q15J260L43j184
5644d99l80M94J580j631n58J526k23j38j097R89J093j623m32J408N6m23j378J660
5662D24R82k469K71J226N90j802r00K069Q8j544r4J728Qr55k26Q45N96o05q15
5681e83J152L64n97j721J649N05q51o69J209L55j361k46R87n8n90r88J257L88
$$ plain form
5699 202 -983 -209 210 1039 -46 -111 915 674 -874 -654 -187 855 -868 -344 57 1052 -504 -819
5717 -819 717 493 -203 -807 500 1082 385 -454 778 -51 -689 -285 430 628 66 -882 847 412 -989
5736 -989 -939 681 1208 -823 -727 712 947 -1320 -406 385 1256 -182 107 409 156 -211 -570 209 645
5755 645 -822 -902 452 609 -396 -742 742 310 -1011 -977 443 580 -370 -432 693 147 -839 -164 980
5774 980 1041 -1549 -221 837 354 -736 -567 860 -93 -321 -581 711 182 -966 -446 1096 731 -261
5792 -261 -334 275 454 75 -145 1026 -238 -825 -252 703 289 -1105 -591 519 265 -866 -590 664
5810 664 19 -93 65 818 -265 -1380 -265 1298 250 -403 -126 780 -8 -694 -707 1018 50 -244
5828 -244 -220 285 159 -575 -353 574 11 -890 361 1020 -302 -925 -233 51 -169 -652 318 571 314 -1008
$$ packed form
5699B02j185P74M19Q29j085o5J026k41j548K20M67J042j723N24M01R95j556l15
5717h19J536k24o96o04J307N82o97q39J232q29o38M04P15J98n62r48J729m35j401
5736i89N0J620N27k031R6J439K35k267R14P91Q71j438K89L02k53l67l59P79M36
5755F45j467q0J354J57j005l46J484m32j321L4J420J37r50o2J125n46r86O75J144
5774I80O1k590J328J058m83j090J69J427r53k28k60J292n29j148N20J542l65r92
5792b61p3O09J79l79k20J171j264n87N73R55m14j394N14J110k54j131K76J254
5810F64o45j12J58P53j083j115J115J563j048o53K77R06p88o86j3J725r68k94
5828b44K4N05j26p34K22R27n63r01J251O59j322o23O92K84k20m83R70K53k57j322
$$ plain form
5848 -1008 1145 792 -714 -391 185 1084 -62 -1360 157 200 216 -1396 1019 1221 -807 -84 167 471
5866 471 230 -838 -71 1151 -742 -1347 363 683 86 -1052 387 1220 -700 -642 -349 914 -543
5883 -543 -1341 -15 369 511 -114 596 683 -409 -987 -29 798 585 -746 133 630 -648 -240 36 866
5902 866 60 -626 502 578 -987 -376 -180 799 -443 -699 528 676 -535 70 584 791 -387 -811
5920 -811 302 112 -367 -814 593 288 -352 -562 895 1145 -804 161 677 298 -726 -508 237 668
5938 668 -568 -714 727 106 353 -449 261 1110 -645 -921 660 130 -269 -535 505 80 -113 -189 789
5957 789 151 -412 -422 740 27 -1147 -415 117 1066 -443 376 594 685 -1035 -646 371 827 -545 -1048
5976 -1048 1541 318 -788 110 1155 67 -314 -780 390 633 -287 -513 998 523 -1088 467 765
$$ packed form
5848a008K153l53j506L23N76Q99j146j298J517M3J6j612K415K02k028P23K51L04
5866D71k41j068P67J222j893o05J710L20n97j138J439Q33j920N8K93J263j457
5883e43p98J326L84J42o25P10Q7j092n78R58Q27k13j331Q79M97j278M08K76Q30
5902H66q06o86J128P6j565O11J96R79j242k56J227J48j211O05N14K07j178m24
5920h11J113j90m79m47J407l05o40k10J457K50j949R65N16l79j024K18P45M31
5938F68j236j46J441o21K47q02P10Q49j755k76J581n30l99k66J040m25j93p6R78
5957G89o38n63j0J162p13j174P32N32R49j509Q19K18R1j720L89J017M56j372n03
5976a048K589j223j106Q98J045j088l81m66J170K43r20k26J511m75j611J555K98
$$ plain form
5993 765 249 -630 -41 553 845 -1226 -82 792 349 -541 -103 548 293 -483 -514 770 391 -449 -153
6012 -153 478 361 -784 -689 257 454 -1265 -544 528 -12 -322 -129 740 4 -906 178 784 159 -155
6031 -155 -835 822 -1442 -660 507 509 323 -1040 -548 1205 475 -549 123 1003 499 -927 240 1337
6049 1337 -261 159 148 519 -406 -1143 94 512 406 -1140 -518 719 -812 -535 -300 548 -168 -1246
6067 -1246 28 1179 208 -1524 972 432 253 -597 90 563 632 -1164 545 1172 493 -1175 -685 684
6085 684 -31 -845 -324 311 12 -406 710 850 -679 -1276 567 1362 -104 -661 455 361 178 -1288
6103 -1288 443 1146 3 -168 515 729 83 -915 -229 562 -97 -745 572 961 -780 -556 -196 47
6121 47 -183 -803 179 247 -319 -687 326 540 -248 -667 -226 442 -510 -844 216 596 -139 -596 1442 718
$$ packed form
5993G65n16q79N89N94K92k071J144Q74m43q90M38O51k55p76l1J284l79q40K96
6012a53O31j17j145R5R46J97j719P21J072n40l10J93Q69p36r10J084O06o25l14
6031a55o80J657k264P82J167Kj86j363M92J753p30j024O72Q80n04j426J167J097
6049A337j598M20j1L71r25p37J237M18j06j546O22J237j531K77K35Q48p16j078
6067a246J274J151r71j732K496n40j79q50O87M73O9j796J709O27o79j668M90J369
6085F84p15q14N21O35k99m18J116J40j529n97J843P95j466n57J116r4j83j466
6103a288J731P03j143j71O83K14o46r98O86P91o59o48J317L89j741K24L60K43
6121D7k30o20R82O8n66l68J013K14p88m19M41O68r52l34J060L80p35m57K038p24
$$ plain form
6141 718 42 -342 557 1000 -877 -330 501 486 -481 -48 468 -104 -357 -442 769 383 -1243 -723 -104 903
6161 903 -461 -1004 600 483 -289 -230 742 52 -665 530 1073 312 260 -202 1210 872 -279 286 1172
6180 1172 682 -1207 -347 -25 5 -586 -692 268 420 -1132 -1296 -355 1002 -317 -342 22 555 -829 -980
6199 -980 429 372 -985 -1010 845 774 -529 383 671 -17 -650 10 732 898 -521 -126 -204 67 -873 -627
6219 -627 779 211 -39 -347 848 -22 -397 -494 1188 114 -240 -571 688 -220 -1097 -584 970 465
6237 465 -527 -426 584 339 -505 -690 197 122 -1007 -172 306 83 -868 -334 1035 -184 -222 -633 210
6256 210 -615 -934 206 552 242 -1198 62 1146 271 -578 172 577 740 -361 123 903 480 -1115
6274 -1115 -281 792 84 -472 75 478 -198 -1308 -367 1032 -403 -1149 36 52 -85 -625 -67 -4 194
$$ packed form
6141G18o76l84Q99M43j877N47Q31j5r67M33N16n72k53q5J211l86j626N20O19J007
6161I03j364n43J604j17p72N9R72o90p17J195N43p61n2m62J412l38j151N65Q86
6180A172m90j889Q60L22L0n91j06R60J52j552j64R41J357j319k5L64N33j384j51
6199i80J409n7j357k5J855p1j303R12K88o88o33O60P22J66j419L95p8K71r40K46
6219f27J406n68k50l08J195q70l75r7J682j074l54l31J259r08q77N13J554n05
6237D65r92J01J010k45q44j85Q87p5j129Q35M78k23r51N34J369j219l8m11Q43
6256B10q25l19J140L46l10j440J260J084q75q49P50M05J63j101M84P80m23j595
6274a115Q34J073p08n56N47M03o76j110R41J399j435p46J185J6j37n40N58O3J98
$$ plain form
6293 194 -418 778 1044 501 -987 50 431 -522 713 571 678 -922 -400 -44 369 -165 -1288 580
6311 580 509 203 -802 158 200 -213 -809 190 859 -20 201 -264 736 -515 -354 23 359 28 -575 578
6331 578 610 -803 -763 949 1317 -156 -816 154 665 -450 256 238 540 -339 -758 521 581 -420 -740
6350 -740 134 414 557 -360 -123 762 401 -980 -73 85 -590 -689 1054 880 -318 -96 367 545 -113
6369 -113 -852 707 840 -943 -365 923 217 -1188 -544 589 57 -473 -252 -575 479 -575 -208 312
6387 312 1170 -80 -975 227 103 -172 -581 324 826 -303 -197 -27 674 -314 -722 590 484 -928
6405 -928 -990 373 621 -118 -144 243 353 -542 -184 297 896 -601 -47 376 372 -695 80 -8 736 -189 495
6426 495 964 701 -95 -460 638 91 -311 -190 922 -62 -737 -88 829 13 -101 -1098 371 194 -1218
$$ packed form
6293A94o12J196K66n43j488J037L81r53J235j42J07j600N22L56M13n34j123J868
6311E80p1l06j005R60M2m13n96R99O69q79K21m65J000j251J61L77L36l31o03J153
6331E78L2j413M0J712L68j473o60R70N11j115P06j8L02q79m19J279O0j001l20
6350g40Q74K80J43r17K37Q85l61j381R07J58o75r9J743j74j198K22M63J78o58
6369a13p39J559J33j783N78J288p06j405O44J133n32n30K21l23J054j054L67N20
6387C12Q58j250q95J202j24k75m09R05N02j129J06J70P01r88m08J312j06j412
6405i28o2J363K48p39k6L87J10q95L58M81N99j497N54M23mj067P75q8P44r25O84
6426D95M69k63p96l65J098n47m02J21J112r84o75O49R17q16j14r97J469j77j412
$$ plain form
6445 -1218 -247 1018 767 -382 10 -174 284 -308 270 534 67 -641 -187 1103 979 -437 -893 360
6463 360 -799 -894 184 665 -521 182 416 1540 354 -1221 -721 291 525 -478 -19 912 388 -1375
6481 -1375 6 639 263 -527 -553 694 236 -741 -125 526 342 -21 -184 171 51 -821 -416 901 457
6500 457 -164 -317 834 168 -329 -144 751 -10 -400 598 665 -244 -591 -130 -75 419 -718 -244 335 548
6520 548 -554 40 977 -384 -911 204 602 124 -1011 245 1019 388 -1372 -287 790 418 -1035
6537 -1035 460 428 -151 -882 -15 -21 -687 -527 421 404 162 -464 268 665 31 -253 -433 245 -296 -598 93
6558 93 794 287 224 559 499 -617 -887 -27 695 -505 -513 -127 1177 -797 -1229 14 619 341 -65 -304
6578 -304 745 -186 -122 594 424 303 -568 526 634 -123 -893 -46 648 -200 -699 99 405 179 -712 35
$$ packed form
6445a218R71J265k51j149L92j84M58n92N78K64m67p08M54J290j24j416m56J253
6463C60j159r5J078M81j186P03K34J124j186j575N00J012K34j003M59R31n24j763
6481a375J381O33l76p90k6J247m58r77O16O51j84l63j63L55j20q72M05J317m44
6500D57o21j53J151o66m97J85Q95p61l90R98O7r09l47M61N5M94j137M74N79K13
6520E48j102N94R37j361n27J115L98m78j135J256P74o31j760J085J077l72j453
6537a035J495l2n79p31Q67oo66J60R48j7k42o26P32L97o34k84j80O78n41l02O91
6558I3P01n07o3L35o0j116k70Q60P22j200qL86J304j974m32J243O05k78m06k39
6578c04J049r31O4P16j70j21q71J094J08p57p70Q47O94q48m99P98L06k26q91P47
$$ plain form
6598 35 431 -61 29 43 552 -934 -766 499 593 -474 186 929 523 112 -513 180 -182 -563 -878 437
6618 437 -258 -353 -680 593 638 -909 -137 396 451 234 701 1070 378 -226 -244 663 517 -718 -110 728
6638 728 1456 -667 -556 867 317 -697 -402 205 331 -460 184 -308 174 -597 -608 475 297 -746 32
6657 32 1085 310 -341 -294 500 165 -409 -392 1169 115 382 -163 501 778 -109 -1097 613 671 -80 177
6677 177 559 -307 -368 -54 459 1119 -326 -516 676 170 -523 -129 644 -692 -977 360 494 874 -394
6696 -394 -216 375 281 -456 -680 757 3 -712 -311 1125 423 -443 -131 189 -470 -976 -290 426 -203 -1203
6716 -1203 72 1188 527 -361 528 824 243 -429 245 841 742 -789 -274 1013 744 -717 150 -18
6734 -18 327 -357 -85 1154 -15 -1100 -236 96 -714 -1066 -377 557 -13 -801 -280 330 -215 395 -203
$$ packed form
6598C5L96m92R0J4N09j486J68J265R4j067O60P43m06m11o25O93l62l81l15J315
6618D37o95r5l27J273M5j547P72N33N5k17M67L69o92o04j8R07j46j235O08Q38
6638G28P28k123J11J423n50j014K95O07J26p91O44m92M82p71j1J083j78j043P78
6657C2J053p75o51M7P94l35n74J7J561j054K67n45O64K77q87r88J710N8p51K57
6677A77L82q66o1L14N13O60j445j90J192n06o93L94P73j336k85J337J34L80j268
6696c94J78N91r4p37k24J437p54p15M01J436p02q66L12L20o59n06O86P16o29j000
6716a203J275J116o61q88Q89K96n81o72O74N96r9j531N15J287k69j461Q67j68
6734a8L45o84K72J239j169j085Q64L32q10l52O89R34n70p88N21O10n45O10n98
$$ plain form
6753 -203 -109 -188 -741 276 391 -465 -122 -10 208 98 -451 192 262 -314 -767 -782 279 -96 -581 156 917
6774 917 -313 -207 107 425 -835 -573 216 -241 271 -822 513 651 -179 -472 -757 758 -60 -324
6792 -324 312 531 389 -317 -190 490 -346 -612 375 325 709 -683 587 520 -431 -189 -92 382 -316 -623
6812 -623 437 482 -160 -313 373 226 -61 254 265 857 38 -484 272 175 -389 -554 240 219 -420 264 166
6833 166 113 24 -689 -499 -175 -460 -541 -15 587 -694 94 45 198 -438 86 -42 692 -118 -338 173 298
6854 298 -723 -80 1084 636 -224 -503 631 900 -329 9 67 49 -209 -285 204 -83 -440 -394 320 456
6874 456 13 -789 817 592 -494 -650 962 193 -902 -675 203 271 -1000 479 268 584 76 -853
6892 -853 515 1201 -1159 -259 515 -10 -191 -966 448 128 -533 32 128 -245 -275 215 611 374 -868
$$ packed form
6753b03R4p9n53J017J15q56L43J12K18j10n49O43P0n76m53j5J061l75m85P37P61
6774I17j230J06L14L18j260K62P89m57N12j093J335J38q30k93k85J515q18k64
6792c24O36K19j42p06J27O80q36k66R87n0L84j392J270o7r51K42R7M74o98l07
6812f23J060M5o42j53O86j47k87L15J1N92q19n22P56r7n64j65P94k1o39O84r8
6833A66n3q9p13J90L24k85q1N26O02j281P88m9J53o36N24j28P34q10k20N11J25
6854B98j021O43J164m48q60k79J134K69j229L38N8j8k58p6M89k87l57M6P14J36
6874D56m43q02J606k25j086j56J612p69j095K27Q78O8j271J479k11L16n08r29
6892h53J368O86k360R00P74n25j81p75J414l20o61N65R6l73l0M90L96k37j242
$$ plain form
6911 -868 557 125 -630 -373 131 567 710 728 433 726 4 -21 -364 841 468 -1224 18 97 -690 45
6931 45 5 1201 -553 -400 -230 359 320 -521 -194 241 -245 -413 434 -435 838 -845 479 859 -404
6950 -404 -157 -410 629 -698 49 99 158 384 -647 -6 291 572 -296 131 276 -216 8 -40 740 26
6970 26 41 15 -54 -715 -546 -411 564 632 -588 -122 808 -92 -499 285 1 754 -711 -452 675 324 -1037
6991 -1037 -254 288 96 -839 -503 137 146 -907 111 -386 -694 -387 297 -46 189 259 -106 1019 -751
7010 -751 -325 -72 218 -531 -549 -621 1121 -41 5 467 742 -145 -475 278 216 149 -286 375 445 -526 -442 -51
7032 -51 -310 -162 -216 334 1171 395 -522 813 470 -527 -585 75 -86 -93 -563 374 987 506 -1032 491 980
7053 980 -213 150 41 234 104 -238 817 308 -369 -944 -252 1095 -640 -367 -39 306 57 -956
$$ packed form
6911h68J425m32p55K57N04M36J43J8k95K93p22k5l43J205l73j692J242P9p87P35
6931D5m0J196j754J53J70N89l9q41L27M35m86j68Q47q69J273j683J324L80j263
6950d04K47k53J039j327P47N0N9K26j031O41K97K81q68M27J45m92K24m8P80p14
6970B6J5k6o9o61J69J35R75O8j220M66R30r00m07P84k84P53j465K59J127l51j361
6991a037P83N42j92r35L36O40Rj053J018m97l08L07O84l43K35P0l65J125j770
7010g51M26K53K90p49j8p2J742j162M6M62K75q87l30P53o2o7m35O61P0r71Q4L91
7032e1k59J48n4N50Q37p76r17J335l43r97n8O60j61pm70R37O13m81j538J523M89
7053I80j193L63j09J93j30l42J055n09o77n75O92J347j735K73L28L45k49j013
$$ plain form
7071 -956 736 390 -1213 -748 160 681 -463 -684 513 708 -197 62 -1236 468 -371 -624 -11 443
7089 443 -278 -1051 196 926 -572 -142 -177 493 -341 -837 663 -10 -618 -579 155 310 250 -316 -43 -267
7109 -267 -589 -264 606 977 -318 101 677 152 -186 165 297 369 -239 -443 845 -359 65 -336 369
7128 369 230 -117 -250 307 -199 -889 -275 926 -494 482 16 1226 -331 -672 -117 382 141 177 -320
7147 -320 153 11 252 169 662 160 -696 18 925 170 -858 -262 423 -138 -188 -826 434 814 -510 -163
7167 -163 1047 651 -29 -241 342 477 -510 18 769 -2 -422 40 438 -57 -525 240 221 -244 -802 463
7187 463 630 -404 -983 -151 952 367 -54 -1100 312 91 -80 169 534 170 -601 32 538 443 83
7206 83 443 676 337 -122 234 90 578 -740 -290 479 -181 162 -19 10 371 -268 -150 231 -423 -76
$$ packed form
7071i56J692l46j603M65R08N21j144k21J197J95r05K59j298J704q39k53O13M54
7089D43p21p73J247P30j498M30l5O70q34m96J500o73o08L9P34J55o0n66K73k24
7109b67l22L25Q70L71j295M19N76n25l38L51J32P2o08k04J288j204M24m01P05
7128C69j39l47j33N57n06o90O14J201j420R76m66J210j557l41N55M99k41L6m97
7147c20M73j42K41q3M93n02q56P14R07p55j028N96O85n61n0o38J260L80j324L47
7167a63J210l96o80k12N83J35r87N28P51p71m20M62L98m95m68P65j9m65n58J265
7187D63J67j034n79Q32J103n85m21j046J412k21j71K49L65l64p71O33N06r5l60
7206H3L60K33l39m59L56j44M88j318M50P69o60L43j81K9L61o39J18L81o54L47
$$ plain form
7226 -76 -129 818 113 -772 591 601 -326 -489 463 796 -75 -274 -339 481 361 -1133 544 247 161 -515 33
7247 33 595 106 -143 3 150 -629 -752 -287 564 -613 -760 -126 -142 -728 -216 39 440 -398 -704 345
7267 345 536 661 213 52 1175 521 -775 82 827 778 -1051 495 256 -284 -553 388 417 -28 -291
7286 -291 -424 370 -432 -362 581 233 -159 266 -44 1017 -264 -342 459 826 580 455 287 394 -413 -45
7306 -45 868 364 -587 -1235 500 -416 61 -398 -528 454 -225 -405 3 -107 393 -324 189 513 -120 -449
7326 -449 101 441 286 -484 394 247 237 -293 458 -295 -359 -51 160 382 -379 -10 566 1431 -24 254
7346 254 668 77 -368 -319 -223 -36 -333 -26 286 40 -650 -74 710 337 85 193 -184 499 -35 22 -226
7367 -226 1174 -118 -580 27 197 -827 -56 367 332 303 -461 592 -306 21 -138 598 -264 291 -162
$$ packed form
7226g6n3R47p05q85J363J0r27j63R52L33q71j99o5Q20j20j494J677k97q6o76N48
7247C3N62m89k49J46J47p79j23M65Q51j177j47O34j6n86N12K55M01q38l06J049
7267C45J91J25m48j61J123o54j296Q57P45m9j829J546k39n40k69R41K9m45k63
7286b91j33P94q02P0R43l48l92M25l10J061j281p8Q01L67k46j25j68J07q07L68
7306d5R13n04r51o48J735r16M77m59j30R82o79j80M08j10N00p17N13L24o33l29
7326d49N50L40j55p70Q78j47j0n30P51p53o4L08K11K22p61L69N76Q65j455K78
7346B54M14n91m45M9R6J87k97L07L12k46o90N76P84l73k52J08l77O83n34N7k48
7367b26J400j292m62O07J70j024P71M23l5k9p64J053q98L27j59P36q62N55m53
$$ plain form
7386 -162 593 344 -187 399 -23 292 -281 -40 139 271 -868 -63 536 -144 -80 -545 -185 117 -417 -490
7406 -490 393 -30 -191 -284 708 548 219 -390 117 218 207 -190 1332 -368 -861 -149 360 143 -819 -357
7426 -357 389 957 34 56 356 -236 -210 -238 225 -455 -882 488 257 222 -1 -149 -175 -516 -834 -509 -133
7447 -133 -489 -1222 44 623 -783 348 271 322 -421 -239 603 -290 27 267 519 253 -154 -387 280 90
7467 90 -747 -894 -738 574 -299 -837 558 -111 108 -668 348 964 -735 -218 97 -74 -197 -586 133
7486 133 -12 293 -454 64 -31 -758 -455 -103 755 -211 -221 -140 382 -24 -407 164 -320 -849 -903 74 -51
7507 -51 -270 -229 593 473 -511 -170 -230 567 -70 -520 397 751 -341 145 -98 -72 -675 -1088 688 316 -528
7528 -528 -206 192 499 -1305 13 198 507 378 127 627 56 -181 -196 356 156 -606 -284 566 -353 -479
$$ packed form
7386a62P55k49n31N86m22L15n73K41J79J32j139Q05N99o80O4m65L60L02n34p3
7406d90Q83m23j61r3R92j60l29o09N07J01j1l97J522j700m93P12N09k17r62M62
7426c57P46N68r23K2L00n92K6k8M63o80m27J370k31l5k23j48k6l41l18L25L76
7447a33l56p33J266N79j406J131p7N1p43J82Q42q93L17K40K52k66m07k33O67j90
7467I0q37j47J56J312q73n38J395o69K19p76J016O16j699N17L15j71j23l89P19
7486A33j45L05p47N18r5p27L03L52Q58r66j0Q1N22m06l83N71m84n29n4R77j25
7507e1k19M1Q22j20r84L41o0P97o37m50R17L54j092M86k43K6o03m13J776l72q44
7528e28L22L98L07j804J318J85L09j29k51N00n71k37j5N52k00p62L22Q50r19j26
$$ plain form
7548 -479 -894 407 651 34 -910 -49 857 -620 485 376 534 -886 -807 780 -167 -621 -447 -412 452
7567 452 79 -624 182 648 389 249 550 72 -258 -491 686 -383 -383 23 -181 -91 211 -169 43 62 -757
7588 -757 -395 -563 -309 -83 -447 413 249 -593 -1183 -293 -10 173 -205 358 -58 -821 78 874 144 290
7608 290 -164 -237 77 -258 379 532 -40 -205 -113 131 -279 -728 -408 935 -243 114 -137 51 -178 -553
7628 -553 322 1054 -351 -563 222 -459 -409 218 -283 657 81 -662 -582 531 -369 -145 -408 -298 554 -776
7648 -776 -11 126 -180 -1085 84 1060 -185 -87 -416 229 -306 -203 60 186 723 -374 240 823 -557
7667 -557 121 100 318 281 -894 123 480 -379 102 964 113 -100 -752 -940 525 634 -183 493 291 -150
7687 -150 -400 -275 -174 -211 -477 32 972 -922 -479 -505 202 -53 252 195 179 639 -425 -66 348 -821
$$ packed form
7548d79m15J301K44o17r44Q61R06j477J105j09J58j420P9J587r47m54J74L5Q64
7567D52l73p03Q06M66k59j40L01m78l30k33J177j069%M06k04R0L02l80K12J9q19
7588g57L62j68K54K26l64Q60j64q42n90Q90K83J83l78N63m16p63Q99P96p30J46
7608B90m54p3L14l35O37J53n72j65R2K44m10m49L20J343j178L57k51J88k29l75
7628e53Q75P32j405k12P85o81N0O27n01R40n76p43Q0J113r00K24k63J10Q52j330
7648g76P65J37l06r05J169R76j245R8l29O45n35J03K63J26N37j097O14N83j380
7667e57O78k1K18l7j175J017L57q59M81Q62q51k13o52j88J465J09q17O76k02m41
7687a50k50J25J01l7k66N09R40j894M43k6P07k55L05n7j6M60j064L59M14j169
$$ plain form
7707 -821 -953 192 837 -348 -418 277 -224 -224 -934 227 -332 19 -529 -470 603 -428 -428 -294 167 -69
7727 -69 -643 166 72 236 -240 429 776 -58 143 225 740 -141 -626 464 65 -57 191 402 457 -785 -817
7748 -817 519 432 226 -183 279 267 -112 65 313 474 188 -57 -196 114 -228 -360 -633 478 -8 -58
7768 -58 158 165 763 -161 -516 24 -73 -583 369 216 -635 -977 325 128 -88 -475 709 -234 1066 -743
7788 -743 -277 490 -907 295 994 -297 -1153 272 408 601 -91 -356 477 449 -58 362 28 10 451
7807 451 -154 281 3 -592 -56 -204 461 -341 -315 453 459 -402 -90 -287 257 -890 -343 166 403 320 -171
7828 -171 629 -9 304 -538 28 227 -644 -44 330 143 -676 -169 775 520 -125 -818 103 320 -188 -284
7848 -284 -29 -367 -488 30 845 76 -144 -314 53 -151 -601 -657 555 -444 490 -101 187 -440 202 370
$$ packed form
7707h21j32J145O45j185p0O95n01%p10J161n59L51n48N9J073j031%J34M61k36
7727f9n74Q09r4J64m76O69L47q34K01Q2N15q81m85J090l99j22K48K11N5j242l2
7748h17J336q7k06m09M62j2l79J77K48J61k86k45j39L10l42j32k73J111m86n0
7768e8K16PN98r24l55N40r7n10R52j53q51l42J302j97k16l87J184r43J300j809
7788g43M66P67j397J202O99j291q56J425J36J93o92k65Q33k8n07M20l34j8M41
7807D51o05M35k78n95N36j48O65q02K6P68Oq61L12j97N44j147N47N09K37q3m91
7828a71Q00o38L13q42N66J99q71O00L74j87q19N07R44k55o45o93R21K17n08r6
7848b84K55l38j21N18Q15p69k20j70L67k04m50n6J212r99R34n91K88o27O42J68
$$ plain form
7868 370 -329 276 343 -894 839 634 -493 637 138 271 -268 -442 216 165 -764 -406 328 789 13
7887 13 -726 663 465 37 465 858 -241 -67 322 327 -392 -219 -109 589 -31 -553 -112 754 310 -592
7907 -592 518 448 210 -385 -394 -15 430 -553 -100 48 -414 -217 -205 450 234 -140 101 1103 147 -376 -302
7928 -302 283 535 -138 -10 413 -133 -137 -801 176 322 -633 196 771 -233 -726 590 503 -632 -379 -822
7948 -822 -597 -140 135 -35 225 1014 -566 -403 939 -633 -39 434 116 301 -238 -389 355 -283 -513
7967 -513 -129 -70 395 43 -4 15 -1013 410 83 234 -74 14 714 -246 -270 -340 438 78 237 -536 -284
7988 -284 150 -128 -143 189 268 -1266 -358 376 -561 -225 -311 -691 292 255 -489 -192 439 -460 -314 323 807
8009 807 -3 -177 7 668 178 -412 531 869 259 751 625 -223 548 19 98 -774 291 -135 -491 301
$$ packed form
7868C70o99O05O7j237J733k05j127J130m99J33n39j74O58n1r29L58P34M61p76
7887A3p39J389j98m28M28L93j099J74L89Np19J73J10O98o20n22M41Q66m44r02
7907e92J110p0k38n95rL79M45r83M53J48m62J97J2O55k16l74K41J002r56n23P4
7928c02N85K52o73J28M23n46mo64R77J46r55Q29N75j004m93J316q7j135K53m43
7948h22K25M57K75j70K60P89j580J63J342j572N94M73l18J85n39j51P44o38k30
7967e13L84N9M65l52m7J9j028J423l27J51l08Q8P00r60k4p0P78l60J59p73K52
7988b84M34k78j5L32P9j534R08P34r37L36q6l80R83l7p44K97O31q99J46O37M84
8009H07q10j74J84O61m90n90R43L38o10M92j26q48P71n29P9q72J065m26l56P92
$$ plain form
8029 301 -810 -778 408 352 361 -488 -131 -122 -974 -286 -433 463 -203 -37 600 -24 -370 -676 759 -71 405
8050 405 -669 59 714 597 -40 -172 694 -313 8 744 355 -643 -603 -196 100 195 -135 588 561 -86
8070 -86 -393 514 -149 -163 36 39 187 85 124 320 -46 -212 292 628 -108 66 -115 52 -47 -746 467 -304
8092 -304 -359 -496 -378 290 17 -309 -49 534 50 -553 -105 -683 -167 -577 111 127 -388 256 -480 506 102
8113 102 307 216 415 -633 575 -10 462 515 -883 -489 -430 -245 364 -506 -195 -56 -89 114 -524 -233
8133 -233 -1084 -324 565 -155 54 211 632 -79 -601 232 977 -366 14 -171 254 -138 -620 -93 -93 530
8153 530 -147 107 127 -194 36 158 105 238 -415 177 46 -630 -99 -245 547 -141 261 -439 659 -446
8173 -446 -326 -270 436 -70 403 -65 -27 190 -567 -188 281 70 -700 -730 477 765 -66 306
$$ packed form
8029C01j111L2J186n6Rq49L57Rq52O88j47Q96o66J66O37o24l46l06J435q30M76
8050D05j074P28O55j17o37j32Q66j007L21P36l89r98M0M07K96R5l30P23k7o47
8070h6l07R07o63j4J99LJ48j02L9J96l66j66N04L36p36J74j81J67r9o99J213p71
8092c04n5j37J18O68k73l26K60N83m84o03M48n78N16m10O88J6n15O44p36R86m04
8113A02K05r1J99j048J208n85M72N3j398L94N9J85O09q70L11J39l3K03o38K91
8133b33q51P60Q89p20K09J57M21p11n22Q33P45j343L80j85M25l92m82N27%O23
8153E30o77K54K0l21K30J22n3J33o53N92j31o76N31j46P92o88M02p00J098j105
8173d46J20N6P06n06M73m68L8K17p57L79M69k11p70l0J207K88q31L72
8191C06
$$ Imaginary data points
##PAGE= N=2
##DATA TABLE= (X++(I..I)), XYDATA
$$ plain form
0 0 0 0 0 0 0 0 0 0 0 0 0 0 0 0 0 0 0 0 0 0 0 0 0 0 3 -29 61 -64 64 -64 64 -65 67 -81 110 -126 131 -139 161
39 161 -182 201 -220 244 -271 297 -329 367 -395 441 -484 533 -589 649 -718 795 -880 982
57 982 -1100 1240 -1406 1603 -1857 2194 -2638 3282 -4272 5960 -9410 19062 -88600 -337212
71 -337212 57548 268428 -50668 -224776 80557 231771 -65879 -207590 90608 217066
81 217066 -55200 -203154 57105 225585 -48642 -224052 65870 217864 -75873 -226126
91 -226126 62273 209501 -93804 -225650 93249 196006 -111573 -204052 86233 188046
101 188046 -95681 -194651 99161 188915 -91136 -176156 96250 194223 -81753 -181501 110207
112 110207 192908 -96239 -166055 107184 179814 -95233 -174886 105259 166339 -115266 -164670
$$ packed form
0@%%%%%%%%%%%%%%%%%%%%%%%%Ll2R0j25J28j28J28j29J32j48J91k36K57k70L00
39A61l43L83m21M64n15N68o26O96p62Q36r25J017j122J238j367J513j675J862
57I82k082K340k646L009l460M051m832N920p554J0232j5370K8472j07662k48612
71c37212L94760K10880l19096j74108L05333J51214k97650j41711K98198J26458
81B17066k72266j47954K60259J68480k74227j75410K89922J51994k93737j50253
91b26126K88399J47228l03305j31846L18899J02757l07579r2479K90285J01813
101A88046k83727r8970K93812Q9754k80051q5020K72406R7973k75976r9748K91708
112A10207Q2701k89147o9816K73239P2630k75047p9653K80145O1080k81605m9404
$$ plain form
123 -164670 102210 153571 -117970 -173744 107665 150223 -127477 -152286 108487 136206 -115881
134 -115881 -147205 117718 146534 -114784 -131670 120444 141048 -102124 -130131 123854 145316
145 145316 -117132 -123080 129657 129702 -116413 -121799 123361 117014 -134112 -114518 119822 98643
157 98643 -123255 -114093 108896 101081 -130210 -111681 117844 97799 -123018 -107080 124126
168 124126 109266 -128252 -95340 138481 95641 -122629 -82938 137125 99620 -125956 -79389
179 -79389 138334 81966 -125900 -78875 126718 80751 -133623 -80789 130007 65276 -135940
190 -135940 -78792 119449 66200 -137301 -75907 128424 59449 -131871 -63487 125747 67552
201 67552 -128339 -60564 138452 61255 -125270 -44707 136197 60773 -125533 -44865 138000
$$ packed form
123a64670K66880N1361k71541n5774K81409M2558k77700k4809K60773K7719k52087
134a15881l1324K64923K8816k61318j6886K52114K0604k43172k8007K53985K1462
145A45316k62448n948K52737M5k46115n386K45160o347k51126J9594K34340k1179
157I8643k21898R162K22989p815k31291J8529K29525k0045k20817J5938K31206
168A24126j4860k37518L2912K33821m2840k18270L9691K20063l7505k25576M6567
179g9389K17723n6368k07866M7025K05593m5967k14374N2834K10796o4731k01216
190a35940N7148J98241n3249k03501O1394K04331o8975j91320O8384J89234n8195
201F7552j95891O7775J99016p7197j86525Q0563J80904p5424j86306Q0668J82865
$$ plain form
212 138000 46687 -126630 -37698 122768 42288 -125699 -47176 124095 35335 -133979 -43187
223 -43187 119005 33530 -135443 -45332 130894 29497 -139123 -28848 130542 26488
233 26488 -129555 -24263 138344 27091 -127461 -11723 132402 25592 -118086 -17194
243 -17194 132659 23170 -126763 -13144 126037 15126 -124403 -19525 123863 6849
253 6849 -136258 -10451 121159 -1342 -128607 -10659 121364 -2088 -130786 2236
263 2236 123786 -4108 -120264 4110 125163 1727 -117732 13376 126069 -3506
273 -3506 -111885 9476 124375 1306 -118982 12201 122276 -14013 -119728 12034
283 12034 116376 -19370 -128044 18033 113860 -33815 -119208 22645 108527 -30625 -119198
$$ packed form
212A38000r1313j73317Q8932J60466q0480j67987P8523J71271q8760j69314R0792
223d3187J62192q5475j68973R0111J76226j01397j68620J10275J59390j04054
233B6488j56043J05292J62607j11253j54552J15738J44125j06810j43678J00892
243a7194J49853j09489j49933J13619J39181j10911j39529J04878J43388j17014
253F849j43107J25807J31610j22501j27265J17948J32023j23452j28698J33022
263B236J21550j27894j16156J24374J21053j23436j19459J31108J12693j29575
273c506j08379J21361J14899j23069j20288J31183J10075j36289j05715J31762
283A2034J04342j35746j08674J46077R5827j47675q5393J41853Q5882j39152q8573
$$ plain form
294 -119198 27018 112676 -31019 -107576 30927 113554 -23256 -111988 34071 123373 -28655
305 -28655 -108300 39211 117137 -30138 -111668 41571 114332 -44615 -107397 41014 97605
316 97605 -43870 -105230 36853 96560 -51349 -102887 39418 90357 -46014 -100817 42401
327 42401 99461 -50611 -97419 54440 97968 -47017 -93583 57742 102508 -54846 -89207
338 -89207 66315 95998 -54296 -88351 60615 93500 -61828 -89565 62670 83107 -64148
349 -64148 -89557 55518 83663 -67646 -90663 60483 77649 -68680 -84540 62233 83319
360 83319 -68460 -82196 73713 78854 -68779 -68962 75188 78819 -68956 -67311 80441 71682
372 71682 -67727 -62057 71210 69296 -70257 -69022 73777 63307 -76902 -67092 69038 61079
$$ packed form
294a19198J46216Q5658j43695p6557J38503Q2627j36810q8732J46059Q9302j52028
305b8655p9645J47511P7926j47275q1530J53239P2761j58947o2782J48411N6591
316I7605j41475o1360J42083N9707j47909n1538J42305N0939j36371n4803J43218
327D2401N7060j50072m6808J51859M3528j44985m6566J51325M4766j57354l4361
338h9207J55522K9683j50294l4055J48966L2885j55328k7737J52235K0437j47255
349f4148k5409J45075K8145j51309k3017J51146J7166j46329j5860J46773K1086
360H3319j51779j3736J55909N141j47633j83J44150L631j47775J645J47752q759
372G1682j39409N670J33267j914j39553J235J42799j0470j40209R810J36130p959
$$ plain form
384 61079 -80227 -70133 76367 56613 -85153 -59519 75685 54269 -79502 -54868 82877
395 82877 53227 -78409 -46153 81231 53992 -73384 -46664 85673 52752 -80418 -43303
406 -43303 83583 47972 -80140 -46916 83055 43182 -89214 -42322 80317 35146 -86967
417 -86967 -44148 80926 33697 -89971 -34969 82449 29492 -84052 -33424 84376 33302
428 33302 -82556 -24514 85495 30292 -75763 -24746 86442 33002 -81814 -23238 86840
439 86840 25079 -81459 -24337 83815 21689 -89553 -21289 82868 11238 -86325 -19486
450 -19486 78567 11960 -87827 -16193 79201 7602 -81370 -12056 80738 14851 -83042 -8798
462 -8798 88807 11959 -80060 -4207 87603 11365 -84084 -2469 89204 3202 -81763 -487
$$ packed form
384F1079j41306J0094J46500j9754j41766K5634J35204k1416j33771K4634J37745
395H2877k9650j31636L2256J27384k7239j27376K6720J32337l2921j33170L7115
406d3303J26886l5611j28112L3224J29971l9873j32396M6892J22639m5171j22113
417h6967M2819J25074m7229j23668N5002J17418n2957j13544N0628J17800n1074
428C3302j15858N8042J10009n5203j06055N1017J11188n3440j14816N8576J10078
439H6840o1761j06538N7122J08152o2126j11242O8264J04157p1630r7563O6839
450a9486R8053o6607r9787P1634R5394p1599q8972O9314R2794o5887r7893P4244
462h798R7605p6848r2019P5853R1810p6238r5449Q1615R1673q6002q4965Q1276
$$ plain form
474 -487 80460 484 -83727 -2675 79165 -5992 -83192 -1092 72858 -3632 -81997 -1711
486 -1711 77218 -7423 -79773 5454 77181 -4427 -76690 8923 83886 -7345 -75777 15537
498 15537 80591 -8415 -73800 15855 81781 -14490 -76154 17071 73248 -15826 -75013 10694
510 10694 72563 -19354 -77920 14321 68843 -20571 -77731 14250 73581 -21925 -76679 23679
522 23679 72152 -24447 -70252 26508 75199 -25117 -68014 33496 71601 -25353 -63740 29552
534 29552 71703 -26231 -69091 30709 67706 -29392 -68004 25700 66656 -32919 -72399 29925
546 29925 63696 -36491 -67594 29600 61472 -36158 -66393 36786 61888 -36889 -58238 38205
558 38205 62199 -34574 -56971 43921 62705 -39357 -53629 42553 60215 -37051 -57830 43241
$$ packed form
474d87Q0947p9976q4211Q1052Q1840q5157p7200Q2100P3950p6490p8365Q0286
486a711P8929q4641p2350Q5227P1727q1608p2263Q5613P4963r1231o8432R1314
498A5537O5054q9006o5385Q9655O5926r6271o1664R3225N6177q9074n9187Q5707
510A0694O1869r1917n8566R2241N4522q9414n7160R1981N9331r5506n4754J00358
522B3679M8473r6599m5805R6760M8691j00316m2897J01510L8105r6954l8387R3292
534B9552M2151r7934m2860R9800L6997r7098l8612R3704M0956r9575l9480J02324
546B9925L3771j00187l1103R7194L1872r7630l0235J03179K5102r8777k1349R6443
558C8205K3994r6773k2397J00892J8784j02062j4272R6182J7662r7266k0779J01071
$$ plain form
570 43241 57990 -45483 -57074 42187 55792 -47536 -62692 43818 53957 -52133 -56311
581 -56311 45693 48735 -49399 -54216 48464 50174 -49780 -46305 50279 49125 -43577 -45927 50920
594 50920 52636 -46228 -43869 52414 47854 -48724 -45260 53964 46464 -56131 -42978 54258 36933
607 36933 -56612 -42703 51708 36526 -58579 -39942 51845 33720 -54765 -38820 52586 39310
619 39310 -56558 -37002 59221 37557 -54571 -32707 59991 39055 -56778 -29249 64950 31685
631 31685 -57720 -26909 60544 29524 -61263 -27390 59505 22716 -62316 -27135 54496 22434
643 22434 -62718 -28128 58682 19672 -62268 -23114 58752 22969 -61408 -20399 65029 20356
655 20356 -59533 -14463 64713 19150 -59800 -12586 65475 14878 -59865 -9823 59592 13112
$$ packed form
570D3241J4749j03473j1591R9261J3605j03328j5156J06510J0139j06090m178
581e6311J02004L042r8134m817J02680J710r9954L475R6584j154r2702k350R6847
594E0920J716r8864K359R6283m560r6578L464R9224p500j02595J3153R7236j7325
607C6933r3545J3909R4411j5182r5105J8637R1787j8125q8485J5945R1406j3276
619C9310r5868J9556R6223k1664r2128K1864R2698k0936r5833K7529R4199l3265
631C1685q9405L0811Q7453l1020r0787L3873Q6895l6789q5032L5181Q1631l2062
643B2434q5152L4590Q6810l9010q1940L9154Q1866l5783q4377M1009Q5428m4673
655B0356p9889M5070P9176m5563p8950M7214P8061n0597p4743N0042O9415m6480
$$ plain form
667 13112 -60075 -14052 59597 9470 -62493 -12820 57607 8976 -63983 -14252 60379 5642
679 5642 -65037 -5926 59907 3982 -61029 -4522 63413 3988 -59583 2639 60978 2916
691 2916 -55799 1462 62739 2427 -58709 3742 60175 -1350 -59461 218 59946 -3999
703 -3999 -63913 2892 57667 -9085 -60887 3165 56250 -8480 -60647 7603 55707 -10723
715 -10723 -55242 9311 56273 -8155 -54367 14149 57647 -9955 -50417 13987 56119 -10154
727 -10154 -53243 16083 55640 -15058 -52729 14194 52771 -16317 -56522 15973 51815 -22297
739 -22297 -54896 16906 48917 -20493 -54648 19131 49582 -22720 -48330 21149 49079 -17958
751 -17958 -48379 23062 51665 -20410 -45385 26047 49950 -20582 -46490 27020 50506 -26739
$$ packed form
667A3112p3187M6023P3649n0127p1963M9673P0427m8631p2959M9731P4631n4737
679E642p0679N9111O5833n5925o5011N6507O7935n9425o3571O2222N8339n8062
691B916n8715N7261O1277o0312o1136O2451N6433o1525n8111N9679N9728o3945
703c999n9914O6805N4775o6752n1802O4052N3085o4730n2167O8250M8104o6430
715a0723m4519O4553M6962o4428m6212O8516M3498o7602m0462O4404M2132o6273
727a0154m3089O9326L9557p0698l7671O6923L8577o9088m0205P2495L5842p4112
739b2297l2599P1802L2011o9410l4155P3779L0451p2302k5610O9479K7930o7037
751a7958l0421P1441K8603p2075k4975P1432K3903p0532k5908P3510K3486p7245
$$ plain form
763 -26739 -45944 27171 43150 -27933 -46776 25617 43138 -31094 -46360 26395 39349 -28608
775 -28608 -44713 25451 42290 -29597 -42203 29024 41545 -27127 -40385 31143 45024 -28768
787 -28768 -38044 35426 39867 -30000 -36173 34287 39888 -34012 -36570 35687 34689 -35000 -35035 31870
801 31870 33226 -36855 -37333 34102 31026 -36677 -36535 33050 34089 -37877 -34944 38790 32691 -37269
815 -37269 -30887 39794 34422 -37290 -28718 42257 30829 -36860 -25107 39216 29391 -36538 -28190
828 -28190 39223 26286 -38816 -26700 35629 25750 -41578 -29757 39422 23597 -43671 -25611
840 -25611 40012 22300 -42325 -23975 43516 21150 -43307 -18022 43647 21445 -38913 -18238
852 -18238 44500 22510 -40460 -15636 43552 19177 -40970 -18442 44194 17664 -45446 -17069
$$ packed form
763b6739j9205P3115J5979p1083j8843P2393J7521p4232j5266P2755J2954o7957
775b8608j6105P0164J6839p1887j2606P1227J2521o8672j3258P1528J3881p3792
787b8768r276P3470M441o9867o173P0460N601p3900k558P2257r98o9689l5O6905
801C1870J356p0081m78P1435l076o7703J42O9585J039p1966K933P3734o099o9960
815c7269O382P0681n372p1712Q572P0975j1428o7689J1753O4323r825o5929Q348
828b8190O7413j2937o5102J2116O2329r879o7328J1821O9179j5825o7268J8060
840b5611O5623j7712o4625J8350O7491k2366o4457K5285O1669k2202o0358K0675
852a8238O2738k1990o2970K4824N9188k4375o0147K2528O2636k6530o3110K8377
$$ plain form
864 -17069 42259 13510 -45130 -17750 42525 11342 -47807 -13991 42437 9545 -43899 -12352
876 -12352 44122 10869 -45075 -8815 43968 10649 -40655 -8845 46065 12374 -42547 -6563
888 -6563 45939 8250 -42596 -6459 46004 7849 -46769 -5451 44306 1925 -45460 -5343
900 -5343 41919 1355 -46811 -3616 41713 -987 -44003 -1608 42426 2341 -43863 -171
912 -171 45893 -80 -41714 3374 45296 1270 -42910 4575 46859 -3603 -41950 6289
924 6289 43336 -4703 -44099 4912 42876 -9387 -43893 5925 39690 -8890 -44395 5267
936 5267 41228 -10689 -43345 9000 40502 -8836 -41461 9561 43463 -9772 -39444 13713
948 13713 40941 -9475 -37719 13211 42129 -11954 -38208 15787 37983 -14001 -37311 13682
$$ packed form
864a7069N9328k8749n8640K7380O0275l1183n9149L3816N6428l2892n3444L1547
876a2352N6474l3253n5944L6260N2783l3319n1304L1810N4910l3691n4921L5984
888f563N2502l7689n0846L6137N2463l8155n4618M1318M9757m2381m7385M0117
900e343M7262m0564m8166M3195M5329m2700m3016M2395M4034m0085m6204M3692
912a71M6064m5973m1634M5088M1922m4026m4180M7485M2284n0462l8347M8239
924F289L7047m8039l9396M9011L7964n2263l4506M9818L3765m8580l5505M9662
936E267L5961n1917l2656N2345L1502m9338l2625N1022L3902n3235k9672N3157
948A3713K7228n0416k8244N0930K8918n4083k6254N3995K2196n1984k3310N0993
$$ plain form
960 13682 36799 -17246 -39097 15439 34935 -18266 -38355 14260 35430 -18922 -38688 18583
972 18583 35940 -18740 -35954 19493 37094 -18948 -34623 23532 35737 -19756 -31233 22106
984 22106 35249 -20224 -32475 23128 32428 -21717 -30961 20212 31080 -22700 -33784 22093
996 22093 30171 -25945 -31960 21973 28939 -24977 -31931 25342 28302 -26198 -27261 25580 28135
1009 28135 -24381 -27403 27715 28466 -25563 -23358 26618 27333 -23616 -25602 27243 27076 -27148 -25169
1023 -25169 27330 23830 -27975 -27388 27569 22535 -32360 -24070 28144 19683 -30458 -23355 29196
1036 29196 19911 -31691 -20086 30440 20355 -27575 -18554 30763 21910 -28806 -18078 32404
1048 32404 20832 -29028 -18929 31959 20231 -31504 -17132 31549 15472 -32007 -17349 28908
$$ packed form
960A3682K3117n4045k1851N4536J9496n3201k0089N2615K1170n4352j9766N7271
972A8583J7357n4680j7214N5447J7601n6042j5675N8155J2205n5493j1477N3339
984B2106J3143n5473j2251N5603R300n4145r244N1173J0868n3780j1084N5877
996B2093Q078n6116o015N3933O966n3916o954N7273K960n4500j063N2841K555
1009B8135n2516l022N5118P51n4029K205M9976P15n0949j986N2845j67n4224J979
1023b5169N2499l500n1805N87N4957n034n4895Q290N2214q461n0141P103N2551
1036B9196r285n1602J1605N0526j0085m7930R021M9317q853n0716J0728N0482
1048C2404j1572m9860J0099N0888j1728n1735J4372M8681j6077m7479J4658M6257
$$ plain form
1060 28908 14610 -33909 -15710 29676 11617 -32386 -14709 29911 13852 -32031 -13633 32216
1072 32216 13064 -31014 -11798 33044 13906 -31947 -9702 35712 12124 -32383 -9367 34515
1084 34515 11616 -33192 -8717 34268 7418 -33169 -8098 30234 6148 -34024 -9518 31987
1096 31987 4806 -34291 -7488 30790 5799 -33785 -6928 34429 5016 -33110 -3117 34292
1108 34292 5718 -32482 -2570 35099 3179 -32025 283 33900 2788 -32234 -2255 33035
1120 33035 626 -33089 -1072 30227 225 -33518 -2616 32417 -1581 -34456 -148 31706
1132 31706 -1561 -34527 867 33331 -2688 -32670 4799 32869 -2923 -29883 4582 33724
1144 33724 -2731 -30991 6579 32376 -5119 -29949 5927 31380 -5228 -32601 6290 29863
$$ packed form
1060B8908j4298m8519J8199M5386j8059m4003J7677M4620j6059m5883J8398M5849
1072C2216j9152m4078J9216M4842j9138m5853K2245M5414k3588m4507K3016M3882
1084C4515k2899m4808K4475M2985k6850m0587K5071L8332k4086m0172K4506M1505
1096C1987k7181l9097K6803L8278k4991l9584K6857M1357k9413l8126K9993L7409
1108C4292k8574l8200K9912L7669l1920l5204L2308L3617l1112l5022K9979L5290
1120C3035l2409l3715L2017L1299l0002l3743L0902L5033l3998l2875L4308L1854
1132C1706l3267l2966L5394L2464l6019k9982L7469K8070l5792k6960L4465K9142
1144C3724l6455k8260L7570K5797l7495k4830L5876K5453l6608k7373L8891K3573
$$ plain form
1156 29863 -7926 -31707 5558 29808 -8920 -32944 8056 29599 -11036 -30937 8075 30526
1168 30526 -9976 -29616 12878 31486 -10696 -27602 12039 30584 -8455 -28310 12735 30156
1180 30156 -10736 -28129 12804 28564 -11840 -29515 13058 27737 -16190 -28700 13191 25841
1192 25841 -15766 -28507 14724 26100 -17847 -26219 16039 24651 -15147 -25272 17199 26735
1204 26735 -16816 -24361 19080 27086 -16315 -24164 19089 27348 -19074 -23998 19982 23965 -19449
1217 -19449 -24096 19463 23447 -21610 -23145 19310 19678 -20443 -22205 19179 20556 -21659 -21624 20403
1231 20403 19881 -19835 -20356 20955 21262 -21168 -19319 24276 20300 -21625 -16759 24400 19952 -22824
1245 -22824 -17348 25461 16577 -23215 -17061 21406 15780 -24704 -17252 22498 13977 -24020 -15983
$$ packed form
1156B9863l7789k3781L7265K4250l8728k4024M1000K1543m0635j9901L9012K2451
1168C0526m0502j9640M2494J8608m2182j6906L9641J8545l9039j9855M1045J7421
1180C0156m0892j7393M0933J5760m0404j7675M2573J4679m3927j2510M1891J2650
1192B5841m1607j2741M3231J1376m3947q372M2258Q612l9798j0125M2471R536
1204B6735m3551p545M3441Q006m3401p849M3253Q259m6422m924M3980L983m3414
1217a9449m647M3559L984m5057j535M2455L68m0121j762M1384J377m2215L5M2027
1231B0403n22l9716n21M1311L07m2430J849M3595l976m1925M866M1159m448m2776
1245b2824N476M2809q884l9792O154L8467n626m0484P452L9750q521l7997Q037
$$ plain form
1258 -15983 22175 15289 -24773 -15639 24378 14423 -24673 -14211 25272 15350 -24029 -12548 27617
1271 27617 13098 -24601 -9873 26540 13175 -24433 -10147 27087 10668 -25397 -10449 24142
1283 24142 9902 -25924 -12090 24482 9413 -27058 -9032 24738 8470 -26724 -9464 25879
1295 25879 7133 -27059 -5914 25802 6619 -25044 -5887 27457 6617 -25066 -3795 26256
1307 26256 5461 -24622 -4571 26663 5390 -25634 -3688 25437 2985 -26611 -5615 25619
1319 25619 2240 -28805 -2898 25594 199 -26008 -2090 26045 403 -26177 147 25625
1331 25625 1252 -23706 622 26044 1986 -23842 1394 26756 -16 -23890 1223 25876
1343 25876 -574 -25555 2498 25171 -3773 -25999 1707 23391 -4096 -26686 3064 24177
$$ packed form
1258a5983L8158o886m0062R134M0017r955l9096J0462L9483r922l9379J1481M0165
1271B7617j4519l7699J4728L6413j3365l7608J4286L7234j6419l6065J4948L4591
1283B4142j4240l5826J3834L6572j5069l6471J8026L3770j6268l5194J7260L5343
1295B5879j8746l4192K1145L1716j9183l1663J9157L3344k0840l1683K1271L0051
1307B6256k0795l0083K0051L1234k1273l1024K1946K9125k2452k9596K0996L1234
1319B5619k3379l1045K5907K8492k5395k6207K3918K8135k5642k6580K6324K5478
1331B5625k4373k4958K4328K5422k4058k5828K5236K5362k6772k3874K5113K4653
1343B5876k6450k4981K8053K2673k8944k2226K7706K1684k7487k2590K9750K1113
$$ plain form
1355 24177 -5655 -24457 4041 23330 -3454 -24351 3755 25788 -3696 -22746 5631 24535
1367 24535 -2570 -23446 6105 26211 -6297 -22725 7554 23900 -6978 -23643 7400 23764
1379 23764 -8980 -23311 7453 20322 -9200 -23743 6711 21149 -9295 -23179 8185 21160
1391 21160 -8893 -21777 9393 22332 -9571 -21619 11822 22532 -9494 -20660 11627 23066
1403 23066 -11046 -20276 12864 20450 -11170 -19377 11982 20200 -12729 -20471 11910 18143 -12659
1416 -12659 -20105 10855 18366 -12809 -21095 12653 17948 -13543 -19190 13478 19177 -13374 -18129
1429 -18129 15338 18791 -13967 -15688 16019 18187 -14734 -15957 16708 17069 -15772 -16044 15513
1442 15513 16729 -14937 -17499 16037 16021 -17285 -17626 14984 14891 -17080 -17068 16187 14702 -18321 -14120
$$ packed form
1355B4177k9832j8802K8498J9289k6784k0897K8106K2033k9484j9050K8377J8904
1367B4535k7105k0876K9551K0106l2508j6428L0279J6346l0878j6665L1043J6364
1379B3764l2744j4331L0764J2869k9522j4543L0454J4438l0444j3884L1364J2975
1391B1160l0053j2884L1170J2939l1903j2048L3441J0710l2026j1166L2287J1439
1403B3066l4112r230L3140P586l1620q207L1359Q218l2929p742L2381O233l0802
1416a2659p446L0960P511l1175q286L3748N295l1491n647L2668N699l2551m755
1429a8129L3467L453l2758j721L1707K168l2921j223L2665L61l2841k72L1557
1442A5513J216l1666k562L3536j6l3306l41L2610r3l1971J2L3255j485l3023M201
$$ plain form
1457 -14120 16402 14168 -16524 -14258 17753 14016 -16752 -11901 18467 13279 -15940 -12450 18440
1470 18440 13717 -17235 -12535 18113 11717 -18898 -12498 18767 11340 -20903 -11790 18495 8747
1483 8747 -20608 -11800 19008 9537 -20634 -9385 19040 9928 -18410 -9276 19488 9612 -19236
1496 -19236 -6497 20533 9641 -17549 -7604 20644 8770 -20641 -6493 21733 6975 -19644
1508 -19644 -6802 20461 5903 -20682 -6526 19602 4372 -21006 -6022 18650 4393 -20619
1520 -20619 -5483 20239 4159 -19308 -4141 21003 4314 -19787 -3407 21794 3828 -20002
1532 -20002 -1334 20857 2821 -20346 -2400 21172 1415 -20411 -1269 19645 335 -20917
1544 -20917 -1877 19602 -1517 -21017 -1436 18897 -189 -20097 -633 20356 -664 -20559
$$ packed form
1457a4120L0522k234l0692K266L2011l737l0768M851L0368n188k9219L490L0890
1470A8440m723l0952M700L0648o396l0615O400L1265p427l2243R113L0285r748
1483H747k9355Q808L0808r471l0171J1249K8425r112k8338R134K8764r876k8848
1496a9236J2739K7030j0892k7190R945K8248j1874k9411J4148K8226j4758k6619
1508a9644J2842K7263j4558k6585J4156K6128j5230k5378J4984K4672j4257k5012
1520b0619J5136K5722j6080k3467J5167K5144j6689k4101J6380K5201j7966k3830
1532b0002J8668K2191j8036k3167J7946K3572j9757k1826J9142K0914j9310k1252
1544b0917J9040K1479k1119j9500J9581K0333j9086j9908J9464K0989k1020j9895
$$ plain form
1556 -20559 621 20000 -321 -19028 1911 21128 -498 -19090 3241 19588 -1596 -18843
1568 -18843 3201 19794 -3128 -19389 3826 18281 -3397 -18571 2523 18371 -4394 -19587
1580 -19587 3582 18143 -5477 -19265 3087 18897 -5047 -18900 5779 18554 -4773 -16941
1592 -16941 6367 18482 -5816 -16758 7448 17506 -6480 -15698 5873 17458 -6725 -16807
1604 -16807 6955 15854 -7886 -18041 6872 15652 -8175 -17980 7495 15777 -9327 -16242 7916
1617 7916 16169 -8554 -15612 8849 15772 -9314 -14362 9854 14894 -7849 -14621 11055 15666
1630 15666 -9686 -13766 9646 15071 -9623 -14259 9618 14356 -11479 -14717 10356 12838 -11511
1643 -11511 -14753 10777 12676 -11991 -13961 10655 12395 -10771 -13089 11185 13206 -10745 -10888
$$ packed form
1556b0559K1180J9379k0321j8707K0939J9217k1626j8592K2331J6347k1184j7247
1568a8843K2044J6593k2922j6261K3215J4455k1678j5174K1094J5848k2765j5193
1580a9587K3169J4561k3620j3788K2352J5810k3944j3853K4679J2775k3327j2168
1592a6941K3308J2115k4298j0942K4206J0058k3986r218K1571J1585k4183j0082
1604a6807K3762Q899k3740j0155K4913Q780k3827r805K5475Q282k5104o915K4158
1617G916Q253k4723p058K4461O923k5086n048K4216N040k2743o772K5676M611
1630A5666k5352m080K3412N425k4694m636K3877M738k5835l238K5073K482k4349
1643a1511l242K5530J899k4667j970K4616J740k3166k318K4274K021k3951j43
$$ plain form
1656 -10888 12021 12962 -10576 -11546 12543 12330 -12276 -11091 13837 10445 -12459 -11171 12591 10408
1670 10408 -13690 -11026 12804 9126 -13355 -11174 12117 9444 -14275 -11330 12795 8508 -13700
1683 -13700 -9804 12813 10482 -13799 -8846 14488 9853 -12874 -8261 13598 9693 -13169 -8135
1696 -8135 15004 8422 -13029 -7003 13963 7115 -14413 -7898 14006 5988 -15293 -6667 13987
1709 13987 6182 -14613 -7539 14937 6039 -14811 -6348 14920 6538 -14781 -5745 16360 6182
1722 6182 -14897 -3433 16185 6100 -14239 -3900 16398 4237 -14586 -3263 15202 3967
1734 3967 -15377 -5195 14536 3326 -15711 -4074 14027 3075 -15689 -3822 15881 2442
1746 2442 -16155 -2171 15574 1425 -15647 -2038 16394 2540 -14952 -195 15669 1836
$$ packed form
1656a0888K2909R41k3538r70K4089k13k4606J185K4928l392k2904J288K3762k183
1670A0408k4098K664K3830l678k2481K181K3291k673k3719K945K4125m287k2208
1683a3700L896K2617k331k4281M953K3334m635k2727M613K1859l905k2862N034
1696h135K3139o582k1451O026K0966o848k1528O515K1904q018k1281Q626K0654
1709A3987p805k0795P074K2476q898k0850Q463K1268q382k1319R036K2105j0178
1722F182k1079J1464J9618j0085k0339J0339K0298j2161j8823J1323J8465j1235
1734C967j9344J0182J9731j1210j9037J1637J8101j0952j8764J1867J9703j3439
1746B442j8597J3984J7745j4149j7072J3609J8432j3854j7492J4757J5864j3833
$$ plain form
1758 1836 -14051 -625 15139 1245 -14917 -1017 15423 361 -15155 -1214 14933 -233
1770 -233 -16274 142 14607 -2153 -16176 -232 14113 -1544 -16180 1354 15765 -2197
1782 -2197 -14451 2676 15795 -525 -14501 3134 16216 -2152 -14043 2780 14866 -2061
1794 -2061 -14348 3033 14975 -3699 -15106 3132 14151 -4254 -15184 3186 13095 -5546
1806 -5546 -14285 4105 13241 -5347 -14450 4611 13577 -4867 -13584 5166 13393 -4504 -13249
1819 -13249 6166 14177 -4676 -12344 6811 13584 -5385 -12309 7316 12552 -7249 -12592 6952
1832 6952 11038 -7633 -12514 7167 11648 -7874 -12541 6655 10501 -7490 -11989 7203 11995
1845 11995 -7510 -11022 7999 11943 -7767 -11295 8169 11533 -7986 -10381 9023 10451 -8549
$$ packed form
1758A836j5887J3426J5764j3894j6162J3900J6440j5062j5516J3941J6147j5166
1770b33j6041J6416J4465j6760j4023J5944J4345j5657j4636J7534J4411j7962
1782b197j2254J7127J3119j6320j3976J7635J3082j8368j1891J6823J2086j6927
1794b061j2287J7381J1942j8674j1407J8238J1019j8405j0930J8370R909j8641
1806e546q739J8390R136j8588r103J9061Q966j8444q717J8750Q227j7897q745
1819a3249J9415Q011j8853p668J9155O773j8969o924J9625N236j9801n343J9544
1832F952M086j8671m881J9681M481j9522m667J9196L846j7991m499J9192M792
1845A1995j9505l512J9021L944j9710l528J9464L364j9519k395J9404J428j9000
$$ plain form
1858 -8549 -9481 9339 10274 -9623 -10625 8804 8569 -9429 -9059 8256 8775 -10029 -10554 8506 8888
1873 8888 -9851 -9680 9272 9565 -9861 -9462 10079 8705 -9652 -7184 10551 9098 -9875 -8152
1887 -8152 10448 8877 -9803 -6892 10374 7232 -9996 -7309 9719 6802 -10332 -7380 10042
1900 10042 6613 -11230 -7443 9933 6355 -11197 -5843 10096 5250 -10868 -5849 11409 6320
1913 6320 -11476 -4939 11710 5566 -10340 -5636 11142 6201 -10265 -4647 11270 5063 -10964
1926 -10964 -5028 11169 4672 -12163 -5665 11449 2898 -11457 -5451 10722 3552 -12374 -3608
1939 -3608 11615 2399 -11147 -3635 11491 4232 -11740 -2013 12484 3106 -10428 -2790 11481
1952 11481 3332 -11475 -1647 12412 2493 -11936 -2277 10931 1844 -12131 -2012 11778 756
$$ packed form
1858h549r32J8820R35j9897j002J9429k35j7998L70J7315N19j8804n25J9060L82
1873H888j8739J71J8952K93j9426L99J9541j374j8357K468J7735j453j8973J723
1887h152J8600j571j8680K911J7266l142j7228K687J7028k917j7134K952J7422
1900A0042l429j7843L787J7376l578j7552N354J5939m846j6118N019J7258n089
1913F320j7796O537J6649o144j5906M704J6778m941j6466N618J5917o207j6027
1926a0964N936J6197o497j6835O498J7114q551j4355O006J6173p170j5926Q766
1939c608J5223r216j3546P512J5126p259j5972R727J4497r378j3534P638J4271
1952A1481q149j4807R828J4059r919j4429R659J3208r087j3975J0119J3790j1022
$$ plain form
1965 756 -11785 -1541 11391 905 -11988 -933 10299 633 -10810 -721 11163 987
1977 987 -11111 -129 12418 603 -11532 889 12522 457 -11413 947 13200 -748
1989 -748 -11933 891 10491 -1904 -11673 807 11488 -1504 -11421 473 10708 -1464 -11528
2002 -11528 465 11523 -1439 -11309 1602 11408 -1603 -10366 2407 12534 -2108 -10819 3829
2015 3829 11629 -2129 -9765 3799 10674 -2879 -10724 3907 10466 -3545 -10676 2200 9307
2028 9307 -3149 -11115 3514 9867 -4732 -10603 3424 10010 -4386 -10289 4462 9797 -4697
2041 -4697 -9665 5596 9972 -4546 -9405 6191 9974 -4418 -9111 5410 9572 -4164 -9779
2054 -9779 5525 9301 -6134 -10118 4717 9018 -5806 -9722 5104 8195 -7344 -9648 6663
$$ packed form
1965G56j2541J0244J2932j0486j2893J1055J1232r666j1443J0089J1884j0176
1977I87j2098J0982J2547j1815j2135J2421J1633j2065j1870J2360J2253j3948
1989g48j1185J2824R600j2395r769J2480J0681j2992r917J1894J0235j2172j0064
2002a1528J1993J1058j2962r870J2911R806j3011q763J2773J0127j4642q711J4648
2015C829P800j3758p636J3564O875j3553p845J4631O559j4011p131J2876P107
2028I307j2456p966J4629O353j4599n871J4027O586j4396n903J4751N335j4494
2041d697m968J5261M376j4518m859J5596L783j4392m693J4521M162j3736n615
2054i779J5304L776j5435l984J4835M301j4824l916J4826L091j5539k304J6311
$$ plain form
2067 6663 8292 -6476 -9571 6602 8575 -6945 -7517 6697 8427 -5827 -7640 7477 8772 -7707
2081 -7707 -7518 7563 7276 -6875 -6533 8032 7553 -7520 -7274 7533 5693 -8865 -7716 6963
2095 6963 7179 -9056 -7192 7993 6233 -8301 -7298 7556 6546 -8215 -5647 8630 6562 -7155
2109 -7155 -6240 8813 5942 -8226 -5345 8376 5478 -7953 -5117 8742 5673 -9204 -5272 8234
2123 8234 4501 -9164 -4657 7512 3654 -9543 -5248 8813 3414 -8975 -4234 8399 4427
2136 4427 -8850 -3627 9986 3205 -8331 -3385 9421 4672 -9087 -3378 9599 3389 -9120
2149 -9120 -3043 9215 2479 -9425 -3095 9445 2485 -9636 -2474 7967 2051 -9584 -3412
2162 -3412 8996 1409 -9330 -2906 9354 2863 -9318 -2126 9860 1439 -9521 -871 9878
$$ packed form
2067F663J629j4768l095J6173J973j5520n72J4214J730j4254j813J5117J295j6479
2081g707J89J5081k87j4151L42J4565m79j5073K46J4807j840j4558J149J4679
2095F963K16j6235J864J5185j760j4534J003J4854j010j4761K568J4277k068j3717
2109g155R15J5053k871j4168K881J3721k898j3431K836J3859l069j4877L932J3506
2123H234l733j3665M507J2169l858j3197M295J4061n399j2389M741J2633l972
2136D427j3277N223J3613o781j1536M946J2806m749j3759N709J2977o210j2509
2149i120O077J2258o736j1904O330J2540o960j2121P162J0441n916j1635O172
2162c412J2408p587j0739O424J2260o491j2181P192J1986q421j0960Q650J0749
$$ plain form
2175 9878 1619 -9012 -528 9911 1297 -8855 -1046 8857 858 -8621 -756 9375 223 -9152
2189 -9152 -842 8822 -301 -9190 -1532 8991 -9 -9438 485 9037 -432 -8536 507 9474 -80
2204 -80 -8541 1470 8946 -863 -8212 955 9327 -473 -8283 1480 8734 -2166 -8473 678 8481
2219 8481 -1242 -9700 1937 9007 -2905 -9189 1425 8349 -3358 -9474 2581 8489 -3077
2232 -3077 -8321 1882 8568 -1847 -8304 3589 7812 -2551 -7083 2963 8621 -1262 -7906 3435
2246 3435 8137 -3181 -7740 3765 7633 -3837 -8531 3517 7726 -4224 -8644 3142 6904
2259 6904 -4137 -7645 3609 7693 -3988 -7131 4266 7127 -3919 -7146 4409 8302 -4421
2272 -4421 -7053 5212 7448 -4029 -6233 4787 8434 -5002 -6425 5631 6386 -4780 -7091 4362
$$ packed form
2175I878q259j0631Q484J0439q614j0152P809R903p999r479P865J0131r152r375
2189i152Q310R664r123q889P658J0523r000r429R923Q552r469q104R043Q967r554
2204h0q461J0011P476r809p349R167Q372r800p810R763P254j0900o307R151P803
2219H481r723q458J1637P070j1912o284J0614O924j1707o116J2055N908j1566
2232c077n244J0203O686j0415o457J1893M223j0363m532J0046N658r883o644J1341
2246C435M702j1318m559J1505L868j1470m694J2048M209j1950m420J1786L762
2259F904j1041l508J1254M084j1681l143J1397K861j1046l227J1555L893j2723
2272d421k632J2265K236j1477k204J1020L647j3436j423J2056P55j1166k311J1453
$$ plain form
2286 4362 5909 -5809 -7264 5445 4835 -4850 -6481 5286 6656 -6183 -6224 5845 6702 -6127
2300 -6127 -6358 5181 6569 -5376 -5948 5250 5196 -4920 -5377 5492 5200 -5975 -6455 6023 4690
2315 4690 -6181 -5555 6154 5020 -6431 -5780 5708 4415 -7024 -4822 5600 4848 -7166 -4783
2329 -4783 7098 4473 -6573 -4976 7130 4987 -7176 -3929 7381 4949 -6678 -3692 6779
2342 6779 4177 -5960 -3563 7353 2996 -8288 -3520 7028 2633 -6899 -4681 6920 2675 -7074
2356 -7074 -3800 7187 2443 -7474 -3811 7412 2908 -7247 -2368 8037 1705 -7086 -2051 7906
2370 7906 2110 -7465 -920 7464 2322 -6943 -1890 7061 1778 -7814 -1696 6462 856 -8250 -2291
2385 -2291 7210 1265 -8234 -993 6845 565 -6928 -825 7814 693 -6981 -188 7805 701 -7300
$$ packed form
2286D362J547j1718j455J2709o10r685j631J1767J370j2839m1J2069Q57j2829
2300f127k31J1539J388j1945n72J1198n4j0116m57J0869k92j1175m80J2478j333
2315D690j0871O26J1709j134j1451O51J1488j293j1439K202J0422p52j2014K383
2329d783J1881k625j1046J597J2106k143j2163L247J1310k432j1627K986J0471
2342F779k602j0137K397J0916m357j1284M768J0548m395r532K218J1601m245r749
2356g074L274J0987m744r917L663J1223m504j0155M879J0405o332q791N035R957
2370G906n796r575O545Q384n142r265N053Q951n283r592O118Q158n606r106N959
2385b291R501n945r499P241P838o280p493O103Q639p121p674O793P993p104q001
$$ plain form
2400 -7300 -116 7170 1261 -6820 332 7972 87 -7314 -153 7297 -160 -8041 444 6531 -790
2415 -790 -7764 242 7089 -854 -8149 997 7378 -946 -7562 252 6867 -1214 -7663 1032 7085
2430 7085 -1440 -6389 1400 7253 -644 -7206 1430 7775 -2158 -6262 1677 7060 -1539 -6620 2080
2445 2080 6420 -2778 -7208 2537 5776 -2626 -6582 1656 6144 -3050 -6886 2707 6341 -2885 -6578
2460 -6578 3011 7459 -1943 -6297 3718 6581 -2354 -6532 3831 7039 -3257 -6066 3761 5597
2474 5597 -2837 -5870 3023 5527 -3070 -5688 2855 5116 -3226 -5949 2924 5382 -3346 -5855 4209
2489 4209 4663 -3887 -5089 3691 5822 -3779 -4770 5278 4913 -3848 -4263 4025 5823 -3697 -4976 3807
2505 3807 4377 -4199 -4475 3832 4865 -4909 -5194 4544 4026 -5071 -4515 3543 4103 -4605 -5227 4929
$$ packed form
2400g300P184P286n909q081P152P640p885p401P161P450p457p881Q485O087p321
2415g90o974Q006O847p943p295R146O381q324o616P814O615q081o449Q695O053
2430G085q525m949P789N853p897o562Q636O345r933m104P939N383q599n081Q700
2445B080M340r198m430R745L239q402l956Q238M488r194l836R593L634r226l693
2460f578R589M448r402m354J0015K863q935m178J0363L208j0296k809R827J836
2474E597q434l033Q893K504q597k618Q543K261q342k723Q873K458q728k509J0064
2489D209M54q550j202Q780K131r601r91J0048l65q761m15Q288J798r520j279Q783
2505C807N70q576k76Q307J033r774k85R738n18r097N56Q058N60q708o22J0156
$$ plain form
2521 4929 4765 -4731 -4817 4596 3686 -4323 -4273 4320 4248 -4072 -3091 4978 4162 -4416 -3723 5138 4042 -4820
2539 -4820 -3547 4464 3092 -5404 -4259 4668 3622 -5696 -3936 4924 2277 -5456 -3783 5098 2643
2554 2643 -5850 -2435 5798 3599 -4163 -3123 4937 3585 -5757 -2312 5064 2722 -4840 -2737 5567
2569 5567 2944 -5614 -2004 5917 2347 -5791 -2582 5699 1605 -6586 -1872 5635 1573 -5939 -2748
2584 -2748 5580 2797 -5804 -1960 6072 2131 -5499 -1135 5745 2275 -6371 -611 6205 1811 -5792
2599 -5792 -1006 5890 1680 -6337 -960 6083 750 -6420 -1118 5162 421 -6089 -1303 6400 -119
2614 -119 -6080 -177 5361 650 -5626 -711 6395 -207 -5394 116 6631 -226 -5768 331 5871
2629 5871 129 -6322 427 6009 -538 -6076 -139 5677 -1063 -6316 587 4960 -707 -6025 361
$$ packed form
2521D929j64r496q6R413r10q009N0Q593p2q320R81Q069q16q578O93Q861j096q862
2539d820J273Q011j372q496J145Q927j046r318J760Q860k647p733J673Q881k455
2554B643q493L415Q233k199p762J040Q060j352r342L445P376k342p562K103Q304
2569E567k623q558L610P921l570q138L209Q281m094q191M714P507m062p512L191
2584b748Q328k783q601L844Q032l941p630M364O880l470q646N760O816m394p603
2599e792M786O896m210q017N377P043n333p170N302O280m741o510M786P703o519
2614a19n961N903N538m711o276M915P106o602n187N510O515o857n542O099N540
2629E871n742o451O749N582o547n538N937N816o740n253O903M373n667n318O386
$$ plain form
2644 361 5721 -736 -6379 1371 5793 -392 -5786 1206 6536 -2017 -5833 1507 6177 -1121 -5052
2659 -5052 930 5839 -1049 -5404 1820 5872 -1493 -4788 2196 5655 -2250 -5707 1376 4650 -2259
2674 -2259 -5615 1556 4871 -2168 -6223 2553 5249 -3016 -5143 3281 5003 -2354 -4569 2521 4866
2689 4866 -2535 -4221 3264 4810 -1786 -4045 2668 5413 -2765 -4553 2508 4455 -3194 -4604 2821
2704 2821 4765 -2972 -4289 2969 4191 -3703 -5014 3026 3664 -3109 -4571 3645 3986 -3205 -4208
2719 -4208 3941 4562 -3414 -4497 4674 3480 -3605 -3969 4259 3730 -3205 -2900 3401 3564 -4419 -3721
2735 -3721 3568 3497 -4256 -3809 3855 3291 -3577 -3479 3290 3130 -4583 -3543 4645 2920 -3671 -2579 3484
2752 3484 4046 -3670 -2746 4320 2699 -4048 -3128 4232 2638 -4365 -1957 4327 2211 -4899 -2675 4739
$$ packed form
2644C61N360o457n643P750M422o185n394O992N330q553l816P340M670p298l931
2659e052N982M909o888m355P224M052p365l295O984L459p905l457P083L274o909
2674b259l356P171L315p039m055Q776K696q265k127Q424J722p357k215P090K345
2689D866p401j686P485J546o596k259O713K745q178j788P061J947p649j410P425
2704B821J944p737j317P258J222p894j311Q040O38o773j462Q216L41p191j003
2719d208Q149O21p976j083R171j194p085l64Q228n29o935L05O301J63p983O98
2735c721P289p1p753M47P664n64o868R8O769j60p713J040Q188j725o591J092O063
2752C484N62p716R24P066j621o747R20P360j594p003K408O284k116p110K224P414
$$ plain form
2768 4739 2895 -4794 -2246 4036 2578 -4524 -3003 4089 1556 -3688 -2805 4251 1945 -5078 -1956
2783 -1956 3933 1732 -3979 -1683 5536 2368 -4567 -1178 5082 1675 -3527 -1745 4966 1929 -4609
2798 -4609 -1146 4597 835 -4786 -1656 4523 769 -5913 -991 3995 1294 -5080 -1072 4541 793
2813 793 -5062 -649 4645 799 -4349 -971 4966 1136 -4641 -307 4911 710 -4145 -1010 4612
2828 4612 486 -4195 -874 4695 21 -4714 61 4459 -644 -4528 -377 4059 -1152 -4266 -534
2843 -534 4648 -14 -4360 697 4294 -433 -4146 585 5098 850 -4970 919 4773 -777 -4253
2858 -4253 225 4645 -56 -4861 -417 4569 -796 -3929 720 3736 -1253 -4248 985 4121 -600
2873 -600 -3728 673 3682 -577 -3892 686 4071 -695 -4049 1907 3000 -486 -3126 1824 4053
$$ packed form
2768D739j844p689K548O282j458p102J521P092k533n244Q83P056k306p023L122
2783a956N889k201n711K296P219l168o935L389O260l407n202J782O711l037o538
2798d609L463N743l762n621L130O179l754o682M922M986k701o374M008N613l748
2813G93n855M413N294l846n148L378N937l830n777M334N218m201m855L135N622
2828D612m126m681L321N569m674m735M775M398n103l884M151M436n211l114L732
2843e34N182m662m346N057L597m727l713M731M513m248n820N889L854n550l476
2858d253M478M420m701m805M444M986n365l133M649L016m989k995N233L136m721
2873f00l128M401L009m259l315M578L385m766l354N956J093l486k640M950K229
$$ plain form
2888 4053 -1475 -4825 1617 4601 -1808 -4730 553 3600 -1646 -3831 1943 4202 -1715 -4205 1531
2903 1531 3799 -1843 -3459 1883 3640 -2331 -3668 1778 4410 -1961 -3326 2498 3851 -1833 -3482
2918 -3482 2387 3756 -2422 -3668 2588 3196 -2218 -3322 2128 3185 -3335 -3870 1673 2520 -2274 -3271
2934 -3271 3243 3560 -3057 -3109 1925 3155 -3120 -2874 3603 3097 -2584 -3037 3384 3415 -2559 -2942 3071
2951 3071 3144 -2911 -2747 3552 2933 -3043 -2787 3027 3229 -3058 -3218 2740 3094 -3127 -2981 3231 2907
2968 2907 -3079 -2346 3894 2016 -3532 -2394 2742 2236 -3318 -1614 4171 1384 -3788 -1296 3335
2983 3335 2787 -3773 -2096 3505 2307 -3979 -2079 3740 1690 -3759 -2190 3482 1023 -4539 -1888
2998 -1888 4102 1020 -4078 -1509 3409 1099 -3699 -1348 2998 1627 -3454 -1295 4215 1995 -4156
$$ packed form
2888D053n528l350O442K984o409k922N283L047n246k185N774K259n917k490N736
2903A531K268n642j616N342J757n971j337N446K632o371j365N824J353n684j649
2918c482N869J369o178j246O256O08n414j104N450J057o520n35N543Q47m794r97
2934c271O514L17o617n2N034J230o275K46O477n06n681m53O421L1n974l83O013
2951C071P3o055J64O299o19n976K56N814K02o287j60N958L54o221J46O212l24
2968B907n986P33O240j878n548J138N136n06n554J704N785k787n172K492M631
2983C335n48o560J677N601j198o286J900N819k050n449J569N672k459n562K651
2998a888N990l082n098K569M918k310m798K351M346j371n081K159N510k220o151
$$ plain form
3013 -4156 -1271 3750 681 -3711 -1093 3848 1089 -3754 -784 3810 432 -4015 -910 3624 666
3028 666 -3855 -624 4118 617 -3878 -1111 3701 351 -4043 -1202 3423 259 -3733 -739 3491
3043 3491 580 -3817 630 3622 604 -3483 293 4354 -295 -4154 188 3273 -167 -3690 265
3058 265 3243 -162 -4544 123 3620 -344 -3188 52 3322 -145 -4163 416 3478 -742 -2903
3073 -2903 938 3179 283 -3474 75 4493 -522 -2913 841 3443 -683 -3890 847 3100 -1432
3088 -1432 -3495 855 3613 -740 -3617 633 3783 -548 -2899 522 2413 -1624 -3270 1003 3471
3103 3471 -1242 -3698 1350 3588 -1828 -3430 254 3449 -272 -2960 2365 3086 -2116 -2186 1394 3156
3119 3156 -1610 -3084 1248 2976 -1526 -3946 1269 2840 -2586 -3445 2017 2836 -2340 -2691 1263 2950
$$ packed form
3013d156K885N021l069m392K618M941k759m843K970M594l378m447L105M534k958
3028F66m521L231M742l501m495K767M812l350m394K841M625l164l992K994M230
3043C491k911m397M447K992l018m087L776M061m649l859M342L085l440l523L955
3058B65K978l405m382M667L497l964k844L240L270l467m018M579L062m220k161
3073b903L841K241k896l757L549M418n015k391L754K602m126l207M737K253m532
3088a432k063M350K758m353k877M250L150m331k351L421J891m037j646M273K468
3103C471m713k456N048K238n416j602L684L195l721k688N325P21n202p0L580J762
3119C156m766j474M332J728m502k420N215J571n426q59N462Q19n176l51L954J687
$$ plain form
3135 2950 -1858 -2035 1526 3002 -1824 -1781 1657 2296 -1169 -2601 1916 3010 -1949 -2961 1955 2856
3151 2856 -2595 -2764 2225 2671 -2307 -3310 2198 2953 -1657 -2367 1717 2392 -2679 -2630 2338 1665 -2194
3168 -2194 -2559 2488 2500 -1687 -2300 2714 2845 -2412 -2418 2843 2210 -2285 -2036 2993 2281 -2596 -2700 3234
3186 3234 1899 -2546 -1637 2115 1716 -2949 -1614 2178 1393 -3525 -1614 3435 1899 -2656 -1664 2301
3202 2301 2274 -1905 -1413 3550 1409 -2941 -1474 2176 1187 -2673 -1016 2951 1471 -3123 -1080 3114
3218 3114 1547 -2749 -1381 2810 391 -3075 -1453 2593 455 -2996 -955 2751 607 -3686 -700
3233 -700 2783 1354 -2409 -844 2774 337 -2641 -72 3499 1461 -3554 -1042 2740 -46 -3346
3248 -3346 -837 2678 542 -3356 -353 2607 142 -3187 -672 2529 807 -2368 -625 2478 312
$$ packed form
3135B950m808j77L561J476m826M3L438O39l465j432M517J094m959j012M916R01
3151B856n451j69M989M46m978j003N508P55m610p10M084O75n071M9M968o73l859
3168b194l65N047J2m187o13N014J31n257oN261o33m495K49N029p12m877j04N934
3186C234j335m445R09L752l99m665J335L792p85m918J911N049j536m555R92L965
3202B301k7m179M92M963k141m350J467L650r89l860J657L967j480m594K043M194
3218C114j567m296J368M191k419l466J622M046k138l451K041L706k144m293K986
3233g00L483j429l763J565L618k437k978K569L571k038n015K512L782k786l300
3248c346K509L515k136l898L003K960k465l329K515L201j722l175J743L103k166
$$ plain form
3263 312 -3544 -96 3595 455 -2479 712 2668 -557 -3103 378 3208 -605 -2985 991 3022
3278 3022 -490 -2122 463 2497 -407 -3264 43 3575 -643 -3323 505 3663 -1343 -3120 -430
3293 -430 3052 -975 -3121 -224 3243 -864 -3029 946 2938 -203 -2710 668 2725 -1049 -2193
3308 -2193 820 3180 -884 -2386 519 2188 -1547 -2175 1127 2582 -1430 -3142 968 3108 -1454
3323 -1454 -2784 631 2191 -1176 -2361 1350 3091 -1463 -2869 2179 2362 -759 -2623 1408 2162
3338 2162 -966 -2854 1883 2503 -1053 -2814 2261 2032 -1473 -1949 1602 2369 -1675 -1613 1575 2767
3354 2767 -1223 -2285 1604 1556 -2057 -2313 1646 2252 -1702 -2483 2286 2235 -1167 -1952 1776 2518 -1465
3371 -1465 -1890 2012 1335 -1865 -1457 1870 1978 -2145 -2377 2285 1887 -1230 -1493 795 1723 -2109 -1753
$$ packed form
3263C12l856L448L691l140k934L191J956l225k546L481K830l813k380L976K031
3278C022l512j632K585K034k904k857L307L532m218k680L828L158n006j777K690
3293d30L482m027k146K897L467m107k165L975J992l141k507L378K057l774j144
3308b193L013K360m064j502K905J669l735o28L302J455m012j712M110K140m562
3323a454j330L415J560l367j185L711J741m554j406N048J83l121j864M031P54
3338B162l128j888M737O20l556j761N075k29l505m76L551P67m044O2L188J192
3354B767l990j062L889m8l613k56L959O06l954p81M769n1l402p85L728P42l983
3371a465m25L902o77l200M08L327J08m123k32M662l98l117k63K288R28l832L56
$$ plain form
3388 -1753 1334 1279 -2481 -1778 2282 1763 -1736 -1047 1682 1697 -2159 -796 2086 1479 -1530 -1251 2938
3405 2938 852 -1901 -881 1553 768 -1892 -471 2142 933 -2462 -1199 1799 1045 -2392 -1605 1813
3421 1813 1486 -3186 -1259 2124 703 -1715 -588 1902 1374 -2975 -972 2840 781 -2246 -1501 2359
3437 2359 863 -2942 -918 2621 883 -2108 -735 1854 730 -2231 -365 2478 528 -2513 -574
3452 -574 2573 466 -3163 -122 2991 -113 -1648 -57 1815 668 -2237 -386 2766 477 -2259
3467 -2259 -322 2209 156 -2726 115 2308 212 -2406 540 2569 -529 -2730 -41 1887 -90
3482 -90 -2298 132 2445 636 -2206 316 2302 -730 -2465 -245 2570 365 -2888 368 2395
3497 2395 -309 -2055 -59 2881 -447 -2047 -68 2887 -790 -3363 877 2367 -439 -2380 273
$$ packed form
3388a753L087n5l760P03M060n19l499O89K729J5l856J363K882o07l009K79M189
3405B938k086k753J020K434p85k660J421K613j209l395J263K998p54l437P87L418
3421A813l27m672J927L383j421k418J127K490n28m349K003L812k059l027P45L860
3437B359j496l805K024L539j738k991J373K589j124k961J866K843j950l041J939
3452e74L147k107l629L041L113l104j535J591J872j147k905J851L152k289k736
3467b259J937K531k053k882K841K193k096k618K946K029l098k201K689J928j977
3482i0k208K430K313j809k842K522J986l032j735K220K815k205l253L256K027
3497B395k704j746J996K940l328j600J979K955l677k573M240J490k806j941K653
$$ plain form
3512 273 1895 -1248 -2695 787 1432 -1058 -2401 -148 2160 -1215 -1633 872 1753 -760 -2689 240
3528 240 2751 -1130 -2352 1419 2288 -1129 -2366 2004 2118 -1542 -2372 991 2062 -627 -1950 1045
3544 1045 2068 -1144 -2086 1350 1761 -1756 -1641 1027 2098 -1653 -1408 1205 1872 -872 -1851 1755
3560 1755 2462 -1016 -1322 1228 2013 -1245 -1477 1585 1757 -2019 -2276 1023 2488 -904 -1862 1553 1618
3577 1618 -1835 -2029 1188 1123 -1636 -1568 933 1061 -1988 -1405 1724 1456 -1834 -914 1582 1142 -1159
3594 -1159 -1571 1324 1955 -1131 -826 2018 541 -1559 -2211 1878 1045 -2414 -1513 1719 807 -2046 -1758
3611 -1758 1842 952 -2328 -969 1814 657 -1631 -1134 1529 716 -2098 -917 2214 254 -1796 -585
3627 -585 1871 1367 -1740 -237 1727 1064 -2058 -322 2257 622 -2092 -850 2612 147 -2425 -582
$$ packed form
3512B73J622l143j447L482O45k490j343K253K308l375m18K505Q81k513j929K929
3528B40K511l881j222L771Q69l417j237M370J14l660q30L363J071k689j323K995
3544A045J023l212r42L436M11l517J15K668J071l751K45K613O67k744r79L606
3560A755P07l478l06K550P85l258k32L062J72l776k57L299J465l392r58L415O5
3577A618l453j94L217o5k759O8K501J28l049N83L129k68l290R20K496m40k301
3594a159m12K895O31l086L05K844j477k100o52M089q33l459R01L232r12k853K88
3611a758L600q90l280J359K783j157k288M97K663q13k814J181L131j960k050J211
3627e85K456n04l107J503J964o63l122J736K579j635k714J242L462k465k572J843
$$ plain form
3643 -582 1589 560 -2821 -1461 1966 152 -2464 -734 1808 476 -1639 -263 1884 313 -1743
3658 -1743 62 1594 511 -2200 119 2234 1108 -1401 765 2156 213 -1153 -502 1334 126
3673 126 -2727 207 1945 97 -2133 -65 1613 43 -1232 578 1443 -173 -2216 0 1561
3688 1561 -639 -1909 323 2525 -511 -2364 224 2291 -166 -2047 -416 2509 -207 -2042 517
3703 517 1223 -460 -2069 137 802 -761 -1602 -17 2146 -509 -2109 38 2234 -1186 -2323 1086
3719 1086 1884 -638 -1889 1063 1703 -617 -2105 1012 1530 -331 -2103 721 1860 -638 -1303 1072
3735 1072 1814 -1126 -1447 1319 1646 -618 -2557 239 1533 -884 -1749 952 2044 -822 -1884 1092
3751 1092 1921 -1222 -1760 690 2195 -1623 -1103 1397 1594 -1567 -1596 637 2415 -763 -2485 886
$$ packed form
3643e82K171j029l381J360L427j814k616J730K542j332k115J376K147j571k056
3658a743J805J532j083k711K319K115j126k509K166J391j943j366O51J836j208
3673A26k853K934J738j848k230K068J678j570j275J810Q65j616k043K216J561
3688A561k200j270K232K202l036j853K588K067k457j881J631K925k716j835K559
3703E17P06j683j609K206O65j563q41J585K163k655j600K147K196l420j137L409
3719A086P98k522j251K952O40k320j488L117N18j861j772K824J139k498o65K375
3735A072P42k940l21K766L27k264j939K796J294k417q65K701J092k866j062K976
3751A092Q29l143n38K450J505l818N20K500J97l161k9K233J778l178j722L371
$$ plain form
3767 886 2008 -1720 -1300 1329 926 -1492 -1294 1491 1123 -994 -1071 1705 888 -1965 -1998 1627 1215 -1804
3785 -1804 -1587 1316 479 -1314 -1061 2072 929 -1596 -1328 1006 1416 -1400 -1393 1225 1253 -1570 -748 1216
3803 1216 638 -1431 -1287 1354 786 -1630 -1149 1446 1144 -1572 -1004 791 530 -2254 -557 1523 1343
3820 1343 -1386 -719 1530 1111 -852 -521 1361 996 -1690 -1031 2366 189 -1626 -607 1936 177
3836 177 -1453 -1362 1730 168 -2180 -518 1961 209 -2024 -1290 2131 133 -1483 -140 2084 1039
3852 1039 -1527 470 2266 713 -1498 -414 1689 -68 -2036 -717 1466 -5 -1711 -232 1850
3867 1850 35 -1741 22 2081 784 -2329 254 2051 141 -1514 138 2507 -790 -1902 322
3882 322 2214 -344 -1469 235 2037 -120 -1601 385 1574 444 -1844 217 1927 -576 -2368
$$ packed form
3767H86J122l728M20K629m03k418J98K785l68k117p7K776q17k853l3L625m12l019
3785a804K17K903q37j793K53L133j143k525K68K334M10k816PK618K8k823Q22J964
3803A216n78k069J44K641n68k416M81K595l02k716N68J795k61k784J697K080j80
3820A343k729O67K249m19j963L31J882l65k686O59L397k177j815J019K543j759
3836A77j630R1L092j562k348J662K479j752k233P34L421j998j616J343K224j045
3852A039k566J997J796j553k211J084K103j757j968J319K183j471j706J479K082
3867A850j815j776J763K059j297l113K583J797j910j655J652K369l297j112K224
3882C22J892k558j125J704J802k157j481J986J189j130k288K061J710k503j792
$$ plain form
3897 -2368 196 1354 171 -1992 717 2136 -709 -2445 311 2096 -1107 -2084 309 1583 -1284
3912 -1284 -1236 -274 1790 168 -1108 354 1576 1172 -1955 722 1976 -1372 -1288 647 1811 -1138
3928 -1138 -2023 640 1630 -539 -1768 811 1621 -609 -1217 422 1530 -781 -1784 516 1790 -1062
3944 -1062 -1614 872 1511 -965 -1183 1134 1029 -282 -1517 1153 782 -946 -1338 1549 1439 -1066 -1280
3961 -1280 571 1566 -1077 -1110 1420 1113 -1331 -1246 1357 1131 -1292 -1305 618 1539 -1158 -914 694 1307
3979 1307 -587 -1661 1161 887 -942 -905 1033 1402 -1478 -1344 1696 637 -1845 -1094 602 362 -958
3996 -958 -1059 1349 1411 -2132 -359 1689 700 -988 -1197 733 1731 -843 -1281 2107 1287 -1506 -758
4013 -758 733 518 -1036 -876 1854 368 -1639 -1361 1560 963 -1418 -148 1805 1398 -1504 -1191 1998
$$ packed form
3897b368K564J158j183k163K709J419k845j736K756J785l203r77K393J274k867
3912a284M8R62K064j622j276J462J222m04l127K677J254l348Q4J935J164k949
3928a138q85K663R90k169j229K579Q10k230o08J639J108k311j003K300J274k852
3944a062n52K486O39k476k18K317j05j311j235K670l71j728l92K887j10k505k14
3961a280J851R95k643l3K530l07k444Q5K603k26k423j3J923R21k697K44J608O13
3979A307j894j074K822k74j829L7J938L69k880J34L040j059k482P51J696k40j320
3996i58j01K408O2l543J773K048r89j688k09J930R98k574m38L388q20k793P48
4013g58J491k15j554J60K730j486k007K78K921n97k381J270J953m07k902L13L189
$$ plain form
4030 1998 719 -1480 -518 2279 68 -1912 -430 1859 825 -1377 -573 1581 848 -1802 -678 1426
4046 1426 330 -2039 -268 1462 283 -1085 -337 1157 807 -2250 -238 1805 357 -1579 -365
4061 -365 1322 -265 -1878 252 1789 -371 -1781 -312 1847 117 -1438 189 1691 -162 -1388
4076 -1388 -313 1026 386 -1474 444 1966 1004 -1853 53 1763 113 -1631 -85 1416 -438
$$ packed form
4030A998j279k199R62K797k211j980J482K289j034k202Q04K154p33k650J124K104
4046A426j096k369J771J730j179j368P48J494l50l057K012K043j448j936J214
4061c65J687j587j613K130J537k160j410J469K159j730j555J627J502j853j226
4076a388J075J339o40j860J918J522r62k857J906J710j650j744J546J501j854
$$ [...]
8191F80
##END NTUPLES=NMR FID
##END=
