##TITLE=1H_Ser DAH-1
 CDCl3
 8 sc, 
 15.2.2023
##JCAMPDX= 6.0         $$ Bruker NMR JCAMP-DX V2.0
##DATA TYPE= NMR FID
##DATA CLASS= NTUPLES
##ORIGIN= UXNMR, Bruker Analytische Messtechnik GmbH
##OWNER= root
$$ XWIN-NMR		Version 3.5
$$ Wed Feb 15 16:27:20 2023 Russian Standard Time (UT+4h)  she@DPX200
##.OBSERVE FREQUENCY= 200.13135
##.OBSERVE NUCLEUS= ^1H
##.DELAY= (6, 6)
##.ACQUISITION MODE= SIMULTANEOUS
##.ACQUISITION SCHEME= undefined
##.AVERAGES= 8
##.DIGITISER RES= 18
##SPECTROMETER/DATA SYSTEM= spect
##.PULSE SEQUENCE= zg30
##.SOLVENT NAME= CD3CN
##.SHIFT REFERENCE= (INTERNAL, CD3CN, 0, 15.7039)
##AUDIT TRAIL= $$ (NUMBER, WHEN, WHO, WHERE, WHAT)
$$ ##TITLE= Audit trail, XWIN-NMR		Version 3.5
$$ ##JCAMPDX= 5.01
$$ ##ORIGIN= Bruker BioSpin GmbH
$$ ##OWNER= she
$$ F:/spectra/data/she/nmr/H-F/1/audita.txt
$$ ##AUDIT TRAIL=  $$ (NUMBER, WHEN, WHO, WHERE, WHAT)
(   1,<2023-02-15 16:26:04.70 +0400>,<she>,<DPX200>,
      <created by zg, POWCHK disabled, PULCHK disabled
       configuration hash MD5:
       00 E9 B6 7A A2 85 ED C7 34 08 36 98 17 FE 4E 26
       data hash MD5: 16K
       79 B3 D2 AC 8A BA DE F7 5B C5 28 F3 EE 20 06 17>)
$$ ##END=
$$ 
$$ hash MD5
$$ D6 6E E5 62 CD 57 60 23 F4 AF EF 8C FB DC E9 84
##$RELAX= 
##$RELAX= 
##$RELAX= 
##$RELAX= 
##$RELAX= 
##$RELAX= 
$$ Bruker specific parameters
$$ --------------------------
##$DU= <F:/spectra>
##$EXPNO= 1
##$NAME= <H-F>
##$PROCNO= 1
##$TYPE= <nmr>
##$USER= <she>
##$AMP= (0..31)
100 100 100 100 100 100 100 100 100 100 100 100 100 100 100 100 100 100 
100 100 100 100 100 100 100 100 100 100 100 100 100 100 
##$AQSEQ= 0
##$AQ_mod= 1
##$AUNM= <au_zg>
##$AUTOPOS= <>
##$BF1= 200.13
##$BF2= 200.13
##$BF3= 200.13
##$BF4= 200.13
##$BF5= 200.13
##$BF6= 200.13
##$BF7= 200.13
##$BF8= 200.13
##$BYTORDA= 1
##$CFDGTYP= 0
##$CFRGTYP= 5
##$CHEMSTR= <none>
##$CNST= (0..31)
1 1 145 1 1 1 1 1 1 1 1 1 1 1 1 1 1 1 1 1 1 1 1 1 1 1 1 1 1 1 1 1 
##$CPDPRG= <>
##$CPDPRG1= <>
##$CPDPRG2= <>
##$CPDPRG3= <>
##$CPDPRG4= <mlev>
##$CPDPRG5= <mlev>
##$CPDPRG6= <mlev>
##$CPDPRG7= <mlev>
##$CPDPRG8= <mlev>
##$CPDPRGB= <>
##$CPDPRGT= <>
##$D= (0..31)
0 1.2 0 0 0 0 0 0 0 0.06 0 0.03 0 0 0 0 0.0002 0 0 0 0 0 0 0 0 0 0 0 0 
0 0 0 
##$DATE= 1676463964
##$DBL= (0..7)
120 120 120 120 120 120 120 120 
##$DBP= (0..7)
150 150 150 150 150 150 150 150 
##$DBP07= 0
##$DBPNAM0= <>
##$DBPNAM1= <>
##$DBPNAM2= <>
##$DBPNAM3= <>
##$DBPNAM4= <>
##$DBPNAM5= <>
##$DBPNAM6= <>
##$DBPNAM7= <>
##$DBPOAL= (0..7)
0.5 0.5 0.5 0.5 0.5 0.5 0.5 0.5 
##$DBPOFFS= (0..7)
0 0 0 0 0 0 0 0 
##$DE= 6
##$DECBNUC= <off>
##$DECIM= 32
##$DECNUC= <off>
##$DECSTAT= 4
##$DIGMOD= 1
##$DIGTYP= 9
##$DL= (0..7)
0 120 120 120 120 120 120 120 
##$DP= (0..7)
150 150 150 150 150 150 150 150 
##$DP07= 0
##$DPNAME0= <>
##$DPNAME1= <>
##$DPNAME2= <>
##$DPNAME3= <>
##$DPNAME4= <>
##$DPNAME5= <>
##$DPNAME6= <>
##$DPNAME7= <>
##$DPOAL= (0..7)
0.5 0.5 0.5 0.5 0.5 0.5 0.5 0.5 
##$DPOFFS= (0..7)
0 0 0 0 0 0 0 0 
##$DQDMODE= 0
##$DR= 18
##$DS= 0
##$DSLIST= <SSSSSSSSSSSSSSS>
$$ [...]
##$SUBNAM2= <"">
##$SUBNAM3= <"">
##$SUBNAM4= <"">
##$SUBNAM5= <"">
##$SUBNAM6= <"">
##$SUBNAM7= <"">
##$SUBNAM8= <"">
##$SUBNAM9= <"">
##$SW= 18.05172834244
##$SWIBOX= (0..15)
0 0 2 0 0 0 0 0 0 0 0 0 0 0 0 0 
##$SW_h= 3612.71676300578
##$TD= 16384
##$TD0= 1
##$TE= 0
##$TE2= 300
##$TE3= 300
##$TEG= 300
##$TL= (0..7)
0 120 120 120 120 120 120 120 
##$TP= (0..7)
150 150 150 150 150 150 150 150 
##$TP07= 0
##$TPNAME0= <>
##$TPNAME1= <>
##$TPNAME2= <>
##$TPNAME3= <>
##$TPNAME4= <>
##$TPNAME5= <>
##$TPNAME6= <>
##$TPNAME7= <>
##$TPOAL= (0..7)
0.5 0.5 0.5 0.5 0.5 0.5 0.5 0.5 
##$TPOFFS= (0..7)
0 0 0 0 0 0 0 0 
##$TUNHIN= 0
##$TUNHOUT= 0
##$TUNXOUT= 0
##$USERA1= <user>
##$USERA2= <user>
##$USERA3= <user>
##$USERA4= <user>
##$USERA5= <user>
##$V9= 5
##$VALIST= <valist>
##$VCLIST= <CCCCCCCCCCCCCCC>
##$VD= 0
##$VDLIST= <DDDDDDDDDDDDDDD>
##$VPLIST= <PPPPPPPPPPPPPPP>
##$VTLIST= <TTTTTTTTTTTTTTT>
##$WBST= 1024
##$WBSW= 4
##$XGAIN= (0..3)
0 0 0 0 
##$XL= 0
##$YL= 0
##$YMAX_a= 154948
##$YMIN_a= -279339
##$ZGOPTNS= <>
##$ZL1= 120
##$ZL2= 120
##$ZL3= 120
##$ZL4= 120
##$ABSF1= 10
##$ABSF2= 0
##$ABSG= 5
##$ABSL= 3
##$ALPHA= 0
##$AQORDER= 0
##$ASSFAC= 0
##$ASSFACI= 0
##$ASSFACX= 0
##$ASSWID= 0
##$AUNMP= <proc_1d>
##$AZFE= 0.1
##$AZFW= 0.1
##$BCFW= 1
##$BC_mod= 2
##$BYTORDP= 1
##$COROFFS= 0
##$CY= 11.3945322036743
##$DATMOD= 1
##$DC= 2
##$DFILT= <>
##$DTYPP= 0
##$F1P= 2.36226072786647
##$F2P= -0.459571619588291
##$FCOR= 0.5
##$FTSIZE= 0
##$FT_mod= 4
##$GAMMA= 1
##$GB= 0.15
##$INTBC= 1
##$INTSCL= 1
##$ISEN= 128
##$LB= 0.24
##$LEV0= 0
##$LPBIN= 0
##$MAXI= 10000
##$MC2= 0
##$MEAN= 0
##$ME_mod= 0
##$MI= 1.114404
##$NCOEF= 0
##$NC_proc= 0
##$NLEV= 6
##$NOISF1= 3.799351
##$NOISF2= 2.8
##$NSP= 1
##$NTH_PI= 0
##$NZP= 0
##$OFFSET= 15.70392
##$PC= 1
##$PHC0= -19119.23
##$PHC1= 21.80078
##$PH_mod= 1
##$PKNL= yes
##$PPARMOD= 0
##$PSCAL= 0
##$PSIGN= 0
##$REVERSE= no
##$SF= 200.130013532006
##$SI= 16384
##$SIGF1= 3
##$SIGF2= 2
##$SINO= 400
##$SIOLD= 16384
##$SREGLST= <1H.CDCl3>
##$SSB= 0
##$STSI= 0
##$STSR= 0
##$SW_p= 3612.71676300578
##$SYMM= 0
##$S_DEV= 0
##$TDeff= 0
##$TDoff= 0
##$TI= <>
##$TILT= no
##$TM1= 0
##$TM2= 0
##$TOPLEV= 0
##$USERP1= <user>
##$USERP2= <user>
##$USERP3= <user>
##$USERP4= <user>
##$USERP5= <user>
##$WDW= 1
##$XDIM= 8192
##$YMAX_p= 0
##$YMIN_p= 0
$$ End of Bruker specific parameters
$$ ---------------------------------
##NTUPLES= NMR FID
##VAR_NAME=  TIME,          FID/REAL,        FID/IMAG
##SYMBOL=    X,             R,               I
##VAR_TYPE=  INDEPENDENT,   DEPENDENT,       DEPENDENT
##VAR_FORM=  AFFN,          ASDF,            ASDF
##VAR_DIM=   8192,          8192,            8192
##UNITS=     SECONDS,       ARBITRARY UNITS, ARBITRARY UNITS
##FACTOR=    0.0002768,     1,               1
##FIRST=     0,             0,               0
##LAST=      2.2672688,     0,               0
##MIN=       0,             -279339,         0
##MAX=       2.2672688,     154948,          0
$$ Real data points
##PAGE= N=1
##DATA TABLE= (X++(R..R)), XYDATA
0 0 0 0 0 0 0 0 0 0 0 0 0 8 -8 8 -8 16 -16 24 -24 32 -35 41 -50 64 -72 81 -96 112 -129 149 -169 193 -220
33 -220 249 -282 318 -357 399 -447 499 -555 618 -686 759 -840 928 -1024 1129 -1245 1372
50 1372 -1511 1665 -1834 2024 -2237 2475 -2746 3057 -3418 3842 -4351 4970 -5751 6763 -8132
65 -8132 10104 -13202 18796 -32131 135396 9152 -188834 49547 -43822 -139227 33758
76 33758 120345 -25098 6230 26749 -76373 -4522 122209 -51079 -91497 98473 26532
87 26532 -131668 34432 105762 -73052 -69975 67513 -12965 -63305 67861 53548 -46888
98 -46888 25755 17907 -87107 -6913 60090 -37911 -1587 99435 -12578 -92012 47227 49972
110 49972 -92092 -12465 90424 -30142 -51441 54412 11368 -33100 24261 -10508 -51904
121 -51904 36456 34828 -70361 2315 92023 -45124 -83947 66946 40875 -62922 9102
132 9102 50099 -21183 -14604 14808 -25326 -1968 49737 -21787 -43877 61952 28677 -72958
144 -72958 4456 59683 -32114 -39766 29946 7832 -24245 13724 8557 -23280 15859 13637 -43577
157 -43577 2312 43905 -26175 -24899 40566 4116 -40448 12275 30673 -23973 -10227 32736
169 32736 -5752 -18389 23945 2771 -15243 14613 -7670 -25732 20873 19412 -30321 -1848
181 -1848 44319 -14615 -49513 22542 28811 -32384 -11611 21245 1145 -4456 -4722 -10138 13756
194 13756 20625 -23061 -22721 38957 20452 -46816 -3967 47199 -9199 -34693 12402 22605 -2346
207 -2346 -9184 -1092 6893 9090 -9895 -24447 10990 26599 -25617 -22259 33643 10834 -31471
220 -31471 -2272 22169 -5762 -19775 4914 11063 -3530 129 -451 773 12591 -6758 -14092
233 -14092 19638 11393 -23145 -3526 25688 -3136 -26643 11175 26112 -14654 -15725 13896
245 13896 6409 -9045 -12378 -4392 15188 5278 -21592 -4754 27440 5172 -34202 -2318 36018
258 36018 -7790 -32760 11941 25211 -5295 -16182 2284 18609 4867 -17058 -8399 18693
270 18693 14317 -22360 -14878 29235 8888 -31037 -3166 23422 -1020 -18260 16 14086
282 14086 -1853 -12783 -3230 3741 5133 -5475 -9140 13383 10654 -16159 -3393 15979 -1806
295 -1806 -15442 5054 17426 -5117 -11530 11938 8647 -8977 -6089 2608 8447 -187 -13591
308 -13591 1675 15821 -2260 -18148 274 18531 -5962 -23593 6379 18461 -7481 -13720
320 -13720 3814 14087 656 -15741 -2053 15214 3532 -13473 -5456 18118 8498 -18769
332 -18769 -3751 19216 4317 -13055 -4161 11053 5695 -13057 -7327 9224 6303 -6563 -9314
345 -9314 6168 10062 -10510 -10659 7530 5625 -6311 -6238 5667 7570 -6736 -5234 7169 3526
359 3526 -3452 -1887 5677 5621 -6133 -2989 8464 759 -6312 -245 7217 3461 -9853 -3814 11306
374 11306 553 -13204 -3501 11787 4286 -15728 -4309 17331 1823 -16555 -3880 12636
386 12636 5934 -14454 -8374 17209 11034 -13456 -9917 14964 13475 -17351 -14128 19885 12246
399 12246 -16165 -7535 14132 9062 -12097 -11412 9960 9315 -8673 -11514 5886 13380 -9136 -16691
413 -16691 11212 11792 -13881 -7545 12140 5406 -11107 -3722 10879 1954 -7187 626 4800 4186
427 4186 -3850 -6677 9534 7974 -12309 -4835 14785 3833 -16487 -2285 18062 -2582 -18062
440 -18062 4333 11985 -4140 -10019 -2074 10490 5591 -14213 -8773 14737 8681 -18121 -9642
453 -9642 23528 7235 -23263 -1093 20006 534 -12429 -1108 10543 6840 -7100 -9018 5652
466 5652 12274 -7757 -16520 12679 16107 -16368 -9785 14532 1867 -12986 -1595 6946 -794
479 -794 -4092 379 -329 2169 3049 -7704 218 11062 -6614 -7962 12671 4819 -12058 1028
493 1028 14401 -2950 -11672 7456 7166 -8120 -2752 2657 1130 4525 -5103 -8929 8515 7778
507 7778 -14286 -8780 16682 4595 -20877 -464 17526 -4116 -10736 3391 4898 3263 -1531
520 -1531 -8379 3116 13175 -4554 -15855 10026 18300 -14326 -12572 17863 6300 -12954 -828
533 -828 5854 -425 -2232 -3942 -3314 6288 5420 -12338 -5385 16667 -1277 -17353 7936 10557 -12152
548 -12152 -5406 10148 1379 -5609 3492 3156 -4014 3366 2005 -5398 6236 3888 -12050 3127
562 3127 13764 -8668 -10048 13741 6474 -17934 -4281 15608 -2719 -11185 4458 4321 -295
575 -295 -1491 -9916 -8 14085 -3851 -16965 9189 19326 -14092 -16778 19911 12286 -17935
588 -17935 -4675 11752 2369 -3513 -3034 862 8957 1561 -14263 -2988 18930 -765 -21545
601 -21545 7062 16734 -14779 -11300 13883 4455 -10576 -1957 4411 -659 -341 716 -2592 4857
615 4857 3350 -12295 375 16452 -5286 -11119 13552 8257 -15994 -4361 16539 630 -12784
628 -12784 5020 7121 -5122 -2486 -1979 837 9131 -3966 -14014 6596 12643 -12744 -12212 17917
642 17917 9372 -20324 -4138 15768 -825 -7759 1853 3149 2902 -1012 -7852 2224 15395 -475
656 -475 -16270 4886 15196 -12289 -11249 15014 5206 -11216 -1391 4557 -972 -572 201 -3880
670 -3880 963 4332 -8615 -4655 13043 -93 -12421 6095 7333 -9776 -2149 11369 648
683 648 -7184 3840 3335 -6281 1514 4056 -2535 5023 2399 -9926 1251 10682 -6473 -9712 10025
698 10025 6855 -14431 -4785 12963 -124 -7891 1480 545 69 1396 -6492 -884 11940 456
712 456 -14682 2030 16223 -5332 -12611 10676 8744 -9653 -3499 5269 3095 932 -2880 -3931
726 -3931 4181 4808 -8772 -5450 13286 2515 -16054 1130 11417 -6823 -7575 7240 3822 -5196
740 -5196 -2011 1718 163 1646 -3 -4551 4751 5074 -9627 -822 12922 -2851 -10047 6837
754 6837 7896 -8372 -5018 9301 1793 -7569 -94 2268 475 972 -5348 -1296 9459 -1663
768 -1663 -12909 3003 12759 -6585 -12654 9358 10041 -10355 -5439 8167 4071 -2406 -4470 -377
782 -377 7976 2533 -9419 -1472 12316 787 -14920 1622 14546 -4989 -9855 6481 5533 -5039
796 -5039 -4974 639 2891 618 -3422 -2771 4683 3581 -8257 -2663 10339 -1833 -9713 5624 7463
811 7463 -5985 -3944 6944 3296 -5344 -807 3970 646 -668 -3018 -384 7214 -1171 -9280 4124
826 4124 8802 -6426 -9199 6831 7385 -9266 -5920 8043 2679 -5315 -3129 1881 6023 -690
840 -690 -7791 1452 9570 -1481 -9988 3091 11563 -4317 -9260 6480 6713 -4519 -3919 1617 3882
855 3882 285 -5078 -1281 4275 1773 -6120 -2748 7279 660 -7988 1168 5272 -3226 -3635 1824
870 1824 2197 -1293 -1202 1505 976 296 -324 -887 3057 1210 -4412 1817 5091 -2818 -3779 3906 3932 -3825
888 -3825 -3814 3658 2375 -3766 -2485 1078 2848 -604 -6388 -158 6390 -1797 -6907 1199 7571 -674
904 -674 -7739 1575 7289 -1877 -5499 513 5665 2414 -5769 -1872 7209 2193 -6235 -2807 6591
919 6591 3087 -7353 -2711 6975 1052 -6039 -1899 4066 1946 -5409 -3084 4839 1644 -4223 -1974
934 -1974 3988 2272 -5038 -1771 5540 335 -4473 525 4410 706 -4788 97 5564 -946 -4632
949 -4632 1490 4758 -675 -6045 442 6535 -2304 -6647 1916 5553 -1417 -6970 439 7683 -1556
964 -1556 -8022 1528 7343 -1062 -8360 635 9309 -712 -7726 1696 7612 57 -6539 -760 7828
979 7828 894 -6983 -557 6666 1562 -7058 -2003 7314 461 -7242 108 4872 -443 -4644 -1208
994 -1208 3827 254 -4001 -216 3141 791 -3288 -910 4526 368 -4840 2074 4736 -1947 -3314
1009 -3314 2064 3731 -2191 -2925 3044 2661 -2004 -2819 101 4096 -308 -6400 1090 5746 -2266 -6520
1025 -6520 1447 5988 -2843 -6828 2771 4881 -2155 -3388 -143 4158 1714 -4874 -1685 6248 2007
1040 2007 -5968 -1675 7274 1893 -6989 250 5399 -1137 -3202 -256 1866 1881 -2403 -3206 2316 3099
1056 3099 -2744 -4403 3435 3384 -5555 -1787 5301 -659 -3751 1321 2142 -186 -659 384 760 531
1072 531 -136 -1483 1991 3695 -3845 -2079 5750 195 -5829 1415 5260 -2079 -4954 2127 3425
1087 3425 -2478 -2286 -253 1600 1859 -3670 -4015 5313 3152 -7131 -2591 7746 2052 -7996 10
1102 10 7425 -909 -4435 710 2514 2145 -1358 -3788 3009 4859 -3692 -5772 4965 5626 -6327
1117 -6327 -3888 6677 497 -6229 452 3172 -173 -1387 -1340 252 2011 -231 -3376 1420 5102
1132 5102 -3479 -4903 6482 3048 -6658 630 6633 -1440 -4550 2474 3719 -1443 -1886 696 602
1147 602 1765 -2373 -4388 4980 4049 -7746 -2815 7992 680 -8496 697 7588 -2342 -5901 2282
1162 2282 3079 -33 -1135 -2237 2494 4701 -4466 -5013 6764 5318 -7258 -3633 8288 1000 -7714
1177 -7714 1548 5327 -2005 -2198 -714 -117 2074 -323 -3715 585 4078 -3427 -5501 5340 4056
1192 4056 -6598 -275 6106 -2740 -3851 3749 2521 -1983 -109 1276 -547 653 778 -2370 2282
1207 2282 3951 -5493 -2910 7184 659 -6759 1788 5284 -3454 -4951 2762 2333 -2060 -318 -1135
1222 -1135 -246 3395 -1870 -4493 5031 4417 -6237 -3498 6470 1991 -6012 1540 5270 -1943 -2195
1237 -2195 694 -580 2443 1362 -4092 82 4802 -1909 -5668 3510 5336 -5453 -3750 4780 -376
1252 -376 -3784 1735 1095 -878 221 -880 -1320 2382 1629 -3545 -12 5316 -2214 -4425 5310 2807
1268 2807 -5166 248 4314 -1706 -2965 1600 1743 -749 -202 -1351 -646 3244 -692 -5008 3306 4581
1284 4581 -6261 -3841 6265 2104 -6033 -886 5119 -865 -3417 571 1497 2313 120 -4666 698
1299 698 5839 -2430 -5541 4219 5679 -4900 -4626 5632 2244 -4809 -313 2147 -284 -791 -2026
1314 -2026 -461 3489 96 -4230 -232 4635 -2148 -5072 4171 3593 -5083 -1316 4744 -618 -2653
1329 -2653 867 1665 -65 -666 -378 333 2599 -322 -3882 2270 3970 -4746 -2938 5833 1685 -5671
1345 -5671 -798 4384 -461 -3684 357 2156 409 -1203 -2788 1064 4330 -2593 -4532 4391 4272
1360 4272 -4776 -3425 5347 2687 -4547 -880 3557 179 -1793 -1085 484 2936 -469 -4087 943
1375 943 3955 -1995 -4197 2437 3533 -3983 -2541 3537 227 -2235 100 405 379 -114 -995 12
1391 12 1629 221 -1987 1086 3147 -2456 -2380 3989 998 -3407 174 2955 -597 -2052 642 1763
1407 1763 -438 -1173 -1259 380 2391 -1760 -3639 2922 2919 -3639 -2167 3583 1732 -3568 -1386 2787
1423 2787 918 -1337 -825 298 2501 179 -3327 537 3723 -1021 -3730 1279 3542 -1828 -2887
1438 -2887 2049 1722 -1702 -900 170 640 727 -2149 -865 2069 261 -2434 -296 3171 -87 -2927
1454 -2927 1507 2566 -1741 -1194 1560 736 -674 -656 997 1327 -250 -1139 299 1912 -597 -3334
1470 -3334 1438 3009 -2494 -2714 2447 2039 -2532 -2333 2177 2086 -2228 -2280 1477 2320 -873 -3541 1232
1487 1232 3915 -1500 -3720 1837 3878 -1343 -3422 1928 3555 -1838 -2622 1442 2751 -586 -3021
1502 -3021 98 3052 -707 -3293 568 2628 -709 -3048 646 2883 -1682 -2460 1252 1796 -1154
1517 -1154 -1452 1265 1834 -1195 -1725 1791 1514 -971 -1419 1530 2264 -1779 -1983 2280 1818 -1867 -1802
1534 -1802 2048 1984 -2270 -2355 2248 1329 -2183 -1574 1696 2125 -1979 -2301 1766 2174 -1759 -1994 1519
1551 1519 2725 -1502 -2624 2099 2778 -1574 -2029 1063 2445 -1021 -2252 1142 2057 -801 -1628 100
1567 100 2190 -89 -2506 -14 1826 -552 -1961 222 1956 -1072 -2150 907 1316 -1119 -334 520
1583 520 1093 200 -1185 314 1485 -266 -959 309 1930 -559 -1991 1398 1662 -1865 -1095 1550
1599 1550 1119 -1370 -1588 858 1010 -682 -1793 73 1801 -271 -2825 966 3069 -1520 -2864 1274
1615 1274 2593 -814 -2248 1417 1712 -444 -1061 -146 1724 1179 -2290 -928 3008 398 -3017 -88
1631 -88 2841 -318 -2789 497 2027 -1016 -1249 18 415 710 -1217 -1105 1774 695 -2090 -773
1647 -773 2396 437 -2828 693 3093 -1252 -1565 1579 1068 -562 -585 476 999 108 -1226 -621 1610
1664 1610 683 -2744 24 3529 -1152 -3624 1516 2690 -2080 -2218 1319 1418 -965 -1146 276 1639
1680 1639 1022 -2152 -931 3737 800 -3838 386 3942 -482 -3264 984 2727 -1206 -1448 1033
1695 1033 938 -12 -1145 -1728 1589 1465 -2265 -1086 2847 299 -3595 139 3121 -1115 -2450 1530
1711 1530 1047 -1287 -123 535 628 553 -930 -765 1346 890 -2225 -95 3466 -588 -3520 1972 2837
1728 2837 -2373 -1560 1885 780 -1525 -825 792 550 186 -1338 -1313 2327 753 -3494 315 3868
1744 3868 -1045 -3248 1592 2410 -1498 -1234 1697 803 -656 -84 -1018 894 1807 -1749 -1537 2579 847
1761 847 -2808 -3 2939 -543 -2589 1145 1062 -1445 -21 242 -749 351 131 -1313 747 1892
1777 1892 -1095 -1414 2081 708 -2581 956 2660 -1420 -1129 1344 35 -959 361 368 -235 613 -495
1794 -495 -1651 1224 1558 -2527 -774 2965 -640 -3313 914 2417 -1619 -1366 1009 608 -574 -320
1810 -320 -437 535 2177 -1078 -2534 2803 1848 -2881 -678 3010 382 -2967 411 2035 -464 -725
1826 -725 262 -244 654 -156 -2018 893 2096 -1887 -2120 1881 1247 -2713 -153 2755 -613 -1909 657
1843 657 788 -563 -36 21 309 719 -498 -1142 1417 1813 -2019 -1152 2743 -216 -3222 1037 2574
1860 2574 -1558 -1750 996 739 -730 -649 -64 820 827 -1361 -1701 2246 1648 -2926 -417 3334 -191 -2723
1878 -2723 537 2357 -604 -1559 330 596 404 -238 -1248 1045 1686 -1801 -2032 2081 1048 -2521
1894 -2521 -707 2478 -287 -2201 602 909 -532 89 245 -176 677 -230 -1107 881 1441 -1248 -926
1911 -926 2064 524 -2175 501 2182 -1059 -1149 781 756 -500 -389 22 399 290 -1016 -1123 1308
1928 1308 1266 -2446 -773 2453 -327 -2691 447 1755 -262 -1363 47 1075 184 -208 -737 632
1944 632 1764 -953 -1543 2031 1376 -1899 -502 1977 167 -1512 66 1267 -317 -420 -125 -370
1960 -370 650 -116 -1612 643 1334 -900 -1151 1321 955 -1863 -254 1406 -168 -680 658 260 242
1977 242 26 -342 315 845 -583 -837 821 1052 -1405 -723 1835 203 -1807 256 1580 -509 -973
1994 -973 -263 733 456 -985 -730 594 1133 -873 -1428 1411 1337 -1785 -983 1719 989 -1410 -300 1368
2012 1368 593 -663 -778 275 798 -370 -1659 580 1462 -1210 -1648 1155 797 -1159 -948 1275 407
2029 407 -1431 -260 548 434 -144 -631 315 1047 -773 -795 855 993 -825 -905 1613 661 -1731 -105
2047 -105 1392 156 -827 -301 1126 325 -1149 -539 1178 284 -1325 -1023 1261 904 -1823 -939 1837
2064 1837 528 -1431 -350 1455 795 -1348 -348 1281 768 -693 -738 959 996 -949 -555 1349 750
2081 750 -1059 -924 982 671 -984 -538 999 116 -684 -500 333 593 -722 -906 620 284 -517 -323
2099 -323 432 477 -756 -477 791 474 -573 -142 713 313 -729 -469 1002 -18 -811 -130 894 446
2117 446 -1014 -455 808 139 -910 -304 725 531 -1097 -699 930 681 -1016 -406 520 374 -833
2134 -833 -1079 766 738 -385 -767 883 1033 -367 -981 652 957 -920 -1006 523 1133 -738 -919 915
2152 915 600 -336 -456 143 388 -163 -902 253 692 -301 -505 433 849 -371 -549 701 425 -698 -245
2171 -245 485 243 -383 -575 503 648 -474 -608 203 575 -486 -758 756 917 -1213 -479 888 434
2189 434 -1156 -887 855 714 -606 -597 449 936 -195 -1421 540 1690 -724 -1214 914 973 -645
2206 -645 -511 818 652 -862 -667 -26 757 189 -1069 -181 1455 -114 -1205 519 1240 -629 -979
2223 -979 773 716 -895 -614 444 230 -446 -283 -329 702 -63 -329 383 1071 -187 -1043 1193 922 -1064
2242 -1064 -712 1179 238 -1015 -193 284 444 -303 -609 160 880 -150 -1077 401 1455 -1064 -1396 1343
2260 1343 912 -1050 -471 884 579 -643 -353 164 783 167 -809 68 1286 -69 -1383 781 1384
2277 1384 -1034 -1039 635 568 -1121 -635 446 153 -250 148 -345 390 527 -637 -145 894 -341 -789
2295 -789 569 818 -1041 -365 897 90 -778 299 153 -369 337 -423 163 675 -261 -1000 172 916
2313 916 -615 -1119 1089 769 -937 -324 848 -181 -674 -156 337 531 143 -624 -351 1098 393 -1544
2331 -1544 201 1557 -418 -868 629 560 -593 -305 407 400 98 62 -675 452 939 -744 -552 1189
2349 1189 303 -986 19 1226 -477 -1047 771 640 -657 -196 93 -168 386 -97 -581 560 499 -796
2367 -796 -137 1243 -262 -930 699 953 -1225 -385 817 138 -345 -132 -15 60 112 -683 -292 750 238
2386 238 -1330 55 1470 -487 -1263 914 973 -808 -589 483 331 -58 -444 -23 477 656 -642 -389
2404 -389 1309 -26 -1505 21 1268 -315 -856 573 374 -556 -294 336 -2 153 -240 -558 492
2421 492 398 -774 81 902 -281 -987 457 843 -626 -403 984 131 -893 44 207 229 43 -612 -126
2440 -126 636 52 -1072 230 1238 -512 -1206 744 760 -958 -130 680 89 -249 -287 8 160 374 -392
2459 -392 -426 825 363 -1148 3 1104 -242 -887 446 286 -308 -137 184 295 72 -104 -638 202
2477 202 764 -791 -264 986 16 -992 280 739 -497 -477 548 250 -436 82 339 -75 251 149
2495 149 -102 565 216 -684 -124 854 -115 -1095 389 891 -658 -325 838 146 -204 -270 46 213 85
2514 85 -301 -510 617 391 -1007 -67 1059 -7 -969 299 737 -458 -255 257 279 302 -397 -447 129
2533 129 540 -460 -685 1070 407 -1015 56 652 -142 -700 355 557 -228 -467 167 -125 54 27 -449
2552 -449 265 308 -599 -255 798 62 -565 -59 693 -447 -577 414 20 -186 -151 -124 107 186 -584 -271 491
2573 491 336 -1203 -236 1031 -263 -1057 -99 705 -430 -323 158 516 41 -164 -484 639 392 -406
2591 -406 -184 801 349 -829 -18 881 -11 -620 160 394 119 -154 7 221 329 -439 -448 400 335 -733
2611 -733 -578 521 237 -617 -109 885 -184 -441 411 289 -188 -154 43 286 214 -376 -127 508 286 -641
2631 -641 -215 604 -15 -581 -21 519 -322 -517 105 283 -58 -372 -139 380 -218 -443 -101 272 219 -633
2651 -633 -152 902 218 -404 185 446 358 -547 -374 594 272 -321 -118 512 268 -171 -570 354 267 -486
2671 -486 -174 620 137 -349 -88 256 125 -216 -200 177 47 -289 -2 562 124 -474 -152 230 304 -244 -183
2692 -183 389 -121 -417 -29 268 246 -201 -206 400 192 -581 -92 153 182 -344 -473 410 -20 -171 -119 571 327
2714 327 -479 -409 242 242 -240 117 387 328 -302 -322 560 325 -306 -356 230 588 -480 -57 374 411 -125 -615
2736 -615 121 132 -438 -177 404 283 30 -459 433 56 -141 -56 120 525 -322 -109 518 171 -272 -32 402
2757 402 101 -612 260 426 124 -235 -225 291 345 -277 -338 333 186 -256 -304 308 413 -631 -49 575 132
2778 132 -540 -479 323 307 -166 -267 360 568 143 -6 344 550 -172 -133 636 277 -256 34 264 10 -371
2799 -371 -58 164 -93 -295 -268 -49 76 -232 -374 -17 209 -515 -154 427 13 -481 -55 459 -1 -184
2819 -184 -42 109 165 -324 -102 394 -105 -407 -247 398 122 -671 -407 543 -225 -369 39 322 116 -250
2839 -250 -127 -65 149 -197 -428 270 403 -94 -275 600 279 -633 -95 13 -32 -98 -219 200 62 -25 -305
2860 -305 -231 249 144 -507 195 380 -503 -144 204 -64 -429 57 319 -99 -66 172 -223 98 136 -193 78
2881 78 498 63 -320 314 269 -320 -250 484 238 -586 150 128 201 1 -53 31 446 61 -422 148 566 -105
2903 -105 -457 433 370 -339 -213 164 178 -252 88 275 329 434 -135 -135 362 290 -788 219 515 -363 -481
2924 -481 398 180 -432 -238 -7 -26 -250 333 -311 -23 175 -510 -10 408 -233 -488 251 351 -360 -259
2944 -259 343 106 -544 -10 313 -108 -141 -418 -381 556 -126 -533 351 249 -270 -297 370 434 -526 -463 525 37
2966 37 -397 122 129 200 202 -340 49 432 97 -431 121 439 -303 -630 425 373 -478 -206 145 141 -144 127 -160
2989 -160 24 227 -225 -189 303 -56 -544 134 612 33 -425 591 -8 -396 273 -92 -53 -2 -13 -56 4 369
3011 369 -338 45 317 -33 -572 -66 45 -224 -467 165 296 -481 -37 18 -294 45 -337 -337 253 -197 -203 133
3033 133 211 -203 -171 298 271 -196 -288 402 61 -76 73 107 41 169 -448 -255 406 312 -550 105 241 139
3055 139 -431 293 257 -178 64 299 -182 -168 27 -155 -16 309 -227 89 169 113 -442 218 283 -165 -7 478
3077 478 264 -274 112 -15 -182 81 -127 -169 199 -80 -138 -6 349 -275 -343 19 309 -238 -274 267 -160
3098 -160 -360 -187 -195 181 191 -181 108 407 76 -333 -27 566 61 -269 421 304 -64 -137 -218 306 -152 -340
3120 -340 -274 313 297 -115 -242 457 97 -205 110 271 -215 -134 129 316 335 -249 -46 185 190 -94 131 400
3142 400 -77 -463 -143 429 313 -162 155 154 36 -80 250 -144 -75 -251 -122 202 100 -214 271 207 -218
3163 -218 -361 172 528 -112 -376 139 193 -155 -138 178 355 -47 -197 103 360 -183 -262 -101 338 -39 -125
3184 -125 229 324 -41 -50 31 197 -56 72 -118 -26 70 -26 -196 -195 -219 -270 173 164 -185 -336 56 102 -182 -80 275
3209 275 71 -148 -15 83 3 41 -587 94 3 112 -323 -32 144 13 -317 31 77 55 124 381 -161 -132 109
3232 109 19 140 102 -457 -146 165 153 78 -183 242 4 -25 -2 259 135 -178 -131 92 3 24 79 -130 125
3255 125 -239 -305 151 26 -213 -77 -355 -77 -156 -128 -147 -23 -174 127 -90 126 -266 175 356 14 -169
3276 -169 64 482 -4 -244 -193 414 -55 -123 -165 148 -207 34 62 105 -215 -175 -206 405 -173 -231 -106 5 131
3299 131 -370 -91 -99 173 -167 -314 155 -2 -204 199 164 0 -33 37 127 -19 -392 -26 -35 164 -235 76 416
3322 416 -4 -69 -455 390 -74 8 -168 130 -72 -249 35 315 -81 121 132 -97 10 -141 130 263 -111
3343 -111 -209 56 213 -72 -72 4 186 33 -36 -143 -108 103 7 -76 112 182 -337 164 144 84 -24 215 204 71
3367 71 -185 80 60 172 -279 -33 286 98 -50 -62 -230 52 -144 7 268 218 -185 -246 -41 -112 67 -330
3389 -330 -40 -145 -147 265 16 -9 -56 69 115 -91 -448 -43 182 39 -470 76 185 -137 -4 -49 99 -39
3411 -39 2 124 288 19 -368 -195 108 181 -237 -215 37 159 -425 184 -149 113 -11 -83 152 270 -272 -6
3433 -6 -13 188 -223 -260 428 119 -249 -97 98 -82 -46 -143 138 -112 -35 110 101 85 143 -194 271 349 -211 -176 386
3458 386 -98 -30 130 235 81 75 42 19 107 194 -15 65 278 -297 -140 4 206 -362 -519 109 -117 -189 132
3481 132 271 142 96 1 185 248 -97 -352 155 196 78 -349 296 76 -342 75 249 -49 -126 -254 180 153
3503 153 -207 -119 124 211 -118 -57 229 235 14 -146 157 16 -271 94 -5 -78 85 -121 194 35 103 -117 -57
3526 -57 224 -221 -106 56 87 -78 -3 352 178 -60 354 130 -26 -57 116 -34 -22 215 -285 340 13 -301
3548 -301 -208 23 235 -114 64 101 61 36 -56 -198 -25 72 -277 55 215 1 -180 88 125 -123 -327 -22
3570 -22 -127 -283 -54 164 -76 -140 92 -114 -104 41 -409 -206 193 -404 -269 -21 236 -411 -132 53 78
3591 78 -283 7 217 48 191 74 -142 72 -107 -268 -7 -85 -106 -222 384 170 -337 -220 60 29 -2 148
3613 148 331 -148 -104 -123 -75 197 141 -179 50 -4 -130 -122 -237 52 -142 -77 235 -37 -251 -297 -115 57 3
3636 3 -76 242 -121 5 -459 26 276 -178 -312 167 -72 48 102 -22 124 -113 38 86 -42 -241 -189 -3
3658 -3 9 -61 -84 162 -1 26 -270 4 180 -48 10 -96 21 -73 66 260 27 -205 -239 -134 403 -12 -231
3681 -231 -13 304 -390 -95 76 -125 -199 -154 101 88 -293 -39 -23 286 -215 -149 410 216 48 -167 41 21
3703 21 -223 -135 217 75 -62 -122 122 11 68 64 -68 141 -31 -155 -207 130 -113 -44 118 -48 -186 104 331
3726 331 -95 -73 72 -40 373 53 -464 157 209 36 -139 -22 -14 -51 -156 241 271 -78 -50 20 -2 132 80
3749 80 -73 6 -236 -41 13 307 41 0 24 -139 -107 -300 174 54 -52 -73 -87 71 -3 -333 21 73 79 -192
3773 -192 61 80 -149 -77 -84 -95 -107 123 -93 49 -243 -132 48 -10 -69 -48 33 133 124 -342 246 112 -99 -19
3797 -19 -287 122 -56 -138 -18 -23 -131 -437 172 121 -76 -194 3 243 -108 -454 187 185 -83 -81 52 246 -16
3820 -16 -278 -276 -156 232 86 185 46 87 -166 205 45 -79 -179 124 170 22 -152 -246 239 38 -430 -58
3842 -58 241 32 -273 12 299 204 -73 157 9 -234 -271 174 329 1 -11 114 88 -89 135 164 132 182 -201
3865 -201 5 174 -16 -189 80 367 -326 -259 69 8 -267 -381 109 512 -11 -295 -45 296 69 44 -266
3886 -266 -10 22 -179 22 194 -134 14 57 -54 186 -95 -166 79 10 -134 -20 74 -132 -23 116 170 25
3908 25 8 -100 -36 120 -81 168 -92 -61 133 134 252 11 22 101 -4 -286 -199 -288 -89 -13 110 -8 208 214
3932 214 -21 255 407 -14 -252 196 -173 -125 -211 -227 270 -316 -135 -103 46 -31 -319 -128 166 240 -219 -50
3954 -50 221 -52 -106 -102 89 -32 14 -195 -374 -32 -30 -162 -4 132 -70 200 44 -138 -188 166 -75 300 -172
3977 -172 59 -83 -56 -216 42 103 235 -79 9 14 60 -195 82 4 -43 -14 104 174 -182 -150 -194 111 -30 -13
4001 -13 3 354 127 -66 -16 24 -22 95 -210 188 178 -160 -8 60 -40 6 -176 168 80 -138 89 -128 50
4024 50 -12 -222 42 -24 -32 72 223 -99 -94 -7 -23 -140 -17 -47 -122 47 -226 51 231 -27 -135 -69 -6 106
4048 106 4 -141 286 -151 175 -39 156 -136 -95 1 172 -2 -36 -68 -117 246 -164 -40 224 -79 -35 125
4070 125 -91 24 122 -19 60 254 123 201 180 97 -90 48 136 16 -74 153 18 273 -87 141 19 17 72
4093 72 109 -26 151 -255 -21 219 449 -307 238 64 51 -243 148 175 278 127 -84 -190 3 -52 -314 37
4115 37 66 -197 -90 101 -16 -239 49 15 -90 -11 271 -74 -179 -135 -28 78 -155 131 -416 179 -74 -258
4137 -258 55 99 73 41 201 9 -109 -177 -78 16 -3 11 -274 -91 246 -174 38 124 257 42 9 258 -199
4160 -199 6 58 -83 33 -67 132 182 38 59 -7 -276 25 -323 -15 307 239 -82 -22 147 -193 -179 -46
4182 -46 158 71 -236 -46 -25 34 -87 -104 309 -58 -208 -26 62 14 -192 222 66 98 -68 -77 95 -108 -166 -104
4206 -104 22 64 -61 185 214 -96 28 -336 282 -56 -227 -144 232 -99 -170 -69 106 -58 -256 -50 -102 -37
4228 -37 -96 -142 -6 -48 -92 -29 419 130 -74 171 332 182 -121 125 48 64 -9 -212 166 335 -415 -259 54
4251 54 -31 -307 169 2 28 -101 -94 396 36 185 -244 102 -294 8 -147 -128 31 164 -319 87 53 77 -87
4274 -87 23 209 -90 139 109 200 223 101 215 118 26 -98 -78 -190 -15 110 201 56 27 -138 12 -18 -181
4297 -181 190 76 -6 -151 30 65 -17 -211 -131 -113 128 -259 84 189 108 -111 144 18 -36 -355 5 -19 2
4320 2 72 -43 -31 183 81 -278 184 -183 -156 -17 27 156 -69 7 -40 211 -23 -149 -9 -13 -39 -230 284 264
4344 264 63 -100 69 10 125 -183 -191 91 -139 -33 -60 -138 -167 -251 -44 45 -326 -210 25 240 15 -10 -128
4367 -128 107 -248 61 137 -31 -195 -203 93 -117 6 -248 46 62 56 117 -163 -46 -111 8 -34 22 -148 -268
4390 -268 96 108 -196 -158 136 -31 -218 -86 -175 116 -100 -334 91 52 -157 -185 221 -138 -124 15 309 42
4412 42 -63 169 -43 96 -288 -217 178 6 -8 -112 209 -34 -63 76 65 148 -146 59 -14 -38 49 -273 99
4435 99 112 -3 -14 53 119 -109 -115 54 -113 -33 -39 -27 44 -103 10 78 33 49 8 -78 -48 -121 -16 25 -42 224 -140
4462 -140 -173 202 139 -149 -51 -3 -187 185 72 38 126 -28 181 103 62 -90 138 68 -267 -159 219 113 -179
4485 -179 -243 111 159 -286 144 212 -26 122 66 -164 175 112 11 147 -202 -26 56 60 10 12 -45 39 121 -248 22
4510 22 210 5 -128 -216 -43 232 -115 -114 360 62 87 -263 107 35 99 -66 -39 327 -293 -309 -178 -103 16
4533 16 -3 -101 -115 37 25 -193 256 -177 47 206 -125 -37 -313 38 -80 125 -378 -100 -140 87 -223 122
4555 122 -84 -234 -120 -9 63 -24 -180 6 127 -61 -393 -243 197 -165 -96 -172 67 211 -70 182 -68
4576 -68 25 -213 -98 -8 -133 71 62 51 159 142 -229 72 -220 166 -100 31 -149 -156 -101 65 -173 130 16
4599 16 89 95 -36 103 -328 -152 78 81 97 75 85 -79 95 -41 10 141 147 54 -58 244 -56 -34 -32 118 83 34
4625 34 -28 -17 -184 -88 -45 -191 -138 -158 89 -113 106 -132 -216 69 -13 -184 102 28 47 -132 -70 25 436 -79
4649 -79 -97 39 62 -105 -156 39 224 -126 180 45 100 -255 -66 -85 39 -25 -119 -191 -41 -80 -208 114 463
4672 463 -122 -201 -31 152 -136 79 44 -108 156 50 -21 -64 -134 127 118 356 -30 48 0 -9 -35 -315 239 -84
4696 -84 15 -177 -38 254 29 -156 15 89 -147 136 -113 377 123 -284 -158 113 -303 -293 94 196 25
4717 25 -239 -317 -122 0 -142 -200 97 -139 -68 144 87 -189 236 132 99 92 -134 202 217 -153 -26 -113 -3
4740 -3 126 -75 125 23 -124 26 -9 160 -70 -272 -179 -47 -23 -352 -24 76 95 -170 -63 3 -102 1
4762 1 -189 32 302 -55 86 183 144 69 -197 -82 147 25 -54 -45 75 -37 24 -40 257 -136 -105 191 -239 -212
4786 -212 282 347 -223 -35 -75 172 241 -193 -70 103 41 -115 -50 76 -67 31 200 -94 161 -213 -128 149
4808 149 -228 -132 114 -128 -117 -86 -117 -76 -55 -288 20 90 -164 -226 -213 217 37 -124 218 99 270 58 -33
4831 -33 214 -192 -16 18 37 20 -109 -55 246 31 -219 136 408 72 -127 -100 -28 178 -126 -166 239 115 -44
4854 -44 -215 137 185 136 113 -166 489 -182 -178 -31 73 2 -239 351 -26 7 -58 146 152 -231 -156 -14 -105 -194 75
4879 75 128 92 -25 42 450 -130 40 -157 68 -156 205 65 -187 -109 -8 -44 -20 104 -5 25 194 220 33
4902 33 249 197 -105 -158 -63 -161 244 217 -62 128 83 -81 57 -30 -251 -51 -16 183 -94 -277 156 -45 94
4925 94 150 -138 -48 49 -219 -169 34 -109 -210 -41 91 -314 -261 54 -209 28 -77 -122 8 -70 -277 -142 -4
4948 -4 -273 -247 46 32 -118 177 137 -34 -307 -314 134 -120 -283 -17 103 -51 -199 -130 -142 29 -47 -27 182 191
4972 191 -26 127 61 89 187 77 28 117 466 -144 131 151 -28 -20 34 255 135 -73 -177 219 209 -269 79
4995 79 164 -14 -125 -115 34 199 242 -157 -37 -33 -139 28 242 142 -117 -17 129 -118 -94 -33 75 -130 -110
5018 -110 -30 -35 111 13 68 153 -171 136 -10 153 7 141 -79 136 -42 -145 52 -184 -16 15 -235 -68
5040 -68 -13 -189 105 77 -60 -232 -226 203 166 -27 -101 -9 40 -25 -28 -177 -79 -77 -302 148 -26 -32 93 194 7 -90
5066 -90 2 171 80 84 -167 -176 -259 -307 85 184 -200 52 -24 102 51 50 -158 13 5 -83 -146 134 -76 -265 -137 35
5092 35 199 -112 182 -220 -114 225 31 -93 202 91 -133 64 -11 -46 -23 -201 69 -80 215 77 47 159
5114 159 -140 78 190 -84 196 31 289 203 173 -79 -99 160 168 2 269 -60 176 82 -169 72 42 245
5136 245 -58 23 74 311 110 -341 153 137 -24 12 88 -48 31 -54 218 4 -7 -181 -70 -16 281 -33 -100
5159 -100 -88 -26 -99 2 62 7 30 32 -34 477 -181 -364 -59 127 -168 15 174 -139 -93 -100 4 -18 20 28 251
5184 251 311 -89 -263 80 134 26 32 33 115 -10 210 48 106 7 19 -102 94 91 -239 -17 175 -46 151 200
5208 200 -201 -136 34 -51 -90 306 69 140 68 53 -213 -69 -16 -14 -48 -32 145 -121 48 112 139 -97 177 -87
5232 -87 -45 -63 -120 122 -29 73 140 17 88 50 15 153 -31 159 41 -247 -145 -8 -83 -36 153 -196 -208 67
5256 67 -19 -103 -112 296 19 -172 -157 139 177 -46 92 -144 33 -122 199 -10 138 193 -113 30 270 -315 66
5279 66 49 226 -206 -233 -230 -24 -50 -39 -25 62 -92 35 93 -9 -93 -110 -190 208 70 -213 52 -190 -51 376
5303 376 -12 236 -91 -127 -16 -22 106 -232 19 -1 245 47 306 133 100 87 51 62 10 -71 86 -8 -148 185
5327 185 -103 -185 28 81 80 22 138 -223 45 119 115 38 24 142 -91 -365 -50 -122 87 29 -64 28 -278 155 -5
5352 -5 -34 -11 13 160 -14 -95 -34 -195 269 -46 59 -18 27 134 -112 -62 -64 -5 55 40 -38 113 -122 -98 -78 284
5378 284 57 213 -194 -13 42 133 -37 -73 185 -69 33 -16 48 235 84 35 144 -110 111 -210 16 -104
5400 -104 -300 -117 -186 -2 15 -131 -122 15 189 42 31 110 -66 -94 -196 59 25 170 84 92 243 121 -26 -104
5424 -104 65 321 8 94 1 182 131 -248 -269 -78 145 103 26 -185 282 6 3 -47 35 -83 -42 138 -1 -57
5448 -57 124 -1 -121 62 -243 60 -146 -85 6 -125 -32 -145 98 -5 235 22 13 233 54 -37 12 -357 120
5471 120 -98 -383 -241 49 -62 -60 -80 64 70 -110 -156 -193 -87 279 -57 -226 56 -32 -166 -110 -22 108 -7
5494 -7 -195 -281 138 146 -92 39 -66 -13 11 104 67 -156 -141 90 -39 36 48 74 238 -100 414 112 -93 130
5518 130 -20 -67 -328 2 62 113 230 -7 15 -135 133 -142 186 -49 -3 16 33 139 -113 -42 -20 80 -15
5541 -15 133 216 272 224 -13 -107 82 -39 314 78 380 -184 172 134 -189 -4 132 -4 44 50 1 -97 -235 24
5565 24 295 136 18 -99 36 109 112 -10 144 -191 -2 81 -237 33 -57 52 88 -29 -81 -170 14 -62 -119 186
5589 186 -31 189 22 -80 41 -150 69 -212 3 -15 -87 107 30 -80 -261 -97 -119 166 -159 -128 -122 229
5611 229 78 202 97 -47 39 -228 -49 -82 99 -107 -94 -47 4 -44 355 -131 298 38 -157 -204 152 -59
5633 -59 -21 69 108 10 -26 -115 41 76 -132 59 -106 195 -97 205 -14 177 1 277 82 50 -133 -14 -195
5656 -195 -93 53 -55 -48 -54 337 67 175 -34 156 -248 -173 130 -116 -34 44 -154 -127 49 -442 8 30 31 -134
5680 -134 -3 139 -219 237 26 107 62 36 50 -46 7 -88 42 202 16 -47 93 14 -51 -290 220 125 17 -67
5704 -67 107 158 -21 -44 37 103 -136 -166 0 235 -130 130 438 -194 -85 -95 -188 0 296 35 122 5 -210
5727 -210 -46 -20 -153 161 171 112 -121 -59 188 -58 -131 -4 -26 -90 203 5 -7 -36 -289 8 -157 175 -203
5750 -203 1 -262 -105 24 -265 182 -37 -110 -190 180 286 37 192 209 53 -110 -92 -44 80 -247 6 106
5772 106 232 -157 18 75 142 -33 -37 -124 129 13 42 -94 -42 -19 -101 88 -210 16 -36 61 107 190 -105 242
5796 242 -4 281 67 -43 43 -328 -145 107 -22 -64 -3 -42 -84 -285 -167 -166 143 184 19 -39 -118 -194 15 -290
5820 -290 -107 -319 143 -244 -130 24 -321 -304 32 -105 213 193 -9 -85 111 216 95 108 -137 74 173 -7
5842 -7 113 93 -32 75 71 131 180 35 78 -87 50 6 -9 -117 -25 49 41 91 23 9 14 -63 -42 -242 68 89 -71
5869 -71 -135 -65 -63 -213 -101 112 178 30 215 -265 105 -110 -12 -21 218 -32 -256 77 -107 20 -25 107 -2
5892 -2 21 201 -48 78 -62 -9 73 -112 -85 88 -20 -89 -62 -148 -195 -21 -202 116 -36 -84 44 -128 351 -225
5916 -225 -200 59 -61 56 -273 91 -113 -100 -52 14 -78 -90 -41 179 14 54 201 11 281 -170 28 -207 -169
5939 -169 131 142 -27 -216 114 23 137 203 210 211 176 65 -163 -135 -6 -327 -113 -114 169 -82 -73 -218 -135 112 27
5964 27 137 48 -125 -14 -10 94 178 -96 -150 147 90 69 -30 -161 27 44 78 -68 -77 -56 -135 -31 -9 -36 -24 116
5990 116 -232 145 -94 44 -170 -68 132 63 -148 9 -85 96 16 150 179 -185 39 -170 216 -182 -21
6011 -21 -48 26 -114 -112 -103 -60 -143 -49 56 33 92 172 104 -178 -24 -203 -229 57 -123 58 -143 219 68 -117 -31
6036 -31 173 16 81 -278 160 -72 196 -102 -39 68 -231 263 -158 46 -159 -8 -33 -433 -65 -69 -118 -148 19
6059 19 239 337 113 109 49 -235 68 -32 -75 -119 -137 -211 135 -22 -29 137 -239 -62 -22 -128 31 -10 -56 -71 -40
6084 -40 103 -96 281 -50 89 26 112 24 -110 71 43 -47 3 -190 93 247 164 274 84 86 -61 1 -201 -81
6108 -81 -11 -3 166 111 -70 128 29 156 -71 -15 -206 339 18 -46 -27 -36 164 -81 -81 -41 170 -213 32 162 -22
6133 -22 -115 -86 -79 56 -116 122 245 187 -188 125 233 123 -78 -265 -212 -43 -7 -216 -166 -67 76 -34 274
6156 274 162 22 -328 -248 249 231 339 125 151 55 -100 -64 -45 -199 166 122 -162 184 24 262 -337 89
6178 89 118 -139 105 11 137 -64 52 -307 26 230 312 -49 160 -104 -62 -92 126 -141 -149 18 -41 260 127
6201 127 -205 -76 23 170 115 -193 75 291 39 25 247 98 52 -23 84 236 215 -47 53 -327 209 134
6223 134 -156 68 -88 124 294 31 330 -42 -38 78 145 -204 -170 128 -246 -8 -325 -138 39 208 -107
6244 -107 -51 195 128 116 -32 170 -159 -126 -132 -123 -111 -217 48 252 -89 -70 65 139 -143 194 326 -292 312 -39
6268 -39 -223 26 -118 -40 52 -15 -26 27 -68 -1 245 55 60 53 143 -151 -59 93 -337 149 -9 -69 -24 -134 -32
6293 -32 139 -240 147 77 -91 -52 -45 83 -56 140 16 85 293 -177 -390 88 56 -104 -102 103 -271 54 -276
6316 -276 35 0 -50 360 -116 12 32 87 202 -71 -266 208 -219 -294 -164 -102 119 -104 7 166 -68 11
6338 11 296 80 15 112 35 -193 90 -40 -12 -130 -97 51 27 -52 -101 284 31 -84 -112 -51 -41 -4 16 -162 172
6363 172 -69 57 -88 36 -65 -58 -86 154 11 87 -72 -166 71 -193 -29 -134 -71 73 -49 204 100 163
6385 163 155 133 156 -132 101 146 83 -2 -29 -43 342 -201 67 -158 259 67 -163 -139 172 120 -56 8 62 -63
6409 -63 256 -47 -51 143 -39 -216 -52 56 -130 -121 -24 82 -108 96 28 94 7 -172 -236 85 131 -131 110 -227
6433 -227 -63 -195 46 -76 74 13 36 3 41 0 17 -116 -125 -25 49 93 107 68 -41 143 -32 -345 -113 259
6457 259 -96 -32 -226 126 -51 -150 -63 -13 10 108 -261 -10 -77 41 33 -141 103 84 260 -84 -30 42 262 60
6481 60 133 45 -148 -122 -234 3 165 140 146 29 -7 -134 -133 -51 -105 -61 159 21 -83 102 -155 45 -91 -112 -131
6506 -131 -58 109 -115 -87 -150 11 35 -124 -164 28 58 -35 55 -164 59 272 -91 131 -296 -27 182 227 316
6529 316 -52 -1 163 -49 -44 210 156 8 -93 -135 -169 222 174 -18 -84 -214 211 -220 -3 -23 26 -60 -176 145
6553 145 205 -180 -139 -68 149 -123 145 99 24 -76 -202 -11 99 -36 -1 -102 -39 45 -168 141 -283 271 -87
6576 -87 194 105 207 -314 123 22 -101 -10 -146 -79 -220 -86 245 174 -300 -182 -105 197 107 168 -212 -161 217
6599 217 -28 -43 0 53 30 18 -24 -97 -99 35 47 -278 -202 33 71 62 -179 -52 210 39 37 42 179 -6 19 36 -35
6626 -35 29 203 22 235 -194 40 214 -184 159 -218 -3 21 179 97 63 66 -102 -61 42 64 195 203 126 16
6650 16 110 -212 -99 96 -306 183 174 -187 -238 -29 5 -200 -199 77 -28 -165 39 -170 100 -20 -49 2 65 76
6674 76 -304 94 231 -17 -11 60 -57 94 103 89 -185 173 16 47 287 -301 -36 100 124 6 -203 -14 -77
6697 -77 119 129 48 200 27 39 -74 89 56 209 -83 162 24 58 265 26 168 387 -188 -16 -146 125
6719 125 57 107 50 8 -220 55 -118 -64 236 -216 -152 29 23 182 198 -120 -4 -31 141 2 -19 67 -38 31
6743 31 71 184 25 222 85 -17 55 63 181 -276 160 -110 91 33 6 105 -51 83 -201 -101 -241 -220 3
6766 3 -165 -52 191 -127 -68 64 301 -19 -145 -81 177 -80 -95 151 63 -141 46 -248 -67 -238 -118 -63
6788 -63 -38 -80 -127 -6 177 -140 31 264 -49 -194 -29 -61 -255 81 88 71 9 -223 78 48 63 185 -141 -138
6812 -138 -167 7 -155 -218 -34 -226 74 17 80 -28 -54 -87 -79 115 -196 23 105 -131 103 -24 122 162 82 285
6836 285 211 114 146 -78 -72 98 -134 -172 123 16 77 -214 63 51 -44 124 -144 7 -50 -89 215 99 -94 -24
6860 -24 55 7 -156 185 -23 32 41 -82 -4 111 127 173 -117 84 90 18 23 113 -44 -39 -174 322 -17 107 177 51
6886 51 -171 -127 52 -106 69 -226 -156 -163 171 -132 68 139 57 52 134 -92 100 166 174 56 55 -72 -162 -144 48 -20
6912 -20 -71 193 -143 -92 289 86 -112 -7 -35 -116 83 -67 -147 181 -243 -19 49 -152 -93 142 -76 -15 121
6935 121 -346 274 91 92 -172 22 -77 106 3 49 -26 170 -16 -17 -124 105 -196 269 22 -67 214 -62 33
6958 33 -266 -11 -138 269 80 -251 -62 146 17 -124 -173 159 26 15 -240 237 24 -169 108 -101 81
6979 81 81 -94 -336 84 77 95 86 8 -189 264 168 -356 141 -65 -95 61 125 -123 144 70 103 -126 -2 152 -22
7004 -22 -59 158 80 -41 105 -31 -51 -186 -131 -149 -45 50 179 121 -224 -230 -30 -104 70 -11 14 23 -23 -74 145 18
7030 18 -94 139 123 81 -39 74 -52 217 95 74 10 -70 -146 12 43 81 62 25 269 -171 338 -247 109 -125
7054 -125 -16 196 -13 31 -70 -117 -126 60 85 -38 -152 206 -77 -22 103 235 -15 -445 -117 49 -238 -64
7076 -64 151 -9 42 -133 44 329 -23 137 -81 375 -157 3 -125 78 119 130 137 -409 -172 -9 49 107 17
7099 17 7 104 52 -66 133 134 -89 -73 189 -78 -133 29 24 -29 287 -121 1 106 51 -42 -79 276 -127 -76 -62
7124 -62 -132 -91 23 120 39 -15 -59 -268 -333 -23 46 -38 -250 -147 -65 51 -190 -39 -145 -13 102 144 -127 -124 -46
7149 -46 -37 105 28 39 22 37 0 -95 96 -98 205 -76 -118 -53 7 -55 -116 102 -172 292 210 85 -201 97 319
7174 319 -57 -9 -150 6 19 29 183 -172 70 -111 -164 -36 16 163 -81 5 -156 295 -25 131 20 -158
7196 -158 167 290 -36 -49 37 213 -206 99 25 -67 180 73 -23 30 -206 -52 -78 118 92 97 -69 89 -171
7219 -171 -140 93 304 -69 -36 33 52 -271 -129 -81 272 -258 -27 -32 442 3 32 178 -76 213 -69 154 25
7242 25 -206 -22 -93 134 -68 -172 81 -67 -11 -8 -98 107 152 -343 66 -271 16 88 -73 98 52 -167 74
7265 74 -86 -62 226 -520 -243 47 -154 36 65 97 -55 -20 220 160 -144 -208 -14 50 -25 -170 15 98 96 41
7289 41 -58 -122 63 -167 47 -130 -19 -150 12 189 -158 -114 -252 -99 179 -112 23 33 -109 150 -235 47
7311 47 72 91 -113 -60 -250 -34 34 -223 -114 122 45 209 -170 -54 140 -322 50 -207 -115 -102 -129 89 -79
7334 -79 33 92 -233 161 60 120 -199 -86 116 33 13 26 -1 -162 48 96 122 167 165 -246 146 90 226 158 18
7359 18 77 158 26 -256 207 -120 -191 97 13 395 9 -78 -174 -76 15 -131 341 -28 -102 84 -32 69 -139
7382 -139 15 -50 48 -147 75 -71 -53 119 127 92 -52 -11 -69 -59 -83 15 41 266 35 73 153 178 95 163 111 -12
7408 -12 19 -82 -59 -213 20 -99 52 -72 9 -136 -153 -35 -60 -107 46 -185 -179 46 343 166 -86 162 -20
7431 -20 -180 48 151 -23 -272 -111 -71 -115 41 -231 -28 147 121 -61 185 118 60 -160 -122 106 138 -74 -9
7454 -9 -31 60 29 24 53 -173 -16 165 213 -232 209 -34 -121 -30 -25 -62 274 -47 170 228 -16 -97 4 -49 162 14
7480 14 -42 -168 35 -144 155 -268 30 168 -145 -5 -150 51 -122 12 246 -180 29 135 222 -120 -474
7501 -474 -25 -160 -141 146 -242 73 -25 220 -50 -7 -261 -151 187 -103 -136 -187 -97 283 -123 49 268 -92
7523 -92 -32 20 -277 -176 -125 -108 -103 153 205 -87 -261 -24 -183 2 93 19 124 -22 193 6 74 -372 -226 186
7547 186 -19 130 379 -246 145 -69 239 73 -306 -11 25 42 72 -88 165 109 105 45 38 202 -303 -139 -26
7570 -26 100 43 -176 -93 -150 -180 -11 -130 -196 69 285 3 -37 -253 -55 -118 56 99 -20 237 -301 11 -24
7593 -24 -28 247 -11 69 276 -155 38 -32 -17 -127 -6 28 -115 -39 -6 135 261 -20 162 -137 83 -97 -118
7616 -118 25 5 10 16 -98 -60 91 108 33 108 -119 -104 101 -6 12 197 34 -58 14 -59 -143 57 -129 -25 -28 2
7642 2 -28 -198 140 -52 300 120 -161 -61 143 -17 19 -73 151 147 -40 23 -106 95 -84 62 256 -62 126
7665 126 0 -230 -31 4 44 -31 -201 -55 156 -106 -92 -64 -147 -129 61 145 21 -71 -144 46 183 -181 114
7688 114 72 217 -78 -2 137 97 -62 -35 -29 -14 -3 29 -115 24 241 61 -195 -26 194 -109 -157 -60 -19 -81
7712 -81 -147 -243 154 -5 34 -101 163 282 50 -33 50 -23 -166 -87 231 132 40 18 3 124 205 88 0 -57 238
7737 238 138 102 68 74 -86 139 -75 -227 4 -329 278 114 56 -31 141 -67 -48 -51 293 138 -66 187 26
7760 26 -13 -112 103 19 -74 125 328 245 230 -131 -95 -93 -67 -25 -116 127 -22 136 -266 -46 -57 159 -44 177 162
7785 162 -108 -34 43 113 -36 79 29 13 66 -112 54 185 51 319 -51 183 -126 191 -19 -87 101 287
7807 287 -120 88 -179 -18 80 -40 199 140 464 -157 213 -141 58 -55 -28 -68 -7 -226 46 -108 -21 29
7829 29 96 -56 -74 -161 56 175 167 92 -58 89 195 -22 245 -51 -51 111 -205 14 76 107 -32 -149 283 -116
7853 -116 -170 5 -147 -138 16 -188 207 429 107 111 336 41 203 196 84 140 -128 -257 75 93 -316 -15 -65
7876 -65 81 168 -224 145 -21 25 15 111 -224 -323 -294 67 145 -18 -146 215 -102 -199 2 -117 -81 73 100 81
7900 81 58 -178 30 290 -26 -156 233 111 -34 -108 -39 38 -13 103 -93 -96 -42 -75 24 -37 22 194 -147 29
7924 29 -105 221 -135 -179 121 -26 71 246 219 25 93 -32 106 -232 -193 -65 -23 34 -32 -83 -22 -170 97 37
7948 37 105 58 30 207 -246 -39 257 308 -29 75 80 69 -117 -278 54 -204 -217 15 89 -95 -135 2 19 119
7972 119 79 -15 156 67 113 15 38 -15 73 24 99 -52 144 89 -8 -32 250 -131 7 3 -3 -28 -103 81 -126 -144 183
7999 183 77 -277 -36 76 -9 -260 99 64 87 -103 -236 -76 244 -19 43 -99 108 -41 51 109 96 -35
8021 -35 94 -163 -187 195 -45 -52 215 -35 -81 72 141 -57 46 -50 40 42 -1 25 182 -17 -211 193 147 -24
8045 -24 16 78 119 -90 -101 73 4 -12 214 -148 118 8 39 -31 -156 6 46 106 65 285 225 138 -20 -379 -216
8070 -216 -46 256 191 -228 218 184 -189 -164 33 127 227 -166 99 -340 -235 -99 5 -94 -150 -237 -37 181
8092 181 -84 21 411 256 33 -145 75 40 0 -329 -126 -55 29 -115 -161 98 -169 66 -21 322 -175 -204
8114 -204 220 92 72 81 225 71 -176 96 114 15 154 131 72 -156 108 -149 -105 -65 48 -206 96 -3 163
8137 163 -25 242 -38 225 -61 -237 0 -165 37 59 220 0 223 -120 -212 67 -203 164 -85 145 -121
8158 -121 -77 28 -223 97 114 -313 170 -114 262 45 209 453 -28 -226 -179 -136 256 -7 -47 122 46 18
8180 18 -74 200 -112 75 170 -113 -292 193 -131 43 -99
8191i9
$$ Imaginary data points
##PAGE= N=2
##DATA TABLE= (X++(I..I)), XYDATA
0 0 0 0 0 0 0 0 0 0 0 0 0 0 0 0 8 -8 8 -8 8 -16 16 -16 24 -24 32 -34 40 -48 54 -61 70 -80 90 -101 115 -129
36 -129 144 -160 179 -199 222 -246 271 -301 332 -368 404 -446 492 -540 596 -655 724 -799 885
55 885 -981 1091 -1222 1372 -1554 1774 -2053 2408 -2886 3563 -4593 6326 -9786 19233 -96080
70 -96080 -279339 8209 36960 -91361 58695 154948 -22434 -46850 28671 -44282 -18598
81 -18598 109952 -23777 -113453 77307 61309 -122394 6936 121635 -59402 -92859 73355
92 73355 29105 -65281 46732 61922 -67828 -23057 26036 -67843 -14844 84035 -8910 -26295
104 -26295 73991 -7276 -103947 26287 72734 -70798 -28907 101300 -5635 -69734 49847
115 49847 32892 -47474 7298 10654 -42289 23420 47095 -54393 -19836 82327 -26705 -94326
127 -94326 57976 63897 -68752 -14885 56669 -21538 -36123 17665 -6699 -9141 41591 -5940
139 -5940 -47405 44493 40494 -69835 -11113 69936 -19228 -49073 34762 25221 -26620 5125
151 5125 17691 -20615 1659 18973 -32502 -7585 45987 -15708 -37378 33313 12106 -44714
163 -44714 2886 34946 -19562 -21601 30150 2814 -26755 17438 12065 -21427 7736 5998 -19887
176 -19887 17550 26400 -23692 -9598 37990 -6547 -49287 18843 40750 -28702 -19382 28441
188 28441 3691 -14476 -3656 -5568 7096 14276 -19744 -24026 29601 22202 -44501 -12949 48934
201 48934 -3199 -41086 13396 29717 -6455 -13764 1164 8300 5398 -6889 -15803 11155 28903
214 28903 -16407 -24722 30978 15965 -34625 -7734 24706 -4180 -22648 4522 15030 -5063
226 -5063 -5527 1559 -1997 5542 -4065 -15123 12944 13199 -21841 -6779 25645 1843 -24269 9293
240 9293 29477 -11928 -20328 15760 10429 -11596 -8027 2132 13975 5924 -18386 -5199 23639
253 23639 3959 -32346 -6061 34029 -3993 -36795 9885 28227 -10426 -20622 3385 16779
265 16779 1495 -17715 -5719 18722 12609 -18610 -13869 27043 13357 -30027 -4452 28832
277 28832 1499 -19901 938 16153 -1172 -13906 -994 7502 3244 -4635 -8758 7800 9149
290 9149 -17116 -8941 15159 -267 -15772 3544 17147 -4252 -14721 9085 10359 -11160 -6033
303 -6033 6774 7851 884 -9590 2465 16457 -1348 -16167 1352 18077 -2816 -21924 5896
316 5896 20855 -8421 -16218 5009 11772 -2224 -16085 -2740 14716 1937 -14374 -4882 15325
329 15325 7560 -18512 -6474 19890 4252 -15012 -2787 12717 6860 -11007 -5456 12654 7689
342 7689 -7165 -7056 5501 9562 -9264 -11562 9182 7811 -7382 -5950 4775 5971 -7553 -8182
356 -8182 6400 3169 -6097 -2934 3577 3733 -5706 -4102 8724 2606 -6338 1052 7531 2753 -7723
371 -7723 -3915 11398 2741 -12048 -886 12886 4447 -13231 -4756 16728 2365 -18718 -3886
384 -3886 13145 3698 -14078 -8004 15204 8991 -16094 -10574 13359 11298 -15599 -14078 19602
397 19602 13970 -17624 -8710 15711 8730 -11928 -9498 11588 11585 -8271 -9461 7534 12761 -7184
411 -7184 -16063 9464 13640 -14016 -10301 12247 5153 -12618 -5386 10516 2153 -10161 -814 5460
425 5460 1427 -3772 -5778 6649 8285 -10398 -5486 14744 5234 -14706 -2188 18240 551
438 551 -18048 4499 15542 -4875 -10356 965 9508 3734 -12852 -7981 13415 7909 -16959
451 -16959 -10111 19889 8044 -25276 -5038 21650 -191 -15885 -110 11642 4628 -8060
463 -8060 -7115 6907 11663 -5139 -13727 10709 17983 -14335 -13341 16279 5715 -13968 -1086 9895
477 9895 249 -5964 1 965 -583 1226 -6218 -3373 8903 -4263 -10508 9908 6301 -12379
491 -12379 -1199 13740 -1788 -13235 5434 10153 -8073 -3667 7079 1958 2000 -1918 -6684 7574
505 7574 8994 -11577 -8553 15241 6501 -19832 -3379 19039 -3202 -15235 3940 6539 -1154
518 -1154 -3428 -6503 1830 10349 -3523 -14722 6895 17799 -11733 -15441 17604 10568 -15041
531 -15041 -1852 10188 479 -3280 -974 -124 5175 4818 -9003 -6069 14507 1718 -18429 4143
545 4143 13462 -11516 -8278 11048 2352 -8648 540 3667 -4909 -405 3333 -4704 2619 5969
559 5969 -8844 344 14553 -5186 -11367 11971 8647 -15649 -5251 17793 1425 -13232 4785
572 4785 7837 -3858 -2842 -5152 -516 11882 -2412 -16478 5728 18038 -12473 -19370 16852
585 16852 14675 -20062 -8067 15332 3232 -6886 -1506 2417 6237 617 -10965 -1611 17624
598 17624 2547 -19826 4263 19841 -11462 -14066 14984 7453 -12811 -3523 6716 -316 -2939
611 -2939 245 -2045 736 3302 -9491 -2525 14990 -2887 -14326 9860 9450 -15229 -6000 17251
625 17251 3243 -14027 3658 11096 -5197 -4040 2593 1819 6219 -2310 -12169 4956 13262 -9804
639 -9804 -12882 15109 10495 -20569 -7515 18059 503 -12633 1419 4331 -375 -1905 -5207
652 -5207 1792 11923 -798 -15796 2476 16790 -8049 -12956 15259 8674 -13312 -2250 8175
665 8175 208 -1991 877 -2127 38 4301 -4544 -5392 11151 2375 -14619 2309 9411 -8884
679 -8884 -5074 10550 905 -10079 1121 5347 -5309 -679 6535 -1482 1158 3301 -7856 -427
693 -427 11424 -3471 -10127 9119 8936 -11786 -5628 14643 2469 -10946 523 2959 -1903 298
707 298 -3824 -2003 8726 238 -13834 -311 15458 -3425 -14935 7975 10621 -11082 -5573
720 -5573 8130 3321 -1211 -2048 -2249 4044 5331 -5367 -4500 11313 4451 -15111 -911 14229
734 14229 -5044 -9552 7339 5251 -6611 -3291 2884 690 -791 -519 -3710 1194 4845 -7655
748 -7655 -3358 11816 -859 -11555 5502 9306 -7367 -5847 9717 4007 -8292 -372 5385
761 5385 182 342 -2556 -1520 7708 6 -11692 2175 12479 -5165 -13345 7409 11074 -10884
775 -10884 -8343 9060 3851 -5437 -3993 919 6428 1577 -8192 -2086 11045 1829 -13451 627
789 627 15798 -2660 -11657 6540 7732 -5760 -4755 3031 3912 247 -3024 -1837 3208 2857 -7105
804 -7105 -4129 9124 -75 -10977 3319 8505 -5848 -5699 6189 3489 -6052 -2094 4810 646
818 646 -1687 -833 118 5899 542 -7994 3066 9823 -4869 -8799 6659 8076 -8157 -6960 8513
833 8513 3805 -7356 -3173 3230 4013 -1263 -7517 408 8119 -1911 -9761 2067 10890 -3356
847 -3356 -10658 5526 8451 -5427 -4911 3789 4351 -280 -4149 -377 5105 1766 -4900 -2152 6908
862 6908 2335 -8267 -121 6611 -3046 -4582 2330 2225 -1818 -1958 776 497 -1038 -910 -983 1647
878 1647 1481 -3812 188 5553 -2318 -3954 4077 3983 -3044 -3550 4434 3725 -3951 -1727 2783 2285 -511
895 -511 -4840 -118 6145 -1207 -7172 1172 6857 -1423 -8088 681 7261 -2198 -6517 1048 5202
910 5202 1236 -5639 -2192 6643 2128 -6317 -1675 7062 3347 -6418 -2043 7843 1820 -6122 -959
925 -959 4690 1866 -4656 -2803 5025 1811 -5012 -2034 3715 1696 -5110 -2710 4814 638 -5365
940 -5365 -183 3855 -127 -4455 -396 5377 -83 -5047 1835 5093 -469 -4837 701 6173 -814
955 -814 -6527 2528 6404 -1516 -6246 579 7237 -1248 -8222 1306 6955 -1885 -8266 109 8482
970 8482 -788 -8749 1278 7441 -1092 -6885 -403 7123 1405 -7225 -327 7383 1512 -6379 -1596
985 -1596 7273 1626 -7186 238 6401 -630 -4426 -227 4298 618 -4428 -683 2926 -2 -3302
1000 -3302 -1442 3609 612 -5108 432 5154 -2415 -4116 2329 3622 -1911 -3020 3068 2989 -2421
1015 -2421 -2052 1478 3542 635 -5155 908 6437 -1512 -6254 1750 6153 -2347 -6510 2508 5359
1030 5359 -3125 -4323 869 2993 930 -4704 -1947 5300 1338 -6298 -1716 6740 1843 -6763 -565
1045 -565 6570 -607 -4130 891 2841 1548 -1943 -2341 2509 3205 -2736 -4037 3130 4057 -4889 -2920
1061 -2920 5032 -88 -4820 617 2469 -1263 -1589 77 417 -343 -142 -747 1087 2938 -2687 -2874
1077 -2874 5157 1708 -5690 859 5696 -1321 -4642 2319 4746 -2421 -2921 1148 1702 1192 -2554 -3635
1093 -3635 4068 3377 -6703 -2775 6915 2117 -8190 -1512 7373 -476 -5834 1107 3353 665 -1373
1108 -1373 -3005 2340 4832 -2849 -5063 4802 6118 -5305 -4796 6700 2506 -6508 220 4723 -750
1123 -750 -2341 -776 137 1590 -695 -2892 292 3810 -2655 -5437 5034 4085 -7190 -1258 6648
1138 6648 -1335 -5043 2334 4473 -1586 -2472 1340 1226 882 -873 -3080 3393 4665 -6358 -3591
1153 -3591 8032 1312 -8502 -42 7864 -1803 -7400 2255 4438 -1684 -2124 -1508 1234 3627 -3466
1168 -3466 -5104 6066 5465 -7117 -4632 7994 2781 -8222 944 6990 -1969 -3305 1033 1040 1611
1183 1611 398 -3010 350 3547 -1751 -5196 4000 4695 -6605 -2568 6528 -1738 -5287 3188 3151
1198 3151 -3163 -1672 1534 -254 -441 976 -1750 823 3579 -3666 -3536 6789 2397 -7089 1011
1213 1011 6337 -2570 -5224 3460 3460 -2960 -1319 389 -946 2131 -572 -4459 3506 4348 -6291 -4337
1229 -4337 6578 2947 -6311 -169 5708 -1827 -3783 1631 729 1200 1325 -2943 -452 4619 -428
1244 -428 -5094 2935 5755 -4279 -4629 5792 1540 -4434 1369 2159 -1744 -677 -305 -1224 1534 1292
1260 1292 -3179 -1175 3813 -1515 -5000 4248 3790 -5489 -1118 5038 -838 -2997 2394 2431 -1228 -962
1276 -962 213 -276 2253 578 -4380 2114 5082 -5066 -4508 6222 2819 -6221 -1921 5072 -271
1291 -271 -4516 747 2223 907 -399 -3585 -200 5220 -1752 -5532 3638 5858 -4343 -5214 5652
1306 5652 3950 -4960 -995 3730 -298 -1210 -574 386 2554 289 -3991 -438 4543 -1080 -5204 2858
1322 2858 4465 -5042 -2771 4879 122 -3866 851 1958 -902 -1236 -37 690 1752 122 -3372
1337 -3372 1452 4392 -3495 -3544 5873 2337 -5679 -801 5003 320 -4101 391 3154 -399 -1938
1352 -1938 -1932 899 3584 -1880 -4626 3248 4138 -4666 -3837 5098 3104 -5042 -1704 4130 455 -2246
1368 -2246 -323 851 2126 -27 -3311 858 4366 -1137 -3965 2330 4195 -3619 -3087 3917 1008
1383 1008 -3211 -107 1266 -577 -517 -1046 -58 898 -75 -2185 322 2878 -1517 -2949 3199 1601
1399 1601 -4093 -66 3736 30 -2322 705 2402 -259 -1418 -239 563 2089 -619 -3095 2327
1414 2327 2843 -3786 -2612 3285 1648 -3646 -1909 3047 860 -2411 -669 668 1233 178 -2786
1429 -2786 41 3913 -911 -3501 1424 3805 -1610 -2782 2338 2625 -1616 -1150 967 598 331 -1229
1445 -1229 -781 1908 327 -2406 -401 2692 -74 -3506 761 2384 -2273 -1945 1891 707 -1117
1460 -1117 -635 862 1393 -438 -1257 651 1742 -112 -2288 1069 3454 -1646 -2688 2693 2440 -2283
1476 -2283 -2331 2380 2180 -2453 -2155 1644 1921 -1319 -2722 531 3479 -1743 -3996 1838 3739 -1845
1492 -1845 -3745 1712 3821 -1778 -2928 1865 2791 -1005 -2468 577 3126 -375 -2938 691 2941
1507 2941 -498 -3054 418 2993 -1434 -3145 1794 1994 -1464 -1668 946 1432 -1312 -1976 1022 1466
1523 1466 -1176 -1468 1058 1782 -1478 -1846 2194 1960 -1951 -1500 2239 2328 -1915 -2149 2312 1784 -2091
1540 -2091 -1700 1602 1938 -1770 -2328 1805 2017 -1990 -2325 1143 2097 -1329 -2805 1708 2622 -1970 -2141
1557 -2141 1160 2626 -879 -2218 1321 2279 -1094 -1458 692 2330 -45 -2253 411 2395 -480
1572 -480 -1862 89 2129 -516 -2266 693 1556 -951 -945 379 607 -53 -1035 85 1192 -400 -1489
1589 -1489 208 1561 -160 -1777 1034 1993 -1734 -1289 1675 1347 -1095 -931 1394 1522 -722 -1461
1605 -1461 9 1614 -171 -2809 484 3115 -1281 -3285 1168 2473 -1199 -2508 1135 1881 -780
1620 -780 -1541 496 1605 646 -2166 -606 3249 764 -2570 -278 3109 11 -2864 932 2630 -812
1636 -812 -1716 569 797 371 -770 -863 1413 865 -1970 -874 1942 384 -2984 31 2721 -1071 -2085
1653 -2085 1550 1551 -1381 -593 727 1091 -508 -968 -62 1727 882 -2053 -112 3210 -40 -3237 1276
1670 1276 2752 -2083 -2357 1282 1717 -1533 -1460 712 1129 313 -1838 -1299 2704 785 -3875 -345 3741
1687 3741 -371 -3220 1070 3018 -1014 -2158 1254 1342 -79 -790 -891 1339 1930 -1835 -1490 2639
1703 2639 875 -3406 -565 3276 -631 -2871 1072 1474 -1902 -407 1220 167 -181 -1037 -699 1000
1719 1000 829 -1675 -667 2944 -49 -3421 1304 3371 -1874 -2074 2327 996 -2038 -897 1058
1734 1058 775 -332 -952 -991 1518 1303 -3012 -564 3755 -930 -3722 1204 2714 -1573 -2014 1478
1750 1478 1125 -1295 -582 213 536 1534 -1052 -1719 2156 1437 -2334 -116 3103 -257 -2823 1413 2024
1767 2024 -1627 -421 1016 -604 -73 181 -1215 181 1454 -1135 -1714 1490 731 -2366 209 2930
1783 2930 -1228 -1989 1839 480 -1281 415 857 -265 119 119 -1182 776 1809 -1757 -1303 2943 106
1800 106 -3319 1031 2860 -1219 -2134 1007 807 -860 -440 77 382 1342 -1104 -2514 2047 2126 -2762
1817 -2762 -1288 3181 579 -3116 318 2682 -318 -1379 482 348 315 24 -1472 562 2275 -1171
1833 -1171 -2500 2018 1913 -2138 -982 2900 -513 -2529 802 1149 -721 30 364 -96 346 -222 -870
1850 -870 1031 1649 -1563 -1403 2448 809 -3009 666 3009 -833 -1929 1122 1168 -790 -829 326 493
1867 493 58 -1124 -1290 1686 1825 -2881 -1193 2919 -56 -3167 350 2698 -671 -1897 568 1113
1883 1113 -81 -162 -878 510 1748 -1264 -1854 2177 1549 -2205 -898 2293 114 -2364 524 1637
1899 1637 -637 -559 561 -437 426 -100 -917 625 1272 -1010 -1442 1425 921 -2309 380 2225 -1167
1916 -1167 -1764 1279 1014 -629 -359 198 435 98 -465 -713 1117 1383 -1787 -1277 2723 107 -2688
1933 -2688 259 1965 -626 -1591 309 629 -375 -615 -652 282 1146 -851 -1823 1673 1748 -2017 -827
1950 -827 2064 663 -1544 -77 1404 -120 -594 73 -323 604 206 -1297 353 1268 -877 -1478 871
1967 871 1062 -1400 -614 1379 -270 -1323 1048 391 -309 56 22 -114 539 -205 -492 587 1006 -794
1985 -794 -1149 1709 431 -1682 382 1667 -277 -1041 -134 850 331 -953 -480 486 889 -582 -1657
2002 -1657 1066 1435 -1789 -1261 1811 457 -1647 -623 1440 637 -914 -365 596 796 -181 -1037 450
2019 450 1853 -614 -1588 1272 1299 -946 -1321 1261 604 -1192 -498 829 159 -798 -715 288 839 -858
2037 -858 -645 550 1027 -800 -884 1343 961 -1486 -403 2004 114 -1311 -27 956 212 -834 -487
2054 -487 999 493 -972 -670 1524 1245 -1648 -954 1929 512 -1777 -428 1194 583 -1375 -968 1137
2071 1137 595 -886 -788 734 1140 -755 -1011 1125 1059 -712 -568 1045 998 -858 -710 921 599 -525
2089 -525 -497 522 639 -540 -569 767 615 -724 -476 322 641 -801 -622 610 197 -960 -351 587
2107 587 87 -620 -198 801 366 -831 -114 951 353 -651 -471 696 445 -866 -350 837 278 -525
2125 -525 -543 966 665 -1152 -555 557 638 -655 -931 552 402 -1019 -617 325 787 -221 -1014 594
2143 594 965 -685 -849 712 814 -374 -917 592 769 -708 -721 302 538 -97 -553 26 859 -262
2161 -262 -614 431 554 -362 -727 496 535 -649 -345 436 370 -347 -275 301 768 -437 -485 750 378 -369
2181 -369 -831 698 1143 -994 -793 1162 175 -1066 -432 497 701 -758 -644 345 679 -192 -1114 398
2199 398 1365 -882 -1382 1070 1157 -952 -823 831 774 -570 -470 414 811 53 -1044 -164 848 3
2217 3 -1210 517 1064 -537 -1407 499 898 -590 -581 554 406 -143 -369 -244 656 -254 -754 -109 892
2236 892 -403 -904 715 1264 -823 -812 1458 453 -889 -101 819 212 -359 -346 321 812 -377 -1035
2254 -1035 360 1242 -550 -1354 1122 727 -1335 -757 1009 520 -1096 -241 436 419 -384 -593 -61 803
2272 803 196 -1676 417 1469 -379 -966 899 742 -720 -316 538 217 -380 87 18 299 319 -907
2290 -907 -214 558 -140 -949 272 707 -784 -736 918 227 -842 -37 689 -185 -5 145 156 371 -35
2309 -35 -616 259 1132 -159 -1204 571 969 -1025 -528 1121 179 -747 -143 109 208 96 -584 -325 988
2328 988 195 -1301 13 1316 -474 -1029 1014 836 -700 -629 455 422 -278 279 -340 201 863 -380
2346 -380 -454 1295 135 -1215 138 1271 -473 -981 546 291 -856 -93 521 -158 -112 -19 -658 289
2364 289 611 -590 -159 1154 -124 -1045 568 1018 -534 -850 930 361 -919 25 463 208 -83 -267
2382 -267 -414 629 321 -1192 35 1384 -162 -1991 781 1122 -884 -895 567 601 -582 -423 259
2399 259 317 404 -709 -291 1180 154 -1200 -142 1841 -157 -1256 494 708 -569 -534 629 100
2416 100 -168 -179 -452 120 521 -713 -70 983 56 -881 166 932 -557 -793 694 309 -961 -42
2434 -42 621 -166 -4 -242 32 604 72 -518 141 1043 -272 -1081 542 1025 -848 -469 870 47 -532
2453 -532 -299 134 144 201 -586 -775 488 476 -1223 -184 1317 -137 -740 458 730 -341 -72 374 159
2472 159 -204 121 -74 -214 669 -336 -200 699 251 -988 3 744 -465 -702 417 375 -371 49 209
2491 209 33 25 -180 -342 373 260 -310 -200 901 -129 -1093 408 706 -673 -484 294 632 -307 -180
2510 -180 306 264 -120 -356 -199 91 224 -822 -450 1167 3 -1466 266 633 -549 -447 156 485
2528 485 97 -239 -278 316 702 -486 -629 886 490 -925 -174 926 2 -735 91 312 -235 -309 133
2547 133 -280 226 -93 -393 -225 395 -394 -444 497 32 -773 207 661 -231 -714 392 329 -140 -303 -6
2567 -6 330 68 -461 -435 556 -148 -603 -61 890 250 -947 33 540 -369 -545 254 457 0 -430 -224 276
2588 276 435 -613 -52 751 451 -958 -460 745 148 -626 104 545 33 -434 213 398 240 -236 -188
2607 -188 326 459 -473 -371 667 354 -854 -325 610 238 -369 90 321 -248 -176 130 262 354 -210 -14
2627 -14 746 147 -460 -21 848 57 -755 326 550 -152 -138 346 282 -131 -301 -74 423 23 -659 -335 418
2648 418 160 -538 -333 822 -21 -547 90 673 74 -332 -206 635 331 -257 -22 185 368 -409 -274 550
2668 550 408 -468 60 213 172 -416 -260 136 142 -62 -333 100 -6 -7 -25 60 236 -441 -350 494 -81 -270 -155
2691 -155 282 231 -530 282 344 250 -72 176 474 95 -229 71 299 34 -313 -269 407 214 -719 -366 764
2712 764 314 -444 -363 141 422 -554 -280 515 217 -272 -242 394 364 -288 -320 278 382 -54 -371 186 491
2733 491 -253 -85 351 246 -350 -86 311 202 -299 -194 194 2 -159 -351 251 382 -196 -218 532 -21
2753 -21 -453 -106 80 216 -453 235 441 77 -618 -243 46 11 -92 -30 600 228 -472 -415 450 230 -688
2774 -688 -286 229 146 -451 -340 261 152 -375 -237 304 109 -235 -445 -17 621 -254 -518 519 215 -386
2794 -386 -242 447 35 -324 53 357 124 -202 -41 8 294 -176 -365 337 97 -295 -385 368 269 -500 -60
2815 -60 312 -250 -433 -22 261 221 -153 -275 -41 351 -425 -96 464 213 -574 -152 568 226 -524 -252 306
2836 306 47 -99 -224 62 213 -199 -365 136 563 -406 -623 259 352 -512 -89 213 -72 -240 -52 133
2856 133 238 140 185 -21 276 133 -609 98 414 -430 -156 98 146 -387 -51 -66 -254 -128 7 -173 -132 66
2878 66 -219 -19 490 213 -458 296 623 -157 -292 308 85 -116 -6 183 -60 -108 197 76 88 196 -168
2899 -168 17 383 -351 -432 361 543 -541 -222 474 151 -448 -252 195 218 -232 55 -145 378 244 -334
2919 -334 76 825 -386 -427 673 517 -126 -112 235 33 -335 -216 19 74 4 -594 -197 188 -13 -504 143
2940 143 453 -443 -253 554 264 -301 257 169 -230 -246 29 -6 214 92 -431 249 358 -115 -357 244 517
2961 517 -462 -99 337 77 -544 -203 63 -240 -323 -248 149 182 -12 -287 45 516 -170 -474 656 364 -418
2982 -418 -280 -20 149 -94 120 -25 57 -121 -90 -250 236 -19 -481 305 251 -291 -462 342 -160 -296 -45
3003 -45 464 -239 -57 77 -201 -16 222 -360 38 241 -55 -270 185 278 -383 -249 254 171 -430 -225 185
3024 185 -39 6 -16 -44 412 45 -497 -131 320 -302 -412 9 275 -482 -8 513 1 -74 -39 291 56 153
3046 153 -72 -269 356 39 -204 -170 127 -55 -230 327 79 -444 -94 138 36 -92 59 154 102 106 -299 -309
3068 -309 414 -159 -177 -219 457 -97 -156 194 29 -245 -224 355 -247 -63 -248 36 298 61 -450 16 395
3089 395 -147 -257 218 387 -453 -301 392 259 -385 -185 -1 163 45 -92 -84 187 193 -243 58 418 -243
3110 -243 -339 242 200 -341 -125 257 -15 60 -203 210 378 167 -117 -441 382 20 -215 -148 76 31 -460 168
3132 168 305 -90 -130 220 228 76 78 -103 73 137 -305 -174 321 -51 -353 369 326 -252 -157 281 262 -461 -94
3155 -94 141 18 228 -81 -271 271 -64 -287 -73 286 -173 -549 -28 -28 -182 -438 -176 429 37 -170 -390
3176 -390 238 235 -408 -193 218 30 -406 99 174 -163 -191 241 325 -2 -117 49 -27 53 -36 157 -31 123 -169
3199 -169 -102 211 20 -301 -176 219 32 -54 90 -48 32 223 -202 -71 -139 -74 183 124 -104 -133 122 120 -95
3222 -95 -312 -227 201 -19 -169 -7 18 108 -227 -218 20 -84 -83 53 324 -47 -193 55 590 -142 -203 113 11
3245 11 34 45 221 114 -13 -10 -149 -39 -81 37 -185 230 125 -224 92 240 29 -83 123 13 -67 -31 58
3268 58 490 -261 -138 151 93 211 -31 234 168 -65 59 -55 248 155 -280 53 293 -145 -85 213 113 95
3290 95 -124 -164 400 327 -468 81 172 47 -127 -59 204 -448 -327 171 229 104 -118 -150 200 -52 -183 95
3312 95 -97 22 -64 9 237 144 229 -61 67 -114 -172 20 -136 -174 -86 40 221 215 -10 380 164 -6 214
3335 214 7 -106 38 -124 201 122 -1 -113 189 163 155 -145 117 -39 -78 -233 163 256 80 -257 -175 313
3357 313 -199 -226 111 76 112 -277 -308 137 119 -418 182 249 115 -231 -352 55 -58 -306 -188 168 83 -44
3379 -44 -119 31 55 -183 239 250 -92 -210 414 86 -220 146 1 17 -76 -271 -42 156 42 -132 -69 81
3401 81 -293 -397 55 223 -313 97 -144 467 -281 147 -65 -76 139 -303 145 -98 -22 -163 12 -59 -163
3422 -163 -337 -97 38 -131 140 115 -96 160 -289 -87 -186 124 -396 -157 255 148 -271 50 72 175 -337
3443 -337 -214 103 43 -38 134 88 89 -17 -125 266 282 99 116 243 -62 -92 -255 321 112 -364 263 -52 208
3466 208 64 10 42 -2 153 -29 27 122 -267 42 223 -19 -347 -11 172 -199 -158 -219 -19 7 126 -33 289
3489 289 281 -354 -370 142 211 -398 -430 352 133 -296 -114 65 66 -146 198 -32 76 75 -231 -274 352 -180 -485
3512 -485 161 180 -197 217 314 -53 -136 -153 186 -152 193 -38 -345 190 -152 -252 209 -366 -139 14 226
3533 226 -4 -101 245 18 -257 -171 -65 145 21 -72 -59 245 307 285 -146 118 245 -349 -207 282 -60 -380
3555 -380 -83 -97 -126 44 14 -85 274 12 -407 148 111 -231 -245 196 -4 -137 -222 367 -172 -153 161 -4 -178
3578 -178 -184 80 -8 355 -43 -184 -15 161 -260 -174 128 -318 122 -128 457 218 -65 90 -26 139 -73
3599 -73 -130 -226 162 134 -238 33 -85 -150 -201 282 -137 129 -202 101 148 -155 -82 -153 218 102 -299 -112 205
3622 205 -178 -12 85 1 -66 -122 172 35 -259 -58 107 36 94 38 128 361 52 -105 15 217 -15 -45 123
3645 123 348 -110 193 -51 -180 -152 -56 28 233 183 -7 -17 98 -79 -358 19 -1 -24 -5 103 123 -377 -50
3668 -50 -11 128 212 -166 220 128 9 77 178 -221 -103 28 246 154 -47 -174 50 49 127 -203 59 370 -45
3691 -45 -274 115 -62 20 -133 94 31 -218 -374 74 85 -110 -70 7 -128 133 65 178 152 -41 98 -296 291
3714 291 -131 -157 90 236 -148 70 270 -256 17 -209 2 -69 -8 -71 -61 -98 -232 -261 -34 -180 -289 -4
3736 -4 88 22 322 -10 209 26 -132 -47 -18 -55 104 -187 27 128 70 -246 -114 6 160 -337 -35 -58 113
3759 113 -297 79 115 -113 -344 3 -4 143 -81 12 -29 -34 -81 -52 -89 -81 32 -115 121 -427 -302 -3 109 -162
3783 -162 -139 15 -25 -380 100 -4 142 -6 -70 218 241 -35 99 113 24 113 -188 185 164 28 -98 177 162
3806 162 -15 -292 93 246 -160 -227 -161 32 -221 -244 156 99 84 88 48 39 204 -29 137 210 -112 -2 234 25
3830 25 44 -16 49 100 -41 -128 -79 171 21 -336 192 72 128 -202 11 50 277 -344 23 -83 -151 -266 174
3853 174 6 -205 -308 225 199 -92 113 79 -79 -27 206 25 218 -19 244 52 197 -81 -138 -144 11 -114
3875 -114 -19 113 128 -13 179 -77 110 -82 307 164 -82 -285 -90 -29 99 31 -150 -198 157 2 -175 -313
3897 -313 112 41 -118 101 176 66 -303 90 78 65 -86 116 -12 0 -187 192 77 -46 -5 -217 24 -37
3919 -37 -42 -206 105 150 -76 69 313 121 59 -90 100 -47 -17 -2 129 111 136 -190 36 -14 -160 127 103 -77
3943 -77 -59 18 205 65 -126 -119 -52 -53 -18 151 -66 40 -207 -126 94 0 127 -52 99 -12 -86 -111 90 268
3967 268 144 91 29 134 -265 -125 97 -83 -226 -59 14 218 -180 -154 28 18 -32 314 83 -49 -48 76 16
3990 16 -88 148 -35 49 -133 142 -171 121 -168 -347 32 -33 190 -138 -20 185 14 -319 -343 286 -201
4011 -201 -192 -15 380 -50 -77 283 -154 9 265 107 204 277 -27 199 49 338 -100 129 -16 -56 -108 -82 155
4034 155 -275 67 94 -102 -122 165 -7 209 52 -58 303 90 135 3 67 193 -133 -25 -5 157 2 70
4056 70 87 -51 -162 -14 41 -68 297 -249 274 47 -77 -20 66 -157 -35 -328 -39 56 -3 -150 -25 61 -120
4079 -120 -27 21 -47 -244 -146 -166 238 -184 100 -13 39 -120 39 -286 162 91 -108 -13 155 98 -163 -12 178
4102 178 -112 -162 -38 -270 -179 -80 71 -36 -4 36 186 -66 117 -47 63 -165 209 -400 -282 179 -89 -388
4124 -388 -127 256 -48 51 -58 72 196 266 -53 31 393 -169 -325 196 -7 -270 -15 75 192 -99 -112 221
4146 221 -129 186 167 -149 248 -33 -180 -106 63 157 59 116 187 -24 -29 336 -123 13 -191 -35 -214 86 71
4169 71 -33 126 -34 -195 90 150 -59 -185 132 65 -171 153 103 64 -204 -95 13 204 -106 -27 36 46 -122
4192 -122 -175 9 186 -194 149 248 -183 24 211 -59 -119 -38 -338 78 100 286 -13 -149 238 -187 -271 83
4214 83 -142 95 272 -24 159 85 -122 -124 10 95 -126 117 -74 -70 120 54 66 -228 228 248 179 -20 -58 204
4238 204 -41 209 102 412 131 -261 -47 -163 331 15 -278 27 -8 -116 -39 -22 -18 19 -2 185 -35 -259
4260 -259 35 94 169 -263 2 335 151 -125 -19 126 0 -40 -70 170 -17 -87 21 121 165 -61 183 -220
4282 -220 347 -126 128 -50 90 -73 -102 213 328 -62 90 24 -41 304 189 -10 -169 22 207 129 35 157
4304 157 -11 -240 61 -73 172 -146 128 -93 -81 198 -144 164 -143 340 8 113 -14 71 95 -191 -157
4325 -157 18 -81 -390 151 224 136 -98 -248 -22 -55 -29 168 -53 114 -139 -12 215 -25 -220 -165 -95 240
4347 240 -4 -54 31 -115 207 -415 -128 195 -2 -199 -143 -44 -61 -350 3 118 -139 9 118 2 -120 50
4369 50 158 89 166 -182 -58 243 -77 -48 36 328 -50 -209 63 -43 -281 210 87 24 -159 -194 -58 -14 -99
4392 -99 13 245 -23 321 -107 235 153 -109 -163 -188 240 -51 -49 64 206 84 -74 106 75 -67 -144 22 25
4415 25 -216 -68 295 -67 7 -27 142 165 -124 -136 -198 282 -360 -186 168 135 11 0 -130 276 87 12 177
4438 177 -70 42 -24 9 82 -192 -17 -32 123 -44 -146 80 203 97 28 34 140 -214 93 112 311 -54 -59
4461 -59 -27 -87 -31 33 59 -40 -17 58 144 362 88 -36 124 -166 -6 -58 -66 -28 -53 15 94 -93 232 -22 -39 21
4487 21 -97 -260 -18 -268 -101 -109 113 116 -247 -64 59 -34 -53 -48 118 76 -255 58 144 147 -221 105 -19 43 -70
4512 -70 -20 146 -303 179 -9 -224 18 105 -62 172 190 -235 -120 193 -77 -136 -68 129 70 54 87 90 84 -91
4536 -91 -146 148 76 38 -80 -41 283 67 -51 106 454 167 60 -133 74 24 146 128 33 -39 -37 175 145 -8
4560 -8 -363 330 111 219 150 -69 445 -165 -77 110 -117 -18 -50 58 4 -203 -131 128 188 64 -129 -36 71
4583 71 -231 314 -27 -71 -127 -19 -153 -122 29 -83 -244 64 -75 -119 -33 -1 -189 -57 -22 -2 172 61 -15
4606 -15 -27 153 3 -56 148 76 -149 -155 231 -1 -203 217 102 -23 -3 -3 -188 155 28 74 -81 -97 -74 2
4630 2 166 -112 160 -67 279 -129 242 221 33 -263 -56 84 93 60 26 -53 -162 94 -257 -111 34 31 -236
4653 -236 85 170 -125 -205 11 331 17 -218 -27 -15 115 -103 82 -41 264 -291 -7 50 -104 -209 129
4674 129 -196 206 -201 365 -37 -90 23 24 159 60 139 54 -81 140 99 117 174 -116 30 -30 327 113 -259
4697 -259 -80 94 107 99 -68 173 95 115 38 156 -165 -198 155 185 138 -162 99 114 -80 289 25 110 28 46
4721 46 96 390 -110 66 135 19 53 -141 -151 -78 47 -315 266 -46 8 -128 -44 154 -47 16 -145 -42 -53
4744 -53 -141 75 80 89 -145 56 392 -223 -70 -193 183 -170 256 -65 58 110 -166 -124 -95 351 -350 35 115
4767 115 -85 -240 -11 8 -83 -145 71 75 209 172 -326 253 -48 -181 -31 55 75 -302 106 265 -110 -230 15
4790 15 116 286 -231 -232 139 -159 254 95 176 -28 -35 76 9 180 -9 -83 7 -136 62 241 -128 -178 186
4813 186 148 -83 -102 -141 -93 119 104 122 -188 163 154 -219 -51 -94 258 -7 -102 -194 115 -76 -11 46 166 -39
4837 -39 -153 241 68 -162 -90 172 -41 96 91 -118 -208 -71 -94 149 -66 0 -163 58 31 -53 284 121 -152
4860 -152 -252 -124 205 289 -280 135 -48 -2 -26 -172 240 -20 -81 -283 -33 -133 -104 -8 232 -88 -92 184 153
4883 153 67 60 263 -57 4 -19 161 25 -36 -265 -153 100 171 -263 89 -193 -126 -238 81 -206 -5 -164 248
4906 248 -18 71 -226 40 -67 -91 -147 -285 166 14 182 -9 104 4 -68 -117 241 -22 -93 -37 170 83 -118
4929 -118 -132 -2 -170 7 55 183 137 -111 111 -158 -72 0 116 -381 191 126 4 -1 -52 170 22 275 217
4952 217 11 225 45 141 27 41 -253 15 13 182 325 9 -93 61 -7 -39 -230 210 -18 -110 228 -102
4974 -102 72 33 55 -123 -18 16 -40 -276 202 -112 -20 95 357 18 -161 173 18 9 82 64 -143 21 -256
4997 -256 389 37 -48 220 82 46 -28 -111 102 69 -269 147 -64 -105 66 14 56 105 59 20 -138 41 257 24
5021 24 -32 -59 51 110 -66 130 83 103 -104 28 -30 86 -162 96 -97 197 -434 -216 -93 -81 -74 60 197
5044 197 129 -21 203 144 163 -195 185 22 -61 -445 -46 85 -247 -80 -113 -91 -220 174 -63 15 -341 244
5066 244 -32 89 -25 -66 -60 -132 44 255 190 -265 206 24 -86 165 158 -310 37 159 -98 -216 262 245 -75
5089 -75 14 -110 172 -182 -86 20 71 138 -139 -59 -45 -129 -267 95 5 26 -185 139 131 -30 197 75 37 6 -210
5114 -210 53 301 -245 -120 -189 161 -90 -189 -90 104 -18 -271 -72 120 211 -68 -149 37 -73 -91 168 314
5136 314 -58 79 -180 56 169 -190 271 -122 -158 34 308 191 -95 327 53 84 107 -67 73 -60 -61 -109
5158 -109 -113 -243 -213 -193 115 97 -26 -236 1 -222 230 139 159 95 16 -93 14 -96 88 29 -47 169 -301 74
5182 74 88 -27 -134 -29 61 -311 -96 104 281 29 -105 85 14 304 -20 108 -19 88 -128 -155 101 23
5204 23 -26 -99 24 10 50 82 -98 -26 25 -291 170 -71 -25 41 -3 9 189 -72 102 283 -148 42 7 18 -78
5229 -78 -23 -212 -105 -14 -32 308 223 -1 202 156 -79 -10 -66 93 -27 -83 -76 -27 216 -169 -49 -20 -202 48
5253 48 34 -141 94 39 75 101 224 32 -43 3 -34 -97 -36 245 -81 251 -115 -295 121 -113 -85 -226 239 158
5277 158 -101 103 82 -151 -3 56 21 54 5 180 -59 104 48 -22 138 -171 -134 -31 47 206 8 50 88 43
5301 43 141 117 -115 -103 -215 -18 132 -141 -53 132 189 -60 -139 -45 -262 -109 255 29 1 -29 -159 260 -141
5324 -141 -246 122 -154 -210 -17 -284 -144 -173 156 234 98 -5 -17 0 -55 103 -38 -113 28 364 152 -104
5346 -104 -96 153 20 118 36 175 -85 65 194 -219 -86 -55 -132 36 -5 207 -312 -34 36 183 -172 -87 -37
5369 -37 -29 -224 -55 8 73 14 75 -28 -160 7 156 16 -53 9 81 -228 -12 95 1 24 -130 -90 -151 -58 58
5394 58 -94 -336 -422 74 208 -184 -63 68 155 -56 -90 4 25 -98 70 -118 138 -72 44 208 69 4
5416 4 -98 -180 -222 69 111 211 242 192 -239 64 130 127 89 -14 84 -56 -7 -113 386 207 -102 -81 -52 153 291
5441 291 -128 25 -25 -48 -265 71 -2 143 -135 -151 103 -86 -269 107 -77 -100 -37 -103 102 -58 -461 19
5463 19 306 -32 165 149 -5 273 -283 -156 -11 45 -93 -45 -84 -122 -68 -117 58 109 -69 51 207 60 -164
5486 -164 183 -71 -19 208 36 46 -82 136 -17 -16 180 131 -138 160 -146 -336 59 -169 42 0 145 254
5508 254 205 29 116 275 224 128 -124 -70 139 63 -75 9 -120 114 -26 -206 -5 -19 -36 -109 -172 42 -18 154
5532 154 77 73 76 -27 42 49 -128 67 -12 -122 -39 -63 252 47 -102 77 -164 -70 31 86 -11 76 119 47 46 -209
5558 -209 -20 -37 -150 -65 -266 -55 0 -61 -127 -172 45 179 -12 -58 53 -67 16 -283 -76 219 -236 192 -92
5581 -92 -168 21 31 -196 -80 -72 219 -136 -34 17 -167 155 -41 -42 145 73 -3 44 123 138 7 14 234 78 -98
5606 -98 1 -92 80 138 88 48 171 94 -289 221 -20 -87 51 -104 92 264 -37 -161 -213 -94 -111 359 67
5629 67 -50 -9 106 -276 23 -327 -172 -8 40 55 63 -75 22 166 37 -209 -109 106 55 -12 38 42 10 -225
5653 -225 -62 310 -242 248 109 -106 155 -49 -60 -1 36 140 -224 -67 -4 -12 -142 308 122 -46 -50 -72 -195
5676 -195 -193 -12 175 -195 121 133 -97 -65 95 224 35 -100 31 28 -29 -59 84 -46 7 -65 267 -9 13 21
5700 21 -175 65 -208 -52 -139 -51 71 174 -33 85 164 97 273 -83 129 -120 -95 39 16 -25 -65 -87 -170 152
5724 152 9 38 -99 -154 202 -141 -89 319 -93 -424 198 -52 -132 -53 -110 94 78 -97 59 -125 -97 131 32
5747 32 20 -145 110 96 309 217 -63 -255 1 -46 -5 -50 60 71 -31 8 -40 -119 -181 149 88 88 104 -116 -282
5772 -282 47 184 -18 16 -258 -121 131 -114 -207 -73 139 126 0 50 -13 20 6 -134 -52 100 141 -101 -2
5795 -2 79 9 127 -8 -40 93 -214 62 -113 350 38 -23 183 -145 -103 218 -100 -63 -171 -184 -66 192 479
5818 479 9 -61 28 -175 -242 -7 -74 -258 42 -168 2 220 -124 79 -57 48 -270 -133 -42 39 -147 -74
5840 -74 61 -259 263 -2 -284 132 -16 76 -77 -160 204 147 85 -41 -264 -24 237 -94 -61 -23 -258 22
5862 22 -149 38 287 -9 -105 -104 -123 -108 274 33 90 -32 227 95 107 28 -135 -64 63 -28 -74 -2 100 19 19
5887 19 -80 -58 -48 83 243 -36 -8 6 -109 -130 275 126 -100 61 -108 -83 31 23 129 -286 -29 54 207 48
5911 48 5 -237 70 179 187 -31 -29 74 -169 213 -141 -29 83 5 225 114 198 5 54 -274 2 140 164
5934 164 -107 -79 187 191 51 215 -99 -60 93 76 3 -57 66 -84 48 -304 -67 -56 226 60 148 126 41 33
5958 33 125 144 12 131 -76 -266 -115 -29 -112 -28 7 -53 -153 -36 17 46 102 -103 -150 193 19 226 -56 7
5982 7 -50 148 -16 232 153 -48 92 -140 274 64 180 27 -148 -50 180 -69 107 -54 55 -207 -23 -28
6004 -28 175 96 -286 36 -102 21 -185 -4 52 -26 76 282 143 -243 -113 208 2 -40 135 -130 -79 20
6026 20 -139 157 -74 -56 193 -146 -66 55 -142 -111 60 0 -34 222 16 -253 187 -209 -41 144 -10 11
6048 11 136 53 50 -319 41 171 -145 195 174 180 -131 -213 94 -28 -156 91 97 -102 49 151 -46 66 162 139
6072 139 96 -102 -3 186 -41 -98 -38 31 -54 181 -28 -110 -131 66 280 24 137 73 236 158 33 -193 -109 177
6096 177 -215 191 -43 46 -111 -259 -76 163 27 66 -94 208 -49 17 219 -6 14 14 -73 43 -16 -31 375
6119 375 26 -32 -257 3 -140 22 -175 -239 175 -198 59 54 -50 45 61 -105 17 313 261 62 133 138 175 -43
6143 -43 17 -23 -137 39 -199 -202 -213 -36 -20 55 103 -81 -85 103 -111 20 -63 -10 106 -109 231 -16 67 -25 169
6168 169 -5 98 108 -70 -120 314 -165 526 311 5 -57 -42 -93 206 -6 -180 83 164 -135 -116 51 -18 165
6191 165 26 -56 -130 -174 -179 63 -84 158 79 148 167 203 19 41 40 -172 -1 31 -115 -55 20 -114 -282 -69 -30
6216 -30 75 168 -252 50 160 -176 -76 105 104 -197 231 -25 -133 -125 2 145 -211 82 -135 -55 94 -103
6238 -103 107 -62 -74 -46 -60 -149 -194 221 41 183 28 3 69 216 -298 -122 186 0 -27 15 -25 -378 81
6261 81 -20 -18 -129 376 33 -193 147 69 -26 50 157 -68 -13 92 108 13 5 -121 51 -171 43 217 83 -166
6285 -166 -88 33 316 -189 92 62 79 27 -40 -105 -8 86 18 -34 150 -199 107 -64 -244 -110 -71 -17 82 27 -35
6310 -35 164 -121 -37 -154 79 -158 -1 53 89 164 170 109 -203 -123 -155 -51 119 117 17 -107 166 -116 144 24
6334 24 -221 119 58 8 -11 -89 -9 -94 64 -55 44 -174 -108 33 -258 69 42 130 16 -33 143 -253 -111 -30
6358 -30 116 67 13 -115 -101 13 137 247 144 6 -14 -204 273 21 -18 -177 -19 34 29 22 2 -57 -159 229
6382 229 -41 42 83 -185 -199 -227 8 -67 -168 -177 -60 -110 77 -32 79 -9 99 290 156 42 68 -149 -70 -161
6406 -161 -1 -172 -95 52 -139 201 -101 -93 79 165 -181 90 36 5 2 -221 -193 51 160 16 107 -195 -120 47
6430 47 -49 119 -34 -28 -174 -159 -273 -6 38 63 42 4 244 -25 -4 -350 -78 -178 -168 185 -1 57 53 -291 -139
6455 -139 -161 -201 302 195 -126 6 -85 164 75 -4 240 248 124 -12 -92 -57 -91 71 -100 -111 -300 155 -13 -143
6479 -143 -34 95 95 32 134 -42 -351 106 81 -112 -347 -55 100 -67 -264 -137 -30 -206 77 97 3 190
6501 190 28 -4 -54 52 -102 -253 -188 149 -204 201 24 47 9 -50 -169 -205 150 -155 181 -110 144 7
6523 7 54 175 176 213 14 -17 101 -14 -80 176 32 10 134 3 203 268 -47 -40 -5 -168 49 -6 -133 85 99
6548 99 104 54 102 -75 7 -58 37 52 -26 -276 56 -142 -53 -258 -188 -144 89 113 -288 188 -247 44 95 95 -75 316
6574 316 -34 136 191 0 280 16 38 -5 205 11 -81 101 45 -221 25 95 214 142 -152 -100 11 169 228
6597 228 280 -275 98 -180 -38 -216 181 -26 56 -239 246 -218 -82 202 -389 197 -10 -72 75 -21 200
6618 200 181 76 83 -9 78 -69 111 152 166 -259 43 99 -120 102 -339 113 -172 -115 33 -12 72 -86 -155 85
6642 85 -88 49 47 -191 136 34 -73 -96 -120 75 28 -140 -6 70 125 35 -63 -65 179 -25 28 94 0 -249 48
6667 48 34 -74 68 174 -47 -196 173 -8 147 -44 101 -75 -138 82 -28 17 -145 -35 266 41 -192
6688 -192 -203 -297 173 -170 -207 94 91 -107 -119 -155 -137 -218 -39 -216 -86 -196 44 -132 78 108 -60 226 87
6711 87 -110 -6 -247 -22 106 -80 -215 -141 81 232 90 148 19 -24 -97 -98 15 181 -173 11 156 50
6733 50 156 -101 15 -101 -134 27 -87 -94 -51 2 168 123 -206 -198 -29 -12 -210 -65 204 75 69 -32 93 66
6757 66 -99 -87 -62 -102 -20 -1 82 -106 97 -5 104 215 9 -41 -38 130 36 70 -103 134 -35 -233 288 164
6781 164 -290 -273 197 67 61 -48 132 -280 130 -8 -133 119 -94 -147 274 34 104 476 -84 -175 179 -227
6803 -227 -106 -39 24 129 -80 96 -3 -268 85 -153 -131 -277 138 -15 -109 -40 39 -153 21 -37 209 -232 -99
6826 -99 -28 -207 -54 307 -1 -125 -33 -172 -211 -28 115 -120 147 -98 29 -70 11 104 -8 -174 175 152 -53
6849 -53 -54 97 -127 210 -49 -53 255 59 -322 -13 -32 162 -244 -56 -243 -110 128 214 325 146 34 -23 22
6872 22 65 162 -162 -46 -147 151 14 -90 -29 -159 -23 -167 324 -206 104 187 -8 85 -97 91 -8 90 -120
6895 -120 -141 -121 120 -142 179 14 -20 8 -11 197 -15 142 -40 220 13 -114 67 -71 32 -201 46 -34
6917 -34 118 -3 -145 51 -218 -56 151 -7 -222 111 -116 -182 -104 65 208 15 98 -32 -65 -20 -19 80 -115
6940 -115 -297 -63 -76 47 71 15 22 -188 161 -158 -51 -84 -93 -37 -40 9 264 -39 -58 67 30 82 106 30 -352 147
6966 147 41 58 39 -146 -150 -44 103 276 -78 -85 -162 -44 -128 -172 49 -90 18 -109 -198 -38 -28 -117 179 68
6990 68 -58 404 74 326 -159 76 163 342 186 32 -83 186 181 -103 -85 17 -86 113 95 -58 123 -131
7012 -131 162 -174 -72 -66 99 -54 -76 92 130 -23 14 13 67 -48 151 -13 153 -11 192 209 -85 168 50
7035 50 -131 30 331 -142 150 -89 -53 -36 152 112 139 -81 161 101 209 -170 -84 121 103 -119 165 80 -174
7058 -174 183 -67 -141 -135 13 -236 -25 -189 97 -128 170 78 -49 58 -230 -99 -274 -31 93 30 -110 -236
7080 -236 -149 -50 -96 -143 -208 -14 -193 -11 -88 -93 -133 -7 123 336 76 42 106 -33 93 186 130 75 -97 -113 122
7105 122 72 65 -122 303 -12 -40 -26 37 104 -194 -148 67 253 124 -72 134 63 10 10 35 -87 290 -11 -88 57
7130 57 -26 -403 -78 -262 120 -132 -28 -68 -183 149 71 225 -41 290 126 125 197 192 69 -64 60 -98 6
7153 6 -60 -298 -183 276 140 -13 -92 -238 62 80 166 133 -37 54 177 -146 -33 -254 424 286 52 38 -110
7176 -110 208 160 89 -69 -8 90 -101 -122 -32 -45 -221 64 163 193 -34 -199 9 77 25 284 235 -18 100 271
7200 271 104 -59 -174 96 33 -99 239 -62 93 -53 -133 -104 -49 -9 104 141 283 -6 -82 49 30 -256 -143
7223 -143 -68 157 -122 -3 -213 -60 218 176 -180 130 111 -378 8 47 171 120 -1 73 153 -286 68 -180
7245 -180 37 183 184 -85 -67 130 68 147 134 -40 -126 -52 6 254 141 138 -49 -51 173 -124 195 -177 -308 369
7269 369 269 96 -51 -94 9 -284 -217 319 -138 -140 -33 -125 14 115 87 -103 -84 58 66 -59 -55 -201 33 247
7293 247 -204 -15 124 73 360 125 -94 -114 54 -163 30 -185 -18 -87 -199 19 -108 212 18 -88 18
7314 18 89 104 58 8 317 -185 -88 -11 -180 -219 31 -42 -166 -1 69 116 -85 -46 48 19 31 79 -44 46 -338 7
7340 7 -26 -54 -18 -21 145 84 48 19 -69 133 -5 -35 127 -111 -8 -221 -208 306 -107 -61 -123 231 53 62 53 148 108
7367 108 -118 14 -57 -55 -174 242 105 38 172 16 74 -57 -101 13 5 21 18 -280 -73 93 148 53 -218 -131 -183
7392 -183 0 -27 -55 -242 189 312 28 -34 193 -89 -115 -226 32 -37 -13 201 84 132 -33 -19 -198 -1 215
7415 215 99 67 -105 -276 81 77 125 151 37 97 8 -132 -100 -83 91 129 -167 -91 -63 16 30 -141 51 172 -34
7440 -34 118 -131 -182 65 -262 137 -252 29 -258 16 85 -103 151 -57 61 -142 -125 267 -9 -57 113 146
7462 146 -235 -294 31 115 -31 222 -11 -265 -288 -171 -120 -108 3 9 136 -40 -10 -27 -32 226 15 50 -71 140
7486 140 -146 -58 -1 32 -263 -159 -162 188 -22 246 -22 -67 -10 -136 -92 109 -26 -60 -17 34 -155 -141 253 92
7510 92 -330 290 -133 -203 -51 -5 115 -83 -44 -238 -70 -94 100 -17 96 3 49 -105 169 165 160 42 204 37
7534 37 -88 1 -12 -164 -34 -72 118 102 -20 93 54 10 -455 -167 -166 122 50 -121 17 48 67 76 85 -38 94
7559 94 198 -73 -192 -183 2 -52 50 -200 -70 124 84 -89 -347 -105 -100 114 -145 -96 -172 -392 -145 12 -87
7582 -87 90 -241 -40 -134 111 -199 -122 71 38 14 -161 15 113 113 -186 41 82 155 -18 143 -46 -34 -20 69
7606 69 84 -67 35 -23 -28 -34 170 -127 -128 -50 -3 194 89 -4 -330 222 -255 -28 3 91 181 8 208 35 -25
7631 -25 -1 -38 59 111 108 35 179 -20 -410 -26 54 135 -406 20 -184 50 118 -22 178 -198 -44 47 176 -103
7655 -103 -81 -23 123 169 203 -142 -86 34 -119 6 -151 -124 24 -29 -53 221 -233 106 -26 -246 -92 86 -133
7678 -133 -200 -106 -73 141 -53 279 15 18 285 178 -214 46 136 45 153 4 6 101 205 115 -20 -161 154 -147
7702 -147 -106 47 100 52 97 -252 34 134 114 -103 157 -50 112 206 -39 39 133 187 222 196 -115 18 -3 263
7726 263 -162 36 -4 53 -155 57 -260 80 195 -207 -135 -33 -74 -19 -83 -276 -114 -120 414 58 141 56 158
7749 158 291 236 -2 178 -132 7 -72 -107 -18 127 151 -150 329 -6 16 234 39 -352 -139 -27 -57 -49 120
7772 120 -42 255 -60 -209 13 334 165 111 49 -199 -98 -49 -175 138 -337 -55 -103 206 195 71 -218 -58
7794 -58 -283 81 -108 47 -116 -173 8 -268 103 -182 133 -75 -276 235 -191 55 -302 140 114 139 49 -106
7816 -106 185 -51 18 17 88 264 -18 -98 5 -35 -136 37 13 -64 -155 -68 51 86 -39 126 34 -19 26 -75 202
7841 202 -129 -40 -165 134 184 74 -299 31 76 -183 -119 -187 118 157 -104 -34 251 108 122 45 260 103 104 -269
7865 -269 -149 -199 163 -186 -156 -42 -20 -22 -190 253 -145 -9 225 112 -177 98 165 -139 105 -114 242 141
7887 141 -110 -47 -390 -199 167 101 12 24 -4 -156 -138 31 -380 204 154 -47 31 156 149 -21 157 94 -104 -234
7911 -234 -96 85 -76 62 -55 26 178 -172 -9 -103 119 43 62 -131 81 -14 10 -72 69 185 -62 35 102
7934 102 69 -96 -267 317 17 47 -18 -48 134 -223 5 -102 78 -87 -252 53 63 141 -222 319 -10 -24
7956 -24 75 -362 116 23 -144 -79 -57 -192 59 -77 119 4 5 228 -107 107 103 82 142 -52 346 152 136 137 130
7981 130 113 170 -362 -277 161 -146 4 39 17 -90 -100 -112 53 192 -116 -157 106 88 -87 -103 348 210 -43
8004 -43 -90 21 121 -195 69 -11 247 85 -263 263 210 109 -98 52 111 136 112 -76 -10 -41 -42 -13 159 -166
8028 -166 45 70 204 13 -216 43 66 -40 -226 6 38 -164 59 122 31 107 237 222 -51 171 399 156
8050 156 217 -122 104 93 13 -20 44 -20 143 122 186 109 -5 -76 -13 -58 2 131 -107 10 225 95 3 13 150
8075 150 30 214 17 82 111 72 184 -110 301 -179 -71 241 -100 -47 122 -19 -198 -4 -48 299 -139 -299
8097 -299 165 -256 -148 6 39 163 226 4 128 -26 97 200 -285 -127 -118 87 382 -63 75 -35 82
8118 82 -154 52 -30 -127 -55 -68 -3 -55 84 298 -36 83 -212 73 23 -204 390 -53 129 208 46 -169 27
8141 27 172 2 36 67 14 244 -167 -36 23 -15 -49 2 -71 80 36 39 160 123 -96 -71 87 201 76 -159 69
8166 69 35 -48 -125 123 69 256 -113 -103 12 -53 -135 -107 -63 -8 9 -119 -45 59 -9 -73 -97 -143 30 -53 160
8191A60
##END NTUPLES=NMR FID
##END=
