##TITLE=1H_Ser Cl-Ac
 CDCl3
 8 sc, 
 26.12.2024
##JCAMPDX= 6.0         $$ Bruker NMR JCAMP-DX V2.0
##DATA TYPE= NMR FID
##DATA CLASS= NTUPLES
##ORIGIN= UXNMR, Bruker Analytische Messtechnik GmbH
##OWNER= root
$$ XWIN-NMR		Version 3.5
$$ Thu Dec 26 14:04:20 2024 Russian Standard Time (UT+4h)  she@DPX200
##.OBSERVE FREQUENCY= 200.1315
##.OBSERVE NUCLEUS= ^1H
##.DELAY= (6, 6)
##.ACQUISITION MODE= SIMULTANEOUS
##.ACQUISITION SCHEME= undefined
##.AVERAGES= 8
##.DIGITISER RES= 18
##SPECTROMETER/DATA SYSTEM= spect
##.PULSE SEQUENCE= zg30
##.SOLVENT NAME= D2O
##.SHIFT REFERENCE= (INTERNAL, D2O, 0, 15.7039)
##AUDIT TRAIL= $$ (NUMBER, WHEN, WHO, WHERE, WHAT)
$$ ##TITLE= Audit trail, XWIN-NMR		Version 3.5
$$ ##JCAMPDX= 5.01
$$ ##ORIGIN= Bruker BioSpin GmbH
$$ ##OWNER= she
$$ F:/spectra/data/she/nmr/H-F/1/audita.txt
$$ ##AUDIT TRAIL=  $$ (NUMBER, WHEN, WHO, WHERE, WHAT)
(   1,<2024-12-26 14:02:50.42 +0400>,<she>,<DPX200>,
      <created by zg, POWCHK disabled, PULCHK disabled
       configuration hash MD5:
       00 E9 B6 7A A2 85 ED C7 34 08 36 98 17 FE 4E 26
       data hash MD5: 16K
       75 84 AD 7A 63 14 98 32 03 F6 37 99 E5 F0 64 FF>)
$$ ##END=
$$ 
$$ hash MD5
$$ 4D AF 47 6F 05 5F 9F 7F EC 8F 77 55 03 E3 5B A3
##$RELAX= 
##$RELAX= 
##$RELAX= 
##$RELAX= 
##$RELAX= 
##$RELAX= 
$$ Bruker specific parameters
$$ --------------------------
##$DU= <F:/spectra>
##$EXPNO= 1
##$NAME= <H-F>
##$PROCNO= 1
##$TYPE= <nmr>
##$USER= <she>
##$AMP= (0..31)
100 100 100 100 100 100 100 100 100 100 100 100 100 100 100 100 100 100 
100 100 100 100 100 100 100 100 100 100 100 100 100 100 
##$AQSEQ= 0
##$AQ_mod= 1
##$AUNM= <au_zg>
##$AUTOPOS= <>
##$BF1= 200.13
##$BF2= 200.13
##$BF3= 200.13
##$BF4= 200.13
##$BF5= 200.13
##$BF6= 200.13
##$BF7= 200.13
##$BF8= 200.13
##$BYTORDA= 1
##$CFDGTYP= 0
##$CFRGTYP= 5
##$CHEMSTR= <none>
##$CNST= (0..31)
1 1 145 1 1 1 1 1 1 1 1 1 1 1 1 1 1 1 1 1 1 1 1 1 1 1 1 1 1 1 1 1 
##$CPDPRG= <>
##$CPDPRG1= <>
##$CPDPRG2= <>
##$CPDPRG3= <>
##$CPDPRG4= <mlev>
##$CPDPRG5= <mlev>
##$CPDPRG6= <mlev>
##$CPDPRG7= <mlev>
##$CPDPRG8= <mlev>
##$CPDPRGB= <>
##$CPDPRGT= <>
##$D= (0..31)
0 1.2 0 0 0 0 0 0 0 0.06 0 0.03 0 0 0 0 0.0002 0 0 0 0 0 0 0 0 0 0 0 0 
0 0 0 
##$DATE= 1735207369
##$DBL= (0..7)
120 120 120 120 120 120 120 120 
##$DBP= (0..7)
150 150 150 150 150 150 150 150 
##$DBP07= 0
##$DBPNAM0= <>
##$DBPNAM1= <>
##$DBPNAM2= <>
##$DBPNAM3= <>
##$DBPNAM4= <>
##$DBPNAM5= <>
##$DBPNAM6= <>
##$DBPNAM7= <>
##$DBPOAL= (0..7)
0.5 0.5 0.5 0.5 0.5 0.5 0.5 0.5 
##$DBPOFFS= (0..7)
0 0 0 0 0 0 0 0 
##$DE= 6
##$DECBNUC= <off>
##$DECIM= 24
##$DECNUC= <off>
##$DECSTAT= 4
##$DIGMOD= 1
##$DIGTYP= 9
##$DL= (0..7)
0 120 120 120 120 120 120 120 
##$DP= (0..7)
150 150 150 150 150 150 150 150 
##$DP07= 0
##$DPNAME0= <>
##$DPNAME1= <>
##$DPNAME2= <>
##$DPNAME3= <>
##$DPNAME4= <>
##$DPNAME5= <>
##$DPNAME6= <>
##$DPNAME7= <>
##$DPOAL= (0..7)
0.5 0.5 0.5 0.5 0.5 0.5 0.5 0.5 
##$DPOFFS= (0..7)
0 0 0 0 0 0 0 0 
##$DQDMODE= 0
##$DR= 18
##$DS= 0
##$DSLIST= <SSSSSSSSSSSSSSS>
$$ [...]
##$SUBNAM2= <"">
##$SUBNAM3= <"">
##$SUBNAM4= <"">
##$SUBNAM5= <"">
##$SUBNAM6= <"">
##$SUBNAM7= <"">
##$SUBNAM8= <"">
##$SUBNAM9= <"">
##$SW= 24.0689530833862
##$SWIBOX= (0..15)
0 0 2 0 0 0 0 0 0 0 0 0 0 0 0 0 
##$SW_h= 4816.95568400771
##$TD= 16384
##$TD0= 1
##$TE= 0
##$TE2= 300
##$TE3= 300
##$TEG= 300
##$TL= (0..7)
0 120 120 120 120 120 120 120 
##$TP= (0..7)
150 150 150 150 150 150 150 150 
##$TP07= 0
##$TPNAME0= <>
##$TPNAME1= <>
##$TPNAME2= <>
##$TPNAME3= <>
##$TPNAME4= <>
##$TPNAME5= <>
##$TPNAME6= <>
##$TPNAME7= <>
##$TPOAL= (0..7)
0.5 0.5 0.5 0.5 0.5 0.5 0.5 0.5 
##$TPOFFS= (0..7)
0 0 0 0 0 0 0 0 
##$TUNHIN= 0
##$TUNHOUT= 0
##$TUNXOUT= 0
##$USERA1= <user>
##$USERA2= <user>
##$USERA3= <user>
##$USERA4= <user>
##$USERA5= <user>
##$V9= 5
##$VALIST= <valist>
##$VCLIST= <CCCCCCCCCCCCCCC>
##$VD= 0
##$VDLIST= <DDDDDDDDDDDDDDD>
##$VPLIST= <PPPPPPPPPPPPPPP>
##$VTLIST= <TTTTTTTTTTTTTTT>
##$WBST= 1024
##$WBSW= 4
##$XGAIN= (0..3)
0 0 0 0 
##$XL= 0
##$YL= 0
##$YMAX_a= 435374
##$YMIN_a= -512645
##$ZGOPTNS= <>
##$ZL1= 120
##$ZL2= 120
##$ZL3= 120
##$ZL4= 120
##$ABSF1= 10
##$ABSF2= 0
##$ABSG= 5
##$ABSL= 3
##$ALPHA= 0
##$AQORDER= 0
##$ASSFAC= 0
##$ASSFACI= 0
##$ASSFACX= 0
##$ASSWID= 0
##$AUNMP= <proc_1d>
##$AZFE= 0.1
##$AZFW= 0.1
##$BCFW= 1
##$BC_mod= 2
##$BYTORDP= 1
##$COROFFS= 0
##$CY= 11.3945322036743
##$DATMOD= 1
##$DC= 2
##$DFILT= <>
##$DTYPP= 0
##$F1P= 15.6554695791079
##$F2P= 12.8336369535428
##$FCOR= 0.5
##$FTSIZE= 0
##$FT_mod= 4
##$GAMMA= 1
##$GB= 0.15
##$INTBC= 1
##$INTSCL= 1
##$ISEN= 128
##$LB= 0.24
##$LEV0= 0
##$LPBIN= 0
##$MAXI= 10000
##$MC2= 0
##$MEAN= 0
##$ME_mod= 0
##$MI= 1.114404
##$NCOEF= 0
##$NC_proc= 0
##$NLEV= 6
##$NOISF1= 3.799351
##$NOISF2= 2.8
##$NSP= 1
##$NTH_PI= 0
##$NZP= 0
##$OFFSET= 15.70392
##$PC= 1
##$PHC0= -26577.92
##$PHC1= 20.38744
##$PH_mod= 1
##$PKNL= yes
##$PPARMOD= 0
##$PSCAL= 0
##$PSIGN= 0
##$REVERSE= no
##$SF= 200.130013532006
##$SI= 16384
##$SIGF1= 3
##$SIGF2= 2
##$SINO= 400
##$SIOLD= 16384
##$SREGLST= <1H.CDCl3>
##$SSB= 0
##$STSI= 0
##$STSR= 0
##$SW_p= 3612.71676300578
##$SYMM= 0
##$S_DEV= 0
##$TDeff= 0
##$TDoff= 0
##$TI= <>
##$TILT= no
##$TM1= 0
##$TM2= 0
##$TOPLEV= 0
##$USERP1= <user>
##$USERP2= <user>
##$USERP3= <user>
##$USERP4= <user>
##$USERP5= <user>
##$WDW= 1
##$XDIM= 8192
##$YMAX_p= 0
##$YMIN_p= 0
$$ End of Bruker specific parameters
$$ ---------------------------------
##NTUPLES= NMR FID
##VAR_NAME=  TIME,          FID/REAL,        FID/IMAG
##SYMBOL=    X,             R,               I
##VAR_TYPE=  INDEPENDENT,   DEPENDENT,       DEPENDENT
##VAR_FORM=  AFFN,          ASDF,            ASDF
##VAR_DIM=   8192,          8192,            8192
##UNITS=     SECONDS,       ARBITRARY UNITS, ARBITRARY UNITS
##FACTOR=    0.0002076,     1,               1
##FIRST=     0,             0,               0
##LAST=      1.7004516,     0,               0
##MIN=       0,             -512645,         0
##MAX=       1.7004516,     435374,          0
$$ Real data points
##PAGE= N=1
##DATA TABLE= (X++(R..R)), XYDATA
$$ plain form
0 0 0 0 0 0 0 0 -1 5 0 8 -8 8 -8 9 -16 16 -17 24 -26 32 -37 42 -49 54 -63 73 -81 92 -105 117 -132 148 -166
33 -166 183 -205 229 -253 280 -309 345 -380 420 -466 518 -573 635 -711 795 -890 1008 -1149
51 -1149 1318 -1537 1823 -2214 2778 -3663 5223 -8518 18329 -107391 -512645 -243440 259038
64 259038 308848 -22073 -182176 -24053 122731 2981 -156001 -70359 126751 125186 -26276
75 -26276 -84773 -15326 21562 -36826 -63808 50784 142936 10374 -165697 -77811 128595
86 128595 100667 -104361 -143986 43275 175399 50361 -144731 -104381 85600 73190 -111454
97 -111454 -98569 141181 217400 -36236 -288856 -173734 170877 264209 2729 -186381 -57871
108 -57871 96458 18557 -113802 -51560 127505 148111 -44988 -168237 -41272 95259 16956
$$ packed form
0@%%%%%%jOnQj6J6j6J7k5L2l3M1n0N8o9P9r1J03j17J36j54J73j97K22k49K80l14
33a66L49l88M34m82N33n89O54p25Q00q86R84j091J208j346J506j685J898k157
51a149K467k855L360m037M992o441Q886j3741K6847j25720m05254K69205N02478
64B59038M9810l30921j60103J58123J46784j19750j58982Q5642J97110j565j51462
75b6276n8497O9447L6888n8388k6982J14592R2152j32562j76071Q7886K06406
86A28595k7928k05028l9625J87261J32124j25038j95092M0350J89981j2410j84644
97a11454J2885K39750P6219k53636k52620J15122L44611R3332k61480j89110J28510
108e7871J54329p7901j32359O2242J79065K0606j93099j23249J26965J36531p8303
$$ plain form
119 16956 -75606 30180 147288 35883 -170211 -164565 74303 215791 48143 -167440 -104199
130 -104199 102556 116788 -43623 -110006 -9230 81768 31827 -46547 3649 75190 -19451
141 -19451 -140152 -38517 154760 129958 -76110 -152100 4597 142577 29700 -160029
151 -160029 -84161 175825 197849 -77156 -243504 -76469 165183 153954 -49662 -117343 29046
162 29046 97049 -47917 -136534 9655 162549 88242 -96665 -134680 8589 109750 28084
173 28084 -72024 -15909 66898 15168 -60332 -19307 49654 16701 -60047 -34192 82715 93526
185 93526 -66346 -152495 4479 164357 63344 -142124 -128373 92995 191007 -5130 -219762
196 -219762 -116032 158161 186725 -42826 -165132 -42202 91692 49719 -61101 -44450
$$ packed form
119A6956r2562J05786J17108j11405k06094N646K38868J41488j67648k15583O3241
130a04199K06755J4232j60411o6383J00776R0998m9941p8374N0196P1541r4641
141a9451j20701J01635J93277k4802k06068p5990J56697J37980j12877j89729
151a60029P5868K59986K2024k75005j66348J67035K41652j1229k03616o7681J46389
162B9046O8003j44966q8617J46189J52894p4307j84907l8015J43269J01161q1666
173B8084j00108N6115Q2807n1730p5500M1025O8961l2953p6748K5855J16907J0811
185I3526j59872q6149J56974J59878j01013k05468J3751K21368R8012j96137k14632
196b19762J03730K74193K8564k29551j22306J22930J33894m1973j10820J6651
$$ plain form
206 -44450 66968 64781 -63509 -94205 25697 84726 -2875 -72087 -8907 77051 32472 -90187
218 -90187 -84217 65437 113803 -22790 -109954 -13687 85198 29615 -76829 -54793 68629
229 68629 87193 -50676 -117749 13796 123152 25226 -112255 -67440 82296 103467 -38192
240 -38192 -123117 -11485 114601 45565 -91115 -62675 66051 74600 -40263 -88495 11551
251 11551 103304 23394 -107695 -58748 98617 94529 -64814 -116855 14076 121822 45679
262 45679 -95957 -85174 55775 94610 -15228 -71696 379 51784 2606 -44570 -4719
273 -4719 57171 26435 -62953 -50518 63879 77733 -49194 -99797 22312 123797 37142
284 37142 -117051 -103657 72702 144623 -5468 -133055 -37279 104673 62407 -77728 -87075
$$ packed form
206d4450J11418k187j28290l0696J19902N9029q7601o9212O3180Q5958m4579j22659
218i0187N970J49654M8366j36593q7164R6267R8885n5583j06444K2036J23422
229F8629J8564j37869o7073J31545J09356r7926j37481M4815J49736K1171j41659
240c8192q4925J11632J26086o9036j36680K8440J28726Q549j14863m8232J00046
251A1551R1753p9910j31089M8947J57365m088j59343n2041J30931J07746p6143
262D5679j41636J0783J40949L8835j09838n6468P2075N1405m9178m7176L9851
273d719O1890l0736q9388J2435J14397J3854j26927n0603J22109J01485q6655
284C7142j54193J3394J76359P1921j50091j27587R5776J41952m2266j40135r347
$$ plain form
295 -87075 47595 116372 5415 -116191 -53119 83374 69224 -46687 -62244 28682 64023
306 64023 -9640 -73492 -20833 66655 41133 -48729 -37374 43637 33643 -50583 -55820 36803
318 36803 82329 -1297 -93418 -37033 88970 65502 -81436 -102364 42757 126213 22377
329 22377 -111173 -81225 59906 90979 -29169 -85384 18078 90656 3320 -97357 -54415
340 -54415 62109 80832 -17846 -71743 3497 61387 -14425 -85363 -10161 95027 60836 -59908
352 -59908 -90276 7262 77035 9174 -69753 -11432 79754 33797 -75311 -68079 37075 75944
364 75944 -3075 -69377 -9940 76626 28473 -83381 -63719 57201 83164 -13228 -71438 -7860
376 -7860 66637 18480 -81794 -52521 79637 97099 -29886 -98001 -16722 68792 30357 -56631
$$ packed form
295h7075J34670O8777j10957j21606O3072J36493j4150j15911j5557R0926L5341
306F4023p3663o3852N2659Q7488k5522q9862J1355Q1011r994q4226n237R2623
318C6803M5526q3626r2121N6385J26003k3468j46938k0928J45121Q3456j03836
329B2377j33550K9948J41131L1073j20148n6215J03462P2578q7336j00677M2942
340e4415J16524J8723r8678n3897P5240N7890p5812p0938P5202J05188l4191j20744
352e9908l0368R7538O9773o7861p8927N8321R1186m5957j09108P232J05154L8869
364G5944p9019o6302N9437Q6566m8153j11854J9662J20920K5963r6392n8210O3578
376g860P4497m8157j00274K9273J32158J7462j26985o8115Q1279Q5514l8435q6988
$$ plain form
388 -56631 -38217 69952 81687 -46481 -114137 -11978 94388 54369 -43724 -48280 28956
399 28956 48122 -31330 -70891 14162 86594 24291 -59559 -32529 37412 26114 -40938 -43286
411 -43286 42106 84602 -4158 -91831 -34923 68119 46259 -49830 -51570 45619 84665 -12188
423 -12188 -109285 -45912 87035 78500 -43076 -69339 24515 64178 -15281 -83165 -23298 83159
435 83159 69169 -45609 -76463 10251 52513 -9699 -50964 3755 65942 32170 -59431 -67500
447 -67500 24890 63808 -11890 -55779 14040 69199 6068 -82042 -57441 50915 81700 -11620
459 -11620 -72053 -1430 63511 589 -78721 -34592 67778 75754 -22510 -84057 -19435 59916
471 59916 20382 -56029 -22838 63723 51634 -45837 -82378 -3580 74128 33224 -53863 -34921
$$ packed form
388e6631J8414J08169J1735j28168o7656J02159J06366m0019r8093m556P7236
399B8956J9166p9452l9561Q5053P2432o2303q3850K7030O9941j1298o7052k348
411d3286Q5392M2496q8760q7673N6908J03042k1860r6089j740R7189L9046r6853
423a2188r7097O3373J32947q535j21576k6263R3854L9663p9459o7884N9867J06457
435H3159j3990j14778l0854Q6714M2262o2212m1265N4719O2187l3772r1601q069
447f7500R2390L8918p5698m3889O9819N5159o3131q8110K4601J08356L0785r3320
459a1620o0433P0623O4941o2922p9310M4129J02370P976r8264o1547O4622P9351
471E9916l9534p6411L3191Q6561j2089r7471l6541P8798P7708m0904q7087J8942
$$ plain form
483 -34921 51366 41061 -51953 -65220 23655 74925 14275 -60948 -32234 50416 38755 -52585
495 -52585 -59701 38086 79287 2773 -67477 -31944 43937 37557 -38948 -46123 44818 76368 -18428
508 -18428 -88260 -25286 63628 48620 -31329 -42713 30420 54769 -28838 -81627 60 88366
520 88366 46276 -52142 -59878 18863 54503 -6662 -56167 2083 72132 23903 -65928 -47530
532 -47530 41255 56365 -15423 -55290 1430 64046 21202 -62897 -43579 47086 55153 -24758
544 -24758 -53994 11062 61076 10589 -67951 -43322 54333 66111 -24910 -61012 7045 50165
556 50165 -1606 -57078 -18684 63761 56346 -44094 -80560 6365 69732 13925 -50758 -18560
568 -18560 45473 29787 -46455 -58644 25580 72949 3142 -66641 -23642 48440 29312 -39650
$$ packed form
483c4921Q6287j0305r3014j3267Q8875N1270o0650p5223K8714Q2650j1661r1340
495e2585p116R7787M1201p6514p0250L5533P5881o380p6505p175R0941L1550r4796
508a8428o9832O2974Q8914j5008p9949j1384P3133K4349q3607n2789Q1687Q8306
520H8366m2090r8418p736P8741L5640o1165m9505N8250P0049m8229q9831J8398
532d7530Q8785J5110p1788l9867N6720O2616m2844q4099J9318R0665Q067p9911
544b4758k9236O5056N0014n0487p8540K4629R7655J1778r1021l6102O8057M3120
556E0165n1771n5472L8394Q2445p415j00440l6466Q6925O3367n5807o4683L2198
568a8560O4033j5686p6242j2189Q4224M7369o9807o9783M2999P2082j9128o8962
$$ plain form
580 -39650 -43383 26606 59327 -8462 -71381 -16670 65995 33865 -55513 -51864 33986 61753
592 61753 -9069 -65895 -16945 57855 29413 -52756 -42159 43301 55531 -23471 -67338 -11174
604 -11174 59020 36351 -43079 -46028 30387 47444 -24585 -55102 8584 60672 18873 -52244
616 -52244 -43051 34113 52493 -20149 -54129 12708 58358 1901 -59410 -25038 51091 50479 -30467
629 -30467 -62847 10564 66117 8679 -59486 -23621 51056 42598 -32381 -56116 12074 65978
641 65978 11864 -62714 -28269 54413 43362 -36471 -50597 18387 57912 5023 -56967 -22905
653 -22905 52166 39041 -38811 -44784 25608 50283 -6824 -51365 -11304 52752 32159 -45175
665 -45175 -46635 33735 55831 -15713 -55337 -2160 52865 22090 -46167 -41131 36745 57683
$$ packed form
580c9650l733O9989L2721o7789o2919N4711Q2665l2130q9378L649Q5850K7767
592F1753p0822n6826M8950P4800k8442q2169J0597Q5460J2230p9002m3867N6164
604a1174P0194k2669p9430k949P6415J7057p2029l0517O3686N2088m1799p1117
616e2244R193P7164J8380p2642l3980O6837M5650n6457o1311L4372P6129o12q0946
629c0467l2380P3411N5553n7438o8165L5865P4677q458p4979k3735O8190N3904
641F5978n4114p4578L4445Q2682j1051p9833j4126O8984L9525n2889o1990L4062
653b2905P5071j3125p7852n973P0392K4675n7107m4541M0061O4056k0593p7334
665d5175j460Q0370K2096p1544l9624N3177N5025l0775o8257N036P7876K0938
$$ plain form
677 57683 -19876 -66213 -3547 61749 26646 -46657 -42456 29959 51809 -18359 -61655 3179
689 3179 67201 18645 -59421 -43121 32725 50560 -8134 -47559 -5343 44113 8414 -50397
701 -50397 -23046 47007 41123 -29037 -53963 771 48912 14363 -43694 -21952 42621 28587
713 28587 -43500 -46912 27263 59708 -1008 -62830 -29566 50485 46307 -36421 -54657 21083
725 21083 55298 -7754 -58189 -14051 55242 40475 -41750 -62641 13711 62984 9832 -46490
737 -46490 -18170 32541 18072 -33275 -30994 32236 55683 -12578 -66453 -16338 52882 31434
749 31434 -29719 -28382 23019 32396 -22195 -51523 8065 68403 25122 -57587 -47816 28634 49832
762 49832 -4596 -39437 -1274 42243 7749 -51524 -23722 53707 50041 -31194 -61378 -596
$$ packed form
677E7683p7559m6337O2666O5296l5103p3303M201P2415K1850p0168m3296O4834
689C179O4022m8556p8066J6300P5846J7835n8694l9425M2216M9456l5699n8811
701e0397K7351P0053n884p0160k4926N4734M8141l4549n8057K1742O4573j4034
713B8587p2087l412P4175L2445o0716o1822L3264Q0051m178q2728j8236P5740
725B1083L4215o3052n0435M4138O9293j4767q2225k0891P6352M9273n3152n6322
737d6490K8320N0711j4469n1347K281O3230K3447o8261n3875N0115O9220k1448
749C1434o1153J337N1401R377n4591k9328N9588O0338m3281q2709R771P6450K1198
762D9832n4428l4841L8163M3517l4494n9273K7802P7429l666q1235l0184O0782
$$ plain form
774 -596 54959 26062 -37116 -31500 30505 34577 -30750 -44777 25626 63704 4906 -63253 -40829
787 -40829 39309 58446 -8109 -47605 -364 37020 -3702 -42005 -3706 51219 33400 -37472
799 -37472 -56987 6740 54911 13974 -37157 -11189 30218 5086 -40567 -22109 42471 54631
811 54631 -18484 -74175 -20741 61596 43105 -35900 -44364 17741 39946 -13377 -50872 -1130
823 -1130 64091 30658 -57939 -60720 22834 60886 9824 -38795 -20740 20114 12686 -26626 -18071
836 -18071 35880 37568 -28385 -56013 -1104 48152 21948 -29998 -26467 21984 24548 -30609 -41061
849 -41061 28221 63686 -1746 -68915 -37269 43532 58111 -10946 -54524 -7322 43004 7762
861 7762 -43088 -13337 46120 34164 -32422 -54266 2031 53065 21812 -35641 -22528 26118
$$ packed form
774e96N5555k8897o3178N616O2005M072o5327j4027P0403L8078n8798o8159K2424
787d0829Q0138J9137o6555l9496M7241L7384m0722l8303L8299N4925j7819p0872
799c7472j9515O3727M8171m0937n1131K5968M1407k5132m5653J8458O4580J2160
811E4631p3115n5691N3434Q2337j8491p9005q464O2105K2205n3323l7495M9742
823a130O5221l3433q8597k781Q3554L8052n1062m8619J8055M0854p428l9312Q555
836a8071N3951J688o5953k7628N4909M9256k6204n1946L531M8451K564n5157j0452
849d1061O9282L5465o5432o7169L1646Q0801J4579o9057m3578M7202N0326l5242
861G762n0850K9751N9457j1956o6586k1844N6297N1034l1253n7453J3113M8646
$$ plain form
873 26118 15996 -31255 -23682 33398 48488 -11129 -62929 -23038 53443 45534 -29819 -43726
885 -43726 16166 39934 -9268 -43334 -3024 52462 30460 -43440 -52485 20091 56515 7506
897 7506 -38262 -15584 22877 13397 -23015 -15791 33508 37245 -27244 -56195 4088 56382 22021
910 22021 -37337 -30506 23286 32933 -21121 -43276 17114 63185 8810 -64380 -42851 37145
922 37145 58581 -308 -48948 -17208 34950 17580 -32139 -19271 32867 29517 -23705 -40316
934 -40316 3827 39903 12051 -33620 -18577 29353 18704 -32258 -26805 29924 41566 -16081
946 -16081 -56611 -13956 54767 41889 -37558 -56930 12151 51845 3117 -45225 -15331 40780
958 40780 31185 -33992 -51374 12281 54147 9512 -39907 -18806 21428 13995 -19154 -15653 22532
$$ packed form
873B6118j0122m7251P573N7080J5090n9617n1800L9891P6481p909p5353j3907
885d3726N9892K3768m9202l4066M0310N5486k2002p3900r045P2576L6424m9009
897G506m5768K2678L8461r480l6412P224M9299L737o4489k8951O0283N2294l4361
910B2021n9358O831N3792R647n4054k2155O0390M6071n4375p3190K1529P9996
922C7145K1436n8889m8640L1740N2158j7370m9719J2868N2138l350n3222j6611
934d0316M4143L6076k7852m5671J5043M7930j0649n0962N453N6729J1642n7647
946a6081m0530M2655O8723j2878p9447j9372O9081L9694m8728m8342K9894N6111
958D0780r595o5177j7382O3655M1866m4635m9419K1101M0234p433l3149L501L8185
$$ plain form
971 22532 28715 -18854 -45300 2098 47358 13608 -40202 -25962 30322 37405 -20007 -51947
983 -51947 1407 59174 22174 -51676 -40967 32174 49056 -8106 -47591 -12775 38847 24989
995 24989 -27789 -28530 20783 29032 -13516 -29162 6428 31473 5484 -30696 -15403 30848 24982
1008 24982 -28998 -34010 25444 47028 -8083 -52944 -16423 47752 40803 -30043 -51692 12777
1020 12777 55053 5353 -48633 -21383 37768 37515 -18112 -43436 322 41061 11740 -31616
1032 -31616 -13059 26778 14342 -23487 -19722 20505 31004 -10682 -39681 -831 44301 14009
1044 14009 -42373 -26492 33849 40626 -17075 -50256 -5685 51245 28609 -40518 -42513 22959
1056 22959 45420 -5135 -41712 -10931 34414 22918 -25857 -30319 16124 30613 -11160 -29868
$$ packed form
971B2532O183m7569k6446M7398M5260l3750n3810J4240N6284P083n7412l1940
983e1947N3354N7767l7000p3850J0709P3141J6882n7162l9485L4816N1622j3858
995B4989n2778p41M9313Q249m2548j5646L5590K5045k5989l6180J5293M6251n866
1008B4982n3980n012N9454K1584n5111m4861L6521O4175o949p0846k1649O4469
1020A2777M2276m9700n3986K7250N9151k53n5627k5324M3758M0739k9321m3356
1032c1616J8557L9837j2436l7829L765M0227J0499m1686k8999L8850M5132l0292
1044A4009n6382J5881O0341O777n7701l3181M4571N6930k2636o9127j995O5472
1056B2959K2461n0555l6577L0781M5345j1496m8775m462M6443J4489m1773j8708
$$ plain form
1068 -29868 6114 29561 261 -31907 -13477 30747 26990 -26834 -41025 15605 48489 -462
1080 -462 -51071 -22013 40059 40168 -22392 -51912 1849 50923 13854 -44942 -28275 29753 35801
1093 35801 -10530 -35360 -6073 25785 8152 -22830 -5956 27487 9438 -31538 -23320 22696
1105 22696 32749 -8467 -36911 -2934 40744 14160 -45481 -32791 37878 51319 -13328 -55871
1117 -55871 -15170 45684 33862 -30651 -42778 17626 47232 242 -41989 -16939 27847 25432
1129 25432 -13936 -24562 10473 27088 -7298 -30153 1616 29462 6011 -22926 -7398 25358
1141 25358 17100 -28253 -36178 20262 54900 5622 -50675 -25978 34341 35824 -18756 -40316
1153 -40316 7102 50192 13448 -47567 -33667 29313 39516 -6954 -30090 -500 26536 4931
$$ packed form
1068b9868L5982K3447k9300l2168J8430M4224l757n3824j4191N6630L2884m8951
1080d62n0609K9058O2072J09o2560k9520N3761M9074l7069n8796J6667N8028O048
1093C5801m6331k4830K9287L1858j7633l0982J6874L3443j8049m0976Q218M6016
1105B2696J0053m1216k8444L3977M3678k6584n9641J2690P0669J3441o4647m2543
1117e5871M0701O0854j1822o4513j2127O0404K9606m6990m2231K5050M4786k415
1129B5432l9368j0626L5035J6615l4386k2855L1769K7846k3451k8937J5528L2756
1141B5358q258m5353p925N6440L4638m9278n6297K4697O0319J483n4580k1560
1153d0316M7418M3090l6744o1015J3900O2980J0203m6470k3136K9590K7036k1605
$$ plain form
1165 4931 -30343 -15355 29866 26502 -19168 -26339 12550 25341 -10514 -33807 -1372 42599
1177 42599 25314 -35126 -41897 15874 40889 -4177 -38031 -5393 39383 23528 -33076 -44845
1189 -44845 10135 45343 7984 -31341 -10417 21618 7955 -24635 -19721 17851 30920 -5270
1201 -5270 -31444 -1829 26957 -961 -35301 -10356 38508 33675 -23223 -50160 -4356 45023
1213 45023 17737 -37906 -24379 33513 36311 -20204 -50509 -9945 42524 31288 -20935 -29804
1225 -29804 10311 20196 -13853 -25291 7929 31381 9649 -23552 -18583 13042 12434 -18764 -14723
1238 -14723 28252 32924 -16802 -45501 -8999 38562 26663 -26290 -33973 21882 45977 -9288
1250 -9288 -54514 -16135 44599 38333 -17983 -39552 2056 35210 4210 -36075 -13250 32864
$$ packed form
1165D931l5274J4988M5221l364m5670p171L8889J2791l5855k3293L2435M3971
1177D2599j7285o0440o771N7771K5015m5066l3854L2638M4776j5855n6604j1769
1189d4845N4980L5208l7359l9325K0924L2035j3663l2590M914L7572J3069l6190
1201e270k6174K9615K8786k7918l4340K4945M8864m833n6898k6937M5804M9379
1213D5023k7286n5643J3527N7892K798n6515l0305M0564N2469j1236n2223q869
1225b9804M0115R885l4049j1438L3220K3452k1732l3201M969L1625o08l1198M041
1238a4723M2975M672m9726k8699L6502M7561j1899n2953p683N5855K4095n5265
1250i288m5226L8379O0734o266n6316k1569M1608L3154l1000m0285K2825M6114
$$ plain form
1262 32864 27796 -13415 -26288 -714 15847 -1971 -17936 8902 36477 7300 -40397 -28524
1274 -28524 22162 33522 -3691 -24711 2568 30083 2931 -41429 -23956 36302 43822 -10649
1286 -10649 -40163 -8019 28072 13638 -25092 -19021 26057 32674 -15135 -38329 -856 30471
1298 30471 9007 -23893 -14119 23677 26674 -17552 -37387 2867 33979 5112 -27054 -5864
1310 -5864 29723 15995 -31821 -39766 12871 50470 13553 -37752 -24486 19136 18145 -16405 -22490
1323 -22490 12882 34709 3040 -37650 -22206 21439 20396 -11857 -11462 15733 15440 -18271 -33389
1336 -33389 2487 39632 16580 -33639 -28810 22819 33144 -12953 -40041 -5280 38264 24368
1348 24368 -28254 -34359 14789 34333 -7721 -35075 -2196 34468 17551 -24568 -29587 8771
$$ packed form
1262C2864n068m1211j2873K5574J6561j7818j5965K6838K7575k9177m7697J1873
1274b8524N0686J1360l7213k1020K7279K7515k7152m4360J7473O0258P520n4471
1286a0649k9514L2144L6091j4434l8730O071M5078O617m7809k3194L7473L1327
1298C0471k1464l2900R774L7796K997m4226j9835M0254L1112k8867l2166K1190
1310e864L5587j3728m7816p945N2637L7599l6917n1305J3266M3622r91l4550o085
1323b2490L5372K1827l1669m0690J5444M3645j043l2253L95K7195k93l3711j5118
1336c3389L5876L7145k3052n0219M829N1629J0325m6097k7088L4761M3544j3896
1348B4368n2622o105M9148J9544m2054k7354L2879L6664j6917m2119n019L8358
$$ plain form
1360 8771 27497 -2271 -23148 3906 27216 1837 -29800 -17343 19552 26656 -4507 -23022
1372 -23022 1968 22417 -5021 -30975 -1925 37881 22788 -27004 -37910 7807 41228 8551
1384 8551 -37507 -17730 33867 28732 -21880 -35632 4995 35157 12015 -26048 -18120 20269
1396 20269 21165 -15831 -21938 12152 25338 -3669 -25586 -3883 28300 15838 -26893 -27799 20473
1409 20473 37156 -4665 -34978 -8849 26518 17262 -18733 -21365 14375 28145 -8442 -32201
1421 -32201 -510 31366 11190 -24874 -19054 17850 27397 -10772 -34694 31 36725 13152
1433 13152 -30026 -23289 16452 25611 -5601 -25834 -1329 26500 5920 -29721 -14487 27025
1445 27025 23534 -18123 -30445 4424 31210 7120 -31314 -18399 27458 27437 -18130 -33623 1253
$$ packed form
1360H771J8726k9768k0877K7054K3310k5379l1637J2457L6895P104l1163j8515
1372b3022K4990K0449k7438k5954K9050L9806j5093m9792j0906M5717L3421l2677
1384H551m6058J9777N1597n135n0612j3752M0627L0162k3142l8063P928L8389
1396B0269Q96l6996o107L4090J3186k9007k1917K1703L2183j2462m2731r06M8272
1409B0473J6683m1821l0313K6129L5367r256l5995k632L5740J3770l6587k3759
1421c2201L1691L1876k0176l6064N820L6904R547l8169k3922L4725L6694k3573
1433A3152m3178O737L9741R159l1212k0233K4505K7829k0580l5641J5234M1512
1445B7025l491m1657j2322L4869K6786k4090l8434J2915M5857k1m5567j5493L4876
$$ plain form
1458 1253 28178 10275 -19430 -14497 14609 14063 -18060 -20778 16882 28810 -7931 -32413 -6805
1471 -6805 28307 18336 -22801 -28804 14574 36025 -2660 -36787 -11494 27901 20009 -17007 -24108
1484 -24108 8897 27603 -2717 -30115 -5853 27884 12028 -22342 -15690 18714 23923 -11472
1496 -11472 -35228 -4888 36638 23366 -21398 -26707 6101 17783 -3900 -15313 6428 27186
1508 27186 5020 -32318 -22089 23160 28964 -8981 -23219 6016 24941 -602 -32674 -16434
1520 -16434 31643 36342 -12687 -37792 -4779 26844 11421 -16704 -11986 15600 17882 -11751
1532 -11751 -22908 7664 25982 -3809 -29176 -4726 31133 22166 -20112 -33935 1389 30494
1544 30494 8260 -21759 -4442 24067 7947 -28367 -25494 14951 35567 7549 -26084 -13643
$$ packed form
1458A253K6925j7903k9705M933K9106n46l2123k718L7660J1928l6741k4482K5608
1471f805L5112r971m1137o003M3378K1451l8685l4127K5293L9395p892l7016p101
1484b4108L3005J8706l0320k7398K4262L3737j5856l4370O652L4404N209l5395
1496a1472k3756L0340M1526j3272m4764n309L2808J1682k1683j1413K1741K0758
1508B7186k2166l7338J0229M5249N804l7945j4238K9235J8925k5543l2072J6240
1520a6434M8077M699m9029k5105L3013L1623j5423k8125M718K7586K282k9633
1532a1751j1157L0572J8318k9791k5367K4450L5859q967m2278j3823L5324K9105
1544C0494k2234l0019J7317K8509j6120l6314K873M0445K0616k8018l3633J2441
$$ plain form
1556 -13643 15413 4909 -23338 -10032 30670 32646 -13144 -45463 -18903 29856 31061 -10566
1568 -10566 -23162 5870 16159 -8915 -22570 130 24171 12027 -18947 -17867 14566 19164
1580 19164 -14547 -26640 6341 29471 7186 -24172 -16895 17254 20869 -16804 -31744 7555
1592 7555 39229 12536 -28659 -25725 6524 17888 -1884 -11230 12417 25517 -9646 -43559
1604 -43559 -17489 33156 36549 -4252 -28357 -8636 15141 1885 -21510 -2852 31316 20244
1616 20244 -21915 -30186 1746 22924 6588 -14835 -2840 20821 8664 -25330 -20461 18551
1628 18551 28165 -5540 -27650 -4283 28360 18116 -22651 -30225 8954 29874 4365 -17237
1640 -17237 -825 16418 -574 -27318 -15189 28071 38519 -5528 -37496 -12692 20199 10703
$$ packed form
1556a3643K9056j0504k8247J3306M0702J976m5790l2319K6560M8759J205m1627
1568a0566j2596K9032J0289k5074j3655K2700K4041j2144l0974J080L2433M598
1580A9164l3711j2093L2981K3130k2285l1358P277L4149L615l7673j4940L9299
1592G555L1674k6693m1195K934L2249J1364j9772r346K3647J3100l5163l3913
1604d3559K6070N0645L393m0801k4105J9721K3777j3256k3395J8658L4168j1072
1616B0244m2159q271L1932K1178j6336k1423J1995K3661j2157l3994M869L9012
1628A8551R614l3705k2110K3367L2643j0244m0767p574L9179K0920k5509k1602
1640a7237J6412J7243j6992k6744J2129M3260J0448m4047l1968K4804L2891r496
$$ plain form
1652 10703 -13740 -5813 22901 22050 -17236 -40533 -8028 34787 25838 -11022 -18294 2474 8108
1665 8108 -9155 -14582 9048 28115 4973 -28082 -16338 19367 17926 -13710 -20200 7873 25392
1678 25392 3180 -24775 -13493 18641 14795 -18842 -19169 17603 29796 -4509 -34967 -17621
1690 -17621 22960 25487 -10404 -21590 10111 23215 -10228 -34831 -9023 32208 31321 -10516
1702 -10516 -33721 -8708 17852 5543 -12169 1523 19463 4795 -21795 -20011 9274 22850
1714 22850 234 -19165 -378 20240 992 -25593 -12577 20537 23025 -8988 -26280 -1450
1726 -1450 26427 7774 -26965 -17810 20410 25346 -7744 -25282 -3129 22045 7615 -23598
1738 -23598 -15372 24570 28377 -12130 -33051 -5968 23879 14443 -13023 -12356 13697 16176 -14667
$$ packed form
1652A0703k4443P927K8714q51l9286k3297L2505M2815q949l6860p272K0768N634
1665H108j7263n427K3630J9067k3142l3055J1744L5705j441l1636o490K8073J7519
1678B5392k2212k7955J1282L2134l846l3637l27L6772J2193l4305l0458J7346
1690a7621M0581K527l5891j1186L1701J3104l3443k4603K5808M1231q87m1837
1702a0516k3205K5013K6560j2309j7712J3692J7940j4668k6590J784K9285J3576
1714B2850k2616j9399J8787K0618j9248k6585J3016L3114K488l2013j7292K4830
1726a450K7877j8653l4739R155L8220M936l3090j7538K2153K5174j4430l1213
1738b3598Q226L9942L807m0507k0921K7083K9847r436k7466O67K6053K479l0843
$$ plain form
1751 -14667 -25255 5789 27465 8457 -17078 -12074 9345 10896 -10079 -13933 11900 24027
1763 24027 -3731 -26014 -6327 20769 14017 -13524 -16497 11027 23448 -5034 -27919 -4025
1775 -4025 28076 13504 -21078 -18904 14393 26165 -4554 -30459 -8221 28796 18997 -19208
1787 -19208 -22811 9736 22481 -2022 -23162 -6799 22863 17345 -16065 -22786 6536 19558
1799 19558 -654 -14660 -1088 14439 4670 -16505 -12443 14418 17573 -9681 -19547 4714 19107
1812 19107 -1091 -20901 -7131 20118 16560 -16487 -25468 7424 27725 847 -26662 -10696
1824 -10696 20864 18930 -14254 -26650 3603 29203 6298 -27217 -15343 19082 19618 -10854
1836 -10854 -22334 1756 23036 5861 -22082 -13572 16361 16278 -10141 -16084 4494 14287 -839
$$ packed form
1751a4667j0588L1044K1676j9008k5535N004K1419J551k0975l854K5833J2127
1763B4027k7758k2283J9687K7096o752k7541k973K7524J2421k8482k2885K3894
1775d025L2101j4572l4582K174L3297J1772l0719k5905K2238L7017r799l8205
1787a9208l603L2547J2745k4503k1140J6363K9662n518l3410o721K9322J3022
1799A9558k0212j4006J3572J5527r769k1175M062K6861L155k7254r866K4261J4393
1812A9107k0198j9810J3770K7249l558l3047q981L2892K0301k6878k7509J5966
1824a0696L1560j934l3184j2396L0253K5600k2905l3515J1874L4425N36l0472
1836a0854j1480K4090K1280j7175k7943Q510K9933q3k6419n943K0578R793j5126
$$ plain form
1849 -839 -16427 -4027 17184 9719 -16534 -14729 12678 16162 -8400 -18243 2501 21204 6696
1862 6696 -21028 -15863 17042 22392 -10536 -24969 3108 26959 8364 -24142 -20369 16076 28401
1875 28401 -4025 -27401 -3897 24364 9864 -20059 -17315 14062 25511 -533 -24864 -9336
1887 -9336 17754 11950 -10415 -8457 10512 10689 -7709 -14945 2263 16410 3693 -14447 -3574
1900 -3574 16452 6198 -17818 -14043 13792 22799 -2487 -24121 -7528 22817 13981 -21195 -21087
1913 -21087 16373 29056 -1581 -28836 -13025 20513 19265 -12418 -20688 8537 23305 -1764
1925 -1764 -24955 -10142 17491 18063 -7065 -17785 2001 16150 -3036 -19636 -2169 19467
1937 19467 10079 -12885 -13556 5472 12468 -5488 -15210 4113 20972 2974 -21517 -13060 12757
$$ packed form
1849h39j5588J2400K1211p465k6253J805K7407L484k4562r843K0744J8703j4508
1862F696k7724N165L2905N350l2928j4433K8077K3851j8595l2506L773L6445J2325
1875B8401l2426k3376K3504K8261j4500k9923K744L1377J1449k6044k4331J5528
1887i336K7090n804k2365J958J8969J77j8398p236J7208J4147j2717j8140J0873
1900c574K0026j0254k4016L775K7835R007k5286k1634J6593L0345q836l5176J08
1913b1087L7460J2683l0637k7255J5811L3538j248l1683q270K9225J4768k5069
1925a764k3191J4813K7633N72k5128j0720J9786J4149j9186j6600J7467K1636
1937A9467r388k2964o71J9028O996j7956r722J9323J6859j7998k4491Q457K5817
$$ plain form
1950 12757 14596 -6152 -15060 4325 20038 108 -26115 -12106 20769 20171 -9993 -20653 1841
1963 1841 19603 2156 -24188 -12283 23541 24094 -12066 -28037 -2087 20961 8184 -16120
1975 -16120 -12460 15073 18752 -9673 -23853 -1085 19003 8152 -10198 -6792 7897 7391 -9283
1988 -9283 -12680 6753 16506 -1266 -13505 1185 13502 -1042 -18091 -7827 18625 21375 -8567
2001 -8567 -25730 -1702 23771 7460 -21011 -13686 19589 26640 -7612 -33532 -11287 27031
2013 27031 22926 -12544 -20105 5177 16437 -1835 -17647 -5194 17389 15113 -9262 -15599 2630
2026 2630 10728 -2517 -8153 4259 12821 1192 -14140 -7578 12730 11691 -11100 -14279 10579
2039 10579 20745 -2648 -22460 -9320 16936 15745 -9933 -17379 8097 20954 -4233 -26558
$$ packed form
1950A2757J839k0748q908J9385J5713j9930k6223J4009L2875n98l0164j0660K2494
1963A841J7762j7447k6344J1905L5824N53l6160j5971K5950K3048j2777k4304
1975a6120L660K7533L679k8425j4180K2768K0088j0851j8350L406J4689n06j6674
1988i283l397J9433R753j7772j2239J4690J2317j4544j7049J0264K6452K750k9942
2001h567j7163K4028K5473j6311k8471P325L3275P051l4252k5920K2245L8318
2013B7031m105l5470p561K5282J1260j8272j5812J2453K2583k276k4375o337J8229
2026B630Q098j3245n636J2412Q562j1629j5332O562K0308j039k2791l179K4858
2039A0579J0166k3393j9812J3140K6256j191k5678p446K5476J2857k5187k2325
$$ plain form
2051 -26558 -9028 22426 21675 -8013 -22425 -3148 16275 3567 -15592 -3992 18671 11477
2063 11477 -15264 -20145 2869 19448 5268 -15811 -6824 14363 8374 -15864 -15008 9695 18545
2076 18545 307 -17171 -8050 12504 9859 -10803 -12172 7677 12838 -3524 -11761 839 10779
2089 10779 -267 -15366 -6478 17918 16111 -13307 -22747 2926 20760 4614 -18383 -10060 17304
2102 17304 19299 -13079 -28691 -563 28098 14445 -16837 -18443 5943 16456 -1394 -16646
2114 -16646 -1516 18826 8083 -15611 -13443 6912 12348 169 -7948 -242 7492 -467 -10273
2127 -10273 -120 13689 3746 -14556 -8154 13284 15653 -7760 -21198 -1718 22990 11963
2139 11963 -18831 -18473 13738 23378 -4185 -25498 -7971 22307 20181 -11010 -23345 268 18289
$$ packed form
2051b6558J7530L1454p51k9688j4412J9277J9423j2708j9159J1600K2663p194
2063A1477k6741m881K3014J6579j4180k1079Q987K1187n989k4238Q56K4703Q850
2076A8545j8238j7478R121K0554k645k0662j369J9849N161j6362q237J2600R940
2089A0779j1046j5099Q888K4396j807k9418r440K5673J7834j6146k2997Q323K7364
2102A7304J995l2378j5612K8128K8661j3653l1282j606K4386J0513j7850j5252
2114a6646J5130K0342j0743k3694K168K0355N436j2179q117P706P734p959r806
2127a0273J0153J3809r943j8302O402K1438K369k3413j3438J9480K4708j1027
2139A1963l0794L58L2211R640k7563k1313J7527L0278k126l1191j2335K3613J8021
$$ plain form
2152 18289 4467 -11690 -3731 10840 6500 -10535 -12012 6848 16212 -563 -14592 -1843 12229
2165 12229 3178 -12284 -6884 11585 13152 -6913 -17950 316 18350 5160 -15589 -8737 11855
2178 11855 11712 -7796 -15453 2086 17123 3354 -18091 -9628 14703 13471 -9478 -16358 1560
2191 1560 15323 3632 -14916 -8454 14055 11855 -12241 -16743 6626 18999 1179 -18956 -9860
2204 -9860 14323 15574 -9485 -19279 3337 18439 3154 -15682 -9238 9571 12057 -4043 -11961
2217 -11961 906 10216 -969 -10294 836 11397 1459 -11862 -6509 10903 12102 -7787 -17417
2230 -17417 3109 21113 4071 -20615 -12597 14813 20138 -4609 -21828 -4830 19777 11807
2242 11807 -15118 -15107 9570 17258 -2432 -17366 -5080 14696 11783 -9304 -13064 4901 12066
$$ packed form
2152A8289j3822j6157P959J4571m340j7035j477J8860R364j6775j4029J2749J4072
2165A2229r051j5462N400J8469J567k0065j1037J8266J8034j3190k0749O852K0592
2178A1855j43j9508p657J7539J5037j3769k1445Q463K4331j232k2949o880J7918
2191A560J3763j1691j8548O462K2509k200k4096m502K3369J2373j7820k0135R096
2204i860K4183J251k5059r794K2616J5102j5285j8836O444J8809K486j6100p918
2217a1961J2867R310j1185r325J1130J0561r938j3321N353J7412J199j9889r630
2230a7417K0526J8004j7042k4686Q018K7410N325k4747j7219J6998K4607p970
2242A1807k6925J1K4677P688j9690j4934J2286J9776k913k1087l760J7965P165
$$ plain form
2255 12066 -1845 -9574 1547 10044 1778 -9973 -4830 10649 9315 -9184 -12033 7325 14913
2268 14913 -3010 -15878 -2367 16536 11190 -13816 -18717 6606 22966 3118 -19960 -9974
2280 -9974 12994 13264 -5947 -12821 2600 14682 356 -16112 -5316 14589 10011 -8990 -11971
2293 -11971 2968 11527 -623 -12316 -1327 15476 6629 -16162 -13660 9454 16793 -796 -15294
2306 -15294 -5727 11509 7791 -10632 -9988 9533 12230 -6489 -15104 -285 14243 6886 -11001
2319 -11001 -11572 6313 11297 -5011 -11734 3893 13182 -621 -16124 -7554 13725 15503 -7542
2332 -7542 -18951 -90 16461 3485 -13970 -6327 12618 11556 -9970 -18841 1373 20170 8243
2345 8243 -14392 -12472 6119 9621 -2556 -7224 2742 9918 -1576 -13632 -3995 13940 9499
$$ packed form
2255A2066j3911p729J1121Q497q266j1751N143J5479j334j8499k849J9358P588
2268A4913j7923j2868J3511J8903n346k5006m901K5323J6360j9848k3078R986
2280i974K2968K70j9211o874J5421J2082j4326j6468J0796J9905m578j9001k981
2293a1971J4939Q559j2150j1693J0989J6803q847k2791K502K3114P339j7589j4498
2306a5294R567J7236l718j8423O44J9521K697j8719q615J4819J4528p357j7887
2319a1001n71J7885M984j6308o723J5627R289j3803j5503Q570K1279J778k3045
2332g542j1409J8861J6551j2976j7455P643J8945j062k1526q871K0214J8797j1927
2345H243k2635J920J8591L502j2177m668R966P176j1494j2056R637J7935m441
$$ plain form
2358 9499 -9556 -10895 4653 10248 -2803 -11264 314 15197 5287 -16848 -13483 12714 19786
2371 19786 -1667 -18440 -6966 12765 10941 -8097 -11336 7383 14171 -4617 -16882 -1623
2383 -1623 16325 10201 -8940 -13510 2152 11988 514 -8943 1442 11103 157 -13472 -6073
2396 -6073 11696 13806 -4561 -16192 -2091 13805 4797 -10981 -4699 11200 7992 -10630 -14530
2409 -14530 3736 19357 6180 -15574 -11979 8708 11637 -4418 -9187 3508 10961 -955 -14499
2422 -14499 -6122 14117 13422 -8477 -14904 1342 11865 1260 -9967 -3226 10612 6556 -11987
2435 -11987 -12687 8498 16937 -1780 -16220 -5749 11038 9036 -7102 -10328 4985 11317 -4034
2448 -4034 -14459 -391 15096 7099 -11377 -12445 3700 12327 378 -11321 -1316 11461 1514
$$ packed form
2358I499j9055j339J5548N595j3051q461J1578J4883r910k2135L365K6197P072
2371A9786k1453j6773J1474J9731j824j9038l239J8719O788j8788j2265J5259
2383a623J7948o124j9141m570J5662R836j1474r457J0385R661j0946j3629P399
2396f073J7769K110j8367j1631J4101J5896r008j5778O282J5899l208j8622l900
2409a4530J8266J5621j3177k1754L595K0687K929j6055m769J2695P453j1916j3544
2422a4499Q377K0239o95k1899o427J6246J0523j0605j1227O741J3838m056j8543
2435a1987p00K1185Q439j8717j4440J0471J6787k002j6138l226J5313O332j5351
2448d034j0425J4068J5487p997j8476j068J6145Q627j1949j1699J0005J2777r947
$$ plain form
2461 1514 -14160 -7928 11835 14241 -4444 -16248 -3996 12924 6787 -10265 -7349 9586 9463
2474 9463 -7835 -13178 1615 15140 6059 -12579 -10501 8452 11394 -5044 -10871 2936 11510
2487 11510 1075 -12015 -6121 10962 11771 -7329 -14676 2167 13835 2589 -10696 -4149 8732
2500 8732 6499 -8829 -11035 7171 16312 -485 -15961 -5957 11498 9358 -6409 -9631 4203
2513 4203 12140 -1946 -15040 -2302 15075 9085 -9691 -11774 3800 11439 583 -10802 -1982
2526 -1982 11362 5313 -11362 -8877 8486 11574 -3465 -12664 -1790 12346 6830 -10909 -9762
2539 -9762 8277 11041 -5616 -12113 1804 13185 3703 -12729 -9996 9050 13565 -4333 -13250
2552 -13250 41 12076 2366 -10859 -6857 8513 11379 -4762 -13908 -287 12262 3439 -10098
$$ packed form
2461A514j5674O232J9763K406j8685j1804J2252J6920o137j7052K916J6935j23
2474I463j7298n343J4793J3525r081j8638K078J8953K942j6438n827J3807Q574
2487A1510j0435j3090N894J7083Q09j9100p347J6843J1668j1246j3285O547J2881
2500H732k233j5328k206J8206R141j6797j5476J0004J7455k140j5767l222J3834
2513D203P937j4086j3094J2738J7377n990j8776k083J5574P639j0856j1385Q820
2526a982J3344o049j6675K485J7363L088j5039r199J0874J4136n516j7739J147
2539i762J8039K764j6657o497J3917J1381r482j6432K733J9046M515j7898q917
2552a3250J3291J2035r710j3225M002J5370K866j6141r146J3621J2549q823j3537
$$ plain form
2565 -10098 -5222 7998 6624 -7059 -10297 3700 12854 -398 -13872 -3770 12378 7125 -10038
2578 -10038 -10567 5255 13185 180 -14273 -5494 12504 8879 -9567 -11486 4602 12177 3
2591 3 -12239 -5685 10836 8538 -8439 -10370 5606 11173 -2626 -11006 -1703 10177 5220 -8810
2605 -8810 -8444 7219 10911 -4730 -12157 653 12303 3711 -10842 -8185 8166 11780 -4402
2618 -4402 -13567 798 14192 3789 -11718 -7997 7992 11451 -3075 -12250 -1305 12286 4268
2631 4268 -10118 -5622 8784 7713 -5861 -10036 2442 12093 2200 -11750 -5097 10888 7975
2644 7975 -8619 -10339 5041 12918 965 -12631 -5779 10705 9673 -7652 -10784 4971 11712
2657 11712 -215 -11095 -4510 9133 8021 -6521 -9428 4615 10350 -2930 -11315 -569 10872
$$ packed form
2565a0098M876J3220j374j3683l238J3997R154j3252j3474J0102J6148n253j7163
2578a0038n29J5822P930j3005j4453Q779J7998l625j8446j919J6088P575j2174
2591Cj2242O554J6521k298j6977j931J5976N567j3799q380R303J1880m957j4030
2605h810L66J5663L692j5641p427J2810J1650q592j4553K657J6351L614j6182
2618d402r165J4365J3394j0403j5507L721J5989L459j4526r175J0945J3591q018
2631D268j4386M496J4406j071j3574m175J2478R651r893j3950O653J5985k913
2644G975j6594j720J5380P877j1953j3596O852J6484j032j7325l132J5755O741
2657A1712j1927j0880O585J3643j112j4542k907J4043N735j3280q385J0746J1441
$$ plain form
2670 10872 5567 -8932 -8772 6066 10706 -4090 -13086 1067 13627 4199 -11537 -9445 6316
2683 6316 11719 -1993 -12970 -1639 12602 5045 -11032 -9295 6111 10858 -1010 -9975 -1861
2696 -1861 8631 3004 -9796 -5748 8909 7973 -5699 -9378 1739 8902 124 -10238 -3521 11403
2710 11403 8372 -9541 -12733 3711 12470 1234 -10854 -5200 9847 9757 -8231 -13451 2674
2723 2674 13947 2807 -10407 -5200 6792 6554 -5483 -9052 4248 12132 -11 -11571 -3201
2736 -3201 8137 3986 -6630 -5539 6848 10048 -3643 -13031 -994 12778 5695 -9518 -7426
2749 -7426 7143 10270 -3116 -13281 -2349 12934 7859 -8513 -8684 5365 8298 -3271 -9601
2762 -9601 244 11462 5783 -9130 -8648 5196 7849 -4474 -7003 4599 10417 -167 -12602
$$ packed form
2670A0872n305j4499J60J4838M640j4796q996J4153J2560r428j5736K092J5761
2683F316N403j3712j0977J1331J4241p557j6077J737J5406M747j1868q965Q114
2696a861J0492n627j2800M048J4657r36j3672l679J1117P163q778j0362O717J4924
2710A1403l031j7913l192J6444Q759j1236j2088N654J5047r0j7988n220J6125
2723B674J1273j1140j3214N207J1992k38j2037l569J3300P884j2143j1560Q370
2736c201J1338m151j0616J091J2387L200j3691r388J2037J3772p083j5213K092
2749g426J4569L127j3386j0165J0932J5283n075j6372j71J4049K933j1569o330
2762i601R845J1218n679j4913M82J3844K653j2323k529J1602N818j0584j2435
$$ plain form
2775 -12602 -7133 9163 11221 -4139 -10583 1917 9974 -69 -11047 -4501 10145 10390 -5154
2788 -5154 -12439 241 10315 1432 -9452 -3287 8781 6854 -5407 -9190 1034 8667 -230
2801 -230 -9277 -168 10981 4041 -10276 -9690 4423 10841 541 -9525 -1950 9902 2938 -12233
2815 -12233 -8971 8372 13245 -85 -12053 -6005 6943 5984 -6253 -6106 7101 9156 -4513
2828 -4513 -11636 -2306 8798 6048 -5621 -6295 5277 6826 -5987 -9971 2811 11119 2001 -9341
2842 -9341 -5471 7171 8008 -6012 -11454 2058 12970 3079 -9552 -6319 5900 6667 -4365 -9289
2856 -9289 2936 12619 2687 -11840 -7783 6547 7746 -2058 -4964 2972 6845 -2565 -11697 -2303
2870 -2303 12205 8315 -7008 -8525 2323 7542 -1612 -8542 -69 11422 6122 -9969 -10417 5344
$$ packed form
2775a2602N469J6296K058j5360o444J2500Q057j0043j0978O546J4646K45j5544
2788e154p285J2680J0074q883j0884O165J2068j927j2261l783J0224P633q897
2801b30r047R109J1149o940j4317N86J4113O418j0300j0066P575J1852o964j5171
2815a2233L262J7343M873j3330j1968O048J2948r59j2237J47J3207K055j3669
2828d513p123R330J1104k750j1669o74J1572J549j2813l984J2782Q308r118j1342
2842i341L870J2642Q37j4020n442J3512J0912r891j2631L233J2219P67j1032m924
2856i289J2225R683r932j4527M057J4330J199r804k906P936L873r410r132R394
2870b303J4508l890j5323j517J0848N219r154o930Q473J1491n300j6091m48J5761
$$ plain form
2884 5344 10999 414 -9172 -2191 8632 5694 -7168 -8370 4855 9449 -1990 -8377 524 8720
2898 8720 2456 -8546 -7214 5374 10061 -706 -8684 52 8159 58 -9193 -3776 9315 9971
2912 9971 -4251 -12345 -1871 10085 3861 -7350 -3569 7190 5532 -6394 -10263 1082 11384
2925 11384 4270 -9180 -6710 6264 6051 -5508 -7535 2972 9339 642 -9653 -5083 7972
2938 7972 6992 -6894 -8715 4237 9465 -111 -8970 -3967 7080 5867 -5815 -7471 4776 9061
2952 9061 -2147 -10409 -2502 8003 5707 -4777 -6882 3356 7960 -2866 -9837 363 10499
2965 10499 3922 -8267 -7276 4241 8553 -1645 -9032 483 10223 2431 -9808 -6515 6470 8831
2979 8831 -2097 -8957 -1381 8623 3929 -8009 -5766 6828 7661 -3414 -8256 203 7894 3044
$$ packed form
2884E344N655j0585r586O981J0823k938j2862j202J3225M594j1439o387Q901Q196
2898H720o264j1002J332J2588M687j0767p978Q736Q107q101r251N417J3091O56
2912I971j4222q094J0474J1956o224j1211L781J0759j658j1926l869J1345J0302
2925A1384p114j3450K470J2974k13j1559k027J0507O367q697j0295M570J3055
2938G972r80j3886j821J2952N228r576q859N003J1047j213j1682j656J2247M285
2952I061j1208q262P907J0505k296j0484k105J0238M604j0826o971J0200J0136
2965A0499o577j2189R91J1517M312j0198p387R515R740p792j2239L293J2985K361
2979H831j0928o860P576J0004m694j1938K243J2594Q33j1075m842Q459P691m850
$$ plain form
2993 3044 -7222 -5190 6582 6787 -4944 -7653 2989 8277 315 -8091 -3752 7238 6903 -5650
3007 -5650 -8550 3348 9607 -270 -8849 -2617 7629 6254 -5671 -8345 3526 9905 -401 -9666
3021 -9666 -2247 8322 5135 -5733 -7144 3366 8791 -494 -10177 -2419 9229 5138 -6384 -6708
3035 -6708 3342 7488 -588 -7974 -1162 8458 3693 -7920 -6530 4477 6769 -1528 -6294 1
3049 1 6546 1247 -8295 -5069 7677 8080 -4060 -9252 41 7386 1861 -7242 -4709 7426 7959
3064 7959 -5843 -10956 1274 10295 2882 -7981 -5688 5163 6902 -3234 -9334 296 8847 2088
3078 2088 -7186 -3650 4825 4923 -3977 -7233 1087 7648 1596 -6889 -2164 5232 1812 -6490 -4653
3093 -4653 6371 9275 -1535 -11320 -4433 8876 6372 -4993 -5435 4402 6031 -3560 -9417 -1680
$$ packed form
2993C044j0266K032J1772K05j1731k709J0642N288p962q406M339J0990l35j2553
3007e650k900J1898O259r877q579O232J0246j375j1925k674J1871O379j0306r265
3021i666P419J0569l187j0868j411J0510N425r285r683P758J1648m091j1522l24
3035f708J0050M146q076p386O812R620m765j1613J390J1007K292q297m766O295
3049AO545n299r542L226J2746M03j2140n192R293P345n525r103K533J2135N33
3064G959j3802n113J2230R021p413j0863K293J0851J739j0136o100R630Q551o759
3078B088r274L536Q475R8q900l256Q320O561o052q485M725P396l420q302J837
3093d653J1024K904j0810r785O887J3309k504j1365m42R837J629r591n857P737
$$ plain form
3107 -1680 10431 7792 -5872 -8321 2280 5959 -1391 -5661 853 7722 3071 -7381 -7128 4820
3121 4820 9038 -1936 -8159 -32 7898 3733 -5969 -5585 3518 6731 -1481 -6456 1716 7799 710
3136 710 -8620 -4742 5787 7854 -675 -6355 -616 5110 -1040 -7461 -590 9860 6256 -5216
3150 -5216 -9626 -849 7207 2977 -5135 -918 7090 2567 -8655 -8349 4777 11105 2428 -9110
3164 -9110 -5758 5527 6048 -4925 -7487 3021 8088 891 -6622 -3914 4093 4110 -3951 -5016 3591
3179 3591 6418 -1664 -6445 -782 4246 746 -5071 -2117 7236 6560 -6230 -11476 -609 9830
3193 9830 5222 -5157 -4743 2966 4005 -4179 -8519 2361 11820 4341 -9081 -8181 2698 6714
3207 6714 -332 -5130 157 6595 1368 -8175 -5814 5373 6712 -1444 -5141 -91 4496 471 -5704
$$ packed form
3107a680J2111k639j3664k449J0601L679p350m270O514O869m651j0452K53J1948
3121D820M218j0974o223Q127P930m165r702L84R103L213q212m975Q172O083p089
3136G10r330L878J0529K067q529n680N739N726o150o421O871J0450l604j1472
3150e216m410Q777Q056m230q112M217Q008m523j1222L06J3126O328q677j1538
3164i110L352J1285N21j0973k562J0508N067p197p513K708Q007J7q061j065Q607
3179C591K827q082m781N663N028l500n817K954R353o76j2790n246J0867J0439
3193I830m608j0379M14P709J039q184m340J0880R459p479j3422R00J0879M016
3207F714p046m798N287O438n227r543K361J1187J339q156l697N050M587m025o175
$$ plain form
3222 -5704 -2569 5881 4285 -4645 -5407 3871 6292 -2118 -8724 -2296 9021 8050 -4279 -8830 562
3237 562 6024 29 -5138 383 6946 3760 -5804 -7739 1933 7697 1088 -4869 -107 5007 248
3252 248 -7419 -4731 6024 10024 -316 -9852 -3591 6555 4416 -4595 -3947 3963 6128 -1100 -6849
3267 -6849 -1668 6089 3360 -5163 -3452 4643 4936 -3176 -6590 -428 6060 3031 -4737 -2930 4970
3282 4970 4082 -5314 -6791 2297 7811 2013 -5964 -4354 4058 4171 -4997 -6019 4686 9755 -114
3297 -114 -9940 -5866 5540 8149 -1532 -7241 -164 6567 760 -6717 -2936 4605 5019 -1643 -4409
3312 -4409 7 3966 -824 -5708 230 6620 1995 -5971 -4374 3318 5554 -1874 -7249 -577 8132
3327 8132 3424 -6693 -6164 3439 6521 -742 -5968 -801 6104 2941 -6810 -5493 4612 7388 -1648
$$ packed form
3222e704L135Q450j596q930p62R278K421q410o606O428J1317r71j2329m551R392
3237E62N462n995n167N521O563l186r564j935R672N764o609n957M762N114m759
3252B48p667K688J0755M000j0340r536O261J0146k139r011O48P910K165p228n749
3267f849N181P757k729q523J711Q095K93q112l414O162O488l029p768J807P900
3282D970q88r396j477R088N514n798p977J610Q412J13r168j022J0705N069r869
3297a14r826M074J1406K609r681n709P077O731n807p477L781P541M14o662k766
3312d409M416L959m790m884N938O390m625p966J597P692K236p428n375O672Q709
3327H132m708j0117N29R603L082p263n226N167O905l163r751J317J0105K776r036
$$ plain form
3342 -1648 -6734 -1099 4820 2603 -4558 -4208 4136 6675 -2395 -6837 -339 5380 1821 -4342 -2519
3357 -2519 4197 4331 -3801 -6694 1727 7780 1259 -6365 -2979 4941 5185 -3035 -6352 807 7092
3372 7092 1454 -5958 -2815 4824 3595 -3016 -4257 1832 5729 67 -6418 -2386 6389 3965 -4912
3387 -4912 -5128 3231 6473 -330 -6754 -2504 6307 5029 -4576 -5692 2861 5640 -921 -5052 -1088
3402 -1088 5282 3050 -4611 -5100 3269 5803 -1347 -5912 -564 5464 2137 -4617 -3848 3574 5847
3417 5847 -1655 -6201 358 6063 1137 -5539 -3321 4220 4793 -2519 -7048 -133 7144 2114 -6219
3432 -6219 -3675 4264 4705 -2684 -6100 301 6727 2440 -5949 -3743 3853 4157 -2679 -4309 1175
3447 1175 5346 502 -6063 -3286 4698 4189 -3314 -4631 2668 5179 -801 -5806 -1763 5439 4730
$$ packed form
3342a648n086N635N919k217p161L50Q344K539r070m442O498N719l559o163J823
3357b519O716J34q132k893Q421O053o521p624L386P920K44q220l317P159O285
3372G092n638p412L143P639j229o611j241O089L897n662o485M032Q775k424q877
3387d912k16Q359L242o803o424M250Q811j278r605j116Q553K779o561m131L964
3402a088O370k232p661m89Q369K534p150m565N348O028l327o754P69P422K273
3417E847p502m546O559N705m926o676K218P541N73p312m529O915P277n030q333
3432f219K544P939M41p389l416O401O426m287q389K206P596L04o836j630N484
3447A175M171m844o565K777P984n09p503j317P299K511n980n005M043P202p09
$$ plain form
3462 4730 -4019 -5827 2644 5890 -1073 -6248 -582 6020 3928 -4006 -5935 1526 6330 -121 -5255
3477 -5255 -483 5165 2090 -4606 -4016 2379 5473 -310 -5057 -526 5586 1550 -5209 -3415 4073
3492 4073 5746 -1396 -5628 -510 5254 1627 -5450 -2903 5838 5089 -2694 -6141 -291 5295 2168
3507 2168 -4408 -2838 4829 4567 -3679 -6674 451 6597 2815 -4190 -4261 2593 3863 -2785 -4478 1922
3523 1922 5430 296 -4945 -1772 3650 2789 -3199 -4165 3055 6152 -1115 -6593 -1759 5128 3287
3538 3287 -3458 -4145 2590 5981 -1019 -6954 -2523 6021 3866 -3227 -3942 1724 3814 -1610 -5727
3553 -5727 -612 6933 3501 -5032 -5699 1668 4367 -69 -3727 -178 4438 1570 -5181 -4117 3610
3568 3610 4647 -1851 -4386 847 4169 774 -5357 -3154 4619 5827 -2242 -6326 12 5187 1069
$$ packed form
3462D730q749j808Q471L246o963n175N666O602k092p934j929P461M804o451n134
3477e255M772N648l075o696N90O395L094n783m747M531O112m036o759J794P488
3492D073J673p142m232N118N764l627p077K547Q741p49p783l447N850N586l127
3507B168o576J570P667k62q246k995P125O146l782p005p1O854J270o648j693O400
3523A922L508n134n241L173N422q61n988r66P220L097p267n478M834O887j841
3538C287o745o87O735L391p000n935M431Q544k155p093p15N666K090n424m117
3553e727N115P545l432q533o67P367K699m436l658L549M616k868o751J064P727
3568C610J037o498k535N233L322l395o131K203P773J208q069m084O338N175m118
$$ plain form
3583 1069 -4968 -3412 3354 4893 -1533 -5441 -151 4275 -486 -4497 -474 5529 3193 -4356 -6348
3598 -6348 1761 7039 1597 -5409 -2024 5192 3130 -4347 -4941 1695 6752 2292 -5075 -3609 3114
3613 3114 3444 -2062 -2194 2329 3911 -1172 -5007 -1194 4585 3201 -3764 -3463 3144 4479 -1622 -4542
3629 -4542 354 4387 1859 -3752 -2664 4799 4645 -4076 -6696 1188 7266 2820 -4980 -4680 2818
3644 2818 5753 -1557 -6269 -325 6840 3609 -4634 -5556 578 4320 1283 -2396 -825 2453 -556
3659 -556 -4091 -333 4494 2510 -3473 -3995 1445 4747 -216 -6048 -1573 5487 3375 -4438 -4880 1945
3675 1945 5185 516 -5672 -2716 5064 4340 -3524 -5249 1665 4561 -359 -4499 -1400 4626 3140
3690 3140 -3992 -5555 1599 5486 388 -3773 -1054 2527 1141 -2993 -2363 3360 4568 -2145 -5659
$$ packed form
3583A069o037J556O766J539o426l908N290M426m761m011M023O003k336p549j992
3598f348Q109N278n442p006L385P216k062p477n94O636N057m460p367J466O723
3613C114L30n506j32M523J582n083l835L813N779j384o965L01O607J335o101k920
3629d542M896M033k528n611J088P463j54q721k620P884O078m446p800L00P498
3644B818K935p310m712N944P165l231q243r22O134L742l037l679J571L278l009
3659e56l535L758M827j984n983n22N440L302m963n832M475P060k112p813m42O825
3675A945L240m669o188K956P780p24p864j725O914K896m920m140L099O026j486
3690C140p132j563P154L887n098m161K719L581j386m134O30N723J208o713l514
$$ plain form
3705 -5659 -348 5069 1746 -4023 -3171 2778 4200 -1968 -5774 -582 5638 2451 -3771 -3096 2429
3720 2429 3455 -1291 -3306 1118 4066 151 -4666 -1153 5589 3085 -4529 -5333 2032 6606 1155
3735 1155 -6143 -3894 4848 5582 -2641 -5479 753 5546 2501 -4127 -3736 2362 4589 -737 -3695
3750 -3695 396 2951 -344 -3173 -362 3293 1637 -2716 -3163 1747 3803 -1394 -3596 1027 5002
3765 5002 198 -5259 -2582 4293 5157 -2721 -6814 25 7068 2762 -5807 -5117 3468 6298 -4
3780 -4 -6111 -2809 5009 4269 -3087 -4487 1300 3598 276 -2965 -986 2509 845 -2881 -1556 3106
3796 3106 2339 -2975 -3330 1921 3896 -394 -4854 -1931 4076 3845 -3307 -5113 1441 4990 220 -4862
3812 -4862 -2166 3327 3494 -3041 -4504 1579 5307 -170 -5517 -1952 4124 3117 -2505 -4134 1064
$$ packed form
3705e659N311N417l323n769Q52N949J422o168l806N192O220l187o222O75N525
3720B429J026m746k015M424K948l915m817L513O742k504p614q04P365M574n451
3735A155p298K249Q742P34q223k838O232M793l045o628L91O098K227n326k958
3750c695M091K555l295k829K811L655j656m353m47M910K056n197k202M623L975
3765E002m804n457K677O875Q64p878m093O839P043m306q569O90Q585K830o302
3780do107L302P818p40p356j400N787K298l322l241J979L495j664l726J325M662
3796C106p67n314l55N251J975m290m460K923O007k31p152j806O554L549m770n082
3812d862K696N493J67o535j463O083L728n477n347L565O076j007n622j629N198
$$ plain form
3827 1064 4266 -143 -4685 -934 4745 2638 -3994 -3910 1605 4698 316 -4381 -1539 4478 2353
3842 2353 -3884 -3329 2503 3880 -282 -4133 -1528 3061 2212 -2492 -2170 2286 2163 -2393 -2836 1858
3858 1858 4218 -83 -4811 -2168 4531 4417 -3376 -5403 1746 5917 819 -5525 -3305 4480 5651
3873 5651 -2119 -6600 -850 5968 3196 -3561 -3621 1775 3570 -150 -3145 -337 3648 1329 -3372
3888 -3372 -1581 2400 1726 -1662 -1872 1391 2363 -1534 -3541 924 5275 1469 -5013 -3320 3558 4602
3904 4602 -1045 -5477 -1263 5275 3197 -4714 -4691 3043 5743 -498 -5574 -2264 4248 4015 -1997 -4173
3920 -4173 1073 3648 -693 -3526 32 3311 1184 -3381 -2858 2069 3519 -835 -3677 477 3347
3935 3347 -148 -4058 -1450 3635 3200 -2138 -4704 -22 4787 1428 -4072 -2079 2732 2301 -2420
$$ packed form
3827A064L202m409m542L751N679k107o632Q4N515L093m382m697K842O017k125
3842B353o237N55N832J377m162l851K605M589q49m704L22M456j23m556m43M694
3858A858K360m301m728K643O699j14p793k027P149M171n098o344K220P785J171
3873E651p770m481N750O818k772o757o0N396J795l720k995K808L985k319m701
3888c372J791L981o74l388k10L263R72l897k007M465M351l806o482J693O878J044
3904D602n647m432M214O538k078p911K3P734K700o241n076L310O512k33o012k176
3920d173N246K575m341k833L558L279k127m565N23M927J450m354k842M154K870
3935C347l495l910K608N085m35n338k566M682M809l359n500J993M811m31m721
$$ plain form
3950 -2420 -3308 1523 4489 -182 -5086 -2206 4143 3562 -2608 -3716 1252 3937 -41 -4252 -1609
3965 -1609 4681 3932 -3603 -5180 1562 5442 1023 -3785 -2484 2128 3161 -1423 -3352 1457 3386
3980 3386 -141 -3545 -961 2625 1758 -1674 -2006 1795 2645 -1458 -3298 1707 4475 -17 -4957 -2021
3996 -2021 3622 4643 -2055 -5111 308 5278 1336 -4832 -2566 3829 4514 -1833 -5629 -1193 5295
4011 5295 3611 -3180 -3868 1335 3408 -567 -2989 -416 3356 1078 -3200 -2462 2658 3046 -1832 -2796
4027 -2796 1161 2846 -560 -3048 -607 3332 2005 -3324 -3957 2609 4737 -657 -4593 -1127 3717
4042 3717 2676 -2681 -3469 1842 4827 -955 -5158 -1133 4448 2824 -2571 -3956 1118 3703 -275
4057 -275 -4297 -692 4499 1636 -3286 -3315 1628 3227 64 -3763 -1120 3098 1226 -2802 -2310 2418
$$ packed form
3950b420q88M831K966m671m904K880O349n81o170j108M968K685l978m211K643
3965a609O290p49p535j577O742L880m419m808J301M612J033m584j929M809J929
3980C386l527l404K584L586q67l432l32L801Q50m103j840N005K768m492m940K936
3996b021N643J021o698l056N419M970l942o168K266O395O85o347l796M436O488
4011E295j684o791o88N203K073l975k422K573L772k278m278P38N120L88m878r64
4027b796L957J685l406k488K441L939j327n329o33O566K128n394l936L466M844
4042C717j041n357p88N311K985n782m203M025N581j624n395j385N074K585l978
4057b75m022L605N191k863m922k9M943J599l163l827K643M218j872m028M92M728
$$ plain form
4073 2418 3050 -1230 -3340 -258 3358 1232 -3483 -2113 2919 3050 -2295 -3138 1539 3529 212 -3910
4089 -3910 -2024 3833 3326 -2819 -4410 770 4777 385 -3874 -1861 3342 3301 -2491 -4620 1283 4983
4105 4983 768 -3741 -2057 2459 2710 -974 -3380 314 3583 449 -3116 -1373 2944 1882 -1929
4120 -1929 -1675 1561 2829 -1008 -3195 -265 3576 1515 -3394 -2139 3045 3416 -1178 -4001 -27
4135 -27 4316 1787 -3665 -3429 3002 3887 -1290 -3884 -104 4039 1815 -3136 -3187 2227 3905 -946
4151 -946 -3635 52 3603 1383 -3062 -2046 1894 2891 -1588 -3490 198 3453 721 -3135 -913
4166 -913 2732 2406 -1704 -3187 499 3635 12 -3741 -812 3279 2173 -2761 -3089 1298 3750 -89
4182 -89 -4323 -1451 3994 2564 -3240 -3269 1628 3844 -25 -3929 -1686 3372 2812 -2663 -3449 1324
$$ packed form
4073B418O32m280k110L082L616k126m715J370N032J31n345q43M677J990l317m122
4089c910J886N857n07o145j591N180M007m392m259K013N203m1n792k129N903L700
4105D983m215m509J684M516K51l684k406L694L269l134l565J743M317j062l811
4120a929K54L236J268l837k187K930L841k061m909J255N184L71m594k823L974
4135b7M343k529n452K36O431Q85n177k594L780M143k224m951n1N414J678m851
4151i46k689L687L551k220m445J016L940R97m479j902L688L255k732l856K222
4166i13L645l26m110j483L686L136l623l753K929M091j106m934l28M387K452l839
4182h9m234K872N445j430n804k9M897K216l869l904K243N058n60n475p86M773
$$ plain form
4198 1324 3305 -120 -3136 -1278 3023 2242 -2175 -3033 1358 2541 -1172 -2668 228 3130 997
4213 997 -2796 -2454 2038 3166 -1544 -3531 815 3679 104 -3413 -1780 2859 3653 -1214 -3690 3
4229 3 4122 931 -3740 -1690 3003 3056 -1378 -3436 -66 3759 1235 -3391 -1699 2905 2286 -1904
4245 -1904 -2914 532 2950 1004 -3308 -1323 2845 2578 -2476 -3083 1351 3297 352 -2755 -1223
4260 -1223 2487 2044 -2399 -2716 1879 3419 -718 -3517 -613 2644 1757 -2163 -2344 1945 3607 -1252
4276 -1252 -4355 -320 4105 1816 -2820 -2429 1519 3292 -654 -4188 -518 3802 1641 -3043 -2380
4291 -2380 1630 2479 -767 -2970 -237 3423 1119 -2961 -2153 1928 2410 -1026 -2108 359 2831 568
4307 568 -3305 -2102 2778 2707 -1589 -2487 664 2525 -227 -3392 -1167 3326 3333 -2482 -3792 965 3375
$$ packed form
4198A324J981l425l016J858M301p81m417q58M391J183l713j496K896K902k133
4213I97l793L42M492J128m710j987M346K864l575l517J633M639P94m867k476L693
4229CM119l191m671K050M693N3m434k058L370L825k524m626J692M604o19m190
4245a904j010L446K418j946m312J985M168k67n054o07M434J946k945l107J532
4260a223L710m43m443l17M595J540m137k799K904L257q87l920j81M289J662m859
4276a252l103M035M425k289m636L91L948J773l946l534L670M320k161m684O63
4291b380M010Q49l246k203K733L660k304m080Q08M081M82l436j082K467K472k263
4307E68l873J203M880p1m296q98L151J861k752l165K225M493Pn815j310M757K410
$$ plain form
4324 3375 458 -3116 -1382 2691 2194 -1682 -3492 717 3657 329 -3058 -947 2401 1512 -2285
4339 -2285 -2604 1187 3353 -349 -3344 -234 3152 1018 -2725 -2061 2232 3288 -177 -3349 -868
4354 -868 2673 1117 -2678 -1210 2579 2649 -1480 -3509 -330 3197 1859 -2182 -1643 1737 2485 -1999
4370 -1999 -2920 654 3681 1671 -2537 -2290 1880 2642 -1252 -2356 820 3262 -19 -2796 -1306 1992
4386 1992 2571 -1660 -3003 818 3671 526 -3501 -1615 2386 2604 -1097 -2194 650 3007 -296
4401 -296 -3780 -693 3389 2264 -1672 -2294 405 1939 -641 -2779 -73 3878 1684 -3193 -3085 1209
4417 1209 3128 347 -2267 -1073 2414 1016 -2908 -2301 2250 3196 -991 -2853 -799 2600 1211
4432 1211 -2261 -2294 2098 2734 -1377 -3084 170 2561 679 -2612 -1846 2331 2735 -1098 -3355 -35
$$ packed form
4324C375k917l574J734M073m97l876j810M209K940l328l387K111L348q89l797
4339b285l19L791K166l702k995L110L386k134l743O64M293J056l465l172K481
4354h68L541j556l795J468L789P0m129k029L179L527j338m041N39L380P48m484
4370a999r21L574L027k010m208K47M170P62l894j104L176K442l281k777J490L298
4386A992N79m231j343L821K853l145m027J886M001K18l701j097K844K357l303
4401b96l484L087M082j125l936o22K699J534k580k138K706L951k194m877J08M294
4417A209J919k781k614J194L487j398l924O07M551R46m187j862K054L399j389
4432A211l472l3M392O36m111j707L254K391j882l291P66M177M04l833k257L320
$$ plain form
4448 -35 2683 528 -2603 -671 2374 1917 -2188 -3478 495 3990 1053 -2933 -1609 1807 1657 -1063
4464 -1063 -1993 998 3234 549 -3240 -1706 2213 1577 -1333 -1872 1179 2535 -574 -3151 -949 2922
4480 2922 2440 -1995 -2673 1587 2894 -386 -3292 -772 2435 1849 -1754 -2227 1689 2488 -1293 -3062
4496 -3062 172 3260 1877 -2234 -2747 1228 2803 -409 -2676 291 2751 802 -2601 -1943 1573
4511 1573 2923 -296 -2552 -67 2539 -26 -2784 -780 2724 1849 -1488 -2708 285 3209 528
4526 528 -3233 -1955 2730 2272 -1568 -2692 155 2881 674 -2687 -1691 2393 1955 -1855 -2854 911
4542 911 2760 400 -2318 -1238 1917 1781 -1931 -2700 1066 2630 -418 -2467 -711 1838 1325 -1872
4558 -1872 -2036 1258 2449 -1307 -3090 -430 2601 1165 -2225 -2185 1230 2768 -334 -3468 -522 2760
$$ packed form
4448c5K718k155l131J932L045m57m105j290L973L495k937l986J324L416j50k720
4464a063r30K991K236k685l789J534L919o36k910n39L051J356l109k577K202L871
4480B922m82m435o78M260J307l280k906K520L207n86l603m73L916P99l781j769
4496c062L234L088j383m111n13L975J575l212k267K967K460j949l403O58L516
4511A573J350l219k256K485K606k565k758K004L504q75l337j220K993K924k681
4526E28l761J278M685m58l840j124K847K726k207l361R96M084m38l810r99L765
4542I11J849k360k718J080L155j36l712p69L766J564l048k049J756K549n13l197
4558a872j64L294J191l756j783K660L031j436l390M0L415J538l102l134K946L282
$$ plain form
4574 2760 1064 -2360 -2128 860 1792 -451 -2548 -229 2724 585 -2672 -1314 2360 1827 -1459 -2489
4590 -2489 332 2667 596 -2882 -1393 2690 2249 -1754 -2635 413 2751 1214 -2525 -1515 1865
4605 1865 2150 -965 -2268 791 2570 123 -2041 -893 1856 1963 -1355 -2339 1557 2826 -577 -2503
4621 -2503 -249 2323 1473 -1902 -1992 1604 3253 -751 -3014 -549 2754 1507 -1900 -2275 1130 2730
4637 2730 -99 -2972 -1273 2914 2081 -1709 -1925 649 1501 -244 -1812 409 2332 649 -2671 -1798
4653 -1798 1904 2097 -730 -1936 622 2191 232 -2693 -1634 2863 2723 -1430 -2874 269 2749
4668 2749 513 -2147 -1650 1521 2609 -928 -2534 66 2067 391 -1889 -796 1898 1288 -1198
4683 -1198 -2268 405 2112 -453 -1924 -189 2681 751 -2738 -2238 1216 3153 468 -3094 -1487
$$ packed form
4574B760j696l424K32K988R32k243k097K319K953k139l257J358L674n33l286j030
4590b489K821K335k071l478J489M083m41m003q81L048K338j537l739J010L380
4605A865K85l115j303L059J779k447k164J148K749J07l318r84L896J269l403j926
4621b503K254K572q50l375r0L596J649m004k263K465L303j247l407l75L405J600
4637B730k829k873J699M187q33l790k16K574Q52j745j568K221J923j683l320Q73
4653a798L702J93k827j206K558J569j959k925J059M497j40m153j444L143K480
4668B749k236k660M97L171J088l537j606K600K001j676k280J093K694o10k486
4683a198j070K673J707k565j471J735K870j930l489N00L454J937k685l562J607
$$ plain form
4698 -1487 2030 1488 -2025 -1746 1435 2551 159 -2930 -1473 2022 1941 -1144 -1608 1245 1479 -535
4714 -535 -1929 99 1690 520 -2102 -1084 2024 1838 -1566 -2489 507 2821 697 -2053 -1538 1569
4730 1569 2306 -1278 -3073 456 3404 1137 -1988 -2334 792 2500 591 -1620 303 1873 166
4745 166 -2104 -801 1610 1624 -433 -1105 609 1392 -313 -2533 -148 2936 1615 -2052 -2302 1177
4761 1177 2493 505 -2757 -1107 2640 2099 -1814 -2433 448 1933 667 -1933 -374 1739 1090 -1805
4777 -1805 -2340 794 2173 -219 -1479 15 1178 4 -2075 -1410 2103 2805 -1025 -2965 -217 2227
4793 2227 429 -1968 -1476 1828 2472 -994 -3602 -921 2829 1542 -1768 -1638 734 1474 -578 -1958
4809 -1958 -325 2219 827 -1450 -749 891 702 -1579 -899 1104 1910 -342 -2314 -969 2551 1278
$$ packed form
4698a487L517n42l513K79L181J116k392l089J457L495q1l085m64K853K34k014
4714e35j394K028J591j170k622J018L108j86l404r23K996K314k124k750N15L107
4730A569P37l584j795L529K948k267l125l46L126J708j909k211J923J570j707
4745A66k270J303K411J4k057o72J714P83j705k220K385L084j321l667k50L479
4761A177J316j988l262J650L747n41l913o19K881J485j266k600J559K113o49k895
4777a805n35L134J379k392j260J494J163j174k079O65L513P02l830j940K748K444
4793B227j798k397M92L304O44l466k608K681L750j287l310J30K372P40k052j380
4809a958J633K544j392k277P01J640j89k281O80K003Q06k252j972J345L520j273
$$ plain form
4825 1278 -2230 -1796 1458 2715 183 -2932 -2032 1831 2616 -950 -2399 164 2079 -301 -2318 -727
4841 -727 1690 1826 -790 -1928 283 1436 -496 -1489 616 2296 750 -1881 -1396 1140 2032 -578
4857 -578 -2064 179 3001 528 -2337 -1431 1479 2679 -331 -2415 -130 2536 1230 -1888 -1659 1308
4873 1308 2098 477 -1667 -795 1360 530 -1384 -341 1967 1237 -1398 -1736 310 2118 -22 -1886
4889 -1886 -881 2281 1596 -1423 -2608 721 2811 804 -1882 -1715 1435 1836 -873 -2459 294 2137
4905 2137 538 -1902 -738 1100 986 -716 -904 622 1528 -627 -2289 -321 2093 544 -1749 -1310
4921 -1310 1117 2033 -900 -2901 -572 2666 1310 -2169 -2142 837 2404 -369 -2177 -1115 1958 1604
4937 1604 -1201 -1984 457 1766 231 -1321 -1 1233 457 -1077 -1178 1331 1033 -1192 -1693 928
$$ packed form
4825A278l508M34L254J257k532l115R00L863P85l566j449K563J915k380k017J591
4841g27K417J36k616j138K211J153j932r93K105J680j546k631M85K536Q92k610
4857e78j486K243K822k473k865R06K910J200l010k084K285K666j306l118K29K967
4873A308P90j621k144Q72K155q30j914J043K308p30k635l38K046J808k140j864
4889a886J005L162o85l019j185L329K090k007k686J67L150M01k709j586K753J843
4905B137j599k440J164J838j14j702j88J526R06k155j662J968K414j549k293M39
4921a310K427R16k933k001K329L238j356l479K7K979J567k773j808J062L073l54
4937A604k805p83K441J309j535j552J320J234p76j534j01K509k98k225n01K621
$$ plain form
4953 928 1705 -194 -2262 -751 2306 1895 -1637 -2807 719 2884 584 -2014 -1289 1494 1991 -450
4969 -450 -2531 -263 2433 660 -1576 -804 1196 1182 -501 -1246 184 1377 27 -1736 -511 1529
4985 1529 1117 -1275 -1129 1358 1661 -136 -2470 -463 2371 1384 -1463 -1926 1108 1768 -18 -1766
5001 -1766 -751 1750 1500 -1286 -1904 889 1678 -213 -1629 -98 1244 498 -1488 -1316 1301 1610
5017 1610 -911 -2274 402 2059 241 -2026 -1329 1236 1699 -438 -2254 -179 2026 625 -1919
5032 -1919 -926 998 1750 -680 -1931 -174 1742 764 -1326 -860 1039 435 -1286 -1277 484 1268 -48
5049 -48 -1412 -373 1654 783 -1968 -1565 1879 2059 -387 -2304 -1059 2019 1821 -1193 -2293 381
5065 381 2112 442 -1931 -1232 1224 1610 -572 -1477 407 1316 -110 -1106 -39 1547 699 -1190 -994
$$ packed form
4953I28P77j899k068J511L057m11l532j170L526K165k300k598P25K783M97k441
4969d50k081K268K696j773k236P72K000j4j683p45J430J193j350j763J225K040
4985A529m12k392J46K487L03j797k334K007K834r87k847m63L034O60j786j748
5001a766J015K501k50k786o18K793P89j891j416J531J342p46j986J72K617L09
5017A610k521j363K676J657j818k267O97K565M63k137j816K075K205j401k544
5032a919R93J924P52k430j251J757J916r78k090M66J899o04j721RJ761P84j316
5049d8j364J039K027q71k751M03L444J80k446j917J245L078j98l014j100K674
5065C81J731j670k373O99K456L86k182r05J884R09j426r96J067J586q48j889J96
$$ plain form
5082 -994 539 922 -731 -2024 537 2236 737 -1703 -1147 910 1569 -437 -1781 138 2038 444
5098 444 -2007 -1613 1499 1694 -362 -1909 -327 1538 617 -1553 -949 1611 1717 -620 -1351 -135 1308
5115 1308 214 -1317 -491 1669 918 -1323 -1750 809 1624 -96 -1511 -470 1468 1423 -942 -1645 481
5132 481 1976 207 -1445 -438 897 361 -1027 -1161 640 1879 -394 -1861 -437 1537 329 -1637
5148 -1637 -808 1147 1593 -530 -2344 -774 1755 1390 -1491 -1437 1152 1490 -354 -1581 0 1599
5164 1599 920 -1618 -1253 835 1603 -326 -1293 138 1459 695 -1210 -1048 942 1041 -981 -1334 454
5181 454 1343 116 -1691 -730 1780 1226 -852 -1341 475 1767 -310 -1783 -590 1740 1721 -439 -1641
5198 -1641 -14 1602 270 -1600 -247 1494 1421 -928 -1583 73 1571 444 -1326 -498 1511 588
$$ packed form
5082i94J533L83j653j293K561J699j499k440N56K057O59k006j344J919J900j594
5098D44k451L94L112J95k056j547J582J865r21k170O04K560J06k337p31J216J443
5115A308j094j531Q26K160p51k241m27K559Q15j720j415J041J938m5k365p03K126
5132D81J495j769j652J007J335n36j388j34J801J239k273j467J424J974j208j966
5148a637Q29J955M46k123j814J570K529l65k881N4K589L38j844j227J581J599
5164A599o79k538L65K088P68j929r67J431J321p64j905J62J990R9k022l53J788
5181D54Q89j227j807R61K510n54k078m89J816J292k077j473J193K330j9k160j202
5198a641J627J616j332j870J353J741p3k349o55J656J498j127j770Q28K009r23
$$ plain form
5214 588 -855 -1162 915 1483 -95 -1416 -411 1503 942 -1258 -1098 997 1479 -146 -1325 -203
5230 -203 1522 693 -1196 -1231 1625 1556 -831 -1745 -53 1640 810 -1150 -1118 1129 1202 -608 -1539 -81
5248 -81 1562 615 -1199 -1057 842 1256 -573 -1382 343 1687 295 -1335 -928 1391 1421 -307 -1589
5265 -1589 7 1520 276 -1323 -516 1253 518 -895 -1102 849 1229 -182 -1220 -712 1560 854
5281 854 -1460 -1317 950 1114 -371 -1563 -116 1320 962 -1084 -1703 435 1464 -58 -1482 -385
5297 -385 1073 921 -945 -1304 504 1462 -609 -1428 -130 999 388 -1267 -1053 995 1415 -345 -2093
5314 -2093 -207 1615 500 -1443 -720 1118 1010 -752 -1243 -38 1286 629 -1399 -628 1259 1396
5330 1396 -568 -1087 317 1180 588 -1426 -736 1400 1511 -613 -1319 479 1497 7 -925 -1077 1040
$$ packed form
5214E88j443l07K077N68j578j321J005J914n61k200J60K095M82j625j179J122
5230b03J725q29j889l5K856o9k387r14J692J693q30j960L2K247P3j810r31J458
5248h1J643r47j814J42J899M14j829q09J725J344j392j630M07K319L0j728j282
5265a589J596J513j244j599Q07J769p35j413k07J951L80j411j038N08K272p06
5281H54k314J43K267J64j485j192J447J436l58k046o19K138J029j522j424J097
5297c85J458j52j866l59J808R58k071q19J298J129o11j655K14K048M20j760j748
5314b093J886J822j115j943P23J838j08j762m91J205J324o57k028P71J887J37
5330A396j964n19J404Q63n92k014O90K136J11k124p06J798J018j490r32j52K117
$$ plain form
5347 1040 1564 -873 -1278 357 1605 -58 -980 -297 1307 1074 -1225 -1003 1119 1554 -134 -1529 -158
5364 -158 1478 780 -931 -1084 913 1495 -357 -1673 -344 1674 487 -1304 -1075 501 1206 119
5380 119 -1459 -215 1384 639 -1286 -819 1126 814 -400 -1078 -313 1378 810 -966 -754 1143 979
5397 979 -778 -1285 311 1228 510 -1210 -911 883 1259 -664 -1275 385 1510 -81 -1053 -547 1039
5414 1039 1006 -939 -1570 536 1157 -30 -1453 -384 1361 923 -1034 -1169 282 1188 -100 -1576 -341
5431 -341 1335 763 -851 -1159 180 933 -156 -1127 -349 1143 488 -1395 -796 909 1128 -11 -1593
5448 -1593 -134 1240 708 -872 -1034 906 1238 -426 -1352 314 1353 559 -1146 -1246 962 1379 -536
5465 -536 -1397 -50 1116 540 -1485 -741 930 1032 -805 -1274 208 1277 64 -1065 -327 1288 920
$$ packed form
5347A040N24k437m05J635J248j663r22O83J604k33k299K22K122M35j688j395J371
5364a58J636o98j711j53J997N82j852j316J329K018j187j791K29J576P05j087
5380A19j578J244J599p45j925M67J945l12j214o78P65J691n68j776K12J897j64
5397I79j757n07J596R17p18j720K99J794L76j923o11J660J125j591r72N06J586
5414A039l3j945o31K106O21j187j423J069J745m38j957j35J451R06j288j476J235
5431c41J676n72j614l08J339P53j089r71P78J492o55j883N99J705K19j139j582
5448a593J459J374n32j580j62J940L32j664r26J666J039p94j705j00K208M17j915
5465e36q61J347J166n76k025P44J671J02j837m69J482J069j213j129P38J615l68
$$ plain form
5482 920 -802 -870 722 1741 229 -1347 -334 1287 757 -728 -981 433 1406 -12 -1385 -457 1535
5499 1535 981 -678 -1321 157 1056 -59 -1025 -501 1104 516 -1124 -1098 737 1287 -342 -1318 -299
5516 -299 966 840 -1059 -786 705 1300 -308 -1357 44 1245 497 -1042 -1233 710 1301 -230 -1413
5533 -1413 289 1259 355 -1062 -656 873 789 -493 -1649 -24 1345 127 -1382 -354 801 985
5549 985 -831 -1194 233 1201 -32 -1416 -951 891 937 -314 -894 16 1083 408 -1359 -607 1066
5566 1066 486 -841 -866 377 730 -223 -758 -119 811 884 -886 -1114 1034 1287 -535 -1326 -229 1331
5584 1331 834 -1107 -1090 995 1239 -362 -1426 -53 1505 827 -956 -1283 468 1042 -88 -1263 -373
5601 -373 600 311 -573 -475 872 727 -160 -1043 -24 1447 323 -950 -154 1111 744 -534 -888 567
$$ packed form
5482I20j722o8J592J019j512j576J013J621n30j485k53J414R73j418j373R28J992
5499A535n54j659o43J478Q99j115r66N24J605n88j640K6J835N50j629r76J019
5516b99J265j26j899K73J491N95j608j049J401J201p48j539j91J943N91j531j183
5533a413J702R70r04j417M06J529q4j282j156J625J369j218j509J028J155J84
5549I85j816l63J427R68j233j384M65J842M6j251n80R10J067o75j767P52J673
5566A066n80j327k5J243L53r53n35O39R30P3j770k28K148K53j822p91J097J560
5584A331m97j941J7K085K44j601j064J373J558o78j783l27J751N74j130j175Q90
5601c73R73k89q84R8J347j45q87q83J019J471j124j273P96J265l67j278l54J455
$$ plain form
5619 567 1152 14 -1417 -390 960 1239 -602 -1626 406 1194 386 -1188 -911 1194 999 -465 -1540
5636 -1540 555 752 -52 -1184 -543 989 728 -766 -1128 325 1143 -330 -1174 -348 1041 788 -660
5653 -660 -1052 580 1150 -455 -1404 -238 1381 667 -599 -798 623 1073 -94 -913 -121 973 499
5670 499 -1124 -308 635 499 -684 -947 486 1289 194 -860 -855 1367 1023 -700 -1112 42 1393 359
5688 359 -1063 -1105 927 1252 -524 -887 69 949 384 -648 -477 324 1015 -390 -884 454 917 -80
5706 -80 -894 361 639 82 -722 -614 771 1168 -522 -1342 -89 1522 357 -1077 -1075 695 1594 -11
5724 -11 -1593 -493 1289 809 -549 -841 307 875 183 -1044 -557 861 303 -541 -506 597 802 -430
5742 -430 -580 223 1062 324 -944 -667 1211 1030 -663 -748 636 1367 143 -1067 -664 1024 1063 -575
$$ packed form
5619E67N85j138j431J027J350K79j841j024K032P88q08j574K77K105j95j464j075
5636a540K095J97q04j132O41J532k61j494l62J453Q18j473q44Q26J389k53j448
5653f60l92J632N70j605r49J166J619p14j266j99J421M50j167q19P92J094m74
5670D99j623Q16R43j36j183k63J433Q03j095j054NK222l44j723m12J154J351j034
5688C59j422m2K032L25j776l63R56Q80n65j032J71Q01O91j405m94J338M63r97
5706h0q14J255K78n57q04J08J385L97j690q20J253J611j165j434KJ770Q99j605
5724a1j582J100J782m80j358k92J148N68o92j227M87J418n58q44L5J103K05j232
5742d30j50Q03Q39p38j268K77J878j81j693q5J384P31j224j210M03J688L9j638
$$ plain form
5760 -575 -1399 176 1194 347 -1102 -914 612 763 -523 -1077 63 883 -219 -933 -243 651 234 -717
5778 -717 -663 387 1244 153 -1179 -646 1037 689 -845 -1023 54 979 257 -842 -264 1156 352 -535
5796 -535 -955 385 674 -358 -791 -415 762 252 -563 -458 851 791 -811 -925 58 1306 337 -969
5814 -969 -484 892 971 -729 -1654 169 1571 253 -1030 -986 600 1275 -208 -1247 -380 654 701 -475
5832 -475 -944 268 536 55 -279 46 769 -65 -706 110 1002 284 -531 -484 839 857 -213 -1508 -391
5851 -391 1204 1196 -1092 -1097 141 1053 36 -893 -624 809 881 -635 -1109 167 1229 310 -850 -270 644
5870 644 353 -356 -892 520 1145 -458 -707 -5 871 418 -214 -397 703 853 -421 -1280 161 1310
5888 1310 228 -1049 -346 930 727 -394 -1166 -498 1152 600 -582 -191 418 391 -490 -468 394 715
$$ packed form
5760e75q24J575J018q47j449J88J526J51j286n54J140Q20j102p14O90Q94m17r51
5778g17N4J050Q57j091j332N33J683l48j534j78J077R25p22j099N78J420q04q87
5796e35m20J340K89j032m33L76J177n10q15J05J309o0j602j14R83J248r69j306
5814i69M85J376P9j700r25J823J402j318j283M4J586O75j483j039Q67J034M7j176
5832d75m69J212K68m81l34L25P23q34o41Q16Q92p18q15M7J323J8j070j295J117
5851c91J595qk288nJ238R12j017r29K69J433P2j516m74J276J062r19j160N80R14
5870F44k91p09n36J412O25j603k49P02Q76m53o32j83J100J50j274q59J441J149
5888A310j082j277P03J276k03j121p72O68J650n52j182L91O09k7q81K2Q62L21
$$ plain form
5906 715 -154 -930 -122 1019 536 -1076 -845 750 1032 112 -1138 -887 1188 1058 -812 -1210 -320 678
5924 678 333 -642 -485 464 324 -579 -532 265 582 -25 -388 649 782 -8 -848 -425 666 406 -221 -1104
5944 -1104 239 892 333 -752 -605 596 1048 -194 -974 -59 1143 284 -1057 -663 1343 1103 79
5961 79 -1295 -617 628 642 -448 -465 206 783 -277 -247 241 87 3 -215 381 900 385 -1172 -842 711
5981 711 1026 152 -1112 -570 788 1147 -496 -1051 141 980 394 -398 -305 429 251 -106 -604 271 785
6000 785 -213 -1026 -225 1052 431 -236 -723 439 1132 -170 -1130 -97 809 340 -521 -369 412 696 -318
6019 -318 -690 -116 912 561 -840 -716 448 740 -238 -727 -476 628 969 -568 -814 391 609 -226
6037 -226 -286 390 557 -71 -838 -287 1053 902 -849 -1106 337 1266 179 -1108 -572 656 1148 -145
$$ packed form
5906G15q69p76Q08J141m83j612K31J595K82r20j250K51K075j30j870l98Q90R98
5924F78l45r75J57R49j40r03M7P97L17o07l63J037J33p90q40M23J091k60o27q83
5944a104J343O53n59j085J47J201M52j242p80R15J202q59j341L94K006k40j024
5961G9j374O78J245J4j090j7O71N77j060L0M88j54q4k18N96N19n15j557L30J553
5981G11L15q74j264N42J358L59j643n55J192Q39n86p92R3P34j78l57m98Q75N14
6000G85r98q13Q01J277o21o67m87J162O93j302r60J033R06m69q61J52P81K84j014
6019c18l72N74J028l51j401J24J164K92r78m89K51J104L41j537k46J205K18q35
6037b26o0O76J67o28p67N51J340j51j751k57J443R29j087j287N36J228M92j293
$$ plain form
6055 -145 -1492 -437 715 304 -437 -64 95 51 -83 -285 169 512 -49 -982 -361 986 137 -784 -652
6074 -652 439 1048 -96 -839 -265 660 311 -500 -626 307 783 -144 -643 -171 951 705 -657 -828 335
6093 335 1224 -206 -1050 -232 685 753 -12 -520 50 563 154 -542 35 767 -149 -519 -286 367 685 -499
6113 -499 -863 524 1338 140 -1086 -170 590 1122 112 -608 -141 375 375 -300 -159 176 377 -436 -645
6132 -645 150 628 -47 -845 -436 985 558 -838 -569 310 928 160 -496 -222 712 895 -475 -522 288
6151 288 624 -145 -752 -209 516 376 -574 -511 284 743 -254 -779 -279 241 503 -280 -402 225 696 -296
6171 -296 -515 -32 630 -215 -585 160 481 786 -618 -756 207 1057 165 -1339 -859 258 764 -30 -736
6190 -736 -373 612 193 -454 -219 424 662 -575 -632 -27 463 5 -570 -214 432 626 -281 -690 191 617
$$ packed form
6055a45j347J055J152m11p41L73J59m4j34k02M54L43n61r33O21J347q49r21J32
6074f52J091O09j144p43N74R25l49q11j26R33M76r27m99M72J122k46j362j71J163
6093C35Q89j430q44Q18R17O8p65n08N70N13m09o96N77P32r16l70K33O53L18j184
6113d99l64J387Q14j198j226R16P60N32j010p20M67N16%o75J41L35K01q13k09
6132f45P95M78o75p98M09J421m27j396K69Q79O18p68o56K74R34J83j370m7Q10
6151B88L36p69o07N43P25j40r50O3P95M59r97n25N00N20K62p83j22O27M71r92
6171b96k19M83O62q45l70P45L21L05j404j38R63Q50q92j504M80J117N06p94p06
6190g36L63R85m19o47K35O43K38j237n7O05M90m58n75L56O46J94r07m09Q81M26
$$ plain form
6210 617 -164 -289 -343 671 462 -537 -790 544 758 176 -419 -7 751 465 -379 -581 408 808 89 -899
6230 -899 42 325 215 -403 -430 280 561 -69 -526 124 643 297 -426 -155 363 204 -337 -1125 44 851
6250 851 447 -474 -690 290 488 -199 -401 269 398 171 -659 -171 406 402 -358 -331 353 436 17 -762 -245
6271 -245 181 599 -522 -745 -7 467 -202 -735 -162 423 312 -289 -609 84 646 105 -435 -56 667 168
6291 168 -431 -731 266 681 -35 -604 -328 43 345 -397 -462 180 607 55 -290 -430 304 142 -757 -437
6311 -437 614 618 -140 -920 -151 607 622 -591 -267 284 836 -157 -387 17 29 494 -501 -174 553 252 -181
6332 -181 -732 156 458 356 -419 -679 513 426 -406 -691 276 741 187 -627 -493 293 225 -191 -563 21
6352 21 924 111 -652 -434 339 491 -180 -410 -14 557 -303 -593 1 456 564 -527 -250 108 348 397
$$ packed form
6210F17p81j25n4J014k09r99k53J334K14n82n95M12P58k86q44k02R89M00p19r88
6230h99R41K83j10o18k7P10K81o30m57O50N19l46p23K71N18j59n41p88J169Q07
6250H51m04r21k16R80J98o87k02O70J29k27q30M88N77mp60K7O84Q3m19p79N17
6271b45M26M18j121k23P38M74o69n33N73N85j11o01l20O93N62n41n40L79P23m99
6291A68n99l00R97M15p16n69K76L71L02p42o5O42M27n52l45j40P34j62q99L20
6311d37J051Mp58p80P69P58J5j213L24N51N52r93k30M04J2M65r95L27P27l01m33
6332a81n51Q88L02j02p75k60J192q7q32k85R67M65n54q14J34P86o8m16l72N84
6352B1R03q13p63K18P73J52o71k30L96N71q60k90N94M55J08j091K77L58K40M9
$$ plain form
6372 397 -298 -80 926 43 -74 -433 357 408 -351 -625 66 511 -5 -603 -624 497 603 54 -408 193
6392 193 361 199 -400 -480 357 737 -118 -375 -50 362 -161 -572 -156 418 372 -147 -536 46 543 104 -639
6413 -639 35 384 468 -341 -454 -122 508 237 -703 -63 556 209 -614 -186 444 628 265 -689 -466 389
6433 389 252 -736 -522 531 432 -419 -571 -228 237 495 8 -703 90 387 -3 -551 -125 604 246 -368
6453 -368 -141 116 690 -131 -527 122 695 436 -220 -372 326 482 -106 -767 184 756 62 -438 -249 422
6473 422 526 -167 -326 14 482 83 -543 -544 330 424 -482 -253 -40 555 473 -366 -124 425 599 -458 -246
6494 -246 -122 837 231 -748 -244 370 479 -407 -637 169 667 -118 -678 -6 342 272 -440 -351 76 815 63
6515 63 -492 -226 143 -4 -149 -463 373 528 -207 -494 -105 675 95 -704 -163 494 729 186 -470 -176
$$ packed form
6372C97o95K18J006q83j17l59P90N1p59k74O91M45n16n98k1J121J06n49m62O01
6392A93J68j62n99q0Q37L80q55k57L25M12n23m11M16N74m6n19l89N82M97m39p43
6413f39O74L49Q4q09j13L32O30k71r40O40O19l47q23M28O30J84l63r54K23Q55
6433C89j37r88K14J053r9q51j52L43M65K58m87p11P93K97l90n48M26P29l58o14
6453c68K27K57N74q21l96O49N73k59o56j52O98J56n88o61R51N72o94n00J89O71
6473D22J04o93j59L40M68l99o26jQ74R4r06K29K13N95q2q39K42N49J74j057K12
6494b46J24R59o06r79N04O14J09q86k30Q06M98p85n60O72L48p0p12Q9M27P39p52
6515F3n55K66L69j47j45l14Q36J55p35k87L89P80n80p99N41O57K35n43o56K94
$$ plain form
6535 -176 382 -17 -723 -388 396 287 -592 -339 -123 488 13 -366 -72 336 227 -729 -222 157 510 90
6555 90 -452 -49 530 509 -246 -558 -390 424 321 -361 42 352 437 -386 -363 282 745 -137 -617 -9 430
6576 430 190 -398 -688 48 643 121 -662 -759 350 264 -522 136 196 423 -35 -668 -157 695 195 -473 92
6597 92 630 561 -576 -469 80 394 176 -658 -493 15 750 -303 -192 332 812 381 -248 -379 604 631
6617 631 -318 -414 170 410 59 -418 -300 407 715 -236 -485 49 684 199 -530 -167 550 377 -478 -241
6637 -241 -111 593 -81 -545 -12 399 448 -204 -631 263 480 31 -341 -115 209 246 -467 -428 112 195 25
6658 25 -306 -233 414 -60 -286 -488 336 447 -574 -366 6 290 101 -545 -70 489 606 -300 -564 77
6678 77 275 80 -320 -251 331 423 19 -527 -89 710 76 -527 -461 89 231 30 -418 271 508 46 -71
$$ packed form
6535a76N58l99p06L35P84j09q79K53K16O11m75l79K94M08j09r56N07L79L53m20
6555I0n42M03N79k1p55l12J68Q14j03o82M03L10Q5q23K3O45M63q82m80O08M39
6576D30k40n88k90P36N95n22p83r7J109q6p86O58O0K27m58o33N11Q52n00o68N65
6597I2N38o9j137J07N49L14k18q34J65N08P35j053J11N24M80m31o29j31R83K7
6617F31r49r6N84K40l51m77J18P07L08r51k49N34O35m85p29L63P17j73q55K37
6637b41J30P04o74m64N33M11M9o52m27Q94K17m49l72K26L24L7p13L9N40Q3j70
6658B5l31P3O47m74k26k02Q24J11j021K08L72K84j89o46M75N59J17r06k64O41
6678G7J98j95m00O9N82R2m04n46M38P99o34o03O6N50J42k01m48O89K37m62j17
$$ plain form
6699 -71 61 389 351 -323 -444 137 493 -38 -332 -440 343 338 -317 -423 -17 688 157 -297 78 502 148
6720 148 -181 -177 470 399 -293 -215 136 416 384 -222 -400 316 352 -347 -237 -248 582 578 -246 -399 190 502 284
6743 284 -353 330 804 247 -341 -334 114 621 248 -449 224 411 131 -266 206 -37 351 -512 -279 167 548
6764 548 -82 -697 -44 639 544 -485 -283 128 451 116 -637 -135 449 252 -447 -388 -52 486 173 -134
6784 -134 -196 268 542 74 -618 -30 402 -442 -450 -298 236 378 -112 -451 595 500 -101 -453 -145 461 221
6805 221 -237 -357 136 341 -276 -767 -116 735 221 -593 -253 196 274 -237 -407 -218 392 348 -473 -341 295
6826 295 361 -332 -223 474 487 -38 -164 -42 269 375 -614 -347 299 585 -198 -628 -349 300 561 -277 -631
6847 -631 181 440 100 -141 -5 410 330 -239 -356 398 234 -162 -292 -443 283 -222 -312 -335 499 452 197
$$ packed form
6699g1J32L28l8o74j21N81L56n31k94j08P83no55j06M06P05n31m54L75M24l54
6720A48l29MO47p1o92P8L51K80l2o06j78P16L6o99J10j1Q30mq24j53N89L12k18
6743B84o37O83M74n57n88PM48N07l73o97O73J87k80l97M72k43L88q63K33M46L81
6764E48o30o15O53O83r5j029K02M11L23l35p53N02N84j97o99N9L36N38l13l07
6784a34o2M64K74m68o92N88M32q44qJ52N34J42m90l39J046r5o01l52L08O06k40
6805B21m58j20M93K05o17m91O51Q51n14q14L40M49P8n11j70J89O10m4q21J32O36
6826B95O6o93J09O97J3n25j26J22L11J06r89K67O46K86p83m30K79O49K61q38l54
6847f31Q12K59l40k41J36M15q0n69j17P54j64l96j30j51P26n05r0k3Q34m7k55
$$ plain form
6868 197 -473 88 597 76 -422 -600 550 315 80 -423 -172 484 299 -328 -421 104 561 -31 -253 -311
6888 -311 392 37 -295 -229 190 345 -6 -249 143 311 -337 -120 -380 543 288 -236 -194 314 349 -16 -734
6909 -734 -159 400 188 -8 -470 -90 536 181 -361 -197 28 -22 -235 -273 185 511 162 -336 -93 180 171
6930 171 -14 -20 -52 95 -59 -487 66 584 120 -376 -224 118 79 -137 -476 40 583 679 -175 -497 291 429
6952 429 -72 -307 -212 377 146 -275 -198 184 359 -431 -376 215 452 32 -454 61 247 65 46 -322 148
6973 148 604 11 -414 -212 229 537 19 -162 -97 279 -30 -129 -149 282 95 -2 -193 25 304 -518 -410
6994 -410 108 386 119 -501 -177 71 347 -149 -484 -59 541 302 -364 -291 165 128 -86 -394 -394 334 228
7015 228 -454 -380 -30 326 -29 -246 -212 -151 205 -30 -498 102 411 -139 -69 78 465 94 -611 -65 117
$$ packed form
6868A97o70N61N09n21m98j78J150k35k35n03K51O56j85o27r3N25M57n92k22n8
6888c11P03l55l32O6M19J55l51k43L92J68o48K17k60R23k55n24M2N08L5l65p18
6909g34N75N59k12j96m62L80O26l55n42J64K25n0k13l8M58L26l49m98K43K73r
6930A71j85ol2J47j54m28N53N18m64m96J52L42l9k16l39N16N43R6q54l22P88J38
6952D29n01k35R5N89k31m21P7L82J75p90N5N91K37m20m86N15J86j82j9l68M70
6973A48M56n93m25K02M41L08n18j81O5L76l09r9k0M31j87r7j91K18K79q22J08
6994d10N18K78k67o20L24K48K76m96l35M25O00k39o66P3M56l7k14l08%P28j06
7015B28o82P4L50L56l55k17L4O1L56k35m68O00L09n50P0J47L87l71p05N46J82
$$ plain form
7036 117 355 -226 -447 371 647 73 -382 -126 230 566 117 -486 44 139 345 -356 -94 148 271 -276
7056 -276 -564 -210 292 69 -399 -317 270 157 -391 -227 417 162 121 -384 -27 289 289 -237 -142 273 379 72
7078 72 -361 -25 176 548 -58 -40 290 157 -179 -621 26 349 83 2 -297 439 199 -216 -306 271 278 -68
7100 -68 -295 219 155 362 302 -600 97 608 -168 -463 -52 226 379 -164 -538 117 126 93 -351 -292 298 51
7122 51 43 -69 -21 446 -172 -331 43 199 56 -161 -339 158 302 3 -481 -151 286 229 -219 -389 416 394
7144 394 -24 -355 -76 301 48 -252 -304 302 397 199 -395 -19 392 -245 -79 86 -61 197 -14 -396 -299
7165 -299 344 -51 -542 -492 497 292 -342 -39 -27 350 315 -73 -520 543 112 -188 -326 -41 382 236 -192
7186 -192 -394 344 88 -233 -127 -131 80 139 -162 -300 266 393 -291 -521 238 341 28 -435 27 517 28
$$ packed form
7036A17K38n81k21Q18K76n74m55K56L56L36m49o03N30R5K06p01K62K42J23n47
7056b76k88L54N02k23m68Q2N87j13n48J64O44k55m1n05L57L16%n26R5M15J06l07
7078G2m33L36K01L72o06J8L30j33l36m42O47L23k66q1k99P36k40m15r0N77Pl46
7100f8k27N14o4K07o0r02O97N11p76k95M11K78J53n43l74O55Rl3m44N9N90k47
7122E1qj12M8M67o18j59L74J56j43k17j78M97J44k99m84L30M37n7m48j70Q05k2
7144C94m18l31K79L77k53l00n2O06R5j98n94L76M11o37J66J65j47K58k11l82R7
7165b99O43l95m91N0R89k05o34L03J2L77l5l88m47J063m31l00j38K85M23j46m28
7186a92k02P38k56l21J06mK11N9l01j38N66J27o84k30P59J03l13m63M62M90m89
$$ plain form
7207 28 -61 -418 352 391 153 -118 103 383 164 153 -269 104 133 321 -433 -71 67 165 -63 -214 282 153
7229 153 22 -455 -305 469 255 -152 -483 62 305 37 -431 -63 486 278 -41 -38 148 225 -25 -130 39
7250 39 302 115 -52 -118 73 308 -135 -28 256 -260 135 -89 -255 108 263 -179 -264 396 541 -144 -599
7271 -599 22 222 -133 -242 -418 -187 257 -402 -79 -248 226 167 -145 -240 -147 426 5 -384 -19 214 457
7292 457 -300 -180 395 359 18 -208 -247 184 250 -275 -274 79 124 -235 -226 49 318 377 -147 -248 31 126 -228
7315 -228 -333 218 261 147 -129 -162 138 94 -13 -55 225 380 224 -166 -295 309 542 81 -226 -71 398
7336 398 2 -443 -427 -52 303 -351 -229 161 248 12 -347 -180 210 522 101 -171 -11 202 240 -311 -159
7357 -159 262 8 15 -92 314 356 64 16 80 258 -161 -377 -377 51 490 -198 -415 140 267 224 -136 -143 -235 225
$$ packed form
7207B8q9l57P70L9k38k71K21K80k19j1m22L73K9J88p54L62J38R8k28j51M96j29
7229A53j31m77J50P74k14m07l31N45K43k68m68L68N49k08l19LJ86P7k50j05J69
7250C9K63j87j67o6J91K35m43J07K84n16L95k24j66L63J55m42q5O60J45o85m55
7271e99O21K00l55j09j76K31M44o59L23j69M74n9l12r5R3N73m21l89L65K33K43
7292D57p57J20N75l6l41k26l9M31O6n25JL53M5l59RK75K69N9n24j01K79R5l54
7315b28j05N51M3j14k76l3L00m4j07m2K80J55j56l90j29O04K33m61l07J55M69
7336C98l96m45J6L75L55o54J22L90Q7k36l59J67L90L12m21k72J60K13L8n51J52
7357a59M21k54Pj07M06M2k92m8O4J78m19k16%M28M39o88k17N55J27m3l60pr2M60
$$ plain form
7381 225 437 -416 -425 249 -259 -63 -467 98 166 -24 -22 -167 417 152 -325 -305 170 90 325 -283 -89 162
7403 162 286 -326 72 65 474 -314 -229 394 -289 -162 -311 -438 314 328 -433 -10 -51 202 -33 -521 -345 -164
7425 -164 452 -66 -207 339 64 -95 -129 -165 128 70 -534 -39 193 161 -260 -604 -103 136 325 -176 -263 -163
7447 -163 313 -267 -593 -146 339 -245 -384 -90 124 356 -333 -273 -219 144 126 -331 -404 107 474 112 -238
7468 -238 136 233 111 -363 -215 224 171 -156 -40 40 228 -132 -280 -140 424 8 -316 -483 -48 334 190
7489 190 -262 -149 338 459 25 -169 -3 58 -37 -324 -20 213 157 -273 -166 14 181 -257 -153 -111 387
7510 387 319 -407 -202 111 83 -50 111 -163 77 -16 -177 -370 5 274 -206 135 -107 451 138 -395 -135
7531 -135 244 566 22 -177 219 134 117 -89 -351 -14 268 85 -240 34 -31 -139 -441 -297 476 171 -109
$$ packed form
7381B25K12q53rO74n08J96m04N65O8j90Kj45N84k65m77K0M75q0K35o08J94K51
7403A62J24o12L98pM09p88Q5O23o83J27j49j27P52J4p61M23m1K53k35m88J76J81
7425a64O16n18j41N46k75j59l4l6K93n8o04M95K32l2m21l44N01K39J89n01q7J00
7447a63M76n80l26M47M85n84j39K94K14K32o89O0N4L63j8m57p3N11L67l62l50
7468b38L74R7j22m74J48M39n3l27J16Q0J88l60j48J40N64m16l24j67M35L82j44
7489A90m52J13M87J21m34j94J66O1r5k87L04K33n6m30J07J80J67m38J04M2M98
7510C87o8p26K05L13k8j33J61k74K40r3j61j93L75K69m80L41k42N58l13n33K60
7531a35L79L22n44j99L96q5j7k06k62L37K82j83l25K74o5j08l02J44P73l05k80
$$ plain form
7552 -109 -187 -95 184 66 -665 8 172 213 -134 -46 41 216 24 143 143 320 -20 -184 -100 347 208 -112 -90
7575 -90 -270 408 369 -298 0 242 2 339 -43 -167 180 447 -242 -68 219 257 -101 23 22 149 209 -167
7597 -167 -252 231 -183 -26 -153 50 -63 138 47 -218 397 108 -404 -286 -14 150 -46 -205 -328 45 104
7618 104 -104 -28 196 393 -113 -15 -188 -15 25 -204 -183 -79 59 -58 -145 -239 118 352 35 -53 90 -5 248
7641 248 -224 -289 411 433 138 108 -60 -125 -139 -53 -227 44 -28 11 -66 -106 235 -56 -235 -68 496 222 -214
7664 -214 -273 115 128 -39 54 -33 99 17 -76 -427 15 267 -270 -313 -153 499 -207 -7 44 -375 297 -154 -97
7687 -97 109 295 195 -257 -95 138 -51 16 -120 -76 98 -30 39 -163 82 282 -44 44 37 114 61 -458 91
7710 91 64 165 -469 -184 236 336 -94 -158 23 267 193 -278 -135 -248 216 -29 -128 -39 106 320 -96 -235
$$ packed form
7552a09p8R2K79j18p31O73J64M1l47Q8Q7J75j92J19%J77l40j64Q4M47j39l20K2
7575i0j80O78l9o67K98K42k40L37l82j24L47K67o89J74K87L8l58J24jJ27O0l76
7597a67q5M83m14J57j27K03j13K01r1k65O15k89n12J18K72J64j96j59j23L73N9
7618A04k08P6K24J97n06R8j73J73M0k29K1J04J38j17q7r4L57K34l17q8J43r5K53
7641B48m72o5P00K2k95l0j68o5j4Q6j74K71p2L9p7m0L41k91j79J67N64k74m36
7664b14n9L88J3j67R3q7J32q2r3l51M42K52n37m3J60O52p06K00N1m19O72m51N7
7687i7K06J86j00m52J62K33j89O7j36M4J74j28O9k02K45K00l26Q8pP7n3n19N49
7710I1k7J01o34K85M20J00m30o4J81K44p4m71J43j13M64k45r9Q9J45K14m16j39
$$ plain form
7732 -235 73 250 -76 -268 -134 51 162 44 -263 110 155 -106 -79 317 362 272 -87 -217 218 -276 -209 1
7754 1 118 213 92 -195 -157 317 293 -319 -39 46 323 103 -113 -325 149 72 -210 -152 138 81 382 -373 9
7777 9 30 272 50 -231 190 324 137 -209 -102 204 326 153 -118 -179 -91 201 -5 -12 454 55 -251 -232 84
7800 84 273 181 -139 -93 362 115 -201 -57 -19 295 169 -259 -109 411 227 262 116 143 -103 202 -273 128
7822 128 316 425 -140 -143 196 88 -8 -36 31 525 -108 -76 -88 238 312 112 -336 -87 393 -66 -108 -117 275 -120
7846 -120 83 174 10 90 9 -66 -91 -59 141 -260 -228 -68 283 -172 -519 61 161 461 -166 68 -1 -129 90
7869 90 -13 -98 49 -10 26 -181 107 212 -36 -343 -109 59 173 33 -180 -194 -150 -29 -123 -135 228 -185 -146
7892 -146 -223 5 -56 107 -97 79 258 316 -175 -30 -107 -50 118 -292 -271 31 25 -107 -16 123 152 -11 263
$$ packed form
7732b35L08J77l26j92J34J85J11j18l07L73M5k61K7L96M5r0l59j30M35m94O7K10
7754AJ17R5j21k87L8M74k4o12K80Q5K77k20k16k12M74p7k82N8K90n7L01p55L82
7777IK1K42k22k81M21J34j87l46J07L06J22j73k71o1Q8K92k06pM66l99l06J9L16
7800H4J89r2l20M6M55k47l16J44L8L14j26m28J50N20j84L5j46K7k46L05m75M01
7822A28J88J09n65lL39j08r6k8O7M94o33L2j2L26P4k00m48K49M80m59m2rL92l95
7846a20K03R1j64Q0q1p5k5L2K00m01L2J60L51m55l47N80J00L00o27K34o9j28K19
7869I0j03q5J47n9L6k07K88J05k48l07K34J68J14j40k13j4M4J21r4j2L63m13L9
7892a46p7K28o1J63k04J76J79N8m91J45p7N7J68m10K1L02oj32R1J39K9j63K74
$$ plain form
7915 263 37 364 10 -208 -63 -51 79 -21 -192 13 269 17 5 -131 101 -163 -216 12 43 430 -14
7936 -14 202 -42 93 374 51 -649 55 364 152 -143 19 -42 305 -212 -139 -121 105 -386 16 136 250
7957 250 -70 -242 55 127 290 -62 -397 51 517 -10 -69 -187 47 111 -45 -200 362 -277 120 -357 21
7978 21 172 384 6 -224 -121 127 262 -73 -174 151 124 22 -18 256 -348 237 -291 43 105 134 -186 128
8000 128 184 98 -12 -179 -39 -8 203 275 -161 -72 91 -7 -212 116 -9 -59 -85 -149 171 -69 127 -128 280
8023 280 311 33 -565 -210 86 195 -61 -159 -161 616 134 -307 -122 -253 253 108 -155 -293 204 136 -170 -148
8045 -148 26 -21 85 -221 -40 134 108 -175 -241 -70 257 -123 -203 -178 17 -42 -17 55 -142 243 -418 -354 64
8068 64 370 15 -450 -224 326 16 -39 73 17 -88 -198 -110 -139 62 27 31 -120 -197 36 -10 -305 2 231
$$ packed form
7915B63k26L27l54k18J45J2J30j00j71K05K56k52j2j36K32k64n3K28L1L87m44
7936a4K16k44J35K81l23p00P04L09k12k95J62o1L47n17P3J8K26m91M02J20J14
7957B50l20j72K97P2J63l52l35M48M66n27n9j18K34O4j56j55N62o39L97m77L78
7978B1J51K12l78k30J03K48J35l35j01L25k7j02m0K74o04N85n28L34O2K9l20L14
8000A28N6q6j10j67J40L1K11P2m36Q9J63r8k05L28j25n0k6o4L20k40J96k55M08
8023B80L1k78n98L55K96J09k56r8kP77m82m41J85j31N06j45k63j38M97o8l06K2
8045a48J74m7J06l06J81J74k6k83o6J71L27l80q0K5J95n9K5P2j97L85o61O4M18
8068F4L06l55m65K26N50l10n5J12n6j05j10Q8k9K01l5Mj51p7K33m6k95L07K29
$$ plain form
8091 231 120 -211 170 118 9 -121 -358 -379 12 159 -16 231 65 -16 -48 16 285 114 94 -211 -213 136 -177
8114 -177 65 -9 14 231 -184 -99 -18 -84 296 -142 -223 -225 462 -423 -178 -149 -66 255 129 -246 108 72 17 78
8138 78 -137 -90 -7 -141 -160 75 -150 87 178 -390 48 532 -84 -115 274 255 -23 -121 104 233 296 105 177
8161 177 -241 49 342 -232 -100 128 57 -9 68 139 246 -90 12 -593 -176 175 171 -294 14 195 -254 -76
8183 -76 216 201 -219 -23 -5 -25 51 -268
$$ packed form
8091B31j11l31L81n2j09j30k37k1L91J47j75K47j66q1l2O4K69j71k0l05kL49l13
8114a77K42p4K3K17m15Q5Q1o6L80m38q1kO87q85K45K9Q3L21j26l75L54l6n5O1
8138G8k15M7Q3j34j9K35k25K37R1n68M38M84o16l1L89j9k78r8K25J29O3j91P2
8161A77m18K90K93n74J32K28p1o6P7P1J07l36J02o05M17L51mm65L08J81m49J78
8183g6K92j5m20J96J8k0P6l19
8191b68
$$ Imaginary data points
##PAGE= N=2
##DATA TABLE= (X++(I..I)), XYDATA
$$ plain form
0 0 0 0 0 2 -8 8 -8 16 -16 17 -24 32 -40 49 -63 73 -89 105 -126 147 -171 202 -234 270 -308 354 -404 459
28 459 -522 589 -665 745 -837 935 -1044 1163 -1295 1439 -1595 1768 -1959 2170 -2400 2659
44 2659 -2948 3267 -3630 4044 -4517 5066 -5715 6493 -7448 8646 -10212 12349 -15452 20401
58 20401 -29556 52183 -226687 -162597 435374 289037 -107585 -267723 -15402 123070 12157
69 12157 -146645 -24274 148737 111236 -83189 -114737 -13688 46936 -9825 -28268 52139
80 52139 107787 -29116 -163821 -51200 149856 89790 -115120 -119729 81650 164444 3694
91 3694 -169445 -88423 109884 93512 -87251 -70751 136784 153114 -109185 -271512 -68226
102 -68226 252115 244743 -75863 -238592 -48908 131819 40847 -93234 -19090 132781 102296
$$ packed form
0@%%%Kj0J6j6K4l2L3m1N6p2Q9j12J36j62J94k31K73l18L73m36N04n78O62p58Q63
28D59r81J111j254J410j582J772j979K207k458K734l034L363l727M129m570N059
44B659n607O215o897P674q561R583j0781J2208j3941J6094j8858K2561k7801L5853
58B0401m9957Q1739k78870O4090N97971j46337l96622j60138K52321J38472j10913
69A2157j58802J22371J73011l7501j94425l1548J01049O0624n6761j8443Q0407
80E2139N5648j36903j34705J12621K01056o0066k04910m609K01379Q2794j60750
91C694j73139Q1022J98307j6372j80763J6500K07535J6330k62299j62327K03286
102f8226L20341p372l20606j62729J89684J80727r0972j34081P4144J51871l0485
$$ plain form
113 102296 -95159 -172650 -6612 136999 43896 -69101 17407 109307 -10992 -171951 -99888
124 -99888 135969 206911 -6185 -197446 -83312 135826 114610 -71169 -113942 17642 100839
135 100839 29485 -59012 -17364 52902 -18298 -106790 593 160819 88251 -121827 -150068
146 -150068 34931 146352 15235 -146035 -48210 176638 139248 -141760 -236847 -1734
156 -1734 217406 131669 -101224 -143711 26345 97618 -41577 -112633 39319 157839 37319
167 37319 -140494 -123330 47745 127199 17152 -88717 -24979 65337 11620 -67175 -19564
178 -19564 52243 16428 -52466 -21699 71766 58604 -82824 -128613 37183 163327 28572
189 28572 -157960 -97101 119493 159264 -56191 -215229 -57126 199175 161390 -103209 -188068
$$ packed form
113A02296j97455p7491J66038J43611r3103j12997Q6508R1900j20299j60959P2063
124i9888K35857P0942k13096j91261J14134K19138k1216j85779m2773J31584Q3197
135A00839p1354q8497M1648P0266p1200q8492J07383J60226p2568k10078k8241
146a50068J84999J11421j31117j61270R7825K24848l7390k81008r5087K35113
156a734K19140q5737k32893m2487J70056P1273j39195p1056J51952J18520j20520
167C7319j77813J7164J71075P9454j10047j05869O3738R0316n3717p8795M7611
178a9564P1807l5815o8894L0767R3465j3162j41428m5789J65796J26144j34755
189B8572j86532O0859K16594L9771k15455j59038J58103K56301l7785k64599q4859
$$ plain form
200 -188068 -9873 127159 52125 -69719 -45290 61499 50538 -70917 -83186 46159 93428
211 93428 -11076 -76645 -3463 71870 16851 -85831 -57084 82907 104103 -44241 -115558
222 -115558 2051 97810 23102 -79005 -39645 74471 71409 -61169 -103506 34231 123972
233 123972 6590 -118952 -44739 100686 87638 -60938 -115172 13787 122830 32566 -102249
244 -102249 -53986 79606 69942 -52541 -79632 27963 97697 6760 -105653 -39764 106906
255 106906 78255 -83489 -106476 42506 123370 17569 -111098 -68319 77986 95042 -32938
266 -32938 -84787 5571 60692 2314 -44892 -1621 49864 13731 -60873 -38200 64358 64359 -58223
279 -58223 -89020 39107 112746 3377 -125845 -72140 99111 129521 -39447 -144285 -20762
$$ packed form
200a88068J78195J37032p5034j21844K4429J06789j0961j21455j2269J29345M7269
211I3428j04504o5569P3182P5333n5019j02682K8747J39991K1196j48344p1317
222a15558J17609R5759p4708j02107L9360J14116l062j32578m2337J37737Q9741
233A23972j17382j25542P4213J45425j3048j48576n4234J28959J09043r0264j34815
244a02249M8263J33592r664j22483k7091J07595O9734r0937j12413O5889J46670
255A06906k8651j61744k2987J48982Q0864j05801j28667M2779J46305J7056j27980
266c2938n1849R0358N5121n8378m7206M3271N1485l6133p4604K2673J02558Jj22582
279e8223l0797J28127P3639j09369j29222N3705J71251L0410j68968j04838J23523
$$ plain form
290 -20762 118421 50194 -91575 -74181 64238 102612 -24435 -122285 -32808 101497 64697
301 64697 -64304 -67335 34874 60222 -21782 -70850 -6200 71788 33067 -58526 -42643 42717
313 42717 31960 -48592 -42671 46597 69228 -21930 -91312 -20213 91132 50247 -87611 -84241
325 -84241 66292 117442 -12815 -125281 -56690 86263 90887 -40886 -88047 22457 85846
336 85846 -10846 -97257 -28586 84410 73497 -37363 -79205 5771 63213 -9458 -70497 8705
348 8705 95893 35490 -82150 -80424 32101 87148 6476 -69968 -8703 75183 19891 -81547
360 -81547 -51214 59415 76723 -16148 -71250 -4207 71972 17312 -81668 -44204 76091 78954
372 78954 -33054 -78671 -219 66907 12862 -72685 -30910 87022 77784 -57796 -103503 3620
$$ packed form
290b0762J39183o8227j41769J7394J38419L8374j27047r7850Q9477J34305l6800
301F4697j29001l031J02209K5348q2004m9068O4650P7988l8721r1593J5883Q5360
313D2717j0757q0552N921Q9268K2631r1158o9382P1099J11345m0885j37858L370
325h4241J50533N1150j30257j12466O8591J42953M624j31773m7161J10504O3389
336H5846r6692q6411O8671J12996j0913j10860m1842Q4976N7442p2671o1039P9202
348H705Q7188o0403j17640J726J12525N5047q0672p6444O1265Q3886n5292j01438
360h1547L0333J10629J7308r2871n5102O7043P6179n4660r8980L7464J20295K863
372G8954j12008m5617P8452O7126n4045q5547M1775J17932r238j35580m5707J07123
$$ plain form
384 3620 84737 28163 -57141 -30732 63877 57118 -64493 -102840 19697 111707 39080 -67861
396 -67861 -54801 31301 44115 -30931 -57563 26990 83368 5926 -76752 -33585 44521 28200
408 28200 -36804 -30724 45007 63650 -27635 -94973 -18900 80745 42845 -56974 -46822 47563
420 47563 64876 -35153 -102910 -17453 102977 67283 -64829 -78084 29151 62418 -22868
431 -22868 -74094 -729 87517 47837 -68290 -80121 22988 63863 -7480 -48311 9197 58109
443 58109 10261 -68352 -54395 41718 69328 -14604 -57907 12841 59512 -9521 -79705 -31285
455 -31285 70792 74827 -29277 -79910 850 64517 -1066 -70377 -13099 78829 57620 -48051
467 -48051 -85651 -2340 72830 23994 -53599 -18263 61740 34717 -59392 -69523 22727 83605
$$ packed form
384C620Q1117n6574q5304K6409R4609o759j21611l8347J22537R2010p2627j06941
396f7861J3060Q6102J2814p5046k6632Q4553N6378p7442q2678M3167P8106j6321
408B8200o5004O080P5731J8643r1285o7338P6073R9645l7900r9819J0152R4385
420D7563J7313j00029o7757Q5457J20430l5694j32112j3255J07235L3267q5286
431b2868n1226P3365Q8246l9680j16127j1831J03109M0875p1343m0831N7508M8912
443E8109m7848p8613J3957R6113K7610q3932m3303P0748M6671o9033p0184M8420
455c1285J02077M035j04104n0633Q0760O3667o5583o9311N7278R1928k1209j05671
467d8051l7600Q3311P5170m8836p7593L5336Q0003k7023r4109j0131R2250O0878
$$ plain form
479 83605 23477 -62361 -34982 50982 36173 -52910 -51923 42470 74539 -2731 -68494 -25167
491 -25167 54468 35359 -50727 -46546 49982 72634 -18114 -76380 -20094 55424 37509 -37485
503 -37485 -38241 44486 61004 -35524 -86435 -3426 80439 42229 -44300 -45925 27834 45171 -32062
516 -32062 -67687 18759 90633 25198 -73699 -57887 32428 57413 -9824 -52816 5960 64741
528 64741 8785 -73327 -38011 54535 53690 -27226 -55732 7597 58174 7839 -66501 -34041
540 -34041 56196 50818 -35766 -55090 16599 55241 -2935 -66580 -27532 63340 57106 -40476
552 -40476 -67270 12269 53265 -5033 -52408 -6293 61525 35988 -58656 -73668 23808 77826
564 77826 6360 -59667 -17422 45660 20918 -48280 -43824 37856 68100 -11541 -73031 -15719
$$ packed form
479H3605o0128q5838K7379Q5964j4809q9083R87R4393L2069p7270o5763M3327
491b5167P9635j9109q6086M181R6528K2652r0748n8266N6286P5518j7915p4994
503c7485p56Q2727J6518r6528n0911Q3009Q3865l8210q6529j625P3759J7337p7233
516c2062l5625Q6446P1874o5435r8897J5812R0315K4985o7237m2992N8776N8781
528F4741n5956q2112L5316R2546q45q0916k8506O3329N0577n0335p4340L2460
540c4041R0237n378q6584j9324P1689L8642n8176o3645L9048R0872o234r7582
552d0476k6794P9539M0996n8298m7375M6115O7818k5537r4644j5012R7476N4018
564G7826p1466o6027M2245O3082k4742o9198M456Q1680L0244p9641o1490N7312
$$ plain form
576 -15719 56866 26211 -43711 -35649 34172 50960 -18785 -66989 -4273 69654 26126 -61873
588 -61873 -42835 46217 57836 -21607 -65039 -4484 62907 24747 -54731 -34586 49787 49019
600 49019 -35024 -62369 7622 66180 26429 -50637 -42258 36299 47222 -26628 -49590 19155
612 19155 59623 5455 -57372 -31510 44118 50156 -25287 -52328 17275 57003 -5580 -59111
624 -59111 -11629 57580 39365 -40945 -57507 20816 66281 -223 -62839 -15313 56507 33400
636 33400 -42131 -49291 22925 62945 452 -65580 -20751 59641 36644 -46130 -47354 28240
648 28240 55179 -7046 -58685 -14613 55526 31666 -46501 -42939 32153 47460 -16952 -51894
660 -51894 -2479 52149 21122 -50567 -40884 39633 51376 -25548 -57027 6026 53696 11569
$$ packed form
576a5719P2585l0655o9922Q062O9821J6788o9745m8204O2716P3927m3528q7999
588f1873J9038Q9052J1619p9443m3432O0555O7391l8160p9478K0145Q4373p68
600D9019q4043k7345O9991N8558l9751p7066Q379P8557J0923p3850k2962O8745
612A9155M0468n4168o2827K5862P5628O038p5443k7041O9603L9728o2583n3531
624e9111M7482O9209j8215q0310j6562P8323M5465o6504o2616M7526P1820k3107
636C3400p5531p160P2216M0020o2493o6032M4829Q0392k2997q2774j224P5594
648B8240K6939o2225n1639M4072P0139k3860p8167L562P5092J5307o4412l4942
660e1894M9415N4628l1027p1689R683Q0517J1743p6924l1479O3053M7670m2127
$$ plain form
672 11569 -50491 -32460 41330 49604 -30161 -64383 7678 64924 15011 -55890 -36440 37019
$$ packed form
672A1569o2060J8031P3790Q274p9765l4222P2061N7246m9913p0901J9450P3459
$$ [...]
8191b33
##END NTUPLES=NMR FID
##END=
