##TITLE=1H_Ser Cl-Ac-2
 CDCl3
 8 sc, 
 26.12.2024
##JCAMPDX= 6.0         $$ Bruker NMR JCAMP-DX V2.0
##DATA TYPE= NMR FID
##DATA CLASS= NTUPLES
##ORIGIN= UXNMR, Bruker Analytische Messtechnik GmbH
##OWNER= root
$$ XWIN-NMR		Version 3.5
$$ Thu Dec 26 16:25:14 2024 Russian Standard Time (UT+4h)  she@DPX200
##.OBSERVE FREQUENCY= 200.1315
##.OBSERVE NUCLEUS= ^1H
##.DELAY= (6, 6)
##.ACQUISITION MODE= SIMULTANEOUS
##.ACQUISITION SCHEME= undefined
##.AVERAGES= 8
##.DIGITISER RES= 18
##SPECTROMETER/DATA SYSTEM= spect
##.PULSE SEQUENCE= zg30
##.SOLVENT NAME= D2O
##.SHIFT REFERENCE= (INTERNAL, D2O, 0, 15.7039)
##AUDIT TRAIL= $$ (NUMBER, WHEN, WHO, WHERE, WHAT)
$$ ##TITLE= Audit trail, XWIN-NMR		Version 3.5
$$ ##JCAMPDX= 5.01
$$ ##ORIGIN= Bruker BioSpin GmbH
$$ ##OWNER= she
$$ F:/spectra/data/she/nmr/H-F/1/audita.txt
$$ ##AUDIT TRAIL=  $$ (NUMBER, WHEN, WHO, WHERE, WHAT)
(   1,<2024-12-26 16:24:15.18 +0400>,<she>,<DPX200>,
      <created by zg, POWCHK disabled, PULCHK disabled
       configuration hash MD5:
       00 E9 B6 7A A2 85 ED C7 34 08 36 98 17 FE 4E 26
       data hash MD5: 16K
       2B BB D1 8F F8 3A 13 D8 AB A6 94 2D A9 D5 C8 36>)
$$ ##END=
$$ 
$$ hash MD5
$$ 89 14 DA C9 01 12 4E 4C 1D 62 6F DF D8 27 BD A4
##$RELAX= 
##$RELAX= 
##$RELAX= 
##$RELAX= 
##$RELAX= 
##$RELAX= 
$$ Bruker specific parameters
$$ --------------------------
##$DU= <F:/spectra>
##$EXPNO= 1
##$NAME= <H-F>
##$PROCNO= 1
##$TYPE= <nmr>
##$USER= <she>
##$AMP= (0..31)
100 100 100 100 100 100 100 100 100 100 100 100 100 100 100 100 100 100 
100 100 100 100 100 100 100 100 100 100 100 100 100 100 
##$AQSEQ= 0
##$AQ_mod= 1
##$AUNM= <au_zg>
##$AUTOPOS= <>
##$BF1= 200.13
##$BF2= 200.13
##$BF3= 200.13
##$BF4= 200.13
##$BF5= 200.13
##$BF6= 200.13
##$BF7= 200.13
##$BF8= 200.13
##$BYTORDA= 1
##$CFDGTYP= 0
##$CFRGTYP= 5
##$CHEMSTR= <none>
##$CNST= (0..31)
1 1 145 1 1 1 1 1 1 1 1 1 1 1 1 1 1 1 1 1 1 1 1 1 1 1 1 1 1 1 1 1 
##$CPDPRG= <>
##$CPDPRG1= <>
##$CPDPRG2= <>
##$CPDPRG3= <>
##$CPDPRG4= <mlev>
##$CPDPRG5= <mlev>
##$CPDPRG6= <mlev>
##$CPDPRG7= <mlev>
##$CPDPRG8= <mlev>
##$CPDPRGB= <>
##$CPDPRGT= <>
##$D= (0..31)
0 1.2 0 0 0 0 0 0 0 0.06 0 0.03 0 0 0 0 0.0002 0 0 0 0 0 0 0 0 0 0 0 0 
0 0 0 
##$DATE= 1735215854
##$DBL= (0..7)
120 120 120 120 120 120 120 120 
##$DBP= (0..7)
150 150 150 150 150 150 150 150 
##$DBP07= 0
##$DBPNAM0= <>
##$DBPNAM1= <>
##$DBPNAM2= <>
##$DBPNAM3= <>
##$DBPNAM4= <>
##$DBPNAM5= <>
##$DBPNAM6= <>
##$DBPNAM7= <>
##$DBPOAL= (0..7)
0.5 0.5 0.5 0.5 0.5 0.5 0.5 0.5 
##$DBPOFFS= (0..7)
0 0 0 0 0 0 0 0 
##$DE= 6
##$DECBNUC= <off>
##$DECIM= 24
##$DECNUC= <off>
##$DECSTAT= 4
##$DIGMOD= 1
##$DIGTYP= 9
##$DL= (0..7)
0 120 120 120 120 120 120 120 
##$DP= (0..7)
150 150 150 150 150 150 150 150 
##$DP07= 0
##$DPNAME0= <>
##$DPNAME1= <>
##$DPNAME2= <>
##$DPNAME3= <>
##$DPNAME4= <>
##$DPNAME5= <>
##$DPNAME6= <>
##$DPNAME7= <>
##$DPOAL= (0..7)
0.5 0.5 0.5 0.5 0.5 0.5 0.5 0.5 
##$DPOFFS= (0..7)
0 0 0 0 0 0 0 0 
##$DQDMODE= 0
##$DR= 18
##$DS= 0
##$DSLIST= <SSSSSSSSSSSSSSS>
$$ [...]
##$SUBNAM2= <"">
##$SUBNAM3= <"">
##$SUBNAM4= <"">
##$SUBNAM5= <"">
##$SUBNAM6= <"">
##$SUBNAM7= <"">
##$SUBNAM8= <"">
##$SUBNAM9= <"">
##$SW= 24.0689530833862
##$SWIBOX= (0..15)
0 0 2 0 0 0 0 0 0 0 0 0 0 0 0 0 
##$SW_h= 4816.95568400771
##$TD= 16384
##$TD0= 1
##$TE= 0
##$TE2= 300
##$TE3= 300
##$TEG= 300
##$TL= (0..7)
0 120 120 120 120 120 120 120 
##$TP= (0..7)
150 150 150 150 150 150 150 150 
##$TP07= 0
##$TPNAME0= <>
##$TPNAME1= <>
##$TPNAME2= <>
##$TPNAME3= <>
##$TPNAME4= <>
##$TPNAME5= <>
##$TPNAME6= <>
##$TPNAME7= <>
##$TPOAL= (0..7)
0.5 0.5 0.5 0.5 0.5 0.5 0.5 0.5 
##$TPOFFS= (0..7)
0 0 0 0 0 0 0 0 
##$TUNHIN= 0
##$TUNHOUT= 0
##$TUNXOUT= 0
##$USERA1= <user>
##$USERA2= <user>
##$USERA3= <user>
##$USERA4= <user>
##$USERA5= <user>
##$V9= 5
##$VALIST= <valist>
##$VCLIST= <CCCCCCCCCCCCCCC>
##$VD= 0
##$VDLIST= <DDDDDDDDDDDDDDD>
##$VPLIST= <PPPPPPPPPPPPPPP>
##$VTLIST= <TTTTTTTTTTTTTTT>
##$WBST= 1024
##$WBSW= 4
##$XGAIN= (0..3)
0 0 0 0 
##$XL= 0
##$YL= 0
##$YMAX_a= 246454
##$YMIN_a= -300757
##$ZGOPTNS= <>
##$ZL1= 120
##$ZL2= 120
##$ZL3= 120
##$ZL4= 120
##$ABSF1= 10
##$ABSF2= 0
##$ABSG= 5
##$ABSL= 3
##$ALPHA= 0
##$AQORDER= 0
##$ASSFAC= 0
##$ASSFACI= 0
##$ASSFACX= 0
##$ASSWID= 0
##$AUNMP= <proc_1d>
##$AZFE= 0.1
##$AZFW= 0.1
##$BCFW= 1
##$BC_mod= 2
##$BYTORDP= 1
##$COROFFS= 0
##$CY= 11.3945322036743
##$DATMOD= 1
##$DC= 2
##$DFILT= <>
##$DTYPP= 0
##$F1P= 15.6554695791079
##$F2P= 12.8336369535428
##$FCOR= 0.5
##$FTSIZE= 0
##$FT_mod= 4
##$GAMMA= 1
##$GB= 0.15
##$INTBC= 1
##$INTSCL= 1
##$ISEN= 128
##$LB= 0.24
##$LEV0= 0
##$LPBIN= 0
##$MAXI= 10000
##$MC2= 0
##$MEAN= 0
##$ME_mod= 0
##$MI= 1.114404
##$NCOEF= 0
##$NC_proc= 0
##$NLEV= 6
##$NOISF1= 3.799351
##$NOISF2= 2.8
##$NSP= 1
##$NTH_PI= 0
##$NZP= 0
##$OFFSET= 15.70392
##$PC= 1
##$PHC0= -26579.93
##$PHC1= 22.98744
##$PH_mod= 1
##$PKNL= yes
##$PPARMOD= 0
##$PSCAL= 0
##$PSIGN= 0
##$REVERSE= no
##$SF= 200.130013532006
##$SI= 16384
##$SIGF1= 3
##$SIGF2= 2
##$SINO= 400
##$SIOLD= 16384
##$SREGLST= <1H.CDCl3>
##$SSB= 0
##$STSI= 0
##$STSR= 0
##$SW_p= 3612.71676300578
##$SYMM= 0
##$S_DEV= 0
##$TDeff= 0
##$TDoff= 0
##$TI= <>
##$TILT= no
##$TM1= 0
##$TM2= 0
##$TOPLEV= 0
##$USERP1= <user>
##$USERP2= <user>
##$USERP3= <user>
##$USERP4= <user>
##$USERP5= <user>
##$WDW= 1
##$XDIM= 8192
##$YMAX_p= 0
##$YMIN_p= 0
$$ End of Bruker specific parameters
$$ ---------------------------------
##NTUPLES= NMR FID
##VAR_NAME=  TIME,          FID/REAL,        FID/IMAG
##SYMBOL=    X,             R,               I
##VAR_TYPE=  INDEPENDENT,   DEPENDENT,       DEPENDENT
##VAR_FORM=  AFFN,          ASDF,            ASDF
##VAR_DIM=   8192,          8192,            8192
##UNITS=     SECONDS,       ARBITRARY UNITS, ARBITRARY UNITS
##FACTOR=    0.0002076,     1,               1
##FIRST=     0,             0,               0
##LAST=      1.7004516,     0,               0
##MIN=       0,             -300757,         0
##MAX=       1.7004516,     246454,          0
$$ Real data points
##PAGE= N=1
##DATA TABLE= (X++(R..R)), XYDATA
$$ [...]
$$ plain form
2628 875 -3190 -2230 2587 4609 -602 -5667 -249 6064 2281 -4516 -2877 2966 3986 -586 -4483
2643 -4483 -782 5225 3057 -4714 -3306 3412 4139 -1426 -3735 -185 4056 2612 -3806 -3393 3354
2658 3354 4344 -2556 -4107 1496 4048 963 -3628 -3502 2880 5044 -1702 -5379 653 4932 444
2673 444 -4084 -2477 2219 4353 -952 -5119 -850 5103 791 -4470 -1542 3101 2692 -1411 -3431
2688 -3431 -235 4020 742 -4941 -1893 4258 2975 -3505 -4329 479 4012 1459 -4392 -3160 4117
2703 4117 4144 -3764 -5016 1212 4310 1577 -3481 -3084 2116 3758 -1911 -4864 1143 4590 97 -3414
2719 -3414 -1583 2325 2505 -1843 -3937 1410 5318 -549 -5019 -988 4066 2243 -2649 -3534 1257
2734 1257 4714 441 -5951 -2298 4871 3495 -3014 -3470 672 3229 988 -3784 -2389 4115 3776
$$ packed form
2628H75m065R60M817K022n211n065N418O313l783o797J639N843J020m572l897
2643d483L701O007k168p771J408O718P27n565k309L550M241j444o418M13O747
2658C354R90o900j551N603K552l085m591J26O382K164o746l677O032M279m488
2673D44m528J607M696K134n305m167M269N953m312n261K928M643m09m103k020
2688c431L196M255l278n683L048O151j283o480q24M808L533k553n851J232P277
2703D117K7p908j252O228L098k733n058L97N200J642n669k953O007L447m493l511
2719c414J831L908J80m348k094N347L908n867m470M031N054j823m892q85M791
2734A257L457m273o392L653P169j376o509m56M142K557k241m772J395O504l39
$$ plain form
2749 3776 -2623 -3598 1432 3225 -688 -2750 -330 3563 2847 -3451 -4795 2196 5010 -791 -3584
2764 -3584 -48 3585 2120 -2780 -4368 1592 5718 109 -4960 -1341 3769 1952 -2485 -2715 669
2779 669 4200 890 -4046 -1229 4037 1017 -4227 -2371 2921 3502 -49 -4147 -2398 3286 2408 -3377
2795 -3377 -2313 3645 3321 -2363 -4982 -1372 4218 3648 -2440 -4356 1200 3396 -1783 -3827 415
2810 415 3522 1446 -2817 -3574 1427 3735 -883 -4658 79 3831 433 -3067 -1900 1273 2637
2825 2637 -1147 -4380 156 5444 1261 -5025 -3236 2363 3007 -74 -2722 -973 3387 1180 -4978
2840 -4978 -3118 3716 4054 -1148 -3290 -1268 1685 1471 -2489 -2058 3215 3673 -2792 -4297 883 3719
2856 3719 1137 -2549 -2116 2717 3417 -1744 -4654 874 4729 623 -3198 -1752 2541 3032 -537 -4185
$$ packed form
2749C776o399r75N030J793l913k062K420L893p16o298j344O991K814n801k793
2764c584L536L633j465m900j588N960M126n609n069L619N110j817m437k30L384
2779F69L531l310m936K817N266l020n244J856N292N81l551m098J749N684q78n785
2795c377J064N958l24n684k619L610N590n70o088j916N556K196n179k044M242
2810D15L107k076m263p57N001K308m618l775M737L752l398l500J167L173J364
2825B637l784l233M536N288m183o286J789N599O44l081k648J749M360k207o158
2840d978J860O834L38n202k142K022K953k14l960M31N273M58o465j505N180K836
2856C719k582l686M33M833P00n161k910N528L855m106l821J446M293M91l569l648
$$ plain form
2872 -4185 -224 4752 1584 -3203 -1024 2887 1600 -1985 -2812 932 4665 1786 -3821 -2493 3095
2887 3095 2155 -2236 -1832 2259 3630 255 -4563 -2918 3904 4401 -1889 -3561 1008 2923 -155 -2694
2903 -2694 -1438 3047 3424 -1617 -4223 815 4089 219 -3190 -669 2146 1843 -1203 -2950 615
2918 615 3636 -406 -4321 -369 3733 1862 -2551 -2963 -14 3104 891 -3332 -965 3867 1719
2933 1719 -3590 -3390 2205 3321 837 -3020 -2158 2391 2114 -2756 -2765 2278 3084 -917 -3704 -1303 2242
2950 2242 2578 -1786 -3703 1143 3477 -1068 -3711 -462 2440 1254 -1992 -2912 788 3316 -592
2965 -592 -3980 -392 3451 1032 -2405 -2128 1120 2316 -527 -3880 -1034 4013 1498 -3413 -2354
2980 -2354 2303 2671 -519 -3231 -854 3173 2023 -2999 -2923 2324 3118 -740 -2828 -430 2455 1999
$$ packed form
2872d185L961M976l168m787K179L911j287l585q27L744L733k879n607J328N588
2887C095r40m391M04M091J371l375m818J645O822M97o290j672M569J915l078k539
2903b694J256M485L77n041k606N038L274l870l409K521K815l03l046j747L565
2918F15L021m042l915L952M102j871m413m12K949L118k213m223K367M832k148
2933A719n309K00N595J116k484l857Q62M549k77m870rN043Q06m001k787K401L545
2950B242L36m364j917M846K334m545k643L249K902j186l246r20L700K528l908
2965e92l388L588L843k419l437K77L248J196k843l353K846N047k515m911J059
2980b354M657L68l190k712K377M027j150n022P6N247P94l858k088K398K885m56
$$ plain form
2996 1999 -2293 -3122 1631 3322 -671 -2937 325 2468 979 -1281 -1645 1659 2854 -1259 -3927
3011 -3927 677 3849 674 -2682 -1647 1639 2391 -647 -3184 111 4003 818 -3743 -2043 2542
3026 2542 2426 -800 -2501 -387 3240 1315 -3222 -2147 3010 2963 -1578 -2790 461 2774 1426 -2424
3042 -2424 -2533 1579 3591 -1378 -2855 549 1955 125 -2038 -1447 1409 2857 -873 -3307 155
3057 155 2902 -284 -2775 -267 2458 1729 -1899 -3395 304 3841 986 -3469 -1138 2628 1047
3072 1047 -2350 -2699 780 3810 1525 -3748 -2859 2562 2616 -1541 -2304 629 1985 985 -2355 -2230
3088 -2230 1703 2183 -1309 -2428 1328 2330 -661 -2194 -634 1664 1559 -1994 -2477 1971 3621 -1407
3104 -1407 -3936 -601 3400 2586 -756 -2804 -210 2874 148 -3031 -98 4028 1924 -2242 -2824
$$ packed form
2996A999m292q29M753J691l993k266L262K143j489k260l64L304J195m113k668
3011c927M604L172l175l356J035L286P52l038k537L295L892l185m561J700M585
3026B542j16l226j701K114L627j925m537J075N157m7m541j212L251K313j348l850
3042b424j09M112K012m969j477L404J406j830k163N91K856J448l730k434L462
3057A55K747l186k491K508K725p29l628j496L699L537k855m455K331L766j581
3072A047l397l49L479L030k285n273Q89N421N4m157p63K933J356j000l340J25
3088b230L933M80l492j119L756J002k991j533J560K298j05l553m83M448J650n028
3104a407k529L335M001q14l342k048K594L084k726l179K933M126k104m166n82
$$ plain form
3119 -2824 61 2770 1834 -2076 -1051 2323 1199 -2641 -2216 1688 3050 544 -1921 -1471 2074 2099
3135 2099 -2027 -2101 1604 2646 -559 -1851 -79 2132 1278 -2331 -2928 1524 4218 -115 -3348 -752
3151 -752 972 827 -1113 -1063 1725 2831 -1101 -4350 -221 3436 1518 -1457 -1334 1080 1733 -1287
3167 -1287 -3520 -705 4223 2666 -2796 -3340 576 2148 -20 -1453 -917 1641 1468 -2103 -1749 1337
3183 1337 1416 -1399 -1722 748 2130 561 -2138 -2397 1388 2385 -1528 -2528 1411 2638 -534 -3704
3199 -3704 -2486 1865 3826 15 -3353 -654 2425 -122 -3123 -1561 2089 2912 -406 -3570 -2098
3214 -2098 2126 1657 -1429 -831 1359 486 -1229 -1613 8 1767 1044 -2052 -1268 2075 1529 -2154 -2230
3231 -2230 1038 2572 736 -2120 -1688 1927 2862 -1916 -3171 823 3576 931 -1716 -1625 615 1679
$$ packed form
3119b824K885K709r36l910J025L374j124l840M25L904J362k506k465M50L545K5
3135B099m126p4L705J042l205j292J772K211q54l609n97M452K694m333l233K596
3151g52J724j45j940N0K788J106l932l249M129L657j918k975J23K414O53l020
3167a287k233K815M928j557n462n44L916J572k168j433N36K558j73l571L54L086
3183A337P9k815l23K470J382j569k699k59L785R97l913j000L939J227l172l170
3199c704J218M351J961l811l368K699L079k547l001J562L650Q23l318l164J472
3214b098M224m69l086N98K190q73j715l84J621J759p23l096P84L343n46l683p6
3231b230L268J534j836k856M32L615R35m778j255L994K753k645k647R1K240J064
$$ plain form
3247 1679 -905 -1956 1514 3279 -269 -3208 -1517 1965 1780 -333 -1594 22 2167 22 -3071
3262 -3071 -719 3247 1987 -1047 -1592 -179 1839 571 -2370 -819 2701 2051 -1672 -1874 532 1932
3278 1932 256 -1534 -971 1844 2141 -1689 -2903 811 2030 -472 -1265 132 2163 1016 -2586 -3029
3294 -3029 997 3743 318 -2775 -1225 1683 1129 -1589 -2643 162 3004 1118 -2531 -1894 1361
3309 1361 678 -814 -283 581 1264 -389 -2014 -887 2085 1027 -2265 -1285 1890 1958 -989 -2299 -908
3326 -908 2306 1509 -2093 -2503 1539 2582 -1033 -2711 -459 2062 1844 -1461 -2566 506 2789 -2
3342 -2 -2611 -486 1903 1003 -1104 -1524 112 2382 350 -1600 260 2369 219 -2123 -1144 1467
3358 1467 1854 -239 -2199 -518 2925 989 -2635 -1259 1859 2098 -389 -1991 -451 1989 1506 -1627
$$ packed form
3247A679k584j051L470J765l548k939J691L482j85k113j261J616K145k145l093
3262c071K352L966j260l034n45J413K018j268k941J551L520o50l723k02K406J400
3278A932j676j790N63K815K97l830j214L714J219k502p93J397K031j147l602m43
3294c029M026K746l425l093J550K908n54k718j054K805K842j886l649O37L255
3309A361o83j492N31Q64O83j653j625J127K972j058l292R80L175O8k947j310J391
3326i08L214p97l602m10M042J043l615j678K252K521k18l305j105L072K283k791
3342bk609K125K389r00k107m20J636K270k032j950J860K109k150k342R79K611
3358A467L87k093j960J681L443j936l624J376L118K39k487j602J540K440m83l133
$$ plain form
3374 -1627 -1709 1866 2120 -889 -1872 510 1760 882 -1562 -1380 1294 2606 -812 -2696 634 2242
3390 2242 360 -1753 -1412 1241 2073 -367 -2384 212 2602 865 -1878 -932 1010 1342 -153 -1584
3406 -1584 -235 2115 412 -2147 -1273 1933 1424 -1188 -1611 167 1762 406 -2107 -1521 2020 1615
3422 1615 -2035 -2317 474 2135 715 -1657 -1215 1238 1879 -1377 -2301 261 2258 232 -1815 -1443
3438 -1443 839 1481 -692 -1874 192 2358 235 -2566 -1067 1016 649 -1163 -1542 422 2221 -51
3454 -51 -2645 -915 2263 995 -1753 -1604 540 1696 327 -2170 -1354 2230 2062 -1460 -2355 313
3470 313 1205 -77 -1489 -780 1353 1507 -1083 -2075 730 1900 -235 -1434 -33 1812 1031 -1322
3486 -1322 -2324 577 2382 51 -1844 6 1831 773 -1172 -1472 761 2283 457 -2078 -575
$$ packed form
3374a627q2L575K54l009r83K382J250q78k444J82K674J312l418j884L330J608
3390B242j882k113L41K653Q32k440k017K596K390j737k743R46J942L32j495j431
3406a584J349K350j703k559Q74L206n09k612m23J778J595j356k513N86L541m05
3422A615l650k82K791J661j420k372M42K453O41l256r24K562J997k026k047L72
3438a443K282O42k173j182K066K166k123k801J499K083l67j812l79J964J799k272
3454e1k594J730L178j268k748J49K144J156j369k497Q16L584j68l522q95K668
3470C13Q92j282j412P09K133J54k590r92K805J170k135j199J401J845p81k353
3486a322j002K901J805k331j895J850J825j058j945l00K233J522j826k535J503
$$ plain form
3501 -575 2200 443 -1492 -1070 1472 2291 304 -1996 -1339 1558 1757 -757 -1282 1245 1380 -601 -1619
3518 -1619 -325 1868 1416 -1428 -1523 1489 2027 -1217 -2261 73 1978 1243 -920 -1546 636 1720
3534 1720 -533 -2218 -107 2121 515 -1355 -994 552 1228 -555 -1544 -59 2655 311 -2507 -1922
3550 -1922 883 1920 66 -832 -573 1094 588 -2006 -904 1599 1183 -678 -1454 -358 1273 545
3566 545 -1712 -1412 1629 2029 -1191 -2425 -110 1548 846 -1438 -1170 808 2059 -299 -2206 373
3582 373 1113 58 -1207 62 1178 1168 -1442 -2415 -113 2846 952 -2043 -1038 560 685 -631
3598 -631 -1484 155 2251 854 -2094 -1543 1335 1205 -885 -401 858 1578 151 -2017 -1430 1557 1816
3615 1816 -840 -1662 545 1669 184 -1245 -977 997 1457 -1017 -1247 762 1717 -684 -2154 -510
$$ packed form
3501e75K775j757j935M22K542Q19j987k300O57K897J99k514n25K527J35j981j018
3518a619J294K193m52k844r5L012N38l244j044K334J905p35k163o26K182J084
3534A720k253j685K111K228j606j870L61J546O76j783r89J485K714k344k818N85
3550a922K805J037j854q98K59J667n06k594J102K503m16j861p76J096J631p28
3566E45k257L00L041M00l220j234K315J658p02k284K68J978J251k358j907K579
3582C73P40j055j265J269J116j0k610r73K302K959j894k995J005J598J25j316
3598f31q53J639K096j397k948N51K878j30k090M84J259P20j427k168N87K987K59
3615A816k656q22K207J124j485j429K68J974M60k474k30K009R55k401j470J644
$$ plain form
3631 -510 1763 1761 -644 -1948 35 2051 312 -2184 -660 1643 1277 -670 -1469 -658 1092 755 -970
3648 -970 -87 1560 -252 -2083 -814 1540 1667 71 -1772 -1049 1528 1259 -1639 -1743 700 1495 162
3665 162 -1463 -785 1087 1471 -1195 -2116 890 1946 -134 -1957 -617 993 982 -674 -1290 311 1662
3682 1662 -352 -2240 -507 1048 728 -536 -653 42 308 -731 -1614 488 2403 365 -2270 -1463
3698 -1463 1103 1266 -361 -2052 -914 1579 1361 -1437 -1654 758 1267 -122 -1011 69 962 609 -802
3715 -802 -1360 973 1591 -901 -1509 145 1953 483 -1252 -1536 654 1992 108 -1784 -110 1372
3731 1372 285 -716 -479 979 947 -84 -1508 27 1718 733 -1674 -572 1541 1161 -452 -1298
3747 -1298 -191 1516 789 -1881 -813 1647 1267 -835 -1233 610 1632 304 -1551 -947 1943 1831
$$ packed form
3631e10K273kk405j304J983K016j739k496J524K303l66j947p99Q11J750l37j725
3648i70Q83J647j812j831J269K354J27j596j843P23K577k69k898j04K443P95j333
3665A62j625O78J872L84k666r21L006J056k080j823J340J610j1j656o16J601J351
3682A662k014j888J733J555l20j264j17O95K66j039q83K102J915k038k635Q07
3698a463K566J63j627j691J138K493k18k798k17K412N09j389q89J080Q93l53j411
3715h02n58K333O18k492o08J654J808j470j735k84K190J338j884j892J674J482
3731A372j087j001K37J458l2j031j424J535J691r85k407J102K113l80j613q46
3747a298J107J707p27k670J068K460l80k102l98J843J022j328j855O04K890j12
$$ plain form
3763 1831 -802 -1715 264 1658 638 -717 -1451 222 1552 18 -1304 195 987 -240 -837 -40
3779 -40 750 370 -593 -787 773 1817 -613 -2304 -424 1890 510 -952 -1765 175 1796 442 -1686
3796 -1686 -1001 1381 974 -987 -1602 -52 1266 442 -1234 -1125 1012 962 -1152 -1326 107 1055 84
3813 84 -878 -319 94 831 -709 -1256 545 1120 -843 -1569 -164 1323 486 -712 -1444 384 1644 13
3831 13 -1968 -270 1627 705 -1039 -1132 487 1183 623 -1466 -817 1440 569 -1418 -466 905 1032 -297
3849 -297 -1370 -867 1399 1368 -1634 -1594 623 1258 98 -731 -376 557 801 -922 -1108 1128 1378 -148
3867 -148 -1207 255 798 104 -332 -497 816 1113 -554 -1544 307 1687 678 -1220 -626 376 1287
3884 1287 -423 -1697 -221 2057 634 -1545 -1133 911 1430 22 -1633 -1092 1518 1264 -437 -1443
$$ packed form
3763A831k633r13J979J394j020j355p34J673J330j534j322J499P92j227n97P97
3779d0P90l80r63j94J560J044k430j691J880K314j380j462q13J940J621j354k128
3796a686O85K382m07j961o15J550J318q24j676J09K137n0k114j74J433R48r71
3813H4r62N59M13P37j540n47J801N75j963p26J405J487q37j198p32J828J260j631
3831A3j981J698J897r22j744r3J619O96n60k089O49K257q71j987R52J371J27j329
3849b97j073N03K266l1l002M0K217O35j160q29L55R33K44j723j86K236K50j526
3867a48j059J462N43o94m36j65J313K97j667r90J851J380j009j898N94J002R11
3884A287j710j274J476K278j423k179M12K044N19j408j655N41K610k54j701j006
$$ plain form
3900 -1443 204 720 -322 -374 -137 675 391 -634 -788 483 641 -789 -753 580 1072 -592 -1594 -615
3918 -615 1329 1693 -629 -1695 211 1706 357 -1387 -869 673 1355 -251 -1879 -445 1693 802
3934 802 -1228 -766 577 889 -214 -790 -274 900 436 -1227 -432 1057 650 -713 -1002 575 631 262
3952 262 -762 -376 795 720 -1168 -997 906 1065 189 -1227 -705 905 996 -474 -1001 584 1216 -216
3970 -216 -1272 -323 1274 713 -531 -1237 -25 1428 320 -1528 -563 896 495 -1026 -1156 39 1096
3987 1096 633 -956 -565 884 649 -713 -417 120 594 151 -835 -267 1140 847 -1088 -1209 618 835
4005 835 -108 -438 273 925 605 -679 -1254 741 1918 -439 -1653 -475 1380 603 -558 -1307 483
4022 483 1777 280 -1552 -437 1156 625 -513 -632 158 686 297 -847 -108 1025 374 -910 -636
$$ packed form
3900a443J647N16j042n2K37Q12k84j025j54J271J58j430L6J333M92j664j002R79
3918f15J944L64k322j066J906J495j349j744N18J542O82j606j628J434K138q91
3934H02k030M62J343L12j103n76N16J174m64j663P95J489m07j363k89J577N6l69
3952B62j024L86J171p5j888J71J903J59q76j416N22J610R1j470n27J585O32j432
3970b16j056R49J597n61j244p06J212J453j108j848R65J459m01j521j30J195J057
3987A096m63j589L91J449k35j362K96N37M74m43r86N68J407k93j935j21J827K17
4005H35r43l30P11O52l20j284n75J995J177k357j214J178J855p77j161p49J790
4022D83J294j497j832J115J593n31j138j19P90N28l89j144P39J133o51j284K74
$$ plain form
4039 -636 739 760 -313 -955 -275 984 436 -920 -810 965 870 -910 -1414 -100 1064 484 -1066 -1105
4057 -1105 629 1368 -721 -1560 -211 1232 342 -813 -1191 194 1217 -174 -1547 -133 1162 -46
4073 -46 -712 -593 394 809 -75 -1268 -291 1082 777 -1036 -822 893 784 -313 -707 -91 1045 422
4091 422 -686 -481 897 710 -613 -663 395 893 464 -1053 -890 723 1092 -778 -1370 532 1276 290
4109 290 -837 -694 602 1060 -306 -1187 4 1098 107 -673 -380 265 499 -125 -1064 -237 988 160
4127 160 -935 -241 661 450 -645 -505 392 848 481 -1214 -574 886 1089 -1058 -884 630 835 197
4145 197 -973 -588 930 1095 -769 -908 744 1179 213 -1107 -259 637 837 -358 -1034 -106 1204 56
4163 56 -1099 -265 505 487 -358 -658 264 673 -283 -1137 -487 1124 290 -977 -519 142 755 62 -1004
$$ packed form
4039f36J375K1j073o42O80J259n48j356J10J775r5j780n04J314J164n80j550l9
4057a105J734P39k089q39J349J443q90j155l78J385J023j391j373J414J295j208
4073d6o66J19R87M15q84j193R77J373l05j813K14J715j09j097l94O16J136o23
4091D22j108K05J378j87j323n0J058M98m29j517J63J613L69j870n92J902P44r86
4109B90j127J43J296M58j366q81J191J094r91p80K93O45K34o24r39Q27J225q28
4127A60j095O94R02k11j095J40Q97M56l67j695O40J460K03k147J74J514K05o38
4145A97j170L85J518J65j864j39J652M35r66j320Q48Q96K00j195o76R28J310j148
4163E6j155Q34P70j8q45l00R22M09r56q54O50J611q34j267M58O61O13o93j066
$$ plain form
4182 -1004 -874 938 364 -826 -1150 544 687 -357 -742 -679 754 817 -883 -1289 504 966 -250 -603
4200 -603 -490 770 429 -310 -1084 128 1178 12 -1303 94 693 454 -218 -521 388 532 -356 -1233
4218 -1233 376 1140 -178 -923 -136 386 480 -293 -830 -97 1054 377 -1032 -431 599 853 -268 -848
4236 -848 -148 958 651 -918 -1050 393 1146 -693 -759 -27 353 532 -349 -530 289 821 -413 -832 148
4255 148 969 272 -613 -269 410 1001 34 -1293 15 1053 470 -1065 -203 517 669 -420 -1213 -405
4273 -405 1086 491 -1131 -445 1144 671 -665 -775 -168 962 740 -813 -730 383 571 -818 -785 386
4291 386 453 184 -516 -911 511 993 -469 -907 -107 547 15 -578 -637 121 415 -235 -705 452 887 -82
4311 -82 -767 -406 477 367 -384 -438 -101 545 -21 -1200 -650 1008 456 -701 -956 -50 680 319 -559 -646
$$ packed form
4182a004J30J812n74j190l24J694J43j044l85O3J433O3j700m06J793M62j216l53
4200f03J13J260l41p39p74J212J050j166j315J397N99k39o72l03R09J44q88q77
4218a233J609P64j318p45P87N22R4p73n37P33J151o77j409O01J030K54j121n80
4236h48P00J106l07j569j32J443P53j839o6P32L80J79q81j81Q19N32j234m19R80
4255A48Q21o97q85L44O79N91r67j327J308J038n83j535Q62P20J52j089p93Q08
4273d05J491n95j622O86J589m73j336j10O07J130k22j553Q3J113J88j389L3J171
4291C86O7k69p00l95J422M82j462m38Q00O54n32n93n9P58K94o50m70J157M35r69
4311h2o85L61Q83j10p51n4L37O46n66j179N50J658n52j157k55R06P30l61q78q7
$$ plain form
4331 -646 639 798 -399 -900 246 742 279 -494 -418 372 319 -796 -684 275 896 35 -326 100 742
4350 742 352 -747 -901 582 999 -203 -881 -171 864 185 -371 -465 177 1187 364 -751 -415 901
4368 901 420 -336 -134 81 484 243 -586 -369 971 657 -749 -355 307 503 33 -760 -56 688 743 -602
4388 -602 -706 334 754 -272 -969 -268 637 307 -96 -600 139 520 -124 -511 154 601 -78 -649 -407
4407 -407 94 449 118 -891 -82 1168 287 -878 -478 590 913 -93 -781 -435 806 214 -709 -231
4425 -231 684 565 -525 -608 129 772 311 -539 -686 420 679 -392 -645 60 304 108 -491 -613 514
4444 514 774 -498 -916 150 652 352 -791 -600 659 327 -481 -1002 -162 627 342 -952 -498 486
4462 486 362 -63 87 -45 823 175 -658 -384 658 349 -306 -522 -22 776 -121 -680 -202 914 650
$$ packed form
4331f46J285J59j197n01J146M96m63p73P6P90n3j115J12R59O21q61l61M26O42
4350G42l90j099j54J483M17j202o78P10J035o79n56r4O42J010q23j115L36J316
4368I01m81p56K02K15M03k41q29K17J340l14j406L94O62J96m70p93P04P44N5j345
4388f02j04J040M20j026o97P01R05l30m03n04P39L81o44l87O65M47o79n71K42
4407d07N01L55l31j009Q09J250q81j165M00J068L23j006o88L46J241n92r23M78
4425b31R15j19j090q3P37O43m61q50j47J106K59j071k53P05K44j96n99j22J127
4444E14K60j272m18J066N02l00j143J91J259l32q08n21Q40P89k85j294M54R84
4462D86j24m25J50j32Q68o48q33K74J042l09o55k16N00P98q97n59M78J116k64
$$ plain form
4481 650 -923 -732 36 657 -160 -581 -348 651 860 -386 -740 133 1021 81 -450 -380 84 364 45 -584
4501 -584 -150 637 102 -615 -1 1055 228 -490 -783 -310 687 132 -832 -206 646 217 -603 -285 -101 385
4521 385 -48 -426 -126 974 343 -484 -527 300 552 -198 -317 -644 390 431 -260 -636 412 902 -164
4540 -164 -543 -8 377 621 -342 -417 38 625 -221 -605 -68 543 72 -426 -624 551 609 156 -817 -43
4560 -43 593 171 -712 -549 279 337 -43 -763 -542 382 511 -521 -258 143 39 -386 -487 10 483 307
4580 307 -574 -575 405 639 -277 -578 103 731 186 -293 -158 390 455 -237 -559 46 529 -46 -288 -531 301
4601 301 818 12 -537 -77 793 139 -471 -79 251 382 -93 -442 -118 569 379 -559 -335 737 226 -653
4621 -653 -610 -38 718 8 -542 -273 715 534 -312 -369 -112 204 56 -283 -353 227 511 -201 -924 -143 726
$$ packed form
4481F50j573J91P68O21q17m21K33R99K09j246l54Q73Q88r40n31P0M64K80l19o29
4501e84M34P87n35p17O14J056q27p18k93M73R97n55r64O26Q52m29q20L18J84M86
4521C85m33l78L00J100o31q27m3Q27K52p50j19l27J034M1o91l76J048M90j066
4540a64l79N35L85K44r63p5M55N87q46l84N37O11m71m98j98J175N8m53r73P74
4560d3O36m22q83J63Q28N8l80p20K21R24J29j032K63M01j04m25j01M97M73j76
4580C07q81jR80K34r16l01O81O28n45m79J35N48O5o92l22O05M83n75k42k43Q32
4601C01N17q06n49M60Q70o54o10L92L30J31m75l49L24O87j90r38K24J072n11q79
4621f53M3N72P56p10n50K69R88j81q46n7K57L16j48l39p0N80K84p12p23P81Q69
$$ plain form
4642 726 130 -463 -292 395 217 85 -587 162 934 153 -773 -26 440 430 -331 -285 -148 631 365 -670
4662 -670 -447 130 517 -204 -335 -182 570 -121 -698 -536 358 451 -25 -214 206 322 -457 -642 -218 491
4682 491 281 -476 -457 344 426 -98 -490 54 857 171 -532 -442 -75 590 -42 -434 -453 315 143 39 -238
4703 -238 6 378 140 -405 -238 297 143 -393 -31 334 692 -18 -442 69 268 70 -465 -275 508 519
4723 519 -212 -211 -371 261 114 -189 -430 298 591 -514 -432 -182 192 355 113 -482 16 101 2 -641 -22
4744 -22 475 -113 -276 -201 323 299 -83 -437 -110 704 49 -869 -156 557 291 149 -346 -118 665 162 -458
4765 -458 -459 461 114 -140 -93 180 11 184 -686 -70 279 489 -400 -344 89 -62 -10 -440 -415 415 474 -358
4787 -358 -664 -9 882 303 -692 -245 107 166 -87 -719 -241 454 79 -641 87 551 174 -488 -316 -55
$$ packed form
4642G26n96n93J71O87j78j32o72P49P72p81r26P47M66j0p61M6J37P79k66j035
4662f70K23N77L87p21j31J53P52o91n77J62Q94R3m76j89M20J16p79j85M24P09
4682D91k10p57J9Q01Q2n24l92N44Q03o86p03R0L67O65o32l92j9P68j72j04k77
4703b38K44L72k38n45J67N35j54n36L62L65L58p10m24N11J99j98n35J90P83J1
4723E19p31Jj60O32j47l03k41P28K93j105Q2K50L74J63k42n95M98Q5r9o43O19
4744b2M97n88j63P5N24k4l82l54L27Q14o55r18P13P13k66j42m95K28P83n03o20
4765d58jR20l47k54M7K73j69J73q70O16L49K10q89N6M33j51N2m30K5Q30N9q32
4787c58l06O55Q91n79r95M47L52N9k53o32M78O95l75p20P28M64l77o62J72K61
$$ plain form
4807 -55 471 -15 -343 -317 193 -80 -672 -414 1 324 200 -612 -385 318 547 -398 -463 260 336 48 -423
4828 -423 -251 255 419 4 -236 78 693 -196 -379 -127 210 146 -305 -663 111 449 -168 -653 -45 866
4848 866 223 -256 -395 651 506 370 -360 -240 700 494 -56 -209 68 328 408 -70 23 207 318 -450
4868 -450 -307 481 194 5 -374 20 471 398 -117 -143 401 356 -280 -212 -71 488 229 -477 -414 307 543 -128
4890 -128 -391 -22 378 235 -49 -387 33 404 158 -240 -184 360 -165 -430 -272 391 333 13 -308 -217 407
4911 407 -33 -195 -383 200 238 -188 -330 94 232 -8 -254 -715 56 376 -47 -48 -19 387 -100 -161 -200 262
4933 262 412 44 -591 -370 433 -161 -407 -93 -24 406 -111 -541 356 722 266 -421 -242 153 431 -151
4953 -151 -355 -109 338 262 -152 -435 107 402 -295 63 177 350 -164 -346 14 669 273 -406 -319 216 162
$$ packed form
4807e5N26m86l28K6N10k73n92K58M15L23j24q12K27P03K29r45o5P23P6k88m71
4828d23J72N06J64m15k40L14O15q89j83K52L37o4m51l58P74L38o17m85O08R11
4848H66o43m79j39J046j45j36p30J20R40k06n50j53K77K60Q0m78R3J84J11p68
4868d50J43P88k87j89l79L94M51p3n15k6N44m5o36O8J41N59k59p06O3P21K36o71
4890a28k63L69M00j43k84l38M20L71k46l98N6N44n25k65J58O63n8l20l21R1O24
4911D07m40j62j88N83L8m26j42M24J38k40k46m61P71L20m23jK9M06m87o1l9M62
4933B62J50l68o35K21Q03n94k46L14O9M30n17m30Q97L66m56o87J79L95K78n82
4953a51k04K46M47p6m14k83N42K95o97L58J14J73n14j82L60O55l96o79Q7N35n4
$$ plain form
4974 162 148 -310 -45 483 271 -380 -379 -41 578 -133 -279 -341 144 488 148 -688 64 170 222 -147 -102 58
4996 58 317 10 -174 19 365 47 -51 160 436 117 -237 311 128 437 118 -262 -623 193 388 -519 -446
5017 -446 324 242 -271 -288 -200 261 497 -263 -123 -11 259 -190 -509 -57 99 156 -225 -352 -108 382 -193
5038 -193 -564 -133 316 136 -120 -344 177 471 57 -229 -292 612 380 -327 -628 -50 312 -124 -278 131
5058 131 282 488 -583 -420 241 -161 -131 -20 223 280 250 -613 -355 403 376 -90 -503 276 177 27 121 -342
5080 -342 608 343 318 -679 -147 74 264 148 -47 68 -10 49 -269 -239 276 110 -648 -72 291 231 -112 -180
5102 -180 -62 330 425 -240 -102 179 322 -494 -478 288 136 236 -228 -427 71 270 -16 75 22 306 -17
5123 -17 -187 -353 11 267 -112 -621 80 136 -115 -298 168 554 23 1 -428 309 205 -178 -668 -244 159
$$ packed form
4974A62j4m58K65N28k12o51JL38O19p11j46o2M85L44l40q36P52J06N2l69M5J60
4996E8K59l07j84J93L46l18r8K11K76l19l54N48j83L09l19l80l61Q16J95r07P3
5017d46P70q2n13j7Q8M61K36p60J40J12K70m49l19M52J56N7l81j27K44M90n75
5038a93l71M31M49j80k56k24N21K94m14k86o3R04k32p07l01N78L62m36j54M09
5058A31J51K06j071J63O61m02L0J11K43N7l0q63K58P58k7m66m13P79r9j50R4m63
5080c42R50k65k5r97N32K21J90j16j95J15p8N9l18L0N15j66p58N76L63o0l43o8
5102a80J18L92R5o65J38K81J43q16J6P66j52J00m64j99M98J99k86R1n3K84l23
5123a7j70j66L64K56l79n09P01N6k51j83M66L86n31k2m29P37j04l83m90M24M03
$$ plain form
5144 159 398 -125 -272 -66 480 -59 -445 -140 436 530 -133 -194 114 14 209 -480 -295 221 316 -237 -537
5165 -537 276 282 -104 -235 -137 -147 341 -166 -417 -81 264 -226 -374 47 633 412 -85 -93 -73 132 -111 -564
5187 -564 34 655 -258 69 -56 181 48 -271 -600 -22 347 84 -442 62 386 209 -175 -614 217 346
5207 346 108 -46 -174 -196 219 47 -458 -110 274 550 -249 -367 292 257 82 -154 222 346 -131 102 32
5228 32 44 447 -177 -278 -35 371 133 -608 21 39 210 95 -339 152 402 -93 -186 -122 98 111 -102 -133
5250 -133 -305 575 96 -561 67 204 341 -433 -96 140 21 380 -23 -258 -64 287 -157 47 -260 283
5270 283 40 -515 182 349 399 -285 -609 -260 305 -106 -424 -529 241 -56 23 -611 55 392 -6 -385 140
5291 140 416 -157 76 -483 228 484 168 -449 -196 130 96 -289 -111 244 40 12 24 14 466 534 -531
$$ packed form
5144A59K39n23j47K06N46n39l86L05N76R4o63o1L08j00J95o89J85N16R5n53l00
5165e37Q13Ol86j31R8j0M88n07k51L36L45m90j48M21N86k21m97qK0K05k43m53
5187e64N98O21r13L27j25K37j33l19l29N78L69k63n26N04L24j77l84m39Q31J29
5207C46k38j54j28k2M15j72n05L48L84K76p99j18O59l5j75k36L76J24m77K33p0
5228C2J2M03o24j01K43M06k38p41O29J8J71j15m34M91K50m95r3O4K20J3k13l1
5250a33j72Q80m79o57O28J37J37p74L37K36j19L59m03k35J94L51m44K04l07N43
5270B83k43n55O97J67N0o84l24L49N65m11l18j05P70k97P9o34O66L37l98l79N25
5291A40K76n73K33n59P11K56l16o17K53L26l4l85J78L55k04k8J2j0M52O8j065
$$ plain form
5312 -531 -418 488 193 -156 -186 -209 385 128 -123 -204 180 463 140 -515 -47 385 109 -143 -248 229 506
5333 506 173 -626 -188 392 311 -327 -264 -59 221 11 -299 111 584 344 -216 -83 176 279 143 -337 -225
5354 -225 -17 248 -200 -380 468 -48 -173 -307 -143 66 -94 -24 -338 -32 28 -29 -182 114 267 -15 -186
5375 -186 -168 -206 143 0 -265 -34 325 -1 -39 12 -8 82 14 -160 81 296 419 -190 -208 39 217 -160 -386
5398 -386 30 267 -147 -3 -78 293 136 -314 -422 -30 -61 -232 -156 -547 208 31 -305 11 -3 290 209 2
5420 2 -306 312 311 63 -379 -124 196 64 -269 -263 176 255 -250 -435 -99 88 -113 -278 176 42 -173 -251 26
5443 26 143 77 374 -203 47 342 23 -329 -312 153 152 -46 -171 147 -7 129 -85 -81 95 418 29 -451
5465 -451 -29 288 564 -136 -649 380 270 -72 -258 390 236 194 151 -190 -132 255 237 -294 -184 -181 106 2
$$ packed form
5312e31J13R06k95l49l0k3N94k57k51q1L84K83l23o55M68M32k76k52j05M77K77
5333E06l33p99M38N80q1o38O3K05K80k10l10M10M73k40n60J33K59J03j36m80J12
5354b25K08K65m48j80Q48n16j25j34J64K09j60P0l14L06O0n7j53K96J53k82j71
5375a86J8l8L49j43k65K31L59l26l8N1k0R0o8j74K41K15J23o09j8K47J78l77k26
5398c86M16K37m14J44p5L71j57m50j08L92l1j71P6l91P55j77l36L16j4K93q1k07
5420Bl08O18jk48m42K55L20j32l33OM39P9n05j85L36J87k01j65M54j34k15p8K77
5443B6J17o6K97n77K50K95l19l52J7M65jj98j25L18j54J36k14MJ76L23l89m80
5465d51M22L17K76p00n13J029j10l42j86O48j54m2m3l41N8L87j8n31J10LK87j04
$$ plain form
5487 2 -147 238 -79 -203 -699 -123 567 130 -494 11 203 208 166 85 -186 211 200 -83 -74 350 159 -99 -342
5510 -342 -27 279 270 -12 -292 -25 346 -170 -72 233 508 362 -368 -443 46 -59 95 -357 -192 332 -115
5531 -115 -390 -84 -58 34 -163 -466 -271 230 74 -551 -253 340 -122 -271 30 -258 176 234 -188 -300 21
5552 21 307 -60 -61 196 211 166 -246 -342 240 -21 -211 -110 -178 110 -54 -134 19 -18 134 18 -134 112 482
5575 482 169 -195 62 135 327 -210 -96 90 130 15 -343 -165 259 538 119 -4 22 130 297 -336 -291
5596 -291 287 329 -106 -285 411 432 96 -273 52 426 135 -217 -247 -60 99 44 -204 -107 148 -1 51 -212
5618 -212 15 375 135 -200 -113 -128 227 -270 -410 45 120 -77 -250 -110 300 60 -191 -42 0 199 152 -596
5640 -596 25 299 -192 -51 16 204 252 -116 -334 -103 388 133 -294 -255 397 303 -408 -125 -291 -13 298
$$ packed form
5487Bj49L85l17j24m96N76O90m37o24N05J92Nm2q1k71L97j1k83RM24j91k58k43
5510c42L15L06rk82k80K67L71n16R8L05K75j46p30p5M89j05J54m52J65N24m47
5531a15k75L06K6R2j97l03J95N01j56o25K98N93m62j49L01k88M34N8m22j12L21
5552B1K86l67jK57J5m5m12r6N82k61j90J01o8K88j64q0J53l7J52j16j52K46L70
5575D82l13l64K57P3J92n37J14J86M0j15l58J78M24K79m19j23K6J08J67o33M5
5596b91N78M2m35j79O96K1l36l69L25L74k91l52l0J87J59n5k48R7K55j49N2k63
5618b12K27L60k40l35Q7j5L55m97j40M55P5j97j73J40M10k40k51J49M2J99m7p48
5640e96O21K74m91J41O7J88M8l68k18K31M91k55m27L9O52r4p11K83j66K78L11
$$ plain form
5661 298 -113 -358 251 248 12 -277 530 227 116 -296 -15 163 247 -416 0 -62 234 33 -129 -32 267 358
5683 358 95 -11 -294 240 81 -440 -164 -34 387 -83 -237 -222 205 346 12 -450 456 227 -273 -89
5703 -89 160 60 195 -300 -226 164 95 -657 -344 28 472 -24 -89 8 -120 325 -77 -147 20 279 388 38
5725 38 90 48 246 210 -80 21 166 -62 -286 127 457 237 -494 -196 20 287 -118 -116 -95 -121 32 -288 -321
5748 -321 145 430 74 -375 -292 317 400 -10 -262 138 112 112 -148 -19 381 211 -101 -172 41 35 -120 -255 -158
5771 -158 78 66 -255 -476 -229 196 -111 -181 -249 471 84 -1 -128 160 238 252 -240 -148 407 -115 -193 -335 261
5794 261 131 0 104 55 152 48 -253 -146 205 16 -196 -69 60 436 144 60 -384 465 250 24 -472
5815 -472 -240 448 130 -269 -278 22 151 -156 -131 -80 13 -43 89 -96 186 240 -512 -164 107 383 -86 -239
$$ packed form
5661B98m11k45O09lk36k89Q07l03j11m12K81J78Q4o63M16o2K96k01j62R7K99R1
5683C58k63j06k83N34j59n21K76J30M21m70j54J5M27J41l34m62R06k29n00J84
5703h9K49j00J35m95P4L90o9p52L13L72M44m96o5R7j28M45m02p0J67K59J09l50
5725C8N2m2J98l6k90J01J45k28k24M13L30k20p31K98K16K67m05KK1k6J53l20l3
5748c21M66K85l56m49Q3O09Q3m10k52M00k6%k60J29M00j70l12p1K13oj55j35R7
5771a58K36j2l21k21K47M25l07p0o8P20l87q5j27K88P8J4m92R2N55n22p8j42N96
5794B61j30j31J04m9R7j04l01J07L51j89k12J27J29L76k92q4m44Q49k15k26m96
5815d72K32O88l18l99rL00J29l07K5N1R3n6J32j85K82N4p52L48K71K76m69j53
$$ plain form
5837 -239 -278 105 465 -1 -148 -181 428 411 -184 -326 -203 511 101 26 -237 445 284 73 -341 54 13 -327
5859 -327 -216 -174 -127 96 -66 314 277 172 65 -161 113 238 50 -364 141 -87 202 93 -243 -122 509
5880 509 437 -238 -152 -135 554 78 -283 -315 74 267 -279 -65 123 10 -27 -308 177 17 -26 -275 82 347
5902 347 5 -436 -501 137 447 -170 -289 -23 80 91 -5 -412 154 428 60 -207 -222 -22 132 -337 -322 -169
5924 -169 45 320 -245 -8 333 285 -42 233 258 135 372 -243 -263 312 237 -236 4 67 367 81 8 -445
5946 -445 139 283 -223 -436 -15 191 233 -230 -278 288 -47 221 -227 151 173 -111 108 176 104 -144 -103 -343
5968 -343 56 284 191 -341 -11 381 105 -136 96 -1 133 117 -331 64 293 -34 -48 -173 51 83 -299 -384
5990 -384 -84 -236 -7 -143 -324 373 211 35 -464 -33 -151 -70 -165 -203 71 388 75 -371 -32 426 -98
$$ packed form
5837b39l9L83L60m66j47l3O09j7n95j42J23P14m10p5k63O82j61k11m14L95m1l40
5859c27J11M2M7K23j62L80l7j05j07k26K74J25j88m14N05k28K89j09l36J21O31
5880E09p2o75Q6J7O89m76l61l2L89J93n46K14J88j13l7k81M85j60m3k49L57K65
5902C47l42m41o5O38L10o17j19K66J03J1r6m07N66K74l68k67j5K00J54m69J5J53
5924a69K14K75n65K37L41m8l27K75K5j23K37o15k0N75p5m73K40O3L00k86p3m53
5946d45N84J44n06k13M21K06M2m63m8N66l35K68m48L78K2k84K19O8p2k48M1k40
5968c43L99K28r3n32L30L92k76k41K32r7J34j6m48L95K29l27j4j25K24L2l82q5
5990c84L00j52K29j36j81O97j62j76m99M31j18Q1r5l8K74L17l13m46L39M58n24
$$ plain form
6011 -98 -250 -157 103 159 -133 -344 -26 334 -259 -167 17 18 54 267 -364 -480 398 -3 -472 -88 290 9
6033 9 -113 69 316 108 26 -80 -141 -85 -164 -143 -472 -129 202 277 -65 -271 225 569 -10 -212 -286 617 27
6056 27 -526 10 166 7 -162 -54 202 136 -9 -368 -110 47 284 52 -325 102 293 134 -405 -128 143
6077 143 340 87 -20 327 25 -68 -89 -286 -31 279 -248 38 370 194 121 -226 -221 283 142 -204 -594 171
6099 171 -23 -126 -167 -175 151 103 157 -459 10 253 173 -268 -157 484 -20 166 -177 -278 -14 -3 -404 30
6121 30 369 386 -416 -62 329 54 -43 -107 -161 95 88 -249 -318 268 454 77 166 -279 87 330 -143 -347 193
6144 193 279 176 -286 -13 343 134 -82 -539 -143 105 155 -415 41 0 -141 -222 -345 177 111 -56 -229 -280
6166 -280 369 -110 -175 -343 164 401 65 -206 116 63 -134 -119 -87 -31 272 9 -205 -200 327 3 -4 -129 156
$$ packed form
6011i8j52R3K60N6k92k11L18L60n93R2J84JL6K13o31j16Q78m01m69L84L78k81
6033Ij22J82K47k08q2j06o1N6p9K1l29L43L31P5l42k06M96L44n79k02p4R03n90
6056B7n53N36J56j59j69J08K56o6j45l59K58J57K37k32l77M27J91j59n39K77K71
6077A43J97k53j07L47l02r3k1j97K55L10n27K86L32j76p3l47NN04j41l46l90P65
6099A71j94j03m1qL26m8N4o16M69K43q0m41J11O41n04J86l43j01K64J1m01M34
6121C0L39J7q02L54L91k75r7o4n4K56pl37o9N86J86l77Q9m45L66K43m73k04N40
6144A93Q6j03m62K73L56k09k16m57L96K48N0n70M56m1j41q1j23N22o6j67j73n1
6166b80O49m79o5j68N07K37l36k71L22n3j97J5L2N6L03k63k14NN27l24pj25K85
$$ plain form
6189 156 648 68 228 197 159 284 -142 -360 179 264 -56 -78 146 166 -19 -134 -163 -49 220 17 -209 134
6211 134 167 173 27 39 122 -51 -14 116 245 440 196 -298 -16 279 271 -91 170 346 237 249 -34 75 219
6234 219 219 -201 -200 -326 282 140 -73 -370 -12 42 -70 177 243 -141 -98 -62 41 124 32 137 -200 50 176
6257 176 -8 -230 -375 -39 89 251 -75 266 391 129 -392 -354 68 130 -268 -260 45 53 -65 -353 -134 346
6279 346 303 5 -131 -177 529 -94 -394 -282 -84 413 -196 -8 -156 387 -412 -197 -396 72 253 -20 -102
6300 -102 -141 279 216 -329 -85 83 356 -95 -128 42 212 215 -465 -209 79 172 45 -41 -45 205 -110 65 -151
6323 -151 322 266 58 -154 12 373 -174 -194 5 41 369 -186 124 289 259 149 -455 -142 168 207 -280 -80
6345 -80 187 56 -277 -57 26 -9 -219 -129 -72 121 249 602 -139 -154 308 34 -270 -122 114 59 -274 -30
$$ packed form
6189A56M92n80J60l1l8J25m26k18N39Q5l20k2K24K0j85j15k9J14K69k03k26L43
6211A34L3Oj46J2Q3j73L7J30J29J95k44m94K82K95ql62K61J76j09J2k83J09J44
6234B19%m20Jj26O08j42k13k97L58N4j12K47O6l84M3L6J03Q3r2J05l37K50J26
6257A76j84k22j45L36J28J62l26L41J25k62n21L8M22O2l98QL05Qj18k88K19M80
6279C46m3k98j36m6P06o23l00J12J98M97o09J88j48N43p99K15j99M68J81k73q2
6300a02l9M20o3n45K44J68K73m51l3J70J70Lo80K56K88R3j27q6mK50l15J75k16
6323a51M73n6k08k12J66L61n47k0J99L6L28n55L10J65l0j10o04L13L10L9m87K00
6345h0K67j31l33K20Q3l5k10R0N7J93J28L53p41j5M62k74l04J48K36n5l33K44
$$ plain form
6367 -30 126 158 213 -2 -124 -37 311 -93 -195 -104 193 315 -108 -711 131 177 15 -233 194 184 -153 -313
6389 -313 -244 139 340 -312 -305 -64 246 20 -232 -267 -230 150 -125 -223 -52 251 123 -109 40 8 32 -138 -89
6412 -89 -120 -100 -97 -96 -62 238 380 54 -87 -74 270 -24 -136 -86 249 208 -129 -422 -232 172 -101 -145 -48 120
6436 120 87 -14 -242 120 331 -191 -229 -147 -16 87 -169 -281 -29 -23 52 -24 -17 239 -76 -6 -427 -177 191
6459 191 166 137 32 206 72 -120 -39 8 149 28 29 138 239 133 -15 -162 133 559 98 186 -73 5 -9
6482 -9 -5 -136 167 -70 -87 383 114 289 138 -377 -32 -23 194 -105 -458 -4 172 144 -202 -292 -232 -170 -81 -238
6506 -238 -307 382 175 -395 -346 -112 98 169 -282 -12 279 17 -147 -22 -9 242 -232 -89 -135 9 91 -42
6528 -42 -231 292 48 -87 -255 -128 129 67 -93 70 251 39 60 -10 -105 176 -85 88 0 37 -44 69 -159
$$ packed form
6367c0J56L2N5k15j22Q7L48m04j02R1K97J22m23o03Q42M6j62k48M27j0l37j60
6389c13O9L83K01o52PK41L10k26k52l5L7L80k75r8J71L03j28k32J49l2K4j70M9
6412h9l1K0LJL4L00J42l26j41J3L44k94j12N0L35m1l37k93J90M04k73m4R7J68
6436A20l3j01k28L62K11n22l8Q2J31J03k56j12K52OP5p6PK56l15P0m21K50L68
6459A91k5k9j05J74j34j92Q1M7J41j21JJ09J01j06j48j47K95M26m61Q8k59P8j4
6482iMj31L03k37j7M70k69J75j51n15L45RK17k99l53M54J76k8l46r0O0O2Q9j57
6506b38o9O89k07n70M9K34K10P1m51K70K91k62j64J25J3K51m74J43m6J44Q2j33
6528d2j89N23k44j35j68J27K57o2j60J63J81k12K1p0r5K81k61J73q8L7q1J13k28
$$ plain form
6551 -159 -62 235 132 -265 -128 460 100 -2 -310 237 -3 183 -417 -39 308 229 184 -320 -72 -21 -28 -172
6573 -172 -362 131 352 -533 -70 174 100 -278 -38 83 151 481 -28 -263 15 108 158 68 -484 -152 97 282
6595 282 -282 108 -85 289 -173 -183 86 124 -170 -52 -442 245 208 -166 -42 233 -185 -143 34 -120 -14
6616 -14 62 -484 -61 254 162 -306 287 31 198 78 -450 114 -194 450 196 -423 28 29 -243 -112 -123 200
6638 200 -109 -181 -233 -192 -140 16 -388 3 273 -158 -42 -31 -67 95 -125 29 190 -57 71 -254 -15 -64
6660 -64 166 150 93 -130 95 -33 11 -295 -268 83 -68 13 -264 -3 4 -303 -169 -212 92 20 -144 225 73
6683 73 110 -126 66 -155 176 78 -336 -53 -13 235 -248 -111 203 178 -107 -104 60 231 242 -284 -237 -15 48
6706 48 -61 -131 78 86 -124 73 -143 134 25 -9 -224 -205 176 -58 -155 -185 181 331 -238 -79 84 137 128 -28
$$ packed form
6551a59R7K97j03l97J37N88l60j02l08N47k40J86o00L78L47p9m5n04K48N1pj44
6573a72j90M93K21q85M63K44p4l78K40J21O8L30n09k35K78R3N0r0n52L32K49J85
6595B82n64L90j93L74m62j0K69L8k94J18l90O87l7l74J24K75m18M2J77j54J06
6616a4P6n46M23L15r2m68N93k56J67j20n28N64l08O44k54o19M51Jk72J31j1L23
6638B00l09p2n2M1N2J56m04L91K70m31J16J1l6J62k20J54J61k47J28l25K39m9
6660f4K30j6n7k23K25j28M4l06K7L51j51Q1k77K61Pl07J34m3L04p2j64L69j52
6683G3L7k36J92k21L31r8m14K83M0K48m83J37L14k5k85LJ64J71J1n26M7K22O3
6706D8j09p0K09Qk10J97k16K77j09l4k15J9L81k34r7l0L66J50n69J59J63N3rj56
$$ plain form
6730 -28 -55 -272 119 24 -466 112 203 323 -300 7 244 208 -185 140 57 394 129 -221 -205 226 154 94 -202
6753 -202 -160 -214 260 -152 -218 -36 -53 260 -106 87 127 -139 -277 -239 -262 33 -179 -44 -122 159 324 66 86
6776 86 -41 260 395 -75 -21 398 -74 292 -1 -189 145 255 -316 -301 195 -84 -181 145 4 272 -117
6797 -117 8 -114 33 49 -152 -18 192 323 -241 25 -204 336 49 -485 -418 207 -20 -56 -544 35 -110
6818 -110 323 -179 87 400 -22 28 45 23 401 -280 -415 247 -31 349 -126 24 78 291 249 -320 -346 143
6840 143 25 -297 -399 79 -50 -119 80 -257 164 172 -143 -16 -37 -16 347 50 -301 -121 44 20 -182 -162
6862 -162 166 -150 278 -141 -56 -183 190 3 129 194 -176 -246 -106 18 67 176 -375 34 -112 130 -260
6883 -260 -72 248 96 -5 21 -16 22 -410 71 34 340 131 -205 -9 -7 218 110 -401 -159 68 315 -169
$$ packed form
6730b8k7k17L91r5m90N78R1J20o23L07K37l6l93L25q3L37k65l50J6M31p2o0k96
6753b02M2n4M74m12o6J82j7L13l66J93M0k66j38L8k3K95k12J35p8K81J65k58K0
6776H6j27L01J35m70N4M19m72L66k93j88L34J10n71J5M96k79r7L26j41K68l89
6797a17J25j22J47J6k01J34K10J31n64K66k29N40k87n34O7O25k27l6m88N79j45
6818a10M33n02K66L13m22N0J7k2L78o81j35O62k78L80m75J50N4K13m2n69k6M89
6840A43j18l22j02M78j29o9J99l37M21Ql15J27k1K1L63k97l51J80J65k4k02K0
6862a62L28l16M28m19Q5j27L73j87J26O5l70p0J40J24M9J09n51M09j46K42l90
6883b60J88L20j52j01K6l7L8m32M81l7L06k09l36J96KK25j08n11K42K27K47m84
$$ plain form
6905 -169 -65 0 267 86 7 384 6 -138 263 -440 -17 106 98 -83 -359 98 -111 -184 -241 -15 10 -140
6927 -140 -86 -189 258 -155 -431 -46 -32 416 -113 -134 39 59 204 -284 -98 71 -239 -123 -288 -112 -9
6948 -9 224 137 -261 163 -17 -16 66 175 207 31 -129 -106 310 47 -75 -145 -24 191 80 -81 -107 98 88 -66
6972 -66 -116 -42 278 205 -74 94 118 102 -171 -284 89 -354 98 84 -257 176 358 -11 -55 91 24 78 258
6995 258 -201 3 159 -449 -328 133 61 -23 -28 204 30 222 -326 -252 41 -357 -81 15 -55 73 67 211 362
7018 362 -175 228 -2 63 -263 128 -71 -251 137 -114 -64 -55 -160 181 -72 301 -283 -118 -346 -146 90
7039 90 -29 -220 96 199 -246 -253 12 345 -17 -200 101 -328 -272 -29 -50 346 339 -167 -313 352 -19 149
7061 149 -6 -129 120 -183 -39 -155 153 192 65 -66 57 10 164 -102 -301 -4 170 27 149 -19 158
$$ packed form
6905a69J04O5K67j81p9L77l78j44M01p03M23J23qj81k76M57k09p3n7K26K5j50
6927a40N4j03M47m13k76L85J4M48n29k1J73K0J45m88J86J69l10J16j65J76J03
6948iK33q7l98M24j80JQ2J09L2j76j60K3M16k63j22p0J21K15j11j61k6K05j0j54
6972f6n0P4L20p3k79J68K4j6k73j13L73m43M52j4l41M33J82l69m4J46o7N4J80
6995B58m59K04J56o08J21M61p2q4nK32j74J92n48P4K93l98K76R6p0J28oJ44J51
7018C62n37M03k30O5l26L91j99j80L88k51N0Rj05L41k53L73n84J65k28K00K36
7039I0j19j91L16J03m45pK65L33l62j83L01m29N6K43k1L96pn06j46O65l71J68
7061A49j55j23K49l03J44j16L08L9j27j31J23m7J54k66j99K97J74j43J22j68J77
$$ plain form
7082 158 88 71 16 113 84 429 -142 123 255 209 -83 -213 -193 152 8 -235 -112 -196 401 223 112 115 244
7105 244 71 -148 110 141 160 20 17 -6 366 -205 -198 152 115 -56 92 26 270 57 117 -361 6 212 -14
7128 -14 216 55 18 114 98 101 -300 185 -114 19 90 184 27 124 -53 51 24 292 26 -256 -109 202 93
7151 93 -126 141 111 176 -90 -85 25 -191 -167 -196 -101 87 152 -537 156 82 165 -62 -148 -113 -113 346 28 -55 -296
7176 -296 76 -242 -108 81 168 -17 -63 22 481 234 96 57 92 215 35 -67 -193 -130 196 66 33 7 -78
7199 -78 -32 17 -6 -22 349 -124 1 8 345 104 -135 -207 -19 -132 160 -182 -118 55 -186 -420 -173 -67 43
7222 43 7 -112 12 394 171 -251 -197 379 105 178 316 -367 -192 -25 73 -219 244 292 -167 -137 -204 88 19
7245 19 140 -49 58 274 -182 -270 -59 339 251 -92 -218 -153 268 43 13 135 -13 -234 -242 -16 -19 -162 309
$$ packed form
7082A58p0j7n5R7k9L45n71K65J32m6k92j30K0L45j44k43J23q4N97j78j11LJ29
7105B44j73k19K58L1J9j40lk3L72n71PL50l7j71J48o6K44k13O0m78L67K06k26
7128a4K30j61l7R6j6Lm01M85k99J33P1R4j57R7j77J04k7K68k66k82J47L11j09
7151I3k19K67l0O5k66NJ10k16K4k9R5J88O5o89O93p4Q3k27q6L5%M59l18q3k41
7176b96L72l18J34J89Q7j85m6Q5M59k47j38l9L5J23j80j02j26O3L26j30l3k6q5
7199g8M6M9k3j6L71m73J25PL37k41k39p2J88j13K92l42O4J73k41k34K47J06J10
7222D3l6j19J24L82k23m22N4N76k74P3J38o83J75J67R8k92M63M8m59L0o7K92o9
7245A9J21j89J07K16m56q8K11L98q8l43j26O5M21k25l0J22j48k21qK26lj43M71
$$ plain form
7268 309 -264 -415 42 -93 -150 -372 491 125 317 130 -197 272 99 127 39 50 372 136 -68 77 181
7289 181 -17 -157 -131 -145 -123 -363 -81 129 27 94 186 -140 -89 8 110 -301 133 100 -325 87 374 -153 424
7312 424 -59 -35 -134 82 131 -177 -220 280 -102 -29 58 97 205 -83 37 168 154 366 -250 -89 114 -220 12
7335 12 215 118 47 128 47 -60 73 79 109 -34 384 325 231 174 -239 226 403 131 -79 -27 21 144 191 -264 -123
7360 -123 171 53 -84 200 210 225 -31 62 133 -14 -67 14 -79 -68 133 170 -1 -6 135 -165 304 -247 -44 174
7384 174 -23 -210 -123 115 -77 86 231 265 -114 -154 -97 156 185 168 41 140 157 -262 131 -126 101 94 24 -128
7408 -128 -76 -87 -52 -239 47 317 36 196 -129 -90 178 97 -371 -92 -124 -35 -60 1 -126 -59 106 50 -15 75
7432 75 -193 84 37 103 -31 -215 -37 -130 -145 143 280 86 102 272 -108 120 -27 -57 -1 138 -94 112 6
$$ packed form
7268C09n73j51M57j35n7k22Q63l66J92j87l27M69j73K8q8J1L22k36k04J45J04
7289A81j98j40K6j4K2k40K82K10j02O7R2l26N1R7J02m11M34l3m25M12K87n27N77
7312D24m83K4r9K16M9l08m3N00l82P3Q7L9J08k88J20J31j4K12o16J61K03l34K32
7335A2K03r7p1Q1q1j07J33OL0j43M18n9r4n7m13M65J77k72k10N2M8J23M7m55J41
7360a23K94j18j37K84J0J5k56R3P1j47n3Q1r3J1K01L7j71nJ41l00M69n51K03K18
7384A74j97j87Q7K38j92J63J45L4l79m0N7K53K9j7j27R9J7m19L93k57K27pp0j52
7408a28N2j1L5j87K86K70k81J60l25L9K68q1m68K79l2Q9k5O1j27O7J65n6o5R0
7432G5k68K77m7O6j34j84J78r3j5K88J37j94J6J70l80K28j47l0N6J39k32K06j06
$$ plain form
7455 6 97 -154 -56 106 25 193 194 -41 -228 -23 -253 194 -137 68 220 -2 -72 51 -22 -217 -185 73 166 -21
7479 -21 42 -106 -169 102 -78 39 162 -27 122 -103 -25 3 157 -213 -75 341 -144 257 -122 105 48 184
7501 184 112 -227 -49 255 238 -111 -91 -26 -422 45 175 25 177 123 -265 61 -363 -256 192 272 -4 -188
7523 -188 -85 88 -246 78 118 -88 140 -233 212 144 -331 165 256 -311 -170 -520 292 49 -201 -254 -59
7544 -59 164 -76 -117 -65 193 -494 -16 -127 -317 259 -112 -55 107 254 62 260 21 161 250 -293 210 14
7566 14 220 -78 125 93 85 -116 20 82 -8 206 -167 38 -228 -41 -5 -6 82 -23 -117 -125 -325 -30 108 30 171
7591 171 -170 -125 323 -25 -184 -160 135 -139 24 -6 137 349 -71 -163 62 -217 -38 70 214 -7 -75 -13
7613 -13 -95 -139 -226 64 85 134 -68 -34 -198 83 277 -294 8 114 107 -181 48 99 270 -27 -105 -51 32 -199
$$ packed form
7455FR1k51R8J62q1J68Jk35j87K05k30M47l31K05J52k22p0J23p3j95L2K58R3j87
7479b1O3j48o3K71j80J17J23j89J49k25P8K8J54l70J38M16m85M01l79K27n7J36
7501A84p2l39J78L04j7l49K0O5l96M67J30j50J52n4l88L26m24J07M48Q0k76j84
7523a88J03J73l34L24M0k06K28l73M45o8m75M96R1n67J41l50Q12k43k50n3J95
7544e9K23k40m1N2K58o87M78j11j90N76l71N7J62J47j92J98k39J40Q9n43N03j96
7566A4K06k98K03l2qk01J36O2r0K14l73K05k66J87L6jQ8j05r4qk00K95J38p8J41
7591A71l41M5M48l48j59K4K95k74J63l0J43K12m20r2K25k79J79J08J44k21o8O2
7613a3q2m4q7K90K1M9k02L4j64K81J94n71L02J06pk88K29N1J71k97p8N4Q3k31
$$ plain form
7637 -199 -224 -34 124 -136 -15 119 101 -61 -145 -77 -325 -71 80 -75 -164 123 -421 98 190 -216 125 -77
7659 -77 -74 -23 48 -105 -72 321 -26 -206 -88 -360 -212 158 -313 -101 -362 134 -42 -40 205 -65 -18 -70 -239
7682 -239 105 -52 103 24 243 -125 29 -161 -196 -22 -68 202 -37 202 57 86 256 -210 153 184 58 178
7704 178 -39 -173 156 -99 63 139 196 213 -275 -163 160 -148 276 142 356 221 99 -175 45 70 -361
7725 -361 115 -232 334 133 -13 -30 -22 -28 -151 -31 104 254 273 -195 71 222 237 -69 -357 4 -3 213 45
7748 45 -20 -86 125 -135 -95 -278 169 -94 -187 -270 -189 -198 179 -417 -220 457 -20 -180 34 -160 -19 117 -117
7771 -117 -324 182 295 157 65 24 -38 39 -186 323 -65 -29 88 -174 227 200 -241 -35 -74 -56 -305 74 -174
7794 -174 -236 56 130 -196 -275 119 85 124 215 121 67 -19 -35 4 251 190 93 54 47 17 153 148 145 -135 30 -19 64 84
$$ packed form
7637a99k5J90J58k60J21J34j8j62q4O8k48K54J51j55q9K87n44N19R2m06L41k02
7659g7LN1P1j53L3L93l47j80J18k72J48L70m71K12k61M96j76KK45k70M7n2j69
7682b39L44j57J55p9K19l68J54j90l5J74m6K70k39K39j45K9J70m66L63L1j26J20
7704A78k17j34L29k55J62P6N7J7m88J12L23l08M24j34K14j35j22k74K20K5m31
7725c61M76l47N66k01j46j7Qoj23J20J35J50J9m68K66J51J5l06k88L61pK16j68
7748D5o5o6K11k60M0j83M47k63r3q3Q1rL77n96J97O77m77j60K14j94J41J36k34
7771a17k07N06J13j38r2m1o2P7k25N09l88L6J17k62M01k7m41K06l9J8k49L79k48
7794a74o2K92P4l26p9L94l4L9R1r4n4q6j6L9K47o1r7l9pl0J36nlk80J65m9Q3K0
$$ plain form
7822 84 -383 -409 -210 11 531 54 -86 93 -103 139 -320 -35 76 53 51 -13 0 68 88 -68 61 39 270
7845 270 -195 -174 126 39 -41 227 123 37 233 -63 -31 -43 331 242 21 78 -45 108 -56 -10 -197 106 -155
7868 -155 -269 34 141 74 0 -5 126 47 -137 216 -299 73 143 101 -58 -30 167 186 -123 63 -249 -134 269
7891 269 150 -47 80 44 -39 -210 -177 -253 215 -106 -183 -220 -156 238 -169 -450 -13 211 1 -206 366 -126
7913 -126 220 -150 -30 165 205 229 17 2 4 -160 -199 -168 -156 28 199 -73 -42 33 252 -37 -206 -41 283
7936 283 -107 -29 84 16 174 -25 -297 66 -215 345 36 -297 87 -178 -296 53 -79 188 -44 -130 2
7957 2 -117 -88 -121 -169 -158 -64 4 -151 -114 -29 -51 347 112 -89 -194 185 -97 264 -187 -120 -47 105 -68 -202
7981 -202 255 305 -88 -154 -93 3 82 -69 -118 125 210 8 -10 196 80 -332 87 -146 -354 -374 144 218 -46
$$ packed form
7822H4m67k6J99K21N20m77j40J79j96K42m59K85J11k3ko4J3O8K0j56J29k2K31
7845B70m65K1L00q7q0K68j04q6J96k96L2j2L74q9k21N7j23J53j64M6j87L03k61
7868a55j14L03J07o7p4nJ31p9j84L53n15L72P0m2j59K8J97J9l09J86l12J15M03
7891B69j19j97J27l6q3j71L3p6M68l21p7l7O4L94m07k81M37K24k10k07N72m92
7913a26L46l70J20J95M0K4k12j5Kj64l9L1J2J84J71k72L1P5K19k89j69J65L24
7936B83l90P8J13o8J58j99k72L63k81N60l09l33L84k65j18L49j32K67k32q6J32
7957Bj19K9l3m8J1R4O8j55L7Q5k2L98k35k01j05L79k82L61m51O7P3J52j73j34
7981b02M57N0l93o6O1R6P9j51m9K43Q5k02j8K06j16m12M19k33k08k0N18P4k64
$$ plain form
8004 -46 294 196 -93 -46 -3 82 310 73 -119 5 178 111 89 9 224 151 -65 -398 11 -10 -42 54 -136 70
8028 70 25 -69 -193 68 97 27 -355 -414 292 -251 -105 108 -172 -223 -44 -220 45 -84 -146 -211 -237 -94 -73 -151
8052 -151 42 -275 -111 42 -170 61 -29 -48 72 210 -45 171 -160 -17 -4 108 17 -230 60 -179 -120 -3
8074 -3 103 -107 -348 -193 -167 -59 -91 322 126 -41 -184 135 -140 206 -181 -89 -359 11 132 -128 14 129
8096 129 186 -51 -102 -172 73 -49 -224 -326 -97 -334 -21 33 -214 259 199 -286 29 103 -175 -307 -194 88
8118 88 58 -114 -385 -45 -53 156 -281 225 -46 -208 -43 47 -113 -130 233 94 12 -19 -275 116 -83 -8 -83
8141 -83 -203 -167 -37 -221 -28 64 -135 -283 156 242 161 268 -102 47 253 88 24 6 312 28 -37 -100 342
8164 342 35 -203 -156 -183 -5 -450 -64 -206 196 -123 5 -290 -24 -335 318 -176 -105 86 -91 -108 52
$$ packed form
8004d6L40r8k89M7M3Q5K28k37j92J24J73o7k2q0K15p3k16l33M09k1l2R6j90K06
8028G0m5r4j24K61K9p0l82n9P06n43J46K13k80n1J79j76K65j29o2o5k6J43K1p8
8052a51J93l17J64J53k12K31r0j9J20J38k55K16l31J43J3J12r1k47K90k39N9J17
8074cJ06k10k41J55K6J08l2M13j96j67j43L19k75L46l87R2k70L70J21k60J42J15
8096A29N7k37n1p0K45j22j75j02K29k37L13N4k47M73o0m85L15P4k78j32J13K82
8118H8l0j72k71L40qK09m37N06k71j62J65R0j60j7L63j39q2l1k56L91j99P5p5
8141h3j20L6J30j84J93R2j99j48M39Q6q1J07l70J49K06j65o4j8L06k84o5o3M42
8164C42l07k38M7k7J78m45L86j42M02l19J28k95K66l11O53m94P1J91j77j7J60
$$ plain form
8185 52 -153 3 97 67 -127 -30
$$ packed form
8185E2k05J56R4l0j94R7
8191c0
$$ Imaginary data points
##PAGE= N=2
##DATA TABLE= (X++(I..I)), XYDATA
$$ plain form
0 0 0 0 0 0 -8 0 -8 8 -8 10 -16 24 -24 32 -40 48 -56 65 -76 90 -105 123 -144 164 -188 218 -249 282 -320
29 -320 362 -409 458 -513 574 -640 714 -795 882 -979 1085 -1203 1332 -1473 1632 -1809 2005
46 2005 -2230 2483 -2772 3110 -3509 3987 -4571 5308 -6268 7577 -9479 12514 -18121 32003
60 32003 -141435 -101539 246454 162563 -46580 -148494 -29944 63162 21315 -93456 -32189
71 -32189 92941 71071 -55822 -61909 -4145 13845 -12340 -16749 17931 64129 4564 -92614
83 -92614 -45587 81987 52721 -68755 -71938 36108 94471 30903 -83313 -77769 46000 68191
95 68191 -49998 -60974 74532 115819 -18444 -147868 -104075 80774 173005 34201 -119690
106 -119690 -62329 55830 30392 -45759 -25889 54754 79968 -2845 -90245 -37362 65630
$$ packed form
0@%%%%qQqJ6j6J8k6M0m8N6p2Q8j04J21j41J66j95K28k67L08l52M06m67N31o02
29c20O82p71Q67r71J087j214J354j509J677j861K064k288K535k805L105l441L814
46B005m235M713n255N882o619P496q558R879j1576J3845j7056K1993l0635N0124
60C2003j73438L9896L47993q3891k09143j01914J18550R3106m1847j14771O1267
71c2189J25130k1870j26893o087N7764J7990k6185m409L4680M6198n9565r7178
83i2614M7027J27574k9266j21476l183J08046N8363o3568j14216N544J23769K2191
95F8191j18189j0976J35506M1287j34263j29424M3793J84849R2231j38804j53891
106a19690N7361J18159k5438p6151J9870Q0643K5214q2813q7400N2883J02992
$$ plain form
117 65630 27718 -55762 1626 92039 41993 -76492 -97362 10110 115425 63105 -78013
128 -78013 -77529 50901 76231 -16054 -54007 -9874 29184 20994 -12220 357 52711 15697
140 15697 -92947 -69573 77777 113142 -4601 -89214 -41647 58317 61383 -53608 -93779
151 -93779 42038 135797 24250 -113499 -88341 30295 87648 28796 -52400 -24794 50863
162 50863 11744 -75649 -38327 61707 65808 -10657 -59857 -31228 32958 32586 -29945 -26252 35408
175 35408 17198 -43709 -16347 46383 25911 -48894 -68496 11791 100529 46310 -96874 -95218
187 -95218 53069 100816 -13296 -97501 -35525 82011 89014 -45248 -125879 -20285 97889
198 97889 54434 -39184 -41413 2075 12602 -10934 -21789 17599 50252 -4707 -62971 -12010
$$ packed form
117F5630l7912q3480N7388R0413n0046j18485k0870J07472J05315n2320j41118
128g8013M84J28430K5330r2285l7953M4133L9058q190l3214J2577N2354l7014
140A5697j08644K3374J47350L5365j17743q4613M7567R9964L066j14991m0171
151i3779J35817R3759j11547j37749K5158J18636N7353n8852q1196K7606P5657
162E0863l9119q7393L7322J00034M101p6465m9200K8629O4186l72o2531L693O1660
175C5408j8210o0907K7362O2730k0472p4805j9602Q0287Q8738n4219j43184J656
187i5218J48287M7747j14112q4205O1976J17536P003j34262q0631J05594J18174
198I7889m3455r3618k229M3488J0527k3536j0855L9388L2653n4959n8264N0961
$$ plain form
210 -12010 52684 17289 -40859 -25745 27927 46626 -3513 -61211 -21508 61900 35215 -51227
222 -51227 -37952 41419 49063 -17309 -60072 -14603 67710 49534 -56468 -66666 41248 75466
234 75466 -10973 -66288 -19126 52347 50061 -26349 -58412 16083 60724 -7653 -55008 3564
246 3564 54942 18830 -41131 -41337 26766 66142 -3470 -72495 -13779 68264 33533 -43614 -42889
259 -42889 14333 45612 13774 -36275 -19174 32019 11633 -36894 -5495 46985 18728 -41269
271 -41269 -43298 14752 61114 18853 -64930 -45575 55778 60779 -37952 -73123 1133 69925
283 69925 41173 -50253 -73052 17369 71897 -645 -61931 -10823 46280 20253 -34929 -42422
295 -42422 9392 48505 4649 -48579 -11918 38742 5150 -39182 -14452 25865 20656 -17583
$$ packed form
210a2010O4694l5395n8148J5114N3672J8699n0139n7698L9703Q3408k6685q6442
222e1227J3275P9371P644o6372m2763M5469Q2313j8176j06002j0198J07914L4218
234G5466q6439n5315M7162P1473k286p6410l2063P4495M4641o8377m7355N8572
246C564N1378l6112n9961k06O8103L9376o9612o9025N8716Q2043l4731p7147P25
259d2889N7222L1279l1838n0049J7101N1193k0386m8527L1399N2480k8257n9997
271d1269k029N8050M6362m2261q3783J9355J01353N001r8731l5171P4256O8792
283F9925k8752r1426k2799R0421N4528p2542o1286N1108N7103k6027n5182p493
295d2422N1814L9113m3856n3228L6661N0660l3592m4332K4730M0317n209l8239
$$ plain form
307 -17583 -34266 7549 45066 -7743 -68406 -14290 67901 38896 -46442 -59681 5805 58408
319 58408 18523 -62084 -43329 54315 62176 -30348 -69157 -13118 42210 33417 -17209 -33393
331 -33393 14146 33240 -24742 -49067 12832 51745 11067 -32080 -23174 15855 26395 -17273
343 -17273 -40802 17515 60949 3038 -55507 -21772 34191 30509 -14724 -33986 10135 53528
355 53528 8411 -58804 -25390 48011 35896 -25222 -31940 17294 47261 5786 -57302 -33309
367 -33309 51673 53701 -22741 -39090 15372 33492 -7486 -41660 -12718 53376 53378 -28104 -60158
380 -60158 4847 44981 4843 -27932 -3858 33456 29813 -22722 -50814 1474 49937 12650
392 12650 -30172 -2732 29061 7651 -28997 -28976 15636 46535 5875 -43672 -8364 43562 10012
$$ packed form
307a7583j6683M1815L7517n2809o0663N4116Q2191k9005q5338j3239O5486N2603
319E8408l9885q0607J8755R7644P861r2524l8809N6039N5328q793n0626j6184
331c3393M7539J9094n7982k4325O1899L8913m0678m3147Q906L9029J0540m3668
343a7273k3529N8317M3434n7911n8545L3735N5963l682m5233j9262M4121M3393
355E3528m5117o7215L3414P3401j2115o1118o718M9234K9967m1475o3088K3993
367c3309Q4982K028p6442j6349N4462J8120m0978l4174K8942O6094Kq1482l2054
380f0158O5005M0134m0138l2775K4074L7314l643n2535k8092N2288M8463l7287
392A2650m2822K7440L1793k1410l6648K1M4612L0899m0660m9547L5308N1926l3550
$$ plain form
405 10012 -47984 -31035 31930 54448 6375 -53368 -33206 37210 33091 -34999 -35166 30574 49336
418 49336 -4128 -52989 -34608 29169 43905 -14248 -36917 15823 35093 -17763 -45870 -8063
430 -8063 33551 26427 -16178 -30472 11249 29353 -23274 -48143 9672 52219 15996 -34354
442 -34354 -33757 8802 31790 -8201 -43973 2811 57607 18212 -50046 -41723 14329 37968 7087
455 7087 -30399 -10471 37935 17507 -46824 -38178 28196 43003 -340 -29529 -12117 22557
467 22557 16473 -30607 -31268 30484 45855 -11190 -39097 -3913 26171 10588 -25149 -22804 29722
480 29722 47989 -13896 -53547 -4317 39846 11870 -25028 -11897 27554 33603 -17469 -53636
492 -53636 -4935 52135 23573 -30248 -16924 22294 18448 -18971 -35508 4509 52515 24811
$$ packed form
405A0012n7996J6949O2965K2518m8073n9743K0162P0416m119o8090j67O5740J8762
418D9336n3464m8861J8381O3777J4736n8153k2669N2740J9270n2856k8107L7807
430h063M1614p124m2605j4294M1721J8104n2627k4869N7815M2547l6223n0350
442c4354N97M2559K2988l9991l5772M6784N4796l9395o8258Q323N6052K3639l0881
455G087l7486J9928M8406k0428o4331Q646O6374J4807m3343k9189J7412L4674
467B2557o084m7080o61O1752J5371n7045k7907L5184L0084j5583l5737K345N2526
480B9722J8267o1885l9651M9230M4163k7976l6898J3131L9451O049n1072l6167
492e3636M8701N7070k8562n3821J3324L9218l846l7419j6537M0017M8006k7704
$$ plain form
504 24811 -41692 -34822 24608 29242 -14212 -26103 6700 35289 14725 -35351 -32771 25827 36024
517 36024 -16524 -31808 11163 33242 4977 -31382 -27064 19381 37123 -10307 -36748 9315
529 9315 38225 -3593 -42002 -20321 27020 38505 -5164 -40707 -6844 33919 756 -40508
541 -40508 -8497 39249 26617 -22425 -42931 -7730 36505 17039 -32215 -18462 30585 19395
553 19395 -29715 -32335 8232 33250 11308 -31554 -25079 25811 27586 -26131 -34177 14804 32927
566 32927 -1159 -30628 -15877 25241 26558 -24567 -41355 13734 43822 1323 -34709 -14789
578 -14789 19439 19708 -13659 -29054 10335 42068 1021 -45576 -16985 31309 25337 -11895 -24076
591 -24076 3523 29366 2588 -37807 -12198 41438 26442 -26644 -28749 11240 28989 4270
$$ packed form
504B4811o6503O870N9430M634m3454j1891L2803K8589k0564n0076K580N8598J0197
517C6024n2548j5284M2971K2079k8265l6359M318M6445J7742m7430k6441M6063
529I315K8910m1818l8409K1681M7341J1485m3669l5543L3863M0763l3163m1264
541d0508L2011M7746j2632m9042k0506L5201M4235j9466m9254J3753M9047j1190
553A9395m9110k620M0567K5018k1942m2862O475N0890J775n3717q046M8981J8123
566C2927l4086k9469J4751M1118J317n1125j6788N5089L0088m2499l6032J9920
578a4789L4228K69l3367j5395L9389L1733m1047m6597K8591M8294n972l7232j2181
591b4076K7599K5843k6778m0395K5609N3636j4996n3086k105L9989J7749k4719
$$ plain form
603 4270 -26853 -11355 33129 24553 -29412 -30354 22729 35925 -4444 -31038 -10005 29290 28182
616 28182 -19408 -34708 15078 39049 -4127 -32629 -2572 30361 18808 -18558 -29747 10305
628 10305 38800 1918 -34291 -4448 30956 11299 -21230 -17625 13519 30186 1110 -34736
640 -34736 -10541 35120 18074 -27638 -20797 18961 26462 -5344 -31320 -9905 33698 23071
652 23071 -30207 -29758 21894 30874 -11055 -31378 -4066 28998 20376 -25712 -34476 15579 36401
665 36401 -7727 -34155 -2050 26317 9619 -23515 -24921 14183 34863 -5717 -39511 -6379
677 -6379 30010 8435 -23605 -14254 14591 20792 -10247 -33725 -2803 36407 11084 -34000 -19844
690 -19844 20546 21272 -10022 -26317 -3794 28159 12355 -32917 -23485 27976 29905 -16928 -34881
$$ packed form
603D270l1123J5498M4484q576n3965r42N3083J3196m0369k6594K1033L9295j108
616B8182m7590j5300M9786K3971m3176k8502L0057L2933j1553l7366j1189M0052
628A0305K8495l6882l6209K9843L5404j9657l2529L605L1144J6667k9076l5846
640c4736K4195M5661j7046m5712O841L9758P501l1806k5976K1415M3603j0627
652B3071n3278M49N1652Q980m1929k0323K7312L3064q622m6088q764N0055K0822
665C6401m4128k6428L2105K8367j6698l3134j406L9104K0680m0580l3794L3132
677f379L6389k1575l2040R351K8845O201l1039k3478L0922L9210k5323m5084J4156
690a9844M0390P26l1294j6295K2523L1953j5804m5272R432N1461J929m6833j7953
$$ plain form
703 -34881 -4106 28143 19147 -20868 -26897 15437 27484 -15590 -32084 7432 33211 9793
715 9793 -24197 -25476 8733 28824 -1541 -25693 4664 27949 -3532 -31781 -8826 27477
727 27477 27300 -10006 -34454 -3274 34176 9041 -30366 -9931 29713 19382 -19830 -28893 4553
740 4553 36693 14883 -32246 -24323 24558 26747 -12538 -21074 6270 21567 3530 -24319 -15537
753 -15537 27139 31748 -16088 -34815 2719 26388 6762 -14704 -7443 15889 16225 -20121 -32022
766 -32022 13363 41960 5519 -32025 -16992 14313 17487 -4912 -17668 6398 27202 -3719
778 -3719 -38185 -9954 33603 22892 -16714 -27457 -1324 23480 7129 -24870 -9429 29195
790 29195 13823 -32192 -27515 18652 35424 3574 -33768 -25810 18779 27996 -11527 -22986 10869
$$ packed form
703c4881L0775L2249q996m0015o029M2334J2047m3074j6494L9516K5779k3418
715I793l3990j279L4209K0091l0365k4152L0357K3285l1481k8249K2955L6303
727B7477j77l7306k4448L1180L7450k5135l9407K0435L9644j0331l9212r063L3446
740D553L2140k1810m7129P923M8881K189l9285q536K7344J5297j8037k7849Q782
753a5537M2676M609m7836j8727L7534K3669j9626k1466P261K3332L36l6346j1901
766c2022M5385K8597l6441l7544J5033L1305L174k2399j2756K4066K0804l0921
778c719l4466K8231M3557j0711l9606j0743K6133K4804j6351l1999J5441L8624
790B9195j5372m6015M677M6167J6772l1850l7342P958M4589R217l9523j1459L3855
$$ plain form
803 10869 19894 -11267 -27553 -5683 26166 25550 -13966 -34627 -2179 23385 962 -15888 5063
816 5063 18609 -1543 -26470 -20222 18858 38211 -1400 -39711 -13531 26504 14471 -17175
828 -17175 -14304 13345 22304 -6395 -35929 -10023 38349 27988 -23669 -32164 3554 23456 8500
841 8500 -12815 -8541 15990 11562 -22243 -19450 22381 29941 -6906 -26038 -6175 17545 13288
854 13288 -11525 -13653 18420 23781 -17708 -33879 7272 37903 16248 -22243 -27596 6222 30507
867 30507 4580 -24642 -1804 27402 6504 -25200 -15484 17264 27878 2244 -26337 -12101
879 -12101 21409 13102 -16985 -7021 21031 13042 -17481 -24687 2895 32983 18775 -25914 -28040
892 -28040 14632 25391 -7420 -20483 3012 22376 7131 -24075 -24484 16753 34427 -3742
$$ packed form
803A0869R025l1161j6286K1870L1849o16l9516k0661L2448K5564k2423j6850K0951
816E063J3546k0152k4927O248L9080J9353l9611l8311K6180M0035j2033l1646
828a7175K871K7649Q959k8699k9534K5906M8372j0361n1657q495L5718J9902j4956
841H500k1315M274K4531m428l3805K793M1831P560l6847j9132J9863K3720m257
854A3288k4813k128L2073N361m1489j6171M1151L0631k1655l8491n353L3818K4285
867C0507k5927k9222K2838K9206k0898l1704R716L2748J0614k5634k8581J4236
879a2101L3510q307l0087R964K8052p989l0523p206K7582L0088j4208m4689k126
892b8040M2672J0759l2811j3063K3495J9364j5245l1206m09M1237J7674l8169
$$ plain form
904 -3742 -30324 -6293 17025 5460 -10491 -6000 11434 12572 -15416 -27880 7642 33625 3465
917 3465 -29534 -15536 15075 16871 -7904 -21940 2237 28454 2987 -36579 -19313 26889
929 26889 28533 -8454 -29227 -11752 17609 15062 -14744 -16039 14156 14015 -16424 -19852 6790
942 6790 19064 3672 -17544 -14247 12742 16665 -14349 -20757 13205 24029 -8166 -28777 -8033
955 -8033 25093 25096 -14538 -36309 -282 33457 9039 -25101 -12774 15963 15879 -8733 -22275 -644
969 -644 26202 10800 -22661 -13460 15864 11170 -10136 -8768 9401 15561 -3028 -23464 -6172
982 -6172 28336 18341 -22157 -21841 14228 25291 -623 -24527 -11606 23504 25652 -15086 -29631
995 -29631 6783 28332 4662 -18604 -10453 11267 17262 -4564 -17965 3495 20856 -830
$$ packed form
904c742k6582K4031K3318j1565j5951M491J7434J138k7988j2464L5522K5983l0160
917C465l2999J3998L0611J796k4775j4036K4177K6217k5467l9566J7266M6202
929B6889J644l6987k0773J7475K9361k547k9806j295L0195j41l0439l428K6642
942F790J2274j5392k1216L297K6989L923l1014o408L3962J0824l2195k0611K0744
955h033L3126Ll9634k1771L6027L3739k4418l4140J2327K8737q4k4612j3542K1631
969f44K6846j5402l3461R201K9324m694k1306J368J8169O160j8589k0436J7292
982f172L4508r995m0498L16L6069J1063k5914k3904J2921L5110K148m0738j4545
995b9631L6414K1549k3670k3266Q151K1720N995k1826j3401K1460J7361k1686
$$ plain form
1007 -830 -19487 -10 18928 6415 -14391 -12815 10492 22216 -4411 -28858 -2290 32263
1019 32263 12999 -25525 -22478 11890 27801 4398 -26894 -15910 22484 20930 -16537 -21841
1031 -21841 8235 19951 1191 -17082 -10741 12074 14823 -10616 -16007 10428 15650 -11477 -18298
1044 -18298 4845 19469 5167 -20151 -18929 14695 26394 -8375 -30419 -1037 26199 9514
1056 9514 -19102 -20582 6828 24970 3536 -26058 -11134 20202 12126 -14593 -12828 6647 13094
1069 13094 -1000 -15538 -4834 17054 6817 -20182 -10046 19640 15291 -14086 -21453 1892
1081 1892 23936 11074 -22511 -21773 18408 27252 -8532 -26922 -3321 21107 14341 -11724 -19530
1094 -19530 6395 22744 -1744 -21463 -854 18949 6153 -10716 -6276 7459 9760 -7409
$$ packed form
1007h30j8657J9477J8938j2513k0806J576K3307J1724k6627k4447K6568L4553
1019C2263j9264l8524L047L4368J5911k3403l1292J0984L8394j554l7467n304
1031b1841L0076J1716j8760j8273O341K2815K749k5439n391K6435N222k7127o821
1044a8298K3143J4624j4302k5318J222L3624J1699l4769k2044K9382K7236j6685
1056I514k8616j480K7410J8142k1434k9594J4924L1336q076k6719J765J9475O447
1069A3094j4094j4538J0704K1888j0237k6999J0136K9686m349k9377p367K3345
1081A892K2044j2862l3585P38M0181Q844l5784j8390K3601K4428o766k6065p806
1094a9530K5925J6349k4488j9719K0609J9803j2796j6869M440J3735K301j7169
$$ plain form
1106 -7409 -15121 9524 26061 -1755 -27570 -8083 22474 18018 -9641 -21205 1157 27623
1118 27623 10179 -27680 -18970 20840 26246 -4171 -21777 -6849 16719 15444 -11548 -18056 8754
1131 8754 18045 -3951 -12272 3086 9057 -2164 -10616 -2585 15534 13594 -14409 -21550 8605
1144 8605 22338 -3218 -20816 -3486 20097 15780 -15272 -29804 2228 32386 9732 -24484
1156 -24484 -15029 12862 14233 -6822 -18188 -2615 19526 9606 -17992 -12869 11486 7959 -11935
1169 -11935 -9632 8085 13615 -1324 -19620 -10813 16277 12543 -16444 -16267 13294 19213 -5789
1182 -5789 -24667 -12617 17003 21979 -8285 -23454 2216 18204 -2398 -18515 -5477 12987
1194 12987 12899 -5707 -16739 221 14511 -3495 -18699 1663 20320 5962 -15736 -14914 5834
$$ packed form
1106g409p712K4645J6537k7816k5815J9487L0557m456k7659j1564K2362K6466
1118B7623j7444l7859Q710L9810N406l0417j7606J4928K3568j275k6992o508K6810
1131H754R291k1996q321J5358N971j1221q452Q031J8119j940k8003p141L0155
1144H605J3733k5556j7598J7330K3583m317l1052j4532L2032L0158k2654l4216
1156b4484R455K7891J371k1055j1366J5573K2141r920k7598N123K4355l527j9894
1169a1935K303J7717N530j4939j8296Q807K7090l734k8987J77K9561N919k5002
1182e789j8878J2050K9620M976l0264j5169K5670J5988k0602j6117J3038J8464
1194A2987q8j8606j1032J6960J4290j8006j5204K0362J8657j4358k1698Q22K0748
$$ plain form
1207 5834 18035 -240 -21762 -2918 26907 12045 -23060 -22633 6999 23063 8518 -15779
1219 -15779 -12231 13204 13931 -12758 -16569 8507 18402 3808 -8953 -7051 4387 5984 -7615
1232 -7615 -6406 15940 16619 -11492 -19716 3417 18287 5362 -14025 -11077 15748 24336 -8174
1245 -8174 -30269 -3564 26799 14300 -12709 -16067 5486 19707 2728 -22339 -10051 20122
1257 20122 16233 -7862 -10886 3027 6695 -2578 -9979 -62 17867 10250 -15341 -13803 9413
1270 9413 9877 -8677 -8373 9005 17537 1845 -23145 -18226 16699 25367 -5508 -21029 -355
1283 -355 15923 4848 -14762 -15170 8875 22338 -417 -21310 -4784 14500 3856 -12286 -7835
1296 -7835 7846 12053 -2247 -15898 -2158 15264 259 -19741 -5081 19272 14367 -9631
$$ packed form
1207E834J2201j8275k1522J8844K9825j4862l5105M27K9632J6064j4545k4297
1219a5779L548K5435P27k6689l811K5076R895j4594j2761J902J1438J597j3599
1232g615J209K2346O79k8111q224K3133J4870j2925j9387K948K6825Q588l2510
1245h174k2095K6705L0363j2499k7009l358K1553J4221j6979k5067J2288L0173
1257B0122l889k4095l024J3913L668r273p401R917J7929p617k5591J538K3216
1270I413M64j8554L04J7378Q532j5692k4990M919L4925Q668l0875j5521K0674
1283c55J6278j1075j9610m08K4045J3463k2755k0893J6526J9284j0644j6142M451
1296g835J5681M207j4300j3651J3740J7422j5005k0000J4660K4353m905k3998
$$ plain form
1308 -9631 -22088 -7196 16742 12782 -12121 -11223 11757 10277 -12596 -16648 1841 16929 10214
1321 10214 -11018 -14084 6629 11134 -10093 -13485 9768 17547 -1161 -17016 -9878 11235 15755
1334 15755 -7494 -18332 5814 21070 357 -19232 -7521 13020 13695 -5598 -17805 1422
1346 1422 23134 6304 -21627 -13339 12330 15690 480 -10016 -3538 8714 3735 -12240 -5388
1359 -5388 15272 10555 -9697 -9708 4704 8480 -2464 -11317 -277 19947 12047 -19231 -21403 10072
1373 10072 22893 2753 -16219 -9591 11431 15798 -7422 -19276 3721 20402 1938 -15452
1385 -15452 -5114 10322 8934 -6764 -13904 1948 17287 2694 -16637 -5174 13349 5796
1397 5796 -9975 -9274 4750 13436 765 -16421 -6421 15096 7311 -14648 -9786 10829 13174
$$ packed form
1308i631j2457J4892K3938l960k4903Q98K2980j480k2873m052J8489J5088o715
1321A0214k1232l066K0713M505k1227l392K3253P779j8708j5855P138K1113M520
1334A5755k3249j0838K4146J5256k0713j9589J1711K0541O75j9293j2207J9227
1346A422K1712j6830k7931Q288K5669L360j5210j0496O478J2252m979j5975O852
1359e388K0660m717k0252j1J4412L776j0944q853J1040K0224p900l1278k172L1475
1373A0072J2821k0140j8972O628K1022M367k3220j1854K2997J6681j8464j7390
1385a5452J0338J5436j388j5698p140J5852J5339j4593j9331J1463J8523p553
1397E796j5771P01J4024Q686j2671j7186J0000K1517p785k1959M862K0615K345
$$ plain form
1410 13174 -5219 -18723 -6651 17075 14976 -13501 -19036 5857 15217 -1543 -13133 -4910 9164
1423 9164 9517 -8182 -14542 4959 14277 -4589 -15618 946 13865 3577 -12931 -13760 6663
1436 6663 19202 -433 -21321 -6367 15342 7909 -9541 -9564 3837 10967 317 -14484 -4405
1449 -4405 14738 6682 -13906 -8057 10483 10125 -6131 -14016 -1774 17041 10926 -14649 -15167 10161
1463 10161 15796 -4499 -13146 -432 12267 7164 -9697 -11040 9115 15456 -7199 -16660 3791
1476 3791 18094 5757 -12486 -13058 5054 17564 2403 -13901 -1379 14465 3069 -12023
1488 -12023 -6229 8175 12325 1023 -10717 -2008 12063 1188 -14919 -2727 19252 13627 -9699
1501 -9699 -18383 -3271 16547 12608 -10219 -11343 9838 11902 -7316 -12325 2511 12354 5433
$$ packed form
1410A3174j8393j3504J2072K3726k099k8477n535K4893R360j6760j1590Q223J4074
1423I164L53j7699o360J9501R318j8866j1029J6564J2919j0288j6508q29K0423
1436F663J2539j9635k0888J4954K1709p433j7450k3J3401P130j0650j4801J0079
1449d405J9143q056k0588N849J8540l58j6256p885J2242J8815o115k5575n18K5328
1463A0161N635k0295q647J2714J2699n103j6861j343K0155O341k2655r461K0451
1476C791J4303j2337j8243n72J8112J2510j5161j6304J2522J5844j1396j5092
1488a2023N794J4404M150j1302j1740Q709J4071j0875j6107J2192K1979n625k3326
1501i699q684J5112J9818l939k2827j124K1181K064j9218n009J4836R843o921
$$ plain form
1514 5433 -9356 -9186 9066 12948 -7960 -16153 3592 15595 2693 -10672 -7152 6979 11101
1527 11101 -6310 -16824 1816 18998 4931 -12054 -7711 3320 3653 -4696 -6491 7615 17259
1540 17259 -2192 -25097 -11979 15512 16111 -2822 -11710 -3176 8028 2256 -13631 -7957 14475
1553 14475 13257 -8530 -14236 180 8134 1387 -8821 -5332 10444 9616 -10825 -14925 5957
1566 5957 14048 -2392 -14149 -5305 11287 13470 -5099 -18061 -3037 11891 1388 -8656 3101
1579 3101 12450 1933 -15139 -16154 4791 21816 8469 -14608 -9373 7322 3988 -9070 -6243
1592 -6243 8203 15548 3365 -16082 -12760 8289 10937 -4119 -4619 7496 6909 -5915 -12532 -2274
1606 -2274 14127 11021 -10319 -13545 8582 15799 -2753 -14529 -4806 9545 10453 -2753 -8897
$$ packed form
1514E433j4789J70J8252L882k0908q193J9745J2003j2902j3365L520J4131M122
1527A1101j7411j0514J8640J7182j4067j6985M343J1031L33q349j795J4106R644
1540A7259j9451k2905J3118K7491N99j8933q888Q534J1204n772j5887N674K2432
1553A4475j218k1787n706J4416P954o747j0208L489J5776q28k0441m100K0882
1566E957Q091j6440j1757Q844J6592K183j8569j2962J5024J4928j0503j0044J1757
1579C101R349j0517j7072j015K0945J7025j3347k3077N235J6695l334j3058K827
1592f243J4446P345j2183j9447L322K1049K648j5056n00J2115n87j2824o617J0258
1606b274J6401l106k1340l226K2127P217j8552j1776R723J4351R08j3206o144
$$ plain form
1619 -8897 4954 11324 -6635 -16560 829 17949 10788 -6482 -12888 -1242 9099 -232 -11831
1632 -11831 2734 18987 6482 -15966 -15661 1511 13704 7845 -5307 -3935 6853 690 -14399
1645 -14399 -6559 13123 12902 -3395 -12731 -4951 8843 7056 -9403 -10626 8698 12804 -4354
1658 -4354 -11702 -611 7992 2575 -10018 -9448 9257 15710 -3889 -17054 -3192 9572 2236
1671 2236 -7604 -3541 9487 11415 -7187 -22041 -5735 17515 12167 -6043 -8185 -281 2301
1684 2301 -3407 -8127 1961 14552 5231 -14445 -10532 6746 7240 -4081 -6279 2922 9891 1882
1698 1882 -13482 -8878 11233 11626 -7990 -11340 4555 12340 2414 -11750 -10176 7449 13889 -3161
1712 -3161 -12160 3756 13483 -400 -13927 -7885 9289 16479 1488 -13755 -5240 9107 2668
$$ packed form
1619h897J3851O370j7959r925J7389J7120p161j7270o406J1646J0341r331j1599
1632a1831J4565J6253j2505k2448L05J7172J2193n859j3152J372J0788o163j5089
1645a4399P840J9682k21j6297r336P780J3794j787j6459j223J9324M106j7158
1658d354p348J1091Q603n417j2593N70J8705O453j9599j3165J3862J2764p336
1671B236r840M063J3028J928j8602j4854J6306K3250n348j8210k142P904K582
1684B301n708m720J0088J2591r321j9676L913J7278M94j1321k198R201O969q009
1698A882j5364M604K0111L93j9616l350J5895P785r926j4164J574J7625O440j7050
1712c161q999J5916R727j3883j3527O042J7174P190j4991j5243Q515J4347o439
$$ plain form
1725 2668 -7588 -574 10135 7232 -4977 -10782 -1963 10611 5031 -7905 -1785 10869 4355
1738 4355 -10109 -8623 5265 13080 3736 -10795 -6719 10848 9571 -9087 -11001 6328 13009
1751 13009 1405 -10245 -6242 8843 10265 -7106 -13374 5395 15382 1326 -11832 -6187 6241
1764 6241 9056 -2480 -10062 1897 12938 609 -12945 -5090 8350 6888 -2779 -6446 1103
1777 1103 7181 -1179 -11743 -1890 12613 5388 -9731 -7850 4082 7646 -1307 -10484 -2954 11777
1791 11777 6971 -12382 -11560 6924 11853 -1942 -11799 -5183 9596 9899 -8160 -14296 3634 12681
1805 12681 -585 -11199 -3655 7274 6712 -5142 -11175 778 11345 699 -10412 -2608 7058
1818 7058 2288 -5511 -4715 3494 7226 -2161 -11032 -820 11664 3087 -10723 -5816 7582 7875
$$ packed form
1725B668j0256P014J0709k903j2209n805Q819J2574n580j2936O120J2654o514
1738D355j4464J486J3888P815r344j4531M076J7567j277j8658j914J7329O681
1751A3009j1604j1650M003J5085J422j7371o268J8769R987j4056j3158N645J2428
1764F241K815j1536p582J1959J1041j2329j3554P855J3440j462r667l667P549
1777A103O078q360j0564R853J4503p225j5119J881J1932L564q953r177P530J4731
1791A1777m806j9353Q22J8484M929j3795r857O616J4779L03j8059o136J7930R047
1805A2681j3266j0614P544J0929n62j1854o033J1953J0567j0646j1111P804R666
1818G058m770p799P96Q209L732r387q871J0212J2484q577j3810M907J3398K93
$$ plain form
1832 7875 -3734 -11161 -1311 12857 6149 -12014 -9961 9058 10856 -3491 -10541 -2133 10280
1845 10280 7729 -8481 -11548 6032 12930 -1414 -9670 -1415 7953 4464 -5698 -7977 4350
1858 4350 12080 -128 -10408 -1460 7827 1947 -4702 -2001 4927 5953 -3215 -9263 874 11296
1872 11296 1426 -9904 -2517 9124 6272 -5777 -10126 1451 13230 4903 -12008 -7472 10547
1885 10547 9805 -6636 -11623 286 12503 7899 -9100 -11592 4317 10523 -2484 -8874 894
1898 894 8200 3220 -6442 -7930 1578 8414 -300 -6628 1699 6283 -2879 -8232 -1228 7368 5266
1913 5266 -4567 -8141 2908 9942 -2576 -13343 -1991 12636 7522 -6962 -11657 -387 10473
1926 10473 2489 -11387 -5623 11262 9391 -7283 -12234 -1258 9295 5425 -5923 -6925 5604
$$ packed form
1832G875j1609p427R850J4168o708j8163K053J9019J798j4347p050Q408J2413
1845A0280k551j6210l067J7580O898j4344q256Q255R368l489j0162k279J2327
1858D350P730j2208j0280Q948R287n880o649K701O928J026r168o048J0137J0422
1872A1296r870j1330P387J1641k852j2049m349J1577J1779q327j6911M536J8019
1885A0547p42j6441m987J1909J2217m604j6999k492J5909O206j3007o390R768
1898H94P306m980r662j488R508O836q714o328Q327M584r162n353P004Q596k102
1913E266r833l574J1049P034j2518j0767J1352J4627n114j4484m695J1270J0860
1926A0473p984j3876N764J6885j871j6674m951J0976J0553l870j1348j002J2529
$$ plain form
1939 5604 7231 -6664 -9768 2730 8999 2276 -5281 -4070 3609 4776 -5253 -7622 4330 10637
1953 10637 -751 -8458 -1783 4722 3073 -4892 -5616 5216 11220 -1105 -12484 -3018 8682 4559
1967 4559 -5034 -4287 5155 9141 -1928 -13634 -3797 13334 9193 -6655 -8423 3316 8291 -108
1981 -108 -9236 -4783 10701 11177 -4767 -10749 600 7158 1118 -4002 -1400 5286 5391 -3812 -7825
1996 -7825 2300 6570 -1640 -4588 3413 6670 -544 -7610 -5363 5803 9404 -3536 -9881 2658
2010 2658 11437 -46 -12448 -7174 7864 13280 743 -13029 -5554 9755 5905 -8210 -7876
2023 -7876 5560 10254 1387 -10230 -8970 4190 8371 -1167 -4084 2514 2176 -4509 -5210 1385 5385
2038 5385 2344 -5802 -5287 5211 5715 -6700 -8911 3581 8853 1023 -7849 -5505 5081 7752
$$ packed form
1939E604J627j3895l104J2498O269o723p557J211P679J167j0029k369J1952O307
1953A0637j1388p707O675O505j649p965p24J0832O004j2325j1379R466J1700m123
1967D559r593P47R442L986j1069j1706R837J7131m141j5848j768J1739M975q399
1981a08r128M453J5484M76j5944n982J1349O558o040n120K602O686J05r203m013
1996g825J0125M270q210k948Q001L257p214p066K247J1166L601j2940o345J2539
2010B658Q779j1483j2402N274J5038N416j2537j3772P475J5309l850j4115L34
2023g876J3436M694q867j1617J260J3160M181r538k917O598l38o685p01O595M000
2038E385l041q146N15J0498N04j2415k211J2492N272p830q872K344J0586K671
$$ plain form
2052 7752 -5290 -11942 1550 12391 3924 -8979 -7608 2401 6217 -979 -7586 517 10645
2065 10645 2315 -11474 -7816 5631 8125 744 -5310 -2264 3944 1754 -7430 -4040 8214 7056
2079 7056 -4317 -8010 -212 5919 3051 -5220 -5112 5509 7112 -3762 -7178 1717 6017 -412
2093 -412 -4643 -1437 5328 5632 -4585 -7786 3301 9210 -1540 -8309 290 9874 5665 -7516
2107 -7516 -12025 1061 14252 5844 -9354 -7339 5023 6557 -1637 -5740 -831 8379 5022 -5999
2121 -5999 -6598 3165 5011 -1015 -1978 2119 2690 -1086 -4705 -668 6706 4360 -6190 -5345 5994
2136 5994 6717 -3563 -7634 392 8231 4863 -7389 -9007 5559 11978 -1828 -12296 -3811 8821
2150 8821 8714 -3175 -10224 -2561 8171 3535 -6639 -3514 4892 3696 -2952 -4424 -729 3734
$$ packed form
2052G752j3042o652J3492J0841q467j2903J371J0009L816p196o607Q103J0128
2065A0645q330j3789L658J3447K494p381o054L046O208k190r184L390J2254j158
2079G056j1373l693P798O131k868q271J08J0621J603j0874l416Q895M300o429
2093d12m231L206O765L04j0217l201J1087N909j0750o769Q599R584m209j3181
2107g516m509J3086J3191q408j5198K015J2362J534q194m103M909R210l357j1021
2121e999n99R763J846o026r63M097N71l776l619M037P374k346j0550Q45J1339
2136E994P23j0280m071Q026P839l368j2252j618J4566O419j3806j0468Q485J2632
2150H821j07j1889p049P663J0732m636j0174L125Q406j196o648j472L695M463
$$ plain form
2164 3734 1220 -3952 -667 5711 749 -7960 -3895 6422 6709 -2517 -8206 -3249 7378 5418 -5984
2179 -5984 -7559 3964 6715 -2492 -6826 -1117 5571 3998 -5050 -7230 3326 8218 -1768 -8573
2193 -8573 -274 6900 3061 -4849 -5466 2554 8112 -534 -8865 -1574 8005 3140 -5299 -4348 3369
2208 3369 6087 -225 -7070 -1982 8136 4695 -5832 -5466 3268 5334 -54 -4253 -1285 4396 3208
2223 3208 -4510 -3651 5407 4596 -4217 -4409 3558 6382 451 -7759 -4465 8382 9438 -4899 -11497
2238 -11497 253 9907 4908 -5321 -6773 2012 8048 772 -7972 -2502 7300 4116 -3923 -3848 1111
2253 1111 3441 666 -3562 -619 4707 186 -6538 -1912 6090 3271 -4499 -5103 1178 6156 1144
2268 1144 -7015 -3719 7140 5231 -6207 -7563 2311 8508 2226 -8478 -7752 4612 9194 -1798
$$ packed form
2164C734k514n172L285O378m962q709M065J0317K87r226n689M957J0627j960j1402
2179e984j575J1523K751r207m334N709O688j573r048k180J0556M892r986o805
2193h573Q299P174l839p910o17Q020N558q646q331P291R579m865q439R51P717
2208C369K718o312o845N088J0118l441j0527L66Q734K066n388m199K968N681j188
2223C208p718Q59R058q11q813j92P967K824n931q210L294J2847J056j4337o598
2238a1497J1750R654m999j0229j452Q785O036p276q744N470R802l184q039P5M959
2253A111K330k775m228K943N326m521o724M626Q002k819p770o04O281M978n012
2268A144q159L296J0859j909j1438j356R874O197o282j0704P26J2364M582j0992
$$ plain form
2282 -1798 -8361 -1215 5287 992 -4593 -3204 2794 5374 -1286 -6889 -639 5179 -10 -4746 -380
2297 -380 4370 1356 -5065 -6481 2089 8999 1924 -9054 -4407 5268 4642 -3044 -4586 986 4834
2312 4834 687 -6547 -3331 6125 5069 -5107 -5806 1858 4999 362 -4261 -2575 4492 4287 -5208
2327 -5208 -6279 4619 8411 -649 -7182 -3799 4321 5832 -1174 -5556 1372 6478 -1355 -7437 -1378
2342 -1378 6981 5426 -2340 -6431 -1211 5592 2544 -3740 -573 5118 1008 -4949 -2254 4110 5301
2357 5301 -313 -5839 -1817 6775 4032 -6065 -3977 5212 5871 -2088 -7461 -1538 7900 6961 -5205
2372 -5205 -8892 1645 7431 1570 -3907 -1545 2634 2308 -2895 -4390 3106 7142 -502 -6463 -1816
2387 -1816 3727 1738 -1848 -1803 2412 3837 -2507 -7600 406 8509 2753 -6227 -4849 2873 4843
$$ packed form
2282a798o563P146O502m295n585J389N998K580o660n603O250N818n189m736M366
2297c80M750l014o421j416Q570O910p075j0978M647R675o26p686j542N572L848
2312D834m147p234L216R456j056j0176o99P664L141m637m623J686P067k05r495
2327e208j071J0898L792r060o533L383Q120J511p006m382O928N106p833o082O059
2342a378Q359j555p766m091N220O803l048o284L167N691m110n957K695O364J191
2357E301n614n526M022Q592k743j0097K088R189O59p959n373N923R438r39j2166
2372e205l687J0537N786n861n477K362M179l26n203j495P496M036p644n961M647
2387a816N543j989l586M5M215J425o344n093Q006Q103n756q980J378P722J970
$$ plain form
2402 4843 -648 -5445 -1518 6253 2657 -7143 -5157 4779 6512 -1333 -6531 -3382 4101 4540 -2819
2417 -2819 -4480 2648 3765 -3760 -5197 1644 5595 1891 -4977 -5874 1974 5807 -1512 -5772 969
2432 969 5019 -603 -5945 -3415 4139 6363 -823 -7709 -1835 5532 2010 -4392 -1915 3755 2667
2447 2667 -2347 -5022 188 6702 2657 -6401 -4070 4410 4572 -2014 -3559 729 4639 1280 -5605
2462 -5605 -3750 5620 6223 -3197 -6467 228 4997 2290 -3065 -2935 2878 4782 -2736 -5737 1928
2477 1928 6496 749 -4673 -2887 2773 4229 -886 -4473 897 5693 -636 -6053 -1036 5216 4110
2492 4110 -2634 -5058 -81 5889 1949 -5288 -2527 5244 3247 -4120 -4651 1468 5704 1925 -5263
2507 -5263 -4431 4450 4807 -3255 -4140 2193 4011 -558 -4535 -1962 4382 4150 -3107 -5939 1866 5343
$$ packed form
2402D843n491m797L927P771l596r800J986R936J733p845n198L149P483M39p359
2417b819j661P128J117p525j437O841L951l704o868q97P848L833p319m260O741
2432I69M050n622n342K530P554K224p186o886N874P367l522o402K477N670j088
2447B667n014k675N210O514m045r058K331Q480J62o586j545M288L910l359o885
2462e605J855R370O03r420l270O695M769k707n355J30N813J904p518l001P665
2477A928M568n747n422J786N660J456n115l587N370M796o329n417N017O252j106
2492D110o744k424M977N970l940p237K761P771j997p367n31O119M236l779p188
2507e263Q32Q881L57q062q85O333J818m569l977K573O344k32p257k832P805L477
$$ plain form
2523 5343 -742 -4574 -859 3349 2543 -3497 -5491 1591 6275 -70 -6813 -1801 4538 2810 -2843
2538 -2843 -3757 689 4839 -112 -6386 -2047 5499 3097 -3961 -3958 952 3544 271 -4116 -2006 4323
2554 4323 2995 -4575 -4012 2961 4681 -1205 -4588 -1777 3879 3349 -3698 -4864 3175 5289 -2142
2569 -2142 -5255 -539 4855 2316 -3588 -4599 2344 6209 -444 -5679 -573 4918 1936 -3393 -3110
2584 -3110 1842 4851 19 -5543 -666 5618 2096 -4584 -2386 3230 3663 -816 -4165 -617 5401
2599 5401 2473 -5094 -3181 4232 4715 -1737 -4093 -219 4442 3083 -3998 -4444 3670 5176 -1920
2614 -1920 -4512 452 4281 1449 -3078 -3463 2400 5048 -1109 -5050 681 4996 847 -4000 -1637
2629 -1637 2523 3600 -1757 -4979 432 6070 1133 -5085 -2300 3306 3517 -1669 -4217 -332 4858
$$ packed form
2523E343o085l832L715M208q06o040j994P082M684o345o743N012O339j728n653
2538b843r14M446M150m951o274M339P546k402p058LM910K592l273m387K110O329
2554D323j328p570N63O973J720n886l383K811N656n30p047j166Q039K114p431
2569b142l113M716N394k539n904j011O943L865o653n235N106N491k982n329K83
2584c110M952L009m832n562M877O284l522o680K198N616M33m479l349L548O018
2599E401k928p567J913P413M83o452k356L874M661j359p081m46Q114J506p096
2614a920k592M964L829k832m527l85N863K648o157l941N731M315m149m847K363
2629a637M160J077n357l222N411N638m937o218K785N606K11n186k548L885N190
$$ plain form
2644 4858 2087 -4834 -3581 3948 3696 -2453 -3933 163 3542 1590 -3683 -3125 3392 3475 -3102 -4110
2660 -4110 1657 3976 -315 -4336 -2675 3473 4256 -2453 -5521 1100 5303 -399 -4643 -1964 2957
2675 2957 3493 -2204 -5294 -4 4882 457 -4594 -1636 3526 2208 -2496 -3443 142 3578 721
2690 721 -4515 -1326 4865 2138 -4331 -3932 1541 4223 473 -4182 -2251 4036 3455 -3867 -4352 2377
2706 2377 5117 -71 -4173 -2732 2691 3934 -2088 -4127 1754 4791 -573 -3959 -617 2891 2104
2721 2104 -1684 -2982 1895 4548 -796 -5331 -56 4916 1938 -3151 -2570 1814 4275 -478 -5449
2736 -5449 -1370 5899 3406 -3768 -3480 1434 3305 129 -3659 -1070 4391 3256 -3577 -4182 1822
2751 1822 3104 -598 -2629 468 3347 1447 -3814 -4219 2759 4887 -1001 -4079 51 3493 865
$$ packed form
2644D858k771o921J253P529k52o149j480M096L379j952n273N58O517Q3o577j008
2660d110N767K319m291m021J661O148P83o709l068O621M203n702m244K679M921
2675B957N36n697l090N290M886m425n051K958N162j318m704r47L585L436k857
2690G21n236L189O191k727o469L99N473K682l750m655J931O287n81p322m85O729
2706B377K740n188m102J441N423J243o022k039N881L037n364l386L342L508p87
2721B104l788j298M877K653n344m535N275M972k978n089N81M384K461m753m971
2736e449M079P269k493p174K88M914J871l176l788K589N461j135o833o05O004
2751A822J282l702k031L097K879j900n261m05O978K128n888l078M130L442k628
$$ plain form
2766 865 -3260 -3394 2356 4942 -510 -5887 -792 4109 1319 -3200 -2449 1461 3702 441 -4393 -1339
2782 -1339 3494 1093 -3744 -1779 3610 2879 -1747 -4205 -1270 3676 2421 -3460 -2544 3179 2686 -3525
2798 -3525 -4195 684 4617 2732 -3402 -4568 1894 4011 -1669 -3648 1480 3790 407 -3050 -2807
2813 -2807 1919 3879 -925 -4071 492 4208 314 -3773 -1281 2254 2497 -1339 -3839 1074 5023
2828 5023 476 -5017 -2286 3518 3631 -834 -3189 -94 3027 1026 -3752 -1911 4809 3988 -2006
2843 -2006 -3745 -103 2181 1209 -1564 -1062 3164 3073 -3357 -4019 2153 4193 212 -3211 -1635 2509
2859 2509 2750 -2300 -4210 1234 5058 210 -3916 -898 2831 2463 -1555 -3703 382 4792 1217
2874 1217 -4065 -1498 3134 1195 -2247 -1740 1574 3907 184 -4319 -2476 3225 2447 -2430 -1863 1950
$$ packed form
2766H65m125j34N750K586n452n377N095M901k790m519P51L910K241l261m834L054
2782a339M833k401m837J965N389p31m626k458K935M946j255n881R16N723m93o211
2798c525o70M879L933j885o134j166O462K117n680j979N128K310l383l457K43
2813b807M726J960m804l146M563L716l894m087K492L535K43l836k500M913L949
2828E023m547n493K731N804J13m465k355L095L121k001m778J841O720q21n994
2843b006j739L642K284r72k773N02M226r1o430o62O172K040l981l423J576M144
2859B509K41n050j910N444L824m848m126L018L729l68m018k148M085M410l575
2874A217n282K567M632j939l442N07L314K333l723m503J843N701p78m877N67L813
$$ plain form
2890 1950 2890 -1432 -4174 -1572 4137 4112 -2985 -4460 1162 2736 -481 -2774 -633 2934 2200 -2524
2906 -2524 -4333 900 3852 -459 -3623 -380 2660 1343 -1673 -2846 899 3191 -658 -3925 -178
2921 -178 4078 1424 -3272 -2896 908 2841 218 -3358 -870 3444 1242 -4119 -2604 3033 3534 -351
2937 -351 -3764 -1684 2773 2049 -2981 -2671 2797 2776 -1683 -3826 -339 2895 2147 -1987 -3661 1693
2953 1693 3750 -990 -3944 274 3047 755 -2064 -2078 1295 3209 -553 -4010 217 3556 512
2968 512 -2457 -1307 1710 2495 -683 -3289 275 4394 1448 -3981 -1918 3073 2417 -1138 -2632 -373
2984 -373 3193 2006 -3310 -2883 3312 3466 -1413 -2696 142 2654 1095 -1928 -2347 1968 3285 -1368
3000 -1368 -3479 722 2852 385 -2033 -1275 1500 2089 -1428 -3485 882 3992 169 -3570 -1003
$$ packed form
2890A950R40m322k742K602N709k5p097j475N622J574l217k293K141L567p34m724
2906b524j809N233K952m311l164L243L040j317l016j173L745K292l849l267L747
2921a78M256k654m696L76L804J933k623l576K488M314k202n361J515N637N01l885
2937c51l413K080M457p24n030L10N468k1m459k143L487L234p48m134j674N354
2953A693K057m740k954M218K773k292k819j4L373J914l762l457M227L339l044
2968E12k969J150L017P85l178k606L564M119k946n429K063M991o56l555j494K259
2984c73L566j187n316M27O195J54m879j283K838K512j559l023m19M315J317m653
3000a368k111M201K130k467k418P58K775N89l517k057M367L110l823l739K567
$$ plain form
3015 -1003 1964 1984 -902 -2718 377 3276 389 -4043 -1539 3186 2123 -1778 -2431 -124 2695 776
3031 776 -3434 -1822 3190 2609 -2496 -3135 810 2652 585 -2537 -2400 2126 2835 -1740 -3286 964
3047 964 2549 -516 -2240 -914 1979 1930 -1310 -3062 739 3381 -590 -2420 408 2544 623 -2131
3063 -2131 -3039 1052 3962 690 -3623 -1133 2796 1335 -2357 -1692 1979 3484 150 -3950 -2344
3078 -2344 2926 2769 -1696 -2179 1118 2285 -34 -1994 -1539 2239 2615 -1509 -2188 1595 2437 -1022
3094 -1022 -1820 498 1854 1072 -1509 -1843 1995 3133 -1770 -3950 581 4339 2160 -1901 -2921 349
3110 349 2933 589 -3076 199 3805 902 -3523 -2784 958 3161 833 -2116 -1320 1856 919 -2808
3126 -2808 -1766 2643 2921 -863 -2562 -881 1924 1503 -2027 -2321 1992 2395 -1201 -2609 345 1829
$$ packed form
3015a003K967K0k886j816L095K899k887m432K504M725j063l901o53K307K819j919
3031G76m210J612N012n81n105o39L945J842k067l122J37M526P09m575j546M250
3047I64J585l065j724J326K893m9l240j752L801K642l971j830K828K136j921k754
3063b131r08M091K910l272m313K490L929j461l692O65L671J505l334m100J606
3078b344N270j57m465m83L297J167k319j960M55L778L76m124o79L783Q42l459
3094a022p98K318J356p82k581l34L838J138m903k180M531L758k179m061j020L270
3110C49K584k344l665L275L606k903m425P39L742K203k328k949P96L176r37l727
3126b808J042M409K78l784j699J681K805m21l530k94M313M03l596j408K954J484
$$ plain form
3142 1829 737 -2387 -2346 2073 3897 -1238 -3479 -746 2001 893 -1291 -781 1381 1887 -2057 -4518
3158 -4518 164 3964 1173 -2751 -1740 1312 957 -1653 -2911 278 4077 1618 -4117 -3297 1542
3173 1542 2320 -9 -1785 -696 1578 1244 -2180 -2095 1781 1638 -1596 -1595 1273 1651 -49 -2144 -1739
3190 -1739 1960 2752 -1227 -2486 1358 2544 -903 -3447 -1030 2809 3089 -689 -3327 -624 2796
3205 2796 500 -2578 -312 2921 1989 -1139 -3739 -1023 3121 2379 -1629 -1255 1473 704 -1276 -1032
3221 -1032 707 2071 826 -1907 -676 2469 1234 -2806 -1794 2016 2791 -168 -2370 -990 2034
3236 2034 2131 -1806 -3082 1478 3550 324 -2637 -1685 710 1899 -258 -1372 1241 2719 -559 -3587
3252 -3587 -777 2484 2096 -473 -1885 -58 2125 -310 -2943 -823 3302 1334 -1843 -2216 132
$$ packed form
3142A829j092l124M1M419J824n135k241K733K747j108k184N10K162N06l944k461
3158d518M682L800k791l924J011L052l55k610j258L189L799k459n735Q20M839
3173A542P78k329j776J089K274l34l424Q5L876j43l234JK868L78j700k095M05
3190a739L699P92l979j259L844J186l447k544K417L839K80l778k638K703L420
3205B796k296l078K266L233r32l128k600K716M144p42m008L74K728p69j980K44
3221a032J739J364j245k733J231L145j235m040J012L810P75k959k202J380L024
3236B034R7l937j276M560K072l226k961R52K395J189k157j114K613J478l278l028
3252c587K810L261l88k569j412J827K183k435k633K120M125j968l177l73K348
$$ plain form
3267 132 1892 370 -2019 -1156 2330 1427 -2511 -2204 1165 1635 -371 -1363 -445 2000 1537 -1930 -2080
3284 -2080 1257 2147 -836 -1699 773 1930 174 -2516 -2123 1656 3848 -252 -3556 -949 2265 1417
3300 1417 -1508 -1882 550 2552 571 -2840 -1596 1859 1309 -810 -536 636 954 -567 -1430 29
3316 29 2441 774 -2018 -940 2192 1637 -1627 -2393 301 2502 1212 -2033 -2238 1895 2172 -1801
3332 -1801 -2548 603 2720 1198 -1871 -2273 976 2568 -301 -2662 129 2159 760 -1107 -1271 727
3348 727 1779 414 -1809 -106 2119 -25 -2311 -404 1912 1257 -848 -2070 30 2555 855
3363 855 -2585 -1151 2215 1700 -1171 -2133 -235 1865 1034 -1333 -1567 1672 1960 -1476 -2072 852 2032
3380 2032 386 -1944 -1451 1341 2017 -1182 -2543 430 2207 -120 -2127 -1083 1273 1745 -788 -2430
$$ packed form
3267A32J760j522k389Q63L486r03l938L07L369M70k006r92R18K445m63l467j50
3284b080L337Q90k983q63K472J157j756k690L93L779K192m100l304K607L214q48
3300A417k925l74K432K002j981l411J244L455n50k119K74J172L18j521q63J459
3316B9K412j667k792J078L132n55l264p66K694K201j290l245k05M133K77l973
3332a801p47L151K117j522l069m02L249J592k869k361K791K030j399j867j64J998
3348G27J052j365k223J703K225k144k286J907K316o55k105j222K100K525j700
3363H55l440J434L366n15k871r62J898K100q31k367k34L239K88l436n96K924J180
3380B032j646k330M93K792O76l199j361K973J777k327k007J044K356M72k533j642
$$ plain form
3396 -2430 43 2694 319 -2705 -1040 1724 1207 -852 -1884 -492 1686 358 -2257 -833 1866
3411 1866 917 -1459 -1594 573 1302 -79 -2204 -1254 2218 1380 -2172 -2257 1208 2153 -211 -2024 -1253
3428 -1253 1230 1808 -1302 -2369 1062 2616 -430 -1968 -634 1144 1314 -598 -1981 807 2041
3443 2041 20 -1989 -225 1630 822 -904 -909 538 1645 -305 -2591 -248 2526 1207 -1701 -1222
3459 -1222 950 1702 169 -1960 -897 2320 1715 -1571 -1897 1346 1648 -453 -1141 -232 1720 1451 -1520
3476 -1520 -1763 1320 1940 -374 -1633 460 1882 562 -1518 -1663 1069 2776 -46 -2111 84 1958
3492 1958 66 -1698 -852 1221 2455 -42 -2202 -720 1982 696 -1860 -951 1760 1739 -742 -2485
3508 -2485 -1279 1938 1485 -1281 -1197 1599 790 -969 -1210 41 1464 796 -1622 -1142 1304 1625 -1050
$$ packed form
3396b430K473K651k375l024J665K764n17k059j032J392K178j328k615J424K699
3411A866r49k376j35K167P29j381k125R50L472q38l552q5L465R45k364j813P71
3428a253K483N78l110j067L431J554l046j538J334J778J70j912j383K788J234
3443B041k021k009J764J855q08j726nJ447J107j950k286K343K774j319k908M79
3459a222K172P52j533k129J063L217o05l286l26L243L02k101o88R09J952k69k971
3476a520k43L083O20k314j259K093J422j320k080j45K732J707k822k065K195J874
3492A958j892j764Q46K073J234k497k160J482K702j286k556R09K711k1k481j743
3508b485J206L217m53k766Q4K796q09j759k41J251J423o68k418M80K446L21k675
$$ plain form
3525 -1050 -2347 347 2044 441 -1662 -1799 800 1604 -746 -2183 461 1918 436 -1579 -1278 929
3541 929 1033 -589 -1553 267 2213 9 -2808 -1176 1858 1839 -108 -1924 -600 1194 289 -1588
3557 -1588 -523 1906 1082 -1497 -1356 463 1227 224 -1603 -817 1681 1683 -1615 -2207 621 1942 693
3574 693 -1594 -815 1306 1843 -723 -2302 182 1917 78 -1107 5 1327 900 -1352 -1644 784
3590 784 2751 690 -2128 -1128 1053 831 -557 -1075 471 1695 443 -2137 -1238 1524 974 -796
3606 -796 -692 689 1107 -95 -1994 -573 2049 1616 -1335 -1674 1338 1551 -355 -1201 -461 1175 1102
3623 1102 -883 -1481 1154 1317 -907 -2009 -64 1949 1042 -1478 -2044 26 1782 281 -1610 -310
3639 -310 1836 832 -1245 -1396 -334 1424 534 -699 -508 999 -253 -1920 -466 1628 1362 -603
$$ packed form
3525a050j297K694J697j603k103j37K599Q04k350j437K644J457j482k015L01K207
3541I29J04j622r64J820J946k204k817J632L034j9j947j816J324J794r05j877
3557a588J065K429q24k579J41J819P64j003j827P86K498Kl298n92K828J321j249
3574F93k287P79K121N37k566j579K484J735j839j185J112J322m27k252k92K428
3590G84J967k061k818J000K181k22j388n18J546J224j252k580Q99K762n50j770
3606g96J04J381M18j202j899J421K622m33k951l39L012K13j906q46P40J636p3
3623A102j985n98K635J63k224j102J945K013r07k520n66K070J756j501j891J300
3639c10K146j004k077j51J062J758q90j233J91J507j252j667J454K094k66j965
$$ plain form
3655 -603 -1976 -470 1845 1147 -1939 -1666 946 1805 -582 -1700 -403 1290 851 -1098 -1579 784
3671 784 2192 -545 -1719 -414 1115 808 -940 -1122 316 1578 -347 -1885 29 1940 834 -752
3687 -752 -638 233 458 -711 -801 529 2099 61 -2702 -1291 1682 1477 -480 -1646 76 1913 1177
3704 1177 -1752 -1352 894 1553 -621 -797 165 1322 552 -1024 -1096 1347 1700 -628 -1262 600 1804
3721 1804 226 -1272 -1260 947 2334 -209 -1874 363 1462 428 -982 -310 989 839 -646 -1379
3737 -1379 208 1625 164 -1756 -572 1699 895 -967 -1494 340 1554 331 -1919 -1364 960 615
3753 615 -954 -1163 814 1376 -53 -1864 -829 1631 1619 -1233 -2264 352 1820 509 -1118 -946
3769 -946 623 1123 -191 -1553 237 1197 -234 -861 198 598 -41 -717 -951 810 1340 -759 -2024
$$ packed form
3655f03j373J506K315o98l086K73K612Q59k387j118J297J693m39j949m81K363
3671G84J408k737j174J305J529l07j748j82J438J262j925j538J914J911j106j586
3687g52J14Q71K25j169r0J330J570k038k763J411K973k05j957j166J722J837p36
3704A177k929M00K246O59k174j76R62J157p70j576p2K443L53k328o34J862J204
3721A804j578j498J2K207J387k543j665K237J099j034j410O72J299j50j485p33
3737a379J587J417j461j920J184K271q04j862n27J834J214j223k250N55K324l45
3753F15j569k09J977N62j429j811J035K460j2k852j031K616J468j311j627J72
3769i46J569N00j314j362J790R60j431o27J059M00o39o76k34J761N30k099j265
$$ plain form
3786 -2024 -109 2202 579 -1584 -1133 169 1560 76 -1866 -912 1607 961 -1513 -1069 158 1041
3802 1041 50 -1359 -865 932 1225 -864 -1348 626 1063 -325 -737 -507 302 652 -550 -892 643
3819 643 730 -1118 -1348 871 1635 422 -1111 -1136 1109 1857 -324 -1880 219 1671 510 -1156 -1096
3836 -1096 687 1102 112 -1295 -768 1349 774 -1066 -740 1132 1117 -600 -1422 -187 1334 1171 -1382
3853 -1382 -1876 1055 1777 -127 -749 -306 590 846 -550 -807 834 1681 -639 -1452 149 777 72 -755
3871 -755 -639 607 656 -847 -1398 587 1795 -315 -1445 -743 1092 804 -571 -1384 150 2012 452
3888 452 -2111 -1181 1484 1911 -599 -1666 -483 1474 1331 -725 -1495 437 777 -608 -422 -43 403
3905 403 170 -616 -665 668 696 -497 -1065 450 614 -827 -1227 -246 1227 972 -966 -1784 140 2122
$$ packed form
3786b024J915K311j623k163M51J302J391j484j942R54K519o46k474M44J227Q83
3802A041r91j409M94J797K93k089m84J974M37j388m12K30Q09L50j202l42J535
3819F43Q7j848k30K219P64j213j533k5K245P48k181j556K099J452j161j666O0
3836a096J783M15r90j407N27K117n75j840L26J872j5j717q22J235J521j63k553
3853a382m94K931P22j904o22M43Q96K56j396k57J641Q47k320q13J601O28p05q27
3871g55J16J246M9j503n51J985J208k110j130P02J835k88j375q13J534J862j560
3888D52k563R30K665M27k510j067J183J957j43k056p70J932L40j385J86L79M46
3905D03k33p86m9J333K8j193n68J515J64j441m00R81J473k55j938q18J924J982
$$ plain form
3923 2122 299 -1588 -858 1312 973 -641 -1366 10 1623 542 -1450 -916 872 1192 -479 -518 -51
3940 -51 837 243 -1131 -663 1346 637 -1131 -713 830 837 256 -629 -751 798 539 -700 -1336 880 1288
3959 1288 -15 -1152 -226 693 869 -679 -841 408 1122 -375 -1539 -174 1261 616 -767 -1055 -57
3976 -57 1447 274 -1213 -171 1548 724 -1081 -1053 280 1533 382 -1344 -605 822 1157 -660 -689
3993 -689 548 848 -10 -527 -177 947 704 -1439 -1292 582 912 -358 -1070 456 870 -105 -848 -1049
4011 -1049 801 1355 -478 -1655 -126 1548 355 -898 -916 198 1532 -34 -1631 -652 1001 372
4027 372 -827 -805 234 900 8 -844 -472 762 166 -1075 -690 1028 449 -571 -886 26 975 586
4045 586 -1175 -745 1026 958 -1147 -1149 504 1120 373 -1291 -834 634 1052 -566 -1308 304 1329 130
$$ packed form
3923B122j823j887P30K170l39j614p25J376J613j081j992N34J788L20j671l9M67
3940e1Q88n94j374M68K009p09j768M18J543Pn81q85j22J549k59j239o36K216M08
3959A288j303j137R26R19J76j548j62J249P14j497j164J365J435o45j383k88R98
3976e7J504j173j487J042J719q24j805K8J333J253j151j726P39J427L35j817k9
3993f89J237L00q58n17L50J124k43k143J47J874L30j270p12J526M14r75p43k01
4011a049J850N54j833j177J529J674j193j253j8J114J334j566j597R79J653o29
4027C72j199K2J039O66q92q52L72J234n96j241L85J718n79j020l15R12R49l89
4045E86j761M30J771o8k105kJ653O16p47j664M57J468M18j618p42J612J025j199
$$ plain form
4063 130 -962 -695 487 1123 -354 -1239 7 1288 530 -759 -239 631 654 -272 -653 -358 1209 465
4081 465 -1148 -527 987 492 -492 -480 69 823 310 -1043 -424 883 745 -773 -752 621 740 75 -792
4100 -792 -783 961 1280 -704 -995 88 1248 49 -1091 -469 994 865 -546 -1264 -6 1445 203
4117 203 -1270 -96 852 431 -306 -783 0 766 97 -1153 -273 887 386 -854 -456 219 768 258
4135 258 -1177 -595 1120 851 -900 -1031 515 889 -354 -982 -236 934 737 -777 -1086 573 1028
4152 1028 -440 -1019 -213 646 804 -210 -1090 134 1333 -218 -952 -334 732 125 -661 -533 58 821
4170 821 59 -1065 -146 1251 67 -792 -230 640 672 -155 -674 -425 1113 795 -827 -950 819 876 -566
4189 -566 -589 -219 1019 608 -676 -1036 391 1119 -303 -772 -21 858 615 -586 -792 375 900 -247
$$ packed form
4063A30j092K67J182O36j477q85J246J281p58j289N20Q70K3r26l81K95J567p44
4081D65j613O21J514m95r84J2N49P54n13j353O19J307j38j518K1J373J19o65q67
4100g92RJ744L19j984k91J083J160j199j140O22J463j29j411p18J258J451j242
4117B03j473J174R48m21p37m77P83P66o69j250Q80J160n01j240L98O75N49n10
4135B58j435N82J715k69j751j31J546L74j243o28P46J170j97j514l09J659M55
4152A028j468n79Q06Q59J58j014q80J224J199j551p34O18J066o07p86J28N91P63
4170H21p62j124R19J397j184q59N62Q70L2q27n19K49J538l18j622j23J769N7j442
4189e66k3L70J238m11j284l60J427P28j422m69P51Q79k43j201k06J167N25j147
$$ plain form
4207 -247 -925 -143 478 140 -154 -347 245 509 -63 -471 232 1153 360 -887 -285 600 617 -268 -906 -184
4227 -184 1254 571 -1294 -646 1015 819 -450 -920 -76 663 307 -698 -959 686 814 -419 -956 106
4245 106 405 494 -423 -562 23 892 -390 -687 229 983 -238 -685 -412 446 543 -467 -713 -17 774 6
4265 6 -1011 -308 620 735 -530 -939 -25 617 247 -1145 -226 753 588 -722 -423 406 929 85 -802
4284 -802 -639 641 759 -589 -973 324 665 -32 -744 -424 701 785 -573 -1125 -78 950 -229 -928
$$ packed form
4207b47o78P82O21l38k94j93N92K64n72m08P03R21p93j247O02Q85J7q85o38P22
4227a84J438o83j865O48J661j96j269m70Q44P39l56j005k61J645J28j233n37J062
4245A06K99Q9r17j39N85Q69j282k97R16P54j221m47K73Q58R7j010k46O96P91p68
4265Fj017P03R28J15j265m09R14O42l70j392R19R79j65j310K99Q29N23q44q87
4284h02J63J280J18j348l84J297L41o97p12L20J125Q4j358n52J047J028j179o99
$$ [...]
8191A91
##END NTUPLES=NMR FID
##END=
