##TITLE=1H_Ser Chel-N
 CDCl3
 8 sc, 
 11.1.2024
##JCAMPDX= 6.0         $$ Bruker NMR JCAMP-DX V2.0
##DATA TYPE= NMR FID
##DATA CLASS= NTUPLES
##ORIGIN= UXNMR, Bruker Analytische Messtechnik GmbH
##OWNER= root
$$ XWIN-NMR		Version 3.5
$$ Thu Jan 11 13:43:24 2024 Russian Standard Time (UT+4h)  she@DPX200
##.OBSERVE FREQUENCY= 200.1313
##.OBSERVE NUCLEUS= ^1H
##.DELAY= (6, 6)
##.ACQUISITION MODE= SIMULTANEOUS
##.ACQUISITION SCHEME= undefined
##.AVERAGES= 8
##.DIGITISER RES= 18
##SPECTROMETER/DATA SYSTEM= spect
##.PULSE SEQUENCE= zg30
##.SOLVENT NAME= CDCl3
##.SHIFT REFERENCE= (INTERNAL, CDCl3, 0, 15.7039)
##AUDIT TRAIL= $$ (NUMBER, WHEN, WHO, WHERE, WHAT)
$$ ##TITLE= Audit trail, XWIN-NMR		Version 3.5
$$ ##JCAMPDX= 5.01
$$ ##ORIGIN= Bruker BioSpin GmbH
$$ ##OWNER= she
$$ F:/spectra/data/she/nmr/H-F/1/audita.txt
$$ ##AUDIT TRAIL=  $$ (NUMBER, WHEN, WHO, WHERE, WHAT)
(   1,<2024-01-11 13:42:02.54 +0400>,<she>,<DPX200>,
      <created by zg, POWCHK disabled, PULCHK disabled
       configuration hash MD5:
       00 E9 B6 7A A2 85 ED C7 34 08 36 98 17 FE 4E 26
       data hash MD5: 16K
       4A 94 58 DD 70 91 4F D2 F9 F0 CA 6D CA FD 49 D4>)
$$ ##END=
$$ 
$$ hash MD5
$$ 5D EC CA 3E 54 EC 99 EF 8F 2B 3C 2F 8F 55 C0 47
##$RELAX= 
##$RELAX= 
##$RELAX= 
##$RELAX= 
##$RELAX= 
##$RELAX= 
$$ Bruker specific parameters
$$ --------------------------
##$DU= <F:/spectra>
##$EXPNO= 1
##$NAME= <H-F>
##$PROCNO= 1
##$TYPE= <nmr>
##$USER= <she>
##$AMP= (0..31)
100 100 100 100 100 100 100 100 100 100 100 100 100 100 100 100 100 100 
100 100 100 100 100 100 100 100 100 100 100 100 100 100 
##$AQSEQ= 0
##$AQ_mod= 1
##$AUNM= <au_zg>
##$AUTOPOS= <>
##$BF1= 200.13
##$BF2= 200.13
##$BF3= 200.13
##$BF4= 200.13
##$BF5= 200.13
##$BF6= 200.13
##$BF7= 200.13
##$BF8= 200.13
##$BYTORDA= 1
##$CFDGTYP= 0
##$CFRGTYP= 5
##$CHEMSTR= <none>
##$CNST= (0..31)
1 1 145 1 1 1 1 1 1 1 1 1 1 1 1 1 1 1 1 1 1 1 1 1 1 1 1 1 1 1 1 1 
##$CPDPRG= <>
##$CPDPRG1= <>
##$CPDPRG2= <>
##$CPDPRG3= <>
##$CPDPRG4= <mlev>
##$CPDPRG5= <mlev>
##$CPDPRG6= <mlev>
##$CPDPRG7= <mlev>
##$CPDPRG8= <mlev>
##$CPDPRGB= <>
##$CPDPRGT= <>
##$D= (0..31)
0 1.2 0 0 0 0 0 0 0 0.06 0 0.03 0 0 0 0 0.0002 0 0 0 0 0 0 0 0 0 0 0 0 
0 0 0 
##$DATE= 1704966121
##$DBL= (0..7)
120 120 120 120 120 120 120 120 
##$DBP= (0..7)
150 150 150 150 150 150 150 150 
##$DBP07= 0
##$DBPNAM0= <>
##$DBPNAM1= <>
##$DBPNAM2= <>
##$DBPNAM3= <>
##$DBPNAM4= <>
##$DBPNAM5= <>
##$DBPNAM6= <>
##$DBPNAM7= <>
##$DBPOAL= (0..7)
0.5 0.5 0.5 0.5 0.5 0.5 0.5 0.5 
##$DBPOFFS= (0..7)
0 0 0 0 0 0 0 0 
##$DE= 6
##$DECBNUC= <off>
##$DECIM= 32
##$DECNUC= <off>
##$DECSTAT= 4
##$DIGMOD= 1
##$DIGTYP= 9
##$DL= (0..7)
0 120 120 120 120 120 120 120 
##$DP= (0..7)
150 150 150 150 150 150 150 150 
##$DP07= 0
##$DPNAME0= <>
##$DPNAME1= <>
##$DPNAME2= <>
##$DPNAME3= <>
##$DPNAME4= <>
##$DPNAME5= <>
##$DPNAME6= <>
##$DPNAME7= <>
##$DPOAL= (0..7)
0.5 0.5 0.5 0.5 0.5 0.5 0.5 0.5 
##$DPOFFS= (0..7)
0 0 0 0 0 0 0 0 
##$DQDMODE= 0
##$DR= 18
##$DS= 0
##$DSLIST= <SSSSSSSSSSSSSSS>
$$ [...]
##$SUBNAM2= <"">
##$SUBNAM3= <"">
##$SUBNAM4= <"">
##$SUBNAM5= <"">
##$SUBNAM6= <"">
##$SUBNAM7= <"">
##$SUBNAM8= <"">
##$SUBNAM9= <"">
##$SW= 18.0517328524113
##$SWIBOX= (0..15)
0 0 2 0 0 0 0 0 0 0 0 0 0 0 0 0 
##$SW_h= 3612.71676300578
##$TD= 16384
##$TD0= 1
##$TE= 0
##$TE2= 300
##$TE3= 300
##$TEG= 300
##$TL= (0..7)
0 120 120 120 120 120 120 120 
##$TP= (0..7)
150 150 150 150 150 150 150 150 
##$TP07= 0
##$TPNAME0= <>
##$TPNAME1= <>
##$TPNAME2= <>
##$TPNAME3= <>
##$TPNAME4= <>
##$TPNAME5= <>
##$TPNAME6= <>
##$TPNAME7= <>
##$TPOAL= (0..7)
0.5 0.5 0.5 0.5 0.5 0.5 0.5 0.5 
##$TPOFFS= (0..7)
0 0 0 0 0 0 0 0 
##$TUNHIN= 0
##$TUNHOUT= 0
##$TUNXOUT= 0
##$USERA1= <user>
##$USERA2= <user>
##$USERA3= <user>
##$USERA4= <user>
##$USERA5= <user>
##$V9= 5
##$VALIST= <valist>
##$VCLIST= <CCCCCCCCCCCCCCC>
##$VD= 0
##$VDLIST= <DDDDDDDDDDDDDDD>
##$VPLIST= <PPPPPPPPPPPPPPP>
##$VTLIST= <TTTTTTTTTTTTTTT>
##$WBST= 1024
##$WBSW= 4
##$XGAIN= (0..3)
0 0 0 0 
##$XL= 0
##$YL= 0
##$YMAX_a= 249757
##$YMIN_a= -279758
##$ZGOPTNS= <>
##$ZL1= 120
##$ZL2= 120
##$ZL3= 120
##$ZL4= 120
##$ABSF1= 10
##$ABSF2= 0
##$ABSG= 5
##$ABSL= 3
##$ALPHA= 0
##$AQORDER= 0
##$ASSFAC= 0
##$ASSFACI= 0
##$ASSFACX= 0
##$ASSWID= 0
##$AUNMP= <proc_1d>
##$AZFE= 0.1
##$AZFW= 0.1
##$BCFW= 1
##$BC_mod= 2
##$BYTORDP= 1
##$COROFFS= 0
##$CY= 11.3945322036743
##$DATMOD= 1
##$DC= 2
##$DFILT= <>
##$DTYPP= 0
##$F1P= 15.7292609196834
##$F2P= 12.9074282941183
##$FCOR= 0.5
##$FTSIZE= 0
##$FT_mod= 4
##$GAMMA= 1
##$GB= 0.15
##$INTBC= 1
##$INTSCL= 1
##$ISEN= 128
##$LB= 0.24
##$LEV0= 0
##$LPBIN= 0
##$MAXI= 10000
##$MC2= 0
##$MEAN= 0
##$ME_mod= 0
##$MI= 1.114404
##$NCOEF= 0
##$NC_proc= 0
##$NLEV= 6
##$NOISF1= 3.799351
##$NOISF2= 2.8
##$NSP= 1
##$NTH_PI= 0
##$NZP= 0
##$OFFSET= 15.70392
##$PC= 1
##$PHC0= -24589.25
##$PHC1= 12.25273
##$PH_mod= 1
##$PKNL= yes
##$PPARMOD= 0
##$PSCAL= 0
##$PSIGN= 0
##$REVERSE= no
##$SF= 200.130013532006
##$SI= 16384
##$SIGF1= 3
##$SIGF2= 2
##$SINO= 400
##$SIOLD= 16384
##$SREGLST= <1H.CDCl3>
##$SSB= 0
##$STSI= 0
##$STSR= 0
##$SW_p= 3612.71676300578
##$SYMM= 0
##$S_DEV= 0
##$TDeff= 0
##$TDoff= 0
##$TI= <>
##$TILT= no
##$TM1= 0
##$TM2= 0
##$TOPLEV= 0
##$USERP1= <user>
##$USERP2= <user>
##$USERP3= <user>
##$USERP4= <user>
##$USERP5= <user>
##$WDW= 1
##$XDIM= 8192
##$YMAX_p= 0
##$YMIN_p= 0
$$ End of Bruker specific parameters
$$ ---------------------------------
##NTUPLES= NMR FID
##VAR_NAME=  TIME,          FID/REAL,        FID/IMAG
##SYMBOL=    X,             R,               I
##VAR_TYPE=  INDEPENDENT,   DEPENDENT,       DEPENDENT
##VAR_FORM=  AFFN,          ASDF,            ASDF
##VAR_DIM=   8192,          8192,            8192
##UNITS=     SECONDS,       ARBITRARY UNITS, ARBITRARY UNITS
##FACTOR=    0.0002768,     1,               1
##FIRST=     0,             0,               0
##LAST=      2.2672688,     0,               0
##MIN=       0,             -279758,         0
##MAX=       2.2672688,     249757,          0
$$ Real data points
##PAGE= N=1
##DATA TABLE= (X++(R..R)), XYDATA
0@%%%%%%%%%%%%%%%%Pj5J6j6J6j6J6k2L0l2L6m4M8n2O0o8P8q8R8j11J25j38J53
39H1j70J87k08K29k51K78l07L38l71M07m48M94n44O00o66P39q20R17j032J167
59F20j331J536j796K139k616L306m375O221r944J9918q9079k04357M01213O0602
73A82057l62974J20443K27161j96408n3179J81636p9482j05434J35941o789j28875
84h5903Q7725N9626j17858K2683Q4147o3348j8004N2147k5678m133L0782k8142
96e956o350L7310r997k3673J6695J0654k1545q113J2092k490n452n019o145K5756
110G767P365m1329J5156M0360l4399j5029L6860j3707j7170L1889j909l0037J8268
123D085K3690l2437j2706L8661j9312l9059M7496R333o0223L2119L9848n4571
$$ y = [0, 0, 0, 0, 0, 0, 0, 0, 0, 0, 0, 0, 0, 0, 0, 0, 0, 7, -8, 8, -8, 8, -8, 8, -14, 16, -16, 20, -24, 24, -28, 32, -36, 42, -46, 52, -59, 66, -72, 81, -89, 98, -110, 119, -132, 146, -161, 177, -194, 213, -235, 259, -285, 315, -351, 388, -432, 485, -547, 620, -711, 825, -971, 1168, -1448, 1858, -2517, 3704, -6240, 13678, -75401, -279758, 121455, 182057, -180917, -60474, 166687, -29721, -82900, 98736, 19254, -86180, 49761, 42972, -85903, 1822, 61448, -56410, -33727, 50420, -12928, -30932, 21215, -4463, -8596, 22186, -5956, -12306, 25004, 15007, -8666, 8029, 18683, -2862, -10975, 1117, -1373, -6825, -11844, -17989, 7767, 15132, -26197, -11041, 29319, -5080, -20109, 16751, 3044, -14126, 17763, 15854, -14183, 4085, 27775, -4662, -17368, 21293, 1981, -37078, 10418, 19751, -40472, -8353, 31495, -23076]
135b3076N326N0070m1973j6495O1045k1457n1677O0763K2045q2903K6162P3491
147F1321p8646l3517R3798l1319o7359P0795P863o8145M7145L2209o4796J4289
159a6362N4215m2419k2739N2080q961l8121L3554J0027l5031J7789R589k7803
171a4182J8090N126l2492K3585J3296l6452J6118K2650l0919O374K6239k2873
183e440m747K8566j3568j7595K9002j415l1860K2932J5826l8796Q841K7750l2968
196a3472j737L0581k5388q361L2157j3692j8581K5133N180k0769O596J7143j2624
209B166q403J8484m161j8111J5378N906k0559M503J0734j0744l246P424m2p494
223h165K846J1266q647p172J9699k756j6992J8096M723j9070R459P780j4282K237
$$ y = [-23076, -17750, 32320, -9653, -26148, 34897, 13440, -38237, 22526, 44571, -38332, -12170, 61321, -17325, -50842, 42956, 11637, -55722, 15073, 22936, -45209, 1936, 34145, -30651, -16362, 37853, -4566, -27305, 24775, 15814, -22307, 11247, 21274, -13757, 4032, 13621, -14182, 3908, 9034, -23458, 127, 13423, -23029, -6911, 15739, -15180, -8806, 17433, -5440, -10187, 18379, 4811, -12784, 16218, 14803, -17057, 5875, 21701, -17095, -8254, 19496, -13472, -15209, 15372, -10016, -18377, 13780, 88, -18493, 6640, 11820, -8949, -2353, 14790, 2166, -6237, 12247, 8086, -10025, 5353, 11259, -9300, -4797, 5937, -4807, -8053, -629, -671, -8165, -5319, 5947, -2700, -9872, 9827, 7071, -9921, 8175, 12898, -6172, 3287, 11067, -3215, -978]
237i78O931q728l804P441q59q730L212P510o675N34O245m446L379L584n443O886
253F059j747r009J5539k084j9901J5530O320k1626Q573J0259j8806J887J7795
266H789j3117j0614K0170J411j9781J4572J3193k3529N917K1539k0786l773K0944
279A4935j4905o657J6655j0646q715J2847m416q393P471J947o504K220O287j620
293E06k161L179j221L173M271j0233K183J1040j1164j430R956j2830J1J3026j5052
308f746m134J6636q485q324J3891j47r799O492O872o810p56Q611n547m180J1899
323I473n298j0621J1503k43j0780N918J56n175K600j563J802K589o745N098O845
338E559q351J987P414o492j46P487m302o052P016K853j1714J761J0426j3389m102
$$ y = [-978, 5953, -2775, -6579, 862, 3, -8727, -5515, 1995, -4680, -4146, 2099, -2347, 1032, 4616, -827, 6059, 4312, -4697, 10842, 8758, -11143, 4387, 10707, -10919, -2346, 7913, -10893, -9006, 8789, -4328, -14942, 5228, 6639, -13142, 1430, 14623, -8906, -2989, 18550, -2236, -6009, 14935, 30, -6627, 10028, -618, -9333, 3514, -902, -9295, -1824, 123, -6381, -4161, 2126, 506, -1655, 1524, 303, 3476, 7747, -2486, -303, 10737, -427, -1857, 8099, -4731, -4720, 8306, -6746, -10880, 5756, -2729, -11053, 2838, 2691, -7108, -616, 6256, -554, -1310, 7301, 1754, -2426, 9473, 4175, -6446, 5057, 4814, -5966, -48, 108, -5067, -2467, -4030, -2228, 361, -6384, -1286, 5559, -2792, -805, 6609, 117, -29, 7458, 3156, -2896, 4120, 6973, -4741, -2980, 7446, -5943, -10045]
353a0045J7255j0022j0847J8630k400j3087J3239L144j1105O340O185o018k356
366a087N403J815o246n24N091m234l284K228r45l78k438k13O127l703l203Q558
382B967l099k427Q601m944l123R637m112n173O415j685m103J718p24j321q97l25
398b595M49j423R62O04j117K845l59O62L380m262K034P459r942L06J1503j1878
414a372l005J3438j1009o824J5132o785j1996J4428J906j5693Q487J2547j5162
427e908j633K0223j1185j1772K2872m350k0290K0121M119k3528J2633R841k0618
440i475M102J3636j4060l896J4277m670r808J1157L731j1550O327Q316j1139L192
454A40R235j0720J283Q345r898J09O933q612P3N452o581n64N811m152k365O172
$$ y = [-10045, 7210, -2812, -13659, 4971, 2571, -10516, 2723, 5867, -5238, 1102, 7287, 1269, -1087, 4316, 6131, -115, -639, 4452, 218, -3066, -838, -1783, -2161, -4599, -4812, 1315, -2388, -5591, 2967, -132, -2559, 6042, 1098, -2025, 7612, 3500, -1673, 4742, 3057, -1046, 672, -52, -1373, -2270, -2595, -2146, -3569, -2607, -2003, -3120, -275, -634, 28, 3408, -854, 1180, 8639, -1303, -997, 10506, -1372, -4377, 9061, -1948, -8772, 6360, -425, -12421, 2007, 3913, -11780, -3293, 9254, -5908, -7541, 12682, 1497, -10275, 12597, 8247, -12043, 8078, 12197, -11331, 1302, 11143, -9475, -5373, 8263, -5797, -9693, 4584, -86, -9894, 1263, 4994, -6556, -229, 8087, -3052, 140, 9375, -1345, -62, 8283, -1615, -1506, 5427, -3185, -3112, 2340, -4241, -4805, 1006, -3146, -5511, 661]
470F61J182o274L813P772q341j647J2133o444p389J1792k992j0032Q737J844j0998
485f183K163P955o111o872R276L426j2119N247J1841j3613j0J7007j2181o963
499g137J8387n378j4113J3151M101j5933L928J1934j3142o143J6914o861j3466
512a3758J8088K36j8252J6296P319j9978R991J2655j6891J723J3812j0604m687
525d050J0917m989p770R087m94j1240P793N248j3689O086Q705j2961M688J0952
539H283j4342L408J3891j3676j092J4997j0387p244J4388l611j3190J0200N268
552F893j5483L295J2946j3648m694J8238p895j1218J7721j339j3369J2691M000
565H138j2604N707O746p984j867O488k790o294M983K724r265K206P071p613p46
$$ y = [661, 1843, -4431, -618, 7154, -1187, -2834, 9299, 2855, -4534, 7258, 4266, -5766, 2971, 4815, -6183, -4020, 3935, -2176, -9048, 228, 3654, -8465, -3218, 8623, -4990, -5000, 12007, -174, -7137, 11250, 5872, -8241, 4910, 9011, -6922, -2994, 8940, -4202, -10345, 6569, -292, -13758, 4330, 4566, -13686, 2610, 9929, -10049, -58, 12597, -4294, -2571, 11241, 637, -4050, 6867, 1878, -5892, 3195, 2701, -8539, -746, 4502, -9187, -3101, 5604, -7357, -2669, 8283, -6059, -2651, 11240, -2436, -3528, 11469, 1082, -6162, 8226, 4615, -8575, 1625, 6893, -8590, -5295, 7651, -5997, -10691, 7547, -348, -11566, 6155, 4816, -8553, 4138, 8138, -4466, 1241, 7987, 3, -1864, 4624, 1834, -4460, 523, 3247, -6018, -3812, 3259, -4354, -5100]
580e100P467m199j581N879j124j813K291J166k58j647J528M87l959K338L51m433
596b607K116J3l867M226j134m436O444m04n427O474J467n996M842M436n907j550
612a310P201k579p388P401J369j1818P238O333j5211M607J1030j4479R55J4375
626G724j1067m396J4749l555r939J0925L702j2750M986R955j2820k674J4099q947
640hq380J3828m815j0143J1955j227r209Q990J61o379P162J671o461M864L780
655E789o459N46O384n824l754Q997m526q241J0794j504j1640J0068K814j2814
669i370P551P092j0778K916Q418o630j455Q714l193o729P308K581j0801L673P946
684G243j0706j803J1172q041n690J0894k882p561P329K950o749J846P313l679
$$ y = [-5100, 2367, -1832, -3413, 2466, 1342, -471, 1820, 2986, 2728, 1081, 2609, 3096, -863, 1475, 1826, -2607, -491, -478, -4345, -119, -1253, -5689, 755, 351, -5076, 1398, 2865, -3131, 1711, 6147, 240, -1310, 5891, 3312, -4076, 3325, 4694, -7124, 114, 6447, -8764, -4157, 6873, -7606, -6651, 7724, -3343, -7739, 7010, 3455, -6484, 4441, 8143, -4607, 379, 10334, -2486, -5160, 8939, -8, -8388, 5440, 625, -9518, 2437, 1210, -7999, 991, 1152, -5227, 1935, 3606, -2855, 2009, 5789, -670, -124, 6260, 436, -3318, 5679, 1153, -7088, 3706, 2202, -9438, 630, 3444, -9370, -1819, 5273, -5505, -2589, 5829, -801, -2256, 6458, 3265, -3464, 3844, 6425, -4376, -703, 7243, -3463, -5266, 5906, -2135, -7825, 3069, 187, -7374, -45, 2905, -3844, -1998, 5315, 1636]
698A636m925Q211P88r319N596M924j0901K818P329r865m49Q325o365l731P334
713A406j234n946M850M088o141J136Q330o332k261R460n547n266R442l863o752
728d630Q547k691o888P271q61p133O045K024p031K555O831o615r00J0064m885
743A703p118J2328j230j2346J0956K984j4647P641P161j3913K673R540r804k632
757f704J0384m450o738R242K767j0275N173Q540r959j10J0428q203l391R289m670
772A323n244O479j619m742K958J195k789n53K741l5k524K227K251k365J875J201
788B379k296K243L71k342J748j037j572K343k352j538J862j302r01R58k31J099
804e68j530O01M244l560n06N408k932k200N713k409l978M023L51m609J045L084
$$ y = [1636, -3289, 4922, 5710, -3609, 1987, 6911, -3990, -1172, 6157, -3708, -4157, 4168, -2197, -5928, 1406, 172, -5774, -924, 3164, -2977, -1841, 6489, 157, -2104, 7356, 1809, -3457, 5985, 2122, -4630, 3917, 1226, -5662, 1609, 748, -6385, -340, 1684, -5347, -2792, 4039, -2576, -3476, 6588, 1703, -5415, 6913, 5683, -6663, 4293, 7277, -7370, 271, 7432, -6481, -3808, 5732, -4072, -6704, 3680, -770, -7508, 1734, 4501, -5774, -601, 7939, -2020, -2130, 8298, 95, -3296, 5993, 1323, -3921, 2558, 939, -3803, -845, 350, -2439, -2992, -251, -286, -2810, -583, 1668, -697, 1178, 2379, 83, 2326, 2697, 355, 2103, 1066, -506, 1837, -515, -2053, -191, -1493, -2394, -1436, -1667, -568, -2098, -1497, 2747, -813, -1319, 4089, 1157, -1043, 4670, 2261, -1717, 2306, 2657, -1952, -907, 2177]
820B177l816k749O049j724o714P215K699r332N670N977r114K722P411p073q07
835a409O963l429m428M705J79n182J092M159n199j912O067l601k454N762j952
850f39k361M700r20p77K699k080N70J857k688J391L33l032J133J230l127n43K226
867b8p26k589J542L072m331M73O082m215j658O778l085k723N242j430l484K783
883A703q2k066J58l10M89j286j168K086r67q63J899m34K73O70N45N95r07J388
901A723J829m461J532M416o260r24N951m977k573N491k907k821M115l00l426K444
917a148K618k573q76N073r66l882N026L72n249L370J140m523J916O43l042J215
933h86j33m73M41j226J012J409k309K068J445j314Q91J160k39p00k58J161o97
$$ y = [2177, -1639, -4388, 1661, -63, -6777, 438, 3137, -6195, -525, 5452, -3662, -940, 6471, -602, -1409, 5554, 2125, -2303, 2402, 2581, -2601, -1509, 2650, -2549, -4461, 1606, -1995, -4449, 1313, -639, -3000, 1700, 780, 3, 2702, 622, 1192, 3049, 361, 1752, 2085, -947, 186, 1416, -1711, -2254, -28, -754, -3343, -1801, 1271, -3060, -2587, 3495, -720, -2378, 4400, 1315, -1408, 3834, 2404, -1080, 1703, 1621, -445, -287, -597, -108, -1394, -2562, -476, -1443, -2306, -407, -841, -568, 102, 647, 1242, 335, 1723, 3552, -909, 623, 5039, -1221, -2145, 3806, -1171, -3744, 1747, -1160, -3981, 134, -166, -3592, -1148, 1470, -1103, -1979, 3094, 2128, -1754, 3272, 3644, -1605, 1765, 2905, -1618, 298, 941, -2101, -886, -1019, -1492, -1051, -2277, -1265, 144, -2165, -97, 1348, 34, 925, 2085, 1846, 1146, 888, 2049, 1352]
950A352k072K034j032k956L684j245l380L576l41k703K673J62j058J597J1Q87
966A189K12q90J790l49k040J798j57k515J050K88j276q35O84J466l227L75M545
983B108m334o39O400l784k251O903k401l856N274m50m436K369J545l621m83L142
999A486k299k991M493k50n020M478J414n111L943K164m180L066J826l491K244
1014A772J178l079R83O00k247M40N24j209p33J487m87k306L026P51m210L462K796
1031B748n685L531M036o139J831M717n527p20M538k640l168K706J004l716l77
1046b861M254k707k652N194j327l798N482J32l935L487J708k519MJ812l91k688
1062h05R45J873l595m56L915l403j863M683k311k260M137p29j988K240Q15o20
$$ y = [1352, -720, 1314, 282, -2674, 1010, -235, -3615, -39, -380, -3083, -410, -248, -1306, 291, 302, 1189, 1401, 511, 2301, 1952, -88, 1710, 1553, -962, 88, 376, -900, -1735, -1051, 415, -2812, -2437, 2108, -2226, -2865, 3535, -249, -2500, 4403, 2002, -1854, 3420, 2970, -1466, 903, 2448, -1173, -1656, 1486, -813, -3804, 689, 439, -4581, -103, 1311, -3800, 143, 2307, -1873, 1193, 3019, -472, 1772, 2950, -129, 854, 1454, -793, -353, 171, -1038, -1771, -284, -771, -3077, -51, 700, -3510, -48, 2748, -2937, 594, 4630, -1509, 322, 5039, -488, -1208, 3330, 690, -2478, 228, 1232, -2484, -2861, 1393, -1314, -3966, 1228, -99, -3897, 1585, 1717, -2218, 1269, 2977, 458, 462, 2274, 1883, -805, 140, 2013, -1582, -2038, 1877, -1526, -3389, 1294, -1017, -3277, 860, 131, -1857, 383, 1198, 578]
1078E78N4J235j91j366J211R9k481J747k22l201L101n91l693L729j50l636M110
1095C33P29m533L955K233m346J536M069l070k042M303p54m990M327J146p330L649
1111g85M643q591J400P227p207q25P498l906l085O051k19m518L608K702n066K55
1127h18N581m234l648O311j820n584N025k37m837M156L46l610K819J665k273N06
1143f52J956j34j094Q12J302j661K74J287k398Q6J703k705%J402k395Q42J257
1160a18j692P03J041n59L00M77Q30n42l81K516j640j943M487k186l863M249k22
1177A457m730K668J610m028J143K777k162j446L707K57m025L558K980n808J949
1192i3N224n929n43O010m930k455N238k457l725M098N2l602J836K547k942n44
$$ y = [578, 632, 1867, 1676, 310, 1521, 1620, -861, 886, 664, -2537, 564, -27, -3720, 9, -141, -3777, 333, 1062, -3471, 484, 2717, -1629, -93, 3976, 906, -1136, 3167, 2413, -2577, 1750, 2896, -4434, -785, 3858, -4733, -3333, 3894, -3313, -4138, 3360, -546, -3631, 2420, 2201, -2317, 1291, 3993, -1073, -818, 4763, 529, -3119, 3192, 1372, -4212, 813, 576, -4261, -105, 241, -3369, -550, 1115, -1158, -652, 1304, 1170, 76, 888, 2190, 529, 803, 2090, -308, -222, 1481, -1224, -1224, 178, -2217, -1375, -118, -1810, -1107, -66, -625, -325, 152, 982, 440, 59, 2575, 935, -1008, 3479, 1293, -2570, 1679, 1457, -3273, -605, 1005, -3023, -1880, 897, -1265, -2711, 996, 1253, -2772, 786, 3766, -2042, -93, 5131, -798, -1341, 4669, -261, -2716, 2522, 65, -3660, 438, 490, -3112, -1276, 1271, -1671, -2215]
1208b215M055j652j842M185p00l068M152p91l634L941o88l805K937l46k902K158
1224b15l49j456J308L47q84j11K374q32j588L048N31l102K552J251l827K316J090
1241B453m166J853J290l090N03J387j327q31N40J218r76m56K934j081j432L119
1257A938l61k094K635l61j934J439N8j416p06O16O39k054m22K686j901r47K895
1274G10j599q43L100j145p73K087j24o80N32p1l72p41J68K2j413R60J22j911J253
1293g18K21j634K173n35j489L249p66j427K943j222q52K518j418j651J869J53
1309A414k010m6J187j072j682J759L40k869K902J136m034L014K279l844J998K411
1325B883l128P16J800j851j56M14j48q26n76Q32r89m23J330j227m91J817p48K36
$$ y = [-2215, 1840, 188, -1654, 2531, 1831, -1237, 2915, 2124, -1510, 2431, 1743, -2062, 875, 529, -2373, -215, -564, -2020, -712, -365, -1249, -1360, 1014, 182, -1406, 1642, 2173, -929, 1623, 2874, -953, 1363, 2453, -1713, 140, 1430, -1660, -1157, 230, -1097, -1928, -1388, -170, -1146, -1602, 1332, 251, -1181, 1938, 1577, -517, 2118, 1757, -177, 1262, 1320, -96, -802, -186, 453, -1601, -2023, 663, -1238, -2185, 710, -889, -1732, 1368, 223, -550, 1537, 1413, 733, 1265, 1194, 822, 81, 249, 271, -1142, -182, -60, -1971, -718, -497, -2131, 42, -493, -1982, 1267, 501, -926, 2017, 795, -57, 2461, 1043, -608, 1261, 1414, -596, -642, 545, -527, -2209, -450, -110, -2979, -77, 1059, -2975, 39, 2318, -1526, 472, 2883, -245, 471, 2271, 420, 264, 678, 530, -296, -872, -40, -1029, -1452, -122, -1349, -1840, -23, -771, -535]
1343e35J127j264J773Q41k505J685J171k372J070N31k236Q51R0j594L53P40m57
1360g31p93J88J217n94n54K445j275o77K604p42j112K118j169o35O51r15N47n57
1378A6j213J346r22r85J482p94p54J760q4n32J012J75M4k9P97J59j222N14J424
1397B194k919N33J445k502L36J577k625N55J415j421N64M95j4L26M05J46M32l97
1415E45K97K29m89N85m73j136J105j288j09Q75j751N27J549k633J251J996k222
1432a142M51K081j428O5J304j2n65n9O09q18q61J500q95k154K390q48j688K255
1450A85q72q83J653m93k22J314o72R20K76j118R85O16j810R01J71j111j5K36l25
1469b64p86M9P98r63m85K287j379o20K733j272j080K940q01j047J521n41p26J87
$$ y = [-535, 592, -672, 1101, 1942, -563, 1122, 2293, -79, 991, 1522, -714, 137, 227, -1367, -1014, -274, -731, -1524, -1336, -119, -713, -1267, 1178, -97, -774, 1830, 1088, -24, 2094, 925, 290, 941, 26, 573, 16, -1197, 149, -773, -1758, -276, -1070, -1824, -64, -148, -680, 332, 507, 551, 522, 1319, 1478, 256, 770, 2194, -725, -192, 1253, -1249, -913, 664, -1961, -1406, 9, -1412, -848, -353, -367, -41, 364, 510, 942, 545, 842, 1071, 582, 1167, 694, -442, 663, -625, -734, 141, -1610, -1083, 466, -2167, -916, 1080, -1142, -691, 1390, -38, 27, 1331, 1319, 754, 695, 1304, 486, -375, 1125, 230, -1924, 466, -382, -2070, 185, -687, -1570, 83, -410, -632, 682, 10, 930, 1206, 88, 1073, 1689, -121, 780, 951, -160, -175, 61, -264, -1050, -1001, -203, -1166, -1651, 636, -743, -1363, 1370, 98, -982, 1958, 1157, 110, 1631, 1090, 364, 551]
1487E51L5p86k22L01l4j413O67P82j684J208P53j028R93O88j207J131K18n93J130
1506A490q95k87J067j208n12P44q85l69J34k15j23J08K85M94q36R59Q16j369J322
1525G20O39j273Q72N06j510Q18j05m72j51q28L27K99j435O82Q55j538J238Q51
1543D95j175K94J225l40r3L07O57o47q79K124j519j114J796r51j891J884o67j541
1561b035J926k71j464J483J22mJ38N51M26o37N94O28j157K60P78j879O52O49j978
1580a218Q02K75j691J469L5j528J764J10j050J653j74o56R41L68n81R0K81L05
1598A195j138M02N87k281M75J339k158L37J433j510M47J232n47n5O20p5L11n71
1616D3N98Q07j315N99M34j501P2R77j520kK43k01kk30O54L1o40J344L07j179J361
$$ y = [551, 586, -200, -422, -121, -155, -1568, -901, -119, -1803, -595, 158, -870, 123, 811, -396, 735, 953, 360, 1490, 595, 308, 1375, 167, -345, 399, -486, -855, -721, -936, -1059, -951, -666, -172, -1008, -49, 767, -602, 720, 1359, 86, 958, 1464, -46, 772, 667, 195, 44, -784, -457, -158, -1593, -911, -56, -1594, -356, 495, -680, -386, 839, 499, 406, 713, 1370, 723, -156, 1968, 449, -665, 1131, 180, -1711, 173, -494, -2035, -109, -380, -1844, -361, -239, -243, -105, 446, 872, 235, 829, 1457, 300, 560, 1338, -541, 111, 760, -1218, -416, -141, -1832, -363, -328, -1856, -92, 18, -1032, 621, 447, -209, 732, 1100, 519, 609, 890, 1195, 57, 459, 1046, -1235, -760, 579, -1579, -1242, 191, -1319, -872, 360, -187, -242, 378, 303, 614, 43, 641, 1448, 133, 732, 1166, -335, -263, 714, -806, -808, -565, -766, -768, -998, -344, -313, -953, 391, 698, -481, 880]
1637H80N59j868J321O04j467M26K63n80j77m21J51r8p45M92J08r63J392O2o82
1656g43J240l81L22O14r99P57J81j332J132R8j649R74L1j671J239j04j101K04
1674a188L64L28m18N56R49q57M80J098j252k46J995j627j84J297j169l49Q68j257
1692f12k70K35k20N21l20Q8K79p8L80M20k3K68p6N3R08j366K69Q38j491p3J157
1713H87j573l54J627j708j23J157q48P8Q55R6k52K26Q61k46m51R22K6j386J362
1732A156N7j666P05P4j492P80O8q21N35l02O29N4p23J296R5q82J274L73r31N73
1752H52o6j61j95r7j44k56o99Q30o88n86J326j006q7J167o66p9J316o02J39P43
1772A041n89L88J2p05O47n16n21J99k13j94J9l02K60k70j72J030r21k94J976q63
$$ y = [880, 1439, -429, 892, 1496, 29, 455, 718, 138, -39, -460, -309, -407, -1152, -660, -552, -1515, -123, -61, -743, 497, 116, 438, 1052, 53, 810, 991, -341, 791, 889, -760, 214, 245, -1426, -187, -291, -1392, -1188, -824, -496, -914, -358, 591, -266, 214, 1312, 60, -186, 1809, 182, -2, 1295, 126, -223, 645, -612, -882, -647, -867, -346, -666, -578, -299, -377, 3, 423, 400, 668, 592, 645, 1553, 187, 456, 1294, -197, -270, 887, -686, -1040, 587, -1121, -1244, -87, -935, -857, -2, 94, -158, 68, 929, 683, 232, 1154, 1180, -206, 1156, 1213, -453, 252, 326, -1166, -386, -318, -1139, -604, -906, -277, -223, -946, 350, 445, -437, 837, 1210, 279, 852, 786, 625, 430, 333, 189, -67, -766, 64, -624, -1210, 116, -890, -977, 190, -476, -555, 761, 159, 298, 1041, 452, 840, 852, 147, 794, 278, -243, -44, -257, -451, -432, -734, -474, -744, -916, 114, -807, -1101, 875, 12]
1792A2o21K225j196j021K000n13j370J474n16r49k8M43l05q49Q97M76j656J112
1810c85P90j681J201R05j151Q89N56p96L85l8l77K90l69p4J35j121P20j6j170
1829a307O41K37m29M56J46K0P72o75R95k0j053J377J19j395P96j21q50O68m29
1848e2q51N89n15J92n5k53O25K40n46R75Lm24Q76l35L53l5m84L74j55j198J278
1869F02o65j083J394q55j058J595l19j072J606M0p20L48Q37J44r49O04O03q57
1887A95J96J036j721O7R81j440l3P74q23q6N78o95P13Q5k82R65m00R3P60n57n4
1908C52O20l00nl36m33M67o93m18O73j256N32P69j174N48J126j263O44P14o66
1927i9P54J50l13L18k02qJ29j028M11k47n05M94j98n38P24n40P6L11l89N99O54
$$ y = [12, -609, 1616, 420, -601, 1399, 886, -484, 990, 474, -475, -503, -60, -365, -1214, -317, 159, -1497, -385, 405, -1276, -75, 830, -321, 568, 1124, 328, 713, 675, 298, 588, 219, 145, 280, -841, -121, -137, -1307, -666, -429, -858, -402, -256, -236, 536, -139, 856, 836, -217, 1160, 1279, -116, 680, 559, -291, 377, -52, -903, -314, -829, -637, -692, -945, -320, -80, -626, 349, 352, -72, 804, 469, 822, 787, 303, 677, 522, -676, 602, -63, -1146, 248, -607, -1665, -70, -389, -1461, 145, 185, -535, -187, 650, 794, -155, 449, 1052, 195, 391, 1427, -294, -227, 754, -686, -719, 55, -768, -854, -276, -971, -258, -173, -455, 510, 110, 203, 963, 406, 352, 972, 672, 667, 331, -102, 365, -328, -746, -73, -1329, -797, -28, -1202, -654, 472, -791, -147, 567, -99, 655, 805, 492, 810, 608, 600, 729, -299, 112, -135, -640, -146, -344, -882, -158, -698, -622, -311, -700, -101, 553]
1948E53r21P91N19j070Q66K77j354Q14k5p87L31j25k74l03j27P74n85j21J115
1967C48q43k71J639p47l80J492o51m25J184j100K93J64j049M82k94m26N14l88
1985d58m67N51j26l42O01j61M07P2j47J032p28J34R88j052k54J076j191l90O00
2004A45m51n20P64o45J28m4J38K73k07N81N1k41P89J93p94N61K39n15J36k80m15
2025a14N39q76o8M31r56L62L56m03L18N26o78M92O48l61L09l8M27l91m58R44n25
2046D84j053Q76k58j077J002n59n39Q38m71K19M09k80N53J81l21O28q0m78P10
2065G84m1m57J97k80j53N2o17K64k14p26J182o97l67J433n32p10J732j016O1R71
2085H66m44k3M43l44j58l37J02Kp23K03K31q51O05K39o25K15L30p25J375j10j76
$$ y = [553, -368, 423, 942, -128, 738, 1015, -339, 475, 450, -337, -6, -131, -405, -708, -835, -61, -646, -767, 348, -495, -766, 873, 126, -254, 1238, 587, 162, 1346, 246, 539, 703, -346, 136, -158, -584, -70, -458, -925, -374, -500, -842, -241, -402, 5, 77, -70, 962, 234, 368, 1356, 304, 50, 1126, -65, -455, 145, -306, -826, -62, -707, -579, -623, -485, -212, -419, 162, 213, -28, 761, 954, 160, 721, 960, 445, 581, 301, -114, 425, -451, -519, -88, -1044, -682, -326, -729, -411, 115, -563, -71, 577, 216, 525, 487, 914, 523, 65, 1009, 484, -569, 307, 49, -1028, -26, -585, -1124, -286, -757, -538, -129, -409, 144, 325, 4, 632, 552, 74, 784, 743, 286, 483, 203, 50, 102, -515, -251, -465, -1191, -9, -706, -1073, 360, -172, -882, 850, -166, -105, 866, 422, 399, 842, 498, 340, 3, 105, 107, -616, -413, -182, -1033, -428, -189, -814, -599, -269, -994, 381, 271, 95]
2106I5R92n24k15O78n28k00N57o82l40J91p06M53l24P2J79n00M93L28n88O71N28
2127F30q19O71M91j172J074j82l66K66l28l20J66o46L19qr46O73J09m31Q39j14
2147i4M7K18J36K6K01m20O39j73p68J010k33j324R35n6r55N78k16o07P80m9j39
2168d64L89k48N61j34PR31o74r1R86r30o2L51q87K21K58j209J123k82r30J109
2188B5l45o54P31K04m58P52r0L43n1k4J23l15k76Q32j046J21M94j324J93J023
2208B58j282K63P80q37M48J89KM80k90J66K11P5J06J76n86L38j78r26Q80n48k04
2229d79M77r05L79N54p98J28Q36p69M71M52m54N66J46l28L10m93K38o6m93M44
2249B16j64p91N08M9o56N64j8m97R92j86j74N63o5L3K87p72Q57j56o89R46m94
$$ y = [95, 1087, 563, 348, 1026, 498, 298, 855, 173, -167, 24, -682, -229, -553, -481, -302, -802, -309, 19, -569, 102, 630, -189, 482, 973, -199, 875, 693, 327, 593, 265, -55, 111, -535, -216, -224, -1170, -497, -388, -819, 20, -94, -47, 171, 307, 333, 534, 114, 753, 580, -188, 822, 589, -735, 200, 144, -811, -233, -449, -1056, -276, -325, -464, -75, -323, 238, 104, 111, 1042, 368, 277, 1263, 333, 271, 622, -265, -44, 214, -995, 128, -154, -1084, 25, -320, -974, -243, -39, -497, 255, 165, 508, 457, 433, 556, 241, -35, 797, -249, -128, 366, -958, -765, 258, -1024, -761, 19, -818, -370, -181, -179, 301, 11, 177, 388, 463, 569, 745, 159, 497, 319, -607, 273, -275, -479, -2, -907, -528, 26, -772, -644, 192, -577, -106, 346, -108, 458, 604, 276, 586, 93, 331, 265, -228, 216, 52, -739, -231, -182, -838, -274, -292, -789, 203, 17, -157, 406, 341, 374, 661, -111, 746, 590, -99, 847, 353]
2270C53j018J045m16p33L78j00j63J84m0L79l79L04Q82r03K18P59n64J16O33r38
2290cJ25P24j142K21L57r99N33l29j89O74p15M30L7j08N54p8j82R09k73k92J063
2311A317j117j77P68q35l85P38p56j99O08m48m20M31L30k58J42M55J34q22J221
2330G27K08j351R23L33j327J263k98r41N62L3n89kj6j26L21l49O39J57p81J126
2350E12j71m30J191p21l90P84r14N03R3n69L80l83o76P03l33k69N48l32P1M54
2370E1l77L15N99r04P19J97n24L38K46o28L67j44m49J89m49M23l82j36L45k71
2390d75k56J162n34n57J423n55m19J141p33m00J060o03p0j51K1m53J24L1M1p51
2410i54N23K65r00R49M36j079Q47N59n62O03l31j05M02m90K01j02j50j13n1m94
$$ y = [353, -665, 380, -36, -769, -391, -491, -654, -470, -510, -131, -510, -206, 676, -227, -9, 750, 186, 302, 935, -3, 122, 846, -296, -75, 282, -717, -184, -513, -702, -28, -743, -313, -276, -384, 170, 92, -90, 819, 546, 254, 1317, 200, 23, 791, -44, -429, 309, -447, -646, -38, -486, -906, -475, -145, -403, -261, 194, 328, -494, 727, 935, -416, 507, 840, -487, 776, 478, -463, 99, 132, -457, -459, -475, -601, -280, -629, 10, 167, -614, 512, 341, -89, 1102, 381, -9, 775, -139, 364, 457, -112, 268, -115, -791, -88, -421, -690, -142, -474, -403, 51, -326, -11, 588, -316, 403, 600, 76, 414, 660, 32, 399, 255, -194, -5, -454, -31, -413, -549, -204, -475, -731, 431, -103, -660, 763, 208, -211, 930, 197, -203, 857, 254, 184, 33, 54, -399, -275, -244, -203, -954, -431, -166, -1066, -117, 319, -760, 87, 646, 84, 687, 356, 251, 653, 163, 364, 262, 112, -1, -52, -546]
2430e46L39r5k41M36l87p7Q04l35j42R08p47L72L43m99L75J8n16O44m05m84K93
2451E8k19j24Q0o05L66Q9n24Q10P7m87Q88k86J07J78o5J03K15n71K77k3n11L33
2473A66m16q17R14j48k67O04m33J68M6J1L37K03k39M36l46J01N95p24k43P89q97
2494a60j4M58r34M63K82q94N34K1l29O83k21J72K61k29J91J31%J93k50k46L46
2515D58n22p0L13l89o7K74q14j0R30q61P98R9k67L24J81k49L08m1q3L15o36O81
2537F72l26o22M75k00o35L10j00j10L46l91K03N69n36M82Qk66O41j00m92N39L17
2558G84n42q9J8j03j06j66J71p10q5P78l65q5O81k47k20Q34m19K60L57o12M19
2579E53L3l44J22l45l41L05j1k77N5m50P9M16l95O92j1m49M76J97m16P76r4k50
$$ y = [-546, -207, -302, -543, -107, -494, -571, 233, -102, -244, 664, -83, 289, 632, 133, 508, 526, 10, 654, 249, -235, 58, -161, -285, -205, -810, -444, -355, -879, -69, 8, -479, 409, 123, 230, 408, 343, 446, 661, 90, 367, 344, -167, 166, -250, -1067, -153, -301, -568, 36, -397, -229, -183, -172, 165, 368, 129, 565, 219, 320, 915, 191, -52, 737, -160, -174, 284, -650, -187, 95, -799, -265, -244, -573, 110, -111, 61, 322, 93, 284, 415, 415, 608, 358, 112, 458, -64, -134, 179, -210, -277, -3, -817, -827, 103, -758, 40, 139, -128, 196, 377, 128, 436, 395, 312, 627, -9, 672, 346, -276, 199, -1, -636, -326, -426, -536, -190, -581, -378, 191, -345, 137, 145, -121, 520, 420, -72, 467, 784, 242, 153, 171, 68, -38, -204, -33, -743, -828, -50, -415, -500, 181, -66, -286, 548, 129, 389, 746, 134, 553, 586, 242, 364, 19, -322, -17, -28, -305, -250, -700, -621, -205, -600, 92, 81, -368, 108, 305, -111, 665, 571, 321]
2601C21O38q98K60J13q48M48P2n75J40j66j42N52m32K59K59l12J76N77k92J02
2621B52K11m89N59j57j61L42m43J33k41o76M78j09n32M87M05p09N52J43j98M39
2641B86J29j80K55j09K95k84k11K60k02l67L82l25q29O11l06J19M35m01P9P3L7
2662b53M75N1k25L54J13kq7k33K15j00p41N77j29n50M11kp55R11l05j12K84j28
2684b31n5P56j11J29k27K33J18m77K3L02l09j77N06j104J33N07p96L95M56l60
2704b89PK26K6K6K03r5L01l34L17J46o46L34K2n01L82l7p98O30j37m54N69k87
2726c89J63R7j09M09J58o1K32k61l20Q20n93j51M69r17J43L90m24k6J82n19L16
2747c91k2QJ60k3M22J08m99Q33m6p98Q35mo89N93q1r29N56P5n99K22k1k07J77
$$ y = [321, 959, 61, 321, 434, -414, 34, 106, -469, -329, -495, -637, -85, -517, -258, 1, -311, -135, 442, 150, 252, 463, -26, 533, 376, 215, 557, 114, 247, 6, -670, -192, -301, -833, -346, 59, -650, -98, 45, -153, 286, 415, 235, 490, 381, 676, 392, 181, 441, 239, -128, 254, -71, -900, -289, -595, -476, -41, -442, -363, -290, -253, 222, 273, 48, 402, 515, 513, 426, 193, 408, 308, -433, 144, 15, -535, -124, -126, -881, 30, -275, -387, -103, -231, -286, 470, 359, 488, 261, 494, 612, 135, 158, 460, 151, -26, 480, -624, -491, 16, -780, -385, 71, -289, -282, -56, -30, -4, 199, 104, 405, 71, 388, 534, -112, 222, 244, -257, 125, 88, -710, -80, -217, -671, -102, -389, -226, -129, -238, 171, 329, 268, 500, 239, -81, 739, 146, -5, 464, -453, -310, 80, -344, -370, -188, -707, -391, -413, -405, -245, -268, 154, 262, -237, 596, 550, -248, 587, 583, -106, 487, 406, -523, 33, 108, -491, -269, -290, -497, -320]
2770c20k26P68m02Q1L22j31l5M76n97K63Q09p72l70M90n81K0L73o13K64k89K00
2791b70j27r9M32k15K05N35k8n46K99O5m11R98o09k73O03n35l12N34l52n13J69
2812d50J26O0o0N9K61k38L98N81q18K53M77o45J86L88m14j11M19l69j52j30k27
2833d06r4J05J03k35k4N56q0l04P15J41p24Q21j09o72P47j64l75J06k7K01m38
2854a57j3K1k23l1M11n46J76P59o91J56N28k66K92K62o29K88O3l0j73l4j04q7
2876b8l80L32j40n33N67k58l78J115j00m85P43m58N3O86m67J76k26L5k64K76k45
2897B1K13n07J9P7n43N96J19n70L79M55n61K63M04m96L03J72MM8p7j91J69n63
2919b66Q0l1k66K50J72n71Q09n82n6O07m19L6M76k27L60J37k17K25k46k13K64
$$ y = [-320, -546, 222, -180, -99, 223, 92, 57, 533, -64, 199, 1008, 236, -134, 356, -225, -205, 168, -445, -181, -470, -270, -397, -496, -64, -279, -74, 461, 433, -113, 186, 251, -160, 838, 229, -44, 559, 24, -288, 246, -106, -619, -450, -324, -264, -324, -265, -4, -242, 156, 737, -81, 172, 649, 4, 190, 578, 164, 53, 472, 103, -49, -179, -406, -500, -395, -292, -527, -551, 5, -75, -379, 336, 477, -247, 574, 465, -207, 540, 376, 1, 107, 80, 281, -157, -170, -149, -372, -403, 8, -538, -362, 397, -294, -138, 390, 124, 416, 678, 49, 337, 400, 370, 197, 163, 59, -28, -408, -76, -216, -749, -182, -440, -818, 297, 197, -288, 455, -3, 50, 736, 269, 445, 219, 254, -10, 266, 21, 234, -273, -254, -177, -720, -124, -5, -575, -196, 259, -302, -39, 365, -131, 172, 344, 348, 396, 319, 128, 297, -266, -186, -217, -483, -233, -61, -632, 177, -405, -461, 146, -273, -237, 239, 12, 372, 509, 292, 517, 271, 58, 322]
2940C22l03j54j0m70L86K50m39J08L50o49M20K68m22N20J15k77K93k29L18M0l35
2961A02J99o00kL78l16l79N55j57l98P83l60J08N1l8L29m4P0K18m39J86J5j78
2983H3J07L05q84J29M01o61K27P0m33M62k14N7N14j27r6K75n2j48L86k26K15k05
3005A85q3K77k45l83L64n11M2K81n48L29L83k84L4K44l7J80j08K17R7l13M92j05
3027E08n72L70R8r69M05K37n70K32j84k57L18j1J75L41l30J30M93m89L81n8j98
3048E0L84j77k16O19p00l15O34o00P0O3l89M49k11rN93m26J14N51m92L73K26n13
3070G8P2J58j01J76k13n22M65m01n3L55n28m9N32k98L54j44m7O56l85j05M48l3
3092D15k44J43m31L72o3m71J41J15n92L91k8J6J22m94M07L87l69N52Oj37M79l19
$$ y = [322, 19, -135, -145, -615, -229, 21, -418, -310, 40, -609, -189, 79, -343, 177, 292, 15, 308, 79, 397, 437, 102, 301, -299, -301, 77, -239, -618, -63, -220, -618, 165, -195, -87, -36, -74, 255, 211, 281, 499, 60, 246, 261, 83, 190, 495, -389, -260, 141, -520, -293, -223, -656, -194, -408, -351, 163, 36, -60, 215, 163, 15, 401, 175, 390, 185, 102, 379, 134, -249, 115, -396, -354, -73, -621, -292, 91, -193, -159, 85, 48, 228, 120, 337, 434, 121, 613, 508, -64, 306, 404, -565, -160, 77, -493, -261, -445, -702, -384, -395, -220, 121, -209, -79, 414, -75, 306, 248, 50, 434, 257, 41, 660, -40, -355, 279, -321, -251, -188, -577, -128, -339, -348, 245, -181, -67, 484, -8, 365, 591, 78, 150, 308, 207, 383, 170, -352, 113, -288, -341, 14, -514, -563, -31, -329, 25, -119, -166, 490, 105, 0, 448, 415, 171, 314, -117, 255, 192, -279, -138, -23, -615, -224, -252, -236, -114, -608, -201, 186, -183, 369, 375, 238, 717, 398]
3114C98l26K37l89k0L46j54n17L45m10L19L18o00K58ql37O67k62K9N42Q1k46M38
3136G09n63K93Mn31M13j84j75N6L5p39O62l29K0K95m57L63L32k51m1K88r7L16
3158D19j64q5K80n30J12J43l02K17o2n45M54k03j46L63k32j02M74r8k4K06K96
3179D71o8P2l14P8Nk79N65m46n39O49n59P0J39m52L37K60m03O28j44j33K81m21
3201b03N83j12o4J34J43o04J28J10k67Q4l6m11M18k44Q7J18K1j07K20r1K64J84
3223C55k73L86l14RN24k81m97K07k17J13K9l13N3q2k00L83j37r8N78k77J9K33
3245B00j28N36K4r35N27J66o19L65k45k54L80j04m41M27l1k09K45k63L13p7p0
3266a93M89o9P8L23m68r8L10k16k14K78l60j3K20m04J58j13q0J45j02K28K92n32
$$ y = [398, 72, 309, -80, -100, 246, 92, -425, -80, -490, -171, 147, -453, -195, -203, -540, 127, -135, -106, 436, 517, 271, 709, 146, 439, 443, -88, 325, 141, -34, 22, 57, -682, -20, -349, -329, -34, -491, -128, 204, -47, -88, 200, 103, 419, 255, 170, 450, -80, 32, 175, -127, 90, 28, -517, -63, -266, -412, -49, -281, -383, 91, -7, -31, 175, 471, 403, 475, 161, 239, 244, -35, 530, 84, -455, 194, -365, -295, -156, -608, -271, -11, -414, 214, 70, -63, 218, -203, 380, 268, 204, 338, 481, -123, 5, 115, -152, -68, -104, -515, -97, -341, -254, -136, -115, -222, -2, -93, 171, 355, 82, 468, 154, 163, 687, 406, -91, 116, -101, 12, 41, -272, -219, -301, -501, -118, -255, -353, 225, -52, -33, 200, 72, 608, 632, -303, 224, 390, -229, 136, -109, -363, 17, -87, -528, -101, -132, -341, -96, -359, -46, -123, -193, 296, 227, 305, 628, 160, 62, 372, 156, -58, 220, -140, -153, 67, -337, -179, -292, -372, -227, -329, -101, 191, -341]
3288c41M28M09o02L13J56l80K15J46k40P6j27l21K01j12M8n2l21K22K5K18M19
3309C80l99O0N10m91Q1M57m21l5J25k28J31q4j89j6ol11L69n48L28K98m82L81
3331i0K68k16N60j29o51P29k75j60M47n31M40l60k25J34l6r5K98n27J52P05q56
3352d18L25J65l57M44L45m90K03M56q23N15J03l60J16k74j9N0l50M44l76n3K57
3373i7n6l84N34J45k77N75k15J3J1j00M3K28l56J5j94j61L32l77J23K83n06N1
3395c70M73n92L19M12k22M10j52J67k24J39k57P0o2j82L37k61P2k05m83M40k53
3416d24j35M35k19J44L12q0k43N42l22j8N67l85M8n2k66M19l72q0M36p08J14J13
3438a74l30L33J18k13J62M15o43N28K0J3j22J97l6M0n42N70k99m85L89j07l32
$$ y = [-341, 87, 496, -106, 207, 363, -17, 198, 344, 104, 180, 53, -268, -67, -179, -131, -183, -504, -282, -257, -39, 380, -19, 41, 551, 60, 141, 598, 177, 142, 267, 39, 170, 86, -103, -119, -125, -436, -67, -615, -287, 11, -471, -90, 178, -38, 522, 393, -258, 471, 196, 36, 483, -48, 392, 32, -193, -59, -95, -190, 108, -419, -267, 438, -418, -93, 72, -285, 159, 504, 14, 217, 673, -150, 365, 468, 108, 224, -50, -69, -19, -369, 75, -301, -354, -97, -153, -537, -3, 142, -135, 440, 225, 238, 249, 149, 192, 420, 64, 79, -115, -276, 56, -321, -198, 85, -421, -370, 103, -489, -170, 242, 20, 430, 278, 445, 221, 360, 103, 173, 111, -71, 266, 5, 77, -128, -611, -171, -424, -559, -124, -343, -199, 113, 33, -210, 332, 10, -8, 559, 174, 222, 170, -96, 323, -49, -129, 307, -401, -287, -174, -504, -171, -53, -266, -104, 311, -332, 196, 216, 229, 107, 304, 268, 308, -234, 336, 37, -448, -59, -166, -498]
3459d98L31j89k60N91k66q5L03L7Q2J40k51L64l9j98N23l95l76M27n01J34L55
3480B29n71L02m5m93M27qN7J66p4j08L62O2M6q3k9R0n9n05N24k41k99L61j38p70
3504g97M06l6K73m7Mk76L65r8O94m02J18K49n2k19K42n64K52J60n66L57k33k12
3526c82J01K69k85J82J12k72M93k01L61j37j61J84J08l52J89o5j69K36l24j11
3546b24J48l02k10L38P0q7J86l04O76k47J29j89J0N01J07k28k34J3j01o9L72m87
3568a32PQ9k36L9N8k50L43k36M60j71k30N63o7l65P55n90K3L38n03J06K59n27
3590b67K77J7k21q4p8J49N6n9J48J68j22L0N13l50O4P4q8K74m19j66K32j49k24
3613b25K98k85M5R1o6K4Jm79O51j5O6J58k43J59q5k3O3P2k55M24m49J71j45j76
$$ y = [-498, -167, -356, -616, -25, -291, -376, -73, -36, 46, 186, -65, 299, 260, 62, 585, 190, -186, 241, -260, -126, 229, -342, -40, -85, -578, -151, -159, -102, 64, -10, -118, 244, 306, 352, 269, 240, 330, 271, -234, 290, 49, -250, 111, -27, -797, -391, -427, -154, -201, -197, -473, -108, -206, 488, 86, 204, 453, 401, 182, 424, -140, 112, 272, -294, 63, -170, -382, -281, -12, -297, -115, -3, -275, 218, 17, 378, 241, 80, 264, 372, 20, 209, 144, -25, 211, -113, -224, -76, -378, -588, -250, -180, -267, -81, -385, 291, 44, 173, -16, -6, 495, 602, 374, 140, 153, 52, -17, 355, -132, -125, -36, -272, -233, -175, -425, -82, -318, 142, -29, -259, 304, 237, -128, 627, 37, 60, 398, -105, 1, 260, -267, 10, 27, -194, -278, -356, -207, -151, -210, -62, 106, -16, 14, 527, 177, 241, 315, 227, 501, 82, -84, 148, -1, -225, 73, -212, -167, -76, -142, -118, -117, -596, 55, 40, 106, 264, 21, 180, 95, 72, 135, 207, -48, 376, -73, 98, -47, -223]
3637b23L1K27k58j41L27l32K56M28o25O59K9k83J58ll11N11n12r0N19p09J38J98
3659fk02k34M88n26M77K0j91M84j68R6r7J82j5k77j75K63p4j08J12j13j50J37
3681g7k75M05l50K15j97k9Q2M66m69K18M29l39j2N08l63j32L78m92L40m17J52
3702D1k06r3K15j42n1N4J52j11L23k62r4J86K03k9M04l03m36N83l93m20L76k57
3724b60K9L36n32J69r3P7K13j54q5N05k41j47N57j98n7L02k69P8mn54L08rj73
3747b02J86l2j19L7L1R0R0l94K86lj87N23j89q8J92j34j78M04j26J65k79o0l55
3770c42J18K1K7N2J44k6k22k20J47L95k02M49n63L25L69l17rm9l34J55O9p0m73
3793e56M17J29k6j87o0N7NK18K26j86L11j83j9J11k07M8O9j48M7k36L4J0k31N3
$$ y = [-223, -192, 35, -223, -364, -37, -369, -113, 315, -310, 349, 378, 95, 253, 250, -61, 450, -62, -152, 367, -342, -204, -6, -208, -442, 46, -480, -3, 17, -174, 310, 142, 238, 141, 323, 308, 31, -144, 119, 45, -63, 49, -64, -214, -77, -352, 53, -297, -82, -279, -308, -226, 240, -229, -11, 418, 79, 67, 575, 212, 80, 458, -34, 306, -111, 41, -165, -258, -43, -185, -236, -182, -30, -141, 182, -80, -174, 12, 215, 186, 590, 287, -149, 434, 41, -379, -3, -260, -231, 105, -427, -258, -351, -274, -61, -215, -300, 205, -36, -183, 374, 176, 119, 421, 152, 230, 226, -328, -20, -29, -202, -16, -48, -167, -130, -99, -9, 81, -313, -27, -30, -217, 306, 117, 29, 221, 87, -91, 313, 187, 352, 73, 13, -342, -224, -203, -176, -124, 20, -6, -228, -448, -301, 94, -108, 341, -222, 103, 472, 155, 146, 97, -237, -82, -13, -83, -556, -139, -10, -36, -223, -283, -226, -221, -3, 223, 37, 348, 165, 146, 257, 50, 98, 167, 19, 66, -170, -136, -126, -357, -304]
3817c04L23l64j80M31o7L98j43k37K84J04m61K07K35k58K43J90m15k46k9K18L3
3838c8k39L01r5j93K28k39J34M29k89p6K54j72k4M37j93j7k42J29K33m28l7N4
3860h3j91j05L05k30J67K49j97K18j17rR8J41m2j61k9J87J5m00K24k3k55K56j61
3883a43r1K67k91N4L70mk34K46m1k2M3Q3m0rK10N6n23N3j02L7N1J05m75P0L80
3908E0m58N13n10K63N1J45j21L17n18N61Rk61J99j52j86K33l29J49M7k02P6R1
3930c3k09o9J54J86k31L23l1L0J44j59K8J2n7J14o4o4J27o17M04k8o20N10J17
3953c3k06N2l45O24J14j25K9M9j72j8J09j28N39p34K71R0l80K43J28k79O5L6K41
3976A70k53K67q0K1q5j29M46k21J83Pl97J29q6j91K86j99K1j05n3J56q1K50l73
$$ y = [-304, 19, -345, -525, -94, -161, 237, 94, -143, 141, 245, -216, -9, 226, -32, 211, 401, -14, -260, -289, -71, -38, -277, 24, -71, -264, -36, -275, -141, 288, -1, -77, 177, 5, -19, 418, 225, 208, -34, 95, 328, -100, -137, -83, -274, -379, -74, -304, -137, 112, -85, 133, 16, 7, 105, 246, 204, 43, 14, 201, 216, -184, 40, 17, -238, 18, -143, -234, 33, -258, -204, 166, 162, -72, 174, 133, 111, 154, 237, 197, 188, 398, 454, -69, -16, -118, -81, -30, 75, -400, -330, 50, -408, 105, -405, -142, -91, 54, -67, 250, -268, 293, 302, 41, 240, 88, -98, 135, -194, -45, 2, -200, -124, -33, -242, -311, -157, 29, -202, 121, 90, 120, 264, 105, 133, 145, 88, 202, 138, 74, 201, -416, -12, -40, -660, -150, -33, -239, -187, -532, 92, 206, 81, 110, 159, -13, -31, 78, -50, 489, -245, 26, 116, -264, -21, 107, -172, -107, -71, 170, -83, 184, 104, 125, 40, -89, 357, 136, 319, 326, -71, 58, -28, -219, 67, -132, -111, -216, -269, -113, -194, 56, -317]
3999c17M12j62J04K73l11K93j10r4L42k59j11L93m33k93J67j83K55J60l54K46
4019A8J78n68M31J09k54K65k28J05J88k19R1J25l71M73l96j27J78rk71L92m85
4040c75P0J43J82j46L3M2Q8j02J55K32k66J85J81k92J15J32m35K09P7n39K33j98
4062b76Q1J21Q2L02j38l72J35J30j11L09j74k33K57K76l43q2j24J93K6m72N1L33
4084b9j32j04R5J76k31o4J72K30M2j41K73k84J82N7j02Q2j53M9o2j46Q3P2k81
4107b16N2m0R0q2pJ67K82j11j52J75L52p72N29k61Qr6L4O8J11k33j4Ol29N33l68
4132b74M8J27j95J56J75n5J9L29k34K5l8J56Kj89j95N07o97L33j12j3o3k28M5
4155c71M95j49M2R9L9j11L37m28J00kj7M9r9n2J17q4j57M5j66J18j52L9L68K9
$$ y = [-317, 95, -67, 37, 310, -1, 292, 182, 88, 430, 171, 60, 453, 20, -273, -106, -289, -34, 126, -228, 18, 196, -372, 59, 168, -86, 179, -49, 56, 244, 25, 116, 241, -130, 343, -53, -180, -2, -11, -282, 110, -375, -305, -162, 20, -126, -93, -51, 37, -65, 90, 322, 56, 241, 422, 130, 245, 377, -58, 151, 228, -311, -78, -276, -195, -74, 8, 310, 172, -200, -65, 65, -46, 263, 89, -144, 113, 389, 46, -36, -160, 33, 59, -413, -362, -29, -161, -265, -170, 6, -225, -289, -117, 113, 155, 14, 287, 3, 185, 242, 140, 222, 69, 118, 56, -90, -7, 65, -216, -164, -204, -114, -196, -203, -36, 246, 135, -17, 158, 510, -262, 267, 6, 14, -82, -48, 20, 131, -102, -116, -110, -439, 94, -274, -226, -99, -294, -138, 37, -18, 1, 330, 96, 121, 83, 239, 241, 52, -143, 364, -333, 0, -112, -125, -188, -416, -371, 124, -25, 17, 116, 155, 44, 381, -47, 53, 51, 34, 83, -16, -68, 49, -35, -192, -147, -313, -195, -347, -308, 60, 89]
4179H9j07o3m5J57K91j65j87K72q3o8K67j45ol5m16K21J94l65J47k17J19L96m82
4202b31L85Pmj7J16l00m1J25J03J82m41L8L32k26j29N7k30L42o7l83M58k41J40
4225b5K85Q2m49J78J95P2j74m79N50j40k62J89p1n0m9j15K90j99lm7K64k62R4
4248a26K72k70N44k01j59R7J6k27L62l73k7j59q6K69j4l16K44J55j9n5j15K88
4270A00J71k66lM97l07q6L4k02L09l04j31N3J36q8j19r8K24oj88J14R7j46L11
4293A02J09j19K48l00N5P9k88M04r4k77L9Q7k74J30J09j41J41r4J2J97k01lK36
4316A57k34K15k2j94J07J84k30j15L88k32n7k68J11M3j11J84L3k03L57j70j72
4337b29L10p8j85M35k44J26l7k8Q9j3k82L55k72o5J03l00q5L30k7n7J23j80J96
$$ y = [89, -18, -81, -126, 31, 322, 157, -30, 242, 159, 91, 358, 213, 207, 172, -244, -23, 171, -194, -47, -264, -145, 251, -231, 154, 161, 157, 140, 256, -44, -85, 40, 143, 325, -116, -78, 254, 28, -101, -44, -274, 68, 1, -382, 76, -165, -25, 260, 342, -107, 71, 266, 338, 164, -315, 235, 95, -167, 22, -49, -99, -148, -263, 27, -172, -175, -222, 42, -220, -126, 146, -124, 420, 219, 60, 157, 173, -54, 308, -65, -92, -251, -337, -68, -82, -398, -154, 1, -18, -73, -188, 100, 271, 5, 2, 499, 192, 106, 140, -62, 247, -57, -188, -135, 1, -87, -206, -304, -80, -86, -274, -160, -63, -209, 102, 211, 92, 340, 40, 95, 174, -114, 290, 196, -81, -42, 45, -229, -99, 10, -131, 10, -84, -72, 125, -76, -79, 157, -77, 138, 116, -78, 29, 213, -17, -132, 256, 24, -33, -301, -190, -147, -258, -74, -41, -244, 113, -57, -229, 81, 3, -182, 253, 9, 135, 98, 70, 159, 146, -136, 219, -53, -118, -15, -315, -400, -70, -97, -154, -31, -211, -15]
4360a5o3J22J48j51J34J60l92L00j45j74p1K4p1J06J44l19J36q8j04K74R0j82
4382a37R3k10L03p7j4L77k55N1j7j31n1J64k98n9K82l50K93J30k09r4J92J01k36
4405a52M84l55M22k75j7K01j44J06l20J8q1r8J39j16k62K69J94j80J66n6M1M4
4427B8J97k41J24q8j8K98l30N9K49l31NO8k17J53n3l50L97J19k03K53l67J18K05
4450G5k98K89J01J78j58N8j50J99k61Ok91K39l23K94J2J0J46k52Q0R8l6O1J71
4473B48j21J42l24J35J67k93N3K54l15K19j14l63K95j42n7m1j7L0L41j97M68n24
4495a56J13K66j3j21oJ0j8J0o1j19J63m9k39J69J04j89j44P2R3l1K21J03k46p7
4519a45L24l47N09J7k79J86j34j03J8j1k70J44O0N4r9m3L1J00j41L76k51k00P09
$$ y = [-15, -78, 44, 192, 41, 175, 335, -57, 243, 98, -76, -147, -123, -194, -88, 56, -263, -127, -215, -319, -45, 45, -137, -44, -254, 49, -28, -42, 335, 80, 131, 114, -17, -68, 96, -202, -261, 21, -329, -36, 94, -115, -209, -17, 84, -152, 332, -23, 399, 124, 107, 308, 164, 270, -50, -32, -113, -211, -72, -188, -450, -181, 13, -167, -1, -57, -16, 28, 225, -16, 108, 20, 2, 300, -30, 29, 278, -53, -48, 20, -197, -44, -97, -447, -50, 69, -134, 119, -248, -130, 75, -223, 66, 167, 345, 187, 245, 95, 294, 33, 39, -252, -13, -336, -42, -30, -20, 126, -126, -46, 52, 16, 77, 248, 127, 269, -55, 80, 247, -46, 7, 261, -54, 165, 51, -312, -17, -159, -216, -257, -274, -244, 97, -100, 368, -156, -43, 223, 210, 89, 83, 93, 75, 85, 24, -95, 68, 19, -220, -51, 53, -136, -280, -208, -115, -146, 75, 178, -68, -145, 179, -168, 341, 358, 79, 265, 131, 28, 46, 35, -235, -91, -31, 23, -76, -119, -88, 12, -129, 247, -4, -204, 505]
4542E05m70J2nj12j02J64O0R8L1m83L57m06L05j76J39L1K48l97L58k64m2L56j23
4565H4j06M8O2P8N1l81J56ln7k74L29m8l8j23r4K85k07M05k59L0K94%k93K58k74
4590g7O7l05N84l43J06j91Q3j65J38n8J0O3R3Q1j97R9K36q0P8q0j59K37k25R6
4614I1R9j75N8r1l39M80j70q7K66j99Q2m1J24m2N0K10nk0l37J79l5j55J82m5L
4639H3j86O3J27k50J66j42j61K24K78k09l6Q0j41J75O8j18L2K34l38J06K31n20
4661b34L40jn02L27n39M33K29l26M20J3j98J06k47L23k27J79k26N8J81K7j52k29
4683b45M71j26j80M1M6j59K66k81o8m8L54l94N59j21q0P0j42K29k3N2l41M02k53
4706B9J07j59J25O7m03J84K17m92J87K6K96l81L28r3J67k88J33qQ7j13j69K62
$$ y = [505, 35, 47, 42, -70, -172, -8, 52, 150, 181, -302, 55, -351, -46, -222, -83, -52, 196, -201, 157, -107, -149, 207, 84, -22, 26, 88, 166, 217, -164, -8, -11, -68, -342, -13, -61, -99, -222, -316, -31, -238, 167, -92, -62, 232, 232, -61, 197, -77, -10, -315, 269, -74, 32, -159, -76, -241, -103, -161, -151, -88, 5, 86, -111, -12, 224, 144, 222, 142, -17, 220, -5, 91, 190, 15, 73, -18, -357, 123, -47, -134, 132, -67, 15, -26, 98, 56, 106, 316, 311, 291, -46, 133, 98, -57, 125, 80, 83, -103, -40, 87, -163, 3, -139, -300, -76, 202, -7, -43, 37, -104, 71, 139, 21, 53, 287, -51, 55, 286, -234, 106, 105, -397, -70, -609, -176, 53, -273, 147, 160, -38, 68, -179, 144, -83, 96, -130, -72, 109, 136, -16, -245, 226, 100, -80, -39, 7, -152, 114, -167, -235, -283, 71, -323, 236, 115, 35, 105, -37, 192, 169, 221, -120, 282, 29, 136, -23, 102, 169, -234, -50, 167, -325, -138, -112, 184, -197, 131, 38, 205, -83, 50, 42, 129, 16, -153, 109]
4728A09l4Pl50O0K09k18L29l41p6M23k64K08j41j72J77J36PK1J39j53J97k57j87
4751a71J31j7k36K64J06j11Q1k56Q0M6j86M59l59K4J37o4K33J68m19J12j20j76
4773b74J96K65m25M3p8Q5k3j06M45M9l4j47J4n4K70l2N1n3K2p7j35j16j52K4j1
4798b53O5P2j28P1%M0K23j98J68n5O6O9mj75Q5k1k73M75k36J32m1J67l03K21j90
4823b3o8P8j59n0J86j7Q3l1r2K85k12n1J07j5J62j02j43R7j97M8ro9J01N9k9n2
4849a13jKJ77J75j95K57m1k87L13l13j00J0J26q4Q5j56J31j28L3p2K4k50J98J07
4873a02JJ34mJ17J6Nj66m0R0j06L1p4j08R7J49J0k36K7J27j2O9J07k13K32KK0
4899A73Qk88L33L9m09M17r8l29L76m7l45j83O1K47r8k38K29k3J16k7L61r1L7m0
$$ y = [109, 75, 82, -268, -208, 1, -217, 112, -229, -305, 118, -146, 62, -79, -251, -74, 62, 69, 90, 229, 76, 273, 16, -171, -40, -57, -293, -29, 77, -34, 47, -209, -129, -83, -269, 190, -169, -145, -8, -72, 161, 329, -90, 22, -98, -274, -78, 187, -238, -195, -273, -188, -211, -317, 128, 177, 143, -4, 10, -44, 226, 194, 245, 192, 214, 137, 2, -114, -266, -242, -253, -188, -116, -244, -173, -173, -133, 90, -108, 60, 5, 71, 140, 136, -39, 46, 25, -248, 227, -9, 123, 82, 249, -54, 167, -23, -91, -13, -172, -222, -36, -53, 30, -1, -93, 192, -20, -71, 36, 21, 183, 81, -62, 35, -162, -114, -123, -192, -91, -32, -61, -113, -114, -112, 65, 240, 45, 302, 261, -26, 287, -26, -126, -116, 10, -74, 11, -145, -14, -142, -109, -181, -157, -407, -209, -102, -101, 33, 29, 146, 162, 167, 1, -39, 51, -55, -24, -98, -206, -109, 40, 50, -186, -159, -32, -44, 25, 132, -81, 151, 153, 173, 181, -107, 226, 265, -144, 273, 175, -154, 222, 175, -170, -353, -292, -45, -143, -381, -152, -175, -59, -86, 275, 184, 221, 181]
4923A81q4J18m6l20J55M2k00J67k04j22K76j05J40j16r0M02k55J1K54k82JL06
4945B29n9k50L63m28J80L9m32K80j77K17j60J34j48r5L53M1j80R3L9J24J25j13
4967A75m72N81k68n5K79k94N8R4k4oj81K7k11L80k85P0J81r4J27J03k49J64M7
4990A47k16L73m79K17j84J42o6n6k13O5K99q7l8J2R0q5J95j65Q5j00O5Q4l0Q1
5014A36j57K35k52K21k3j13k09rK37q9J67j88l4n8K72k64K29k62K02J59M5m13
5036a68L27O1l55k8J29q0k5L4Q2r9K6j9j54J86J16jj93L03l00O8M00l30L21l8
5060B63q8l54OK71R4j88J4j37J18mj65J60M9j71L07Q4l87J84J38k48J20J45k68
5083e7m2N5k18L0P6N8m6J23Q4k92n7M70Jl95L56j74j31M02l58J31j11K76l04K39
$$ y = [181, 97, 215, 169, -151, 4, 46, -154, 13, -191, -313, -37, -142, -2, -118, -208, 194, -61, -50, 204, -78, -77, 229, 170, -80, 283, -145, 35, 74, -358, -78, -255, -38, -198, -64, -212, -307, 46, 87, -93, 0, 39, 163, 288, 175, -297, 284, 16, -39, 240, -54, 4, 98, 74, 68, -113, -86, -297, 83, -202, -132, 49, -45, 82, 185, -64, 100, 147, -69, 304, -175, 42, -142, 0, -66, -122, -335, -270, 29, -58, -96, -84, 6, -79, 116, -49, 36, -64, 1, 85, 55, 136, -21, 214, -38, 183, 160, 47, -162, -171, 66, -23, 144, -44, -78, -136, 136, -128, 101, -161, 41, 200, 245, -168, 159, 220, -135, -163, -34, -114, -139, -105, -23, -122, -96, -115, -269, -83, 33, 32, -161, 142, -158, -90, 310, -20, 301, 263, 175, -179, -173, 98, 192, 4, 18, -119, -1, -5, -170, -10, 39, -132, 175, 259, -128, 56, 194, -54, 66, 211, -57, -99, -44, -262, -232, -156, -98, -144, -21, 63, -229, -286, 184, 185, -210, 146, -28, -159, 243, -115, 16, -95, 181, -123, 116]
5107A16k99K17k7k79L24Q6k14Q3k19J07J10k64L43l75M62k5J76l39R9R5r7j76
5129i6P0l36L30j3K97m37j13K76J12mL2k12l9M07j75j01L10k70J7K18l86R0MQ0
5153F1p2l99Q6K53J82j95j71J35j5K21l5J10J3k36L65k32m0J74r1n3m7j81j3K34
5177E4k7j81J44j84M26j91m40L52OJ27K10l34K49k25L9K51m9l80J6R4k0j91R0
5200a64P3q5K21j89l5L42on0j22k60L44R2LJ2m57M00j01j23J01n1k96k0L26q0
5224a25m1R6j9l4N6K5K33k63K77l09R6J40j62K52k65j71K43k08P9J21k23L83p4
5247A07j99J33r8J21m4k58J21k2K60j70K77j36q4L03l48m5J76k85L73k48j28L72
5269A78j83q1L5j30L74k62k1P4Q5k64L04r8P9j32K56k36K57j23j99J4Lj61J61
$$ y = [116, -183, 34, 7, -272, 52, 138, -76, 7, -212, -105, 5, -259, 84, -291, 171, 146, 322, -17, 82, 177, 80, -96, -26, -362, -32, -45, 252, -185, -298, -22, 90, 86, 118, -94, -133, 274, 99, -2, 308, 38, 55, 273, -113, -23, -19, 61, -11, -410, -324, -71, 111, -84, -255, -120, -135, 86, 51, 161, 174, -62, 303, 71, 31, 205, 114, 61, 14, -167, -180, 54, 27, -154, -10, -194, 232, 41, -399, -47, -41, 86, 296, -38, 211, -14, 25, 276, 227, -153, -137, -43, -63, -254, -164, -91, -176, 45, -144, -179, 163, 157, 107, -15, -275, 69, 161, 164, 176, -281, 119, 18, -105, -4, -55, -351, -371, -45, -125, -166, -70, -89, -123, -67, -42, 191, -72, 205, -104, -8, 132, -30, 222, -43, -214, 29, -179, -100, 21, -202, 181, 107, -92, 41, -57, 64, 20, -238, -117, -139, 121, -49, 228, 92, 8, 311, -37, -82, 94, -191, 182, -66, -194, 178, -5, -86, -51, -181, 193, -69, -90, -16, 69, -195, 109, 11, 90, -42, 214, -22, 235, 112, -87, -73, -70, -231, -70]
5292g0kJ74k20P4R8k23K11K26j56k33J30M4R6j90j10M22j62j62K29k52n4J3Q6
5315c1j22J08q9J03j6j81M21K4l34K14p4J8m7Q4K7m64L65Nk9j1J86j91k00L22
5339H8k07j21J65p0K22p3N46m85p1J05j14J25k24L22k89MJ15k75J57R0p2J00j07
5362f9L2O2q2l4L23j67p4L38k14J65j44j72J05o0j39K24k52Q9j41K40J12k04j07
5385a69J54R2j4J43j66l0L17k29J42Rp9k50K91l69J65p2k35L37k71L67j26r7j40
5408b30K30M4o0J03J36Q6n38PN33m72L02j19j81J56j40J46n9k1R7k41N8J42j19
5431a40K03p6J2j05J60J11k38j10J84R3M4k25JK74l55k1K17l8k97K97k68M39k33
5454g1R7P6J02j04K97k98o1J09j22j07K11n0l22K06n2J81J61l80L76l57J91P1
$$ y = [-70, -72, 102, -118, -44, 54, -169, 42, 268, 112, -121, 9, 53, 149, -41, -151, 271, 109, -53, 176, -76, -130, -117, -31, -153, -45, -134, -31, -47, -228, 193, 217, -117, 97, 23, 41, -6, 78, 105, -359, 6, 11, -18, -29, 157, -34, -234, 88, -119, -240, -75, -145, 77, 4, 550, 65, -6, 99, -15, 110, -114, 208, -81, -77, 38, -237, -80, 10, -62, 38, -69, -37, 25, -57, -91, 232, 65, -9, 329, 115, 280, 136, -36, 69, 9, -130, 94, -158, -69, -210, 30, 142, -62, -169, -15, 77, 63, 206, 40, 10, 327, 98, 240, 249, 170, -80, 211, -158, 7, -65, -300, 37, -234, 133, 7, -90, -230, 0, 44, -16, 87, 223, 309, -229, -222, 311, -161, 141, 22, -159, -3, -143, 3, -56, -77, 20, -221, -163, -21, -140, 63, -13, -1, -106, 54, 165, -73, -183, 1, 94, 138, -87, -86, 188, -167, -188, 29, -9, -306, -9, -277, 162, -71, 26, 102, 204, 100, 397, 99, 38, 147, 25, -82, 129, 79, -243, -37, -89, 92, 253, -127, 249, -108, 83, 154]
5476A54l06J32P0K05q0O8q2K5M3j73J59l47j01L27k40o8NJ60LK05k78K82m1k54
5500a32K02r3K28m7k74K0j3R3J76m38M5K49K2r3K29j35R0k98j12J18L44q0M2j17
5524B6k1J42j47J63k21L4K01r9J37j53m21L46p5j50L1K99l41K58Kj34K33L2j23
5547A9lJ11j44R1nrJ65j43N6j2m17Q8J84k68K31n2O8J44j31J71j88P2n9K2J03
5572I4M6J63l69R1m3o7k35j3PJ62L1J32l79J48K61K30j24J77k99K90M2l91J24
5595G8l8J45k96K41j64J74o2l21Q2R2O7j26m7J37Q1n5n8K86m78J26K58k11P2J28
5619A11j73J02j44K61k08L9J0l5j56K27L7q7L09m66K77j38K59l63M45l82K81j13
5641I3k89L66j76k40M25O7n65L40q6l60M71k27J19N1J50j42R5j24L05Qo5k58j95
$$ y = [154, -152, -20, 50, 255, 175, 243, 161, 186, 229, 56, 215, -132, -233, 94, -146, -214, -209, -49, -46, 159, -119, 163, 122, -132, 70, -23, 205, 158, -116, -96, -109, -16, 160, -278, -233, 16, 38, -55, 174, 39, 129, -169, -281, -163, 181, 101, 143, 26, 5, 147, 0, 163, -58, -24, 177, 78, 215, 62, -359, -13, -88, -238, -207, 92, -249, 9, 11, -123, 110, 142, 19, 16, 127, -17, 74, 69, 60, 225, 82, 138, 126, -291, -203, -19, -287, -56, -108, -40, 104, -27, 144, -44, 28, -31, -9, 94, 140, 303, -66, 25, -18, -85, -320, -333, -326, -164, -133, -1, -380, -232, 29, 259, 135, 312, 13, 303, 345, -46, 78, 40, 185, -111, 130, -34, 140, 78, -243, -161, -69, -2, -128, -175, -38, 43, -12, -70, 216, -262, -136, 122, -89, -17, 111, -62, 40, -104, 157, -51, -12, -2, -37, -193, 34, 71, -16, 293, -173, 104, -34, 225, -138, 307, -75, 206, 93, -196, 170, -6, -246, 179, 246, -319, 21, -65, -425, 46, -181, -62, -11, 139, -3, 92, -32, 273, 281, 216, -42, -237]
5664b37K57J33O6l19Lj45K12l2k4K1j50j3K70J1n2K18j53p3K22k00K84j46k06
5687e3j32PkL56m38J84K48j97J2J38l39L3M20k44q7J86j68K47l41K41jj74K86
5710A82k63K40j98k33Q9J30J5j46o0Q1L2Q1J87l48O3K55J90m52L01j09n9Q7m6
5733A9M6o5j74K26j60J66j23P2j6P4J69o8l84L47l43M09j10N4q8J37j31j21mj94
5757b62J99oq1J41k49J10K36j41j42L82q0j68p3J28J62N5j5k32J45m4k6j08L7
5780c2L3l4J60m20K34J4r4K7M0J74p9P7J01j84J47j23P7Q2k44lj8Pk37J79L76
5805B60K7k59l57M10j70L29j11J8J94l72n3J81j65J13l4K0j08P5j42J28%o5L17
5828B36l16j22L74j35j27J83k12o9J01J63N1Mm9o4N5j81J65J34K8o7k75K75k58
$$ y = [-237, 20, 153, 219, -100, -97, -242, -30, -62, -86, -65, -215, -228, 42, 53, 1, 219, 66, -7, 215, 15, 299, 153, -53, -185, -178, -180, 176, -262, -78, 170, -27, -15, 123, -216, -183, 237, -7, -94, 92, -76, 171, -170, 71, 70, -104, 182, -81, 159, -39, -272, -183, -53, -38, -184, -244, -163, -131, -50, 137, -211, -148, 107, 297, -155, 146, 37, -22, 65, 19, 65, 0, -174, 52, -108, 58, -65, 7, -9, 65, 234, 166, -218, 129, -214, 195, 85, 139, 51, 188, 57, -64, -68, -262, -63, -69, -150, -9, -258, -148, 88, -53, -195, 187, 107, -61, -134, -6, 156, 211, 196, -36, 109, 65, 39, -69, -32, 1, -33, 127, -293, -59, -45, -139, -112, -72, 102, 23, 100, 201, 17, 164, 41, 118, 200, -44, -47, -65, -58, -295, -116, 260, 287, 28, -329, 81, -89, 240, 129, 147, 341, -31, -84, 97, -68, 45, 11, 31, -77, -2, -144, -16, -16, -81, 236, -80, -202, 172, 37, -90, 93, -119, -188, -87, 76, 127, 131, 82, 18, 73, -108, 57, 191, 219, 152, -123, 152, -106]
5851a06Q3pj17P2m1J83j36J17m8rj87J42J64Q4k97L41m12J60k1j53K03j55Nj48
5875b83K97JM5J02j47J33l47L46P6l39J65qm7K14j65k90K00j69J42K28j97o3P3
5898c3m1j53P9M01k16q4r0P0J58j68K06q8j01j56j67L84j8r6N1j06J30K44l42
5921a36K40J95l77r3M30j68k41J62n1J19J82p7l32J48k11P9M47k84O2qk39J12
5943d1J32J07j43k10J83J31n4k3l41J14J38r4r4L42P3m20L69l68K40o0q8k3q6
5966b16M6P4M9jl8J22J03L9j4m6k00L07l58mK56l09L62J00m93O7P8q8m9M55k45
5991cJ05r0J45K3j43o3J45O8j80j56J67j08j83L27n9l5k5o8%J60j09K10k19J63
6015G2q9J47n9k29O39m86O9J6k14L6K18j81L1N5r4J01L2k41J12K2K00k55N92m97
$$ y = [-106, -23, -30, -147, -75, -116, 67, -69, 48, 0, -9, -196, -54, 110, 194, -103, 238, -174, -14, -35, -188, 15, -140, -135, -283, 14, 15, 60, 162, 15, 148, -199, 147, 223, -116, 49, 41, -6, 208, 43, -247, -47, -216, -74, 154, -43, -106, -33, -74, -227, -148, 253, 37, -47, -137, -67, 91, -77, 129, 41, -60, -216, -383, 1, -17, -113, -62, -168, -38, 206, -136, 104, 299, -78, -171, 259, 91, -150, 12, -39, 80, 262, 185, -147, 1, -210, -131, 316, 32, 94, 86, -153, -41, 91, 198, 55, -155, 28, 159, 105, 82, -259, -145, -7, -101, -195, 147, 220, -200, 169, -199, 41, -19, -107, -130, -216, -170, -96, -47, -48, -86, 36, 139, 178, 164, 118, -82, 225, -133, -137, 119, -190, 172, 272, -221, -154, -76, -164, -213, 242, -3, 102, 12, 157, 180, 37, -26, 119, 187, 7, -149, 18, -90, -273, 54, -5, -40, -65, -133, -133, 27, -82, 128, -91, 72, -17, 130, 71, -158, 481, -5, 64, 80, -134, -98, 120, -61, -30, 25, -69, 32, 64, -177, -65, -43, 157, -98, 494, -3]
6039cj07J80j09J12J02r7k29J89J3o9J3m42M99j4Q1j40k8K58p1j11K5J12J36q
6063B92j68K6n7PN2m00L61l6k90KK3rJ03L03k47J45q8o6L36j65j51Q1k21M4J04
6088a9k23J36R0Rq1N1k28K44l9j05J31l4MK47l04R2O4j32J60m7o6Q8M6K38l44
6113b2k80J39R3J26j83L93k02j79J66J12j99L27j74J82k44k64M82j20q3J93k30
6134C3R9l18Q6J79j91r3K68p1K3N2m3j62jJ18K66R0l67OJ50q0J29k00j71J11J6
6159g1Pk20K26j42J24nj90K70l9R5l2L6j58j0m8K01j70J33PQ2q6O9nnj08L2m6
6186e3j97K89m4lK11j88J6j35k9K35m7J88J08j70k49j63M25m48J77om4L84l34
6209g7j43L19r2j39L21l64L35j00R9K6q4r1L05m14R7k8m6L00m5k35J4k42Q8L00
$$ y = [-3, -110, 70, -39, 73, 175, 78, -151, 38, 51, -18, -5, -447, 52, 38, 119, -21, -49, 209, 138, 27, 52, 164, 300, 292, 124, 150, 93, 100, 152, -248, 113, 77, -213, -211, -188, -197, -94, 209, -38, 107, 19, -47, 289, 124, -27, 54, -167, -123, -19, -242, -106, -16, -7, -88, -37, -265, -21, -60, -165, -34, -68, -64, 183, -121, -29, 35, -97, 63, 16, -50, 38, 84, 322, -22, -302, -163, -70, 56, -127, 266, 64, -115, 51, 163, -36, 291, 117, 299, 55, -209, 273, 153, 70, 263, 33, 132, -186, -100, 79, -112, -205, 63, -8, 15, 67, 24, -138, -139, -21, 245, 335, -32, -26, 124, 44, 173, -27, -198, -87, -71, -64, -284, -58, -200, -76, -81, -271, -1, -40, 55, 23, 59, -99, -109, -157, 44, -126, 7, 14, 96, 10, 79, 74, 69, -39, -7, -53, -250, 39, -5, -8, 203, 15, 31, -104, -133, 102, 55, 243, 351, 181, -68, -231, 194, -254, -77, -83, -127, 257, -77, -220, 99, 7, -132, 189, -175, 160, 60, 159, 185, 101, 10, 315, -99, -2, -30, -76, 224, 179, -56, -42, -284, -196, 104]
6233A04P6K5k2r3j20Q6Oj64K99l5k12K7k02L51j33J31k7l94L27k60K23M4k69J11
6257a21p3L37l05K67P0j84J01Q8k22rN3R9k0j91J18l33L15Q0j74j13L3L73k77
6280h8Q2J42k80Q7J12J4J64m32L79j97n6J94l31L48m13K72l25Q1K52QM4n20L40
6303a23r0K99j21M4J67j05M09n40J53o9r1Q3J7M9L0m24K05q6O4O6Lk0J92j29l
6328b0j89Q2K72N3M8k93j5J98m7m6j08j16L2J35O9k66L42k33j02K35O3j84MK57
6352A71j75L2Q2k6q4l5R2j86n7L71l88K59n0k02J91m3K7k00K56k17K66N6l33J70
6376b3n0M6K08k64kJ47j37J97k90Q4N8j93J62J37p8K%l1K25j96L9J1K61k09k91
6401a87K16L8o2j14J72r9j56J49l9o0K15k79L7J58l9JK60m07N1k7M6L21k66P2
$$ y = [104, 180, 205, 183, 90, -30, 56, 62, -102, 197, 162, -50, -23, -225, 126, -7, 124, 97, -297, 30, -230, -7, 37, -232, -121, -194, 143, -162, 105, 175, -9, 92, 180, -42, -51, 2, 101, 81, -110, 8, -325, -10, 70, -104, -217, -184, 189, -88, -6, 136, -144, -57, 55, 69, 233, -199, 180, -17, -73, 121, -210, 138, -275, -3, -328, -247, 5, 13, 57, -463, -123, -213, 86, -35, 9, 176, 71, 480, -60, 93, 24, -67, 16, 33, 82, 112, -312, -107, -193, -129, -63, -60, -80, 112, -17, -20, -209, -127, 145, 198, 246, -47, -62, 136, 89, 43, -65, -181, -149, -14, 55, -211, 131, -102, -204, 31, 94, -90, -86, 171, -4, 28, 110, 84, 0, -35, 57, -129, -186, 185, -203, 56, 6, -196, -5, -48, -21, -221, 35, -182, 84, 140, -193, -23, -73, -27, 181, -83, -85, 62, -75, 122, -168, -84, -26, -219, -57, 80, 2, 4, 4, -27, 198, 2, 41, 52, 313, 104, -187, 29, 67, 5, -109, 63, -36, -192, -43, -82, -142, 73, -206, -169, -11, -50, -49, 211, -196, -145, -172, -126, 195, -71, 1]
6425AJ1N7O7l18K39j06j07J20q8q7J87L4m2P7k9K09p0j52P9k06P8K04o4j63RO8
6451HJ31k99k5r3J15J06O4L0P9k74K69p9K8j24L7J46j10L77m22J01j72j50J80
6474g7j15K06K5j40N0K04m73K19R6o4J40j14m0J24j8J51j1j7j35j21O5Q1n6R5
6498G5j21p1M7J72j87Q7p4J22N8m57K07K19J77p9l91kJ36Jj15K38N9j8Q7k31K44
6523A83k47l6K6P8J14J36j23J27n0k70J36N7j30K1r8J03j10J64j97M7j07L16l45
6546b05J82j52K37k60J24j6J62j3J0q2M6M7J7j82J27m6k8K03J5j42j30K4k15K75
6570bk0J34M8j90K17k42K10k25q3K73p5j24j99K53L0J22J01k94J25k49K81j97
6592a06M7J80j35J37j97kO7K41j70j54J62m4M2qn18N42k96J29J4j87J60l8J88
$$ y = [1, 12, 69, 136, -182, 57, -49, -156, -36, -124, -211, -24, 10, -32, 45, 16, 225, 155, 3, 82, -124, -46, 158, 94, -69, -60, 8, 139, -160, -185, -278, -163, -57, 7, 37, 116, -158, 111, 32, 60, -64, -27, 119, 9, 386, -36, 65, -107, -257, -77, -192, 14, 39, -101, -51, 153, -320, -101, -5, -69, 71, -43, -83, 41, 23, 174, 163, 146, 11, -110, -45, 36, -20, 75, -46, -117, -70, 102, -85, 2, -72, 50, 108, -349, -142, 77, 254, 175, -216, -218, -82, -81, -196, 42, 101, 83, 170, -61, 183, -64, -100, -74, 4, 118, 254, 131, 258, 208, -62, 74, 131, 1, 22, -76, 27, -83, 81, -116, -69, -176, 140, -205, -23, -175, 62, -198, -74, -90, 72, 59, 69, -13, 33, 80, 97, -85, 42, -4, -32, 171, 186, 44, -86, -62, -277, -2, -22, 112, 160, -30, 187, -55, 155, -70, -153, 120, 45, -79, -278, -25, 5, 127, 228, -66, 59, -190, 91, -106, -59, 121, -14, 123, -74, -76, -9, 232, 62, -92, 70, 26, 68, 60, -458, 84, -212, -83, -69, -256, -96, -134, 54]
6615E4n8L49l77P3J5k39K3K54k26J00k01L6N8j11J0K01j27k21M35m9q5J86L9j15
6639B4l77M71n0q3K10k70Q4j37nK75j2L7j44j70j68Q9M46m97L19k79K01K83j81
6662F6p7N0k05M12p3k71J03o0P3K21l06r0K94l61K40k85j01M69j39K6M3l3j00
6685a04L57k09l7J42j32R5q7J4k35M57m35N0j88M03m7O8k58L71k95j48L97j28
6707E1K4k03o0J96J31k00J56k96K47K6k40K59j6Q5k59j73J40J13j44J64J8L55
6729C74l31l9Q9q2P0k34K54j52j1M8J62k66L40l57k5J96j58J76j6k31R9n2K21
6752G5j96j28L13jJ9j06p7J81r6K3q0J36j20J43j6j93q7K41J35l07K5M30l55L41
6776C00j85r5J43j84p3O9J9J37n9m9J97j31j61P8l31K51k3N1O8J79r4j52k1l6
$$ y = [54, -4, 345, -32, 41, 56, -183, -160, 94, -132, -32, -233, -197, -139, -250, -240, -39, -166, -387, 48, -1, -86, 100, 139, 24, -353, 118, 68, -15, 195, -75, 9, -128, -133, 142, 130, 167, 23, -147, -315, -226, 220, -277, 42, -237, -36, 247, 66, -11, 39, -166, 246, 173, -98, 5, -55, 18, 239, -67, -157, 137, -224, 16, -269, -370, 99, -40, -14, 29, -4, -104, 253, 44, 7, 149, 17, 112, 25, 39, -196, 261, -174, -124, -312, 91, 44, 112, -146, 225, -70, -218, 179, 51, 75, -128, -188, 8, 139, -61, 95, -201, 46, 72, -168, 91, 75, 160, -99, -272, -132, -19, -163, 1, 19, 374, 43, 4, 93, 11, 81, -153, 101, -51, -62, -14, 148, -118, 222, -135, -160, 36, -122, 54, 38, -193, -94, -146, 75, -121, -249, 64, 63, 82, -24, -101, 80, -16, 7, -73, 63, -57, 86, 70, -123, -210, 31, 166, -141, -116, 314, -41, 300, 115, 20, 163, -21, -94, -25, -6, 131, 72, 23, 220, 89, -72, 6, -325, -74, -97, -46, 22, 201, 107, -45, -66, -102]
6800a02J09l9R1O8k81K47k8l18K53j42J85J19q3j19o9K15j41j44J42j10M00l23
6822g0K03j66j17J28L45l40P1k98L35j48K1Pk66L61l19L41J4p5r2J72q7q5J73
6845A08o2K12k06j83K07L3j38%p2K27j0j87J10j30J79j6jNp4o4N5J73r1J97l06
6870c4N1J20j06P3Lq0J47k9j17J71j06N0k61K56k25M15l04j07J24N3m6k4Q5J20
6894B29q6k65J11l0L3k35N43k10l99K23M1P5k6j52J13NK20m6j81Q1P9j62j18K36
6918G9l19M88l55k4J57r9k09J26J70k38J04m9K47j25O9R2l1J11k40J99L0N5l4
6941B04j19O3k62m3J98o2r3K63k65P6opM4j73K68n6K2J57p7N1rj13p7q2q1J11
6967f8Q4l5l02L2L61Ok41L7Q5MP5r3j04J64J71P7Pm10K2J51J20lj55j73J73K43
$$ y = [-102, 7, -32, 59, 127, -154, 93, 65, -253, 0, -142, 43, 162, 79, -40, -109, 106, -35, -179, -37, -147, 253, -70, 133, -33, -150, -22, 323, -17, 54, -244, 91, -57, -36, -29, -295, 66, -253, 88, 102, 27, -65, 107, 20, -65, 108, 46, 258, 52, -131, 76, 109, -29, -29, -101, 126, 116, -71, 39, -91, 88, 72, 71, 76, 2, -62, -7, 166, 75, 272, -34, 17, 137, 31, 104, 107, 27, 174, 145, 28, 199, 93, 143, -118, 138, -87, 328, 24, -83, 41, 94, 48, 24, 109, 229, 143, -122, -11, -41, -8, -243, 300, 90, -309, -86, -45, 30, 4, -148, -35, -30, 190, 144, -37, 44, 123, -39, -157, 79, -240, 248, -107, -131, 26, -73, -282, -156, 14, -224, -120, -169, 78, -47, 22, 114, 83, 194, -46, 153, 183, 238, 204, 85, 148, -114, -157, 41, -21, -114, 149, -116, -40, -46, -53, -9, -182, 86, 30, 52, 209, 132, 183, 174, 61, -16, -98, -179, -68, 16, -19, -321, -289, 72, 78, -163, -126, -41, -37, 38, -55, -159, 5, 176, 253, 260, -150, -128, 23, 143, 140, -15, -188, -15, 228]
6993B28l47J61k60L20l36M3J61j45N06k77J21r0l24K53L1k27L25j4m4k54O7M6
7015e6J69j29j05M08k13N4j05j51K89pJ12M1j47l56J88j06K3N1j57J27J88m03
7037b85J94O4n1L2q7J2N6p4LL18p4k42J24J20j27o3j30K12Lj8PJ03r5J28j65K69
7063B34k19k1N8o8n2J15k65K98l7k11O9J18ok32K00K49k49q5r5J50K5j23K13j3
7087E3M2p3j44N8L97K2k35q7l02J28K56O0k2r5M1j47L6K8m7R0k15K98j30j13J81
7112H0l22J43kp1K88j62j82L16q9j17n4J15k2pk8J09J11l17J04j69M06r0K27k24
7136D3N9P4j45j56K32m33L58k09L9L8J97n6J4P6k91J8K31j28j3L01k16j40J20
7159A3L0L5j31q8K33j43l5l3j16L80j26p6K53l44j6J35L3n5J2L7jJ64o00L46J95
$$ y = [228, -119, 42, -218, 102, -234, -191, -30, -175, 331, 54, 175, 85, -239, 14, 45, -182, 143, 129, 85, -169, -102, -56, 113, -16, -121, 287, 74, 128, 23, -128, 161, 154, 266, 307, 160, -196, -8, -114, -91, -40, -197, -70, 118, -285, -91, -27, -78, -46, -133, -121, -65, -139, -136, 182, 108, -134, -10, 110, -17, -80, -210, 2, 5, -13, -6, 97, 2, 130, -35, 234, 15, -6, 52, -16, -68, 47, -218, 80, 43, -168, -99, 19, 13, -219, -19, 230, -19, -104, -199, -49, -24, -147, 66, 53, 95, 22, -122, -64, 333, 355, 120, 33, -269, -141, 115, 175, 153, 58, 99, -48, -12, 16, -31, 59, -156, 142, 12, -101, 80, -242, -99, -101, -172, 116, -46, -228, 88, -1, -118, -172, -57, -79, -86, -114, -5, 106, -211, -107, -276, 130, 40, 267, 43, 102, 176, 31, -125, 107, -326, 32, -177, -138, -100, 97, 41, 55, 131, -160, -142, 89, -39, -52, 249, 33, -107, 13, 43, 78, -53, -141, 92, -51, -86, -119, -235, 145, 19, -57, 196, -148, -164, -29, 4, -51, -39, -2, -3, 161, -439, -93, 102]
7184A02J0Q9j10Rn6l8R2p3L4j19J52j41J00j50K23j17J11j74O9K7J4j64K5K03
7208A18l20K56L8P6k73J40P3j28j08O8j65L05k01R6N3KL76l55j67PR2j81p7L88
7232A13p3j41J53r0J61k21J89k54j4K59k28N2QJ21L6l13M25o1Kj90J59o8r9M8
7256b6K2K1p4J25k4l04K45j46L19j49M6q8L8L27m77Q5J37j29n9J16r1K84l79K03
7280B2k32J67l63L63J75l50J90k4J30r9k3j2l3J36R8l9P8l01R8M0k30J57k04M00
7304A44j28Lk2N8k16R1j8K32q6p7J43o3j34O6L27j20k66R4n1O7r3J94l26K09j05
7329g7j2J85J88k66M43m16k40J54N9K23j76j61j4j80O7L04O1j48O1j94j7K39k95
7352b12L65O5k30m6Q6j38J98q8K1M0N6j00j27P3J16k28J6J04o0k65K69m9j34R1
$$ y = [102, 112, 201, 91, 100, 44, 6, 98, 25, 59, -60, 92, -49, 51, -99, 124, 7, 118, -56, 13, 40, 54, -110, -85, 118, -202, 54, 92, 168, -105, 35, 108, -20, -128, -60, -225, 80, -121, -25, 28, 30, 406, 51, -116, -109, -17, -198, -275, 113, 40, -101, 52, -38, 123, -98, 91, -163, -177, 82, -146, -94, -86, 35, 71, -242, 183, 122, 124, -66, 93, 25, -74, -26, -4, 17, -57, 68, 44, -260, -15, -161, 158, 9, 55, -33, 5, 332, -145, -60, 77, -52, -111, 5, -86, 198, -181, 22, -210, -43, -406, -43, 132, -218, -28, -52, 78, -21, -44, -56, -89, 47, 145, 106, 184, -117, -19, 21, -209, -52, -256, 144, 16, 19, -3, 55, -161, -70, -88, 144, 58, -19, 124, 61, -73, -7, 320, 200, -66, 28, -23, 44, -49, 145, -181, 28, -77, -89, 96, 284, 18, 461, 45, -195, -41, 18, 241, 65, -96, -110, -290, -223, 81, 142, -6, 55, -139, -156, 83, -212, 153, 218, -12, -58, 28, -110, 88, 0, 21, 61, 117, 17, -110, -37, 79, -149, -133, -29, -89, -354, -85, -134, -268, -177]
7376a77J82O0l25K52J28K0o9k25L6J46M9q4Q4k06k8J91j68Q7j52J89k68J93K04
7399A19k63L16j02M4l24L44j14r0J46l98K82J0Q1j82J55j18J40m18M97j94J99
7420A30k73J70Nj21q9J57J87Ok74J78L3K13l58K2p1M47o05K17K39m65J57L3j5
7443g7r9J86K2J20j67L82k49N4j81J13j15q3j90K57j27K8R7Pp8P2M2l1J56O0l92
7468a93K94r3j6J25j59K47p7k9k75K5j26P4K85j55R8Q5l48J09N8J92j15j43L34
7491A97j10k0j29n1J48p0m9j63O5K46r4l6j8J89j39rJ22j35l9j20L76l4j48K9
7515HJ55j66K05j62N7k0o0j28m9J40M8R6J44j76j33J98l80K26j86L30l04PJ03
7538d7R5Rj50K89j09m8l21K45Q7J6j76J01l14K73J67J99l20J26k3m9j13J70J97
$$ y = [-177, 5, 65, -260, -8, 120, 140, 71, -154, -118, 28, 77, -7, 77, -129, -157, 34, -134, -47, -199, -10, -278, -85, 119, -144, 172, 70, 114, -210, 134, 20, -70, 76, -322, -40, -30, 51, -131, 24, -94, 46, -372, 125, -69, 130, -143, 27, 32, -89, -178, -21, 166, 172, -102, 76, 109, 322, -36, -14, -85, 362, -243, -26, 213, -252, -95, -62, -77, -176, 10, 32, 152, -15, 367, 118, 172, -9, 104, -11, -94, -284, -27, -154, -126, -29, -22, -100, -28, 14, -17, 139, 199, -193, 101, 8, -8, 117, -42, 205, 128, 99, -176, -151, -277, -203, 82, -73, 25, 110, -238, -129, -71, 121, 6, -137, 197, 87, 67, -62, -113, 35, -35, -84, -247, -182, 64, -30, -66, -84, 105, -34, -43, 79, -56, -95, -215, 161, 127, -21, 8, 163, -3, 202, 40, 97, 77, 17, -111, -160, -20, 28, 124, 268, 92, -41, 157, -223, 3, -183, 147, -157, -150, -47, 48, 57, -93, 196, 87, 39, -282, -37, 50, 66, -110, -9, -323, -50, 117, 316, -4, 122, 99, 50, -63, 107, 304]
7561C04j42j76J15k64K27j28k16L05P5l30L09k28K25j28J36n8r9J42q0o4J00P4
7583I9r9K15j62p3P3N6n3K7q9k01J71j83R6K9Q8K52k29J01L4J31KK3M9l85P8J11
7609A61j24j30K72j4k71l0J12M6j81J56L59m52M32l67O4L9L7J5r5n7N0N5r7K93
7633B73l82Q6p7J89l60L92J0k90J68o8J90q5Pr4K1J99m3o0j23k31J95j02K27j0
7657C2n20L21K5N09l57J60k78K47m25J96K36j18Q1l75J55K47k25M1K14j31O5j15
7679a5J0K0m5l8K17l33M45j68k0J32j79R2m6K35k97Q6k57J43K28j90O1l16J05
7702a30J06K87m33J13J0J70k47K18k31nj41L71M4N1j14j62L09l02J03k63J96K07
7724A57j98J6O6j48R3N7n2J15m09L83q8mK2J16j21J87N6k05j95J27J45O2j85k9
$$ y = [304, 162, -14, 101, -163, 64, -64, -280, 25, 100, -230, 79, -149, 76, -52, 84, 26, -73, 69, -11, -75, 25, 99, 0, 215, 53, -20, 53, 109, 56, 83, -6, -207, -36, -219, -123, -94, -6, 246, 17, 118, 152, 283, 285, 308, 357, -28, 50, 161, 37, -93, 179, 165, -106, -136, -24, 22, -159, -3, 356, -96, 336, -31, 33, 72, 109, 124, 29, -28, 22, 77, -20, 273, -109, -23, -100, 89, -271, 121, 131, -159, 9, -59, 131, 46, 53, -41, -20, 179, 136, 76, -47, -278, -83, -185, 42, 32, -488, -167, -142, 367, 10, 170, -108, 139, -286, -90, 146, 28, 109, -266, -111, 136, -89, -48, 166, 35, 100, -15, -5, 15, -30, -68, 149, -184, 261, 93, 73, 205, 26, 118, 72, 307, 10, 96, -161, -18, 210, 20, 81, -235, -130, -24, 263, -170, -57, -47, 123, -124, 94, -137, -142, -283, 88, 132, 183, 69, -93, 216, -86, 17, -246, -50, 157, -41, -25, 41, -107, -14, 43, -9, 106, -303, 80, -8, -12, 10, 126, 5, 192, 248, 43, -152, -25, 120, 182, -3, -32]
7748c2pJ53j74J68j05J12k10k78L88j89LM83k32N4j64j45L30q7M5l08k29L65m8
7771a07qJ92j19K0J06N6k84P5J60l1k74L21j73L41k00j01O8m3R0o9k64K58j30
7794a16J87j69J07j30K89j44P4n2k13J58J13K7q9p4m8K59j84j00K31j73P8J30
7816A61j56n7R1J9k43K44o1m7q0J48K5l97M64k81K26rq5K81k65J91o6j41j32p9
7840b49K63j35j4L83l74K79j33j92M96l19j17k8J05m5M1J28j77J80Rl29O8P4R9
7863A3J29j71K9M1k17L0J51M9O7k26R4R3p8J85j81k4q3Q8j4R1p7K0L9O1L8k20
7889g3j4P0L07l93J1K67j18J69l15k6P1J54J1M5L9l15J04O4J8k21J10J57Q6k29
7913b1j12O4R4J16m10L05Q1p6k10K06l16o7L04J96j62K63j95N8j23r2m8j8K85
$$ y = [-32, -39, 114, -60, 108, 3, 115, -95, -373, 15, -174, -171, 312, 80, 134, -30, -175, 155, 68, 113, -195, -424, -59, -107, -115, 77, -42, -22, 84, 140, -144, -69, 91, 60, -214, 107, -66, 275, 75, -26, 42, -1, 89, 20, -244, 14, -116, 71, -98, 9, -121, 168, 24, 98, 46, -167, -9, 104, 131, 42, -32, -80, 179, -5, -105, 126, -47, 31, 161, 5, -52, 39, 58, -185, 59, -2, -49, -129, 19, 44, -353, 111, -170, 56, 47, -38, 243, -22, 169, 103, -38, -170, -249, 14, -121, -135, 248, -126, 153, 20, -172, 324, 5, -112, -140, -35, -80, -39, 89, -88, 92, 101, -228, -160, -86, 13, 142, -29, 0, 41, -176, -146, 5, 54, 121, -105, -11, 82, 4, 189, 8, -16, -99, -11, -25, 66, -11, 9, 48, 109, 147, -73, -87, -17, 290, -103, -92, 175, 57, 226, -89, -115, -44, 110, 121, 166, 205, -110, -6, 58, 76, -145, -35, 122, 208, -21, -133, -69, 25, 141, -269, 36, 117, 41, -169, 37, -279, -346, -42, 154, -8, 255, 60, 118, -5, -97, -145, -163, 122]
7936A22l09J78J65o3o6J61k11j06jj66L54J64p6%l7k00l24J68J97K5mj07n0M39
7960B53j69k23L4J49k8Q3k67J57R1k04O6J05j58m0K44J16l25J26M7j0p1K90k16
7983E0n4N3j2N2j15r7J34j46M05l89j41L14j24j6K78l02J33J0M3L2j5j63J12q
8007C4o7P8r1K99m72N28n08K33l03L20l76M10n8J27j8K6j46P3kr8j13m9J19l0
8031h4N6j95L84q6j38o8P4n6O4J46k51K9J46j96J4R5J51l36L81r9k6K44l13j12
8055a76K07n1n2O5j39J2k9N1O5J13k81K51K5m0L3l1q7r0M35l04J03J71l20J40
8079G1L8k90K59p6qj53P2O1J55l18M7P2K18m4j95K58k3j46K42k85L11j45Kj41
8103a8K0J48k25o4L0P2j34K07l8M8k14J42q0J70j20j36L17l22L19k88J0L02k81
$$ y = [122, -187, -9, 156, 93, 27, 188, -23, -129, -130, -296, 58, 222, 146, 146, 109, -91, -415, -247, -50, -25, -29, -136, -186, 253, 84, -139, -105, 44, 16, 99, -168, -11, 80, -124, -58, 47, -111, -151, 93, 209, -116, 10, 57, 47, -24, 266, 50, -4, 49, 37, 89, -26, -123, 11, -135, 270, -119, -260, 54, -70, -86, 192, -110, 23, 33, 76, 108, 93, -70, 42, 34, -33, 45, -46, 253, -219, 309, -199, 34, -269, 51, -325, 85, 27, 154, 136, 162, 16, 89, 87, -11, -124, -173, -54, -84, -28, -223, 161, 75, -63, -131, -57, -113, -49, 97, -154, -125, 21, -175, -161, -66, 85, -251, 130, 31, 5, 249, -64, -176, 31, -20, -72, -7, -146, -134, -163, -112, -47, 66, -215, 36, 61, 21, 54, 23, -64, -154, 281, -23, 80, 251, -69, 71, 109, -181, 78, 2, -6, -159, -87, -26, 129, -189, -142, -70, 148, 104, -91, 167, 144, -2, 240, -45, 266, 121, 123, -18, 2, 150, -75, -139, -109, -37, -171, 36, -2, 46, -168, -26, -106, 64, -56, -192, 125, -197, 122, -166, -156, 146, -135]
8126a35J53J07j71Lo4K08j20P7k63M15j86j05J23K17m29j66M94k10J59l23K05
8147a1J55k02K69l19L66k60J6J1lo5N4J78k4p5r1K4o8n8J55J23n8j13j82j54L06
8172b6K50k07p9kJ24l3K5j02J36K30k82L6J56j9j67N4J49j33j53
$$ y = [-135, 18, 125, -46, -43, -107, 101, -19, 58, -205, 210, 24, -81, 42, 259, -170, -336, 158, -52, 107, -216, -11, 144, -58, 211, -108, 258, -2, 14, 25, 22, -43, 11, 189, 165, 90, -1, 23, -45, -103, 52, 175, 117, 4, -178, -332, -26, 224, 17, -62, -64, 60, 27, 52, -50, 86, 316, 34, 70, 226, 207, 40, 94, 243, 110, -43]
8191d3
$$ Imaginary data points
##PAGE= N=2
##DATA TABLE= (X++(I..I)), XYDATA
0@%%%%%%%%%%%qJ6j6J6k4L2m0M9n7P2q8J04j21J45j69J94k26K63l03L46l98M53
33B40n12N81o56P38q28R25j032J150j280J421j575J744j928K127k345K586k849
50a493L139l457L810m205M643n132N687o325P058p916Q938j0174J1708j3670J6285
65H896j9958K5527l5055N5637j78605J71410K21905m33427O9715K85876j51510
76B0411j50616K13560l0052j39822J08947N6969j48009N7445R2522j08585k3179
87e0409J08858n5393n0467N9373p296l1314L5733j5824j5950L7236K05l0873J7676
100A555J6594j8096r358J8425J674q978p73j897J1891P025l7453O3M1820k7243
114d751l0529L9505P48k6275K6910R550k9880J2554K8476k4244j9202L6357k348
$$ y = [0, 0, 0, 0, 0, 0, 0, 0, 0, 0, 0, 0, -8, 8, -8, 8, -16, 16, -24, 25, -32, 40, -48, 56, -65, 80, -89, 105, -121, 142, -161, 185, -213, 240, -272, 309, -347, 391, -437, 488, -544, 606, -674, 747, -828, 916, -1012, 1115, -1230, 1356, -1493, 1646, -1811, 1999, -2206, 2437, -2695, 2992, -3333, 3725, -4191, 4747, -5427, 6281, -7389, 8896, -11062, 14465, -20590, 35047, -143558, 27852, 249757, -183670, -113955, 171921, 20411, -130205, 83355, 53303, -86519, 22428, 79397, -68612, -11167, 81355, -27230, -50409, 58449, 3056, -47411, 11962, 4666, -26648, 9085, -6739, -22689, 14547, 14752, -16121, 1555, 18149, 53, -9305, 9120, 10794, 1816, 1043, -854, 11037, 18062, -19391, -19328, 22492, -4751, -35280, 4225, 4973, -21302, 5608, 15158, -14722, -2168, 26308, 2064, -17138, 19219, 16871]
127A6871m2391L3551K6329n9529R634N2470m8592k0082N5463k6573l5371N5692
139A7472r22n7878M4053M1307p3160J953Q3810n3602n7046R1757O44q7142N5328
152F574L8098p6783K1047N0983o2008r930O2179l1004l9457N0615Q114m5670K5218
165b024K6952l6181O255K6296k6382N030J8862k9630R245K4754l5120L44L0502
178A8903k7696r183L0468j7063j5559K8258m040k2945K3859J0568l1242J3617
190b055K7721l2809l998L6675k4324j6708L4770j5169k2598L0396n241k8029K0713
203f56J0775k3979K258J9471q772j1519J7581M228j8601J1568J3871j8912k01
216b888J6224r718p870Q259n09q139j72P582n445j0669J4859L211j9146J2279
$$ y = [16871, -25520, 8031, 34360, -25169, -15535, 36935, -11657, -31739, 23724, -2849, -38220, 17472, 16550, -41328, 2725, 44032, -29128, -27175, 56635, 3033, -54013, 37744, 38388, -48754, 6574, 44672, -32111, -11064, 39919, -22089, -32019, 30160, -844, -40301, 10314, 18428, -27242, -2024, 24928, -11253, -4998, 21298, -5084, -54, 18808, -10822, -1577, 23177, -11943, -11599, 18903, -8793, -17976, 12492, -4571, -20130, 8128, 4088, -18857, 5002, 15570, -15672, -2055, 25666, -7143, -11141, 25534, 1210, -15498, 19272, 4103, -18495, 11901, 6660, -21369, -656, 10119, -13860, -11602, 7869, -903, -12422, 5159, 9387, -9214, 2354, 16225, -2687, -2888, 13336, 3618, -4252, 4007, 3498, -4641, -4813, 2769, -2676, -13345, 1514, 4725, -14421, -2142]
230b142J2829j8876M229J5476j2110j449J1634o316m917P773K03r222N26P317
244D955o236n368O305l576j831N596n052K282M276q179J0308N875j8148J0012
258A219J4972j9895J203J6949j6444n132J8468r327j5629J5783N578k1615O466
271g404J7773j9880l539K5596j3555j2440K4546n528j4260J8648k688j3810J3103
284F562J201j2183N677L442q233n77N413k682m872K641R15R7M219n802r86J3386
300H218o034o591J3131o105n607J4369q767j0668J6539l779j4428J1208K502j2469
314h481L046Q131o858l572R048j177n959J0104J079j1326J0008N853j2347L744
328A293N781p348J138O96k070K037n599Q3O965p773k580Q596l908k983Q374j054
$$ y = [-2142, 10687, -8189, -3960, 11516, -594, -2043, 9591, 3275, -1642, 6131, 6334, -2888, -2362, 4955, -1281, -6649, -344, -3920, -5751, -155, -5207, -2925, 1351, -6828, 3480, 9355, -8793, 1219, 16191, -3704, -2501, 14448, -1996, -7128, 11340, 2013, -13616, 2167, 7745, -13870, -7404, 10369, -9511, -13050, 12546, -1009, -13449, 11097, 5569, -8691, 9957, 7269, -6541, 6562, 7763, -4420, 1257, 4699, -3534, -4111, 1302, -1380, -6252, -3611, -2696, -2599, 1620, -4182, -5168, 8218, 2184, -4407, 8724, 2619, -2988, 11381, 2614, -8054, 8485, 4706, -9722, 1486, 3988, -8481, -5435, 2696, -4162, -7734, 1314, 137, -5822, 4282, 5361, -5965, 4043, 9896, -2451, 1293, 7074, -274, 864, 1560, -510, 1527, -4072, -3989, 2976, -4797, -7377, 1219, -2689, -5672, 2702, 1648]
344A648n879O874N706r070p36J1578p752r006J5726l748j6883J5291L478j8459
358a1232Q059P890j2929K701Q911n930k764O720K729m696k00O432j838m042L778
373C589K05j976j588j715L892k169o534O380n03o832O990q33o247Q818P76o979
389d726P096K205m858L050J225j756j58l52J63j242r75O65k442K45j43j594K245
406a352k175q38P615n200l583J3051n488p749J4761l562j1973J4327m69j5343
420g978J0614O122j6624K467J3730j2510q358J8890m589j7038J8580N639k2670
433a3725J4255J4379k3101N531J8537j8555k329J7479j0945r334J4069j886j3165
446h790P268O652j2462Q52J0884r101k209J2397p081l552J2154n977l540R881
$$ y = [1648, -4231, 2643, 8349, -721, -1457, 10121, 2369, -6637, 9089, 5341, -11542, 3749, 7227, -11232, -3173, 4717, -8212, -5511, 3400, -2530, -5294, 1426, 4155, -541, -741, 5691, 3853, -189, 3589, 3794, 1818, 230, -1485, 2407, 238, -6296, 84, -419, -7251, -261, -1094, -7341, 1477, 2253, -4726, 2370, 4575, -283, 2767, 3992, 2236, 2078, 1726, 1889, 647, -328, 337, -2105, -1860, -2003, -3597, -1352, -3527, -4365, 3250, -1950, -5533, 7518, 2030, -5719, 9042, 5480, -6493, 7834, 7365, -7978, 2636, 8758, -7866, -5399, 8331, -4179, -12537, 6353, 1764, -15274, 3306, 8945, -13725, 530, 14909, -8192, -2661, 15876, -2679, -5008, 12471, 1526, -7808, 6261, 4375, -8790, -1522, 5130, -7332, -6480, 4404, -4697, -6906, 5491, -1590, -5142, 7012, 1035, -2505, 7376]
460G376n340l614Q026n020l570O148l399n226M505J314o625P54P448n769m776
475g768J1143j033j0111J0993L301j0863O747O667j0872O03Q692m748q035O308
489A024M788j1841l46J2818j0597o671J6911o117j2161J7179J655j6238J0914
502A318R893j5147P06J4772q864j0193J5148r19j7209J2274P182k0682P659J3843
516I781k0071K010J7820j4381m476J7383o546q487J2569K35r837P928L900j1107
530c279L459Q440j2120p82J1304j0941l251J3436j1061m338J6009r209p793J7058
544F932m179j1598J4603J859j3580P657R376j3363j962J4534r495j0490J6340
557F634k972j6331J3432N293j7262Q301R466j3008K111J0462o383l138P776j3
$$ y = [7376, 2036, -1578, 6448, 1428, -2142, 4006, 607, -4619, -114, 1200, -5425, -4671, 2777, -2992, -7768, 3375, 2342, -7769, 3224, 6525, -4338, 2409, 9076, -1796, -1193, 7499, 2751, -5284, 1024, 5812, -6029, -6375, 6443, -4154, -10825, 6086, -31, -12192, 4987, 6642, -9596, 1318, 11211, -3936, -3230, 11542, 2678, -7515, 7633, 6714, -10495, 1779, 8961, -11721, -4062, 9781, -10290, -8280, 9540, -4841, -9317, 8066, 1520, -6967, 5602, 5837, -4000, 3928, 7828, -3279, 180, 8620, -3500, -4282, 7022, -3919, -7170, 6266, -4795, -9133, 6876, -2333, -10126, 6932, 2753, -8845, 5758, 7617, -5963, 1694, 11070, -2293, -4255, 10279, 784, -9706, 6634, 3662, -12669, 763, 6056, -11206, -2905, 6561, -6447, -4336, 6126, -257, -3395, 4381, 4368]
571D368o182L677N096p929j145Q476o274n132P691k864n477N496k76m006K293
586b188J721n34n33J383K423k348J376L096l848J016K395m534K115J304o382L562
602B4J814p256L561L293o934K444N878n131k512P669L21o841N485N455r929K802
618A43J0030j2474j867J3768j1320o464J5020p284j0213J3788J31j3200Q604P266
632E928j1975J635J2724q353o692J5360l287j2258J2552J673j3834Q679L932j2369
646f285N220M413r255L819M219p554K409O094n997q21P423k550m626Q320N18r913
662d566Q082M177j2968N730P348j3683K218R916j0731j899J0487o231m556Q825
676B149n96p434N957N911q994Q14J0597p000n505J1629l867r770R794M64j0364
$$ y = [4368, -1814, 1863, 6959, -970, -2115, 6361, 87, -5045, 2646, -218, -5695, -199, -475, -4481, -2188, -467, -1001, -1534, -151, 2272, -76, 1300, 4396, 548, 1564, 3959, -575, 1540, 2844, -3538, 24, 1838, -5418, -1857, 1436, -5498, -3054, 2824, -2307, -4819, 2850, 3171, -3670, 1815, 7270, -2659, 143, 10173, -2301, -4168, 9600, -1720, -8184, 6836, -448, -10661, 3127, 3258, -9942, -1338, 5928, -6047, -4412, 8312, -41, -6733, 8627, 5340, -6918, 5634, 7307, -6527, 2152, 6084, -6285, -1065, 3348, -5907, -2088, 2131, -5423, -3014, 3080, -2917, -3738, 3685, 1135, -3491, 4829, 5347, -4566, 3516, 7693, -5275, 455, 7803, -5880, -3662, 6254, -4477, -6376, 4111, -2120, -6676, 2149, 1553, -5881, 76, 5987, -3007, -2193, 8404, 1404, -4101, 7528, 3661, -6109, 3685, 4149, -6215]
691f215N110M383p628k00O390k515n573O346L667q636L178Q612q680l53J0507
706H393p523l971R626m050o822O728J09p298K749M817o036k127P749l438n464
721f558R253p14p774Q972J117q069P372K237q678N495K738q545K993M180p688
736c669oO791n352m506Q955j448q929R455L915j2765P532R078j3599K956J1947
751A0355j1456k521J2147p529o812R879j528r660O236N088j0190P64J0247p597
765b577m358J1497l451p083J0521n07p642O992J619o358K609K224l778j124K120
780G04k73l069K44K573k514j04K649k631J307J818k001J951J186j765K468J6k068
797D91J865p23j798J042q70l21q52j312K937k180k926N162m46m303N693K74m491
$$ y = [-6215, -1105, 3278, -4350, -4550, 1840, -675, -6248, 98, 3765, -4871, -1693, 6919, -1761, -2114, 8393, 870, -3101, 6525, 2475, -4347, 2381, 2490, -4808, -2059, 2758, -3278, -5405, 2344, -1094, -6558, 2695, 1981, -5793, 3179, 4296, -3773, 3599, 5836, -2842, 2653, 5391, -3154, -161, 4019, -3669, -3675, 3116, -2236, -6742, 2213, 765, -8164, 1291, 5206, -7559, -27, 9051, -4548, -1592, 10355, -1101, -3622, 8525, 996, -5816, 4063, 2535, -7125, -889, 4199, -5991, -5227, 5020, -2577, -6935, 4562, 1111, -5972, 4549, 4042, -3600, 3392, 5011, -1347, 1262, 3486, -292, -1416, 704, 431, -2638, -2394, 179, -2335, -2439, 210, -2421, -1114, 704, -1297, 654, 1840, 75, 2543, 2559, 491, 2356, 1633, -165, 877, 7, -314, -1166, -2478, 459, -1721, -4647, 515, 69, -4234, 1459, 1733, -2758]
814b758M145K644m265N71L905k494l230M095P28p522L641M927r474Q75Q359q479
830d332j009R234n341l479P917j134m859M715K591m792M14M858l483l638N576
845C238j583n456M705j95n450M104L84l043K494k59o60K562j191K58K311k069
861A50J125K053k294r81K292o41l090M66K401l006k177M922k392m121O340o49
877C98n077N643R81m351L616J863k767Q44Q85R9r97j218J339o20k167J171l87
894g45j360R12m61L28m39O16K011j961l51N710l619k955P059k185m608N358p43
911B567m676L319L49m527J207K589k516k095L700M15m316L582K947n083K233M010
927C705m338R63L418l284M27J164j863K28n26l76N12k500P90J804j997j79J857
$$ y = [-2758, 1387, 4031, -234, 337, 4242, 1748, -1482, 2613, 3341, -4181, -540, 4387, -5087, -4212, 4147, -4332, -5341, 3893, -1448, -4927, 2990, 1856, -3003, 1712, 4303, -489, -75, 4783, 1300, -2338, 3238, 1655, -3801, 904, 709, -4741, -637, -253, -3296, -802, -1061, -1721, 841, -350, -92, 2219, 150, 1275, 3328, 1034, 53, 2345, 1704, -1386, -920, 1481, -1525, -3702, 1220, -1172, -5293, 1047, 398, -4679, 964, 1945, -2406, 1210, 3073, 306, 1150, 2035, 2134, 1137, -81, 1258, 638, -1529, -358, -745, -2105, -1193, -1654, -1326, -1765, -1149, 862, -1099, -1450, 4260, 641, -2314, 4745, 2560, -2048, 3310, 2567, -2109, 1210, 1559, -2968, -1761, 828, -1688, -3783, -83, 332, -3984, -402, 2545, -2538, -305, 3705, -633, 330, 3748, 464, 891, 2055, 192, 420, -106, -482, 30, -2470, -1680, 124, -1873, -2052, -195]
944a95m36j81L01J200N97j524J882J239l537K708Q75m378K400J054m182J283J008
961A14k360O46L65k97R46j004J330R67j760J806J278k090J296J419j110j009L21
978H58J102k371j525L580k555l369N190j143m708O012J92n341M546K305m883K312
994B02L245l164m98L428p62l490K495J233n754K156L098n571Q56M162m743R89
1010b118L405l534J128K782k590J123K115j721K46J313o43q83N59j41k456J426
1026A1J493m704J409L672n151J37N774m877q45O554l537k670O093j381l355L184
1042A807J773l293j078L155j253m418L687O64n110L230K156n192K118L155l001
1057a600K21K743n69j255R53K684k351j276L890j953l444M037p58m454L143N45
$$ y = [-195, -631, -812, -511, 689, 1286, -238, 1644, 2883, -654, 2054, 2929, -1449, 951, 2005, -2177, -894, 114, -2246, -1600, -1235, -1532, -586, -1590, -260, 707, -1053, 753, 2031, -59, 1237, 2656, 1546, 537, 858, 1960, -411, -1936, 1644, -911, -4280, 910, -233, -4941, 1071, 1263, -4078, 468, 2773, -2110, 202, 3447, 283, -215, 3213, 2451, -1039, 1456, 2689, -3065, -909, 2189, -3382, -2526, 1636, -3107, -2118, 1287, -2247, -1119, 1663, -927, 196, 2311, 590, 836, 2149, 1506, 623, 1182, 1041, -1415, 11, 1504, -3200, -1791, 1881, -3270, -3133, 2641, -2236, -3081, 3473, -64, -2734, 3359, 1978, -1377, 1807, 3580, 287, -791, 2364, 1111, -3307, 380, 1044, -4066, -836, 1320, -3872, -1754, 1401, -1600, -1379, 1364, 795, -460, 493, 3177, 826, -450, 3440, 1487, -1957, 2080, 1322, -3132, 11, 556]
1073E56l638J755J558j912O1J614J00q95J110J266j728J016J626k746J707J476
1089B926m317J722J772m747K213J969n037J993L244m742o2M768k189k341M040
1104A212J110m281K815L850o180R29O632o999j999P937n019m759P434k319n744
1119e381N442J335n259K298M163m199q69N620j819m176N898R75o515L952K242
1134C707n931K347K251m877J411K174l174m0J955n55j034N50J770q56k96K373
1150A775j124o85K781k059n10K361k156o85J636k075n61J379j266m94J036n6o75
1167a378k64J798l5k246L896Q03m458L226K654n092J569K896m005m64L254k565
1183d11k219K792Q77m820J862M204m642m01O221l822k813P017k220m202N751l01
$$ y = [556, -3082, -1327, 231, -1681, -1620, -6, 94, -801, 309, 1575, -153, 863, 2489, -257, 1450, 2926, -1391, 331, 2103, -2644, -431, 1538, -3499, -1506, 1738, -3004, -3066, 1702, -487, -2828, 1212, 2322, -1959, 856, 4706, -1474, -545, 6087, -912, -2911, 5026, 7, -4752, 2682, 363, -5381, 61, 1396, -3863, -1565, 2598, -1601, -2470, 3150, 1331, -2845, 3053, 4028, -2487, 1465, 3707, -2224, 123, 2374, -2503, -1092, 1082, -2092, -2132, -177, -732, -1766, -1216, 554, -302, -598, 1775, 651, -34, 2747, 688, 178, 2539, 383, -302, 1334, -741, -1302, 77, -1189, -1683, -647, -703, -1378, -1642, 156, 121, -2125, 1771, 2574, -1884, 1342, 3996, -1096, 473, 3369, -636, -1100, 2154, -411, -2630, 162, 1039, -3781, -1919, 2285, -2357, -2758, 3463, -359, -3172, 3845, 1625, -2577, 3174, 2873]
1199B873m968L843R54m057N12K814k738k074L168n23l487L355J259m209L269J947
1215A938m145K997J624l265J935J797k980J148R20k499N56P03j441r16J411k02
1231d19k246J616J688l189J516L215l589Q18L680l395J34L385k858n77K330j167
1247I42j320L21M01j098j355J527L38k415K110R88k533K279J035k299J534J348
1263A803j175p9Q10N27j361j086K089r58k638K512n04k763K835l85k152K204M72
1280A51j449J126N92K9N2M72P01r59M31O27j518N8P55k180P32K99k219K098K24
1299B2k685K488K21j868K623M6j713J950Q06j710k6J903n67j889J122O57l004
1316a624J050J967l939Q03L133l866M01L379k409m21K892j169m69J425o6k98k73
$$ y = [2873, -2095, 1748, 2702, -1355, -843, 1971, -767, -2841, 327, -196, -3683, -328, 931, -3278, -9, 1938, -2207, 790, 2414, -851, 1084, 2881, -99, 1049, 1969, -530, 26, 729, -712, -1628, -217, -419, -2665, -1049, 639, -2550, -1034, 2181, -1408, -590, 3090, -305, -171, 3214, 356, -221, 2109, 942, -378, -57, 344, -754, -2109, -582, -244, -2659, -549, 439, -2094, 185, 1220, -1079, 455, 1803, 628, 549, 1359, 1886, 525, -561, 1528, 570, -2068, 444, -60, -2823, 12, -373, -2525, -321, 151, -1298, -172, 420, 449, 501, 973, 1674, 715, 1146, 1773, 255, 313, 1068, -1112, -380, -81, -2300, -202, 22, -2663, -175, 46, -1822, 801, 847, -866, 1084, 1890, 180, 154, 2057, 1490, -399, 723, 1380, -1624, -574, 1393, -2546, -1743, 1390, -2476, -2075, 1304, -1105, -1526, 1366, 197, -272, 1153, 1087, 789, 516]
1333E16Q50m52j083J169n46j944J782m84j275Q90q89Q1J515j831O97K516j906
1350c94K08J784j381L38J483j487Q2P06o45j042j60J015q43j657J782m81j612
1367b304K442m38j441K359r3r48J322l3Q0K15o33O98L9j490J123k63k131J426
1385g0m5j558N30N81m19m8L37P25p56M97K040j867j70K681j826n33J983j777q92
1404e87J740j479p93R88j074%O30o50M13J2N96M39n49J012M86j140J108k05o40
1423C07J199r56p68J783k109q24K225j841r71J965r35o45J417k89o5L65Q30Q8
1441G76o86J154L49j730J442K37k137J082L65k162J195j71j219R68o31l3Q65p82
1459a118O22J004r49N86J087j049N21O84k99o53l42R97o78j435J518r20j716K517
$$ y = [516, 1366, 914, -169, 1000, 454, -1490, 292, -192, -1467, -577, -1466, -1385, 130, -1701, -1004, 1512, -394, -186, 1598, 217, 555, 2038, 551, 633, 1339, 694, -348, -508, 507, -336, -1993, -211, -692, -2304, 138, -300, -1741, 618, 525, -423, 899, 866, 946, 1161, 528, 1226, 1265, -225, 898, 635, -1496, -70, -115, -1673, -1143, -562, -981, -1029, -692, 33, -723, -226, 1814, -53, -223, 2458, 632, 99, 2082, 305, -587, 1153, -326, -1119, -131, -1205, -1205, -575, -1225, -812, -800, -204, 235, -314, 698, 1184, 44, 1152, 947, 307, 1506, 550, -218, 1565, -544, -1368, 857, -984, -1955, 10, -925, -1570, -153, -442, -507, -142, 688, 776, 90, 1244, 1593, -137, 1305, 1542, -595, 487, 852, -1310, -115, -286, -1505, -537, -1168, -1201, -336, -1118, -496, 508, -441, 145, 1232, 183, 704, 1388, 1089, 436, 94, 1091, 413, -1022, 496, -424, -2140, 377]
1477C77n28k493K514N09k088J909M93r89J023K75l83m4M96J96r73P7O44j364m08
1496g57J292j675mQ14r89O39P35j085J160J45o82J344k99p59J389k47o03O53o53
1515D18l38k76O6n9q91K69P44j333K03J497j130L68J386j208O87P46n49L68l34
1534F34M3P18j081l08J081j686j8J003j523l50J225o45P5M46O12n06l53J539K03
1553A109j672K084L49k439J977R5k447J360Q44k608O77O97j242P7N43M3m02K42
1571g13J131p09J10J239o99j49J600j462k9J030j277J1N81j900Q96O42j810Q66
1589f42K03q61M43Q97m90L8N76P97o63Q8J239j081p06K000j838r60K104j233j167
1608a256J527q76r43Q09j64P7j09M11J037q02L79J193o33l73J265q36l42M16o42
$$ y = [377, -151, -2644, -130, 379, -1709, 200, 693, -296, 727, 1002, 619, 575, 1071, 1267, 294, 371, 1015, -349, -757, 535, -1140, -1144, -330, -1319, -680, 55, -1030, 130, 275, -407, 937, 638, -121, 1268, 1021, 418, 1071, 418, 80, -196, -130, -189, -1080, -811, -67, -1400, -1197, 300, -830, -462, 924, -284, 403, 1149, 600, 968, 634, 677, 1395, 314, 6, 1087, -599, -617, 386, -1137, -1487, -262, -907, -832, -386, 226, -280, -633, 906, 1109, -563, 1521, 1870, -569, 1408, 1503, -944, 416, 1260, -1348, -671, 26, -1216, -1139, -596, -553, -955, -713, 418, -291, -181, 1058, 359, 210, 1810, 348, 319, 1349, 72, 83, 664, -1236, -340, 302, -1508, -642, -439, -1300, -857, 40, -450, -412, 164, 961, 298, 386, 1625, 544, -162, 1838, 0, -960, 1144, -89, -1256, 271, -605, -1548, -739, -903, -826, -935, -524, 513, -289, 90, 1283, 650, 277, 1542, 706, 364, 780, 138]
1627A38J61l62n34O97j327L97J053j830M85J550j602O88J302j357P02P65n0j26
1645G50j90K29j10m46L12k70j111N98J33r40M96l9n39O46m15K98Q39r79J192J029
1665A483j733J067R97j628M99N63j379J13L39n65m32k56N19l89m55J556r55o73
1683a329K305j025n23J963m32j007J540n81q27N62m44r6Q4q27M91m26m82L36j34
1702h52n1O73k30N48M7n52J597n87p84J975r57p71J409q03j065J147p45j207R20
1721b88k58n28J47M00L13q84O38J060j339Q89J141j296L99J154j371L35K63o03
1739A72r8l0m26L67j267L29P98r90L69R74j057O61P04l16K03J83K73k52l07O88
1759I78n0j305R37l97j121Q31k26j115J337m15o02R34k40j93J084k87L03M99q57
$$ y = [138, 299, -63, -597, 100, -1227, -830, 223, -1607, -1122, 428, -1174, -486, 816, -541, 161, 926, 876, 750, 560, 789, 679, 233, 545, 275, -836, -238, -105, -1045, -549, -588, -1127, -481, -896, -598, 241, -738, 454, 1483, -250, 817, 1814, 186, 685, 1248, -131, -18, 321, -244, -676, -932, -413, -802, -1257, 299, -656, -1329, 976, -49, -572, 1391, 959, -48, 1492, 911, 84, 646, 202, 106, 190, -637, -146, -572, -1054, -718, -852, -903, -230, -460, 88, 135, -417, 1180, 593, -191, 1784, 827, 56, 1465, 662, -403, 744, -1, -1208, -288, -546, -1074, -927, -527, -214, -1098, -460, 600, -739, 150, 1291, -5, 394, 1548, 177, 512, 775, 172, 74, 44, -382, -15, -1282, -953, -155, -1145, -776, 198, -859, -198, 506, 190, 393, 576, 849, 597, 290, 978, 928, -377, 560, 163, -958, -127, -353, -1468, -131, -546, -1148, -214, -454, -647, 437, 150, 453, 952, 95]
1778I5N84P6J65k56k69L9j61q54O34m07j251J766p49j511K105j00j194J907J11
1797G30j502J279O71j090P09K40k67p38M51L71j600K45J155j935K96J104j154
1814a035k55J558r06K7R88m47M89K9J15M63q36K86P62j361o2N27p56j10K76m75
1834g23J16j17K21L91j126Q11J214j100N91J216j451M61O04r13L14j96l34M18
1852C97p79l11P45r78n1P54q89P47p4l11O54J27K99L86q04Q94Q00j805Q78J69
1872H48j489R91K85j693N58M55q30J42L49j79k34L89P94n82j21J648j100k98J615
1891A548r67m94J306j110j63M40r90J33P5o58M61k18l29R47m59p1R12l99M34K67
1911F65j15K77j16k73Q30j027m32J045j301m7R13j474Q2Q84j073L98P18p00P89
$$ y = [95, 679, 755, 920, 664, 395, 434, 273, -581, 53, -354, -1605, 161, -588, -2099, 6, -94, -1288, 619, 730, -772, 507, 1178, 88, 797, 1037, 770, 32, 483, 854, -746, -501, 654, -1281, -985, 119, -1035, -1290, 268, -638, -611, 377, -70, 419, 448, 563, 1026, 190, 476, 1238, -123, -185, 342, -414, -524, -248, -723, -607, -724, -503, -112, -1238, -427, 787, -313, 278, 1494, 43, 504, 1108, 195, 509, 313, -21, 397, -382, -693, 52, -926, -977, -223, -1112, -365, -439, -750, -96, 31, 330, 716, -88, 806, 1606, -199, 679, 848, -641, 350, 635, -1058, -500, -45, -875, -733, -384, -563, -797, -408, 386, -196, -317, 1331, 231, -67, 1548, 581, 87, 1393, 283, 120, 560, -430, -297, -222, -880, -419, -637, -966, -19, -478, -549, 363, -36, 398, 665, 550, 827, 711, 438, 1268, 241, -191, 854, -447, -494, 419, -1055, -973, -89, -1162, -764, -46, -746, 43]
1930D3J73j80N18o80O50N07p73L42K98r50J21J41o55L54l25m39P27j107O56P81
1950B02j108N26J044q16K57J106r36J36M96m19q4j2p1n11n08P81l69j133J395
1969b4n29p26J153m2n46J042k56n7P25j64K71k2n79N21l82p88O75m68l85N97o52
1990f36R6m7l80P78k39m47J418l46o34J448m54m46Q59l62o00R56p02n0p7k63k97
2011d25j96j67P57q62L17O73r91O12O31m90N44N26p19O70l29l73R20j017j74P01
2031F08r45j63N59n34m24O33n41K27N8M22Q6j97O61M50r73P26K47j024P30L07
2051I13j268O84m2j174O44m04j07O40n79L07L99o52M45N28n43O68R0n0L81l20
2071E60N2k50l60O30l18j142P92j64j126J240j09r44J139n0l70O98P4k79K67K34
$$ y = [43, 216, 36, 554, -126, 524, 1031, 258, 600, 898, -52, 69, 210, -445, -91, -416, -855, -128, -1235, -579, 202, -906, -380, 664, -152, 105, 1211, 275, 411, 907, 488, 404, 392, 321, -190, -698, 83, -286, -1419, -24, -553, -1279, -126, -168, -714, 328, 72, 15, 740, 576, 847, 825, 246, 767, 385, -403, 272, -196, -581, 16, -636, -540, -587, -967, -189, -428, -875, 543, 197, -437, 1011, 557, 111, 970, 608, 8, 964, 262, 212, 135, -128, -425, -621, -788, -31, -893, -576, 97, -894, -282, 349, -141, 403, 929, 210, 880, 551, 178, 1098, 81, -93, 608, -337, -500, 59, -475, -899, -266, -807, -580, -522, -100, -14, -211, 450, 900, -73, 653, 900, -124, 606, 913, -355, 329, 287, -887, -243, -647, -754, -114, -693, -386, 13, -639, -194, 334, -209, 459, 549, 499, 880, 560, 612, 362, 2, 632, 314, -828, -36, -200, -1326, -86, -195, -1139, 0, -50, -420, 278, 352, 73, 340, 574]
2091E74K01l74j26O18j114K93P21j410nQ06j246N69J64o35O31J55l61N02K97q9
2111A71L63K33m63M39k68j85J23n44O76q73J61L82j033K61M97r78J72J026q89
2130g29K54Q14m79M14N83n82M56m01L03Q7q79JQ33j114N2L04q23N01n6n40R85
2151a6n05L01O50r76Q19Q34j074P34L73j367P16J25q59J67J45o70K56j40n0N5
2171d82n95J020m05k73R80k49m4Q33o64K81L15o50M45K85q81K58N2q05M37n6n58
2192g56K90R6k87K50J40M02j35k52Q57k23k60J092q79m34J299j138l78R57j175
2211e34k08O28o62K00K25j96K21J70J19L24k41K04J44m70P92K36q68O55m59o41
2231c61R08q69n08Q99n45l85O82p33K87P82o47M57N4L62K08J2j12M23n74J93K79
$$ y = [574, 775, 401, 275, 893, -221, 72, 793, -617, -622, 184, -1062, -493, -329, -964, -333, -178, -539, -37, 260, 171, 534, 767, 304, 743, 475, 290, 413, -131, 545, -328, -167, 215, -818, -557, -60, -1038, -866, 160, -729, -475, 339, -140, 274, 857, 275, 731, 330, 633, 720, -159, -158, 675, -439, -387, -83, -906, -405, -461, -1001, -16, -521, -220, 430, -546, 273, 1107, 33, 767, 1140, -227, 489, 614, -245, -78, 67, -603, -347, -487, -537, -482, -1077, -57, -462, -735, 245, -4, -48, 785, 121, 402, 717, 67, 512, 797, -84, 174, 226, -579, -142, -198, -756, -466, -370, -657, -407, -267, 135, 0, -252, 605, 382, 122, 1214, 335, -99, 1200, 62, -316, 641, -534, -742, -114, -776, -576, -351, -547, -326, -156, -37, 287, 46, 250, 394, -76, 716, 952, 84, 739, 280, -361, 547, -322, -830, 69, -476, -861, -179, -912, -625, 157, -490, -33, 21, 383, 591, 603, 491, 914, 340, 533, 812]
2252H12r91L44J68r74M47j6n83L80j83J11M72m83L95M40n94Q74O1q08Q26M7q03
2273e8L96J19n04K61m58J6k24j85L95n65J54Q20m53j84J011n70R8J162q74j06
2293B51N97n26L3K30n47r6l5J30l01l25J04O5k21L25M21n51Q09k1q30J417l90
2314E39o23J143n86o72R94m82o73P92n54k25N6j47L61q00M56O70q54L96R48j265
2334e26O23P31q95M86M76q54L04J63l73j39j65j76Qo14M79K77p97J045O7m21M61
2355A60l3j77N51r8J13K04n37L98q4o22N50n72q01J144n33l51P01q30L42O08o34
2376e01K85N89n36N79K80n10N01j69j44L2m21L73k61q68R00l36r43J252l23r81
2396a202J229j31p53J116J73l31L08J95K53n32R0K59p02J5M79j077L7P78p04j35
$$ y = [812, -179, 165, 333, -641, -194, -210, -793, -413, -596, -485, -13, -496, -101, 339, -255, 619, 680, -128, 698, 745, -58, 338, 457, -47, 214, -244, -228, -452, -637, -242, -807, -653, 167, -286, -470, 541, -29, 69, 1231, 357, 251, 848, 322, 355, 585, 38, -58, -93, 37, -264, -589, -485, -420, -641, -316, 105, -446, 363, 342, -488, 929, 539, -84, 1059, 473, -199, 795, 313, -360, 432, -122, -347, -291, -438, -77, -877, -421, 249, -605, -209, 739, -526, 97, 828, -67, 419, 895, 41, 345, 508, 135, -4, -169, -345, -337, -951, -472, -195, -992, 53, 120, -301, 160, 127, -50, 501, 403, 516, 720, 183, 581, 497, -125, 425, -147, -948, 196, -337, -688, 13, -817, -475, 133, -501, -216, 373, -163, 416, 696, 186, 687, 518, 374, 406, -15, 358, 97, -771, 129, -207, -1150, 102, -221, -1202, 27, -104, -857, 259, 432, 101, 409, 604, 857, 325, 415, 674, -28, -13, 466, -611, -574, 204, -500, -635]
2416f35O90m16m6N87o49N14K55j91J98K11k74M47l87K66K0m84n4q7n64O90o13
2437e22j69O03p18J09R01n56N03O3j27J86L32k82N13l02l47K47k47O4J21q43K61
2458b10J69q32N35K65m71L27J58k17M75l12L40J94k49L88J75p63N18kp69L73K29
2479C21p99M05k69j47K09k84M40j5l79Q04j67k13R13o17p2M69n17L6M03m55k04
2500a38K59p71M35o7n12M86j29j60L69j4PN45k52M43J48n20O47m28j96P06p60
2521I8k24N77n01k64K29n80J86L39l48Q1J24J8M59j82J65L29l92K36K80n01L52
2542D81k42l61L47j91m04M90n05k42P05m13rK72l62M00N27n21K96k4l2L83n37
2563E8L69k15j90k9J80r88O50l85j38M25K2n15P67k63M2M74j79J19K30mJ30k82
$$ y = [-635, 55, -361, -407, 180, -469, 45, 300, 109, 307, 518, 244, 691, 304, 570, 590, 106, 52, -35, -599, 91, -522, -691, -88, -806, -697, 204, -352, 151, 214, 87, 273, 605, 323, 836, 534, 187, 434, 187, 251, 372, -471, -210, -41, -873, -338, -73, -544, -217, -59, -276, 199, -113, 227, 421, 172, 560, 735, -28, 490, 488, -281, 92, 321, -478, -73, -342, -489, -280, -564, -124, -139, -518, 286, 119, -94, 819, 202, 130, 599, 82, 118, 521, 66, -138, 121, -650, -215, -282, -794, -308, -437, -597, -228, -242, -235, 310, 58, 501, 649, 129, 776, 348, 152, 858, 98, -126, 451, -50, -314, -85, -665, -479, -140, -488, -407, -283, -265, 194, 12, 177, 506, 114, 350, 630, 129, 481, 239, -122, 225, 34, -370, 120, -385, -627, 78, -335, -344, -72, -434, -34, 493, -28, 268, 244, 212, 595, 58, 427, 212, 22, -7, 173, -815, -165, -550, -688, -263, -241, -756, 11, -252, -210, 264, 85, 204, 434, 430, 560, 278]
2585B78r8J22m61O8L05l20k26J61n68L20K09n59Q53P3n79N05K10l06N53J20o49
2606A1N44l98L24j99j01l3l54m59M58l55oL56k61J78L48l11J74J49j36M90j00
2627C19k7K56k80k46N16q20J31M40l91l8K28p66L04j03m3K41J80J22J66k73M79
2648C95K42n00N26n7o28M89j43o28N04j38n60L97k26j89N75m89K78j48L07R2j75
2669g6QN64l97L14N25r79M81J17r12M32K17r35L44M19r82N02L43l92J87K34Q4
2690I8K3j92P45m83p9O44l42m87O13l32p03Q87o08k04M74k14k40n1N0L82k03Q9
2712a33M93m21L08J57l70M42K46o80L95j41n02O39o85k04J23j46K01j08j70N10
2732d6j26o4M03L77n35M43j02m00P23n24j75P71q82k02K49K0m75L02k02M2j81
$$ y = [278, 180, 302, -159, -91, 214, -106, -332, -171, -739, -419, -210, -769, 84, 157, -422, 83, 293, -13, 540, 660, 11, 555, 157, 481, 282, 181, 148, -206, -665, -207, -562, -568, -212, -473, -295, 53, -258, -84, 65, -71, 419, 319, 292, 548, 268, 22, 538, -282, -151, 289, -102, -140, 88, -678, -374, -477, -520, -279, -99, 23, 189, -84, 395, 637, 137, 663, 606, -22, 467, 324, -304, 200, 62, -498, -101, -327, -516, 59, -430, -152, -300, 7, 99, -76, -68, 496, 99, 413, 938, -41, 440, 557, -355, 77, 294, -641, -297, 122, -860, -358, -15, -407, -220, 14, 98, 121, -71, 674, 191, 112, 756, 414, -73, 540, 208, -495, 392, -216, -420, 54, -160, -400, -451, -401, -19, -222, -133, 360, -61, 247, 404, 34, 476, 722, 42, 437, 296, -206, 433, -252, -456, -333, -479, -278, -386, -556, -46, -172, -236, 167, 544, 9, 452, 350, -50, 673, 149, -26, 745, -137, -339, -90, -70, -545, -243, -445, -403, -584]
2753e84K03L92n48O70M20p42L55P39j138N19N46m71k29J57k75m05K10K31l14l93
2773f57O32m65k68R16j97k32Q18o62n3J001m58m66Q16k46m67M06n18J43k90Q4
2793a63R1n34K62M05n99M70L81o21M90J86o54P22J04l93J14j10%K3k09J29k11
2814a17m10M84k91j7J93m08k9Q98n46j44O10j46J97K52l28J83L26n87L45p09M50
2835B06K11p17J08L00r98M78N84r49N43M38m44M94J44m02J05L09j28Q3k82L04
2855C87k03j17l04j7k2J44n3m63O92n75j47P85k36n3L39k17L39j4J28m4o5K06
2877D90k93m33J77K59o58M61k01q16O59K71o28Q43k95k72O11o4J95j05Q5L9j45
2898A80r1M46p00J53K19n55K8N96q04l18R83m63O0M27l32J17K37J3K18k8pL68
$$ y = [-584, -381, 11, -537, 133, 553, -189, 166, 905, -233, 286, 832, 361, 132, 289, 14, -391, -181, 50, -264, -657, -25, -490, -758, 158, -39, -271, 547, -115, -168, 833, 375, -91, 725, 479, 12, 418, -100, 43, -247, -163, -72, -606, -344, 61, -538, -68, 313, -308, 182, 368, -286, 436, 540, 147, 261, 151, 151, 174, -35, 94, -117, -527, -43, -334, -351, -158, -566, -595, 303, -243, -387, 223, 77, 274, 526, 198, 381, 707, 120, 465, -244, 206, 417, -300, -192, 108, -890, -412, 172, -777, -234, 204, -240, 254, 398, -4, 101, 410, 282, 365, 83, 387, 184, 67, -237, -254, -276, -132, -185, -648, 44, -531, -678, 107, -129, -182, 157, -60, 279, 265, 393, 349, 284, 490, 197, -236, -59, 200, -458, 3, -198, -1014, -355, -84, -712, 131, -164, -436, 175, 111, 306, 201, 286, 325, 180, 89, 535, -165, -12, 207, -348, -320, 276, -528, -846, 137, -326, -266, 161, -171, -54, 183, 196, 414, 386, 379, 747]
2920G47o35r5L41n92M43k14m21K83O4n33O84m21o5N35k59J43K36J20j02P3j55
2941A77K16j34n6K83l80k31K15l82L3J06o4j42K74l18L88Q2r3K88k32J40L31n37
2963c6L36K12m90M44R2q06N33k34m10M35m49kJ16%n8P6J3N49m61K06N25o56L51
2986B86M28p02J59L27o56L11j62m61K15j8k50N89l99j39N02n7R5L00m17O09n0
3007E10l33L29j59l60K07j74j66N62p45j51L28l84P4J75k9L71l54J75N81m95L25
3028B87J79k82m6K45j48K8j67j83K17m34l4k9J50l16O29p60L73N39n84K98r0m4
$$ y = [747, 112, 17, 358, -234, 209, -5, -426, -143, -79, -612, 72, -349, -414, 121, -138, 5, 241, 361, 259, 332, 177, 393, 259, 203, 486, 106, -125, 90, -292, -259, -153, -217, -359, -85, -403, -15, 67, -26, 262, 30, 170, 501, -36, 300, 512, 22, 466, 558, -248, 285, 51, -359, 76, -373, -375, -259, -259, -317, -241, -228, 321, -140, 66, 591, -65, 286, 714, 12, 171, 498, -158, 153, -9, -470, -255, -273, -523, 66, -333, -472, 30, -27, 68, 368, -49, 560, 510, 177, 506, 347, -13, 194, 20, -146, 416, -329, -480, -152, -536, -462, -287, -316, 55, -299, -124, 457, -38, 287, 466, 184, 138, 383, 235, 263, 96, -87, 130, -304, -338, -367, -217, -533, 96, -664, -291, 248, -336, -38, -128, -172]
$$ [...]
8191C6
##END NTUPLES=NMR FID
##END=
