##TITLE=1H_Ser C-4
 200.13MHz,.
 8 sc
 
 13.2.2026
##JCAMPDX= 6.0         $$ Bruker NMR JCAMP-DX V2.0
##DATA TYPE= NMR FID
##DATA CLASS= NTUPLES
##ORIGIN= UXNMR, Bruker Analytische Messtechnik GmbH
##OWNER= pz
$$ XWIN-NMR		Version 3.5
$$ Fri Feb 13 15:35:30 2026 Russian Standard Time (UT+4h)  she@DPX200
##.OBSERVE FREQUENCY= 200.131
##.OBSERVE NUCLEUS= ^1H
##.DELAY= (6, 6)
##.ACQUISITION MODE= SIMULTANEOUS
##.ACQUISITION SCHEME= undefined
##.AVERAGES= 8
##.DIGITISER RES= 18
##SPECTROMETER/DATA SYSTEM= spect
##.PULSE SEQUENCE= zg30
##.SOLVENT NAME= D2O
##.SHIFT REFERENCE= (INTERNAL, D2O, 0, 14.3821)
##AUDIT TRAIL= $$ (NUMBER, WHEN, WHO, WHERE, WHAT)
$$ ##TITLE= Audit trail, XWIN-NMR		Version 3.5
$$ ##JCAMPDX= 5.01
$$ ##ORIGIN= Bruker BioSpin GmbH
$$ ##OWNER= she
$$ F:/spectra/data/she/nmr/H-C/1/audita.txt
$$ ##AUDIT TRAIL=  $$ (NUMBER, WHEN, WHO, WHERE, WHAT)
(   1,<2026-02-13 15:34:16.70 +0400>,<she>,<DPX200>,
      <created by zg, POWCHK disabled, PULCHK disabled
       configuration hash MD5:
       00 E9 B6 7A A2 85 ED C7 34 08 36 98 17 FE 4E 26
       data hash MD5: 16K
       D0 81 D9 22 CF 97 3A 88 54 4C 5C A8 85 89 CF BB>)
$$ ##END=
$$ 
$$ hash MD5
$$ 7D FE 75 E8 9B 6D 4C CC 96 7C 64 78 A7 E9 06 DA
##$RELAX= 
##$RELAX= 
##$RELAX= 
##$RELAX= 
##$RELAX= 
##$RELAX= 
$$ Bruker specific parameters
$$ --------------------------
##$DU= <F:/spectra>
##$EXPNO= 1
##$NAME= <H-C>
##$PROCNO= 1
##$TYPE= <nmr>
##$USER= <she>
##$AMP= (0..31)
100 100 100 100 100 100 100 100 100 100 100 100 100 100 100 100 100 100 
100 100 100 100 100 100 100 100 100 100 100 100 100 100 
##$AQSEQ= 0
##$AQ_mod= 1
##$AUNM= <au_zg>
##$AUTOPOS= <>
##$BF1= 200.13
##$BF2= 200.13
##$BF3= 200.13
##$BF4= 200.13
##$BF5= 200.13
##$BF6= 200.13
##$BF7= 200.13
##$BF8= 200.13
##$BYTORDA= 1
##$CFDGTYP= 0
##$CFRGTYP= 5
##$CHEMSTR= <none>
##$CNST= (0..31)
1 1 145 1 1 1 1 1 1 1 1 1 1 1 1 1 1 1 1 1 1 1 1 1 1 1 1 1 1 1 1 1 
##$CPDPRG= <>
##$CPDPRG1= <>
##$CPDPRG2= <>
##$CPDPRG3= <>
##$CPDPRG4= <mlev>
##$CPDPRG5= <mlev>
##$CPDPRG6= <mlev>
##$CPDPRG7= <mlev>
##$CPDPRG8= <mlev>
##$CPDPRGB= <>
##$CPDPRGT= <>
##$D= (0..31)
0 0.7 0 0 0 0 0 0 0 0 0 0.03 0 0 0 0 0 0 0 0 0 0 0 0 0 0 0 0 0 0 0 0 
##$DATE= 1770982456
##$DBL= (0..7)
120 120 120 120 120 120 120 120 
##$DBP= (0..7)
150 150 150 150 150 150 150 150 
##$DBP07= 0
##$DBPNAM0= <>
##$DBPNAM1= <>
##$DBPNAM2= <>
##$DBPNAM3= <>
##$DBPNAM4= <>
##$DBPNAM5= <>
##$DBPNAM6= <>
##$DBPNAM7= <>
##$DBPOAL= (0..7)
0.5 0.5 0.5 0.5 0.5 0.5 0.5 0.5 
##$DBPOFFS= (0..7)
0 0 0 0 0 0 0 0 
##$DE= 6
##$DECBNUC= <off>
##$DECIM= 32
##$DECNUC= <off>
##$DECSTAT= 4
##$DIGMOD= 1
##$DIGTYP= 9
##$DL= (0..7)
0 120 120 120 120 120 120 120 
##$DP= (0..7)
150 150 150 150 150 150 150 150 
##$DP07= 0
##$DPNAME0= <>
##$DPNAME1= <>
##$DPNAME2= <>
##$DPNAME3= <>
##$DPNAME4= <>
##$DPNAME5= <>
##$DPNAME6= <>
##$DPNAME7= <>
##$DPOAL= (0..7)
0.5 0.5 0.5 0.5 0.5 0.5 0.5 0.5 
##$DPOFFS= (0..7)
0 0 0 0 0 0 0 0 
##$DQDMODE= 0
##$DR= 18
##$DS= 0
##$DSLIST= <SSSSSSSSSSSSSSS>
##$DSPFIRM= 0
$$ [...]
##$SUBNAM0= <"">
##$SUBNAM1= <"">
##$SUBNAM2= <"">
##$SUBNAM3= <"">
##$SUBNAM4= <"">
##$SUBNAM5= <"">
##$SUBNAM6= <"">
##$SUBNAM7= <"">
##$SUBNAM8= <"">
##$SUBNAM9= <"">
##$SW= 18.0517599122864
##$SWIBOX= (0..15)
0 0 2 0 0 0 0 0 0 0 0 0 0 0 0 0 
##$SW_h= 3612.71676300578
##$TD= 16384
##$TD0= 1
##$TE= 0
##$TE2= 300
##$TE3= 300
##$TEG= 300
##$TL= (0..7)
0 120 120 120 120 120 120 120 
##$TP= (0..7)
150 150 150 150 150 150 150 150 
##$TP07= 0
##$TPNAME0= <>
##$TPNAME1= <>
##$TPNAME2= <>
##$TPNAME3= <>
##$TPNAME4= <>
##$TPNAME5= <>
##$TPNAME6= <>
##$TPNAME7= <>
##$TPOAL= (0..7)
0.5 0.5 0.5 0.5 0.5 0.5 0.5 0.5 
##$TPOFFS= (0..7)
0 0 0 0 0 0 0 0 
##$TUNHIN= 0
##$TUNHOUT= 0
##$TUNXOUT= 0
##$USERA1= <user>
##$USERA2= <user>
##$USERA3= <user>
##$USERA4= <user>
##$USERA5= <user>
##$V9= 5
##$VALIST= <valist>
##$VCLIST= <CCCCCCCCCCCCCCC>
##$VD= 0
##$VDLIST= <DDDDDDDDDDDDDDD>
##$VPLIST= <PPPPPPPPPPPPPPP>
##$VTLIST= <TTTTTTTTTTTTTTT>
##$WBST= 1024
##$WBSW= 4
##$XGAIN= (0..3)
0 0 0 0 
##$XL= 0
##$YL= 0
##$YMAX_a= 345043
##$YMIN_a= -304550
##$ZGOPTNS= <>
##$ZL1= 120
##$ZL2= 120
##$ZL3= 120
##$ZL4= 120
##$ABSF1= 10
##$ABSF2= 0
##$ABSG= 5
##$ABSL= 3
##$ALPHA= 0
##$AQORDER= 0
##$ASSFAC= 0
##$ASSFACI= 0
##$ASSFACX= 0
##$ASSWID= 0
##$AUNMP= <proc_1d>
##$AZFE= 0.1
##$AZFW= 0.1
##$BCFW= 1
##$BC_mod= 2
##$BYTORDP= 1
##$COROFFS= 0
##$CY= -3
##$DATMOD= 1
##$DC= 2
##$DFILT= <>
##$DTYPP= 0
##$F1P= 0
##$F2P= 0
##$FCOR= 0.5
##$FTSIZE= 0
##$FT_mod= 4
##$GAMMA= 1
##$GB= 0.15
##$INTBC= 1
##$INTSCL= 1
##$ISEN= 128
##$LB= 0.25
##$LEV0= 0
##$LPBIN= 0
##$MAXI= 10000
##$MC2= 0
##$MEAN= 0
##$ME_mod= 0
##$MI= 1.114404
##$NCOEF= 0
##$NC_proc= 0
##$NLEV= 6
##$NOISF1= 3.799351
##$NOISF2= 2.8
##$NSP= 1
##$NTH_PI= 0
##$NZP= 0
##$OFFSET= 14.38212
##$PC= 1
##$PHC0= -3780.316
##$PHC1= 6.992321
##$PH_mod= 1
##$PKNL= yes
##$PPARMOD= 0
##$PSCAL= 0
##$PSIGN= 0
##$REVERSE= no
##$SF= 200.129724274929
##$SI= 16384
##$SIGF1= 3
##$SIGF2= 2
##$SINO= 400
##$SIOLD= 16384
##$SREGLST= <1H.CDCl3>
##$SSB= 0
##$STSI= 0
##$STSR= 0
##$SW_p= 3205.1282051282
##$SYMM= 0
##$S_DEV= 0
##$TDeff= 0
##$TDoff= 0
##$TI= <>
##$TILT= no
##$TM1= 0
##$TM2= 0
##$TOPLEV= 0
##$USERP1= <user>
##$USERP2= <user>
##$USERP3= <user>
##$USERP4= <user>
##$USERP5= <user>
##$WDW= 1
##$XDIM= 8192
##$YMAX_p= 0
##$YMIN_p= 0
$$ End of Bruker specific parameters
$$ ---------------------------------
##NTUPLES= NMR FID
##VAR_NAME=  TIME,          FID/REAL,        FID/IMAG
##SYMBOL=    X,             R,               I
##VAR_TYPE=  INDEPENDENT,   DEPENDENT,       DEPENDENT
##VAR_FORM=  AFFN,          ASDF,            ASDF
##VAR_DIM=   8192,          8192,            8192
##UNITS=     SECONDS,       ARBITRARY UNITS, ARBITRARY UNITS
##FACTOR=    0.0002768,     1,               1
##FIRST=     0,             0,               0
##LAST=      2.2672688,     0,               0
##MIN=       0,             -304550,         0
##MAX=       2.2672688,     345043,          0
$$ Real data points
##PAGE= N=1
##DATA TABLE= (X++(R..R)), XYDATA
0@%%%%%%%%%qJ6j6J6k4L2m0M8n6P2q8J04j20J44j70J96k34K72l12L60m16M80n45
32b89O17p04Q00r00J011j132J265j414J574j750J943k153K384k634K908l209L537
49A854l895M288m724N208n742O341p016P777q647R653j0833J2236j3940J6059
63H619j8773K2397k7502L5273m8660P7890k48144J14547L15585l09138K26801
74A48895j20558j88789L36060j27388l52770K81671Q2840J7280J16319k44084
84e0524r1210J91589p5276l0076O735L1162J88831o7578j67315L0362r6300R4133
96c5467J46883j97740J08356J79157k61021L4344L8806k29555K53044J12831k67010
107a17372K18826M2902k84310J48932m2913j49910L15757k6335j95589J91038
$$ plain form
0 0 0 0 0 0 0 0 0 0 0 -8 8 -8 8 -16 16 -24 24 -32 40 -48 56 -64 80 -90 106 -128 144 -168 192 -224 256 -289
32 -289 328 -376 424 -476 535 -597 668 -746 828 -922 1021 -1132 1252 -1382 1526 -1683 1854
49 1854 -2041 2247 -2477 2731 -3011 3330 -3686 4091 -4556 5097 -5736 6500 -7440 8619
63 8619 -10154 12243 -15259 20014 -28646 49244 -198900 -84353 231232 -77906 148895
74 148895 28337 -160452 175608 48220 -304550 -22879 59961 77241 193560 -50524
84 -50524 -141734 49855 -25421 -55497 -48762 -17600 171231 103653 -63662 -33300 -129600 -35467
96 -35467 111416 -86324 22032 201189 -59832 -25488 13318 -216237 36807 149638 -117372
107 -117372 101454 144356 -139954 8978 -33935 -183845 131912 105577 -90012 101026
117A01026o4335j22194J03398j29556K5299K31991p1595o5472m672p2956Q6328
128A7262k4641j02593J20120M7048K7774K3428k23303J777J72231j01920L7877
139d940O7376j20988J59444K4067k87175Q4028R7113p5073J68721n2264j65335
150a05026J91543l1781j74608J00705k6310J9234J79650j22301r3678R4284o8024
161c6312j893M1633o7099J01545O6591r8388l386m8197k5720J02019m8644m859
173b2710J08621o8179j0570J7780j31040P2466R0207j00354Q0364L9345j13599
184c7669O8902l7218j14017J40712K0438o8130R7985n2336n8911Q0955r0099l1405
196h0793J19573k2105J2048L0308r7495K0338L2053o9971M2219K9293p401O4506
$$ plain form
117 101026 36691 -85503 17895 -111661 -86362 145629 74034 8562 3890 -69066 17262
128 17262 -7379 -109972 10148 57196 84970 108398 -114905 -113128 59103 -42817 -4940
139 -4940 62436 -58552 100892 124959 -162216 -78188 18925 -56148 112573 60309 -105026
150 -105026 86517 54736 -119872 -19167 -45477 -26243 153407 31106 -62572 31712 -36312
161 -36312 -38205 3428 -63671 37874 104465 6077 2691 -45506 -71226 30793 -17851 -22710
173 -22710 85911 17732 7162 24942 -106098 -33632 56575 -43779 36585 75930 -37669
184 -37669 31233 -5985 -120002 20710 41148 -26982 71003 18667 -40244 40711 -49388 -80793
196 -80793 38780 16675 28723 59031 -38464 -18126 13927 -56044 -13825 15468 8067 72573
208G2573n7945o8018N0323k7135R384N6468n3459L7536N1005r7224j463J7441
220a0514m7723Q3580K0145p1251O3041q519p0718M3078l2103j5309R9258k5566
232B7399l2742M0199n5783p846L6774m7913L4651N2407l9455J2456j3407m9934
244d3194L9462k343j9531N4517r499j2853K2285n5922o621M1345k7990K5281L0974
257C5911l9556K0793l978n7112L1543J3852j6584M7000j1551l0493K8979l1269
269a2465k2147L7426j0906J3004L1979l6658m129J0110l3167J5560J5418j3107
281i082L1964m50l0258J1195j6084j1286K9875p681M007K5405k4242q048M857
294A72k5137J5800J9677j2893J8106R80k5102Q017r324j1577K6578J357k879J4934
$$ plain form
208 72573 14628 -53390 -3067 -30202 -20818 35650 -17809 19727 70732 -26492 -27955 -10514
220 -10514 -58237 25343 45488 -25763 37278 28759 -41959 1119 -30984 -46293 52965 27399
232 27399 -5343 34856 -20927 -28773 8001 -39912 -5261 47146 7691 20147 6740 -43194
244 -43194 -3732 -6075 -25606 28911 19412 6559 28844 -27078 -33699 7646 -20344 4937 35911
257 35911 -3645 17148 13170 -43942 -12399 1453 -15131 31869 20318 -10175 18804 -12465
269 -12465 -34612 2814 -8092 4912 36891 233 -3896 6214 -26953 -11393 4025 -9082
281 -9082 22882 22432 -7826 3369 -12715 -24001 5874 -1807 2200 27605 3363 -4685 172
294 172 -24965 -9165 10512 -2381 15725 16705 -8397 -380 -9704 -21281 5297 6654 3775 18709
308A8709j7889r579P936j4723P301J7866o653P906O59j9526K922r60p100J6127
322B996M583k860P700j1320j0512M698m541M949J2491k500J361p20j2310j307
336g292J591m81R722L996k599O90o508o044J638J03M307O797q6j213k915n964
352d258j819J239K777M810L137k35l761m140k477j362L800M625R20K606k086o596
368b820j9j499o81P594N75j106L741o307l703L296m380L538P127m627K431Q87
384D047q777L090K83m518R337N72m383N800o904m243P473n910K043R002p653K444
400A703K811j1800O027L552q194J0239k12q400J0058o151p439J2082o328j485
414c537J1905j0782N15Q942j3513L986P212j1239R855K958j2944J0317j823r921
$$ plain form
308 18709 820 -8759 -823 -15546 -8245 9621 2968 10874 11533 -7993 -5071 -6031 -13131 2996
322 2996 7579 4719 12419 1099 -9413 -4715 -9256 -4307 8184 5684 7045 6325 -5985 -7292
336 -7292 -5701 -6182 3540 7536 4937 5627 -881 -6925 -5287 -5184 -877 5920 5834 4621 1706 -4258
352 -4258 -6077 -4838 -2061 2749 5886 5651 1890 -2250 -4727 -6089 -2289 2336 3256 5862 3776 -2820
368 -2820 -2839 -4338 -5019 2575 3150 2044 5785 -522 -4225 -929 -5309 -1771 5356 729 3160 4047
384 4047 -4730 -1640 -1357 -5875 3462 4034 -349 5451 -1453 -5696 1777 -4133 -2090 6912 -741 1703
400 1703 4514 -7286 -1259 2293 -5901 4338 4126 -4274 5784 -367 -7806 4276 -2052 -3537
414 -3537 8368 -2414 -1899 7043 -6470 -2484 4728 -6511 3344 6302 -6642 3675 1852 -8069
428h069J2806n051m941J3938r979l232J0966j2088L496R358j3802P796N574j4218
442g446J0464J7j1921J5027m229r659J5631q843n190J4921j3616QJ4484j5481
456e833M361R848j6921R750N694j6578J3577J165j3793J5145n406r940J7167r124
470h88n153J4994j3350P03J2169j5816O549Q675j5655J0926J925j4889J5254l020
484B424j1452J7339q581o860J7290j4275k082J6116j6764M315J3087j8870Q993
497F80P847j9330J3287L232j6148J7096k331j3411J6894q451q215J7387j1416
510b879j813J4637j4952L164R434j6529R416N661j4439J3811j450j2891J6267
523G437p790q934J8034j1544k341J6930j7480J680J3992j9368P803J0563j8546
$$ plain form
428 -8069 4737 -314 -5255 8683 -1296 -4528 6438 -5650 -2154 7204 -6598 1198 6772 -7446
442 -7446 3018 3035 -8886 6141 1912 -7747 7884 -959 -6149 8772 -4844 -4836 9648 -5833
456 -5833 -1472 8376 -8545 1205 6899 -9679 3898 5063 -8730 6415 1009 -8931 8236 -888
470 -888 -6041 8953 -4397 -3694 8475 -7341 -792 7883 -7772 3154 5079 -9810 5444 2424
484 2424 -9028 8311 -270 -7130 10160 -4115 -6197 9919 -6845 -2530 10557 -8313 680
497 680 8527 -10803 2484 5716 -10432 6664 4333 -9078 7816 -635 -8850 8537 -2879
510 -2879 -4692 9945 -5007 -1843 7591 -8938 478 6139 -8300 5511 4061 -8830 7437
523 7437 -353 -9287 8747 -2797 -5138 11792 -5688 -4008 9984 -9384 -1581 8982 -9564
536i564J3566M655j9587J4937n47j4284J8105n641r643J8089j0840o154J4284
549G376j3273K524J2571j5342O579P122j5188J0217J07j2877J6383l067r997J5388
563H523j0078n309J5740j4711J06J6028j5220M804R253j9006R919O858j7127J3711
577C491K269j3570J5440n807j2029J6694p651n182J5287j1907L21J2004j6176
590f816L841Q866j3527J0528L313j3989J3335k179j2699J3958n692n206J6305
603A0038j1451l853J3767j3377J166J0034j4117Q807Q429j5900P963J932j1879
616h441J3096l016j0006J5576m871o634J0666j1737L0J3614j2571K449R058j2301
630e088P549K539j5493J1685L337j0103J1897n011q328J4234q422o322J2987q031
$$ plain form
536 -9564 4002 8657 -10930 4007 3460 -10824 7281 1640 -8003 10086 -754 -6908 7376
549 7376 -5897 -3373 9198 -6144 435 7557 -7631 2586 2693 -10184 6199 3132 -6865 8523
563 8523 -1555 -6864 8876 -5835 -5729 10299 -4921 -117 9136 -9870 49 6907 -10220 3491
577 3491 5760 -7810 7630 1823 -10206 6488 -1163 -6345 8942 -2965 -2644 9360 -6816
590 -6816 -2975 5891 -7636 2892 6205 -7784 5551 3372 -9327 4631 -1061 -6267 10038
603 10038 -1413 -5266 8501 -4876 -3710 6324 -7793 1014 9443 -6457 1506 3438 -8441
616 -8441 4655 1639 -8367 7209 2338 -4296 6370 -5367 -5337 8277 -4294 -1845 7213 -5088
630 -5088 2461 5000 -10493 1192 4529 -5574 6323 1312 -7016 7218 -1204 -7526 5461 -2570
644b570J471J0086j4099K714P991j2040O732L489r899J1442r45j0960J0047m389
658i30n037J1968p693j348J1297j1014j34P332j1011O450O028j1537Q519K369
672E259j1305Q311k317o986J2871m248o067J0370p017k127P878j0222K807R562
686F769r005L326K461r568Q008M05r212R401k95m438Q301q100l997J0392o517
701b069k16P258q222M378M961j1832M097L802o676Q350q98p782Q987k838o279
716d979P337m709l31R203p410q85N719p734K682L630p272O590K676p444N152j864
732C61n417P654l023k783Q263m750j951N016p199J644N715o640L722L631o710
747b467M038o23o448P022p5m012O323l324k543N471n987r03O299m014K168K947
$$ plain form
644 -2570 -1099 8987 -5112 -2398 5593 -6447 285 3774 -6125 5317 4372 -6588 3459 -930
658 -930 -5967 6001 -1692 -3040 8257 -2757 -2891 4441 -6570 -120 5908 -5629 2890 5259
672 5259 -6046 2265 -52 -7038 5833 1585 -4482 5888 -1129 -3256 4622 -5600 -2793 6769
686 6769 -2236 1090 3551 -6017 1991 2396 -6816 2585 2290 -2148 6153 -1947 -5944 4448 -2069
701 -2069 -2285 4973 -3249 1129 6090 -5742 -1645 2157 -4519 3831 2933 -4849 4138 1300 -4979
716 -4979 2358 -2351 -2682 6521 -889 -1774 3945 -3789 -1107 2523 -4749 1841 4517 -2927 2225 361
732 361 -5056 2598 -425 -3208 5055 305 -1646 3370 -3829 -2185 3530 -3110 612 4243 -2467
747 -2467 1571 948 -5500 1522 1447 -2565 3758 434 -2109 3362 -2625 -3528 2771 -1243 925 3872
763C872o844L039J783n936M418P65l038O006k817m566M903l043r82N265m125J085
779b15M473n836M42K093m562M201J907m469M135l70m352L460k086j762N606k086
795E79j099L381m121j50K476l839K536K819l361K316l44l876L159q82k031M527
811B090j216j220K826l846o41L187k997J448K860l127J738M07m307K295P96j954
827a661L462n27k085K555k239j756K632j308Q14K550k566J76Q38k758J221Q22
843A70j328K674j6k089J379j503j145K373j008K84K357j985l53P48k420J044J531
860G13j357J707M78k131Q37p14j350K094N4l41J572j221q36O43j460M40J508n59
878G7Q19J78j598L85l29q64J448K90o0R87j181q81N58p98L60J241l99N01K43j486
$$ plain form
763 3872 -2972 67 1850 -4086 332 1097 -1941 4065 1248 -3318 1585 -1458 -2440 2825 -1300 -215
779 -215 4258 -1578 -1136 957 -3605 596 2503 -1966 2169 1799 -2553 907 -1179 -2941 2665 579
795 579 -520 2861 -1260 -1410 1066 -2773 -237 2582 -779 1537 1193 -2683 476 -406 -2437 2090
811 2090 874 -346 2480 -1366 -2007 1180 -1817 -369 2491 -636 1102 1509 -2798 -503 293 -1661
827 -1661 1801 1274 -811 1744 -495 -2251 381 -927 -113 2437 -129 47 885 -1873 -652 170
843 170 -1158 1516 1500 -589 790 -713 -1858 515 -493 -209 2148 163 -190 558 -1862 -818 713
860 713 -644 1063 1541 -590 247 -467 -1817 277 331 -10 1562 341 -495 148 -1312 -872 636 77
878 77 896 1074 -524 -139 -468 -1332 116 406 346 1333 152 -729 -171 -969 -609 632 233 734 977 -509
898e09j01J19l80J078M99l59M42n44r04J23j39L30R64J1j04j14p40k77L1O3P15
919B04M83m7j94n81m53K0Q3M16N56J73j01m92n52j51J38L92L88K35R1l66n01k72
941e31j46M12N95O3J58j29o27j20j91j35Q25L30j07K16o39m79K94l67K65Q69j86
962C70R9m5r98J07K76l45P92L09m05M00o03p40O09j69J40R05m77j2K80j091O2
983e36M76m10R22K64q34N16l63q53P95k10l4J234o86m31N53j027J14Q02p85P39
1003B46O69j098L28j36r62J064L3n31J132m20n54O48j080l8J183p01M01O12j195
1022c99N00J23j228J030L05o55J166n85r13J110p92l85J294p43J98R94j444J20
1040c04O55j159Q35M76r72J076j33j183R33m63m45J369p26j67J080j218jP13j186
$$ plain form
898 -509 -610 -491 -871 207 706 347 789 245 -659 -536 -675 -345 619 630 526 412 -328 -605 -574 -511 204
919 204 687 640 446 -135 -588 -568 -485 -69 487 660 559 67 -485 -636 -498 -106 282 517 608 242 -259 -531
941 -531 -677 -265 330 393 551 422 -205 -325 -516 -651 174 504 397 613 -26 -505 -211 -578 -313 556 370
962 370 469 424 -574 -467 -191 -536 256 565 160 560 -43 -783 -174 -343 -203 702 225 213 493 -598 -536
983 -536 -60 -470 452 716 -118 398 35 -818 -23 -233 -267 967 281 -150 403 -624 -510 292 -493 246
1003 246 915 -183 145 9 -953 111 144 -387 745 325 -229 419 -661 -699 484 -217 184 796 -399
1022 -399 101 224 -1004 26 331 -324 842 257 -656 454 -338 -723 571 -172 26 1020 -424 -304
1040 -304 351 -808 27 503 -469 607 474 -709 224 -239 -684 685 -41 -208 872 -346 -347 366 -820
1059h20Q35P31j251R04Q3j300J117l21q47J585m74o47J196j091k62J166j185K95
1077b86J100j151N36L44j378R12K16j009J196k12o91J156r21n26J255r11J46J046
1095H22j315N05O92j510P67M14j147J301n8j202J292m76q53J330p92k53J388j095
1113a90q9R19j248M67P01j203Q69L31j121R62k86q72J258n17m95J251r19j53J037
1132G02j269K79R32j242O88N50j294R29R5j200J195j59q40J289o04n82J190r45
1150b86j80J084j009L06P64j194N85L85j128R00K4q41J156m22o95J128p67k78
1168d68J103j012J45R68j175L88N77j211P82L37j091J023l3r24J072m70o49J175
1186E37o45k45J008r12L7P73j052M03N41r62P61J73r45Q54k07p29J043m49l86
$$ plain form
1059 -820 15 746 -505 399 482 -818 299 -22 -869 716 242 -405 791 -300 -562 604 -581 -286
1077 -286 814 -337 199 543 -835 77 293 -716 480 268 -423 733 -188 -714 541 -370 -224 822
1095 822 -493 12 704 -806 -39 375 -772 529 471 -731 561 85 -768 562 -230 -483 905 -190
1113 -190 -279 640 -608 -141 560 -643 226 557 -564 398 112 -760 498 -19 -514 737 -182 -335 702
1132 702 -567 -288 644 -598 90 640 -654 275 370 -830 365 206 -634 655 51 -531 659 -286
1150 -286 -466 618 -391 -85 679 -515 70 455 -673 227 251 -590 566 144 -551 577 -190 -468
1168 -468 635 -377 -232 736 -439 -51 526 -685 97 434 -657 366 333 -591 481 11 -638 537
1186 537 -108 -353 655 -257 -220 553 -499 -96 445 -517 244 417 -528 326 119 -610 433 -16 -402
1205d02J052p86j53Q14r75K37P25r58N56L92j015P22J4q66R51j83n67J000n64
1224fl94Q67p71k7Q29q08L12N32r49M63K33q53P70M3o53Q64l27n51P96n63j84
1245c77Q48o51R7O18q69K48L76q09N98K52o98O92j13o77P27l52l50Q58m47j41
1265a70O56p28L0N10p13M01L92o48N02K6p08O05j34m09P59l09k43O22o16j06N63
1286B82n99K63M73o27L55J44p26M61N9m60O96j39m10N62m08k78N57l84O1N46n38
1307a10J02K46o02L10J82m15N24K1m43M06k87k90N47k76l1N13m48QK69n63K22
1328a15L16m11L92J06m88L47j48l70M92r0j41M73l65j41L11m38R5L60l31K74J42
1349B70m53K09k6l27M06Pj74L88k57k17K69k95L5L75k55J38J78m24J10O3k89L49
$$ plain form
1205 -402 650 -136 -289 525 -450 -213 512 -446 110 502 -513 209 223 -643 308 125 -442 558 -6
1224 -6 -400 467 -304 -331 498 -310 2 534 -415 48 281 -572 198 241 -412 452 125 -426 370 -193 -377
1245 -377 471 -180 -83 535 -334 -86 290 -519 79 331 -367 325 212 -465 262 -90 -440 418 -29 -170
1265 -170 486 -242 -212 298 -415 -14 378 -270 232 258 -450 155 21 -388 371 62 -181 441 -175 -281 282
1286 282 -317 -54 419 -208 147 291 -435 26 85 -375 321 182 -228 334 -74 -352 205 -179 -118 428 -110
1307 -110 -8 238 -364 -54 128 -287 237 258 -185 221 -66 -356 191 -85 -116 397 -51 -43 226 -337 -115
1328 -115 201 -210 182 288 -200 147 -1 -371 121 31 -110 363 -2 -143 168 -270 -175 185 -146 128 270
1349 270 -183 26 0 -327 79 86 -88 300 43 -174 95 -200 -165 210 -45 93 271 -153 -43 20 -269 80
1371H0Q0k23K82j53k66K57k05j6L75j74JJ74l67K9J45k54K56J71k27K04j21k68
1393b20K18p5n9L20j13n0J48k83l6J57j46J87J53k00J10n4k57J68j4m4K83q6j07
1416@J10k22n9J92j09J13J81k04K8Kk24J17P4n5K09j5j58M9j21o2J59k0M3J49
1440A77j37m9oj45J05Q4k5J37k8j21J6j07n1J66J6L4Q0j33m6J2j17P0J10rP2j2
1466I3j38nl8k4J19M5JN0p8r4kk7O4R1PK9k8j04k7j0OJ02M8Lnp7o1kj6P0Q6J3
1498I1k9j4r1l1mL8O3N5J0m9o8l7j8K3O2M6K8k0o5l7l4NP9M0K0Nm7n5k3k7N4R0
1530F0NPj6r0nj7j7J06L4jRr2m5J9l6O6P4k8K4k0j07mK0pJ04K2m2M4q6o8M5mM2
1563dJ00n0qNj04JL5j2R0L3o9J8n1p4P7j8K3J06n3k6%j05K5O5m0Q1L3r2L1m7r2
$$ plain form
1371 80 160 -63 219 66 -200 57 -148 -164 211 37 38 212 -155 -126 19 -235 21 192 -35 169 48 -220
1393 -220 -2 -77 -136 184 71 21 169 -114 -150 7 -139 48 201 1 111 57 -200 -32 -46 -90 193 107 0
1416 0 110 -112 -171 21 -88 25 206 2 30 32 -192 -75 -1 -56 153 138 -20 29 -92 -154 5 -15 28 177
1440 177 40 -9 -15 -160 -55 29 4 141 113 -8 8 -99 -150 16 32 66 146 13 -33 -21 -138 -68 42 33 105 93
1466 93 -45 -50 -88 -112 7 52 53 103 25 -69 -71 -98 -34 57 64 93 65 -39 -66 -76 -70 32 80 83 78 1 -60 -62 -78 -8 78 91
1498 91 62 48 -43 -74 -78 -40 23 78 88 39 -29 -66 -84 -61 1 47 75 55 -10 -47 -81 -76 3 43 63 68 21 -34 -57 -84 -30 60
1530 60 65 72 56 -34 -39 -56 -73 33 67 66 75 -17 -62 -43 -79 -13 61 33 57 37 -70 -74 -54 -61 43 65 23 67 -19 -87 -42 -46 -4
1563 -4 96 46 38 43 -61 -60 -25 -37 53 86 17 35 -16 -90 -13 -31 -8 98 45 19 19 -86 -61 4 -36 45 78 -14 17 -30 -122
1594a22J16Kj3J10n5o1L4r5J2R9m7N8M9j07J5lq5Q5M3k8Q9m9q9N1o6mJ06m4M0
1623D1N0j27J8J4r0Q6M1o0J05m5j16Q1o4qJ38n4j0P7j10k0N8q4P0Q7p8M9pj07
1651f5O2j6m6J22k2l0P1j04k0P3p8N5Q0q5L7Rj29P4Ln0J20k7o9R0q7m5R1o3K9
1680b0J03j12L2L8j25O0L7n8R7j1p3Q3p3n6J12m5J0R9j00nM0r7M9N5r2J08rr6
1708d9P3k8o9J02j6m3J02p4l2P5j16K6Q7p6N7K7r6N0Np4R3j5l0R7o5m4P1p8J0
1737c0R0p2K6M7j10N0K3q2P8J8o7P7m0n4P5o2KP8o0QM9r5L3M1q4P3K5p7P3k4p2
1768f3Q6m1k3R4m2k2N6p8PN8p3M6M1p0N3j4p0P0jn4Q5l8k7N8o2j5P2o5L5M5q9
1799d1M6K1q7O7Ln6R1m3n6P8m5k1Q1n3J1N8p7OM4o5M8J3m3N4j4m7N2k3l7P0l5
$$ plain form
1594 -122 -6 -4 -17 93 38 -23 11 -84 -72 27 -20 38 87 -20 -5 -8 -93 -8 35 7 96 47 -42 9 -57 -61 45 1 41
1623 41 91 -36 -18 -4 -94 -8 33 -27 78 33 -83 -2 -66 -74 64 10 0 77 -33 -53 5 -79 -9 78 0 49 42 -65
1651 -65 -3 -19 -65 57 35 5 76 -28 -48 25 -53 2 82 -3 34 43 -86 -12 -9 -59 61 34 -35 55 -32 -77 14 -49 -20
1680 -20 83 -29 3 41 -84 -24 13 -45 52 41 -32 51 -22 -78 34 -11 -1 98 -2 -7 33 -64 -15 40 -52 56 47 -49
1708 -49 24 -4 -73 29 13 -30 72 -2 -34 41 -75 -49 38 -38 19 46 -50 0 5 -69 24 9 -21 76 11 -33 38 -40 -30
1737 -30 60 -12 14 61 -49 1 24 -58 20 38 -29 48 8 -46 29 -33 -31 47 -13 -5 44 -51 -18 23 -61 12 37 -40 33 9 -63
1768 -63 23 -18 -41 53 11 -11 45 -33 -26 32 -41 5 46 -24 29 15 -55 15 14 -40 45 7 -20 38 -24 -39 33 -32 3 48 -41
1799 -41 5 26 -61 6 9 -47 44 1 -55 23 -22 -43 38 -15 -4 54 -23 -17 27 -38 10 23 -20 34 20 -27 25 2 -35 35 0
1830@j9O1m8j4M6o3L3L0o1N1Oo3N1j2m5P4k9k6N5m0j6M7m2J8L4l6K1J3n1L2Nl4
1862b2M3Ll6M1k3k6M5k4j6N0m9NL1n2K7J9m5L6Nm6M9k8j7N2l4j0N9n9JL7l9J2
1894a1L6m2L4Ol7K9ll7M0oj6L4j7j4L2l6kL4l2K1Ml2K8%l5L9j0k7L3k9j0L1j9
1927a4qL8k3LJ5m0K2J6k8L1J2l6K2j3pK3mj2K8k7lL4l6NJ3j4PJ6k3m%j3J8mJJ2
1963Gj7kNj6lK5qjJ0j1RorJ8kmJ9j7mJ7j3MJ0qOOj7MJ9k9ORoLrOLj0kJ2lj0J4
2006Ek9J2Rj4J7Mj2J0j1NjjoK4nqJ6k0%J0j4K3rPlKj8O%QPpnpnN%nMJ3j2oMj5
2050b2J0JJNlmJ2j5%QJ2j4J2Qnmj0J2jPKLpnj0%K2oMJj0qqRoQKj1L%rKjQLj%r
2098a4J5j7J3qJ3LLKk0J3L%OmKknlOmOj2RllmJkO%rOjj2LOLRj0Qlj4%J4j7K3K
$$ plain form
1830 0 -19 42 -6 -20 26 -37 -4 26 -35 16 22 -41 10 -2 -47 27 -2 -28 27 -13 -29 18 -24 -6 28 -8 13 26 -25 7 12 -22
1862 -22 21 24 -12 29 6 -20 25 1 -15 35 -14 -9 22 -30 -3 16 -29 7 12 -34 15 -13 -30 22 -12 -22 37 -22 -21 16 -23 -11
1894 -11 25 -17 17 23 -14 15 12 -25 15 9 -7 27 10 -4 28 -8 -10 24 -8 13 17 -15 13 13 -22 17 7 -20 13 -16 -26 5 -14
1927 -14 -22 16 -7 -4 11 -29 -7 9 -19 12 24 -12 10 -3 -10 13 9 -3 25 -2 -5 29 -7 -2 11 -3 4 20 -3 -7 -7 -20 -2 -6 -5 7
1963 7 -10 -12 -7 -23 -26 -1 -9 -10 0 -11 -2 -8 -17 1 -1 -5 14 -3 -7 10 -3 1 11 3 9 15 -2 2 21 -8 -2 7 1 4 -5 1 4 -6 -8 4 1 -9 5
2006 5 -24 -12 -3 -17 0 4 -8 2 -9 -4 -5 -6 -12 12 7 -1 15 -5 -5 5 -9 14 5 12 9 11 -7 -1 -1 7 14 7 2 -5 -10 -5 -5 -10 -6 7 -5 -11 -7 -22
2050 -22 -12 -11 -10 -5 -8 -12 0 -15 -15 -7 5 -9 3 11 6 2 -8 4 3 10 12 15 8 3 -7 -7 15 9 13 14 4 -4 -12 -3 -9 -1 1 -10 -7 -7 -16 -14 -15 -7 -4 -5 -5 -14
2098 -14 1 -16 -3 -11 2 5 8 10 -10 3 6 6 12 8 10 8 3 0 6 2 8 -4 5 2 -1 -5 -4 -6 0 0 -9 -3 -4 -16 -13 -7 -4 5 -5 3 0 -14 -14 0 -17 6 8
2145Hj0OMk5J6nNJ1nlMKojmQLjnnj0jjRJ0j8J8j2jkKPOjj2jmoJ4Rk2L4j4NNk2
2191a1O%OOKqPj4kJ1JqMj0LOk5QNlLJ1qjLj1J8j4jPJ3j3jo%K0rOJ2j8kJ5nlMn
2237aMRj2jNoJ3j3RkmpRj4PMj2OmklOMQKoKj2mRkMJ6j9lQj0J4mJJ1mpRMj4KJk
2286aNj1%QqOMj3LQj6RmrJ4KqPljjrRNj3J6OoRqoJ5oJjJj5J1oQ%JMj2nJ9k0PN
2335AkrJ6j8KplNRrLK0k0JPMPj3j0J4NplMQjkj3J6o%J0k0J4Qj6J1pj2J2ojjnP
2380gOj8POrJ7kj5J1JoJ3nmJ0nlJ4olLMqJ2n%Oj1rNJPj1kRqQJj2kjKrLMQPj3P
2429bkoJNj0J3lNJ1k2RmNkOLNlJlj0%Pj2nJ3jJkLnkkJ0rMj6KMNNmRpKNpJJ3rR
2480Ijj9J5%JQonjLMmoKQj3NQnj2lOnJ0oqJ1j3J5joP%qKRmQj4J4JmmROp%kKJ4
$$ plain form
2145 8 -2 4 8 -17 -1 -6 -1 10 5 2 6 8 2 1 -3 5 8 7 2 -3 -13 -14 -15 -6 4 -14 4 -8 -9 -11 -9 -2 4 3 -9 -10 -14 -20 -6 3 -19 15 1 6 11 -11
2191 -11 -5 -5 1 7 9 1 8 -6 -8 3 4 -4 0 -10 -7 -1 -26 -18 -13 -16 -13 -2 -10 -11 -8 -19 -1 -15 -16 -9 4 -9 -10 -16 -16 4 -5 1 13 -5 -7 8 3 0 4 -1
2237 -1 3 12 0 -1 4 -2 11 -2 7 5 1 -6 3 -11 -4 0 -12 -6 -10 -12 -15 -9 -5 3 5 -1 1 -11 -15 -6 -8 -4 12 -7 -10 -2 -12 2 -2 -1 10 6 -1 8 12 -2 0 1 -1
2286 -1 4 -7 -7 1 -7 -1 3 -10 -7 1 -15 -6 -10 -19 -5 -3 -11 -4 -7 -8 -9 -18 -9 -4 -17 -1 5 -1 8 0 -6 9 3 4 3 4 -11 0 -6 2 2 3 7 -5 -10 9 -11 -4 1
2335 1 -1 -10 6 -12 -10 -17 -20 -15 -6 -15 -12 8 -12 -11 -4 0 7 -6 -16 -2 3 -4 -7 -3 5 4 2 -11 5 -1 -1 9 -11 3 11 -5 6 -1 -13 -1 -7 -8 -9 -14 -7
2380 -7 -1 -19 -12 -6 -15 2 0 -15 -4 -3 -9 4 -1 -5 5 0 -3 11 5 2 5 9 1 13 8 8 14 3 -6 -1 0 7 -4 -6 3 -5 3 4 -8 -10 -11 -9 -18 -15 -11 -3 4 -9 -2
2429 -2 -4 -10 -9 -4 -14 -1 -4 1 12 -10 -1 -5 0 -2 4 7 12 9 10 7 -3 -3 4 -8 -13 0 -1 0 -2 1 -4 -6 -8 2 -7 -3 -19 -17 -13 -8 -3 -7 2 -5 -3 2 -5 -4 9 0 9
2480 9 8 -11 4 4 5 13 7 2 1 4 8 4 -2 0 8 -5 0 8 3 -9 -12 -6 -11 -1 -7 -15 -4 -17 -2 -3 -9 -2 -2 -10 -8 1 -3 5 -9 5 6 2 -2 7 13 6 6 4 6 20
2530B0j4Pjj2%NnkPjqjjLmkJ0lLnJjNoRnpO%NloLJ0j0nJ5JK%oPooPj4QlkOqqJ9
2583Dj0Jj5J2mJMjMqKQnkNrPmPKJLkQj1jPnJ2j4MpQjpkMOMj2kQqKKJnJ%rKRRj8
2637a4J3j1jJ9k6J5J1lj0J1qJ2oKkPMn%Jnjj1J2j0NJ6k3LRj0Qj2Rjj6K2j9J0%
2677ejoQK2j6oLJPm%Rl%ljKoN%%j3J2mJ1j0Oj3jJ1Jj3MlJ3j5rMPplJ1kpK4j8J6
2724HnlRjjnRrnQ%lQj0Qj9J0MnjMmOjlKj5MkOmNpjmJ0llJ2lqJ3loMP%krJ1jPq
2777ALj%J2qkkJj2RKolJ2j2qNQNj7RlqJ2nNqMLQpjJJ0kKpkJ5j3RnlJ1j5MJ2lj5
2826eJ0j4RPj9QqjJ2Kj2MoLOqlK1prM%jOkjJ1pKmJ5j9J4JoQj1QmPrMqmoJ5qMk2
2875b3J6jkkLJ1kj2LmMQlQrNoNMqRJ0j1J1j2LPj1QQomJ2j1jqKLj3PjloJ1pLKL
$$ plain form
2530 20 6 13 12 0 0 5 0 -2 5 4 -4 -5 -6 -3 -7 -9 1 -2 1 -4 -3 -4 1 -5 4 -1 -8 -2 -2 3 0 -6 -3 7 -3 -8 7 8 10 10 4 11 5 -1 6 -8 0 -3 -5 1 -7 -15 4
2583 4 -6 -5 -20 -8 -12 -11 -7 -8 -4 -12 -10 -2 -7 -9 -4 -13 -6 -10 -3 -1 0 3 1 9 -2 -3 4 -1 11 -3 1 -6 2 1 -6 -8 -4 2 6 -6 -8 0 -8 -6 -4 -3 -8 -7 -7 -16 -14 -5 4 -14
2637 -14 -1 -12 -13 6 -20 -5 6 3 -7 4 -4 8 2 4 2 9 13 8 8 9 4 3 -8 4 -6 -1 15 -8 -5 4 -6 2 -10 -1 -2 -18 4 -15 -5 -5
2677 -5 -6 -12 -4 18 2 -4 -1 0 7 3 3 12 9 9 6 5 7 1 6 6 6 -7 5 1 12 2 8 -5 -6 5 6 -7 -3 -6 7 -8 -17 -13 -6 -13 -16 -5 -7 -14 10 -8 8
2724 8 3 0 9 8 7 2 11 2 -3 5 5 2 10 0 8 -11 -1 3 -2 -3 1 -3 3 2 -1 1 -14 -10 -12 -6 -10 -5 -12 -13 -17 -7 -10 -13 -1 -4 -12 1 -2 -8 -4 3 3 1 -8 3 2 9 1
2777 1 4 3 3 15 7 5 3 4 -8 1 3 -3 -6 6 -6 -14 -9 -1 4 -13 -4 -7 -15 -3 -8 -3 -11 -7 -4 4 -3 -4 -3 7 5 7 0 -2 13 0 9 4 1 12 -3 1 13 10 -5
2826 -5 5 -9 0 7 -12 -4 -12 -13 -1 1 -11 -7 -13 -10 -4 -12 -15 6 -1 -10 -6 -6 -7 -1 -3 -4 7 0 2 -2 13 -6 8 9 3 11 0 8 4 11 2 6 -2 -6 -12 3 -5 -1 -23
2875 -23 -7 -8 -10 -12 -9 2 0 -12 -9 -13 -9 -1 -4 4 -5 0 -6 -1 3 -5 4 14 3 14 2 5 12 1 9 17 11 7 19 8 7 -1 1 4 -9 -2 -3 -6 -12 -1 -8 -5 -3 0
2923@j6QQmpJ7lpNj1J4rJ6j2jJ5j7KJ2jN%qKmjOmjjNj0KLnJmkJlRrJJNj1J0Kl
2972dKqLOoJ3PoLlJlMnqNKJMkKnlNnNj1K0j8JjPmj0J0kJkkOJNlNpLMpRnpJ5rQ
3026A2Nj5KrKmJ1mLLoOj2mkOKjmkLpRkpJ7Rj0nmMJ2j6MKK%MOKMjlk%LLjj4PrN
3078DoJ0j4PmJ1mqK%KmNp%M%KJ1j3Q%n%%mLJ0nJlPLqRj1MQj0Lq%LqKJ%p%K1j0
3129Br%PqjjJ0kj6K2kKmJ0j0%LkPJ0j4NknMJn%Lk%p%RpjnJ1jqJjLnJ3j7J0Mmj
3179cJ%nPmJ2rMkMLmqMQrLO%rOqJ2%lpPnpJ0k3QRlQj3NlLMrKJ1lnMjPJk%nPqR
3234GJ1j8MqJ0k%qLOlkj0MKnkJK%KKnMRk0J5j1LPrJ5mOoMKnOorRJ2j0M%lPj4J2
3284IrkJ5j0nj1K0j0Nj0KJoMQnnNpOqJ4%qPMJ0k4QRQj0lqJ1nMKKplJKNnJrKlp
$$ plain form
2923 0 -16 -8 0 -4 -11 6 3 -4 1 -10 4 -5 11 -1 -2 13 -4 -2 10 9 14 14 6 8 4 3 9 5 4 3 8 -2 0 3 -2 -1 -5 -7 -6 -9 0 -9 -8 -7 -2 -13 -3 -1 -4
2972 -4 -2 -10 -7 -1 -7 6 13 7 10 7 8 5 9 4 -4 1 3 4 8 6 8 3 0 5 0 5 -6 14 -4 -3 -4 3 -1 -11 -1 -3 -2 -4 -6 0 1 6 3 8 1 4 8 1 10 5 -2 13 4 12
3026 12 17 2 4 -5 -3 -7 4 0 3 6 0 6 -6 -10 -12 -6 -4 -5 -9 -11 -8 -15 -6 -8 -15 2 11 1 -4 -8 -4 8 -8 -4 -2 0 0 4 10 12 16 15 12 10 10 13 16 15 1 8 -1 4
3078 4 -2 8 -6 1 -3 8 4 -4 -2 -2 0 -4 1 -6 -6 -2 -2 0 11 -2 6 6 1 1 1 -3 0 10 5 6 3 10 13 5 14 3 7 15 5 8 0 0 3 -5 -3 -2 -2 -9 -9 12 2
3129 2 -7 -7 0 -8 -9 -10 0 -2 -18 4 2 4 0 10 0 0 3 1 8 18 4 9 7 2 6 7 2 2 5 3 3 -4 -4 5 -2 -3 -8 3 2 -6 -5 -6 -3 -8 5 -12 -2 2 -2 -3
3179 -3 -2 -2 -7 0 -4 8 -1 3 1 5 8 4 -4 0 8 -1 2 8 8 -1 5 -3 9 9 6 -1 6 1 -6 4 -19 -11 -2 -5 3 -10 -5 -8 -5 -1 -10 -8 3 0 -5 -1 -2 5 6 4 4 -1 6 -2 7
3234 7 18 0 4 -4 6 4 4 -4 -1 5 2 0 -10 -6 -4 -9 -11 -10 -8 -8 -6 -4 -9 -5 4 -16 -1 -12 -9 -2 -11 4 0 6 0 4 6 1 7 1 -8 1 13 3 7 7 4 11 -3 9
3284 9 0 -2 13 3 -2 -13 7 -3 2 -8 -6 -5 -11 -7 1 -4 -9 -4 -11 -5 -13 1 1 -7 0 4 14 -10 -2 7 15 5 2 -6 5 0 4 6 8 1 -2 -1 1 6 1 2 -7 -5 -8 -15
3334a5J4j4OpJ2nJrO%NOkkj0J4PpOlkJ2j6PJpOkjpN%KqLOnklJj2RJ0j5Oj0O%M
3383i%PnNMoPpPnpPmNNmkJkKpLJ3j9RJMoMmoJ0lj0J7j1mKjpKMNjJOnjPnLjoJM
3438bkkRnLJ0pmjNqJ%RrlMj3J0mmRj2LQoMLqrK4j7J8mLllJJLJJjjLJ4j4rOrpJ6
3490Bj0lkOjMJj0mPj3J6rO%KjrRPnopQJ0nKnJ0j2MQlJPKqrJ7j4QOk7J4mPpnJ1
3539dKj3MmNkoKj%L%KmNOnNlJ1kkkJ6j8OjJKmJoRj3oJ6oKj1OllPj1JMJ0j6mOO
3590a2mPqnR%OmjJ0mPJJj4J4mLlj5J4oJ0k%Qk3NPp%jjPlJqJ6j9PnJLLmpJ2PLr
3640gRRj3JJoJ2ljnL%Nk%j1NmJMmJpJKNj2JOQj4kK4j3nJ0qKmPqLJ7j8ONJ%NoN
3691FlrQJ4j9MmNkpJl%mJ6j0MqmmMNRlrJPoKPklRnjQKqMk%oJ3olJ0pmkmlRp%R
$$ plain form
3334 -15 -1 -15 -9 -16 -4 -9 -8 -17 -11 -11 -6 0 -2 -4 -14 0 7 0 6 3 1 13 -3 4 5 -2 4 2 1 -6 -1 -1 1 -7 -4 2 -3 -5 -8 -7 -19 -10 0 -15 -9 -19 -13 -13 -9
3383 -9 -9 -2 -7 -2 2 -4 3 -4 3 -2 -9 -2 -6 -1 4 0 -2 -1 -3 -1 -8 -5 8 -11 -2 -1 3 -3 1 -3 -9 1 -2 -12 5 -6 -10 -8 -9 -16 -14 -10 -5 -6 -5 1 -4 -5 2 -3 0 -1 -7 -6 -2
3438 -2 -4 -6 3 -2 1 11 4 0 -1 4 -4 -3 -3 6 -3 -6 -2 -15 -5 -9 -13 -4 -16 -13 -5 -11 -7 -4 -12 -21 3 -14 4 0 3 0 -3 -2 -1 2 3 4 3 2 5 19 5 -4 2 -7 -14 2
3490 2 -8 -11 -13 -7 -8 -4 -3 -13 -17 -10 -23 -7 -16 -10 -10 -8 -9 -18 -9 -2 -7 -13 -20 -12 -2 -7 -5 -10 0 -12 -8 0 -3 -2 5 7 -1 -10 7 -7 1 7 -20 -6 -10 -3 -10 -15 -4
3539 -4 -2 -15 -11 -15 -10 -12 -18 -16 -17 -17 -14 -14 -12 -16 -11 -5 -10 -5 -8 3 1 -1 -3 13 -5 1 0 1 3 -1 0 -6 3 -10 -16 0 -6 -4 -15 -9 -12 -15 -8 -19 -18 -14 -4 -20 -24 -18 -12
3590 -12 -16 -9 -17 -22 -13 -13 -7 -11 -12 -2 -6 1 2 3 -11 3 -1 2 -1 -16 -2 -8 2 0 0 8 -15 -10 -3 -10 -10 -11 -12 -5 -8 -7 -15 1 -18 -11 -16 -15 -12 -9 -13 -20 -8 -1 2 -7
3640 -7 2 11 -2 -1 0 -6 6 3 2 -3 0 0 5 3 3 -8 -3 -7 -6 -2 -6 -5 -12 -11 -9 -4 -16 -15 -9 -1 -15 -17 7 -6 -11 -1 -9 -7 -11 -4 -12 -9 8 -10 -4 1 2 2 7 1 6
3691 6 3 -6 2 16 -3 1 -3 2 0 -7 -6 -9 -9 -13 3 -7 -3 -11 -15 -19 -15 -10 -1 -4 -13 -12 -5 -11 -9 -2 -4 -7 2 -3 -4 4 6 -2 2 0 0 -6 7 1 -2 8 1 -3 -5 -9 -12 -3 -10 -10 -1
3746akjrjNqLlRlkjQNJ2k1OjoPkJLkJ0kmJJ%J1jj4Jkjl%oN%Kj4PJ1k2J1LpJ0j1
3797a8RmKM%mOKNnjkpJ3%lnJ4j7J5lmlNpJ2oOr%nJlOjj2kJ1j1QJ3rqRLr%NNjK
3848c%nMJ0rkKN%j2J5pNj0QqqPPoOnjNJj0kkJKM%KoOOon%QmRLNj6QjlKlPpKKl
3903boMPrJ2j8PkOlJrNJk0J2oNmJ8j5NJoJ3joJ%J0j3PRjRj8QLKj6J0K%onM%lj
3952hKnR%j6J1PmnKmKmNPj8QJ3jloJ3pKOLqj0QjjRmLomNkj%lKMj6%J6j1JPpMM
4004bqKlJLKJnJ1K%%%LoKmoQj3J8n%Oj9JJ3%j2MRj2KKLj0KnPPkjnkOkjO%K%J3
4056A3j7J1Pj3mM%jRJqjQjqmMjPpOo%LqoJ5ko%KKPqnJ2%pJ%NnNj2J4NjmnM%Mm
4109ENqkR%lnNjkn%nqJ7lm%kOj4ORkoRjMpJ5j7P%%l%J4j1J5j0kO%j1oJ4ojooR
$$ plain form
3746 -1 -3 -4 -13 -14 -9 -17 -14 -17 -8 -11 -13 -14 -6 -1 11 -10 -4 -5 -11 -4 -6 -5 -2 -4 6 4 0 1 2 2 13 12 -2 -1 -3 -4 -7 -7 -13 -8 -8 -6 -20 -13 -2 -24 -13 -10 -17 -7 -18
3797 -18 -9 -13 -11 -7 -7 -11 -5 -3 2 -3 -4 -6 -13 0 0 -3 -8 6 -11 4 1 -3 -6 -1 -8 4 -2 4 -5 -5 -10 -9 -12 -6 -7 -19 -21 -10 -21 -13 0 -9 -17 -8 -5 -14 -14 -9 -4 -5 -3
3848 -3 -3 -8 -4 6 -3 -5 -3 2 2 -10 5 -2 3 -7 1 -7 -15 -8 -1 -7 -1 -6 -7 -2 -1 -11 -13 -15 -14 -12 -8 -8 -6 -12 -6 0 -6 -11 -11 -3 -7 2 5 10 -6 2 1 -2 0 -3 4 -3 -1 1 -2
3903 -2 -8 -4 3 -6 6 -12 -5 -7 -1 -4 -3 -12 -7 -6 -26 -14 -20 -15 -19 -1 -16 -11 -10 -16 -3 -4 -10 -9 -9 1 -12 -5 4 3 12 -6 2 5 7 -9 1 3 3 -3 -8 -4 -4 -7 -8
3952 -8 -6 -11 -2 -2 -18 -7 0 -4 -9 -7 -11 -9 -13 -8 -1 -19 -11 2 1 -2 -8 5 -2 0 6 9 1 -9 -1 -2 -3 6 2 5 -1 -5 0 -2 -3 -3 -6 -4 0 -16 -16 0 -11 -10 -3 -10 -6 -2
4004 -2 -10 -8 -11 -10 -7 -5 -4 -9 2 4 4 4 4 7 1 3 -1 -7 1 -12 6 1 1 7 -12 -11 2 2 -10 -6 3 -9 -7 -5 -2 -12 -10 -15 -8 -1 -3 -4 -9 -11 -5 -7 -8 -2 -2 0 0 13
4056 13 -4 7 14 1 -3 1 1 0 9 10 2 1 9 8 0 -4 0 -1 6 -1 5 -1 -1 2 -6 -12 3 1 -5 -5 -3 -1 6 -2 -7 5 5 -2 -1 -1 4 -1 4 -8 6 11 10 6 1 5 5 9 5
4109 5 10 2 0 9 9 6 1 6 5 3 -2 -2 -7 -15 2 -1 -5 -5 -7 -1 -15 -9 0 -2 -8 1 0 4 -3 12 -5 2 2 2 -1 -1 13 2 17 7 5 11 11 0 -6 8 2 1 -5 -11 -2
4160bk%Lj5J1nNK%j3KMNRj2RLnoJ0jLj0MOj1JjK0k1MmRpJ2j6J5j1%KJnkLRj6J
4207a2mK3j3j1MlJ9j3qMJ5k1J2PLKKrOKkQqmJ1j0MOj8NJ1omjoJ0mOqlpRkj2%K2
4253BJjrRjmJ6j8J1j0LnNpKOMmNkmRkrmJ1Mj0rJ3j0JjkRjqj2J6jKknmJJ5qPrJ0
4303@jNj5OOloJ0oJ0kpqJ5kPkrJ0mrLrKPLmqPjKLj2NMMoKRj1Nj2J2j0J2mNKjM
4353HoLnMj2QLkKpNloJ0qlJ3j1omJ6j1jjJ2%q%RnPmmJ4rOqQj4J7nj1PQJKj3Oo
4402dJoJ2qPkoNj3J2j0%ljJ3JknRp%LMnP%LlllJ3jmJ0rPnJ0qqPoKJ%j0RKomKj
4454cPqqKJNmJ3o%j0JQ%NJj4J6nkJ6j1L%Jj1J9j5LL%kpQnlkmJ0j2%NOrK%%jO%
4504aLJJj3LP%Qj4RnLnJ8j3LjkNojQqjKo%Ron%lOOj6RKpJOoJ3j5PQ%n%nNLpLm
$$ plain form
4160 -2 -4 -4 -1 -16 -5 -10 -5 -3 -3 -16 -14 -10 -5 4 -8 1 4 -1 -7 3 2 5 -5 -1 5 -6 -5 -6 14 -7 -3 -7 2 -5 7 -9 6 -5 -5 -3 -2 -7 -9 -6 3 -13 -12
4207 -12 -16 7 -6 -17 -13 -16 3 -10 -18 -14 1 -20 -8 -1 2 4 6 -3 3 5 3 11 3 -1 10 0 4 10 -8 -3 8 2 -2 -3 -9 1 -3 3 -5 -8 -15 -6 -8 -20 -20 2
4253 2 3 2 -7 2 1 -3 13 -5 6 -4 -1 -6 -1 -8 -6 0 4 0 5 3 -1 8 6 -3 -7 4 8 -2 -11 2 -8 -7 -8 -10 -1 -2 -10 -22 -6 -7 -5 -7 -12 -16 -15 0 -8 -1 -10 0
4303 0 -1 4 -11 -5 1 -2 -8 2 -4 6 4 -3 -11 4 2 9 7 -2 8 4 -5 -2 -11 -9 -2 1 -3 -11 -4 -5 -3 0 -12 -7 -3 1 -5 -3 6 -5 0 -12 0 -10 2 -2 3 5 4 8
4353 8 2 5 0 4 -8 0 3 1 3 -4 1 -2 -8 2 -6 -9 4 -7 -13 -17 -1 -12 -13 -14 -2 -2 -10 -10 -1 -6 1 -3 -7 7 -2 4 -4 4 -10 7 2 -9 -2 6 7 9 -4 2 -4
4402 -4 -3 -9 3 -5 2 0 -6 -1 -14 -2 -12 -12 -15 -16 -3 -2 -4 -9 0 -7 -7 -4 0 -5 2 2 5 2 -1 -4 9 8 4 14 5 12 7 17 9 1 8 2 4 5 5 -5 4 6 0 -4 -2 -3
4454 -3 4 -4 -12 -10 -9 -4 -8 5 -1 -1 -11 -10 -2 -2 3 4 -10 6 1 -1 15 4 7 7 8 -3 16 1 4 7 7 5 -2 6 1 -2 -4 -8 2 -10 -10 -5 1 -8 -6 -6 -6 -7 -1 -1
4504 -1 2 3 4 -9 -6 1 1 9 -5 4 -1 2 -3 15 2 5 4 2 7 1 0 8 0 -1 1 -5 -5 4 -2 -7 -7 -10 -4 2 -14 -5 -3 -10 -9 -3 -9 4 -11 -4 4 4 -1 -1 -6 -1 2 -5 -2 -6
4558fJ5mJjpnJ4oKlJKj5J0Ljmj0J2j3J2olkJ2%nmoOJ5qn%RplMQJNrO%mkO%jj0
4608fJ1rJ0oOoj2MQj0MNQj2JPoK%nJ0k6K2J2j6MQj2%OkJ4KmqkKK%kpMqJ5pJ1r
4655C%lm%J0j1MOolKkjJlpRkKnOkJ2Mj4nK1olKkKkKMokLj1J3j4%J1jj1KLkqJK
4706a1MpmJ6JoJ0rMLMNoJjOj4J5j5QlJ3j2oQLoJjPoJqOqNjJPmj1PqLNPjj2%Lj
4757gOjMJplLLQrMJJPjj4M%NjllLj0J1lopJ4oKjoR%%j1jQJmJ2JrO%oPJnLJ1nj
4811FNoKkJnOMmnLplJ0nJppJ3LrMrPOmN%ljmJ2%nJ%K1k0LOj3OnOlMlLojj%Ojj3
4866hONJj6LPpJ3j9RkJKjJ1pjNlMPoJ1j0Qnln%%%mQpj%KLqPLqQNj7L%pjKK%LK
4920ejOnpjJ3LjoQrJ5j0MlQnJJ2j5Km%KMknkJkKQnOj4%oOMjJ2%j4jPpJ4kKOj2
$$ plain form
4558 -6 9 5 6 5 -2 -7 7 1 3 0 1 3 -12 -2 1 0 -4 -14 -2 -15 -3 -9 -12 -14 -2 -2 -7 -11 -17 -11 4 -4 -9 -9 0 -7 -10 -6 2 3 8 -1 5 5 1 -1 5 5 4 -6
4608 -6 5 -4 6 0 6 0 -12 -8 0 -10 -6 -1 7 -5 -4 3 -3 -1 -1 -6 4 -22 0 12 -4 0 8 -4 -4 2 0 14 16 12 4 2 4 6 6 4 -3 1 -7 8 1 12 3
4655 3 3 0 -4 -4 6 -5 -1 5 -1 -4 -2 -4 -5 -4 -7 -14 -5 -7 -5 -10 -4 -6 6 10 -4 -9 12 6 3 5 3 5 3 5 9 3 1 4 -7 6 -8 -8 3 2 -9 -7 -4 -6 -14 -13 -11
4706 -11 -7 -14 -18 -2 -1 -7 3 -6 -2 1 5 10 4 5 4 10 -4 11 -4 4 1 14 2 -4 4 7 1 2 1 8 2 3 -5 1 -7 -2 -3 -2 5 1 -10 -3 -11 -8 -3 4 3 -9 -9 -6 -7
4757 -7 -1 -2 2 3 -4 -7 -4 -1 7 -2 2 3 4 11 10 -4 0 0 5 4 1 -2 1 -9 2 -1 -7 -14 0 -6 -4 -5 -11 -2 -2 -2 -13 -14 -6 -5 -9 3 4 -5 1 1 -5 2 3 -2 1 12 7 6
4811 6 11 5 7 5 6 1 7 11 7 2 5 -2 -5 5 0 1 -6 -13 0 3 -6 -2 -11 -4 2 -2 3 3 0 -1 -5 7 7 2 3 3 24 4 7 13 0 6 1 7 4 8 5 8 2 1 0 0 6 5 -8
4866 -8 -2 3 4 -12 -9 -2 -9 4 -15 -6 -8 -7 -5 -6 5 -2 -3 2 -1 3 10 4 15 5 13 8 5 0 0 0 0 -4 4 -3 -4 -4 -2 1 -7 0 3 -5 3 8 -9 -6 -6 -13 -14 -12 -10 -10 -7 -5
4920 -5 -6 0 -5 -12 -13 0 3 2 -4 4 -5 10 0 4 1 9 4 5 17 2 4 0 0 2 6 4 -1 -3 -2 -4 -2 6 1 7 -7 -7 -13 -7 -3 -4 8 8 -6 -7 0 -7 7 5 7 13 1
4971AoPjQnQnjl%Mj6kMRkj2PjmPj4J3j5J2Nj0LjRj0QoLQj3RpJ0MpMjMqLNJLkj4
5022gJ4n%jljkLkJ3mjj7LJ%m%KPoJ3j3PLKqjJ0KpjNmjJ1%oLjJj3J3Jj2mJ1llP
5072Bj0Lk%J3pnjOpMj0NmJ7j0JJ3j0jMpJ3mmL%KNrQj2J3k%lPj4jLllOpNlkJ0j3
5121a1jQj%%pRj0J4o%mLRQqlJ0lrPklmPLkMmpQkj3Njp%QLpJj1J3lNJrJ2qPqJ5
5173Flj0J0QpPp%Mm%%oONj0MmKJJknqOkMqPn%J7j4rJ2lKmKNkJ5j6OlJ2mNj1K%
5224B%llMkNnJjOoMkJ2pnLj0NLJrPqNKNKKj0O%noJ2jrJ3m%J2j5KMKNqqRQj2jL
5277EkkLjKj3NmJ1oj1RjmLpJPMJ0j7J3j0MLJ1j3J0rpJ4rLQpj1J3j0Rm%LnMkoK
5324dMlj3K0lo%j2PkPKj0J0J0j%jMlLpJ3KrRj0J2lj2kLlmJ1pnMjJmNMrkKKj2Q
$$ plain form
4971 1 -5 2 1 9 4 12 7 6 3 3 7 -9 -11 -7 2 0 -12 -5 -6 -10 -3 -17 -4 -19 -7 -2 -12 -9 -10 -1 -11 -3 -9 -6 2 -11 -2 -9 1 5 -2 2 1 5 -3 0 5 6 9 7 -7
5022 -7 7 2 2 1 -2 -3 -5 -2 -4 9 5 4 -13 -10 -9 -9 -13 -13 -11 -4 -10 3 -10 -3 0 2 -6 -7 3 5 -2 -3 2 -2 -3 8 8 2 5 4 5 -8 5 6 -6 -10 1 -2 -5 2
5072 2 -8 -5 -7 -7 6 -1 -6 -7 -1 -8 -4 -14 -9 -13 4 -6 -5 8 -2 -3 1 -6 7 3 -1 2 2 4 9 0 8 -4 9 7 7 4 11 -3 -4 -1 -4 -7 -1 -8 -3 -6 -8 2 -11
5121 -11 -12 -4 -5 -5 -5 -12 -3 -13 1 -5 -5 -9 -6 3 11 3 0 10 7 -2 5 3 0 -4 3 6 4 8 4 -3 5 3 -10 -5 -6 -13 -13 -5 -2 -9 -8 -19 -6 -9 -4 -3 -12 0 -8 -1 -9 6
5173 6 3 -7 3 11 4 11 4 4 8 4 4 4 -2 4 9 -1 3 -1 1 2 3 1 -4 -12 -6 -8 -4 -12 -5 -10 -10 7 -7 -16 -4 -7 -5 -9 -7 -2 -4 11 -5 1 -2 10 6 11 0 2 2
5224 2 2 -1 -4 0 -2 3 -2 -1 -2 4 -2 2 0 12 5 0 3 -7 -2 1 2 -7 0 -8 -3 -1 4 6 8 -2 4 4 -1 -7 5 4 -5 8 4 4 16 1 3 7 9 14 6 -2 7 15 3 2 5
5277 5 3 1 4 3 5 -8 -3 -7 4 -2 -13 -4 -5 -9 -6 -13 -12 -5 -1 9 -8 5 -5 -1 2 13 0 10 1 -6 8 -1 2 10 3 -8 5 -5 4 0 0 3 -2 2 0 -6 -4
5324 -4 0 -3 -16 4 1 -5 -5 -17 -10 -12 -5 -3 -13 -3 7 6 6 5 9 6 9 2 15 17 8 17 7 19 16 4 2 5 2 -2 9 2 -3 1 0 1 -3 2 6 -3 -5 -3 -1 -13 -5
5373ekNPoJPlOkoKjKONj7Mj0J0LNjJJnOkj4RnQn%j4J6mJj1J6pj0PpOMOljLOqQ
5425A2rNNJj2LJ1j4Q%JKKmkljmOj4PlNlLKj1OjKpRrJ4nPoOlnJ3jjqLnJ2ooJ9j8
5476CQOj0kKLj5MOJokLjjPqPlqkJ2j0NnNlMjJ1KmoRmMJLj2jRlNjkqjRj1PkpMj
5530@%O%j4LNorQNJ4j6j%Rq%J0j1OMjJkRrNLj0OK%%%kPj1LkoKorK4j1QroLRjq
5582fJ5j5j%J0jQnOom%J1nlQ%lnjQppK2j3QprOojpNj0J1pQNj0Qj1ONpMN%KnNM
5633HrJ2nkmPpJ6j2OmKjQj5ljoPJkqJ2m%JpJ3j3JPj3QJ0qPqmJ1nJ3j0Rj0J0Mm
5680HoJ%JNLJlnj2J0%jmmNkj0J5mJ1j1kMqJJ0pjOmjJ4j3J2klJ3rMj0O%K%Jp%O
5729A0nnQMk2J0jnQp%JKKpNLj6J2j3J0PjRk0K0klj3J3J1nNk0J5Rj6RqMj2J1KJ
$$ plain form
5373 -5 -7 -2 5 -1 0 7 4 10 8 2 4 3 5 11 16 -1 3 -7 3 6 11 10 11 12 7 13 11 -3 6 1 9 4 4 -10 6 2 3 -8 8 1 -9 -2 -9 -3 1 7 4 3 6 12 4 12
5425 12 3 8 13 14 2 5 16 2 10 10 11 13 15 11 9 6 5 1 7 -7 0 -3 2 -1 2 4 -7 -1 -2 0 -7 2 -7 7 2 9 3 9 6 1 14 13 12 4 7 2 14 8 2 21 3
5476 3 11 17 7 5 7 10 -5 -1 5 6 0 -2 1 0 -1 6 -2 5 2 -6 -8 4 -6 -1 -6 -1 -4 0 -1 10 12 8 2 11 7 11 12 15 3 2 11 8 13 12 10 2 1 10 -1 6 4 -3 1 0
5530 0 0 6 6 -8 -5 0 -6 -15 -7 -2 12 -4 -5 -5 4 -4 -4 6 -5 1 5 4 5 3 12 3 8 11 1 7 9 9 9 9 7 14 3 6 4 -2 0 -6 -15 9 -2 6 -3 -9 -6 3 2 -6
5582 -6 9 -6 -7 -7 3 2 10 5 11 5 1 1 12 7 4 12 12 9 4 3 11 4 -3 19 6 14 7 -2 4 -2 -3 -10 -5 -15 -4 -11 -3 2 -8 0 -11 -5 0 -7 -3 2 2 4 -1 4 8
5633 8 -1 11 6 4 0 7 0 16 4 10 6 8 7 15 0 -3 -4 -10 -3 -2 -4 -12 0 -4 -4 -3 -10 3 -10 -9 -2 -15 -7 3 -5 2 -6 -10 1 -4 9 -1 8 -2 8 12 8
5680 8 2 3 3 4 9 12 13 10 5 -7 3 3 2 -2 -6 -1 -3 -13 2 -2 9 -2 -4 0 -8 -7 3 -4 -5 1 -3 -4 10 -3 9 7 4 17 8 12 2 8 8 10 10 11 4 4 10
5729 10 5 0 8 12 -10 0 -1 -6 2 -5 -5 -4 -2 0 -7 -2 1 -15 -3 -16 -6 1 0 9 -11 9 7 4 -9 4 15 10 15 -5 10 19 3 12 4 8 -4 7 9 10
5773A0qKpQ%njkj0J8noJlJJ%j1NJ1Lj0JNORj5KRj2PJPr%rJ0qQj3LJ6j0loLnJ1
5821@Jj2PJ0j9jQljLNj0J5JkljmPKPoPqLnMJ2j9KMKjolpKJ0Mj4QmoRjKoPk%lk
5873g%PJjoJ3j0J1mjOklQnr%J1pNLkqLj7J3k%Om%MpjMj0LjPnPj1kJ2j0PjJ2nK
5923DlmJ6j1kQrNOmnLLnLoQjj3QpOkj1J2Onj6RllO%J0qLRj1OkJNrPRoqORpnJM
5976GpKNMlj2KJ0pj0P%oJKkJjPmMlnlJ0mjNLKpNK%lJ0Nj1%MLkJj1jNrJ2%j1lJ2
6028ErKkMklRj3lOJ%JQmnNlLk%OjRpPk0J7qj%%kNlkOmJ1k1J0oKMNj4%kLjJpMJ
6082a0NOj7K1rJ0pnNOnJ3j8O%Lj0J3KrPnrNoJNPj6KMrJ3pNnkMLKpkNJ0j0jPLj1
6131gQjJ%kMRppqJ8j%lLj2Lj0NMjMm%jMj2QloNjJ2j2lMkJ0pLJ1qOnNk%KoQokK
$$ plain form
5773 10 2 4 -3 5 5 0 -1 -3 -13 5 0 -6 -5 -8 -7 -6 -6 -17 -12 -1 2 -8 -7 -2 4 13 -2 0 9 -3 4 5 12 3 3 -6 4 -4 4 -9 -6 10 0 -3 -9 -6 -11 0
5821 0 1 -11 -4 6 -13 -14 -6 -9 -10 -7 -2 -12 3 4 2 -1 -2 -6 1 3 10 4 11 3 6 1 5 17 -2 0 4 6 5 -1 -4 -11 -9 1 5 -9 -1 -5 -11 -2 -3 -1 -7 0 -2 -2 -5 -7
5873 -7 -7 0 1 0 -6 7 -3 8 4 3 9 7 4 12 7 -2 -2 9 2 7 10 8 0 3 -14 -1 -3 -3 3 -1 -1 3 -4 -5 -1 -11 -8 -9 -2 -7 0 -11 -13 -1 -11 -4 -5 7 2 4
5923 4 1 -3 13 2 0 8 -1 4 10 6 1 4 7 2 5 -1 7 6 -7 1 -6 0 -2 -13 -1 5 0 -16 -7 -10 -13 -7 -7 3 -5 -2 7 -4 2 0 1 6 -3 4 13 7 -1 5 14 7 2 3 7
5976 7 0 2 7 11 8 -4 -2 8 1 -9 -2 -2 -8 -7 -5 -7 -6 -7 0 -4 0 -3 -8 -11 -1 -5 -6 -1 2 4 -3 2 4 4 1 11 16 5 5 9 12 10 11 0 -1 4 -5 7 7 -4 -7 5
6028 5 -4 -2 -4 0 -2 -5 4 -9 -12 -6 -5 -5 -4 4 0 -5 0 -3 0 -2 -2 4 3 12 5 12 -8 9 1 0 0 0 -2 3 0 -2 4 0 11 -10 0 -6 -4 0 5 -9 -9 -11 -8 -9 -8 -15 -11 -10
6082 -10 -5 1 -16 5 -4 6 -1 -6 -1 5 0 13 -5 1 1 4 -6 7 9 0 7 2 -7 -2 -8 -7 -2 5 -11 -9 -5 -14 -1 -8 -3 -8 -10 -6 -3 -1 -8 -10 -5 5 -5 -6 1 4 -7
6131 -7 1 0 1 1 -1 3 12 5 -2 -10 8 7 7 4 7 -5 -2 -12 -7 -3 -4 0 -4 -4 -5 -1 -13 -5 -8 -14 -9 -10 2 -10 -13 -9 -11 -1 -8 -5 6 -2 4 -1 4 2 2 4 -2 6 0 -2 0
6184@MkJ2rj1J1%plkOojOKmO%j0PpKJ0j3PL%j1J1j5J6pORpQrJ1rNqRqloOnMK%
6234@o%kJ7rlj2MkOKlO%Nj1Ln%K1j4j%OkO%rqJ3JKmj0J4j2NLqJMJ%pLkj1J4mK
6284fkOJknk3L0PnoP%Jn%%J3qNnmPLnoJ1ompQ%%KrjOoLnkJ2j6J7mojLKnJ3J0j1
6336BkqlRqJ2mKKjKNJrjLm%jKqP%j%j5K2j5JjLlJ1rJ0mlLjmJ2kJlRoLqRj0jRL
6389Hj8J0j4J6Kj8J6qJLj1J1Kj2RrmMOj3JRNOrLJlqK1k%jjJ%JmnMLkq%J0rJ1j1
6437f%J1nj1KoQMjj0OrMPoQjmmJjRqJ8rKKpKJ3j1OknRlplJ1jKqJ1j4NKjj0pJ0
6487gk%jMpO%JqJ1OnjnJ0j0jQj2QNjLmJJM%pKJJ%j0MNrOqOMpJMj0P%K%j8J8jK
6540cjNolOpJ3%qJ6%j2OoMrJ5mj3KkJ0kKj3J1j5J6j4J2oqJ0PoJ1j0JrLJKj0J6
$$ plain form
6184 0 4 2 14 5 -6 5 5 -2 -5 -7 -1 -7 -8 -2 0 -4 2 2 -8 -1 -8 -6 4 -9 -2 1 1 -10 1 -14 2 -5 1 10 3 11 2 13 4 9 1 10 2 -1 -7 -1 -6 -2 0 0
6234 0 -6 -6 -8 9 0 -3 -15 -11 -13 -7 -5 -8 -2 -2 3 -8 -5 -10 -10 11 -3 -4 -4 2 0 6 6 -3 -11 2 3 5 1 -9 5 -7 -2 1 -7 -6 -2 -1 -1 -8 -5 -7 -18 -4 -8 -6
6284 -6 -8 -2 -1 -3 -8 -31 -1 6 1 -5 2 2 3 -2 -2 -2 11 3 8 3 -1 6 9 4 -2 9 3 -1 -8 0 0 0 2 -7 -8 -2 -8 -5 -10 -12 0 -16 1 -3 -9 -10 -7 -5 -10 3 13 2
6336 2 0 -8 -11 -2 -10 2 -2 0 2 1 3 8 9 0 -1 2 -2 -2 -3 -1 -9 -2 -2 -3 -3 -18 4 -11 -10 -11 -8 -11 0 -9 1 -3 -6 -3 -4 -8 4 2 3 0 9 3 6 -2 7 -3 -4 5 8
6389 8 -10 0 -14 2 4 -14 2 -6 -5 -2 -13 -2 0 -12 -3 -12 -16 -12 -6 -19 -18 -9 -4 2 -7 -4 -3 -6 -14 7 5 5 4 3 4 4 5 1 -4 0 3 1 -7 -7 3 -6 5 -6
6437 -6 -6 5 0 -11 -9 -15 -7 -3 -4 -14 -8 -17 -13 -6 -12 -4 -5 -9 -13 -12 -13 -4 -12 6 -3 -1 1 -6 -4 9 -2 4 2 -3 6 3 -4 -7 4 3 5 -3 8 -6 -1 1 0 -10 -17 -7
6487 -7 -9 -9 -10 -6 -13 -7 -7 -6 -14 -3 3 -2 -3 -8 2 -8 -9 -1 -13 -5 0 -1 2 -2 -1 0 4 4 -3 -1 0 1 1 -9 -5 0 -9 -3 -11 -5 -1 -8 -7 -3 -13 -6 -6 -4 -4 -22 -4 -5 -3
6540 -3 -4 1 -5 -8 -2 -9 4 4 -4 12 12 0 6 0 4 -5 10 6 -7 -5 -7 3 1 3 -10 1 -14 2 -12 0 -6 -14 -4 3 -3 8 -2 -1 -10 -7 -6 -4 -14 2
6584BoRrjOnjLPlJjjlNj3KJ1klkPqpJlJ4JkrjJJPnK%jjNjOJqJMmPkLK%lpNNLj1
6642aOjj4RLnLnoPjqJ3MroNpQmjJ4mlNqjJ4o%MpRqNjlMPqnOQlMroKLnnNjKojM
6699dLm%JjqOOjkKj2K3j0jPpLjOMKj6J6rmQoJ4mj1oJ2ooJmKjJ3j3pJ7qoJQlJ0
6748Dj5OMMMrJ0k1J6Rj4JNkJ2j2rOkQmjo%j0J3Oj5MklJ8rrJ2j4J6pkkRJ%qjJ0
6794Aj1J1LMj0%OjlkPjpJ0jj9QnJ5qLjlkjQklpLQjjJNj2LJ0rJ0kmjJMOkKNj1q
6845dK2k3Rj4J2j5NJ6mrPNj1j2J3mnQnjLkKjjOkMj5QJ2pJRj3LJ2NqmRjlmlkJ3
6892A1j4J0j0Lkj3OKRmLjj2NpPjNLJnPnMjJ0qloJQLmJj%LpPmrJ0koNonKPqJ0j2
6944a3J1oLj4J7Qj5LJ6j2NNj7P%MNOj5L%P%QjoNqkRj7K%KJ0j8NJ1j2LlJRj3KM
$$ plain form
6584 2 -4 5 -4 -5 1 -4 -5 -2 5 2 3 2 1 -2 3 -10 -8 3 1 -2 -4 3 -5 -12 -11 -14 0 1 -1 -10 -11 -10 -9 -2 -7 -5 -5 -6 -7 -2 -3 3 4 -4 -3 1 -3 4 2 5 7 7 4 -3 2 7 10 -1
6642 -1 5 4 -10 -1 2 -3 0 -5 -11 -4 -5 -13 0 4 -5 -11 -6 -13 -5 -9 -10 4 0 -3 2 -6 -7 7 1 1 5 -2 7 -1 4 3 0 4 11 3 -2 4 12 9 13 4 -2 0 3 -2 -7 -2 -3 -1 -7 -8 -4
6699 -4 -1 -5 -5 -4 -5 -13 -7 -1 -2 -4 -2 -14 9 -1 -2 5 -2 1 0 6 10 12 -4 12 3 -1 7 1 15 11 0 -6 6 0 -6 -5 -9 -7 -8 5 -8 -15 2 -6 -12 -11 -3 -6 4
6748 4 -11 -5 -1 3 7 -2 8 -13 3 12 -2 -1 4 2 14 2 -7 -1 -3 5 1 0 -6 -6 -16 -3 3 -12 -8 -10 -13 5 -4 -13 -1 -15 1 -6 -8 -10 -1 0 0 -8 -9 1
6794 1 -10 1 4 8 -2 -2 4 3 0 -2 5 4 -3 7 6 -13 -5 -10 5 -3 0 -1 -4 -6 -7 1 -1 -4 -11 -8 0 -1 -2 -1 4 -8 -5 5 -4 6 4 0 -1 0 4 10 8 10 15 4 -4
6845 -4 18 -5 4 -10 2 -13 -8 8 4 -5 2 7 -4 -16 -3 -7 -12 -4 -9 -10 -7 -9 -7 -8 -9 -3 -5 -1 -16 -8 4 -3 -2 7 -6 -3 9 14 6 2 11 10 7 3 0 -2 11
6892 11 -3 7 -3 0 -2 -15 -9 -7 2 -2 1 0 -12 -7 -14 -7 -8 -3 0 1 -4 3 -2 2 1 11 3 0 -6 -5 3 6 2 3 2 2 5 -2 5 1 -8 2 0 -6 -1 -7 -12 -10 -3 -11 -1 -13
6944 -13 -2 -8 -5 -19 -2 6 -9 -6 10 -2 3 8 -9 -2 -2 2 7 13 -2 1 1 8 8 16 15 9 14 6 4 13 -4 -2 -2 0 10 -8 -3 8 -4 -1 -4 -3 6 -7 -5 -1
6990anjnJ3oO%%joP%KmQoJlKJPnJ3rj9J7j0OMJj1K%jmOkj1jPPnkj3K7j1%RKlr
7041fJ3j1Pl%J0Pj0oJJ0nokJ1Mj8LRj0MmLmj0lRK%Pj2KmJ6lq%RmkJ0nNmnJ3rj
7089@jLMmJ4j8KOkj2J1%lLqkMmNlj0J4njJ2j8J1kP%kpO%%jlNJLjjLlJkkMjPlr
7141bJ1p%LpkRj2RmnMpJ4JrnNjlPpLJ0jLpnRLpjPoKPj4RJj0MRnj5J0LLnMplNJ
7194akNqL%nJ1J%Oj4JRj0OjoJ2qPKKplLk%nPoNkmKmnNKL%j1J1KnkL%j0PQlNkm
7248bLkKkJ5k1J4nJ7j8JJ9qmpnPNMpj0RoJ0j4LoQo%M%Lkj3Pj2J5JJjONlJ0o%J
7296A0%rKjMJ0j8PjkqlJ6mOj0kpJ8pmRlNj5Nj%LOJj0J1nkoJ0pOpOnMPJj1J0jK
7345A0kmrJJ0Jj2KnLMpJ3qjPMkNj0j0J0L%qM%NKkrJ0j3OJKJ3j6JJJ4nKpjjOj6
$$ plain form
6990 -1 -6 -7 -12 1 -5 1 1 1 0 -6 1 1 3 -1 7 1 2 -1 1 2 9 4 17 8 -11 6 -4 2 6 7 -4 -2 -2 -3 -7 -1 -3 -14 -15 -8 -1 -6 -8 -21 6 -5 -5 4 6 3 -6
7041 -6 7 -4 3 0 0 10 17 7 1 2 12 7 1 -1 10 14 -4 -1 8 -2 2 -2 1 -3 -13 -16 -7 -5 -5 2 -10 -8 -12 4 1 -7 -7 2 -2 -4 6 1 6 2 -3 10 1 0
7089 0 -1 2 6 2 16 -2 0 6 4 -8 3 3 0 3 -5 -7 -3 -7 -2 -5 -15 -1 -6 -7 5 -13 -2 -4 3 3 1 -6 0 0 0 -1 -4 1 2 5 4 3 6 3 4 2 0 4 3 10 7 -2
7141 -2 9 2 2 5 -2 -4 5 -7 2 -2 -7 -3 -10 4 5 -4 -9 -4 -5 -8 -1 -8 -5 5 4 7 0 -5 4 7 0 -1 6 0 2 9 -5 4 5 -5 -1 8 3 -12 -2 1 4 -1 3 -4 -7 -2 -1
7194 -1 -3 2 -6 -3 -3 -8 3 4 4 10 -4 -3 6 -4 2 1 -5 7 -1 6 8 10 3 0 3 1 1 -4 3 -3 2 0 -4 -2 -6 -11 -6 -4 -1 -1 -12 -1 1 -4 -6 -3 -3 -13 -6 2 -1 4 2 -2
7248 -2 1 -1 1 -1 14 -7 7 2 19 1 2 21 13 9 2 -3 4 9 13 6 -4 5 -1 9 -5 -2 -8 0 -6 -6 -2 -2 1 -1 -14 -7 -19 -4 -3 -2 -3 3 8 5 15 9 9 10
7296 10 10 1 3 2 6 16 -2 5 4 2 -6 -9 7 3 9 -1 -3 -10 8 1 -3 6 3 8 -7 -2 -3 -3 0 6 7 -3 8 3 1 -5 5 -2 4 -3 3 -2 2 9 10 -1 9 8 10
7345 10 8 4 -5 -4 6 7 -5 -3 -8 -5 -1 -8 5 -3 -4 3 7 5 10 0 -10 0 3 3 -5 -1 -1 4 6 4 -5 5 -8 -2 -1 1 14 -2 -1 0 14 9 11 4 3 2 8 -8
7393hJ0pmJ4lolKMklrJQmMKLkJQnPj2KOJRqjlJmJ0j1OqPMPj7Oj5LOKmj0J5krJ6
7445EpmLkJ4j3KJLljLMjj0NJjRkMnOrRj2Qk1J6QqjPj7OKmJlQk%jJqQpKjMMJjj
7499@NoL%LKKnNNrlkKqJ1k%mMjrlRKOqJoKmKMlOK%nQrLOKmj%%J1mmJljJ1mjnK
7557Fj0QJlMjqJ0ojpJrKJ1Nj0nQ%rPPlJnKNNj5J3lKoNKoJ0Qj8N%lkjRk4OJ6j2
7607hRk%kmkjJ5nkMLLmojkJ5pMKkj8K3KqlMOp%j1OKk%NklpmJJ5j0ojJ7rJKqQl
7660cPnRj3kJ3MLj0%MLj6mJ2LMj5Mj%KPj3LMjrQm%mJ8j4jnMJ6j1mKkQJ0oNjJo
7709D%NjLjpMmN%J%omJnJ0n%rKOj5J5qKJ5j2jrNP%lMpLJ1%nqK4j9J0J1j4%ojN
7759CNj2Rkj5J3KnLlnj2LJ6mpJ2kKkoLQqj4J2mJ0JNolJJ0j6J1jP%Kjk%KpJ2j4
$$ plain form
7393 -8 2 -5 -9 5 2 -4 -7 -5 -1 -3 -6 -15 -14 -6 -10 -6 -4 -1 -3 -2 6 1 8 -4 -2 4 5 14 6 5 2 3 -1 9 -2 4 -4 3 7 14 -3 3 -12 -9 -3 -1 -5 -15 0 -2 -11 5
7445 5 -2 -6 -3 -5 9 -4 -2 -1 2 -1 -2 1 5 4 -6 -1 0 -1 8 6 10 5 11 2 11 -1 7 -14 2 10 2 1 8 -9 -3 -1 -5 -4 -7 1 -1 -1 -2 -1 -9 -1 -8 -6 -7 -3 1 2 1 0
7499 0 5 -1 2 2 5 7 9 4 9 14 5 2 0 2 -6 5 3 3 -1 3 2 -7 -10 -1 1 7 -1 0 -6 -4 -8 -6 -2 -5 1 3 3 -2 6 -3 0 6 8 4 3 3 3 14 10 6 7 4 3 14 10 9 4 6
7557 6 -4 4 5 2 6 5 -3 7 1 0 -7 -6 -15 -13 -2 3 -7 -12 -4 -4 -13 -6 1 -2 -1 -6 -4 1 6 -9 4 1 3 -3 2 4 -2 8 16 -2 3 3 0 -2 -3 6 -18 -12 4 -8
7607 -8 1 -1 -1 -3 -7 -9 -10 5 0 -2 2 5 8 4 -2 -3 -5 10 3 7 9 7 -11 12 14 6 3 7 13 6 6 -5 1 3 1 1 6 4 1 -6 -10 -9 6 -4 -10 -11 6 -3 -2 0 -8 0 -3
7660 -3 4 -1 8 -5 -7 6 10 13 3 3 7 10 -6 -10 2 5 9 -6 -2 -3 -3 -1 6 -7 -4 0 -1 -10 -2 -6 -6 -10 8 -6 -7 -12 -8 8 -3 -7 -5 -7 1 11 5 10 9 10 4
7709 4 4 9 8 11 10 3 7 3 8 8 9 9 3 -1 0 -5 5 0 0 -9 -7 -1 -16 -1 -9 -7 8 -4 -5 -14 -9 -2 -2 -5 -1 -8 -5 6 6 1 -7 17 -2 8 19 5 5 -1 -2 3
7759 3 8 -4 5 3 -12 1 3 -2 1 -2 -7 -19 -16 0 -4 -11 1 -1 1 -1 -7 -4 4 -4 -18 -6 -10 0 1 6 0 -3 -2 8 -8 3 2 9 9 11 10 8 8 10 3 15 1
7806A%jlOpJ4j9PoMPkRrj2NJ1pQomjO%lOQoJ0rmQj0LMLRj3mllOJj4J2mPj0jJ%
7857ejlJ0j1O%O%rNKnPOlj0Rl%JOqJ0lj1K2j5kMoPL%lj%roJ7qnJ2rrQJKk%KpJ2
7909Dkn%KNnPoJ2j4J8OrjmJ%Nj0j0QrQjoJ%%Mj0J4j0lLKPokrJ6jjmLLPj0MLMJ
7960A0j0JLOrRj0J4nllj0%J1nNnlkjNkokJ3rOmkJ7rN%kjm%JJMmM%oMMpOJOqQj0
8013BlmjQJJrOj2J1nJ0j3Nq%J0KJJj3K1jrJ4j7RMj8J2jPj3PMkj1LkMQqlnJKJ0
8060FpOj0OrOmOpOqoJ1Mj3RNKj8J7npJ1Rj1KOlmrJ3mRj1RjjqJ0jnjJKp%NqNjP
8111Dj9J4Pkj1J2k0K4nrRkKR%rMlPj1J1qKj4OQjj8J3nJ1k0J3j0MKKNmoNMqJ4j
8156Fj0J1KpoOLmKMkKlQMj4PnNKrJKMkmLmkNqm%Kq
$$ plain form
7806 1 1 0 -3 3 -4 10 -9 -2 -8 -4 3 1 10 1 -11 -6 5 -2 6 0 -4 -5 1 1 -2 4 12 6 16 7 3 11 1 4 8 11 20 7 3 0 -3 3 4 -10 2 -2 5 -5 -6 -5 -5
7857 -5 -6 -9 1 -10 -4 -4 2 2 -7 -2 0 -5 2 8 5 -5 4 1 1 2 8 0 10 7 -4 18 3 1 5 -1 6 9 9 6 5 5 -4 -10 7 -1 -6 6 -3 -12 -4 -3 -1 -3 -3 -1 -8 4
7909 4 2 -3 -3 -1 4 -1 6 0 12 -2 16 22 13 12 8 9 9 14 4 -6 2 -7 1 0 -6 -5 -5 -5 -1 -11 3 -7 -10 -7 -5 2 -4 -6 -15 1 0 -1 -5 -2 1 8 -2 2 5 9 10
7960 10 0 1 4 10 1 10 0 14 9 6 3 -7 -7 4 -1 4 -1 -4 -6 -7 -2 -4 -10 -12 1 -8 -2 -6 -8 9 0 5 5 3 2 -2 -2 -1 0 4 0 4 4 -2 2 6 -1 5 6 12 4 12 2
8013 2 -1 -5 -6 2 3 4 -5 1 -11 0 -5 5 -8 -3 -11 -11 -1 1 2 3 -10 11 10 1 15 -2 7 11 -7 5 4 11 -2 5 9 7 -4 -1 -3 1 9 1 -2 -7 -6 -4 6
8060 6 -1 5 -5 1 -8 -2 -6 0 -7 -1 -9 -15 -4 0 -13 -4 1 3 -15 2 -3 -10 1 10 -1 1 7 4 0 -9 4 0 9 -2 7 6 5 -3 7 6 1 0 1 3 -4 -4 1 -7 -2 -3 4
8111 4 -15 -1 6 4 -7 5 -15 9 4 -5 4 2 4 13 13 4 8 5 12 1 12 4 6 -8 -2 6 5 -13 0 -5 6 -14 -1 -11 -7 -5 -3 2 -2 -8 -3 1 -7 7 6
8156 6 -4 7 9 2 -4 2 5 1 3 7 5 7 4 12 16 2 9 4 9 11 2 3 5 9 7 3 6 2 0 5 -3 -7 -7 -5 -13
8191a3
$$ Imaginary data points
##PAGE= N=2
##DATA TABLE= (X++(I..I)), XYDATA
0@%%%%%%%%%%%%%%%%%%%%%kOj2J6j6J6j9K4k9L6m1M8n5O3p4Q5r9J13j26J40j58
42h4J79k02K24k49K78l07L38l75M15m56N00n47N99o55P15p79Q45r12R81j044J089
63E53j100J035p95J35J725q155N8185K93460l43375k0872J02195k80468K58353
76F0876L9729l79977K61767K35768j63624M1481j66409j36572K49655n82j00585
87e8473P7476J2036R7689n5192k21951O1988L9983K6889J70099j54299l8476K12213
99A69982k27842r0804J87966j56346J27331K18057l02154N4677J68052l09170
109a60251P1295J50110j76508K20303P5838l00913J26620N3800j92253J18810
119a3149M93m2564K18197o7857j70074M2012l0429N1361M7313j04045R6099Q2340
$$ plain form
0 0 0 0 0 0 0 0 0 0 0 0 0 0 0 0 0 0 0 0 0 0 0 -2 4 -8 8 -8 8 -11 13 -16 20 -21 27 -28 35 -39 46 -53 60 -66 74 -84
42 -84 95 -107 117 -132 146 -161 177 -198 217 -239 261 -286 313 -342 373 -406 439 -473 508 -536 553
63 553 -547 488 -307 -172 1553 -6602 51583 345043 1668 -19204 82991 -197477 60876
76 60876 100605 -279372 -17605 218163 54539 96020 -70389 -206961 42694 42112 -58473
87 -58473 19003 31039 128728 73536 -148415 -86427 -46444 -19555 150544 -3755 -42231 169982
99 169982 -57860 -148664 39302 -117044 10287 228344 -73810 -19133 148919 -160251
109 -160251 -88956 61154 -115354 104949 180787 -120126 6494 60294 -131959 -13149
119 -13149 -12656 -55220 162977 95120 -74954 -32942 -63371 -12010 35303 -68742 27357 109697
131A09697p4345o601j43621k7250K33476n3681o7556J13846j06630L4350Q6308
142I7993k58594L9713K27040r6931N3820K2088k07863J31055O9697k10732R5686
153c7028Q7243n3403J27544q5418j64827J23005J492m9576Q3703l9185L3470P7029
165A04049j27480l8639K8788k3122R8132j362o3567R3151m5960p9364N6018p1633
177g0989L0338J39269r7544m320Q0012j26207J4489M9455j07275J09781Q2396
188I9405j22543M9370J893j02679Q0494j6146o1052J30423J364o3454L3849p3760
200d2836j0676P8489n1967J5891O2976l7266J9966l0307q3792O4706K3974k2214
212a3056N9622l6223j8080N8751q3473l0672P1571k8452M2181M5940r2931K1940
$$ plain form
131 109697 35352 28751 -114870 -142120 91356 37675 -29881 83965 -22665 11685 97993
142 97993 -160601 -120888 106152 9221 63041 85129 -122734 8321 78018 -132714 -37028
153 -37028 50215 -3188 124356 38938 -125889 -2884 -1392 -50968 32735 -6450 27020 104049
165 104049 -23431 -62070 -33282 -56404 41728 40366 -23201 69950 23990 -55374 644 -70989
177 -70989 -40651 98618 1074 -3246 76766 -49441 -34952 14503 -92772 17009 99405
188 99405 -23138 26232 28125 -74554 5940 -10206 -71258 59165 60529 -2925 30924 -42836
200 -42836 -53512 24977 -26990 -11099 51877 14611 34577 4270 -79522 -14816 9158 -13056
212 -13056 46566 10343 -7737 51014 -32459 -63131 8440 -20012 22169 68109 -24822 -2882
224b882L1604q3490L5300K6618l4157Q0966o471p9857L7908k0173l0027O0718
236A6057k1342J441O0674m8494k4379J4581m1872L3226L2437l3169L7212M000
248C0372m5050J8771k7010j8393O1061j0808p224L6909m2601r420K0546m7161
260d0008K3420M4605k8034K2040K189n0051K2446j753k9413M4803P491j4251K6475
273B9959l2246k3734K7093j8465N992L2326j7254J0033O448l9923O503P953j3355
286a8670L0632L873j5657J9336j9444k1641J7841j0289Q037K9080j6863j021O847
299A2061k8421L959J0005j0937K3569Q477j7965P758j1042j6105J5957k499J216
312c967K1024q749o438L365j8172J182J1728n074J1961P398j2124J175o469j1667
$$ plain form
224 -2882 28722 -54768 -19468 7150 -27007 53959 47488 -32369 5539 -14634 -44661 16057
236 16057 -5285 -3844 56830 8336 -16043 -1462 -43334 -10108 22329 -10840 26372 30372
248 30372 -14678 4093 -22917 -41310 19751 8943 1719 38628 -3973 -13393 7153 -40008
260 -40008 -16588 28017 -17 22023 24212 -25839 -3393 -5146 -34559 10244 17735 3484 29959
273 29959 -2287 -26021 1072 -17393 -11401 20925 3671 13704 20152 -19771 -13268 -5315 -18670
286 -18670 11962 15835 178 19514 70 -21571 -3730 -14019 -5982 23098 6235 5214 12061
299 12061 -16360 -12401 -2396 -13333 10236 18713 748 8506 -2536 -18641 -2684 -5183 -3967
312 -3967 17057 8308 1870 5235 -12937 -11755 -27 -5101 6860 14258 2134 3309 -3160 -14827
326a4827J0137M189J399J1311m911p395L4r311j19R060J267N988K830q108k737
341a193l362m393N547M403K499M483l109n447k526l464R82M951L524K825k3l614
357B083m748l056Q07K198M315M315j594j761k294o159R79L501L4O011J212n595
373B48J404l578m971O090P6M35P417m981l310L064p288J238O072m358N805L306
389F669q795K947j724o537R047n25l176R399o108m505O380q867J796R773q441
404b667M249N060j1844N944J433j0795J1313R31q282J1364n728p387J1932q623
418c100k920J3025r356J598Q861j4187M337O766j2545R309L227j1079J1715l131
432B520j0739J2972n574m692J3550j0539j124J1938j3722K963Q978j3949R193
$$ plain form
326 -14827 -4690 -501 898 12209 7298 -97 -63 -9374 -9493 -433 834 6822 9652 1544 -1193
341 -1193 -4555 -8948 -3401 1002 3501 7984 4875 -572 -3098 -6562 -5580 -629 2895 5720 5697 2083
357 2083 -2665 -5721 -4914 -2716 1599 5914 4320 2559 265 -5894 -4915 -1414 -1380 4631 5843 248
373 248 1652 -1926 -6897 -807 -731 -296 7121 2140 -1170 1894 -5394 -4156 1916 -2442 3363 6669
389 6669 -2126 821 -903 -7440 1607 1082 -2094 7305 1197 -3308 3072 -5795 -3999 5774 -2667
404 -2667 1582 6642 -5202 742 2175 -8620 2693 3624 -4658 6706 978 -6409 5523 -3100
418 -3100 -6020 7005 -2351 -753 8108 -6079 -1742 5024 -7521 1788 5015 -6064 5651 2520
432 2520 -8219 4753 -821 -5513 8037 -2502 -3626 8312 -5410 -2447 6531 -7418 1775
445A775N006j5219J2191M62j3034J4732n000r315J7273r481o211J5645j3211j58
459d545J4031j6149M899J0858j7007Q761N235j5584J3990M38j3758J5055n254
472I70q943J5984j0233l482J5251j3923J389J1056j6154Q170P543j6539J2630
485C719J861j5198J5931m435j2052J8768q907p313J8424j4289k654J6378j7420
498g187L459J3901j8064Q654Q349j8912J1941K900j5465J6190k055j1782J6246
511H175q447p193J5247j2310O6J3993j4914N076Q193j6898J0816L410j5623J6077
525E668j408j2788J7553r249r655J9272j2828l661J8575j6187J707J4138k0407
538i270O372J1515j7930J1857N335j7133J4575j133j4865J5775m637p205J6311
$$ plain form
445 1775 6781 -8438 3753 4215 -8819 5913 913 -8402 8871 -610 -6821 8824 -4387 -4545
459 -4545 9486 -6663 -1764 9094 -7913 848 6083 -9501 4489 4927 -8831 6224 970
472 970 -7973 8011 -2222 -5704 9547 -4376 -2987 8069 -8085 85 7628 -8911 3719
485 3719 5580 -9618 6313 1878 -10174 8594 -313 -7626 10798 -3491 -6145 10233 -7187
498 -7187 -3728 10173 -7891 763 9112 -9800 2141 5041 -10424 5766 3711 -8071 8175
511 8175 -272 -7465 7782 -4528 -4462 9531 -5383 -307 7886 -9012 1804 5214 -10409 5668
525 5668 4260 -8528 9025 -224 -9879 9393 -3435 -7096 11479 -4708 -3001 11137 -9270
538 -9270 -2898 8617 -9313 2544 7879 -9254 5321 4188 -10677 5098 461 -6744 9567
551I567j1098l708J3786j3905K010R874j4371J0040O221j6378J1413j54j3170
564i873J6005n389r539J8895r514p001J5094j4744K06J5935j6370M564J1818j7097
578g010Q094M719j6942J3938K587j3267J4547m391r539J4730j0272m892J5598
591G900j0870J213J0678j5360N881P161j6020J0252M418j1976J3671l704j2523
604i279J5237o163p547J4868r360r00J3744j5225j09J0758j2604P102N907j4068
618g639J1346K720j3808R939l178o877J5692p450o540J3271r674j198R483j3957
632g870N595J1456j3387N661L115j2914J1551K5j2224J3464j348p229J1380r629
646b354m698J3358r199k74R905j0520M742N463j3874O852L898r364J0476j403
$$ plain form
551 9567 -1531 -5239 8547 -5358 -3348 6526 -7845 2195 8416 -7962 3451 3297 -9873
564 -9873 6132 743 -8796 10099 585 -6416 8678 -6066 -5860 10075 -6295 -1731 10087 -7010
578 -7010 1084 5803 -11139 2799 5386 -7881 6666 2275 -7264 7466 -2806 -7698 7900
591 7900 -2970 -1757 8921 -6439 -558 6603 -9417 835 5253 -6723 6948 3244 -9279
604 -9279 5958 -205 -7752 7116 -2244 -3144 10600 -4625 -4734 6024 -6580 522 6429 -7639
618 -7639 3707 6427 -7381 2558 -620 -7497 8195 745 -5795 7476 -2198 -3396 6087 -7870
632 -7870 -2275 9181 -4206 1455 4570 -8344 3207 3232 -8992 4472 3124 -4105 7275 -2354
646 -2354 -7052 6306 -2893 -3167 6738 -3782 960 6423 -7451 -599 3299 -6065 4411 3008
660C008q387J1494o143p010J1414o782m89J0769j0948J399Q229j2386L878N658
674C704r463R417J802j1526Q935j083p846R515m760l066J2097p414l628P119q422
689d619L232O397j0247N779N240q902N451k118p769J1221j522o147Q828n193k200
704b569Q016r804l46R528o753L063L793j0035N726K744r258O682R76m849Q648
719E562m343o188P872m512j740P375o056J790O024q742J544L325o680O039J732
734C002o339O907j414o395O021l281k084Q073m904j099O175o728K15L832o424
749d443M765L966o647M081K17n804N419k014l731P649j997k474M375n740j37N214
765B699n417J939M253m773L164J19o561M659Q37l488N410j873k687N100m397k407
$$ plain form
660 3008 -5379 6115 -28 -7038 4376 -2406 -2895 7874 -3074 -1675 6554 -5832 -1954 3704
674 3704 -5759 3658 5460 -6066 2869 1786 -6060 3455 -1305 -4371 7726 312 -3316 3803 -4619
689 -4619 -1387 5010 -5237 542 5782 -3120 2331 213 -7556 3665 2143 -4004 4824 -369 -2569
704 -2569 5447 -4357 -4703 4825 -1928 1135 4928 -5107 619 3363 -5895 787 1763 -3086 5562
719 5562 1219 -4969 2903 -1609 -3349 4026 -2030 -240 5784 -2958 -1414 1911 -4769 1270 3002
734 3002 -3337 3570 2156 -4239 1782 -1499 -3583 4490 -414 -1513 4662 -2066 -1851 1981 -4443
749 -4443 322 4288 -2359 1722 1939 -3865 1554 -460 -4191 3458 1461 -1013 3362 -2378 -2515 2699
765 2699 -2718 -779 3474 -1299 1865 1984 -4577 82 919 -2569 2841 968 -1719 3381 -1016 -3423
781c423M906l131J430M137n271J283K252n344K489J480l159M837k00m116L290
796A460k095k231M207k170J73M117l710l34J755l978K185J995l071L423M57l662
812a479K439j687k204M390j337r00L651k964q09K089l729J232L153k520J786Q52
828A963l551J773j97k564L133L03j059K422k167j562K000j884L76K354j526J148
844I62P68l030P79L04j545K538J87j238K022j519j742J625j280K80K542j412J31
861C72J027k495J84Q37j275J848R13j461R18o99j577J154l64k0J925o15l99L79
879F52j613P2P94o70J206P54r51L82p62j235J044R7QJ340m69n13K87j284k00R86
899g5j04P02N70r14j15k24q55M62N13J95P44k11p00j69m65r5N38K82M92K59n22
$$ plain form
781 -3423 1483 -1648 -218 3919 -1352 -69 2183 -3161 -672 808 -2351 2486 2286 -1830 1460
796 1460 -635 -2866 1341 -829 -656 3461 -249 -583 1172 -2806 -621 1374 -1697 1726 2183 -1479
812 -1479 960 -727 -2931 1459 122 -778 2873 -91 -900 1189 -2540 -1308 1845 -675 1111 1963
828 1963 -1588 185 -12 -2576 557 860 -199 2223 56 -1506 494 -1390 -1014 1340 -186 962
844 962 1730 -1300 -521 -217 -1762 776 963 -275 1747 228 -1514 111 -1169 -889 1653 241 372
861 372 1399 -1096 -912 -75 -1350 498 1411 -50 868 169 -1408 -254 -618 -638 1287 672 273 652
879 652 -961 -889 -95 -765 441 1195 244 626 -136 -1371 -327 -230 -222 1118 649 136 423 -861 -1061 -75
899 -75 -179 523 1093 179 64 -160 -1015 -553 -40 155 899 688 -12 -181 -646 -741 -203 79 571 830 308
920C08m73l78k07M02M12L36L14j86m82m64l10K24M66M09K45j21k81m18m25O9K77
941b83M64N13j85l17j87n47l0L15P1O72K91n95j30l65m86N93J52M6P81k94n33
962e4O7p08O9Q22k13L82M17q04kj43p34P75M07k38O99m09o43M24o87j13J014k55
984G3K93M41j122O9K67q58P71M68n12Q99m19j081P31l84k56J180m94l3Q71j179
1004b75k36N79q11P88O65r51O85J7j110O66k85m24J407l71m67P97j036j30Q13
1023C21j025N99R71j047N33K1j329R97J10q96J338k08p06J037j004n57J276p72
1041c41J44J068j136L33N12j425O65M48q27J171j46r69J074o76o99J241p24O4
1059b23J239j289Q5P88j373O24O32j173J157K23j358J023l12r17J391n33n06J409
$$ plain form
920 308 -165 -543 -750 -348 64 400 714 528 46 -418 -728 -504 -38 371 616 495 214 -204 -629 -560 -283
941 -283 181 694 509 192 5 -542 -572 -257 -186 486 777 182 52 -313 -799 -206 -54 -8 773 479 -54
962 -54 13 -695 -626 196 -17 365 782 -22 -24 -167 -901 -126 281 43 742 333 -310 114 -573 -686 328 73
984 73 366 807 -315 -246 21 -837 -66 402 -110 789 370 -711 20 -364 -620 560 66 33 904 -275
1004 -275 -511 68 -743 45 710 -241 444 461 -649 17 -268 -692 715 344 -123 674 -362 -492 321
1023 321 -704 -105 866 -181 352 373 -956 41 151 -745 593 385 -321 716 -288 -845 431 -341
1041 -341 -197 871 -265 68 580 -845 -180 268 -559 612 466 -503 571 -105 -804 437 -287 -223
1059 -223 1016 -273 -188 600 -773 -149 483 -690 467 690 -668 355 43 -874 517 -16 -522 887
1077H87r25l60R24j200L46J006j163O38M94j222Q49j47j043J355k31o63J249r14
1095a20l84J210j213M3J188j164N62O76j546P96M24j319J152M7r74J337n32r18
1113g35J237p28k79J236j034J11R44j251L75N32j146R65K50j093J105k68r00J206
1131E27o73m66J360r14j61J113j249K19Q78j312O82O44j244Q85J41j168J100k21
1149A41q26J250n14m78J107r50j26R79j068L38P32j108P00K83j149R31l9q66J166
1168E03m17o09J208q19l54J086j007J42R81j152M23O17j186O74K71j039J000O
1186C28q53J020m38n97J051p10j89R86q67J43P07j060M00M69r79P66J77q63R13
1205D04k52p38R82n03l61J073p46r0Q39r89J86O50r79N85M33r39P28Jq81Q81k23
$$ plain form
1077 887 -38 -398 526 -674 -328 678 -485 153 647 -575 274 127 -916 439 208 -455 794 -120
1095 -120 -504 706 -507 -464 724 -440 122 798 -748 48 472 -847 305 352 -622 715 183 -735
1113 -735 502 -226 -505 731 -303 -192 752 -499 -124 408 -738 227 477 -616 489 221 -679 527
1131 527 -146 -612 748 -166 -327 786 -463 -244 634 -678 4 648 -596 289 430 -738 362 141
1149 141 -685 565 51 -427 680 -270 -396 583 -485 -147 585 -523 177 460 -689 242 203 -663 503
1168 503 86 -523 685 -134 -488 598 -409 -267 714 -438 -15 602 -584 90 361 -678 322 328
1186 328 -525 495 57 -540 511 -199 -388 598 -269 -126 581 -479 -79 390 -589 177 354 -509 404
1205 404 152 -586 396 -107 -468 605 -141 -231 608 -381 -195 455 -524 61 494 -445 283 284 -597 284 61
1226F1n45R93m79l13Q21q04m6P37q10L43N54q65M96J77q84P06k4n90Q88k82m71
1247c37P73o10k27P61o32J54O63q00K62L37q49N33J92o31P33m8o32O87l91l77
1267d39P67m42n2O76o47N4L98p50L57L62o26N85N2o31N51k32m53P29k75j83O78
1288D79n73r5M71o55K02N03n73M06J98o84M23l0n03O23p8k84N86l98k74M61m49
1309b44M6N09m29K02K65o05K24J02m42N27J9l40M81k81l29M41l61mN51l89O5K97
1331C05n65J55K12m41M25J77m03L63j51l92M17j88j25N09k50n8K77m66K9K87l34
1352b17K80K22l76K41p0l90L23k9j43M18j76j43K43l54n4L03k27J91K36l52J14
1373D0K3l51K59M3j53L79j04k49K36k48r4L23j66Q5K55k99J1N5k92J99J53j72
$$ plain form
1226 61 -484 509 30 -283 538 -266 -312 425 -385 -42 512 -353 143 320 -564 142 118 -472 416 134 -337
1247 -337 436 -174 -401 360 -272 -118 545 -255 7 344 -505 28 220 -411 322 274 -358 329 -62 -439
1267 -439 328 -114 -166 510 -137 -83 315 -435 -78 284 -342 243 295 -336 215 -17 -470 259 -16 -199 479
1288 479 -94 -189 282 -373 -171 332 -241 165 363 -321 102 72 -431 192 114 -170 416 18 -256 205 -244
1309 -244 -198 311 -118 84 349 -256 -32 70 -372 155 174 -166 315 34 -295 146 -215 -219 332 -57 8 305
1331 305 -260 -105 107 -334 91 268 -135 228 77 -315 102 -86 -211 298 48 -10 267 -199 -170 117 -217
1352 -217 63 285 -91 150 80 -310 13 -16 -159 259 83 -60 183 -171 -225 78 -149 42 278 -74 40
1373 40 63 -288 -29 14 -139 240 136 -113 123 -125 -219 104 -62 23 278 -21 -10 45 -247 -48 105 -67
1395f7K47j9k57J45j66r9K83n3J9J85k43m0P0k12J33J72j18J77m3k29J06q5r3
1418a87K57j6j9J57k03j06J15j41Q1K04j05O2L5k37L5K0o3J80L9o8R4j35j24P5
1442e0o3P8J53o7K8j1j78K3K5m8J74N6q5M5j14j06R9l8O3J38n5j7rj37%O8j3J19
1470G8N9q9lo6r1M9N5L9P5k7m8l4q9qO1M3Q1J8n9m2o5m9M3N0O1M5l3m7m1m3qO4
1502b1N0M9K0o4o1m4JL3N9O2Qj9n7o5k5K3M5O4L3l2l1n1o7K9K4N1O9k2m5k3p5
1533h2%N0J1P9K0n3k2m7n4O3K4L2P2m6m0j9o6J7Q3oN0K8q2j1l4o2Q6M8j0Q1p4
1564C6o2J6o9MJ05j8L3L2j03j5qm2Q4M9l4P0n3q2L1m8J4J19l3J7L8j25MK4o9J04
1594A9O0o6O4m2j03O9l6j7J23k6k5N0j06k7N4m4N4Q1q3K7Lj14M3K9m6J16j0n0
$$ plain form
1395 -67 180 161 -96 49 -117 -216 67 14 33 218 -25 -65 5 -207 -74 98 -20 157 114 -115 -9 -94 -187
1418 -187 70 54 35 192 -11 -117 -2 -143 -62 142 37 99 134 -103 -68 -48 -111 69 108 40 134 -1 -125 -50
1442 -50 -113 -35 118 51 79 68 -110 -87 -62 -110 64 120 35 80 -34 -140 -41 -79 -16 122 67 50 41 -96 -96 -28 -41 78
1470 78 137 48 45 -21 -112 -63 -8 31 106 79 31 -3 -92 -100 -39 4 85 103 44 2 -63 -112 -69 -19 42 87 54 7 -34 -77 -85 -21
1502 -21 29 78 98 34 -27 -71 -70 -37 22 84 92 73 16 -49 -74 -51 -6 58 91 59 28 -23 -90 -61 -37 14 83 61 16 -7 -82
1533 -82 -82 -32 -21 58 78 25 3 -44 -98 -35 -11 21 93 47 7 -12 -78 -61 22 16 66 94 12 1 -33 -95 -9 39 29 110 36
1564 36 -26 -10 -79 -75 30 12 45 77 -26 -41 -49 -91 -7 42 8 78 25 -57 -26 -74 -60 59 26 43 81 -44 -40 -16 -85 19
1594 19 79 13 77 35 -68 1 -35 -52 71 45 20 70 -36 -63 -9 -53 1 82 -1 26 29 -85 -42 -13 -59 57 47 -3
1622cN1r5l5R7o6O6Q3r6M1pj23P0L2m9J24k9p3O4o8n2R3m5QJ16j01pL5j11M1O8
1652B9p4Q8J5r9O2n5n8J12l9J1R2q7j7L8j01M6P5o5P1K9j14O4k5p7J15lm7J14
1680A00q9n5Q0q0J7Q3o6M3M3j25M6J7r1J18%o4Q4o3p0Q5o9K5R4p6K2O0j24L2M2
1709A9q9R9K8r5P6k8p7Q6l9j6J12n5k6P5j16L0N1q1O5M1p4N6l3q6R1j1m7J05n8
1738Cm0P4q6MP1p2N8N3r8L8J2q9O7K7o4J05l7o3P1o0j2Q2n7K1O6r3L3J7q7O6K1
1769C1o2P2j0q0Q1n1l1R3o3RO2p9LL2q7O7M0p1O7no5N3j1m7Q6j7m2P2p4J0N5q0
1801d2L6N9p6N2J1q2N9j5m4Q4j6n6O4l6m4O6n2J7N5n9J6L5q1M2K4o8O4%m7M3j2
1832cl7N7k5k5P6m6j4M8o1K2M5n7N4J4o9M6k2l2O0j9l5P1n2j2M4n4J8M2n9L3P
$$ plain form
1622 -3 48 -47 -82 15 -51 15 98 2 43 36 -87 -17 15 -34 90 61 -12 52 -16 -68 25 -20 -12 104 3 -4 31 -80 -39 29
1652 29 -45 43 58 -41 21 -34 -92 20 -19 -8 84 -3 -20 18 -83 -37 38 -27 44 73 -41 23 -2 -79 36 33 -14 100
1680 100 11 -44 36 -44 -27 56 -10 33 76 -49 -3 14 -77 41 41 -23 61 -2 -72 13 -56 -31 63 -13 9 69 -55 -23 19
1709 19 -70 29 57 -38 38 10 -67 19 -20 -36 76 21 -5 70 -46 -16 35 -46 19 60 -14 42 9 -77 14 3 -44 61 3
1738 3 -37 37 -49 -45 26 -46 12 65 -33 5 17 -72 -5 22 -42 63 26 -37 34 -26 -38 44 -13 8 74 -19 14 31 -56 10 31
1769 31 -31 41 31 -49 32 -19 -50 43 -20 -11 51 -28 -25 7 -80 -13 27 -44 23 18 -47 6 -5 -52 34 17 -25 47 -27 -17 38 -42
1801 -42 -6 53 -23 29 40 -42 17 2 -42 42 26 -30 34 -2 -46 20 -32 -15 40 -19 -3 32 -49 -7 17 -51 13 13 -34 9 -3
1832 -3 -40 17 -8 -33 43 -3 -17 31 -30 -8 37 -20 34 48 -21 25 3 -29 31 12 -23 48 -4 -16 28 -26 -8 34 -25 8 15
1863A5n0L6J1m5K9J4l7N1l3j1L8m3J3L9k9MK9o2L1J8m8O0j5k3M5k7k7M9l7nM5
1894C5l5mK6l9J0K4m3K7J7m2L3j3k8L4%k5K9j6qL1l6RK2j9J4J6l2K4lk6L7qj8
1927gM2j4k3K7l0nM0l2J4J3k9J2Jl4K9Lj8J4Kk2QqpK5j5PJ6k3LJ4j9J8Qk2K4L
1963A5k5J5JrK8j8nK6k6NRk2J3J5j7Nmj4JRqJ8kk3J2rrJ8joK2j9KRpP%j2QLoL
2005BqlK2LLMj4pRj1LJ3k0J8Mj7kMj2QkLPk3J7k4OJ1J1KpnlkOoJ4LmLnrMJ0J4
2050B0rj0QMj0QrJ0NPqj4Pj5L%kPKjnj0j0J1MJ1lOrmjJ0npJ3qJ2qPo%%J0MJm%
2097A2%jNpJkjj0KMj1MRoKj5O%mMPoRq%OnkOK1k4J7rLlJ0lKj6J6okoJ7j2Q%j0
2145BOj1j1LJ1Nkj4KKlqKPJ2jj3QkkNOlRmoOnkJ5k%joJ0pl%%PJ1j2j0%njQMoJ
$$ plain form
1863 15 -35 1 12 -33 -4 10 -27 24 -9 -20 18 -25 -12 27 -2 2 31 -31 0 18 -30 30 15 -8 37 10 -17 32 -5 -10 35
1894 35 0 -4 22 -17 -7 17 -26 1 18 -24 9 -4 -32 2 2 -23 6 -10 -18 13 -23 -14 8 -11 3 19 -13 11 8 -18 19 11 -7
1927 -7 35 21 -2 25 -5 -10 30 -2 12 25 -4 8 9 -25 4 7 -11 3 5 -17 -9 -17 -24 1 -14 -7 9 -14 -11 3 -16 2 10 -12 12 15
1963 15 -10 5 6 -3 25 7 2 28 2 7 16 -6 7 22 5 10 6 -8 -7 2 -6 12 10 -13 -1 -10 -19 -1 -2 -8 14 -5 -3 6 -1 6 6 -6 2 5 -1 2
2005 2 -6 -9 13 16 19 23 9 2 11 0 3 16 -4 14 18 1 -1 3 -9 -1 -3 0 7 -16 1 -23 -17 -6 5 7 0 -5 -8 -10 -4 -10 4 7 3 6 1 -8 -4 6 20
2050 20 11 1 9 13 3 11 2 12 17 24 16 2 9 -6 -3 -3 -5 2 4 3 -2 -12 -22 -11 -7 4 1 7 -2 -6 -7 3 -2 -9 4 -4 8 0 7 1 1 1 11 15 16 12 12
2097 12 12 11 16 9 10 8 7 -3 -1 3 -8 -4 5 -1 1 -14 -8 -8 -12 -8 -1 -7 2 -6 -6 0 -5 -7 -1 20 -4 13 4 7 4 14 11 13 -3 13 7 5 -1 16 4 12 12 2
2145 2 8 -3 -14 -11 0 5 3 -11 -9 -7 -10 -18 -16 -9 3 2 -11 -3 -5 -7 -2 4 1 10 6 0 6 1 -1 14 12 12 11 5 15 8 5 5 5 12 23 11 1 1 -4 -5 3 7 1 2
2195Boj4J4nNnNLJj4J2KmJ3j1RJ3j7j0R%PN%jJrLj3OJ5Jr%qj2RlRpLqJ0k3J2J0
2241@j7J8j5K3j0kj3J7j0J0J2j7K0rlkNlNlrJ8mKjJmLj1%PqoJ4rJNqlmlONlOj2
2287a1KPnoJ1LKJ1k0K2koPmlKQj5J3j3mK4k1%JqPKj2J3j0Pmjj7LLJ2Nj6J1Moo
2331a0OjK2mj4KMnPk%PJrLkLKLj4J3j6NjqNOrRmk1K6j5jlkONKPlrLRlJ2oj3J3
2380FpJJ1koJ5j9LNpLKmQOkj9Qj2LPqKOnjlnJ8k5J4J6j5pJ6j6K0PqKnnJ1%oQk
2427I%%jnJ2%r%%Nn%nloJ0mj0%lJJ4j%omJNlJ3jjOpL%Lj0J4%KJ1j8kPjjlkPJj0
2479CMj3%J7j0MMooKj1KRj5J6nJ1plQlPj5RJ1pKnQJo%QjJLmj0Rp%Klj3%J5njk
2528bnoJ2Kj0JMJ1j2lMNpJ0Qj5RqQJLj3MPPlMj1MjJ3j9jmRlqLj2RjPrLlO%ol%
$$ plain form
2195 2 -4 -18 -4 -9 -4 -9 -4 -1 0 -14 -2 0 -4 9 -2 7 20 3 -7 2 2 9 14 14 13 14 5 8 -5 1 16 17 8 8 0 -12 -3 -6 3 -4 -1 -9 1 -22 -10 0
2241 0 -17 1 -14 9 -1 -3 -16 1 -9 1 13 -4 16 7 4 2 7 4 9 6 -3 15 11 13 12 13 9 12 1 1 8 0 -6 8 -1 0 5 -3 -6 -10 -13 -7 -2 -5 1 -11
2287 -11 -9 -2 -7 -13 -2 1 3 14 -6 16 14 8 15 11 8 10 18 3 16 3 -1 23 2 2 3 -5 2 4 -8 5 -5 2 -2 -3 -20 -17 -14 -2 3 -13 -2 2 -4 -10
2331 -10 -4 -5 17 13 -1 1 5 0 7 5 5 12 13 4 7 5 8 10 13 -1 12 -4 1 0 -8 -3 3 -6 3 -1 -22 4 -11 -12 -15 -17 -11 -6 -4 3 0 -9 -6 3 0 12 6 -7 6
2380 6 -1 0 11 9 3 18 -1 2 7 0 3 5 1 9 15 13 -6 2 -10 -7 0 -8 -6 0 -5 -6 -9 -14 4 -21 -7 9 -6 -13 3 -13 7 14 6 8 3 -2 9 9 3 11 9
2427 9 9 9 8 3 15 15 6 6 6 11 6 6 1 -2 -8 2 -2 -12 -12 -15 -14 0 -1 -1 -7 -11 -10 -5 -8 5 4 3 9 2 5 5 8 -2 12 12 14 25 7 5 12 11 10 7 5 12 13 3
2479 3 7 -6 -6 11 1 5 9 3 -3 -1 -12 -10 -1 -16 0 -5 6 -1 -4 4 1 8 -7 2 13 6 8 3 11 12 6 6 14 13 14 17 13 3 12 5 5 7 4 -9 -9 6 1 0 -2
2528 -2 -7 -13 -1 1 -9 -8 -4 7 -5 -8 -4 1 -6 4 12 -3 6 -2 6 7 10 -3 1 8 15 12 16 5 9 8 21 2 1 -3 6 3 -5 -2 -14 -5 -6 1 -8 -5 -8 -2 -2 -8 -11 -11
2578a1J2j4J8%NnJ0%j3J1KqkJ1qPj0PJlJJj8J5qMlPj0Lj0N%NomJ1oPj1J5j2jM
2622aJ0prPjJ8k0J1%%pOPJrLNj1k%mpJ1o%M%KkNj0jRj2jQjKn%KQj0J7no%NMLP
2673A8qkoMOmjlLoP%Kjj4J%Qj0NrJRmj%J1njrQNJoPqJ5moJ2j1J2rM%Nmj7QmOJ6
2725B1j5mkMjoOkl%j5J6JrNlmQKmlMO%J3j0pLJ1jKlmKLLJmMpjmkMnLoMjj5J1p
2777a1%%pJ6Mj7J0J3j1oRkPpjMJJ1rrJ4qNLlk%NkklkLMrn%RqlNqJPJqmQNjlMN
2830CmJNLkMj0KJ0lKjkNNkp%n%j5J0jPrkkJNJjqM%KnoJ2NNKj0JKKNLQmNj4JkP
2884A3l%nj0ORnl%mM%j2O%LrkKoNKQj1jRlJL%J0pkM%nNLJKMJj4OnNJqknJ8npq
2938a1LJj2J2mJlJ1npONlj0lJ6Lj8J4NkJJ3nnJ5qlKLj0Rl%Mo%jkopNplOrjJ2J1
$$ plain form
2578 -11 1 -13 5 5 10 5 15 15 2 13 15 7 5 16 8 15 5 12 13 10 11 12 -6 9 1 5 2 9 -1 2 -8 -3 -3 2 -4 -8 3 -3 4 -7 8 -4 -5 -1
2622 -1 9 2 -7 0 -1 17 -3 8 8 8 1 7 14 15 6 9 14 3 1 1 -3 -10 1 -5 -5 -1 -1 1 -1 4 -6 -7 2 -10 -11 -3 -4 -2 -7 -7 -5 3 -7 10 5 -1 -1 4 8 11 18
2673 18 10 8 2 6 12 8 7 4 7 1 8 8 10 9 -5 -4 -4 4 -6 -1 -10 -9 0 -4 -5 -5 6 1 0 -9 -1 4 5 -1 6 -2 13 9 3 15 4 16 7 11 11 16 12 -5 3 -1 5 21
2725 21 6 2 0 4 3 -3 3 1 -2 -2 -17 -1 0 -9 -4 -7 -11 -3 -1 -5 -8 -4 2 2 15 5 -2 1 12 11 13 10 6 8 11 14 15 11 15 8 7 3 1 5 0 3 -3 1 0 -15 -4 -11
2777 -11 -11 -11 -18 -2 2 -15 -5 8 -3 -9 0 -2 5 -2 -3 1 2 13 4 -5 9 1 6 9 6 4 4 9 7 5 2 0 3 7 -2 -7 -7 2 -6 -9 -4 -12 -11 -4 -3 -11 -15 -7 -2 -3 -6 -2 3
2830 3 -1 0 5 8 6 10 0 2 12 9 11 10 8 13 18 16 9 9 4 4 -11 -1 -2 5 -4 -6 -8 -7 -2 -1 -2 -10 -6 -6 -4 -9 -15 -3 2 7 9 -1 0 2 4 9 12 20 16 21 7 8 6 13
2884 13 10 10 5 -5 1 10 5 2 2 -2 2 2 -10 -4 -4 -1 -10 -12 -10 -16 -11 -9 -1 -12 -13 -4 -7 -6 -3 -3 7 0 -2 2 2 -3 2 5 6 8 12 13 -1 5 0 5 6 -2 -4 -9 9 4 -3 -11
2938 -11 -8 -7 -19 -7 -11 -10 -13 -2 -7 -14 -8 -3 -6 -16 -19 -3 0 -18 -4 1 -1 0 13 8 3 18 10 7 9 12 2 11 8 8 12 6 6 5 3 -3 -10 -5 -12 -15 -9 -18 -19 -7 4
2987Dj0NpJ%jjQKLOLj6Rp%RJj1QQrMKmmJ0lloNj0Qj0PrNjjOo%oOjoJ1j1QJkMK
3040A%k%QNOqLpPkmJlnJ0kj5KPLj7RrLLKm%LNj1JKmJ4oJj2J7oJNjlKOJ0oLj0k
3092AJ2omKokOJmpmKJ2rpJ6j1MlK%oNQj4J3lMkj2J1kP%nLOMrJ5nj0J1j2NKj7P
3140aNllKp%MnLLj4J5J%j2%MOj3LRkRrJ0m%%MoPJ1nj3LKLQj1rMNkmPj2mOMKpM
3192bJ%j9J2lKjnPnJ2JJ1qjlMMqPMMp%pRlLJjoJJ3k5Qkk%Oj1%rN%%QkjKqMlkJ5
3246@%OnJKLK%qRoJ0knKpmRkppnJ3mlmOooQOOr%%N%j2PNrJ9oloOJQPnj5RMLQn
3302A4oLnNplp%PKj1jMj3J6ljjj0RJ1j3OJ3j8J0kJ3ljKj3PNklPlljmJ1kjj1J1
3348HkmNrrK0j0j4J6j6J2pPj2OlMKKPrOj1PJ2m%OLrkNNlqQj6J9j1j3J3J1j8JR
$$ plain form
2987 4 -6 -1 -8 -7 -7 -8 -9 -1 1 4 10 13 -3 6 -1 -1 8 9 -2 6 14 5 9 11 7 3 13 10 7 1 6 -4 4 -6 1 -8 -3 -4 -5 1 -5 -5 -11 -5 -6 -12 -1 -12 -4 -3 -5 -1 1
3040 1 1 -1 -1 7 12 18 10 13 6 13 11 7 8 5 0 10 8 -7 -5 2 5 -12 -3 -12 -9 -6 -4 -8 -8 -5 0 -11 -10 -8 -12 2 -4 -3 -15 2 -4 -3 2 1 -2 0 6 16 10 13 3 1
3092 1 13 7 3 5 -1 -3 3 4 0 -7 -11 -9 3 -6 -13 3 -8 -4 -7 -5 -5 -11 -6 2 -12 1 -2 2 0 -12 -1 -3 4 4 -1 2 8 12 3 18 13 3 14 2 7 9 -8 -1
3140 -1 4 1 -2 0 -7 -7 -3 -8 -5 -2 -16 -1 0 0 -12 -12 -8 -2 -15 -12 -3 -5 4 -5 5 1 1 1 5 -1 6 17 12 -1 2 4 7 15 4 -5 -1 4 2 -2 5 -7 -11 -5 -1 1 -6 -2
3192 -2 -1 -1 -20 -8 -11 -9 -10 -15 -8 -13 -1 0 11 3 2 -1 3 7 -1 6 10 14 7 7 0 9 6 9 10 9 3 4 17 -8 0 -2 -4 -4 2 -9 -9 -18 -13 -13 -13 -5 -7 -8 -6 -14 -10 -13 -15 0
3246 0 0 6 1 2 4 7 9 9 1 10 4 14 12 7 9 2 -2 7 5 -2 -9 -14 -1 -5 -8 -12 -6 -12 -18 -10 -4 2 -7 -7 -7 -2 -2 -14 -7 -2 -11 8 2 -1 -7 -1 0 8 15 10 -5 4 8 11 19 14
3302 14 8 11 6 11 4 1 -6 -6 1 3 -8 -9 -5 -18 -2 -5 -6 -7 -17 -8 3 -10 -4 9 -9 1 -1 12 9 8 10 -3 4 9 7 4 11 8 5 4 0 11 9 8 -3 8
3348 8 6 2 7 -2 -11 9 -1 -15 1 -15 -3 -10 -3 -15 -9 -12 -8 -6 -4 3 -6 0 -11 -4 8 4 4 10 13 4 2 7 12 9 1 9 -7 12 1 -12 1 12 -6 -5 4
3393Dj9RJlqJ2qMMNj0nJkMJ1%jn%%JRNnjLK%JkkN%Jpj0J1nkJ0j6J6j3rOJJKj0
3443a4%OmJ2kmj0QRLOj7J0jJnjQLpK%OjjKj7RnJ7j2qPLj2J4okkOJj7OQj4jQMk
3492fJ5j6OJKMKNpJJ2Nj4NqOlpMnj2J3nPpkJ0Kj2Lol%PnkNj6J4%nlJ0Nj2K0rR
3540HnMkjJ0kj7NkJ5j1oQKJpKopRj3J5qkJ3j5%kO%NplJ3j1OlJ0nj%ONrJJ3j3J2
3588A1j1J2n%kjrPj1NJ2mjpKN%j3On%jMMlj0QmLM%JnNJ2lrMJ3j2NjJKqnJMOj1
3638dNRj5jkjJJ%%mPm%kjmJKPJ2pmNPkKrQJjKoMKLrKlNOj0n%J2qpOjlMnjkMoK
3695gqJ8j8MkMPj5K4j1J1mjKNjloJ3j4Qj%rRlLJqjj1J0knQj2NpJ0Mj3K0k5J0p
3740a8J6mLP%LooMQpO%JkMj2ORoKmj1lPO%j3mJ0%pM%knjKKPLlpJ1rQmjPmRoOr
$$ plain form
3393 4 -15 -6 -5 -8 -16 -4 -12 -8 -4 1 -9 -14 -13 -15 -11 0 0 -1 -6 -6 -6 -5 4 9 4 3 6 8 8 9 7 5 10 10 11 4 -6 5 0 -2 8 -8 8 -5 -14 -8 -7 -6 -4 -14
3443 -14 -14 -8 -12 0 -2 -6 -16 -8 1 4 10 -7 3 2 3 -2 -3 5 8 1 3 3 9 8 7 9 -8 1 -4 13 1 -7 0 3 -9 5 -1 -3 -5 1 2 -15 -9 -1 -15 -16 -8 -4 -6
3492 -6 9 -7 -1 0 2 6 8 13 6 7 19 24 10 15 7 13 10 3 7 2 -10 3 -2 5 -2 -4 6 8 -4 -1 -7 -10 -10 -3 -8 -10 -5 -21 -7 -7 -12 -15 -5 0 -12 8 -1 8
3540 8 3 7 5 4 14 12 -5 0 -2 13 2 -4 4 6 7 0 2 -4 -11 -2 -15 0 -8 -10 3 -12 -12 -14 -8 -8 -3 -10 -13 0 -11 -5 -8 2 -3 -4 -4 2 7 -2 -1 12 -1 11
3588 11 0 12 7 7 5 4 -5 2 -9 -4 8 4 3 -4 -2 3 3 -10 -4 -9 -9 -10 -6 -2 -5 -15 -7 -11 -8 -4 -4 -3 -8 -3 9 6 -3 1 14 2 7 6 7 9 1 -4 -3 1 7 -4
3638 -4 1 10 -5 -6 -8 -9 -8 -7 -7 -7 -11 -4 -8 -8 -10 -11 -15 -14 -12 -5 7 0 -4 1 8 6 8 -1 7 8 7 9 3 7 9 12 3 5 2 7 13 3 -2 -2 10 2 -5 1 0 -3 1 -4 -5 -7 -3 -9 -7
3695 -7 -15 3 -15 -11 -13 -9 -2 -17 7 -4 7 3 2 4 9 8 5 -1 12 -2 6 5 5 -4 5 2 5 6 -2 -3 -14 -4 -6 -11 -3 -15 -10 -17 -7 -3 -16 4 -21 -11 -18
3740 -18 -2 -6 -3 4 4 7 1 -5 -1 7 0 6 6 7 5 9 -3 3 12 6 8 4 -7 -10 -3 3 3 -10 -14 -4 -4 -11 -7 -7 -9 -14 -15 -13 -11 -4 -1 -4 -11 0 -9 -1 -5 -6 1 -3 6 0 6 -3
3794cMOj0J1oOMKj5nlJ1jnjrJ2Kj6J1kQpklJ2j1RqKoJJ5nONojlLrJ5j1RMj2J0
3841HnJ0qoMJnjPj1%j0NJ2qjj0lRL%J0%nKkpJ1pJ8j2kJ8j5Nm%M%oRpjrJ2qNJm
3890cJ%knPpOJj1J0j5J8npRqJ4j2J0KQj2QMj1LK%QrJ6j1JJj3kQP%j2lRj0Rmkm
3937fnNJ2j5PjLoqRqPPqNNjMoJ0o%J4j6JNKkp%%j%J1j1lpRrpMOMpMo%KJoJ7rJ0
3990Cnj7K4rqJ2LPpkRKj0QnqJ0jMmopQlMj1kJ4j2%%Op%NoKNPjnMj3J7p%MlQLq
4041BOjkkpJ2jloJ3qj0J5njnMOj4RqLjqRPqjnQJ%lQkpQ%PmlKlLMMj5QKqMrKjk
4096fL%NqQpMKpqJ3jj3J3qpK0j2qJ8j1J5%lKpJ0lJ3j2rJ0koQK%mkmlj0J2j6O%
4142a3jKRmKK%Nj0LpJ9konRj1QqJ0%LMojjJ2JjJj3%jQjJ2prOj5mRKJoKjnjKNl
$$ plain form
3794 -3 1 7 -3 8 2 8 12 14 -1 -6 -9 2 1 -4 -5 -14 -2 0 -16 -5 -7 1 -6 -8 -11 1 -10 -1 -9 -7 -13 -12 3 -2 4 9 3 2 -1 2 -7 8 -3 6 10 -2 8
3841 8 3 13 5 -1 3 4 -1 -2 5 -6 -6 -16 -11 1 -7 -8 -18 -21 -12 -9 -9 1 1 -4 -2 -4 -11 0 -7 11 -1 -3 15 0 5 1 1 5 5 -1 8 1 0 -9 3 -5 0 1 -3
3890 -3 -2 -2 -4 -9 -2 -9 -3 -2 -13 -3 -18 0 -5 -12 -3 -11 3 -9 1 3 11 -1 7 11 0 3 5 5 13 4 20 9 10 11 -2 -4 4 11 11 -1 -4 5 -5 4 0 -2 -6
3937 -6 -11 -6 6 -9 -2 -3 0 -6 -14 -5 -13 -6 1 -7 -2 3 2 6 0 10 4 4 18 2 3 8 10 8 1 1 1 0 0 11 0 -3 -10 -1 -10 -17 -13 -7 -3 -10 -6 -12 -12 -10 -9 -15 2 -7 3
3990 3 -2 -19 5 -4 -12 0 3 10 3 1 10 12 2 10 5 -3 7 6 10 6 0 -7 1 -2 2 -9 -11 3 -9 -9 -9 -3 -10 -10 -5 -11 -9 -4 3 2 -3 1 -12 5 -2 -2 2 -1 7 10 2
4041 2 8 7 5 3 -4 8 7 4 -2 11 3 -7 8 3 2 -3 1 7 -7 2 -6 -3 -4 -12 -3 4 -4 -5 -10 -2 -1 -1 -4 4 2 -5 3 3 10 6 3 5 2 5 9 13 -2 6 8 0 4 -5 -3 -4 -6
4096 -6 -3 -3 2 -6 2 -5 -1 1 -6 -14 -1 -2 -15 -2 -10 -17 3 -9 -17 1 -10 5 5 2 4 -3 7 4 17 5 -4 6 4 -2 6 8 8 4 2 -2 -5 -15 -3 -19 -13 -13
4142 -13 -14 -12 -3 -7 -5 -3 -3 2 -8 -5 -12 7 5 -1 -6 3 -8 0 -8 2 2 5 9 3 2 1 13 14 13 14 1 1 0 8 7 19 12 3 9 -6 -10 -1 1 2 -4 -2 -3 -8 -9 -7 -2 -5
4194eLrNnLJ0mPQKkqj0J3lLOnpKJoJ3%j2RpljmKl%lJ7j4PpMnOj1QKrQkMPmRJp
4247DmJ5j4J4j0lJ0j0MmKjmKj9J1MJ1j1KJjp%Kj1JkJ3Nj2J3mOj5J5LnpNjNNJ2
4291B0j4jjm%PlLpMJ1k5QlrJ8mMj1%LqlK1j0%Jk%QJj2OlJ6jnLKKpONj0J%qRJ1
4340A9pnnLmmOKKk2OKMMnklLmOJrJ6j4J2qKJ3j6J7mNrRkokOkMJoKljLl%okMlm
4393iOkrOkMRj1J2oo%lMJ1nJjMMj0QPnMmMMKj0J0oj1pLJ1j4oQJOj6J4j3lJ2j1
4440a5RjnQRkmKOj0LJQmlOJoLRloLpRNj4Lkj2LNmKlnJ0j4KMnQmRojQJj7J4K%N
4493EPpKjkOKJjKnrJ2noQj0%KpQJpQj2JlJ5j8J2onJ3rKNNqJ3jlKj%jRoRJjopM
4546HNpmRj1JKj4JOpJ0j0Oj4OPJoRmNLP%j8J4roOKLKNQnmmRj1nRKooJ2j1mQjq
$$ plain form
4194 -5 -2 -11 -6 -11 -8 2 -2 5 13 15 13 5 -5 8 5 8 14 9 2 4 5 -1 12 12 0 9 2 -1 -2 -6 -4 -7 -7 -10 7 -7 0 -7 -3 -8 -2 -13 -5 -3 -12 -4 -6 -2 5 1 10 11 4
4247 4 0 15 1 15 5 2 12 2 6 2 4 3 -1 1 -18 -7 -3 8 -3 -1 0 -1 -8 -8 -6 -17 -16 -18 -5 0 -12 1 -3 3 -12 3 6 1 -6 -1 -2 3 8 20
4291 20 6 5 4 0 0 7 4 7 0 4 15 -10 -2 -5 -14 4 0 4 -7 -7 -4 -12 -15 6 -4 -4 -3 -5 -5 3 4 -8 -2 -5 11 10 5 8 10 12 5 11 16 6 7 7 -1 8 19
4340 19 12 7 2 5 1 -3 3 5 7 -15 -9 -7 -3 1 -4 -6 -9 -6 -10 -4 -3 -12 4 -10 2 -6 -4 9 -7 10 6 11 2 11 9 3 1 7 5 9 10 4 6 3 2 5 2 2 -4 -6 -2 -5 -9
4393 -9 -3 -5 -14 -8 -10 -6 3 -8 4 -2 -8 -8 -11 -7 4 -1 0 -1 3 7 -3 5 12 7 11 7 11 15 17 7 17 11 0 -7 -4 7 -7 -13 -5 -4 2 -14 0 -13 -16 -4 -15
4440 -15 -6 -7 -12 -4 5 3 -1 1 7 -3 0 1 9 5 2 8 9 3 6 15 12 6 9 2 11 16 2 5 3 -9 -6 -1 -5 -3 -6 -11 -1 -15 -13 -9 -14 -6 -10 -1 -7 -8 0 1 -16 -2 0 0 5
4493 5 12 5 7 6 4 10 12 13 12 14 9 0 12 7 1 9 -1 -1 1 -6 2 3 -4 4 -8 -7 -10 5 -13 -1 -7 -12 1 -8 -6 -1 4 -4 9 8 5 7 6 6 5 14 8 17 18 17 11 4 8
4546 8 13 6 2 11 0 1 3 -11 -10 -4 -11 -1 -11 -5 -19 -13 -6 -5 -11 -2 -6 -1 2 9 9 -9 5 -4 -10 -4 -2 1 3 8 16 11 7 3 12 1 -4 5 7 1 -5 7 -4 -8 0 -1 -9
4597iJjRj3mJ0loQjRj2jJ1nMk%J1m%%nJ1JkKkLmQnmOpmLOj1lMj4J8mmj6K6qj3
4646a6LNL%mJ0pJKNj0J0LjMoJKjk%JlQqNLrJjMj1PkJ1j0lplJ4j0J3j1Kl%%ONn
4696dJ0rOoJ5j1PlMOljkNj0PoMj1J5j1mlPnkkKkJ0j3MJ2j1%MpLMmK%jLJ1j1Pm
4744BKmJ3j1J5j4KoR%Nj2O%rKkJ3j5lJ2j0NnNrJqNmPKoRkJ2rPPqlKjRjmJJOpp
4795@J4j4Pnj2J7rjpPmmOOOk2J7j0JQrOnQjrJ3Nln%OM%rKKJqlJ2Kl%kmPj3JRj3
4846hRJj1lMkjMljqJ7mRl%j6J6NmRj6OKNM%kQj6lOQj4JkQj6OLlmnJ3KqJpQNj4
4897a4J9k0J8q%jPj1nJ2KJ3j4RJkPj1JRj3R%%pPj3jJ4j7Q%mQrj2MOlNplJ0kjJ0
4943Aq%kOlLJ1Llj0OQqjlNMKrrNJLpJoJ4rLpJ2j2%kJNj7RLkPj4K1j3N%PMj2KL
$$ plain form
4597 -9 -8 -9 0 -13 -17 -7 -10 -16 -8 -9 0 -12 -13 -2 -7 -3 -5 -5 6 2 2 2 -3 8 9 7 9 7 10 6 14 9 5 11 4 0 3 9 -2 -5 -1 -15 3 -1 -5 -21 5 -3 -16
4646 -16 -13 -8 -5 -5 -9 1 -6 -5 -3 2 -8 2 5 4 8 2 3 5 4 2 2 3 0 8 0 5 8 -1 0 -1 3 -8 -1 -3 8 -2 -5 -12 -15 -1 -11 2 -9 -7 -10 -10 -10 -4 1 -4
4696 -4 6 -3 3 -3 12 1 8 5 9 15 12 11 9 14 4 11 5 9 -2 13 2 -2 -5 2 -3 -5 -7 -5 -7 3 -10 -6 6 -5 -5 -1 -8 -5 -1 -5 -3 -3 -4 -1 10 -1 6 2
4744 2 4 0 13 2 17 3 5 -1 8 8 13 1 7 7 -2 0 -2 11 -4 -7 5 -5 0 -5 0 -9 -8 -16 -11 -15 -8 -6 -12 -3 -5 7 -2 5 12 4 1 3 2 11 10 6 7 8 14 7 0
4795 0 14 0 7 2 -10 7 -2 -3 -10 -3 -7 -11 -5 1 7 -15 2 -8 -7 1 -8 -2 -7 1 0 -9 4 9 6 1 1 7 11 11 2 4 6 7 -1 -4 8 10 7 7 5 1 8 -5 -4 5 -8
4846 -8 1 2 -9 -12 -8 -10 -11 -7 -10 -11 -19 -2 -6 3 0 0 -16 0 5 1 10 -6 0 2 7 11 11 9 17 1 -2 4 12 -2 -1 -3 5 -11 -5 -2 -5 -9 -14 -1 1 -7 -6 -13 -5 0 -14
4897 -14 5 -15 3 -5 -5 -6 1 -10 -15 -3 -1 12 -2 7 8 6 13 2 3 12 -1 8 8 8 1 8 -5 -6 8 -9 -1 -1 -5 3 -6 -18 -14 -8 -11 -6 -13 -16 -6 -8 -9 1
4943 1 -7 -7 -9 -3 -6 -3 8 11 8 -2 4 12 4 3 0 5 9 11 2 -7 -2 -1 2 -5 -4 -10 4 -5 -2 -9 3 -9 -9 -11 -10 -5 -22 -13 -10 -12 -5 -19 2 -11 -6 -6 1 5 -7 -5 -2
4994bNNpJ6Kj3jnQqlrLPlLMnpJNp%mOlkJ2j0JrPJ2JJjJl%NRmoLkRkpOMjj3jNK
5049EplRjj3N%jJMj1J1j0NloJ1jLjOQj1pLMPkqNNqOOnklJQMj3nOqPj0OMrQj2%
5101a2jJ7ojrqJ9OrJMMqKPNomNjnJ1rKnRn%llQjlMqlP%j0PNnjmllJ2qkJ1KrNK
5155@lJ7j5nPOLqmPMkOnkJ0oMnkqRoJ0j7pO%ojNLKLj7J1kJnQmOOj2J5j0OJ0nj
5205GJmo%J2rqQmLkNj6NjQqlkMmOjLnrJ2KjJjjOmJ0j5J1KKnmJ0NnkQqJqj0J1M
5257AlKnNj7J2jl%nLRkmOj4J4lj%%nJ6kjJNkKrMOqlLLo%kmJ4j3kM%%Okj0jKJN
5310dj5RMjoQknNJRKnMqQPqMn%%jqJ9oqjjJ0j1KrjRjj5J4j4K0lmKjoPPmj1POp
5362gPJ2mj2PkNklJ1qnlQkk%nLMj2J0j4lJ4j1mLPkojPmJ0l%jlJ2lkkMPKj2JPQ
$$ plain form
4994 -2 3 8 1 17 19 6 5 0 8 0 -3 -12 -9 -2 -5 -2 2 -3 -10 -9 -4 -11 -11 -15 -9 -12 -14 -2 -12 -11 -20 -13 -1 0 1 0 1 -2 -2 3 12 8 2 5 3 12 10 3 9 13 12 -1 -2 3 5
5049 5 -2 -5 4 3 -10 -5 -5 -6 -5 -1 -12 -1 -11 -6 -9 -15 -4 -5 -2 -3 3 11 0 -7 -4 0 7 5 -3 2 7 -1 5 11 6 4 1 2 10 14 1 -4 2 -6 1 -9 -3 1 -8 0 -12 -12
5101 -12 -13 4 -2 -3 -12 -20 -1 5 -4 -3 1 5 -3 -1 6 11 5 1 6 5 0 11 2 4 -1 8 3 3 0 -3 5 4 1 5 -3 -6 1 1 -9 -2 3 -2 -3 -7 -10 -13 -1 -9 -11 0 2 -7 -2 0
5155 0 -3 14 -1 -6 1 7 10 2 -2 5 9 7 13 8 6 16 10 14 9 7 -1 8 2 12 -5 -12 -6 -6 -12 -13 -8 -5 -3 0 -17 -6 -8 -7 -12 -4 -8 -2 4 -8 7 -3 3 13 8 7
5205 7 8 4 -2 -2 10 1 -7 1 -3 0 -2 3 -13 -8 -9 -1 -9 -12 -14 -10 -14 -8 -9 -6 -11 -20 -8 -6 -7 -6 -7 -8 -2 -6 4 -11 0 2 4 -1 -5 5 10 5 3 11 3 4 -4 -14 -3 1
5257 1 -2 0 -5 0 -17 -5 -6 -9 -9 -14 -11 -2 -4 -8 -2 -16 -2 -5 -6 -6 -6 -11 5 3 2 3 8 6 8 -1 3 9 1 -2 1 4 -2 -2 -4 -8 6 -7 -9 -5 -5 -5 1 -1 -11 -12 -10 -9 -4
5310 -4 -19 -10 -6 -7 -13 -5 -7 -12 -7 -6 3 5 0 4 -4 4 11 3 7 2 2 2 1 -7 12 6 -2 -3 -4 6 -5 -3 -12 -13 -4 -5 -20 -6 -20 0 -3 -7 -5 -6 -12 -5 2 -2 -13 -6 0 -7
5362 -7 0 12 8 -4 3 1 6 4 1 12 4 -1 -4 4 2 0 0 -5 -2 2 -10 0 -14 -17 -3 -14 -18 -15 -8 -10 -16 -17 -10 -14 -4 -7 -7 -8 -11 1 -2 -4 -6 -2 5 7 -5 -4 3 11
5412A1qkJ0m%l%j1OPqlQj8J2%PqkljlPpJ1mMqQnjJ4ln%Lo%J2qKPj1OJ3pj3QRl
5462A0ojjoLnkkQp%Rj1Oj0J2jqNpLJ0RqlMLLnPj1J9j0KN%oj0J5qJLjj8PMjKj0
5511hLKqjNJ1j1kNj1LJ0%pMJ0pJ1j7J1LJMmplMjOMJomnMqJ6j2kJJ0nqJJlqRmm
5561a6J8rMmOnOlNkqJ4nJ3Lj5M%mj1QjkJ2j4K%J1j3nJ2mNj6JJjNnJ3onkRj1J3
5607blmJ3rOkokNRJM%oJ0rjNrJO%j2J4j2Qj5mJ4knknLKKQk0RM%kJ3j5J4pmJ2M
5656Ilj4OMQj1OLjPj0%Qrlj1J9Nk5NlnJ2j6RLJkJoJ1j4JOKJNPkrJ4j1MKMqJKJ0
5705A3j6Pj1J1mqOlQoJ0nqjRlmmRpLljkOllJ3Lj0J0plNO%Np%jMkKqMj%nj3J8J
5756DlnjQmKkkoOj4J1Pj4J0rJQjMNPqkLqJ6mnJ2%r%jlNOj0%jjlkpLJ0j4jJ0ml
$$ plain form
5412 11 3 1 11 7 7 4 4 -7 -1 6 -2 -5 3 -15 -3 -3 4 -4 -6 -9 -10 -13 -6 -13 -2 -6 -2 -10 -2 -7 -8 6 3 -2 -2 1 -5 -5 7 -1 1 8 -3 3 16 9 -4 4 13 10
5462 10 4 3 2 -4 -1 -6 -8 -10 -2 -9 -9 0 -11 -5 -15 -3 -4 -12 -7 -14 -11 -1 8 0 -3 1 4 7 2 9 -2 17 7 9 14 14 8 -2 13 5 6 9 8 -10 -3 1 0 2 -8
5511 -8 -5 -3 -11 -12 -7 4 -7 -9 -4 -15 -12 -2 -2 -9 -5 5 -2 9 -8 3 6 7 11 7 0 -3 1 0 6 10 11 5 1 -4 0 -8 8 -4 -6 -5 5 0 -8 -7 -6 -9 -17 -8 -12 -16
5561 -16 2 -7 -3 -7 -1 -6 0 -3 2 0 -8 6 1 14 17 2 6 6 2 -9 -1 -2 -4 8 -6 -4 -4 7 -6 -11 1 -3 2 -14 -13 -12 -13 -8 -13 0 -6 -11 -13 -4 -15 -2
5607 -2 -5 -9 4 -5 1 -1 -7 -9 -4 5 6 10 10 4 14 5 4 9 0 1 7 7 -5 9 -3 5 -10 -14 0 -2 -7 -9 -14 -11 -9 -7 1 -19 -10 -6 -6 -8 5 -10 4 -3 -7 5 9
5656 9 6 -8 -2 2 10 -1 5 8 7 14 4 4 12 3 0 -11 8 13 -12 -7 -10 -15 -3 -19 -10 -7 -6 -8 -7 -13 -2 -16 -15 -9 -7 -6 -1 6 4 -5 9 -2 2 4 8 0 1 3 13
5705 13 -3 4 -7 4 0 -8 -2 -5 3 -3 7 2 -6 -7 2 -1 -5 -9 0 -7 -4 -7 -8 -10 -4 -7 -10 3 6 -4 6 -1 -4 1 7 7 12 5 5 4 8 6 8 0 4 3 3 -2 -15 3 4
5756 4 1 -4 -5 3 -1 1 -1 -3 -9 -3 -17 -6 1 -13 -3 -12 -11 -3 -4 0 5 12 4 2 5 -3 13 9 4 16 16 7 7 6 3 8 14 4 4 3 2 -1 -3 -10 -7 3 -11 -12 -2 -6 -9
5807inOnQLnO%MQnKj0%J1qJ0j2PJ0j2oMPNolOrNklPKj2pPOj4J2lqOQj7MKJ2j5
5856hoJ3QlJMoJ3%j2KLPknpJ1rjQqOj3RlpJ6qNqjmjJLkLpkRkJ0ojLmJ5jrJ2pm
5908EJ2lnk%j5J2pJ4pJ0lj5MLjLLj7JJ0qoJ8j9QmkkJ3qJ4j6J3mLmOLnP%llJ7j3
5954GLlmLJmkjPj1PL%j3Mj4JRKpOMNljpQQj0LJKoJJ4mK%mkKlJ1pQj4KNpkQJrJ
6008AoMOj0LqMKj1nJ5jKmNOqR%MNkj1J0POj9J2j3J4j0J1j0lLloLJmPMqqPj1kO
6056fpMjJ0nJ0qN%qKPqMJMoRljRmmjNnnQqJ1j5OJm%pJRj7%J1NqJ0pmQnKMJ%jN
6110DNj0PkQqMmQloJLJojJPj7KPrmP%j0%QKloPjJ0j1PqLMkJ1oQrJ1j0MMj3J1l
6161CjMlJ8k0LJ2mj6NLnmPKrmMk%rK0j5J1qNqLJ2%j3J7j0j%NNLKpNloMNrRj6J2
$$ plain form
5807 -9 -14 -8 -13 -5 -2 -7 -1 -1 3 11 6 8 -2 -2 9 1 11 -1 6 16 4 -2 2 9 14 8 5 11 2 7 5 2 9 11 -1 -8 -1 5 -9 3 0 -8 -2 6 -11 -7 -5 7 -8
5856 -8 -14 -1 7 4 5 9 3 16 16 4 6 9 16 14 9 2 13 4 3 11 3 9 -4 5 2 -5 11 3 8 0 -1 -5 -6 -5 -2 -4 -1 -8 -10 -1 -3 7 1 0 3 -1 14 13 4 16 9 5
5908 5 17 14 9 7 7 -8 4 -3 11 4 14 11 -4 0 3 2 5 8 -9 -8 2 -6 -12 6 -13 -5 -9 -11 -13 0 -8 6 -10 3 -1 2 -2 4 7 2 9 9 6 3 20 7
5954 7 10 7 3 6 7 3 1 0 7 -4 3 6 6 -7 -3 -17 -16 -7 -5 -12 -6 -2 3 0 -1 -8 0 8 -2 1 2 4 -2 -1 13 9 11 11 7 5 7 4 15 8 16 2 4 9 2 0 8 9 0 1
6008 1 -5 -1 5 -5 -2 -10 -6 -4 -15 -20 -5 -6 -4 -8 -3 3 -5 4 4 8 13 11 0 10 17 23 4 16 3 17 7 18 8 5 8 5 -1 2 3 -1 6 10 2 -6 1 -10 -12 -6
6056 -6 -13 -9 -10 0 -5 5 -3 2 2 -6 -4 3 -5 -1 0 4 -2 7 4 3 12 8 4 3 8 3 -2 6 -2 9 -6 0 1 -3 -3 -10 -9 0 -17 -17 -6 -1 -9 1 -6 -10 -2 -7 -5 -1 0 0 -1 4
6110 4 9 -1 6 4 12 4 8 4 12 9 3 4 7 8 2 1 2 9 -8 -6 1 -8 -12 -5 -5 -15 -15 -7 -5 -8 -14 -7 -8 2 -9 -2 -10 -7 -3 -5 6 0 8 -1 10 0 4 8 -5 6 3
6161 3 2 6 3 21 1 4 16 12 -4 1 4 -1 -5 2 4 -5 -9 -5 -7 -7 -16 4 -11 0 -8 -3 -11 -8 4 4 -9 8 -2 -3 -3 2 7 10 12 5 10 7 1 5 10 1 10 -6 6
6210FomKlj5K0j1JMQorK4j1j2J4LJjmJ1KOj5LJ0j8QRo%joRq%kPPj4lJLqPMKj0
6258ajqJ0knLkmJ5mpN%nJ0qJ1pJ1j1PJ3j1oJ2j3J0j0OqQPnjqPrJ9j8oJ3rPj4n
6303a4OKKJrLPNMrJmJ0j2RMkJMKknNlnPKkKRmj0KJo%j2J3qKp%KOknKQNj6J2lj1
6356a2kK5Jj3JRm%nlOmJ5j0MLqRmj1NnK%mkLLpJ2pOj0oN%KOoJpJ1LNmjkkONrJ1
6408A1J0j3mJ0r%jlj0J4nnklnkL%jK%pOKPKoNpj%J2Qj1J2lqJ2mmK1j4oMMrJ%O
6457IkoJj4J3qKj1lJ2nNJ%j0LOlJ1j5QORj1pRkRpLQrNj%Jj0J2qqJ5l%pNrPj2O
6506ekJ1nm%oRkJNpKj0J0K%kLlMJ1JKPk3MJKOJplj1J7JqOknoqOQj2J4j0J4j6J2
6555CljOrMlPj5J7j1OOmQmOJj0OoQkMj0Rmj0kJ0Jj1jJjKnlJOnKjlOlKMj1NKNp
$$ plain form
6210 6 0 -4 -2 -5 -20 0 -11 -10 -6 2 -4 -13 11 0 -12 2 5 6 5 1 12 14 20 5 8 18 0 8 17 11 11 10 4 13 5 5 3 10 17 3 0 1 4 -4 3 7 9 -1
6258 -1 -2 -10 0 -2 -7 -4 -6 -10 5 1 -6 -1 -1 -6 4 -4 7 0 11 0 7 20 9 3 15 2 12 2 8 0 8 15 10 9 1 8 -1 18 0 -6 7 -2 5 -9 -14
6303 -14 -8 -6 -4 -3 -12 -9 -2 3 7 -2 -1 -5 5 -7 2 6 4 5 9 11 9 4 9 6 1 8 10 8 10 19 15 5 7 8 2 2 -10 3 -5 -3 -10 -10 -8 -2 -4 -9 -7 1 6 -10 2 -1 -12
6356 -12 -14 11 12 -1 0 9 5 5 0 -3 3 -1 14 4 8 11 3 12 8 -3 2 -3 -1 -1 -5 -7 -4 -1 -8 4 -3 3 -7 -13 -8 -8 -6 0 -6 -5 -12 -1 2 7 3 2 0 -2 4 9 0 11
6408 11 21 8 4 14 5 5 4 1 -9 5 0 -5 -7 -10 -15 -17 -14 -14 -15 -13 -13 -20 -14 -12 -5 -3 -9 -4 -11 -12 -12 0 8 -3 9 6 -2 10 6 2 23 9 3 7 11 2 3 3 9
6457 9 7 1 2 -12 1 -7 -5 -16 -19 -7 -12 -7 -6 -6 -16 -13 -7 -10 1 -14 -6 0 9 -2 -9 0 -2 7 0 3 11 2 7 6 6 7 -3 9 1 -7 8 5 5 -2 3 -6 1 -11 -5
6506 -5 -7 4 -1 -5 -5 -11 -2 -4 -3 2 -5 -3 -13 -3 -1 -1 -3 0 -3 1 12 13 15 22 -1 3 4 6 12 13 6 3 -8 9 10 2 8 6 1 -5 -13 -7 1 -11 3 -7 7 -9 3
6555 3 0 -1 5 -4 0 -3 4 -11 6 -5 1 7 3 11 7 13 14 4 10 4 12 10 14 4 13 9 -1 -3 7 8 -3 -4 -3 -4 -2 -7 -10 -9 -3 -8 -6 -7 -10 -4 -7 -5 -1 -12 -7 -5 0 -7
6607gJ5qKQnKNmj3J4j3J3ojj%JjMrLJQj2KJjl%mj0J9r%%JjN%MmQjPj0kJRm%Nj
6659Hj1J3j2JMqJ2pLklkMMrJNm%PkKj1LMoP%pJ6lmkPmmJ1lkkqMNrPMmqjMQk1J4
6712akqJ7j3lMQn%Oolj1jJ1NKjjJmK1j2j0lJ6j4OPj6J0KkLPkrNrNLj4NjkNLLj2
6761a0OklJ0Nk4J3rJ3Rp%j0OOOj0J2j0MrORmNNj3pRpRpKnj%jnRlJOj3oNOnKJ0
6810CooJ8pmNMlQj2OkKKoJ7j3q%OMJj2MmOj4NPj9KjJ6pj3RNnRkK%LKKjKNpLmJ
6862CQn%NJlplPj0PpORj2oLp%LJklNkJ2j0LqOpJ2jJ0orJ0OJj2J2j1MKRkmNJj0
6912DJKllM%qPmj5J1oNNkklQqoJ1%kJ2j1J2oqJ8Jj2RRj1Lj2J0MlrLMMnkpmJ1l
6961CqKMn%Oj3MJkjNJ0mLlNLklnjQLjllQLnKKKpKj0OpKj0J2oPj1LLllOpOpQkr
$$ plain form
6607 -7 8 0 2 10 5 7 12 8 -5 9 -4 9 3 2 1 1 2 1 5 -4 -1 0 8 -4 -2 -1 -2 -5 -5 -9 -19 0 -9 -9 -9 -8 -9 -4 -4 0 -4 4 3 10 0 -2 -1 8 4 4 9 8
6659 8 -3 10 -2 -1 3 -5 7 0 3 1 -2 -4 0 4 -5 -4 1 -3 -3 4 2 4 -7 -4 0 -6 1 1 -6 10 7 3 1 8 4 0 11 8 6 4 -4 0 5 -4 3 7 3 -5 -6 -2 6 -15 -1
6712 -1 -3 -11 6 -7 -10 -6 2 -3 -3 3 -3 -6 -17 -18 -7 -2 0 -1 -2 -1 -5 16 4 -6 -9 7 -7 -1 6 -10 0 2 0 3 10 8 -1 4 -5 0 3 -11 -6 -7 -9 -4 -1 2 -10
6761 -10 -4 -6 -9 1 6 -18 -5 -14 -1 8 1 1 -9 -3 3 9 -1 11 1 5 -4 2 11 7 12 17 4 -3 6 -1 8 1 3 -2 -3 -3 -4 -9 0 -3 -2 4 -9 -15 -10 -4 -9 -7 3
6810 3 -3 -9 9 2 -2 3 7 4 12 0 6 4 6 8 2 19 6 -2 -2 4 8 9 -3 1 -3 3 -11 -6 1 -18 -16 -17 -1 -8 -21 -12 -7 -12 -3 -5 -3 -3 0 2 4 3 5 10 3 6 2 3
6862 3 11 6 6 11 12 9 2 -1 6 -4 3 -4 2 11 -1 -7 -4 -11 -11 -8 -7 -9 -12 -7 -9 3 -7 -4 -12 -6 -13 -1 -2 8 2 -7 3 9 10 -2 10 -1 3 5 14 12 8 13 14 4
6912 4 5 7 4 1 5 5 -3 4 0 -15 -4 -10 -5 0 -2 -4 -7 1 -7 -13 -2 -2 -4 8 -3 9 3 -5 13 14 2 11 20 9 12 0 10 14 11 2 5 9 13 8 6 -1 -5 6 3
6961 3 -5 -3 1 -4 -4 2 -11 -7 -6 -8 -9 -4 6 2 5 2 7 10 8 5 0 -1 7 10 9 6 3 11 14 9 11 13 15 8 10 0 6 -1 1 -9 3 -3 4 -7 -4 -1 -4 -7 -1 -8 -2 -9 -1 -3 -12
7016a2NkJ0LjoJ0mjJOjJQj5NKJJ0romOLkmkolPqjLOqJlRKmJLkRj2J1plOkOO%j
7070A2j4MKQNj1nJ2pqRKj3NOjj4MJmMlJ3Jj1qLMLlP%%lJ0pQ%kk%J2j0OPlj4n%
7119@Qj0J3kllpM%Lj0nJ1Lj0J1Kj0LMmkJmQjLlJJ0JjmmR%LlrJ1JrMrKoMPrjmQ
7171BLj4PmJPj0LMJkKKNj2QMlQolkQRj1PlpJ2j1oOlJ0Mj5J0j7QLj1%Pj3KJLjJ
7220fKoJ7poMMNo%N%oJ7nMqJ1p%kj5J3JpLJ2j6OnjLj0lJ2mpKOqJ2pmJ5rMpJ6j5
7269cJ3jmjKmPPjpJ2j3%j1K2j6lKkLOLj5k%PJj1pRLplJ1rNmNJ0lokJKLJ0%j1K
7318@pJ0LJ9rlKj1MlqJ7j3nOjj0J4j2LKKKlnj2PPJjkJ0QmmpJJ8JqRlLoKj0lJ5
7366A6pJ%J1ooOj0Nk0J1JnlJ0mljKJj1RJ0LpnKQ%JQorJ4RnjOj2KRj1knPqnjJ3
$$ plain form
7016 -12 -7 -9 1 4 3 -3 7 3 2 3 9 8 9 17 2 7 9 10 20 11 5 1 7 10 8 4 2 -4 -7 0 -8 -9 -6 0 -8 -7 -10 -1 1 -3 -2 1 -1 8 -4 7 0 -3 3 1 7 13 13 12
7070 12 -2 2 4 12 17 6 1 13 6 -2 7 9 -4 1 7 6 -8 -4 -3 -7 -3 -6 7 8 -3 -11 -8 -4 -1 -4 3 3 3 0 10 3 11 11 9 7 7 19 9 15 22 19 5 0 0
7119 0 8 -2 11 9 6 3 -4 0 0 3 -7 -12 -1 2 -8 3 5 -5 -2 2 -2 -4 -3 -7 1 0 3 0 1 11 12 11 7 3 12 12 15 12 3 14 15 6 10 1 3 -3 1 8 -1 -2 -6 2
7171 2 5 -9 -2 -6 -5 2 -8 -5 -1 0 -2 0 2 7 -5 3 7 4 12 6 3 1 9 18 7 14 11 4 16 5 -1 5 2 12 16 1 11 -6 2 5 -6 -6 1 -12 -10 -9 -6 -7 -6
7220 -6 -4 -10 7 0 -6 -2 2 7 1 1 6 6 0 17 12 16 8 19 12 12 10 -5 8 9 2 5 17 1 7 2 1 4 -6 -9 3 -1 -8 -6 0 -8 4 -3 -7 8 -1 3 -4 12 -3
7269 -3 10 9 5 4 6 2 9 16 15 8 20 7 7 -4 18 2 -1 1 -1 2 8 11 -4 -6 -6 1 2 -9 -16 -7 -4 -11 -14 -3 -12 -7 -11 -6 4 1 -5 -7 -6 -4 -1 9 9 -2 0
7318 0 -7 3 6 25 16 13 15 4 8 5 -3 14 1 -4 2 1 -9 5 -7 -4 -2 0 2 -1 -6 -18 -11 -4 -3 -4 -6 4 12 8 4 -3 -2 16 17 9 18 15 18 12 14 4 1 16
7366 16 9 10 10 21 15 9 15 5 10 -10 1 2 -3 -6 4 0 -3 -4 -2 -1 -12 -3 7 10 3 -2 0 8 8 9 17 11 2 16 25 20 19 25 13 15 24 13 11 6 13 5 0 -1 12
7415A2qqKrJ0mMPLj2MMpj1LMjNPMkK%lJ%NmJPk%mMjrMmRlljlJkrJLloJ0%ljJ3
7470GomkMJ1j2jJ0l%%NKkjmJ2lkj2RJnJ1LrqoJ3kmkoJj2J8njlJ0j3NRj3MJ2rJ2
7518Ijj0mJ0pMQPj2KKN%k2QKJ9j7%LlpJjM%j3OMkOolQmNMj1jJ7j4OMjQj1PJjN
7568A4loOQj2NKq%pOJ1roJjKPk0NMPj2NNlkJkKOLoPLp%PQj0nRLj2J0j2J2j3J2
7617A5rqJ7qoMoQk1J4mmQnJ1okjpjJ3NoJJKMNjnljLkQj4J2lQj2QLj3J5j5J0mn
7665CkJNj3RopJQomMN%KlJ0KljKlQoLPj0OoNMoj1J2LoNrjnKpJ4olkJkOoNJrjK
7720hJ0qlRMlLMqpJ1OnmRJ2j0J1j5JKlJ1opJLmpjjoNkJ1kj2KJ2jj0J5mQqkkQk
7769GNOj6J8loJ3nomJ5j1LqLnkPj5K0j7M%rNmKlJ0nmKKjJLJ0knKj3J6mLqJ3mn
$$ plain form
7415 12 4 -4 -2 -11 -1 -5 -1 6 9 -3 1 5 -2 -13 -10 -6 -7 -2 5 9 7 9 9 6 7 7 12 8 9 16 14 14 10 14 13 4 8 4 13 10 7 6 3 4 2 -7 -6 -3 -6 -12 -2 -2 -5 -6 7
7470 7 1 -3 -5 -1 10 -2 -3 7 4 4 4 9 11 9 8 4 16 13 11 -1 8 9 4 15 18 9 1 -5 8 6 2 0 -6 -5 -17 1 -4 -5 -8 2 -11 -6 3 -10 -6 6 -3 9
7518 9 8 -2 -6 4 -3 1 9 16 4 6 8 13 13 -9 -1 1 20 3 3 6 3 -4 -3 -4 0 0 -13 -7 -3 -5 1 -5 -8 0 -4 1 5 -6 -7 10 -4 2 6 5 13 2 9 10 9 14
7568 14 11 5 11 19 7 12 14 6 6 -1 5 16 7 1 2 1 3 10 -10 -5 -1 6 -6 -1 4 1 -1 0 -2 0 6 9 3 10 13 6 6 13 21 11 6 15 18 6 16 4 16 3 15
7617 15 6 -2 15 7 1 5 -1 7 -14 0 -4 -8 0 -5 6 0 -2 -3 -10 -11 2 7 1 2 3 5 9 14 13 8 5 4 7 5 13 -1 11 8 16 4 12 15 2 17 2 12 8 3
7665 3 1 2 7 -6 3 -3 -10 -9 -1 -7 -11 -7 -2 -2 0 -3 7 9 6 5 7 4 12 6 9 16 6 12 6 11 15 9 -2 10 13 7 12 3 2 -3 -1 -8 6 0 -3 -5 -4 -6 0 -6 -1 0 -9 -10 -8
7720 -8 2 -6 -9 0 4 1 4 8 0 -7 4 10 5 1 10 22 12 23 8 9 11 8 19 13 6 7 10 6 -1 -2 -3 -9 -4 -6 5 3 -9 -7 5 4 -6 9 5 13 5 3 1 9 7
7769 7 12 18 2 20 17 11 24 19 13 9 24 13 16 8 11 6 4 11 -4 16 -1 3 3 -6 -1 -5 -3 -6 4 -1 -5 -3 -1 -2 -1 2 12 10 5 7 -6 10 6 9 1 14 10 5
7817ERJK%Lj7MoKLPj2MJljjqoOQmNKpQj%qL%LjkJ4pjLkNK%nNkoJ2j6nJ1mJOqP
7872IoPqj3J3j3J0JmJlNNoKNrjJ4oj1J3MKnO%jkNMlqmOlLNj2J2j9J2jpOjokml
7922a1MPlLj0LRnNoPPlKjQj4J3j0L%LKmLl%JOj7QnJj1J4j0PqRj2JljNKpJ1nRj0
7972fJ0J2j7%lJ0kkJ0kpPLqPj1J0konMJ7j6lPj4KJ6j5J5j8NlOlmqQRMkj1jMQL
8018HloQLJj5J2mJ4rLJpOmoJoKLJm%Kj8QLOj0NmMRj9J6%pOLKnmK3j5J1j6JNNK
8068A2poJ1Rq%rJJ3j7jJ2p%moQj3J8rQj2jjJ0rPK%%PkjjnQjPLnLrP%JpJp%mJ1
8119Gj1MoMn%nOQj7mJ1KrJ5okJ8j3pJ%J2oJJ2pJ2mPj0LOj0NjJkmqJ2j6Q%j2OO
8166BoJlJjPoKKnQJonJ0rJ3lJOqJ0mjQ
$$ plain form
7817 5 14 15 17 17 20 3 7 1 3 6 13 1 5 6 3 2 1 -7 -13 -7 1 -3 2 4 -3 5 4 4 -4 -1 -1 2 1 -1 13 6 5 8 6 11 13 13 8 13 11 5 17 1 -4 7 3 4 10 2 9
7872 9 3 10 2 -11 2 -11 -1 0 -4 -3 -6 -1 4 -2 0 5 -4 -5 9 3 -8 5 9 11 6 12 12 11 9 14 18 15 7 3 9 6 9 14 2 14 -5 7 6 -1 5 4 -2 -4 -8 -11
7922 -11 -7 0 -3 0 -10 -7 2 -3 2 -4 3 10 7 9 8 16 2 15 5 8 8 11 13 9 12 9 9 10 16 -1 7 2 3 -8 6 -4 3 -5 4 -8 -7 -10 -11 -6 -4 -11 0 -5 4 -6
7972 -6 4 16 -1 -1 -4 6 4 2 12 10 3 10 13 5 12 1 11 9 3 -2 2 19 3 0 7 -7 -5 11 -4 11 -7 -2 -5 1 -2 -6 -14 -6 3 7 5 -6 -7 -3 5 8
8018 8 5 -1 7 10 11 -4 8 4 18 9 12 13 6 12 8 2 3 -3 -1 2 3 -1 -1 1 -17 -9 -6 0 -10 -5 -9 -5 4 -15 1 1 -6 0 3 5 0 -4 19 4 15 -1 0 5 10 12
8068 12 5 -1 10 19 11 11 2 3 16 -1 -2 10 3 3 -1 -7 1 -12 6 -3 5 -7 -8 -9 1 -8 -1 1 1 1 8 6 5 4 -1 7 6 13 16 11 14 5 12 12 13 6 7 0 0 -4 7
8119 7 -4 0 -6 -2 -7 -7 -12 -6 2 -15 -19 -8 -6 -15 0 -6 -8 10 -3 -10 -9 -9 3 -3 -2 10 3 15 11 18 8 11 17 7 12 11 12 10 6 -2 10 -6 2 2 -10 -4 2
8166 2 -4 -3 -6 -5 -6 1 -5 -3 -1 -6 2 3 -3 -8 2 -7 6 3 4 10 2 12 8 7 15
8191A5
##END NTUPLES=NMR FID
##END=
