##TITLE=1H_Ser C-3
 200.13MHz,.
 8 sc
 
 13.2.2026
##JCAMPDX= 6.0         $$ Bruker NMR JCAMP-DX V2.0
##DATA TYPE= NMR FID
##DATA CLASS= NTUPLES
##ORIGIN= UXNMR, Bruker Analytische Messtechnik GmbH
##OWNER= pz
$$ XWIN-NMR		Version 3.5
$$ Fri Feb 13 15:30:48 2026 Russian Standard Time (UT+4h)  she@DPX200
##.OBSERVE FREQUENCY= 200.131
##.OBSERVE NUCLEUS= ^1H
##.DELAY= (6, 6)
##.ACQUISITION MODE= SIMULTANEOUS
##.ACQUISITION SCHEME= undefined
##.AVERAGES= 8
##.DIGITISER RES= 18
##SPECTROMETER/DATA SYSTEM= spect
##.PULSE SEQUENCE= zg30
##.SOLVENT NAME= D2O
##.SHIFT REFERENCE= (INTERNAL, D2O, 0, 14.3821)
##AUDIT TRAIL= $$ (NUMBER, WHEN, WHO, WHERE, WHAT)
$$ ##TITLE= Audit trail, XWIN-NMR		Version 3.5
$$ ##JCAMPDX= 5.01
$$ ##ORIGIN= Bruker BioSpin GmbH
$$ ##OWNER= she
$$ F:/spectra/data/she/nmr/H-C/1/audita.txt
$$ ##AUDIT TRAIL=  $$ (NUMBER, WHEN, WHO, WHERE, WHAT)
(   1,<2026-02-13 15:28:58.10 +0400>,<she>,<DPX200>,
      <created by zg, POWCHK disabled, PULCHK disabled
       configuration hash MD5:
       00 E9 B6 7A A2 85 ED C7 34 08 36 98 17 FE 4E 26
       data hash MD5: 16K
       13 B6 A7 D2 6E 94 B1 51 6C 06 79 E9 C5 26 F0 2E>)
$$ ##END=
$$ 
$$ hash MD5
$$ 29 B9 E1 D2 35 38 A4 48 0F F2 95 52 16 40 03 3F
##$RELAX= 
##$RELAX= 
##$RELAX= 
##$RELAX= 
##$RELAX= 
##$RELAX= 
$$ Bruker specific parameters
$$ --------------------------
##$DU= <F:/spectra>
##$EXPNO= 1
##$NAME= <H-C>
##$PROCNO= 1
##$TYPE= <nmr>
##$USER= <she>
##$AMP= (0..31)
100 100 100 100 100 100 100 100 100 100 100 100 100 100 100 100 100 100 
100 100 100 100 100 100 100 100 100 100 100 100 100 100 
##$AQSEQ= 0
##$AQ_mod= 1
##$AUNM= <au_zg>
##$AUTOPOS= <>
##$BF1= 200.13
##$BF2= 200.13
##$BF3= 200.13
##$BF4= 200.13
##$BF5= 200.13
##$BF6= 200.13
##$BF7= 200.13
##$BF8= 200.13
##$BYTORDA= 1
##$CFDGTYP= 0
##$CFRGTYP= 5
##$CHEMSTR= <none>
##$CNST= (0..31)
1 1 145 1 1 1 1 1 1 1 1 1 1 1 1 1 1 1 1 1 1 1 1 1 1 1 1 1 1 1 1 1 
##$CPDPRG= <>
##$CPDPRG1= <>
##$CPDPRG2= <>
##$CPDPRG3= <>
##$CPDPRG4= <mlev>
##$CPDPRG5= <mlev>
##$CPDPRG6= <mlev>
##$CPDPRG7= <mlev>
##$CPDPRG8= <mlev>
##$CPDPRGB= <>
##$CPDPRGT= <>
##$D= (0..31)
0 0.7 0 0 0 0 0 0 0 0 0 0.03 0 0 0 0 0 0 0 0 0 0 0 0 0 0 0 0 0 0 0 0 
##$DATE= 1770982137
##$DBL= (0..7)
120 120 120 120 120 120 120 120 
##$DBP= (0..7)
150 150 150 150 150 150 150 150 
##$DBP07= 0
##$DBPNAM0= <>
##$DBPNAM1= <>
##$DBPNAM2= <>
##$DBPNAM3= <>
##$DBPNAM4= <>
##$DBPNAM5= <>
##$DBPNAM6= <>
##$DBPNAM7= <>
##$DBPOAL= (0..7)
0.5 0.5 0.5 0.5 0.5 0.5 0.5 0.5 
##$DBPOFFS= (0..7)
0 0 0 0 0 0 0 0 
##$DE= 6
##$DECBNUC= <off>
##$DECIM= 32
##$DECNUC= <off>
##$DECSTAT= 4
##$DIGMOD= 1
##$DIGTYP= 9
##$DL= (0..7)
0 120 120 120 120 120 120 120 
##$DP= (0..7)
150 150 150 150 150 150 150 150 
##$DP07= 0
##$DPNAME0= <>
##$DPNAME1= <>
##$DPNAME2= <>
##$DPNAME3= <>
##$DPNAME4= <>
##$DPNAME5= <>
##$DPNAME6= <>
##$DPNAME7= <>
##$DPOAL= (0..7)
0.5 0.5 0.5 0.5 0.5 0.5 0.5 0.5 
##$DPOFFS= (0..7)
0 0 0 0 0 0 0 0 
##$DQDMODE= 0
##$DR= 18
##$DS= 0
##$DSLIST= <SSSSSSSSSSSSSSS>
##$DSPFIRM= 0
$$ [...]
##$SUBNAM0= <"">
##$SUBNAM1= <"">
##$SUBNAM2= <"">
##$SUBNAM3= <"">
##$SUBNAM4= <"">
##$SUBNAM5= <"">
##$SUBNAM6= <"">
##$SUBNAM7= <"">
##$SUBNAM8= <"">
##$SUBNAM9= <"">
##$SW= 18.0517599122864
##$SWIBOX= (0..15)
0 0 2 0 0 0 0 0 0 0 0 0 0 0 0 0 
##$SW_h= 3612.71676300578
##$TD= 16384
##$TD0= 1
##$TE= 0
##$TE2= 300
##$TE3= 300
##$TEG= 300
##$TL= (0..7)
0 120 120 120 120 120 120 120 
##$TP= (0..7)
150 150 150 150 150 150 150 150 
##$TP07= 0
##$TPNAME0= <>
##$TPNAME1= <>
##$TPNAME2= <>
##$TPNAME3= <>
##$TPNAME4= <>
##$TPNAME5= <>
##$TPNAME6= <>
##$TPNAME7= <>
##$TPOAL= (0..7)
0.5 0.5 0.5 0.5 0.5 0.5 0.5 0.5 
##$TPOFFS= (0..7)
0 0 0 0 0 0 0 0 
##$TUNHIN= 0
##$TUNHOUT= 0
##$TUNXOUT= 0
##$USERA1= <user>
##$USERA2= <user>
##$USERA3= <user>
##$USERA4= <user>
##$USERA5= <user>
##$V9= 5
##$VALIST= <valist>
##$VCLIST= <CCCCCCCCCCCCCCC>
##$VD= 0
##$VDLIST= <DDDDDDDDDDDDDDD>
##$VPLIST= <PPPPPPPPPPPPPPP>
##$VTLIST= <TTTTTTTTTTTTTTT>
##$WBST= 1024
##$WBSW= 4
##$XGAIN= (0..3)
0 0 0 0 
##$XL= 0
##$YL= 0
##$YMAX_a= 164446
##$YMIN_a= -120707
##$ZGOPTNS= <>
##$ZL1= 120
##$ZL2= 120
##$ZL3= 120
##$ZL4= 120
##$ABSF1= 10
##$ABSF2= 0
##$ABSG= 5
##$ABSL= 3
##$ALPHA= 0
##$AQORDER= 0
##$ASSFAC= 0
##$ASSFACI= 0
##$ASSFACX= 0
##$ASSWID= 0
##$AUNMP= <proc_1d>
##$AZFE= 0.1
##$AZFW= 0.1
##$BCFW= 1
##$BC_mod= 2
##$BYTORDP= 1
##$COROFFS= 0
##$CY= -3
##$DATMOD= 1
##$DC= 2
##$DFILT= <>
##$DTYPP= 0
##$F1P= 0
##$F2P= 0
##$FCOR= 0.5
##$FTSIZE= 0
##$FT_mod= 4
##$GAMMA= 1
##$GB= 0.15
##$INTBC= 1
##$INTSCL= 1
##$ISEN= 128
##$LB= 0.25
##$LEV0= 0
##$LPBIN= 0
##$MAXI= 10000
##$MC2= 0
##$MEAN= 0
##$ME_mod= 0
##$MI= 1.114404
##$NCOEF= 0
##$NC_proc= 0
##$NLEV= 6
##$NOISF1= 3.799351
##$NOISF2= 2.8
##$NSP= 1
##$NTH_PI= 0
##$NZP= 0
##$OFFSET= 14.38212
##$PC= 1
##$PHC0= -3777.421
##$PHC1= 0.992321
##$PH_mod= 1
##$PKNL= yes
##$PPARMOD= 0
##$PSCAL= 0
##$PSIGN= 0
##$REVERSE= no
##$SF= 200.129724274929
##$SI= 16384
##$SIGF1= 3
##$SIGF2= 2
##$SINO= 400
##$SIOLD= 16384
##$SREGLST= <1H.CDCl3>
##$SSB= 0
##$STSI= 0
##$STSR= 0
##$SW_p= 3205.1282051282
##$SYMM= 0
##$S_DEV= 0
##$TDeff= 0
##$TDoff= 0
##$TI= <>
##$TILT= no
##$TM1= 0
##$TM2= 0
##$TOPLEV= 0
##$USERP1= <user>
##$USERP2= <user>
##$USERP3= <user>
##$USERP4= <user>
##$USERP5= <user>
##$WDW= 1
##$XDIM= 8192
##$YMAX_p= 0
##$YMIN_p= 0
$$ End of Bruker specific parameters
$$ ---------------------------------
##NTUPLES= NMR FID
##VAR_NAME=  TIME,          FID/REAL,        FID/IMAG
##SYMBOL=    X,             R,               I
##VAR_TYPE=  INDEPENDENT,   DEPENDENT,       DEPENDENT
##VAR_FORM=  AFFN,          ASDF,            ASDF
##VAR_DIM=   8192,          8192,            8192
##UNITS=     SECONDS,       ARBITRARY UNITS, ARBITRARY UNITS
##FACTOR=    0.0002768,     1,               1
##FIRST=     0,             0,               0
##LAST=      2.2672688,     0,               0
##MIN=       0,             -120707,         0
##MAX=       2.2672688,     164446,          0
$$ Real data points
##PAGE= N=1
##DATA TABLE= (X++(R..R)), XYDATA
$$ plain form
0 0 0 0 0 0 0 0 0 0 0 0 0 0 8 -8 8 -8 8 -16 16 -24 24 -32 40 -40 48 -56 72 -80 92 -104 120 -136 156 -176
34 -176 200 -224 252 -281 316 -352 392 -436 484 -536 592 -652 721 -796 876 -964 1061 -1172
52 -1172 1291 -1422 1574 -1742 1933 -2153 2408 -2706 3070 -3511 4068 -4790 5774 -7193 9429
67 9429 -13484 23187 -94330 -47163 105445 -935 73620 -29250 -36786 87363 -76520
78 -76520 -120430 66647 34126 76297 44609 -118398 -4101 27708 -90027 42824 55434
89 55434 8524 67703 -68986 -86696 50975 -34807 -586 87160 -1952 21681 -25379 -120707
101 -120707 37709 53348 -29586 50830 10135 -8925 24243 -110651 -47194 107371 31630
112 31630 14323 -10883 -65965 43631 -4201 -92117 45810 65695 26836 19356 -102220 -42178
$$ packed form
0@%%%%%%%%%%%%Qj6J6j6J6k4L2m0M8n6P2q0Q8j04J28j52J72j96K24k56K92l32
34a76L76m24M76n33N97o68P44q28R20j020J128j244J373j517J672j840K025k233
52a172K463k713K996l316L675m086M561n114N776o581P579q858J0564j2967J6622
67I429k2913L6671j17517M7167J52608j06380P4555j02870p536J24149j63883
78g6520m3910J87077l2521M2171l1688j63007J14297L1809j17735J32851J2610
89E5434m6910N9179j36689j7710J37671q5782L4221Q7746q9112K3633m7060r5328
101a20707J58416J5639q2934Q0416m0695j9060L3168j34894O3457J54565p5741
112C1630j7307k5206n5082J09596m7832q7916J37927J9885l8859p480j21576O0042
$$ plain form
124 -42178 71767 -22010 -79 45183 -6446 35259 -35206 -99383 39622 39404 -165 48206
136 48206 -25490 -19453 17930 -73118 -2289 70849 -4329 24311 1483 -53594 17737 -26309
148 -26309 -39575 76809 30788 -12918 549 -63134 1004 41267 -45371 19556 57257 -8951
160 -8951 1217 -54155 -52649 68053 22473 -18726 28994 -15164 -561 484 -71858 17850
172 17850 69888 -4097 8673 -20018 -39539 29035 -19125 -24933 58332 14245 -5232 -2855
184 -2855 -56934 5003 31171 -24107 31119 28507 -25195 483 -34528 -24092 49960 2208
196 2208 -4645 31011 -19969 -12139 -10418 -38412 38978 42577 -20321 5261 -12269 -21845 16075
209 16075 -24857 -3218 56487 2293 -16380 -12769 -34563 19429 18484 -21607 28241 18816 -20350
$$ packed form
124d2178J13945r3777K1931M5262n1629M1705p0465o4177J39005k18l9569M8371
136D8206p3696O037L7383r1048P0829P3138p5178K8640k2828n5077P1331m4046
148b6309j3266J16384m6021m3706J3467o3683O4138M0263q6638O4927L7701o6208
160h951J0168n5372J506J20702m5580m1199M7720m4158J4603J045p2342Q9708
172A7850N2038p3985J2770k8691j9521O8574m8160n808Q3265m4087j9477K377
184b855n4079O1937K6168n5278N5226k612n3702K5678l5011J0436P4052m7752
196B208o853L5656n0980P830J721k7994P7390L599o2898K5582j7530r576L7920
209A6075m0932K1639N9705n4194j8673L611k1794N3992r45m0091M9848r425l9166
$$ plain form
222 -20350 -5539 -32078 -6420 45729 -1347 -3906 17271 -20111 -7310 -8291 -22055 35724 25675
235 25675 -16730 4066 -14925 -16312 11965 -14764 9520 39447 -9933 -14979 -8643 -20138 16337
248 16337 8827 -9493 26600 5990 -21845 -8020 -18643 7735 31219 -7388 -189 11564
260 11564 -17306 -8933 -8205 -5237 32332 12118 -16094 -688 -10860 -7232 5802 -8624 15271
273 15271 25687 -13127 -14252 -7878 -8649 14177 5089 -2494 18077 -963 -18277 -8586 -7903 12678
287 12678 18828 -6269 1131 3932 -14381 -7627 -3670 4502 22817 3738 -12526 -3307 -6837 -3745
301 -3745 1964 356 15225 11426 -12343 -11643 -5889 -385 9654 2892 2844 9611 -4841 -14048 -7988
316 -7988 715 12900 8825 -2749 213 -2463 -9081 -5904 -821 10162 13776 -1308 -8666 -5204
$$ packed form
222b0350J4811k6539K5658N2149m7076k559K1177l7382J2801r81j3764N7779j0049
235B5675m2405K0796j8991j387K8277k6729K4284K9927m9380n046O336j1495L6475
248A6337p510j8320L6093k0610k7835J3825j0623K6378K3484l8607P199J1753
260A1564k8870Q373P28K968L7569k0214k8212J5406j0172L628J3034j4426K3895
273A5271J0416l8814j125O374p71K2826r088p583K0571j9040j7314R691O83K0581
287A2678O150k5097P400K801j8313O754L957Q172J8315j9079j6264R219l530L092
301c745N709j608J4869l799k3769P00N754N504J0039o762m8O767j4452r207O060
316g988Q703J2185m075j1574K962k676o618L177N083J0983L614j5084p358L462
$$ plain form
330 -5204 -3814 -862 806 5313 11420 2702 -9566 -9857 -3927 4188 6702 2798 3422 2672 -5371 -10293
346 -10293 -5335 5070 9583 4975 -672 -3570 -3911 -4799 -4586 3178 9541 6548 -696 -8319 -6435
361 -6435 753 -760 2027 8111 3498 41 -5300 -11333 69 6940 2202 5025 1430 -3422 -1396
376 -1396 -8909 -4253 10019 4692 2720 1500 -9243 -1679 998 -7169 6151 9603 -355 1171
390 1171 -7916 -8285 6175 -173 671 8956 -1643 -593 -2264 -12953 3800 9455 -2018 5268
404 5268 -53 -6685 2258 -7004 -4244 11867 2824 799 333 -10417 1482 2400 -7368 8226 6951
419 6951 -3220 2022 -9080 -6161 9589 -1575 348 7597 -3780 621 -3557 -11461 8641 6760
433 6760 -3604 6082 -4140 -4994 5120 -9487 -628 13434 -2033 792 -754 -10523 6214 567
$$ packed form
330e204J390K952J668M507O107q718j2268k91N930Q115K514l904O24p50q043m922
346a0293M958J0405M513m608n647k898l41q88K13P764O363k993p244p623J884
361f435P188j513K787O084m613l457n341o033J1402O871m738K823l595m852K026
376a396p513M656J4272n327j972j220j0743P564K677q167J3320L452r958J526
390A171r087l69J4460o348Q44Q285j0599J050j671j0689J6753N655j1473P286
404E268n321o632Q943r262K760J6111r043k025m66j0750J1899R18r768J5594j275
419F951j0171N242j1102K919J5750j1164J923P249j1377M401m178p904K0102j881
433F760j0364R686j0222q54J0114j4607Q859J4062j5467K825j546r769J6737n647
$$ plain form
447 567 -7840 11741 2623 -4641 3758 -11903 -1870 12866 -6700 1612 8171 -7853 2562 -3225
461 -3225 -11101 13052 3798 -6329 8030 -6535 -4057 7464 -11564 2628 14534 -7487 874
474 874 446 -10658 8551 -209 -7939 13296 -159 -6075 4127 -11157 1652 12058 -9403
487 -9403 3210 7448 -9404 2896 -3105 -7961 13902 729 -6364 7017 -6714 -1401 5498
500 5498 -10671 6464 10614 -9356 2544 -1287 -8336 9854 -2689 -5249 12631 -3883 -4352
513 -4352 3390 -10161 5675 8031 -10110 6943 3168 -9901 5858 -4941 -4649 14875 -4694
526 -4694 -4672 8163 -8654 885 4216 -10220 10417 6221 -11561 5308 -2946 -5950 11603 -6919
540 -6919 -3232 13909 -7526 -3320 3609 -9954 8710 6061 -11371 7863 949 -8438 7442
$$ packed form
447E67q407J9581r118p264Q399j5661J0033J4736j9566Q312O559j6024J0415n787
461c225p876K4153r254j0127J4359j4565K478J1521j9028J4192J1906k2021Q361
474H74m28j1104J9209q760p730K1235j3455n916J0202j5284J2809J0406k1461
487i403J2613M238j6852J2300o001m856K1863j3173p093J3381j3731N313O899
500E498j6169J7135M150j9970J1900l831p049J8190j2543k560J7880j6514m69
513d352P742j3551J5836K356j8141J7053l775j3069J5759j0799K92J9524j9569
526d694K2J2835j6817R539L331j4436K0637m196j7782J6869q254l004J7553j8522
540f919L687J7141k1435M206O929j3563J8664k649j7432J9234o914r387J5880
$$ plain form
553 7442 -6675 -2610 14663 -7114 -2966 7111 -9927 3275 4397 -9387 10169 2593 -10355
566 -10355 7018 -4039 -4692 10429 -7236 306 11244 -10784 -1187 4474 -7766 8897 1481
579 1481 -9960 10355 -1010 -8139 6191 -6284 2352 12113 -11269 -1218 7166 -8057 4484
592 4484 370 -8041 12417 309 -9934 5521 -4598 50 9289 -9533 1515 8807 -9533
605 -9533 1748 1616 -7409 10045 485 -7748 8224 -4042 -4695 7277 -5864 2444 7186 -9722
619 -9722 3444 4122 -9509 5070 725 -4029 10291 -5305 -7602 8364 -3513 -330 4447 -7929
633 -7929 6522 5615 -11553 2351 1506 -2863 9637 -5425 -6272 10318 -4178 -3401 4401 -6265
647 -6265 6076 5619 -10509 3230 1633 -5715 7416 -2992 -4140 9689 -5404 -3638 6303 -6756
$$ packed form
553G442j4117M065J7273k1777M148J0077j7038J3202J122j3784J9556p576j2948
566a0355J7373j1057o53J5121j7665P542J0938k2028R597N661j2240J6663p416
579A481j1441K0315j1365p129J4330j2475Q636R761k3382J0051Q384j5223J2541
592D484m114q411K0458j2108j0243J5455j0119M648R239j8822J1048P292j8340
605i533J1281j32r025J7454r560q233J5972j2266o53J1972j3141Q308M742j6908
619i722J3166O78j3631J4579m345m754J4320j5596k297J5966j1877L183M777j2376
633g929J4451r07j7168J3904q45m369J2500j5062q47J6590j4496P77P802j0666
647f265J2341m57j6128J3739j597p348J3131j0408j148J3829j5093J766R941j3059
$$ plain form
661 -6756 2164 5946 -6947 4526 1112 -8337 6535 -53 -4584 7171 -4058 -1382 7464 -8345
675 -8345 -1484 6851 -4275 3881 869 -8261 6579 1093 -6576 4895 -1988 -10 7344 -8059
689 -8059 -2557 6514 -4189 2735 2011 -6649 5876 1222 -6602 4065 -1644 -854 7018 -5257 -1781
704 -1781 4547 -5270 2407 3017 -5950 4488 1449 -5038 3939 -2663 -2645 6599 -2773 -908 3433 -5434
720 -5434 2269 2999 -5928 3821 1892 -3895 4509 -2686 -4003 5888 -2040 -755 3997 -4900 1505
735 1505 3073 -5888 2759 1655 -3661 5403 -1666 -5136 4959 -1788 -1224 4523 -4439 791 4305
750 4305 -5233 973 1393 -3371 5415 -362 -5117 4401 -1209 -2201 3985 -3515 322 4777 -4326 -227
766 -227 1715 -3210 3342 353 -3492 3961 -993 -2889 3183 -2187 -213 3731 -3048 391 2123
$$ packed form
661f756Q920L782j2893J1473l414r449J4872o588m531J1755j1229K676Q846j5809
675h345O861Q335j1126Q156l012r130J4840n486p669J1471o883J978P354j5403
689h059N502R071j0703O924p24q660J2525m654p824J0667n709P90P872j2275L476
704a781O328r817P677O10q967J0438l039o487Q977o602J8R244r372J865M341q867
720e434P703P30q927R749j929n787Q404p195j317R891p928J285M752q897O405
735A505J568q961Q647j104n316R064p069l470J0095o747N64N747q962N230L514
750D305r538O206M20m764Q786n777m755R518n610r92O186p500L837M455r103M099
766b27J942m925O552k989l845P453m954j896O072n370J974L944o779L439J732
$$ plain form
781 2123 -3512 1206 1074 -1640 2851 -1272 -2016 3199 -1870 -1312 2311 -1706 1558 1619 -4026 860
797 860 1620 -1625 1415 -983 -533 3150 -2268 -1610 1996 -1271 1501 1112 -3216 1951 1232 -2941 1186
814 1186 204 -395 2308 -1975 -908 2157 -1839 113 1145 -1631 2145 258 -3239 1828 583 -1669
830 -1669 1632 -517 -229 1770 -2137 -568 1719 -811 861 96 -1542 2023 -345 -2437 1709 496
846 496 -464 1055 -1542 -223 1591 -1386 -302 889 -102 1057 -989 -1550 1770 10 -983 1025
862 1025 -382 239 815 -1759 -60 1403 -385 79 -157 -219 1004 -1010 -975 1371 117 -184 168 -1015
880 -1015 528 732 -1343 -40 1040 183 -38 -900 -268 1108 -243 -566 555 196 218 -228 -1044 470
898 470 1046 -492 -495 383 404 -158 -822 -256 879 503 -522 -535 113 476 -36 -772 -68 1176 280 -1086
$$ packed form
781B123n635M718j32k714M491m123p44N215n069N58L623m017L264O1n645M886
797H60P60l245L040k398M50L683n418O58L606l267K772l89m328N167p19m173M127
814A186r82n99K703m283J067L065l996J952J032k776L776j887l497N067j245k252
830a669L301k149K88J999l907J569K287k530J672p65j638L565k368k092M146j213
846D96r60J519k597J319J814k977J084J191r91J159k046n61L320j760r93K008
862A025j407O21N76k574J699J463j788M64k36o2J223k014L5K346j254l01L52j183
880a015J543K04k075J303J080q57k21q62O32J376j351l23J121l59K2m46q16J514
898D70N76j538lQ78K1n62o64N66J135l76j025j3O48L63n12p36P04J244q96j366
$$ plain form
918 -1086 -248 549 148 -19 -393 70 1024 -219 -1129 17 579 543 -302 -916 771 723 -1154 -363 362
937 362 268 822 -738 -1019 1156 268 -884 -45 207 942 105 -1500 320 912 -439 113 -382 -19 1419
956 1419 -889 -1381 1073 437 -153 -234 -757 1054 465 -1549 120 515 218 719 -1408 -447 1929 -670
974 -670 -1047 669 36 898 -126 -1732 1017 851 -867 254 -524 409 1465 -1913 -765 1833 -426
991 -426 -133 15 -1017 1492 189 -1940 832 536 -106 647 -1558 190 1898 -1585 -450 1234 -522
1008 -522 768 -307 -1605 1702 403 -1445 633 -171 401 850 -2162 181 1911 -1151 -38 165
1024 165 -772 1664 -501 -1871 1592 405 -446 397 -1380 888 1400 -2077 286 1130 -829 1021
1040 1021 -748 -1398 2176 -330 -1380 1212 -554 271 692 -2026 945 1269 -1741 812 194 -1028
$$ packed form
918a086Q38P97m01j67l74M63R54j243r10J146N62l6q45o14J687m8j877P91P25
937C62r4N54j560k81K175q88j152Q39K52P35q37j605J820N92j351N52m95L63J438
956A419k308m92K454o36n90q1n23J811n89k014J669L95k97N01k127R61K376k599
974f70l77J716o33Q62j024j606K749j66j718J121p78R33J056l378J148K598k259
991d26K93J48j032K509j303k129K772k96o42P53k205J748J708l483J135J684j756
1008e22J290j075j298L307j299j848K078q04N72M49l012K343J730l062J113K03
1024A65r37K436k165j370L463j187q51Q43j777K268N12l477K363Q44j959J850
1040A021j769o50L574k506j050K592j766Q25M21k718K971L24l010K553o18j222
$$ plain form
1056 -1028 1691 -1030 -1247 2354 -616 -869 1064 -1075 825 769 -2170 1164 1066 -1412 899 -706
1072 -706 -764 2279 -1242 -1307 1898 -655 -75 570 -1757 1173 1043 -1764 821 96 -769 1511 -1164
1089 -1164 -746 2034 -1032 -410 1144 -1230 604 538 -1485 1246 232 -1231 1093 -598 -330 1363
1105 1363 -1507 37 1607 -1406 138 535 -1076 1325 -123 -1403 1467 -182 -564 913 -1361
1120 -1361 514 1584 -1820 236 920 -1221 1095 -148 -1433 1676 -221 -974 1146 -1077 108
1135 108 1295 -1698 602 1047 -1782 1052 414 -1520 1528 -274 -1108 1762 -838 -693 1346 -1125
1151 -1125 508 893 -1912 1109 801 -1742 1151 -156 -1076 1922 -879 -1191 1620 -744 -82 832
1167 832 -1509 930 839 -1636 922 51 -986 1647 -715 -984 1709 -851 -433 1159 -1120 417
$$ packed form
1056a028K719k721k17L601k970k53J933k139J900n6k939L334r8k478K311j605
1072g06n8L043l521o5L205k553N80O45k327K930j30k807K585p25q65K280k675
1089a164M18K780l066O22J554k374J834o6k023K731j014j463K324j691K68J693
1105A363k870J544J570l013J544L97j611K401j448j280K870j649l82J477k274
1120a361J875J070l404K056O84k141K316j243j285L109j897p53K120k223J185
1135A08J187k993K300M45k829K834o38j934L048j802q34K870k600J45K039k471
1151a125J633L85k805L021l08k543K893j307r20K998k801l12K811k364O62R14
1167H32k341K439r1k475K558q71j037K633k362k69K693k560M18J592k279J537
$$ plain form
1183 417 727 -1316 912 150 -1170 1222 -430 -628 1432 -1138 -347 1491 -1176 14 822 -1068
1199 -1068 911 206 -1344 1127 -40 -627 1090 -1060 -70 1543 -1403 -127 1025 -1061 742 280
1215 280 -1416 1114 117 -943 967 -655 -168 1248 -1279 32 1125 -1239 480 614 -1150 953
1231 953 91 -1095 1113 -197 -560 880 -782 189 900 -1341 334 828 -1018 616 19 -941 1178
1248 1178 -191 -954 855 -266 12 558 -1114 437 787 -1022 474 138 -706 1088 -352 -889 1086
1265 1086 -273 -359 619 -685 339 467 -1015 581 314 -771 733 -315 -503 1114 -663 -538 1017
1282 1017 -427 -56 340 -755 648 305 -935 544 66 -297 705 -773 -274 1168 -610 -346 555
1299 555 -468 417 155 -899 596 264 -491 423 -396 -29 804 -805 -123 823 -537 97 218 -563
$$ packed form
1183D17L10k043K228p62j320K392j652j98K060k570P91J838k667J190Q08j890
1199a068J979p05j550K471j167n87J717k150R90J613k946J276J152k086J803m62
1215B80j696K530r97j060J910j622M87J416k527J311J093k364J719J34j764K103
1231I53q62j186K208j310l63J440j662R71P11k241J675M94j846J634n97r60K119
1248A178j369p63J809j121K78N46j672J551L50j809J496l36q44J794j440n37J975
1265A086j359q6R78j304J024J28j482J596k67j085J504j048j88J617j777J25J555
1282A017j444L71L96j095J403l43j240J479m78l63J002j478M99J442j778K64R01
1299E55j023Q85k62j054J495l32p55R14q19L67Q33j609O82R46j360O34J21p81
$$ plain form
1317 -563 629 50 -696 582 -15 -198 383 -659 202 723 -859 60 541 -461 355 -138 -593 842
1335 842 -33 -593 388 -203 215 383 -928 271 727 -632 139 73 -428 721 -148 -675 644 1 -230
1354 -230 257 -459 295 455 -774 218 424 -470 314 -97 -427 739 -110 -565 435 -6 -21 136 -475
1373 -475 305 387 -545 115 114 -213 425 -275 -408 643 -18 -378 158 -63 185 107 -424 175 247 -163 86
1394 86 -206 -38 512 -257 -329 358 28 -57 -3 -199 218 163 -225 15 -21 83 173 -321 -18 371 -184 -129 142
1417 142 -71 114 2 -211 167 107 -96 -25 -129 166 210 -336 -40 251 -88 17 -16 -161 212 92 -196
1438 -196 7 38 68 22 -192 114 181 -184 -3 78 -45 122 -37 -177 134 120 -83 -97 -11 162 29 -175 18
1461 18 61 -22 45 -71 -78 140 31 -108 -15 103 32 -97 7 117 -18 -38 40 -29 61 83 -84 -62 113 80 -111
$$ packed form
1317e63J192n79p46J278n97j83N81j042Q61N21j582R19M81j002Q16m93m55J435
1335H42q75n60R81n91M18J68j311J199M56j359P71o6n01J149q69n27J319o43k31
1354b30M87p16P54J60j229R92K06q94P84m11l30J166q49m55J000m41j5J57o11
1373d75P80Q2r32O60jl27O38p00j33J051o61l60N36k21K48p8n31N99P2m10K49
1394H6k92J68N50p69p2O87l30q5N4j96M17n5l88K40l6J04R0m94L03L89n55N5K71
1417A42k13J85j12k13L78o0k03P1j04K95M4n46K96K91l39J05l3j45L73j20k88
1438a96K03L1L0m6k14L06O7l65J81Q1j23J67j59j40L11j4k03j4Q6J73j33k04J93
1461A8M3q3O7j16pK18j09j39R3J18p1j29J04J10j35k0P8o9R0K2j67K2J75l3j91
$$ plain form
1486 -111 -99 88 59 -75 1 -1 -34 69 -16 -110 39 100 -42 -105 42 101 -91 -54 109 -25 -14 58 -109 -2 148
1511 148 -66 -89 41 56 30 -128 -18 140 -67 -20 87 -144 51 163 -188 -2 168 -90 -5 31 -38 80
1533 80 -52 -38 134 -99 0 96 -201 95 180 -255 21 162 -151 26 24 -83 116 -59 -59 112 -114 65 96
1556 96 -241 158 167 -273 81 126 -124 120 -34 -97 172 -38 -22 41 -152 187 48 -286 169 63 -199 172
1578 172 -57 -155 196 -73 -61 109 -105 88 5 -176 237 -20 -216 280 -62 -174 263 -126 -79 247 -166
1599 -166 -24 105 -118 142 -57 -184 280 -66 -192 250 -160 -47 320 -251 -82 256 -124 58 33 -177
1619 -177 238 -9 -183 192 -147 -12 296 -308 -61 301 -211 5 102 -221 159 64 -196 152 -74 -40 222
1640 222 -239 10 260 -262 69 195 -247 139 88 -186 219 -44 -140 207 -112 36 147 -319 146 241 -345
$$ packed form
1486a11J2J87k9j34P6kl3J03q5r4J49O1j42o3J47N9j92L7J63j34J1P2j67J07J50
1511A48k14k3J30J5k6j58J10J58k07M7J07k31J95J12l51J86J70k58Q5L6o9J18
1533H0j32J4J72k33R9R6k97K96Q5m35K76J41l13J77kj07J99j75%J71k26J79L1
1556I6l37L99Rm40L54M5k50K44j54o3K69k10J6O3j93L39j39l34M55j06k62L71
1578A72k29r8L51k69J2J70k14J93q3j81M13k57j96M96l42j12M37l89M7L26m13
1599a66J42J29k23K60j99j27M64l46j26M42m10J13L67n71J69L38l80J82k5k10
1619a77M15k47j74L75l39J35L08o04K47L62n12K16R7l23L80r5k60L48k26L4K62
1640B22m61K49K50n22L31J26m42L86n1k74M05k63r6L47l19J48J11m66M65R5n86
$$ plain form
1661 -345 93 88 -190 270 -97 -270 288 -23 -70 84 -261 220 250 -392 94 154 -180 261 -112 -292 382 -3
1683 -3 -204 124 -146 116 180 -333 124 136 -243 203 -26 -224 316 -93 -228 303 -106 -121 148 -134 134 55
1705 55 -294 191 98 -176 156 -155 -70 389 -238 -257 260 -20 21 -13 -264 238 148 -218 58 -77 52 315
1727 315 -321 -134 384 -110 -31 79 -212 207 114 -252 119 0 -58 177 -229 4 273 -290 0 236 -248
1748 -248 66 74 -212 222 0 -252 172 -6 -23 114 -284 114 308 -305 -3 143 -124 218 -48 -296 269
1769 269 91 -147 50 -143 116 217 -304 10 159 -146 152 -41 -235 278 13 -181 134 -76 10 126
1789 126 -195 82 88 -204 155 28 -188 196 -72 -131 241 -125 -128 158 -63 59 13 -212 187 76 -180 137
1811 137 -81 -55 294 -174 -152 240 -69 -9 80 -182 133 81 -183 113 -54 -89 224 -176 -121 261 -157 -44
$$ packed form
1661c45M38nk78M60l67j73N58l11m7J54l45M81L0o42M86O0l34M41l73j80O74l85
1683ck01L28k70K62O4n13M57J2l79M46k29j98N40m09j35N31m09j5K69k82K68p9
1705E5l49M85r3k74L32l11Q5M59o27j9N17k80M1l4k51N02r0l66K76j35J29K63
1727C15o36J87N18m94P9J10k91M19r3l66L71j19n8K35m06K33K69n63K90K36m84
1748b48L14Qk86M34k22k52M24j78j7J37l98L98J94o13L02J46k67L42k66k48N65
1769B69j78k38J97j93K59J01n21L14J49l05K98j93j94N13k65j94L15k10Q6J16
1789A26l21K77Ok92L59j27k16L84k68n9L72l66lK86k21J22m6k25L99j11k56L17
1811A37k18K6L49m68K2L92l09O0Q9k62L15n2k64K96j67l5L13m00N5L82m18J13
$$ plain form
1833 -44 173 -193 47 115 -176 90 6 -115 179 -104 -90 199 -171 -7 216 -227 4 165 -163 80 40 -165
1855 -165 140 5 -94 107 -129 23 188 -193 -4 139 -152 85 65 -199 98 62 -109 45 -67 -10 120
1876 120 -123 4 84 -132 95 57 -184 94 58 -123 79 -22 -55 77 -50 7 46 -98 92 34 -138 106
1898 106 14 -113 123 -10 -106 82 -14 -14 29 -71 53 19 -73 83 -54 -72 128 -58 -109 119 -35 -45 52 -46
1922 -46 28 37 -48 42 -34 -18 108 -97 -37 141 -75 -34 97 -81 1 76 -48 26 0 -21 59 -53 7 85 -116 20
1948 20 114 -124 8 71 -88 49 45 -91 37 3 -19 33 -82 29 75 -111 25 57 -120 44 55 -108 53 42
1972 42 -76 27 9 0 28 -46 39 42 -74 51 45 -80 66 42 -88 41 39 -53 18 7 -9 5 -18 31 -7 -47 44 0
2000 0 -68 49 10 -64 44 18 -43 10 14 10 1 -2 32 -23 -19 65 -10 -35 53 -7 -32 48 6 -34 16 29 -5 -27 17 38 -25 0
$$ packed form
1833d4K17l66K40O8k91K66q4j21K94k83J4K89l70J64K23m43K31J61l28K43m0k05
1855a65L05j35r9K01k36J52J65l81J89J43k91K37k0k64K97l6j71J54j12N7J30
1876A20k43J27Q0k16K27l8k41K78l6j81K02j01l3J32j27N7L9j44J90n8j72K44
1898A06r2j27K36j33r6J88r6%M3j00J24l4r2J56j37j8K00j86n1K28j54j0R7r8
1922d6P4Rq5R0p6J6J26k05O0J78k16M1J31j78Q2P5j24P4k6k1Q0j12O0P8k01J36
1948B0R4k38J32O3j59J37mj36J28l4k2N2j15J11M6j86J36L2j77J64J1j63J61j1
1972D2j18J03j8rK8p4Q5Lj16J25oj25J46k4j30J29kr2P1j1j6J4k3M9l8m0R1m4
2000@o8J17l9p4J08k6o1N3MmrlL4n5MQ4p5k5Q8o0k5Q0m2m0N0J3l4k2M4K1o3K5
$$ plain form
2032 0 45 -32 -18 54 -21 -23 43 7 -36 19 23 -25 -8 20 3 -16 20 3 -19 17 29 -30 -36 53 34 -49 27 32 -31 24 31 -30 2
2065 2 41 -16 -7 28 24 -8 -29 30 21 -52 26 31 -51 35 18 -69 23 39 -40 -7 2 6 5 -50 17 28 -43 27 9 -51 58 22 -70 34
2099 34 42 -31 3 2 13 9 -29 33 19 -38 51 -21 -64 78 17 -63 38 11 -16 8 -14 5 6 -20 44 -27 -32 62 -33 -49 79
2130 79 -15 -54 44 -12 -7 15 -21 22 0 -11 46 -44 -5 96 -61 -31 92 -26 -13 47 -40 20 46 -20 10 -9 16 49 -69
2159 -69 0 76 -74 8 55 -85 14 55 -65 10 16 -22 23 -28 7 38 -66 38 59 -81 27 41 -79 53 26 -65
2185 -65 41 15 -4 31 -55 29 50 -78 40 21 -66 80 1 -91 70 31 -47 33 -28 10 44 -66 18 15 -49 75 -21
2212 -21 -89 99 0 -81 64 -22 -26 61 -48 11 35 -48 47 3 -49 87 -32 -56 114 -21 -59 72 -20 0 34 -65 28
2239 28 41 -30 39 -49 -10 120 -67 -78 97 -26 -17 32 -89 35 54 -66 -8 -10 13 72 -79 -17 114 -68 1 76
$$ packed form
2032@M5p7J4P2p5kO6l6m3N5Mm8J7K8j7j9L6j7k2L6J2n9oQ9j9q3P6No3N5Po1L2
2065BL9n7RL5ml2k1N9rp3P8Nq2Q6j7q7R2J6p9L3RMjn5O7J1p1P0j8o0J09l6r2J04
2099C4Qp3L4jJ1ml8O2j4n7Q9p2m3J42o1q0J01k7k7K4k2J9Jk6O4p1nR4r5j6J28
2130G9r4l9R8n6NK2l6M3k2j1N7r0L9J01j57L0J23j18J3O0q7O0K6o6L0j9K5L3j18
2159f9O9P6j50Q2M7j40R9M1j20P5Ol8M5n1L5L1j04J04K1j40J08J4j20J32k7r1
2185f5J06k6j9L5q6Q4K1j28J18j9q7J46p9r2J61l9p8Q0o1L8L4j10Q4lo4J24r6
2212b1o8J88r9q1J45q6mQ7j09N9K4q3R5m4n2J36j19k4J70j35l8J31r2K0L4r9R3
2239B8J3p1O9q8L9J30j87j1J75j23RM9j21J24J9j20N8kK3N9j51O2J31j82O9P5
$$ plain form
2265 76 -77 40 63 -85 37 41 -30 28 -27 6 59 -83 23 87 -95 20 37 -87 62 29 -121 36 41 -25 7
2290 7 -62 32 78 -88 2 36 -69 84 -3 -132 95 49 -99 32 -10 6 61 -65 1 49 -42 56 -4 -85 113 -8
2316 -8 -102 83 4 -62 64 -34 -9 40 -62 26 25 -44 44 -41 -49 112 -46 -97 83 -10 -16 34 -64 16 65 -44 7 -18 0
2345 0 90 -52 -48 116 -24 -21 67 -53 17 86 -50 3 23 -8 48 -35 -12 71 -58 -9 76 -71 8 61 -61 16 39 -60
2373 -60 15 11 -12 13 -43 20 56 -70 15 47 -59 47 24 -81 45 39 -31 16 -9 14 38 -41 24 27 -44 63 3 -82 59
2402 59 10 -57 28 -9 -18 46 -27 9 7 -42 58 -7 -74 64 -1 -51 62 -16 -42 62 -18 -15 19 -31 28 6 -38 51 -23 -40
2432 -40 83 -32 -38 79 -29 -33 62 -32 -5 45 -27 21 -11 -23 66 -38 -45 60 -43 -24 62 -54 -14 63 -40 -15 21
2459 21 -24 29 -19 -22 44 -30 -1 51 -62 5 75 -44 -12 36 -26 11 18 -14 18 -6 12 28 -44 17 43 -44 19 37 -47 13
$$ packed form
2265G6j53J17K3j48J22Mp1N8n5L3N3j42J06O4j82J15J7j24J49l3j50J57No6L2
2290Go9R4M6j66R0L4j05J53q7j29K27m6j48J31m2J6N5j26O6M8r1R8o0q1J98j21
2316hr4J85p9o6J26r8K5M9j02Q8jo9Q8q5qJ61j58n1J80r3oN0r8Q0M9j09N1k5J8
2345@R0j42MJ64j40LQ8j20P0O9j36N3K0l1N6q3K3Q3j29M9Q5j47P9N3j22P7K3r9
2373f0P5mk3K5n6O3L6j26Q5L2j06J06k3j05J26op0M7k5K3K4p9O5Lp1J07o0q5J41
2402E9m9o7Q5l7rO4p3L6km9J00o5o7J38o5n0J13p8k6J04q0LL4n0N9k2m4Q9p4j7
2432d0J23j15oJ17j08mR5r4K7N0p2M8l2j2Q9j04pJ05j03J9Q6j16M0P7j03K5L6
2459B1m5N3m8lO6p4K9N2j13O7P0j19L2M8o2L7Pl2L2k4J8J6p2O1K6q7O3J8q4O0
$$ plain form
2489 13 46 -32 2 8 -6 13 -6 4 4 -24 32 20 -48 27 15 -48 12 12 -35 14 -1 -11 1 -7 20 -4 -26 35 -3 -32 36 5
2521 5 -26 34 9 -30 19 1 -3 6 0 12 -9 -1 33 -25 -32 47 -18 -25 14 -10 -19 12 -9 -10 -1 4 7 -30 -17 31 -14 -10 34 -11 -2 21 -13
2558 -13 -13 24 9 -2 -3 29 8 -16 12 33 -25 0 19 -22 4 15 -10 -21 19 0 -15 -19 7 2 -20 11 7 -30 17 19 -26 -1 22
2591 22 -6 -15 28 17 -16 10 24 -6 0 31 -3 -13 30 13 -13 19 22 -8 -6 21 0 -23 9 9 -27 -2 28 -12 -8 24 10 -19 2
2624 2 14 -11 3 15 -6 -11 21 15 -20 10 15 -7 -12 25 12 -5 15 18 -15 13 19 -16 -1 38 5 -13 15 13 -7 8 14 5 -5 17 4
2659 4 -32 13 27 -26 -13 34 -14 -17 16 -8 -1 3 10 -10 -5 22 13 -25 4 27 -23 0 27 -14 3 27 -18 -6 18 15 -4 4 31 18 -19
2694 -19 21 16 -32 17 17 -28 23 28 -26 0 21 -3 -1 -8 24 -5 -20 23 11 -22 32 10 -45 27 14 -20 14 27 0 10 3 25 7
2727 7 -3 39 4 -20 46 1 -25 46 11 -14 25 17 10 10 5 14 -15 -13 29 -24 -12 41 -20 -23 33 -7 -26 15 -5 5 14 -2 2 2 2 37
$$ packed form
2489A3L3p8L4Oj4J9j9J0%k8N6j2o8P5j2o3O0%m7M9j5j0J2qK7k4k2O1l8k9O8l1
2521El1O0k5l9M9j8mRoJ2k1QL4n8pP9o5pL9k4rL1k1jRNLl7J3M8m5MM4m5RK3l4
2558a3%L7j5j1jL2k1k4K8K1n8K5J9m1K6J1k5j1M0j9j5mK6nk2L1ml7M7Km5K5K3
2591B2k8rM3j1l3K6J4l0OL1l4j0M3j7k6L2Ll0KK7k1k3L2%l6K5L0m0ML2j4k9K1
2624BJ2k5J4J2k1nL2ol5L0Nk2nL7j3j7K0Ll3K8Ol5J5L9l3j8K8kk0J5Orj0K2j3
2659Dl6M5J4n3J3M7m8lL3k4PMPk0NK7rl8K9K3n0K3K7m1J7K4m5J2K4lj9QK7j3l7
2694a9M0nm8M9%m5N1Nn4K6K1k4KpL2k9j5M3j2l3N4k2n5P2j3l4L4J3k7J0pK2j8
2727Gj0M2l5k4O6m5k6P1l5k5L9qp%nRk9KM2n3J2N3o1lN6m0j9M1k0J0Rj6M%%L5
$$ plain form
2763 37 -27 -3 55 -16 13 44 -5 6 31 -5 2 11 2 10 -10 14 18 -25 17 35 -44 1 36 -23 -2 23 -16 13 0 3 10 -16 26 17
2797 17 -35 25 26 -36 13 23 -35 22 17 -16 15 6 15 18 -21 18 16 -29 32 14 -35 38 12 -39 22 2 -8 16 -13 3 11 -18 20 0
2831 0 -40 33 -9 -43 27 -5 -30 39 -2 -17 14 -1 8 7 -7 35 8 -11 38 -10 -16 48 -6 -3 35 -2 -1 17 -8 3 -7 -1 21 -13
2865 -13 -19 33 -24 -15 26 -32 -15 28 -17 -3 2 -14 5 -9 2 26 -28 9 26 -34 10 28 -22 8 16 -19 13 12 5 15 -9 24 30 -32
2899 -32 21 23 -33 16 13 -32 18 17 -25 13 5 1 9 -15 11 9 -23 24 1 -47 35 13 -38 27 14 -15 19 1 -7 19 -8 26 7 -25
2933 -25 32 4 -17 41 3 -23 40 8 -20 24 -2 8 3 -20 17 3 -21 30 -14 -31 35 -6 -28 24 -8 -12 16 -7 8 9 -3 15
2965 15 -7 -8 28 -8 -9 38 -3 -1 32 0 0 15 3 10 1 12 15 -4 5 24 -21 -11 30 -18 -10 19 -17 -2 3 -11 -4 -18 11 0 -20 9
3001 9 21 -28 3 28 -20 5 21 -18 10 24 3 3 6 22 9 -6 18 18 -22 17 18 -11 18 13 -13 3 22 -5 -5 4 11 -5 -25 21 0
$$ packed form
2763C7o4K4N8p1K9L1m9J1K5l6PRrQk0K4Mm3M2J8p9M5L5n9K1K5l9K9j3LPk6M2r
2797A7n2O0Jo2M9J0n8N7nl3L1rRLl9L9km5O1j8m9P3k6n1O1k0j0K4k9J6Qk9L8k0
2831@m0P3m2l4P0l2k5O9m1j5L1j5Rjj4M2k7j9M9m8oO4n4LL8l7JJ8k5J1j0OK2l4
2865a3oN2n7RM1n8J7M3m5J4Nj6J9j4J1K4n4L7J7o0M4J8n0L0Ql5L2jpJ0k4L3Oo2
2899c2N3Kn6M9lm5N0jm2L8qmQk4K6kl2M7k3m8Q2k2n1O5j3k9L4j8qK6k7L4j9l2
2933b5N7k8k1N8l8k6O3l2k8M4k6J0nk3L7j4k4N1m4j7O6m1k2N2l2mK8k3J5Jj2J8
2965A5k2jL6l6jM7m1KL3l2%J5j2PrJ1Lj9RJ9m5J0M1m8QK9l6J5Nj4Pj4K9j1k0K9
3001IJ2m9L1K5m8K5J6l9K8J4k1%LJ6j3j5K4%m0L9Jk9K9nk6J6J9k7%RPj6k0M6k1
$$ plain form
3036 0 -27 20 -10 -26 17 -1 -23 -4 14 -2 -1 -2 9 -9 2 16 -16 -7 35 -3 -9 26 8 -5 19 4 5 2 11 13 -1 3 20 -16 3
3071 3 34 -18 -10 19 -8 -5 9 -5 -15 -4 -2 16 -20 8 9 -23 12 19 -28 -5 6 -12 6 15 -1 -1 14 18 10 -9 13 24 -10 15 26
3106 26 -9 9 21 -6 4 24 -8 0 12 3 -1 -7 5 -4 -13 8 5 -26 4 8 -25 5 8 -11 -4 11 -3 8 6 17 -5 -14 19 7 2 2 24
3143 24 -3 9 18 -6 -3 15 12 -5 12 10 -5 2 14 -5 -13 14 -5 -17 4 9 -7 -6 6 -5 -11 12 -1 -9 -6 4 -7 3 8 -2 -8 4 14
3180 14 -6 -2 20 0 -1 11 8 -6 16 4 -12 -3 7 3 -11 4 4 -17 0 3 -11 -1 11 -11 -10 7 -1 -13 -8 2 -9 -14 0 4 -11 16
3216 16 5 -16 -1 15 -15 -14 17 2 -4 14 14 3 -2 19 5 -4 10 1 -10 2 16 -14 -7 11 -6 -14 4 -3 -15 -4 8 -19 -14 11 5 -12
3252 -12 0 2 -14 6 1 -11 -1 9 2 -8 6 18 -4 -1 19 -1 3 17 8 -6 8 2 -5 1 13 3 0 4 9 -12 8 13 -17 -7 7 -12 -2
3289 -2 7 -8 -11 3 1 -2 -6 9 14 -19 4 13 -10 3 11 -10 -2 15 -3 -2 8 9 5 5 11 7 -8 18 17 -13 12 3 -21 -1 11 -6 -6 0 -2 -3 -16
$$ packed form
3036@k7M7l0j6M3j8k2J9J8j6JjJ1j8J1J4l2RM2l8oL5j8j3K4j5JlRKj4MJ7l6J9
3071CL1n2QK9k7LJ4j4j0J1KJ8l6K8Jl2L5Pm7K3J1j8J8Rj6%J5Mqj9K2J1l4K5J1
3106B6l5J8J2k7J0K0l2QJ2rmoJ2rrK1ll1L0Ml3L0Lj9PJ5j4J1kJ1k2rL3j2n%K2
3143B4k7J2Rk4LJ8lj7J7kj5PJ2j9qK7j9j2K1Nj6JJ2j1oK3j3qLJ0j1J0Nj0oJ2J0
3180A4k0MK2k0jJ2lj4K2j2j6RJ0mj4J5%k1J7Lj4J0J2k2JJ7qj2NJ0j1nJ4Mj5K7
3216A6j1k1J5J6l0JL1j5oJ8%j1nK1j4rJ4rj1J2J4l0PJ8j7qJ8pj2J1J2k7NK5oj7
3252a2J2Kj6K0nj2J0J0pj0J4J2k2LK0k0MJ4rj4J4opOJ2j0lMNk1K0Nl0J0J4j9J0
3289bRj5lJ4klmJ5Nl3K3Rk3J3Qk1QJ7j8JJ0Jm%Omj5K6jl0K5rk4K0J2j7%Okjj3
$$ plain form
3330 -16 4 -1 -15 13 8 -25 9 12 -10 7 1 -13 0 11 15 5 2 10 -2 -9 22 9 -15 15 14 -6 15 3 -6 7 9 -1 -2 -11 17 -12 -2
3367 -2 22 -16 -12 6 0 -15 9 -4 -10 -8 -8 -9 -8 2 1 -4 -2 20 -10 -10 23 -3 0 25 -2 -6 7 3 1 3 10 18 6 -1 23 -13 -4 11 -12 -10 9
3408 9 -7 -4 3 -8 -1 -10 4 -5 -7 4 8 -21 0 11 -16 -4 11 -13 0 13 1 -1 -1 11 9 -13 8 3 -17 12 13 -14 7 4 -13 6 7 -5
3446 -5 -1 -12 -4 -16 -14 14 5 -20 13 -1 -20 7 4 -21 6 5 -5 0 0 0 -9 -4 8 -9 -8 22 -1 -2 15 -1 -11 6 10 1 -2 12 5 -3 -1 6 -16
3487 -16 -1 16 -17 -11 3 -7 -13 4 -2 -8 -4 -8 -6 -11 0 0 -22 1 14 -10 -1 18 3 -7 0 -1 -1 8 8 -3 -8 8 11 -13 4 2 -17 6 15 -6
3527 -6 -1 5 -9 -8 -3 3 -1 -17 6 -5 -20 8 4 -20 3 -5 -15 1 9 1 -1 -7 1 1 -3 20 7 -1 19 5 -7 20 5 -7 0 15 5 -3 7 5
3567 5 0 -1 11 -1 -10 11 -1 -16 4 -3 -14 -5 -2 -8 -2 -3 -3 -18 1 8 -9 -6 12 -8 -4 14 0 -4 9 0 0 3 9 10 4 11 11 -10 7 25 -9 1
3609 1 14 1 1 11 -2 -5 9 -2 1 -11 -1 -5 -11 -1 4 -12 -9 16 -12 -8 5 3 -2 4 6 -3 5 7 10 4 10 11 -4 -2 19 -2 9 12 -3 -9 7 -1
$$ packed form
3330a6K0nj4K8nl3L4Lk2J7oj4J3J1Mj0lQj2pL1j3k4L0jk0K1j2rJ3Kj0jrK8k9J0
3367bK4l8MJ8oj5K4j3oK%jJJ0jnKK2l0%L3k6LK5k7mJ3mkKPQj2pK4l6RJ5k3KJ9
3408Ij6LPj1PrJ4rkJ1Mk9K1J1k7J2J5k4J3J3j2k%J2kk2K1nk0K9Jk7K1lj7J9Jj2
3446eMj1Qj2KK8rk5L3j4j9K7lk5K7jj0N%%rNJ2j7JL0k3jJ7j6j0J7MrlJ4pqKPk2
3487a6J5J7l3OJ4j0oJ7ooMmKnJ1%k2K3J3k4RJ9j5j0Pj%R%j1nJ6Lk4J7kj9K3Rk1
3527fNOj4JNOmj6K3j1j5K8mk4K3qj0J6QqkoQ%mK3j3qK0j4j2K7j5j2PJ5j0qJ0k
3567EnjJ2j2rK1j2j5K0pj1RLoOj%j5J9Pj7LJ8k0MJ8j4mJ3r%LOJoP%k1J7J8l4J0
3609AJ3j3%J0j3lJ4j1Lj2J0moJ0Nj6LK5k8MJ3knOKrQKLoOJj5KK1k1J1Lj5oJ6q
$$ plain form
3651 -1 0 2 7 -3 -10 1 -8 -8 1 2 -8 -6 0 4 -7 -6 -2 -11 4 5 -7 -6 3 -11 -4 12 0 0 8 0 0 9 11 0 -4 9 8 0 5 14 -4 -2 16 4 -12 9
3697 9 -6 -14 -7 1 -7 -15 0 2 -15 -2 -1 -7 -6 1 -1 -10 10 1 -2 -3 7 1 -3 17 4 -2 15 9 0 5 17 -3 0 10 6 1 4 6 -7 3 8 -5 -4 1 -7 -11
3743 -11 -5 4 -9 -10 7 -6 -2 1 1 -12 -1 3 -4 -5 5 -8 -8 7 -2 1 9 3 -5 -4 6 12 4 2 10 -9 4 1 2 0 3 -4 -5 -1 8 -5 -8 7 -9 -16 6
3788 6 3 -11 -1 2 -12 -6 8 -8 -4 8 6 -6 2 15 -7 2 8 5 -4 11 4 3 6 5 2 1 8 8 -3 12 13 -10 -1 9 -5 -12 8 -7 -14 1 -5 -3 -12
3831 -12 3 -12 -9 6 2 -9 3 5 -5 3 3 -5 -3 6 6 4 5 11 9 -2 10 -4 -7 3 7 -1 11 8 -6 4 3 6 0 7 7 -8 -5 3 -10 -10 2 -1 -10 -1
3875 -1 2 -21 -12 -3 -11 6 7 10 -2 1 12 0 -2 12 11 1 6 8 1 -2 10 1 5 10 6 -4 -1 3 -6 0 9 -2 -13 9 -9 -18 3 -7 -10 -5 2 -4 -10 2 1
3920 1 -3 5 5 1 -1 6 4 0 11 9 -1 9 1 0 5 7 7 -2 9 2 3 4 6 -5 4 3 1 -1 -3 1 -16 -8 0 -13 2 0 3 -13 -4 -9 -10 -5 3 6 -2 7 1 1 -6 5 2
3971 2 -5 14 9 -8 6 2 1 1 1 1 -4 -1 9 -5 0 -3 -6 -12 5 -5 -5 1 -5 -23 -3 0 -8 3 6 -5 -8 6 -3 -12 1 5 -1 -1 13 0 3 -1 5 0 2 -5
$$ packed form
3651aJKNj0pJ1r%RJj0KOMj1JMrJ5Jj2JRj4PJ6j2%Qq%RKj1mJ3jqNRj8KJ8j2j6K1
3697Ij5qPQqqJ5Kj7J3JoJPkrK0rljJ0omK0j3oJ7orNJ2k0LJ0mnLKj3J0Nj3JNqm
3743a1ORj3jJ7j3ML%j3J1MpjJ0j3%J5rLQoqJJ0OqkQj9J3lJkLpjMRj3lJ5j6pK2
3788Flj4J0Lj4OJ4j6MJ2kj2QJ3k2ROlrJ5pjLjljP%j1J5Jk3RJ0j4pK0j5pJ5oKr
3831a2J5j5LJ5mj1J2Kj0Q%qKR%kJOkj1J2j4lJ0MqJ2lj4J0jLoP%j5LQj3%J2lrR
3875aLk3RRqJ7JLj2LJ1j2kJ4jj0NKplJ2rMNmj0LMrORj1j1K2j8rK1j0lNPooJ2j
3920AmQ%mkPkmJ1kj0J0qjNK%rJ1pJJKj1RjkkkMj7QQj3J5kLj6RnjNQLqRo%pJ1l
3971BpJ9nj7J4mj%%%nLJ0j4NlloJ7j0%Ooj8K0LqJ1Lj1lJ4rrJ3Mo%J4j3LmOnKp
$$ plain form
4017 -5 6 1 5 12 -7 5 3 -16 -1 5 -6 1 4 -5 -11 -2 -10 -1 -6 -9 -3 -12 2 -11 -10 -6 -7 -10 4 -2 -3 -3 0 7 1 1 7 -1 -2 9 1 -10 3 5 1 7 5 1 1
4066 1 3 4 -2 -6 -8 -5 1 1 -4 -10 0 -3 -9 -8 0 -13 -9 2 -6 -1 -6 0 -4 -6 9 4 -1 19 5 2 8 9 7 8 2 10 -1 1 18 -6 9 12 -4 -10 7 -1 0 -7 -2
4115 -2 -4 -2 2 -13 -5 -3 -7 -3 1 12 -4 -1 5 -2 -5 4 6 -4 6 8 -2 -2 9 5 10 6 -5 -4 2 3 -3 3 4 0 3 -1 12 -2 -1 2 0 -14 -5 2 -7 -7 -1 -6 -1 13
4165 13 -2 2 5 1 6 8 2 1 -7 7 -7 3 6 13 1 6 5 6 13 8 -1 2 3 8 2 4 14 -13 1 2 1 -1 9 2 1 -5 6 1 -5 6 -8 -4 -2 10 -1 -6
4211 -6 14 2 -2 8 5 -5 15 7 1 14 8 12 11 13 16 4 4 20 11 14 7 6 9 11 7 2 5 10 5 -2 7 -2 -7 1 3 -9 0 1 -6 -3 4 -7 -2 6 11 5 6 10 6 -1 6
4262 6 14 0 11 9 0 -4 14 -1 5 14 1 1 -1 7 0 1 1 -3 -10 6 -3 -10 0 1 4 -10 -6 3 -6 -1 3 -1 -3 13 2 -5 5 5 0 14 9 0 15 3 8 11 17
4309 17 14 2 9 10 -4 -2 1 -4 -1 12 -1 -11 -1 4 -5 -7 -2 -7 -7 -8 3 -2 -13 5 -14 -7 -8 -1 -2 -1 3 -8 1 12 6 -8 8 9 8 -2 12 -2 3
4352 3 5 3 -1 -2 8 -5 5 11 -3 -2 5 -5 -4 -4 8 -8 3 -2 0 -5 5 3 -8 1 -2 -2 0 10 0 4 11 1 -4 3 8 1 10 9 -5 1 20 4 2 4 10
$$ packed form
4017eJ1nMPj9J2kj9J5Oj1PLroRqRnlOrJ4j3JMjlJ4oj%LPo%OqjJ1qj1J3KmOkm%
4066AKJomkLO%noJ0loJQj3MJ1qNnOmkJ5nnK0j4lOJkJoQj1KJ7k4J5Lj6oJ7qJpN
4115bkKMj5QKmMMJ1j6LOplRKj0J0Kj0%J1mNmj1JOJoOJmLmJ3j4JLkj4RPr%OnNJ4
4165A3j5MLmNKojqJ4j4J0LPj2NjJPnrLJNoKJ0k7J4JjkJ0pjoJ1noJ1j4MKJ2j1n
4211fK0j2mJ0lj0K0qoJ3oMjKLj2%J6rLpjLKmnLNnpRrnQKj2RJpLPj1NQNoJMmpP
4262FQj4J1krmJ8j5ORj3%kQpJ%mpJ6rpJ0JLj4MRrNMmkJ6j1pJ0%nJ4nrJ5j2NLO
4309A7lj2PJj4KLnLJ3j3j0J0NrkNn%jJ1nj1J8j9PjPjJMj1RJ1oj4J6Jjj0J4j4N
4352CKkmjJ0j3J0Oj4JPj0J%J2j6J1nKnJ0kj1Rl%KJ0j0MPj0nPNpRjj4OJ9j6kKO
$$ plain form
4397 10 6 4 8 0 -7 -4 -2 1 -3 5 -7 -6 6 -5 -2 -1 -3 -1 -5 -8 -5 -8 3 0 -8 0 7 -3 -6 5 2 3 6 7 -2 3 7 9 7 16 -4 3 8 7 6 3 3 -3 5 5 -2 -4 2
4450 2 -1 -1 -10 2 -8 -6 3 -6 -6 -11 -1 -3 -7 -5 -10 5 1 5 -2 -6 3 -5 -1 7 -5 -2 1 8 -9 -9 4 -8 -5 1 2 -4 -1 2 -7 -9 -4 -3 1 -1 -2 -14 1 -9 -7 -2
4500 -2 4 -3 -2 -1 5 -2 -4 10 -6 -2 1 0 -6 1 2 -3 15 5 -1 -1 7 -3 -2 -3 4 4 5 6 -3 0 2 -5 -5 -7 -2 -9 -4 -4 0 -1 -1 3 -2 6 7 -8 7 1 0 -6 5 2 -10
4553 -10 8 6 -2 -3 4 9 5 5 13 1 6 2 -12 3 -1 -5 -5 4 2 -7 -7 2 -3 -10 -2 8 -10 -10 -2 -3 -5 1 -2 -6 1 5 -2 -4 4 4 -1 8 5 -5 10 11 1 3 4 4 11
4604 11 8 10 -3 9 7 -4 2 4 11 0 3 -6 -11 3 1 -3 -5 4 2 -1 0 7 -8 -1 10 -2 7 13 18 4 8 7 2 7 12 12 1 7 7 4 6 15 6 6 4 0 6 6 8 -11
4654 -11 3 -4 -8 -2 7 4 -19 3 8 4 -2 3 2 -1 5 9 0 12 -3 1 7 14 10 7 7 6 7 15 10 7 1 6 -2 0 2 5 2 -4 6 -2 -1 4 2 -7 3 0 1 -5 -3 -4 6 6
4706 6 6 -4 -4 -2 0 8 9 1 6 6 -4 -4 2 2 4 3 7 2 2 6 -3 4 8 8 13 -7 12 7 -4 3 -4 -7 -1 -2 1 -8 3 1 -15 -3 3 -12 1 2 -9 0 -4 -1 -7 -8
4756 -8 -3 7 3 5 -6 -5 12 9 4 4 6 3 0 6 1 -2 -6 3 3 8 2 2 -4 2 6 -5 1 -6 -9 -12 5 -9 -12 4 -4 1 -6 1 -2 -1 2 -7 3 8 3 5 3 9 -6 4 5
$$ packed form
4397A0mkMqpLKLmQj2JJ2j1LJkKmlLlJ1lqQPj0lJ1lJLJrNMKkRk0PNjjl%oQ%pkO
4450Bl%rJ2j0KRr%nJ0kmKnJ5mMpmRqMQj2LLPj7%J3j2LOJoLLrkNJMkjj2J5j0KN
4500bOpJJOpkJ4j6MLjoPJnJ8j0o%Qj0JjP%JJrLKp%kNpN%Mj%MnQJj5J5ojoJ1lj2
4553a0J8kqjPNm%Qj2Nmj4J5mm%Rkr%RnpQJ0j8%QjkOlmPMpkQ%nRlj0J5Jj0KJ%P
4604A1lKj3J2kj1OKPj1LrnJ4kmkRklJPj5PJ1j2RONj4MjnNN%j1O%lKRr%kmO%Kj9
4654a1J4pmORlk3K2NmoNjlOMrJ2j5MOPml%jJQnloNqKKLloJ0qJNkrJ0lJoKjJ0%
4706F%j0%KKQJqN%j0%O%KjMn%MrPM%Nk0J9nj1PplOjLrJ1kj6J2Oj5J3Jj1RmLoj
4756hNJ0mKj1JJ7ln%KllOnlmR%No%oOMj1OpllJ7j4lJ6qNpPlJLrJ0NnKkOj5J0J
$$ plain form
4807 5 7 -3 10 15 6 8 2 -4 6 17 -1 -2 -9 -4 -5 1 -6 -6 -5 3 -7 -14 -4 4 -1 -10 2 -4 2 2 0 -3 -4 6 6 3 5 -3 0 10 13 14 11 9 4 7 10 6 3 4 4
4858 4 -4 6 9 1 -2 5 -7 -11 -5 -1 -9 -9 -5 -1 -10 0 -8 -5 1 1 -5 -6 7 -7 -4 2 5 5 11 5 2 7 5 -1 3 7 5 1 -2 9 -1 3 3 -4 -14 -1 -6 -8 1 -4 -11 -9
4910 -9 -6 2 -1 -6 -7 1 -4 -7 -11 -4 4 1 2 8 6 2 -6 9 3 1 0 8 5 6 8 5 10 11 4 4 0 5 -6 0 10 10 6 0 2 5 8 -7 3 -10 -1 -1 -4 -3 -1 -10 5 -2 -8 -8
4964 -8 7 3 0 5 5 5 1 14 7 2 2 2 -1 6 19 -4 5 11 3 4 -8 4 -4 -6 1 -7 0 10 -4 -2 8 -9 1 -1 5 -9 0 -2 2 -4 -3 -2 -8 -3 8 6 -2 9
5012 9 3 4 3 4 5 7 0 4 -6 8 -7 -6 -3 6 -9 -7 1 1 -7 -3 -4 -4 -2 -9 -7 -2 -1 0 -5 -3 -9 -8 -6 -6 -9 -9 7 1 2 5 3 6 4 4 -6 0 6 1 -5 2 6 -2 1 -3 -1
5067 -1 -9 -3 -15 -9 -11 -8 -11 -2 -4 -7 -17 -4 -7 -17 -5 -8 -5 -4 6 -4 -1 7 -3 1 3 2 -4 -1 0 -5 1 -5 -4 1 -3 9 -3 3 0 -1 -4 -1 -2 -2 -6 2 -3 -10 -7 -15 -14
5118 -14 -5 1 -13 -13 -4 -10 -8 -13 -8 -10 -4 1 -1 -4 6 -4 -4 0 5 -8 3 6 2 -1 2 5 -2 3 4 -6 -8 0 -6 -9 1 -6 -23 -6 -8 -7 -10 -8 -9 -10 0 -1 -8 1 0 -6
5168 -6 -12 0 -2 -5 3 -2 7 11 6 7 4 4 2 4 2 11 2 -4 0 1 4 3 -3 -5 -6 -3 -14 -5 -6 -11 -15 -4 -14 -4 -4 -14 -12 -9 -6 -4 -5 -4 -9 -6 -3 4 -1 -3 3 -2 -4 4 2 5 1
$$ packed form
4807EKj0J3NrKooJ0J1j8jpNjOp%JQj0pJ0QnrJ2oO%kljJ0%lKqLJ0LJlknLLmlJ%
4858DqJ0LqlPj2mOMq%MMrJ0qLO%ojJ3j4LOL%OolNkoMMkmlJ1j0M%pj0J3nkRnpK
4910iLQlnjQnlmPQlJOkmqJ5okjQlJKlNJp%mNj1OJ0%moKLLj5J0j3R%lJKrJ5po%
4964hJ5mlN%%mJ3pn%%lPJ3k3ROqJj2J2qkPqPJ0j4KJ0j7J0kOj4RkMoJJoNJ1kqJ1
5012IoJjJJKpMj0J4j5JLRj5KQ%qMj%KpKNJJnKoJK%l%J6oJLkLk%j0OOnoPMqLmK
5067aqOj2OkLlRklj0J3lj0J2lLJJ0j0LQj0MKjoLJnOoJNmJ2j2OljlLj%mQnpLqJ
5118a4ROj4%RoKnNkONklJ0j0%MNj3J1LmlLLpNJj0kQolJ0pj7J7kJlKjjJ0jpRjo
5168foJ2klQnRMnJl%kKkRroMJLjokjLj1RjnmJ1j0J0%j0KLLKjJnLLPnkOnkQkLm
$$ plain form
5223 1 7 0 1 -1 3 -1 -3 2 -9 -5 0 -11 -17 -11 -7 -3 -6 -3 -3 -14 -9 -3 -6 -2 -15 -6 -5 0 -4 -11 0 5 -4 7 -3 -2 1 -8 -1 6 1 -1 0 -2 11 2 4 8 -2 3 3 2
5275 2 -9 -1 -1 -4 -2 -1 0 -5 1 -1 -5 2 -4 -7 2 -5 1 -11 -4 2 -5 1 -4 0 -6 9 3 -1 3 4 10 0 11 -2 4 7 6 -3 -6 0 -2 -3 2 -1 0 3 2 -5 -11 0 2 5 0 -6
5329 -6 -9 -2 -6 -5 4 -4 -3 0 3 0 -5 -1 4 -2 -3 4 6 1 5 10 2 2 7 0 0 9 0 8 5 2 3 -1 0 -6 1 3 -7 -3 5 -3 -5 -9 4 1 -3 1 -1 -7 1 3 0 -2 0 1 -4 2 8 3 4
5388 4 2 0 5 9 -3 -3 8 5 0 5 6 4 -4 -2 2 -6 4 6 -10 -1 -2 -9 -4 -2 0 2 -2 -2 -7 -2 -2 1 3 6 -3 3 -4 6 1 1 10 11 2 1 10 1 3 6 -5 2 3 2 6 9 0
5443 0 0 1 -2 -6 -3 -8 -4 -4 -3 -4 -10 -7 3 -2 -7 -1 -3 -5 -4 2 -3 -3 11 5 2 18 9 8 10 7 0 11 5 -2 5 12 4 -4 -1 5 -7 9 1 -2 -5 -2 7 0 -5 -5 -5 -11 -8 3
5497 3 -14 -20 -3 -11 -11 -2 -4 0 7 12 -6 2 -3 1 -1 6 1 3 -6 6 4 8 6 -2 -4 14 11 -2 1 -3 4 3 -6 -8 -8 1 -2 -5 -4 -1 -6 -4 -5 -5 6 -1 5 8 5 4 -5 8 6
5550 6 -5 1 0 0 -5 -2 6 14 -3 -2 3 -1 -1 7 -8 -5 -3 -9 -6 -7 -6 -11 -11 -2 -12 -12 -6 -3 -3 -12 -11 -9 -8 5 -1 0 -1 1 7 5 4 -1 5 -1 1 -3 13 -2 4 3 0 5 -2 3
5604 3 3 -8 4 3 4 0 0 1 3 10 -3 11 -3 -8 0 6 3 -4 -3 -1 -4 -4 0 8 4 6 2 6 1 1 1 -4 -9 1 5 5 8 9 0 3 -3 -4 2 3 -5 -2 0 -1 -2 -2 -1 -7 -13 -6 -8
$$ packed form
5223AOpJkMmkNj1MNj1oOMMlL%j1NOlMj3RJNmpJ1NrJ1j0JLrPPnkJkJ3rKMj0N%j
5275Bj1Q%lKJJnOkmPolRpOj2POpOnMoJ5omMJOj0J1j3OLjrlOkjNlJLjpoJ1KLno
5329flPmJRqJLLlnMNojPKnMNq%Np%RrQllJmJoPKj0MQqkmJ3lmMkoQKlkKJnOOnJ
5388DkkNMj2%J1lnNJkqKMqJ0Kj6RjpNKKKm%nN%LKLrOpJ0n%RJrjRrKLj1PJjMLr
5443@%JlmLnM%JjoLJ0nnOkkJOn%J4olJ6rjKlpJ1opPPqqLOj2J6qllLRpn%%oLJ1
5497Cj7oJ7q%RkMPNj8QnMkPnKrJ2kMkqkJ8lj3LmPjrk%RllJLnKj%J1pOLljrJ3k
5550Fj1Oj%nLQQj7JNm%Qj5LKoLjJn%Rj0%OL%rJKJJ3oJjKOkjnOoKmJ6j5OjlNpN
5604C%j1J2jJm%JKPj3J4j4nQOlpJKl%MQmKmMn%%nnJ0M%LJrLojOJqLKjj%JooPk
$$ plain form
5659 -8 -9 0 -6 -14 -2 0 -6 4 8 -3 3 9 0 3 -1 7 -4 6 8 -1 3 7 8 4 7 8 6 1 3 7 1 4 -4 3 -6 3 -7 -5 -1 -4 -5 3 -2 -8 -2 -9 -14 -10 -1 0 -9 0 -7 -9 -2
5714 -2 0 1 3 12 1 6 8 4 -6 1 10 4 0 9 3 0 4 -2 -5 -5 -4 -5 -9 -6 -2 -10 -12 -10 -6 -2 -5 -9 -8 -10 1 -5 2 -3 -6 -2 5 1 2 5 5 -7 3 12 4 3 2 -5 6 -1 -2
5769 -2 -5 -7 0 3 5 3 -2 -2 -7 -3 -1 0 0 -3 -7 -3 -4 -10 0 -3 -6 -7 5 -3 3 4 10 -1 4 3 6 1 1 6 6 4 11 3 5 9 2 2 10 5 2 -3 7 6 1 15 -3 -4 6 -8
5823 -8 -15 -7 -4 -10 -9 -8 2 -2 1 -3 4 0 -4 7 3 6 2 4 -1 -2 5 -1 2 5 2 0 0 11 6 11 7 3 12 -1 9 7 2 1 3 -1 -2 -4 2 -7 -10 -7 1 -15 -5 7 1 -5 -5
5876 -5 7 -8 8 1 -2 -11 7 9 -1 12 11 4 12 15 18 -1 9 7 5 8 5 1 6 9 0 -3 -2 -5 -15 -8 -8 1 3 1 -9 -2 1 -10 -15 0 6 -2 -3 2 -4 -10 4 8
5924 8 -2 2 -6 1 1 8 7 3 7 -5 7 0 6 1 1 10 2 1 7 -2 -1 -14 3 -4 -11 1 -5 -2 -5 -10 -10 -13 4 -2 -4 5 -4 1 1 0 2 -1 6 8 7 11 5 -2 11 9 10 -1
5976 -1 3 6 1 0 -1 -6 1 0 1 -8 0 -2 -8 -7 -4 -8 -7 1 2 6 -4 0 -15 -9 -5 -4 5 11 2 1 11 -5 1 0 8 5 6 -2 -1 5 8 8 4 2 0 0 -8 -3 -1 5 0 -6 -1 0 -2 0 -9
6033 -9 2 -7 -3 -2 2 0 -7 0 -4 -4 9 3 -4 0 7 3 0 4 4 -10 -2 9 10 14 -2 2 2 3 -1 -4 -7 -2 -7 -17 5 3 -8 0 -7 -1 -4 3 2 2 1 -2 -4 -1 2 1 0 0 3
$$ packed form
5659hjRoqJ2KoJ0Mj1OOrLmQj1J0KrMMJmLJknKMoLqPrRj0KMljQnoOpnMRJrRpkP
5714bKJKRj1NKmj0PRomRolMol%JjmLMqkKMMlmJkJ1oPnlMPmJL%j2J0RqjjpJ1pj
5769blkPLKkn%nMKJ%lmMjoJ0lljJ2qOJOj1NjLn%N%kPqKMp%QnlnJ0jnJ4j8jJ0j4
5823hpQLoJJJ0mLmPmmJ1mLmKnjPoLLlk%J1nNmmRj3J0knjKmjkOrlLQj6J0J2oo%
5876eJ2j5J6plrJ8Kj0J3jpQLLj9J0kkLlmNLrlJlj0P%RKkj0PLj1nJ5OqjNooJ4M
5924Hj0MqP%PjmMj2J2pOn%RqjOrJj3J7ppJ2oLln%lJ7okRrN%jKlPKjMopJ3kJj1
5976aMLnjjnPjJrQkoJLmJQJMj0Mj5OMJROrjJ0j6OjQlJqJOL%mkk%qNKOnoNJkKr
6033iJ1rMJMkpPm%J3opMPmlM%j4QJ1JMj6M%JmllNnj0K2kj1QpOlPj%jlkLLjj%L
$$ plain form
6086 3 -2 3 3 -4 4 5 2 7 3 7 9 2 3 4 -7 -5 -1 -7 0 -1 1 -10 -6 -7 -14 -6 -4 -4 -9 -6 -13 -4 -4 -9 -5 -7 0 -4 2 -3 -3 1 7 3 -3 6 1 -2 10 14 10 14 11 6 1 8 2 10
6144 10 6 2 -1 -7 0 3 -2 -1 8 -9 0 0 -13 -9 -8 -3 -11 1 0 5 -9 0 1 -4 11 11 2 6 8 5 2 5 5 5 5 3 4 3 5 6 1 9 4 1 4 4 -4 -7 -4 -2 2 3 -2 -11 -4
6199 -4 -2 2 -3 -5 -3 -7 6 2 4 -2 4 2 -5 1 4 -3 5 -4 6 0 7 4 0 2 4 -4 4 -3 -7 -2 4 9 1 3 -3 4 -6 0 1 12 -3 -6 3 1 -6 0 -3 -2 -7 -2 3 -7 -5 0 3
6254 3 -7 2 9 7 10 2 6 -1 3 -2 2 3 6 8 2 -4 7 -4 -2 -3 -6 2 0 6 -9 2 -6 -9 -10 -6 -14 -9 -2 1 -11 1 -10 -2 -2 -1 8 -4 -4 2 17 7 7 -8 0
6303 0 8 1 -2 8 6 1 11 6 -3 0 3 -1 -5 -4 -2 -5 -5 -1 -17 -2 -4 -8 -5 -5 -1 -2 -2 -6 -1 -8 3 -2 -11 4 -2 3 4 6 6 7 6 4 4 7 8 8 5 8 2 4 11 1 -1 -5
6357 -5 0 -2 0 1 -4 -3 -7 -9 -3 -7 -8 -2 -1 -4 -10 -4 -2 0 -7 9 9 3 1 1 6 1 1 1 2 15 1 -2 2 0 13 5 6 1 2 5 3 -1 5 1 1 3 -2 -4 -7 -10 -4 -2 -11 -1 -3 1
6413 1 1 1 2 2 -6 -6 -2 4 6 7 -3 2 -3 1 7 11 -4 0 8 4 8 5 -1 4 -2 -1 -10 3 3 0 -6 1 -4 -2 1 -11 -8 -4 0 -1 -7 4 2 -2 4 2 0 -4 12 -2 1 1 -5 3
6467 3 -3 3 3 -3 9 6 -1 3 1 8 4 -1 -5 -5 2 -5 2 5 -9 -7 -3 -7 -4 -5 0 -3 -8 5 -6 -1 -2 -5 -10 -6 -2 -2 -3 2 -5 7 6 -1 1 -2 -3 2 15 6 11 -2 9 1 -11
$$ packed form
6086CnN%pQJlNmMKpJJj1KMoPjKj1MjpQK%nLpR%nMkPmOn%MOmoRnlJ2MmMlnnPoQ
6144A0mmloPLnJRj7R%j3MJNqJ2jNj4RJnJ5%rMKllL%%%kJjKJnQnlL%qlLKMJnrP
6199dKMnkKmJ3mKoOkpOLpQrJ0oPlmKKqQpmNONqKoPj0OJJ1j5lRkpOlJnNNj0KNL
6254Cj0RPkLqMpMnMJLKooJ1j1KjlQkOj5J1qljMqNPLj2J2j1Q%JRj2%OJ5j0%j5Q
6303@QplJ0knJ0nrLLmmJKl%Mj6J5kmL%Mj%mNpJ1nrJ5oNJK%Jjk%LJ%lLoKPj0km
6357eNkKJnJmkOmjOJloOKKpJ6%ok%Nn%%JJ3j4lMkJ3qJnJLkmOm%KnkllOKrJ0kM
6413A%%J%q%MOKJj0NnMOMj5MQmMloNoJrJ3%loPnKLj2LMMjoJ1kmOkkmJ6j4L%oQ
6467CoO%oJ2lpMkPmnm%PpPLj4KMmLjNlnJ3j1NjlnMM%jNpJ2jpKljNJ3rNj3J1qj2
$$ plain form
6520 -11 2 1 -9 -2 4 -1 0 -6 -11 0 -2 -5 -8 -10 -4 -9 -2 2 -15 -3 2 0 -4 -8 -2 8 4 3 6 4 9 4 8 1 -6 11 3 7 9 -1 -7 -3 2 2 5 -3 -3 6 6 -8 -3
6571 -3 0 1 3 2 1 -3 -2 -11 7 -3 -4 -13 3 -7 0 1 4 1 7 3 6 8 8 2 12 4 6 4 -1 4 0 0 -2 5 -4 -2 1 6 4 1 -3 0 -5 -2 -5 -3 -9 -1 2 -1 -8 3 2 -3 1
6626 1 4 2 -1 2 -3 -6 9 -1 9 6 10 9 13 1 7 1 10 10 10 3 -1 -9 7 8 -1 -1 -3 -4 0 -5 -1 -3 -2 -6 4 -11 -5 -4 -10 -4 1 -5 -2 1 5 2 5 10 7 9 9 4 1 14
6680 14 2 2 8 3 1 0 2 -1 -5 0 -1 -7 -4 -3 -1 -7 5 0 -4 -7 5 3 7 -6 -8 -4 -1 4 0 -5 -2 -8 2 -1 -2 -1 -6 1 -3 7 2 3 0 3 1 14 -4 3 -4 -2 -1 -7
6732 -7 3 0 -2 -2 -7 -3 -1 2 -5 -6 -8 -6 3 -5 -5 -2 -4 -10 0 8 12 2 -1 4 -2 5 8 2 7 16 2 0 11 -1 7 5 -4 1 1 -4 8 -6 -4 -17 -10 -3 1 4 -7 -10 -10
6783 -10 -4 -7 -1 0 -3 6 -1 -2 -7 -1 2 -1 -1 -1 2 1 4 3 2 2 -2 4 -1 5 -2 -7 -1 -4 4 7 1 -2 2 -3 -3 -5 -3 -15 -5 -4 0 1 -5 -10 -5 4 -9 -12 -1 1 -12 5 5 -8
6837 -8 0 0 1 -5 3 1 -5 5 2 2 2 12 -3 -3 5 3 0 -3 9 4 2 4 -1 -5 -2 12 -6 -1 -7 -2 -11 -3 -4 -11 -9 -7 1 5 0 1 -7 -3 4 -2 2 7 -4 0 13 5 11 1
6889 1 6 5 8 1 0 13 -3 2 7 -1 -8 -10 -1 -4 -11 -8 -9 -7 -14 -5 -2 -14 -6 -7 -6 -6 -7 -3 -6 4 0 5 -1 5 6 -2 4 4 3 -1 11 -3 -2 7 3 -4 4 6 4 -3 -2 -10 -9 -7 -1
$$ packed form
6520a1J3jj0POnJonJ1kllkOnPMj7J2NkmmOJ0mjLkNnMppJ7qMKj0oMN%Lq%R%j4N
6571cLJKjjmJrJ8j0jrJ6j0PJLlOmLK%oJ0qKknNm%kPrKLNklmLnLlKoQLlpJ1jnM
6626ALklLnlJ5j0J0lMjMj2OoR%%pmqJ6Jr%kjMnMkJmJ0j5OJoONoLLMlLNlK%nlJ3
6680A4j2%OnkjKlmNjoLJKoJ2nmlJ2kMj3kMLNmnLoJ0ljJnPmJ0nJlLkJ3j8PpKJo
6732gJ0lk%nMKLpjkKRq%LkoJ0QMj0lNoPLoNRj4kJ1j2QkrN%nJ2j4Kj3PPMLj1l%
6783a0OlOJlRpjnOLl%%LjLjj%mOnOpnOlQLolMn%kKj2J0JMJonNRj3lJ1Kj3J7%j3
6837hQ%JoQkoJ0l%%J0j5%QkllJ2nkKnmLJ4j8NoNrQjpKKQMnJqMPoMNj1MJ3qOj0
6889ANjLpjJ3j6NNqpkRlpLjKpRLj2QjJ%jMlJ0mNoOJqO%jmJ2j4JRmpQKkpJqJKO
$$ plain form
6944 -1 -1 -2 3 0 3 -9 -7 -3 -14 -3 -6 -3 5 -3 -2 -1 0 -7 4 9 10 9 6 11 9 13 2 -1 8 3 4 8 9 4 1 5 7 -7 -1 -6 0 -4 -7 -2 -2 -5 -2 -6 7 -8 -3 -2 6
6997 6 -6 1 -5 -5 7 3 -3 -2 -2 -1 3 6 9 5 -3 7 14 11 2 0 3 -2 2 -1 6 -4 -5 0 9 -3 -6 0 0 -3 1 0 -4 5 2 -9 -5 3 8 -6 3 1 4 9 3 6 9 7 7 10
7051 10 4 1 10 10 5 10 6 -4 3 6 4 1 2 3 2 0 -8 5 -9 1 0 -7 -3 -2 -4 -1 -1 -10 -7 -5 1 -6 -5 0 -8 -10 5 3 -1 7 3 -2 3 5 8 -4 -3 1 9 9 11 -3 -4
7104 -4 -3 -6 3 9 -5 -3 -1 -9 -1 -5 2 -9 -6 -14 -9 -4 2 2 5 -1 1 3 6 10 7 3 1 4 -11 0 3 -6 2 0 -3 2 4 -3 -3 1 -10 -6 -1 7 4 -7 -14 -3 0 -3 -8 2 0
7157 0 -10 -9 -11 -5 -4 -2 -1 6 6 -6 -1 4 4 -2 -2 3 0 6 3 5 12 10 8 15 11 -2 -3 11 5 8 7 -5 9 0 -2 2 7 -5 6 -5 4 4 -3 0 -4 -4 -6 8 5 -3 7
7208 7 0 5 4 -1 8 -6 3 6 0 2 8 4 7 6 0 -2 1 10 5 0 0 -3 -2 -2 10 -1 10 2 2 -1 5 0 -3 -12 -6 -2 0 -13 -1 -1 4 2 8 2 8 12 9 12 4 10 17 2 12
7261 12 4 12 12 4 9 -9 -3 1 -2 6 6 7 2 -5 2 9 4 -6 -3 -6 -7 -6 -13 -3 4 -5 0 0 -13 2 9 1 -8 -4 -1 9 1 3 -4 0 -4 4 -5 4 8 3 4 2 2 -4 1 1 -13
7314 -13 -12 -1 -5 5 -1 -8 -2 -6 -5 -3 -7 -1 -8 -11 -1 -10 4 2 0 -10 -5 2 0 4 -8 6 3 3 5 5 7 7 5 10 1 6 -2 -2 3 -1 5 -5 2 1 2 4 -7 -6 8 6
$$ packed form
6944a%jNlLj2KMj1J1lLQqJJJpJ1NJjlNkMj1lRnJMJnlMKj4OnOmlN%lLmJ3j5NJQ
6997Fj2Po%J2moJ%JMLLmqJ0PlrkLnMlPj0jNRj2lO%lMjmRlj1MQNj4RkLNoLLk%L
7051A0olR%nNmj0PLklJJjkqJ3j4J0jpMJkL%rLKOpJNqkJ5kmQmnNKLj2JMQ%Kj4j
7104dJlROj4KKqQmPj1LqNNO%LoKKLMlmkLj5J1LrQklNKp%Mj1MNQlj1pJ1LlnJ0k
7157@j0JkOJKJP%j2NN%o%NlOlKPkkPmj3jJ4oLjj2J4rkMNj2J1j1R%pLm%kJ4lqJ0
7208GpNjnRj4RLoKOmLjokLRnn%lJ%J2j1J1q%lOnlrOMKj3J2%NkOoOMlLqOPj5J0
7261A2qQ%qNj8OMlQ%JnpPPnj0LljJpJ0PrN%j3J5PqrMLJ0qKpMmQrRMnJk%oN%j4
7314a3JJ1mJ0opOmJKmOplJ0rJ4kkj0NPkMj2J4l%K%K%kNrNq%NmOj0PjJKj1JJ4k
$$ plain form
7364 6 1 -6 -10 3 -4 4 0 -1 -7 4 -11 -2 3 0 4 0 2 10 10 11 5 5 9 1 12 0 -2 4 4 9 -3 1 0 -4 0 -3 0 1 -7 -4 -3 -4 4 -7 -8 2 -4 2 1 -8 -6 -10 1
7417 1 6 -1 6 6 0 3 9 4 3 11 0 -1 7 -4 -7 11 10 -4 11 -2 -2 -11 -6 -3 -8 -5 -2 -8 -8 -6 -14 -2 5 -3 -2 -2 6 -3 -6 -2 1 -2 2 0 2 -3 1 2 -7 8 -9 -2
7469 -2 4 6 6 -6 5 0 1 4 10 0 -3 12 1 -6 -4 3 -3 -5 1 -10 -5 -8 1 -2 1 3 -7 -8 5 2 -6 3 -5 -2 -1 7 -3 3 7 1 7 7 -4 7 1 5 7 6 8 -4
7519 -4 3 -4 -1 -6 -4 -11 -15 -1 -8 -5 -4 -1 -7 -1 -6 -2 -6 -4 4 -7 -7 -11 5 7 -4 -4 -5 11 10 1 5 1 6 5 2 4 6 2 7 -2 -8 -4 -1 -3 -6 -1 -8 -7 -4 -5 -7 -6 -4 1 -10
7574 -10 -14 -2 -11 1 -1 0 3 -10 -2 -3 -5 5 -5 5 0 6 4 1 5 8 -5 0 5 0 2 0 -1 4 -3 -2 4 -2 -9 -2 -1 0 -4 3 -12 -4 -1 -1 -3 -13 8 3 7 -11 -8
7623 -8 -4 6 0 4 -4 5 2 -4 5 6 -1 5 9 4 6 5 9 7 2 -2 -2 8 2 -4 -9 7 -3 0 5 -3 -8 0 -5 -7 -8 3 -6 -2 0 0 -3 1 1 -4 1 5 -4 3 9 7 12 6 6 0 15
7678 15 7 5 5 11 9 8 -4 -1 3 -3 6 -2 -1 3 -5 -6 -10 -3 1 -19 -13 -13 -2 2 -4 -6 -3 -1 -5 -6 3 3 7 -1 7 3 -5 16 14 7 11 5 0 10 7 6 -6 -1 8 4 -2 -5 -2 -4
7732 -4 -2 -3 -4 -5 -11 -5 -13 3 -6 -1 -7 -13 -3 -4 1 3 2 9 7 3 -2 -1 2 13 5 13 10 -2 7 5 13 5 5 9 3 0 -2 3 -4 5 0 6 -8 1 1 -3 1 2 7 -3 0 3 0 -3 -13
$$ packed form
7364FnpmJ3pQmjoJ1j5RNlMmKQ%Jo%MqJ1j2kO%Nj2MjmMlLJqLJjQj1jJ0oOjrKmJ1
7417ANpP%oLOnjQj1jQj1lJ8jj4J5j3%rNLnLLo%KqJ2PqJ%QrlMLlMkKnMJrJ5j7P
7469bOK%j2J1nJLOj0lJ5j1pKPokOj1NlRlLKj0jJ3lqRqLJQj0OMoO%j1J1oMKjKj2
7519dPpLnKpmJ4pLJLoOnMmKQj1%mJ6Kj1%jJ6jrMmNjlKKmNroMLklNpJLjkJKNj1
7574a0mJ2rJ2kJLj3QjkJ0j0J0nOklMLj3NNnKkjNpJOopPJJmPj5QL%kj0K1nMj8L
7623hMJ0oMqRloRJpOMnKjMknm%J0oonJ6j0LNqnQnkjJ1rMK%lM%nNMrPOkNo%oJ5
7678A5qk%Okjj2LMoRqJMqjmPMk0O%J1MokLKmjR%MqQmqK1kpMonJ0ljj2NRmolLk
7732dKjjjoOqJ6rNooJ0jNKjPkmnJLJ1qQlj2RkQq%MolkNpRnOj4R%mMJNj0LLllj0
$$ plain form
7787 -13 -1 -3 4 -1 -1 2 -7 5 2 -2 3 3 6 3 8 4 0 -2 4 1 11 9 2 -6 1 -5 0 -4 0 -6 6 0 -9 -10 -12 -6 -9 -9 -6 -1 -8 2 4 0 5 3 1 -4 -1 11 10 -1 -1
7840 -1 -2 5 13 9 6 5 3 5 5 10 11 4 2 -2 -7 -4 1 -3 -8 -7 -2 -8 -15 -10 -12 6 -6 -6 3 0 2 -5 -8 0 -1 2 -2 0 2 11 -3 2 -3 4 4 0 8 4 10 -8 -1 5 8 1 9 0 -2
7897 -2 -4 1 -5 0 -2 0 -1 -5 -5 -1 -7 0 -6 -1 1 -8 -9 -6 -1 -5 0 5 5 -2 4 -4 -2 4 -2 7 1 6 11 0 -1 8 5 5 2 7 5 -3 -2 -3 2 -4 3 -8 -5 0 0 -4 -4 2 -2 0 -5 1 -1
7956 -1 5 8 1 3 9 1 -5 2 4 3 5 -1 11 8 1 16 2 -1 -1 7 6 4 2 -2 -4 10 1 -4 -8 -1 -6 -4 -6 -11 -3 -8 -3 -1 9 2 7 -3 -5 -6 4 0 -2 9 -1 8 4 10
8008 10 9 3 12 2 8 16 2 10 2 0 1 -2 5 2 -7 0 2 4 -11 -2 -1 -10 -9 -2 -1 5 -4 -7 5 2 5 13 5 7 6 5 1 -1 3 -3 9 8 11 6 12 3 15 3 4 5 7 5 -2
8061 -2 0 -8 -4 -4 0 -4 0 -3 2 5 3 0 -2 -10 3 -6 7 4 0 -4 2 0 6 1 12 10 1 8 8 2 6 5 1 1 -2 3 -3 6 1 5 -3 8 13 -3 5 -1 -4 -3 -3 2 -4 -5 -5 -2 -8 -9
8117 -9 -1 1 3 6 -14 4 -4 -3 6 -3 4 1 8 -3 13 7 -3 9 13 5 7 12 7 8 5 7 10 6 0 -8 -4 1 -3 -8 -3 -5 1 -2 -9 -10 -8 2 3 3 -8 0 7 0 -3 -3 -2 2 0
8170 0 11 5 5 6 0 2 5 -7 9 11 3 -5 -2 -1 4 7 3 -2 -2 5 -9
$$ packed form
7787a3J2kPn%LrJ2lmN%LlNmmkOlJ0kpqPoNmMoJ2orjkOl%LNpJ0KmNkknLJ2jj1%
7840ajPQmljkK%NJpkmnLNmnJNopNkJ8j2%RlKplQjLmKKRj4NnP%mQmOj8POLpQrk
7897bkNoNkKjm%MoPoNKrjLNmNN%pOqKOoRoNNj1jRl%lNkqJjNoPj1LN%m%OmKnOk
7956aOLpKOqoPKjKoJ2lpJ5j4l%QjkkmkJ4rnmPnKknQnNKJ0pNj0kjJ0mkJ1j0RmO
8008A0joRj0OQj4QqkJlPlrPKKj5RJrJPJOrlJ2lLQqKjjmkMoJ2jLnOrJ2j2JJKkp
8061bKqM%MmMlNLklkqJ3rJ3lmmOkOnJ1krP%oMjm%lNoRnMqJ1Nj6QolJ%Noj%Loj
8117iQKKLk0J8qJRrPlPj1J6oj0J2MqKNnJlKLmoqMNmnNkOlpjKJ0J%j1QPpl%JMk
8170@J1o%JoKLj2J6KqqLJNLmn%Pj4
8191i
$$ Imaginary data points
##PAGE= N=2
##DATA TABLE= (X++(I..I)), XYDATA
$$ plain form
0 0 0 0 0 0 0 0 0 0 0 0 0 0 0 0 0 0 0 0 0 0 0 0 0 0 0 0 0 0 4 -4 8 -8 8 -8 11 -12 13 -18 20 -20 24 -28 30 -34 38 -44 48
47 48 -53 59 -66 72 -80 87 -94 102 -111 120 -131 140 -147 152 -154 147 -125 71 47 -328 1060
68 1060 -3617 26020 164446 21696 -2057 -6162 -81641 55624 -25212 -116588 95574 87988
80 87988 2367 16202 -119137 -40756 82231 -49259 21768 93448 -28168 7236 -46095
91 -46095 -99604 70014 33070 -23015 82457 -7645 -46772 -11467 -87888 34635 105740 -35458
103 -35458 9037 21398 -51155 5711 -55388 -39884 131075 43911 -50197 -17162 -58385 20136
115 20136 39193 -72073 39134 91436 -19922 -23084 -74237 -44483 100101 14833 -32578
126 -32578 47134 -13761 -13779 -14381 -80202 44927 83336 -22148 12435 -17449 -50834 24521 -29870
$$ packed form
0@%%%%%%%%%%%%%%%%%%%%%%%%%%%%MqJ2j6J6j6J9k3K5l1L8m0M4n2N8o4P2q2R2
47D8j01J12j25J38j52J67j81J96k13K31k51K71k87K99l06L01k72J96k4l75J388
68A060m677K9637J38426j42750k3753m105p5479J37265q0836r1376K12162p586
80H7988q5621J3835j35339P8381J22987j31490P1027P1680j21616L5404n3331
91d6095n3509J69618l6944n6085J05472r0102l9127L5305p6421J22523P1105j41198
103c5458M4495J2361p2553N6866o1099J5504J70959q7164r4108L3035m1223P8521
115B0136J9057j11266J11207N2302j11358l162n1153K9754J44584q5268m7411
126c2578P9712o0895j8o02o5821J25129L8409j05484L4583k9884l3385P5355n4391
$$ plain form
139 -29870 -9430 89574 -2080 -25549 4650 -55221 6264 21091 -30318 65240 40369 -56079
151 -56079 -14621 -33462 -6822 64718 -21482 -7280 60303 -26014 -34375 -22892 -35083 71266
163 71266 47113 -47153 8468 -4687 -26640 12125 -38044 11932 84888 -14436 -33052 -8694
175 -8694 -36777 26967 16850 -27883 49412 20312 -41137 -7885 -33327 1174 55402 -13947
187 -13947 3114 30320 -39684 -17182 -4337 -16811 52017 18587 -30648 17792 -15024 -29403
199 -29403 9483 -14093 29700 49772 -34815 -20540 2247 -22261 18395 3282 -9442 48676
211 48676 497 -44112 -7298 -14452 16838 35487 -20981 7125 21144 -33746 -13452 -5524
223 -5524 -2103 47672 5319 -27994 10675 -14805 -16513 10612 -7487 26808 29459 -31459 -12382
$$ packed form
139b9870K0440R9004r1654k3469L0199n9871O1485J4827n1409R5558k4871r6448
151e6079M1458j8841K6640P1540q6200J4202O7583q6317q361J1483j2191J06349
163G1266k4153r4266N5621j3155k1953L8765n0169M9976P2956r9324j8616K4358
175h694k8083O3744j0117m4733P7295k9100o1449L3252k5442L4501N4228o9349
187a3947J7061K7206p0004K2502J2845j2474O8828l3430m9235M8440l2816j4379
199b9403L8886k3576M3793K0072q4587J4275K2787k4508M0656j5113j2724N8118
211D8676m8179m4609L6814p154L1290J8649n6468K8106J4019n4890K0294P928
223e524L421M9775m2353l3313L8669k5480j708K7125j8099L4295K651o0918J9077
$$ plain form
236 -12382 -1414 -15758 18362 4392 -625 32115 -13602 -32922 931 -6024 14902 21032 -13706
249 -13706 10289 6546 -31388 -6937 2264 8382 31707 -6900 -18277 9440 -13881 -11857 8452
262 8452 2624 24407 11098 -28827 -7959 398 -5762 12794 1772 5546 19468 -18294 -23861
275 -23861 2657 1347 14138 11177 -9075 6695 -1477 -22841 -3192 6253 12382 17816 -9886
288 -9886 -11006 3989 -11321 -5751 8441 7428 16010 -94 -21278 -5120 1226 -564 7837 3878
302 3878 7387 5652 -17262 -13900 3110 5859 10771 4010 -3852 2652 -6357 -14264 -903 8762
316 8762 12795 6273 -8679 -6035 -1744 -6450 -782 6238 9778 8718 -6815 -13702 -3542 1536
330 1536 3241 4658 4445 5727 -2518 -13005 -7642 2845 8414 7657 442 -2049 -1504 -6411 -7440
$$ packed form
236a2382J0968j4344L4120j3970n017L2740m5717j9320L3853o955K0926O130l4738
249a3706K3995l743l7934K4451R201O118K3325l8607j1377K7717k3321K024K0309
262H452n828K1783j3309l9925K0868Q357o160J8556j1022L774J3922l7762n567
275b3861K6518j310J2791k961k0252J5770q172k1364J9649R445O129N434k7702
288i886j120J4995j5310N570J4192j013Q582j6104k1184J6158O346j790Q401l959
302C878L509j735k2914L362J7010K749M912o761p862O504r009p907J3361R665
316H762M033o522j4952K644M291m706N668P020L540j060j5533o887J0160N078
330A536J705J417k13J282q245j0487N363J0487N569p57p215k491N45m907j029
$$ plain form
345 -7440 658 9447 9445 648 -5932 -6006 -3367 -994 599 5722 8732 1653 -6364 -9156 -4478 4833
361 4833 4252 1959 5864 328 -5861 -5495 -6821 3072 11378 2043 -345 -590 -6491 -2379 -2785 -1299
377 -1299 11829 5688 -4321 -1773 -7971 -3098 6296 -2389 3929 10188 -4659 -5211 -4571 -6501 8396
392 8396 5616 -2567 6097 -2149 -6899 -209 -7214 3611 13845 -3087 -1873 931 -8656 1057
406 1057 418 -3490 11890 4045 -6859 -1081 -7570 -328 8242 -4520 4172 8531 -7805 -2894
420 -2894 -3400 -5572 11409 3351 -4851 6053 -3673 -5108 851 -7142 7268 11339 -7203 147
434 147 -729 -8123 5635 -1948 -3133 14068 -1347 -7619 1260 -7898 3534 7598 -7859 7166
448 7166 5977 -10819 1124 -4170 -4109 15229 -2318 -6201 9137 -7088 -3797 3731 -8402 9768
$$ packed form
345g440Q098Q789kq797o580p4K639K373J593N123L010p079q017k792M678R311
361D833n81k293L905n536o189L66j326R893Q306r335k388k45n901M112m06J486
377a299J3128o141j0009K548o198M873R394q685O318O259j4847n52O40j930J4897
392H396k780q183Q664q246m750O690p005J0825J0234j6932J214K804r587R713
406A057o39l908J5380p845j0904N778o489P242Q570j2762Q692M359j6336M911
420b894n06k172J6981q058q202J0904r726j435N959p993J4410M071j8542P350
434A47q76p394J3758p583j185J7201j5415o272Q879r158J1432M064j5457J5025
448G166j189j6796J1943n294O1J9338j7547l883J5338j6225L291P528j2133J8170
$$ plain form
462 9768 9341 -11715 3049 -714 -8584 9006 -3777 -2862 15840 -6592 -8006 5127 -8137 4766
476 4766 7351 -9658 8417 4171 -12435 3342 -3103 -2246 14576 -6146 -5045 9964 -8902
489 -8902 -2640 4615 -6990 10324 5499 -12303 4234 -1050 -6034 8347 -5064 397 12943
502 12943 -9923 -4567 5021 -7582 7011 4344 -9050 9429 197 -10730 5220 -3828 798
515 798 11775 -9298 -681 7736 -11192 1983 3610 -6889 12148 176 -11891 8013 -3357
528 -3357 -4798 8982 -6646 3440 10133 -13570 -166 5183 -7753 9365 301 -9085 12478
541 12478 -3298 -10459 7596 -4623 2659 10443 -12074 1138 7026 -10830 4558 1656 -6607
554 -6607 13060 -2682 -10690 8865 -5039 -2428 9667 -7769 3429 7432 -12843 3007 3740
$$ packed form
462I768m27k1056J4764l763p870J7590j2783R15J8702k2432j414J3133j3264J2903
476D766K585j7009J8075m246j6606J5777o445Q57J6822k0722J101J5009j8866
489h902O262P255j1605J7314m825j7802J6537n284m984J4381j3411N461J2546
502A2943k2866N356R588j2603J4593k667j3394J8479r232j0927J5950r048M626
515G98J0977k1073Q617Q417j8928J3175J627j0499J9037j1972j2067J9904j1370
528c357j441J3780j5628J0086O693k3703J3404N349j2936J7118r064r386K1563
541A2478j5776p161J8055j2219P282P784k2517J3212N888j7856J5388k902q263
554f607J9667j5742q008J9555j3904K611J2095j7436J1198M003k0275J5850P33
$$ plain form
567 3740 -7741 9517 -1095 -6576 11156 -7137 -7424 9691 -4787 2673 6459 -11634 5114
580 5114 4949 -11626 5348 1266 -3148 11489 -7903 -7990 11037 -5069 -1202 6280 -7897 6969
594 6969 5005 -13610 3805 2836 -4105 9226 -5343 -5050 10872 -7290 -4030 7278 -6156 5097
608 5097 5162 -11031 4771 1880 -8185 7602 -735 -3298 8458 -7431 -2527 8408 -8150 1157
622 1157 6672 -6165 5830 -461 -10957 8356 1847 -5343 5973 -4770 431 8155 -10966
635 -10966 -1495 7939 -4089 5262 -776 -9882 9199 739 -8120 6227 -2061 464 7622 -10009
649 -10009 -1323 7281 -6031 4008 2222 -7409 7615 -912 -8234 7423 -2202 -2582 8171 -5873
663 -5873 -1007 5084 -8154 3403 5133 -6969 4916 402 -5772 7080 -4085 -5219 9461
$$ packed form
567C740j1481J7258j0612n481J7732j8293k87J7115j4478P460L786j8093J6748
580E114j65j6575J6974m082m414J4637j9392q7J9027j6106L867P482j4177J4866
594F969j964j8615J7415r69o941J3331j4569K93J5922j8162L260J1308j3434J1253
608E097O5j6193J5802k891j0065J5787q337k563J1756j5889M904J0935j6558R307
622A157N515j2837J1995o291j0496J9313o509p190J1316j0743N201P724j9121
635a0966R471R434j2028R351o038r106J9081q460q859J4347q288K525P158j7631
649a0009Q686Q604j3312J0039j786r631J5024q527p322J5657r625l80J0753j4044
663e873M866O091j3238J1557J730j2102J1885m514o174J2852j1165j134J4680
$$ plain form
676 9461 -2182 -1668 3781 -7664 3146 5594 -7976 3019 2739 -3753 5815 -4642 -6071 8766
690 8766 -1497 -2103 4381 -6032 2015 4700 -7690 2220 3042 -3465 5559 -2523 -5466 6087 -2390
705 -2390 -1270 5508 -5144 926 4486 -6134 1769 1573 -4263 5814 -146 -4693 4067 -3045 -1016
720 -1016 5364 -4970 620 4789 -5083 1721 905 -5342 5361 1146 -4061 4092 -2689 -1799 5041
735 5041 -4538 -38 4802 -4214 2266 1345 -6531 4087 1847 -3907 4221 -1994 -2551 5276 -3848
750 -3848 -1870 4306 -2975 2405 2079 -6403 2916 2179 -4126 3601 -699 -2381 5076 -2942 -2896 3847
766 3847 -2153 1059 2465 -4293 2130 1394 -4309 2721 358 -2204 3756 -1823 -2101 3149 -2560 -405
782 -405 2932 -1959 1216 416 -3118 2681 57 -2648 2833 -357 -611 2165 -3355 -440 3300 -1707
$$ packed form
676I461j1643N14N449j1445J0810K448j3570J0995k80o492R568j0457j429J4837
690H766j0263o06O484j0413Q047K685j2390R910Q22o507R024q082k943J1553q477
705b390J120O778j0652O070L560j0620P903j96n836J0077n960m547Q760p112K029
720a016O380j0334N590M169r872O804q16o247J0703m215n207Q153o781Q90O840
735E041r579M500M840r016O480r21p876J0618k240n754Q128o215n57P827r124
750c848J978O176p281N380l26q482R319p37o305P727m300j682P457q018M6O743
766C847o000L212J406o758O423p36n703P030k363k562N960n579k78N250n709K155
782d05L337m891L175q00l534N799k624k705N481l190k54K776n520K915L740n007
$$ plain form
798 -1707 200 567 -1535 2395 -1006 -2860 2669 -8 -388 1723 -2852 340 2576 -2960 257 1912
814 1912 -1187 1462 -823 -2050 2502 -645 -1152 2048 -1203 460 1235 -3251 893 2177 -2131 877
830 877 632 -1367 1415 -1151 -1411 2375 -283 -427 792 -1588 1016 804 -2551 1354 1666 -1354 552
847 552 -647 -909 1859 -700 -976 1442 -146 47 -363 -1648 1512 879 -1600 739 245 -643 771
864 771 -1153 -493 1862 -257 -601 260 -372 669 -330 -1098 1443 598 -886 163 -554 77 1038 -1036
882 -1036 -349 1327 -41 -564 -571 -287 1101 63 -893 514 315 -278 -157 -690 373 1190 -488 -759
900 -759 456 371 -276 -590 -44 935 411 -745 -566 248 464 -70 -605 -14 978 160 -1228 -316 854
919 854 180 -223 -187 5 738 -134 -1151 214 925 263 -324 -758 485 894 -1069 -539 885 221 250
$$ packed form
798a707J907L67k102L930l401j854N529k677l80K111m575L192K236n536L217J655
814A912l099K649k285j227M552l147n07L200l251J663P75m486M144J284m308L008
830H77k45j999K782k566k60L786k658j44J219k380K604k12l355L905L12l020J906
847E52j199k62K768k559k76K418j588J93m10j285L160o33k479K339m94q88J414
864G71j924O60K355k119l44Q61o32J041r99p68K541q45j484J049p17O31R61k074
882a036O87J676j368n23pK84J388j038r56J407j99n93J21n33J063Q17j678k71
900g59J215q5o47l14N46R79n24j156J79Q14K16n34n35N91R92q18j388R12J170
919H54o74m03L6J92P33q72j017J365P11o62n87m34J243M09j963N30J424o64K9
$$ plain form
938 250 -488 -1119 968 634 -1155 -39 524 393 26 -1367 48 1352 -468 -323 157 -218 993 -397
956 -397 -1543 1170 948 -696 -152 -404 571 741 -1467 -125 1163 -134 187 -828 -829 1824 -143 -1641
974 -1641 899 434 23 82 -1539 605 1474 -1126 -140 268 -146 1193 -1216 -1303 2160 87 -1081 457
992 457 -704 708 766 -1987 436 1367 -735 229 -771 -470 1983 -1006 -1279 1732 -229 -264 340 -1450
1010 -1450 1133 1203 -1803 347 689 -364 755 -1390 -471 2344 -859 -1044 872 -689 779 269
1026 269 -2082 1220 1203 -1298 225 -581 46 1698 -1669 -605 1934 -819 13 250 -1521 1716 662
1043 662 -2059 1086 365 -710 955 -1337 30 1975 -1650 -209 1185 -1321 894 109 -1814 1970
1059 1970 302 -1906 1164 -259 -286 1269 -1750 211 1939 -1622 36 540 -1172 1772 -177 -2094
$$ packed form
938B50p38o31K087l34j789J116N63j31l67j393J415J304j820J45M80l75J211j390
956c97j146K713k22j644N44k52R75J70k208J342J288j297L21j015jK653j967j498
974a641K540m65m11N9j621K144Q69k600R86M08m14J339k409q7L463k073j168J538
992D57j161J412N8k753K423R31k102R64j000L01K453k989k73L011j961l5O04j790
1010a450K583P0l006K150L42j053J119k145R19K815l203j85J916j561J468n10
1026B69k351L302j7k501J523q06O27J652l367J064K539k753Q32K37j771L237j054
1043F62k721L145p21j075J665k292J367J945l625J441J394k506K215p85j923L784
1059A970j668k208L070j423k7J555l019J961J728l561J658N04j712K944j949j917
$$ plain form
1075 -2094 1893 214 -1218 934 -1084 243 1712 -1797 -53 1102 -1149 909 -136 -1421 1932
1090 1932 -185 -1431 1412 -607 -338 1214 -1283 442 1075 -1548 626 383 -996 1286 -653 -873
1106 -873 1839 -952 -864 1229 -908 443 652 -1704 957 661 -1311 818 -462 -379 1815 -1354 -755
1123 -755 1690 -996 154 788 -1570 1114 724 -1644 941 -88 -742 1533 -1089 -488 1680 -1502
1139 -1502 -2 1341 -1649 700 775 -1672 1272 130 -1531 1430 -330 -581 1364 -1465 81 1661
1155 1661 -1765 296 1008 -1454 1273 153 -1890 1549 155 -1071 1110 -924 -33 1458 -1593
1170 -1593 93 1052 -1285 1005 237 -1627 1483 49 -1284 1319 -479 -468 1216 -1102 115 938
1186 938 -1339 690 481 -1218 1155 -294 -1140 1590 -552 -887 1259 -774 28 840 -1427 577
$$ packed form
1075b094L987j679j432K152k018J327J469l509J744J155k251K058j045j285L353
1090A932k117j246K843k019K69J552k497J725O33k623K174k43j379K282j939k20
1106h73K712k791Q8K093k137J351K09k356K661k96j972K129j280Q3K194l169N99
1123g55K445k686J150O34k358K684l90k368K585j029o54K275k622O01K168l182
1139a502J500J343k990K349P5k447K944j142j661K961j760k51J945k829J546J580
1155A661l426K061P12k462K727j120k043L439j394j226K181k034Q91J491l051
1170a593J686R59k337K290p68j864L110j434j333K603j798J1J684k318J217Q23
1186I38k277K029k09j699K373j449q46K730k142l35K146k033Q02Q12k267K004
$$ plain form
1202 577 778 -1154 795 -195 -792 1597 -776 -970 1530 -636 -149 925 -1338 513 925 -1298 615
1219 615 170 -789 1189 -656 -784 1445 -820 -391 1156 -1070 209 770 -1290 638 514 -1053 747
1236 747 -144 -505 1070 -889 -343 1317 -860 -80 683 -1015 693 456 -1289 704 344 -580 613
1253 613 -683 -149 1154 -898 -151 747 -791 572 275 -1193 886 329 -875 656 -238 -248 760
1270 760 -826 55 809 -881 281 301 -824 844 -81 -982 1013 -26 -644 561 -481 128 685
1287 685 -961 180 601 -589 447 -210 -630 1145 -217 -843 757 -147 -95 456 -794 262 679
1304 679 -697 172 65 -365 733 -430 -567 966 -302 -410 506 -479 215 410 -813 344 380 -524
1322 -524 327 -257 -179 833 -625 -368 837 -390 -71 266 -606 576 336 -847 320 189 -174 428
$$ packed form
1202E77K01j932J949r90n97K389k373j94K500k166M87J074k263J851M12k223J913
1219F15m45r59J978j845j28K229k265M29J547k226J279N61k060J928j24j567J800
1236G47q91l61J575j959N46J660k177P80P63j698J708k37j745J993l60r24J193
1253F13j296N34J303k052P47Q98j538J363k97j468K079n57j204J531q94j0J008
1270G60j586Q81P54j690J162K0j125J668r25r01J995j039o18J205j042O09N57
1287F85j646J141M21j190J036o57m20J775j362o26J600r04N2N51j250J056M17
1304F79j376Q69j07m30J098j163j37J533j268j08R16r85O94J95j223J157L6r04
1322e24Q51n84P8J012j458K57J205j227L19L37q72J182k40j183J167j31l63O02
$$ plain form
1340 428 -629 -96 971 -545 -295 455 -407 380 215 -827 484 338 -550 231 -162 -60 564 -624
1358 -624 -151 683 -467 -40 249 -498 466 184 -760 352 271 -303 172 -267 49 526 -501 -119 401
1377 401 -243 198 18 -500 529 202 -577 155 139 -24 148 -363 28 387 -230 -56 -6 -121 408 -125
1397 -125 -485 358 155 -241 32 -109 102 211 -256 -61 117 -11 123 -205 -140 381 -109 -272 201 3
1417 3 -24 76 -194 98 188 -150 -44 -3 82 218 -267 -141 330 -54 -119 58 -130 114 139 -254 -29 105 -2
1440 -2 9 -157 18 193 -183 -115 150 -49 26 14 -166 101 147 -127 -97 38 134 44 -177 4 139 -22 11 -15
1464 -15 -70 110 43 -132 -19 94 12 -104 -33 110 -12 -97 23 -18 0 55 -88 -85 101 66 -118 -104 98 86 -99
1489 -99 -42 45 -44 34 11 -101 25 91 -40 -116 38 107 -62 -90 111 17 -72 67 -44 -39 151 -33 -112 62 64 -6
$$ packed form
1340D28j057N33J067j516K50P50q62P87j65j042J311j46q88P81l93J02O24j188
1358f24M73Q34j150M27K89p47R64k82r44J112q1n74M75m39L16M77j027L82N20
1377D01o44M41j80n18J029l27p79P32j6j63J72n11L91L59o17J74N0j15N29n33
1397a25l60Q43k03l96K73j41K11J09m67J95J78j28J34l28O5N21m90j63M73j98
1417Ck7J00k70K92R0l38J06M1Q5J36m85J26M71l84o5J77j88K44K5l93K25J34j07
1440bJ1j66J75J75l76O8K65j99P5j2j80K67M6k74L0J35R6r0k21J81J35j61L3k6
1464a5n5J80o7j75J13J13q2j16P1J43j22q5J20m1J8N5j43LJ86l5j84J4K02j2j85
1489i9N7Q7q9P8k3j12J26O6j31p6J54O9j69k8K01r4q9J39j11NJ90j84p9J74Kp0
$$ plain form
1515 -6 -81 -42 142 -29 -107 75 -82 -37 162 -153 -116 201 -71 -108 67 -47 25 5 -91 121 -36 -86 131 -102
1539 -102 -9 239 -176 -79 248 -96 -57 111 -88 72 21 -124 101 -43 -42 139 -192 12 228 -264 -57 231
1561 231 -140 6 53 -159 126 28 -110 68 -93 65 143 -284 67 209 -227 72 89 -209 155 39 -165
1582 -165 121 -45 -23 94 -168 118 107 -270 182 105 -264 187 34 -202 229 -53 -161 179 -75 15 64 -223
1604 -223 184 67 -288 187 2 -213 280 -133 -249 308 -72 -116 117 -155 120 121 -252 137 48 -128 285
1625 285 -144 -200 378 -96 -157 227 -151 43 184 -237 73 87 -135 184 -108 -149 292 -170 -132 274 -216 -27
1647 -27 194 -223 81 92 -229 168 15 -126 186 -196 -7 337 -294 -78 258 -187 119 67 -328 238 129
1668 129 -224 92 -129 37 318 -361 -76 333 -196 80 70 -335 294 171 -342 126 19 -42 214 -258 -50
$$ packed form
1515fp5L9J84j71p8J82j57M5J99l15L7L17k72l7J75j14P2k0r6K12j57n0K17k33
1539a02R3K48m15R7L27l44L9J68j99J60n1j45K25j44JJ81l31K04K16m92K07K88
1561B31l71J46M7k12K85r8j38J78j61J58P8m27L51J42m36K99J7k98L64j16k04
1582a65K86j66K2J17k62K86j1l77M52p7l69M51j53k36M31k82j08L40k54R0M9k87
1604b23M07j17l55M75j85k15M93m13j16N57l80m4K33k72K75Jl73L89q9j76M13
1625B85m29n6N78m74o1L84l78J94J41m21L10J4k22L19k92m1M41m62L8M06m90J89
1647b7K21m17L04J1l21L97j53j41L12l82J89L44o31K16L36m45L06n2l95N66j09
1668A29l53L16k21J66K81o79K85M09n29K76j0m05O29j23n13M68j07o1K56m72K08
$$ plain form
1689 -50 276 -248 20 135 -285 195 70 -337 227 36 -269 162 -30 -40 138 -249 72 251 -230 60 48
1710 48 -150 319 -71 -355 310 94 -138 40 -169 122 234 -278 -34 80 -53 228 -219 -280 388 -20 -240
1731 -240 131 -137 49 188 -289 22 150 -136 132 -87 -133 290 -160 -159 317 -162 -86 207 -182 87 135 -287
1753 -287 123 138 -148 91 -144 -26 335 -248 -171 271 -103 43 72 -318 182 209 -248 9 -25 -3 226 -247
1775 -247 -126 272 -138 -10 74 -249 174 136 -281 96 52 -94 150 -122 -38 189 -176 38 159 -207 115
1796 115 74 -186 199 16 -207 183 16 -64 85 -178 75 169 -239 34 52 -144 215 -62 -266 247 17
1817 17 -154 103 -133 18 171 -202 30 88 -144 173 -29 -212 266 -22 -182 209 -92 -62 207 -139 0
1838 0 123 -141 115 19 -167 172 -50 -130 227 -127 -121 236 -115 -48 125 -161 59 97 -158 65 -25 -86 180
$$ packed form
1689e0L26n24K68J15m20M80j25m07N64j91l05M31j92j0J78l87L21J79m81K90j2
1710D8j98M69l90k84O65k16k32J78k09K91J12n12K44J14j33K81m47o1O68m08k20
1731b40L71k68J86J39m77L11J28k86K68k19m6M23m50JM76m79P6K93l89K69M8m22
1753b87M10J5k86K39k35J18L61n83P7M42l74J46K9l90N00K7m57K57l4K2K29m73
1775b47J21L98m10J28Q4l23M23l8m17L77m4j46K44k72Q4K27l65K14J21l66L22
1796A15m1k60L85j83k23L90j67q0J49k63K53R4m08K73J8j96L59k77k04N13k30
1817A7j71K57k36J51J53l73K32N8k32L17k02j83M78k88j60L91l01L0K69l46J39
1838@J23k64K56r6j86L39k22q0L57l54OL57l51O7J73k86K20L8k55K23r0o1K66
$$ plain form
1861 180 -141 -128 201 -101 -40 138 -176 25 156 -133 17 29 -60 125 -77 -67 136 -85 12 126 -156 29
1883 29 143 -139 27 60 -94 64 -12 -58 59 -75 13 77 -138 22 82 -132 54 61 -140 50 34 -68 34
1906 34 -40 12 63 -75 46 25 -90 110 21 -134 118 37 -90 60 0 -17 55 -37 9 20 -33 89 -38 -86 131
1931 131 -17 -101 112 -47 -55 92 -48 -30 33 -45 25 -23 -44 80 -73 -38 136 -94 -72 114 -68 -18 86 -87
1955 -87 11 57 -25 22 -30 -11 99 -69 -27 113 -90 -6 89 -98 4 76 -77 0 40 -38 10 -28 -11 51 -68 -5
1981 -5 60 -77 1 65 -93 3 65 -56 -1 25 -31 3 -5 15 19 -48 26 38 -62 27 42 -62 22 52 -42 2 27 2 -4 -6
2011 -6 18 -2 -33 35 3 -58 48 10 -63 16 14 -46 2 19 -19 -32 -6 25 -28 -20 26 -23 -33 46 -1 -41 44 22 -47 9 38
2042 38 -13 -22 27 10 -14 5 17 -15 0 27 -11 -33 34 27 -54 -13 37 -46 -24 24 -38 -20 32 -19 -33 10 4 0 -34 11 32 -57
$$ packed form
1861A80l21J3L29l02O1J78l14K01J31k89J50J2q9J85k02J0K03k21R7J14k82J85
1883B9J14k82J66L3j54J58p6m6J17j34Q8O4k15J60O0k14J86Pk01J90j6j02J02
1906C4p4N2N1j38J21k1j15K00q9j55K52q1j27J50o0j7P2r2M6J1n3J22j27m8K17
1931A31j48q4K13j59qJ47j40J8O3p8P0m8k1J24j53L5J74k30K2J86j82N0J04j73
1955h7R8M6q2M7n2J9J10j68M2J40k03Q4R5j87J02P2j53P7M0p8M8l8J7O2j19O3
1981eO5j37P8O4j58R6O2j21N5K6n6L4qK0Mo7P4J2j00Q9J5j04Q4L0r4M4K5k5ok
2011fK4k0l1O8l2o1J06l8p3P9ko0M8J7l8j3K6L1n3QM6m9j0P9m7m0Q5k2o9N6K9
2042C8n1rM9j7k4J9J2l2J5K7l8k2O7pq1M1N0q3K2M8o2J8N2n1j4M3oml4M5K1q9
$$ plain form
2074 -57 -1 41 -50 1 47 -50 15 51 -39 -16 34 13 7 -23 -2 34 -27 1 34 -45 26 39 -72 11 51 -44 -18 14 -1 2 -30
2105 -30 -10 22 -39 8 0 -73 53 37 -79 12 35 -31 1 1 -4 17 -7 23 1 -44 52 11 -59 72 18 -70 48 18 -32 29
2135 29 -4 0 13 -29 15 -22 -40 69 -28 -77 71 -19 -71 43 -33 -30 45 -29 -21 -1 -15 39 -41 -41 84 -39 -39 89 -50
2164 -50 -23 88 -45 -9 51 -26 18 8 -10 48 -38 -3 78 -63 -9 70 -64 12 56 -73 16 40 -40 19 -28 -12 53 -68
2192 -68 -20 56 -77 26 41 -101 38 53 -71 17 6 -12 63 -38 -9 62 -49 36 34 -93 78 54 -92 56 38
2217 38 -54 43 -17 -24 59 -43 3 33 -78 36 5 -112 75 9 -113 59 9 -52 42 -52 -10 59 -47 2 -4 -31 86
2244 86 -24 -102 104 15 -66 50 -37 -7 87 -47 -24 38 -8 60 -44 -65 107 -35 -65 77 -54 -25 78 -80 -20
2269 -20 62 -64 0 1 -35 45 -55 -45 95 -78 -40 78 -75 13 66 -120 13 90 -55 -7 -20 3 94 -71 -34 91
$$ packed form
2074e7N6M2r1N1M6r7O5L6r0K3N0k1ol0K1L6o1K8L3p9P1J3j11Q3M0r5K6L2j5Ll2
2105c0K0L2o1M7qp3J26j6j16R1K3o6L2%nK1k4L0k2m5R6m1p0J31n4q8J18l0n0O1
2135B9l3MJ3m2M4l7j8J09r7m9J48r0n2J14p6LP5p4QK0j4N4q0%J25j23%J28j39
2164e0K7J11j33L6O0p7M4j0j8N8q6L5Q1j41N4P9j34P6M4j29Q9K4q0N9m7J6O5j21
2192f8M8P6j33J03J5j42J39J5j24Q8j1j8P5j01K9P1j11Q5kj27J71k4j46J48j8
2217C8r2R7o0pQ3j02M6L0j11J14l1j17J87o6j22J72n0o1R4r4M2O9j06M9ok7J17
2244H6j10p8K06q9q1J16q7L0R4j34K3O2m6O8j04k1J72j42l0J42j31K9J03j58O0
2269b0Q2j26O4Jl6Q0j00J0J40j73L8J18j53Q8N3j86J33P7j45M8j3K3R1j65L7J25
$$ plain form
2295 91 -42 32 48 -115 72 110 -112 11 43 -25 40 -43 -42 65 -51 0 33 -95 54 44 -123 45 43 -100 34
2320 34 19 -45 46 -38 -16 57 -47 10 17 -78 84 18 -114 90 46 -73 44 -14 -17 82 -40 -33 26 -15 63 -25 -100 90
2348 90 14 -82 46 -27 -43 81 -49 -53 32 -24 5 -13 -47 57 -29 -54 70 -43 -44 75 -39 -32 60 -43 4 53 -19
2375 -19 20 -5 -1 70 -46 -14 76 -37 -2 52 -67 12 62 -53 -7 8 -9 28 -41 -20 31 -48 15 31 -96 24 43 -80
2403 -80 11 8 -46 35 -1 -33 15 -31 26 32 -67 38 39 -70 45 24 -68 58 19 -50 41 -14 -2 29 -49 22 21 -69 47 -5
2433 -5 -78 63 -4 -72 51 -29 -46 35 -32 -22 8 -42 26 1 -55 54 -9 -54 65 -21 -54 76 -5 -37 40 -17 7 13 -35
2462 -35 37 2 -19 47 -29 -26 81 -26 -41 55 -27 -18 31 -24 -4 -1 -11 7 -43 -13 28 -48 -15 44 -55 -20 55 -34 -17 23 -4
2493 -4 9 -5 -6 5 -28 13 32 -55 14 37 -44 6 37 -23 1 23 -18 10 5 3 -3 -32 13 1 -55 10 5 -50 8 12 -41 -1 4 -20
$$ packed form
2295I1j33P4J6j63J87L8k22J23L2o8O5q3JJ07j16N1L3j28J49j0j67J68kj43J34
2320C4j5o4R1q4K2P3j04N7Pr5J62o6j32K04m4j19J17n8lR9j22PN9m1P8q8p5J90
2348I0p6r6J28p3j6J24j30mQ5n6K9j8l4J04q6k5J24j13jJ19j14PR2j03M7M9p2
2375a9L9k5MP1j16L2R0j13L5N4j19P9N0j15M6J5j7L7o9K1N1p9O3J6j27J20J9j23
2403h0R1ln4Q1l6l2M8m6N7Or9J05Jj09J15k1r2J26l9o9R1n5J2L1p8P1jr0J16n2
2433ep3J41o7o8J23q0j7Q1o7J0L0n0O8k5n6J09o3m5J19q6l3J30q1l2P7n7K4Om8
2462c5P2l5k1O6p6LJ07j07j5R6q2RM9n5K0Lj0J8n0L0M1p6L3N9r9L5P5q9J7M0k7
2493dJ3j4jJ1l3M1J9q7O9K3q1N0L1o0K4K2m1K8nkok9M5j2n6O5nn5N8Mn3M0Nk4
$$ plain form
2527 -20 -11 -13 1 -13 -17 25 -11 -35 36 7 -37 24 11 -15 13 4 -6 6 3 18 -18 -14 26 -7 -33 27 -4 -32 19 -12 -36 2 -3 -18
2561 -18 -21 1 0 -33 -12 15 -30 -22 12 -25 -19 20 -10 -25 11 16 -10 -5 22 5 -14 10 19 -16 11 27 -24 -7 32 -2 -16 14 12 -19
2595 -19 -12 9 -10 -23 21 -1 -45 5 8 -38 -11 18 -21 -21 7 1 -18 4 9 -22 -9 25 -5 -31 12 15 -17 4 23 5 0 16 1 -16
2629 -16 14 13 -29 -4 20 -11 -20 19 0 -20 1 6 -21 -8 7 -25 -27 13 -10 -42 3 12 -19 -12 5 0 -12 9 1 -21 3 29 -12 -14 42
2664 42 -2 -13 29 6 -6 19 7 4 6 21 17 -26 2 40 -29 -19 36 -23 -5 18 -21 -19 17 -8 -12 -5 13 10 -33 -5 32 -40 -2 33
2698 33 -29 -3 34 -25 -2 28 0 -3 0 17 12 -13 14 25 -19 12 30 -29 15 45 -43 -7 25 -15 -4 3 -4 -6 -25 9 -1 -42 21
2731 21 1 -50 18 21 -36 2 7 -19 6 -5 0 -5 -11 23 3 -27 29 10 -35 43 13 -20 24 9 -10 8 5 6 9 -6 23 -21 -27 40 -10
2766 -10 -39 32 -14 -27 16 -14 -21 2 -6 1 -13 -16 24 -22 -22 44 -23 -13 37 -16 -17 32 -10 11 19 -8 23 1 11 34 -17 6 44 -28
$$ packed form
2527b0RkJ4j4mM2l6k4P1k9m4O1j3k6K8rj0J2lJ5l6MM0l3k6O0l1k8N1l1k4L8nj5
2561a8lK2jl3K1K7m5QL4l7OL9l0j5L6Nk6NK7j7j9K4Rl5K7J6n1J7L9l4j4L0kl1
2595a9PK1j9j3M4k2m4N0Lm6K7K9l9%K8oj9K2Nl1J3L4l0k6M3Ll2K1J9j8nJ6j5j7
2629a6L0jm2K5K4l1rL9j9k0K1Nk7J3J5l2kM0k3l2M5Rl1PJ7nj2K1qk2K4K6m1kN6
2664D2m4j1M2k3j2K5j2lKJ5mm3K8L8o9J0N5n9J8K3l9KL6k5mPJ8lm3K8L7p2L8L5
2698C3o2K6L7n9K3L0k8lLJ7nk5K7J1m4L1J8n9M4L0q8L6L2m0J1Ppkj9L4j0m1O3
2731B1k0n1O8Ln7L8Nk6K5j1NnoL4k0l0N6j9m5P8l0l3M4j5j9J8lJLj5K9m4oO7n0
2766a0k9P1m6j3M3l0pK3qPj4lM0m6%O6o7J0N0n3jM9m2K1Qk7L1k2J0K3n1K3L8p2
$$ plain form
2800 -28 -4 37 -28 2 25 -18 -1 1 4 14 -31 -8 11 -43 10 19 -49 -1 34 -49 2 28 -21 3 0 -6 15 -13 12 21 -28 25 28 -37
2834 -37 24 24 -29 32 18 -24 22 21 4 3 -21 8 9 -26 16 3 -43 23 9 -52 14 -6 -25 3 -11 -12 -4 -8 7 -14 -29 32 -1 -25
2868 -25 27 -11 -10 35 -10 -9 28 14 11 5 -5 26 -9 -1 29 -21 -11 25 -23 -18 23 -21 -8 9 -12 -3 -29 -7 1 -35 -10 23 -40 -10
2902 -10 24 -38 3 22 -24 7 25 1 6 -17 4 32 -14 22 31 -26 28 38 -24 17 32 -19 7 4 -15 18 -13 3 9 -32 6 12 -37
2935 -37 14 18 -40 16 7 -44 8 -4 -20 8 -19 4 20 -17 28 3 -34 30 10 -30 28 22 -16 19 4 -4 20 -3 13 9 -14 29 9
2968 9 -24 29 -8 -33 29 -6 -23 5 -10 -10 0 -6 0 -13 -2 14 -25 -14 28 -6 -25 20 -7 -8 14 -13 3 5 2 2 -12 8 33 -6
3002 -6 0 38 -3 -5 14 -10 -3 14 -9 -9 -5 5 -6 -14 -2 17 -22 -10 9 -24 -14 9 -21 -10 8 -16 -20 -1 1 -11 -12 6 7 -22 14 20
3038 20 -25 27 27 -13 1 26 7 -5 6 13 8 0 20 -4 -8 28 1 -29 15 -2 -29 -1 -5 -20 -10 -10 -13 -27 -16 10 -26 -13 18 -19
$$ packed form
2800b8K4M1o5L0K3m3J7KLJ0m5K3J9n4N3Ro8M8L5q3N1K6m9K4loK1k8K5Rm9N3Lo5
2834c7O1%n3O1j4m2M6jj7jk4K9Jl5M2j3m6O6j4o1O6k0j9K8j4jQmJ5k1j5O1l3k4
2868b5N2l8JM5m5JL7j4loj0L1l5QL0n0J0L6m8NM1m4J3J7k1Rk6K2Ql6K5L3o3L0
2902a0L4o2M1J9m6L1J8k4Nk3K1K8m6L6Rn7N4J0o2M1J5n1K6lj9L3l1J6Om1L8Om9
2935c7N1Mn8N6rn1N2j2j6K8k7K3J6l7M5k5l7O4k0m0N8ol8L5j5qK4k3J6mk3M3k0
2968Il3N3l7k5O2l5j7K8j5%J0oOj3J1J6l9J1M2l4j9M5k7jK2k7J6Kl%j4K0K5l9
3002fOL8m1kJ9k4PJ7k3%MJ0j1qJ2J9l9J2J9l3J0K3l0J1J8k4mJ9Kj2jJ8Jk9L6O
3038B0m5N2%m0J4K5j9j2J1PnqK0k4mL6k7l0M4j7k7K8mj5J0%lj4J1K6l6J3L1l7
$$ plain form
3072 -19 -23 26 -10 -14 20 1 4 13 13 14 0 7 27 -10 7 29 0 2 31 -3 -16 24 -7 -12 7 1 -5 -12 -6 8 -16 -11 18 -26 -7 13 -17
3109 -17 -11 8 -17 -10 5 4 -1 6 7 16 -10 11 19 -15 -1 20 -12 4 23 -2 -7 17 11 -4 7 6 4 -14 2 8 -22 4 10 -25 -11 4 -16
3146 -16 -20 3 4 -15 -5 -3 -14 -9 2 0 -16 9 8 -6 -1 12 0 -2 18 8 -4 13 12 -6 10 15 -2 5 6 -8 -6 1 10 -18 -10 11 -7 -13 5
3185 5 -12 -23 -1 5 -19 -15 0 -6 -15 -2 1 -11 -8 5 -2 -5 16 -7 -9 18 7 -15 1 15 4 -11 19 7 -12 6 11 -17 -4 10 -5 -18
3221 -18 7 -6 -17 -1 5 -10 -7 -3 -6 -19 -4 1 -24 -8 7 -13 -16 17 -8 -12 1 9 -3 3 9 -4 3 11 8 -9 15 12 -7 10 10 -9 9 10
3259 10 7 -10 -1 10 -15 -6 11 -8 -19 0 -2 -13 -7 -2 -12 -6 3 -4 -12 0 10 -12 -12 13 -11 -12 19 0 -10 16 4 3 4 18 15 -6 14 14
3297 14 -1 -6 9 -12 -10 22 -16 -11 10 -3 -11 -4 -7 -4 -21 -13 4 -17 -3 8 -20 -4 10 -21 -2 16 1 -4 1 4 -5 7 9 11 -11 19 24 -8
3335 -8 8 21 -10 2 18 -9 0 14 -7 -4 -7 1 -1 -13 -4 2 -24 -4 -4 -22 -8 -9 -21 -5 -4 -7 -19 -9 13 -9 -1 11 5 -14 19 2 -21
$$ packed form
3072a9mM9l6mL4j9LR%Jj4PK0l7J7K2k9KK9l4j3M0l1nJ9oopOJ4k4NK9m4J9K0l0
3109a7OJ9k5PJ5jnPJRk6K1Ql4J4K1l2J6J9k5nK4oj5J1jkj8J6Ol0K6Ol5J4J5k0
3146a6mK3Jj9J0Kj1NJ1kj6K5jj4NJ3j2kK0j0j2J7jj8J6Nj7PJj4KPRk8QK1j8oJ8
3185Ej7j1K2Ok4MJ5orJ3Lj2LJ3plK1k3kK7j1k2J6J4j1j5L0j2j9J8Nk8J3J4j5j3
3221a8K5j3j1J6Oj5LMlj3J5Nk5J6J5k0lL3k5mJ3Qj2OOj3PQlj7K4lj9J7%j9J8J
3259A0lj7RJ1k5RJ7j9j1J9kj1ONj0ORpqJ2J0k2%K5k4jL1j9j0K6j2jJJ4lk1K0%
3297A4j5nJ5k1KL2l8NK1j3qPlLj7QJ7k1J4J1k8J6J4l1J9J8j5nNLrJ2KKk2L0Nl2
3335hJ6J3l1J2J6k7RJ4k1LlQkj2ROk6K0%j8J4jj2J6Jlj2J0K2k2QJ2oj9L3j7k3
$$ plain form
3372 -21 16 12 -4 7 8 6 7 1 11 -4 -5 14 -11 -12 15 -9 -16 7 6 -17 5 -2 -16 -14 -1 -1 -16 -16 7 -18 -10 21 -12 -18 12 1 -8 5
3410 5 1 3 11 4 9 2 0 15 -8 -3 17 3 -5 13 -4 -1 13 -3 -11 -2 5 0 -13 -5 0 -18 -12 -2 -19 -12 6 -21 -7 1 -5 -5 2 -4 6 -7 8 8 -3
3453 -3 13 18 -15 11 25 -12 8 6 -3 2 9 10 1 -6 2 1 -16 7 4 -21 1 0 -21 -4 -2 -11 0 4 -6 -14 -6 5 -3 -25 6 -3 -14 13 0 -15
3493 -15 10 6 -2 10 14 8 0 12 17 0 5 16 -7 3 19 -1 -11 10 1 -11 -4 1 -8 -11 4 5 -11 -8 6 -15 -12 6 -20 -11 11 -11 -5 -1 7 -10
3533 -10 -6 3 -1 -16 6 15 -2 9 10 -4 -1 13 6 9 7 4 -9 -5 8 3 -12 7 6 -24 4 4 -17 -9 3 -15 -13 -9 -6 -6 1 1 -5 -10 21 7 -8 15
3575 15 11 2 9 17 2 10 12 5 3 10 19 6 2 10 13 -5 12 12 -13 7 2 -5 -6 -1 -2 0 0 -4 -13 -12 10 -10 -16 7 -4 -8 12 -3 -5 15 1 -4 -2 8 9
3620 9 6 13 20 7 6 24 8 -1 18 7 1 17 12 11 1 -1 9 -6 -2 -3 -10 0 8 -8 -4 6 -3 -6 2 -8 -10 -3 -3 0 -12 8 -5 -6 2 7 -6 6 21
3663 21 3 2 15 16 4 13 16 -1 12 20 5 1 11 7 -2 -6 -5 -3 -15 8 -6 -11 -13 -6 -19 -10 0 -13 -8 0 -13 -8 -9 9 -5 0 7 2 3 10 1 -10 -2
$$ packed form
3372b1L7mj6J1JkJoJ0j5jJ9k5jK7k4pK3jk3K2pj4KJ3%j5%K3k5QL1l3oL0j1rJ3
3410EmKQpNpkJ5k3NK0j4qJ8j7LJ4j6qRPnj3QNj8OJ0j7PJ8k7J4Qo%PoJ0j3J5%j1
3453cJ6Nl3K6J4l7K0krNPJrpQjj7K3lk5K2jk1J7KrJ1Mj0qQJ1qk2L1rj1K7j3j5
3493a5K5mqJ2MoqJ2Nj7NJ1k3J0J6k0j0K1rj2PNrlJ5Jj6LJ4k1LJ8k6RK2k2OMQj7
3533a0MRmj5K2Rj7J1Jj4LJ4pLklj3MJ3nj5J9jl0K8%k1QJ2j8KML%P%onL1j4j5K3
3575A5mrPQj5QKpkPRj3mQLj8J7%k5K0npjNjK%mrJK2k0oK3j1mK0j5kK0j4nKJ0J
3620IlPPj3jJ8j6rJ9j1oJ6njj0kJ0j5MjpJ0Qj6MJ0rlQj0kP%Lj2K0j3jQNj3J2J5
3663B1j8jJ3Jj2RLj7J3Qj5mJ0mrmJKj2K3j4nkPj3RJ0j3NQj3NjJ8j4NPnJPrj1Q
$$ plain form
3706 -2 11 -7 4 16 5 -1 13 -4 -5 2 -2 3 1 5 3 -7 1 -3 -14 -9 0 -12 -14 2 -10 -6 -10 2 -5 0 1 4 -5 10 11 -2 3 10 -1 -1 3 1 9 18 6
3751 6 -9 10 10 2 9 4 2 -7 1 8 -16 -8 8 -1 -19 2 -5 -21 -1 2 -13 -4 -2 -7 -15 -8 -4 -18 -5 6 0 -7 15 2 4 9 1 -3 12 10 6 3 4 4 -4 6
3797 6 3 -12 -2 15 -2 -2 5 3 -13 2 -6 -11 -9 -8 -12 -14 -8 -7 -17 -12 -6 -14 0 0 -9 -6 7 0 -5 10 3 -8 1 7 8 -1 17 14 4 10 9 2 4 16 1 -14
3843 -14 8 -4 -9 -6 8 -8 -9 -1 -1 -11 -7 -11 -11 -7 -13 -2 -14 3 0 -1 7 8 -1 -2 7 -4 -6 8 8 -7 8 12 2 3 8 9 2 2 4 2 3 4 -13 -15 1
3888 1 -3 -23 -7 -8 -17 -8 -5 -12 -5 -10 1 -8 -12 -4 -4 -13 4 -8 -4 7 6 -1 10 9 -5 -3 12 14 8 8 16 2 6 5 5 -1 12 13 -3 -1 0 -2 -2 1 0 -6 -3 -3 -21
3937 -21 -2 0 -14 -7 1 -14 -9 0 4 -10 -2 3 1 4 10 5 0 17 8 -6 7 11 -2 7 1 2 1 10 0 -3 -7 3 4 -6 6 2 -11 -5 3 -13 -2 3 -3 -10 -3
3982 -3 -7 -9 -4 5 -7 -8 -1 -2 -9 11 6 3 3 14 -3 3 9 4 2 4 6 13 -3 14 5 -7 -2 0 -3 10 -3 -7 -9 2 -10 -11 -7 -2 -12 -13 7 -3 -1 -4 -2 -13
4028 -13 4 8 -6 4 10 11 -2 0 7 2 -5 5 13 1 18 -3 4 7 4 -3 -1 -3 -3 -3 -3 -4 -12 3 -2 -16 -11 -6 -5 1 -5 -18 -11 -7 -14 -10 -8 3 5 -4 4 3 -9
$$ packed form
3706bJ3j8J1J2j1oJ4j7jPmNkMkj0Qmj1NRj2kJ6j2MmJ2pNJLrJ5Jj3NPj1%MkQRj2
3751Fj5J9%qPnkrQPk4QJ6rj8K1pj6K0Lj5RKnqPMj4J3J1opK2j3KNqmJ5kmlJ%qJ0
3797Flj5J0J7j7%Pkj6J5qnKJmkOJj0NOqJ4%rLJ3pnJ5pj1ROJrJ8lj0OjpKJ2j5j5
3843a4K2j2nLJ4j6jQ%j0Mm%MoJ1j2J7ljQJrjRj1kJ4%j5J5Mj0JNJp%KkJJj7kJ6
3888Amk0J6jrRLpPnJ1rmQ%rJ7j2MJ1jpJ1jj4KJ5Ko%Qj4Mj%oJ3Jj6KJk%LjoL%j8
3937b1J9Kj4PQj5NRMj4QNkLOnnJ7rj4J3Mj3RoJjRj0lmJ0Jj0J2mj3OQj6J1NopP
3982cmkNRj2jPjpK0nl%J1j7OOnkKKPj6J7rj2NKlJ3j3mkJ1j2jMNj0jK0j0KlKj1
4028a3J7Mj4J0OJj3KPnpJ0Qj2J7k1PLlpKk%%%jqJ5nj4NNJOoj3PMpMKJ1KrQjj2
$$ plain form
4075 -9 1 1 -6 9 9 6 10 14 7 4 5 7 -5 0 1 -5 -2 9 -5 -7 2 0 -10 -15 -6 -10 -8 -5 1 -11 -12 0 -7 -6 0 -11 -12 4 2 -3 3 1 0 8 1 4 -6 4 10
4124 10 5 6 6 8 -8 4 -1 -2 8 1 -6 -1 -1 -3 -7 -5 1 -9 -4 -7 -10 -10 1 -2 -12 -8 -5 -16 1 4 2 -4 -3 7 -1 8 7 6 8 11 17 8 12 10 5 7 8 -3 -1 -3
4174 -3 7 -4 6 -8 -15 -4 -2 -11 -9 -5 -10 -7 -10 -7 -15 -5 -8 -7 -10 3 1 -9 -3 7 2 -2 5 -6 -7 11 14 0 0 12 6 -1 6 8 2 3 2 -13 6 -5 -5
4219 -5 -3 -2 -6 -7 -4 -3 -24 -15 -4 -17 -10 -9 -7 -5 -3 0 -4 -5 2 -5 1 6 -2 -4 2 9 3 10 20 8 3 13 13 -3 3 6 1 -6 5 -4 1 -2 1 -6 0 0 -3 -10 -6 -7 -13 -11 -11
4272 -11 -8 -10 -7 -12 -12 2 9 -7 4 -1 -9 -1 13 1 6 10 13 4 5 17 5 1 13 16 -3 4 6 4 4 8 1 -4 -2 0 -13 -6 -2 -15 -17 -2 -11 -12 -2 -8 -14 -5 -2
4319 -2 -3 3 10 0 1 6 0 4 7 6 7 12 8 -1 0 14 2 -4 -4 2 1 7 4 -3 -8 -4 -8 -6 0 -8 -8 -7 -2 -7 -9 -6 -6 -6 -4 -6 -5 -8 7 5 -3 0 0 -9 6 6 0 1 3 14 -2
4374 -2 5 11 6 8 10 11 -4 4 -4 1 -4 9 -3 -14 -2 -1 -11 -12 -1 -11 -10 -4 -8 -9 -6 -4 -5 -2 5 -3 2 -1 8 -1 7 -4 4 13 11 5 20 16 7 1 9 18 5 12 8 6
4424 6 10 4 -4 -2 -10 -8 -8 -1 -1 0 -7 -1 -4 -16 0 0 -10 -8 7 -7 -1 4 4 4 -9 10 3 2 3 8 3 4 8 -6 3 5 6 5 -1 5 2 8 7 -1 1 2 -2 -12 -5 -2 -13
$$ packed form
4075iJ0%pJ5%lMMplJKj2NJoLJ1j4kRkj0nRmKLOj2jJ2pJOj1jJ6knOkjQpLj0J0O
4124A0nJ%Kj6J2njJ0ppN%kmKOj0Nll%J1lj0MLj1J7LkoJJ0qRjjKLOrMknKJj1Kk
4174cJ0j1J0j4pJ1KrKMnLlLqJ0lJlJ3kj0OJ0nmPj1jJ8Lj4%J2opPKoJjj5J9j1%
4219eKJmjLJk1RJ1j3PJKKKLmjPpONqkOPoPJ0j2nJ0%j6OLnpJ1rNlLpO%lpMjoK%
4272a1LkLn%J4Pj6J1nqQJ4j2NMLrJJ2j2mJ2Lj9PKk%MpnKKj3PMj3kJ5rjJ0ooRL
4319bjOPj0JNoMLjJNmrJJ4j2o%OjOlpnMmKOq%JNnkL%%KkJlJ5kqL%rJ5%oJKJ1j6
4374bPOnKKJj5QqNnJ3j2j1J2Jj0jJ1j0JOmjLKjLPqNlRrQj1QRkoJ5mroQRj3Pmk
4424FMoqKqK%P%JpOlj2J6%j0KJ5j4ON%%j3J9pjJNnJMj4RKJjoOlOjqKJmj0PLj1
$$ plain form
4475 -13 -9 -3 -11 -13 -3 -3 -12 -5 -15 -5 2 -2 -5 -5 0 6 -3 1 0 8 5 12 -3 6 14 16 -5 10 14 8 4 7 4 -7 7 6 -2 -2 -12 -13 0 0 -16 -3 -1 -5 -4 -7
4523 -7 5 -1 -4 8 -4 0 9 0 0 8 6 11 4 14 12 1 13 22 12 9 17 6 2 4 1 6 1 7 -8 -4 -6 4 -14 2 -5 -6 -4 0 -8 -1 -7 -4 -6 -1 -9 -6 1 -1 6
4572 6 -4 15 16 1 2 6 3 9 18 -2 16 11 4 9 2 8 15 8 4 8 -4 -2 -1 0 7 1 -16 -3 1 -3 -10 -6 -6 -2 -5 4 3 -12 0 7 -1 4 1 -1 3 8 1 13 7 11
4622 11 9 3 12 7 5 7 5 -1 11 3 -1 -5 -2 -3 -6 0 -10 -6 -6 1 -14 -10 -2 -14 -14 4 -11 -14 -5 2 -3 2 2 3 4 0 3 1 1 7 -2 5 7 9 3 6 0 8 5 1 1 -2 2 -2
4676 -2 -6 -7 -4 -10 -7 -3 -19 -12 -13 -9 -12 -11 -15 -15 -12 -11 -15 -9 -7 -3 -4 2 -1 -2 2 3 1 0 9 3 5 11 6 8 9 8 8 3 8 3 3 3 6 -16 -8 1 -7 -7 -2 -13 -14 -6 1 0 -4 3 -2 -3
4734 -3 0 -1 7 1 2 4 -1 2 0 -3 9 0 8 -1 12 15 7 9 9 4 4 11 -1 1 5 -2 -4 -11 2 -3 -6 -6 0 -13 -5 -2 -5 -4 -6 -8 -2 0 -8 -3 6 4 -1 5 7 4 3 9 7 -4 9
4789 9 5 11 4 12 1 9 4 -2 6 3 8 5 2 -6 -15 -4 -5 -2 -12 -14 5 -10 -4 -5 -14 4 2 -8 0 0 -4 2 3 7 4 -1 9 -1 5 13 7 0 13 13 10 12 6 9 -3 -3
4839 -3 3 1 -4 -7 -10 -4 1 0 -8 -2 -5 -7 -13 -2 -7 -10 -2 3 -7 -5 1 0 -6 1 -1 -6 4 8 1 9 15 5 10 2 17 2 12 6 2 6 11 0 -1 4 -5 -10 -5 -6 -10 -14 -9 -7 -10
$$ packed form
4475a3MOqkJ0%rPj0J0Pml%NOrMjQlPj5RQKk1J5MomLlj1J4jq%j0jJ3%j6J3KmJl
4523gJ2olJ2j2MRr%QkNpJ0kj1J2Rj0lQj1mKlNnOj5MkJ0j8J6pjKMqPoLkNqLPkP
4572Fj0J9Jj5JMlORk0J8npNpOPpmMj2KJJPoj7J3MmpM%MlRjj5J2PqNlkMNpJ2oM
4622A1koRnkKkoJ2qmmLjlOj0M%Pj5MQj2%J8j5lRPnN%JJmLk%OrPKKoLoQlm%lMm
4676bmjLoLMj6PjMlJm%LJmOKMjOljMJkjRoKOnKJj%nNn%%Lk2QRq%Nj1jQPjmPnj
4734cLjQoJKnLklJ2rQrJ3LqK%n%Pj2KMpkpJ3nl%Oj3QLlJkkOKqNRknOKljOkj1J3
4789ImOpQj1QnoQlNllqrJ1jLj0kJ9j5OjrJ8kj0Q%mOJMlnJ0j0OQopJ3%lKoLj2%
4839cOknllONjqOlkoJ1nlQNj0KOjoPknJ0MpQOj0NqJ5j5J0omMNj1jNrnNjmmNKl
$$ plain form
4892 -10 -4 -7 -16 -18 -3 -6 0 1 0 -1 4 3 -7 10 5 14 1 4 5 9 11 11 10 4 9 1 -7 9 7 -11 0 4 1 0 0 -12 -3 -1 4 -5 -11 -11 -6 -1 -4 -10 -15 -9 -13 -13 0
4943 0 -2 2 -4 5 0 -4 7 5 2 8 7 13 2 13 7 12 1 16 8 -3 6 4 -3 -2 0 4 -2 1 -9 -9 -5 -1 -12 -5 10 -2 -5 -2 4 1 10 4 3 2 5 0 3 13 11 3
4993 3 2 3 6 11 9 3 7 13 6 -8 15 10 4 -5 11 -2 1 0 -5 -9 -3 -5 -9 -7 -15 -4 -6 -4 -9 -15 -7 4 -7 -3 -2 4 4 5 10 0 13 9 7 6 -4 13 6 9 3 2
5043 2 2 5 9 6 8 1 5 -6 2 -5 1 -2 -7 -17 0 -6 -11 -18 -2 -17 4 -6 -5 -5 -5 -1 0 -2 0 1 -1 2 0 4 6 3 -2 -4 13 3 4 8 -4 7 11 4 2 -4 3 1
5093 1 -10 2 -8 -2 -7 -4 -13 -9 -5 -8 -7 3 -4 -4 -4 -5 -9 -6 2 8 2 -2 5 6 10 -1 12 0 9 6 7 8 -9 2 0 7 1 3 1 2 1 -7 -5 -2 -7 -5 -4 -11 -9 -1 -11
5144 -11 -4 -11 -9 -7 0 -1 -7 4 8 -2 3 2 5 -6 14 4 6 11 10 5 8 13 5 -2 9 2 -2 6 5 1 -6 -2 -12 -4 1 -2 -12 -11 -4 -9 -7 -2 -7 -6 -7 -7 0 2 -7 -8 -5 6
5196 6 6 5 5 1 6 8 13 15 7 6 14 8 11 13 8 -2 2 4 0 7 4 -5 0 -4 -9 -4 -6 -3 -8 -2 -10 -10 -6 0 -6 -9 -6 1 -10 2 -1 1 -3 0 4 -2 15 14 -5 13 12 1 5 14
5250 14 9 6 3 0 2 -6 14 -6 2 -4 -6 -11 4 5 -2 -5 -10 -18 -6 0 -3 2 -2 4 4 -1 3 10 3 7 1 4 1 7 3 14 13 6 10 8 11 4 10 4 0 6 7 11 4 1 -5 -1 -3 1 -5
$$ packed form
4892a0OlrkJ5lOJjjNjj0J7nRj3LJMK%joNqqJ6kj8J1Mlj%j2RKNro%NNlonOm%J3
4943@kMoRnmJ1klOjOj1J1oNj1J5qj1RkpJKMoLj0%MMj1PJ5j2lLOlRojjLnLJ0kq
4993CjJLNkoMOpj4K3norJ6j3LjnmOkmKqJ1kKnoQJ1j1MJO%JNj0J3mkjj0J7pLoj
5043B%LMlKpMj1QpOlnj0J7onpJ6j5K1j0J%%MJkKJkLkMKlnkJ7j0JMj2J1MpkoPk
5093Aj1J2j0OnLrMMlJJ0p%%jmLQOomPJMj1J3j2RlJJj7J1kPoKkJjqKLnKJpKQj0
5144a1PpKKPjoJ1Mj0NjLj1K0j0KNjnLNqpJ1pmQjmpMj0QNlj0JPnKNnJj%PKrjLJ1
5196F%j%mNKNKqjQoLKnj0MKmPlrNmnNkLnOq%MOolLPj1J2lKmLMoJ7jj9J8jj1MR
5250A4nlllKqK0k0QoknJ5JplnqJ2OlNmO%nMPpMoLlOmJ1jpMkLpOomOJMploMkMo
$$ plain form
5305 -5 -6 -5 -7 -18 -3 -9 -18 -14 -14 -3 -8 -3 -2 -5 4 2 0 10 10 8 5 -4 6 -2 12 8 14 17 13 9 5 15 2 -4 1 4 4 -5 7 3 -5 -3 -2 -2 -7 -7 -3 -5 -8 -9 -4 -4
5357 -4 -5 2 -1 5 3 5 11 7 7 -2 6 10 6 7 12 12 4 17 1 9 2 8 12 9 -6 -4 7 4 -11 -8 1 -8 -8 -3 2 -16 -11 -3 -19 -5 -4 -8 -6 4 -2 -4 1 0 -6 3 10 11
5409 11 -1 10 11 8 8 8 5 2 11 4 -3 5 5 -5 -3 -3 -1 -13 -4 -1 -12 -6 -12 -11 -11 -7 -10 -16 -4 -3 -20 -14 0 -11 -10 -4 -4 -4 4 -3 -4 2 13 -3 3 0 5 5 0
5458 0 -1 1 -3 3 4 -9 -2 -1 -9 -2 -11 -13 -8 -3 -3 -9 -2 -8 -6 -5 -9 -8 -7 -9 -14 -6 -3 1 -3 1 -1 1 6 7 5 2 11 13 10 10 7 -1 6 6 21 -1 4 7 10 4 4 -9 -1 -4 -5 -5 -10
5515 -10 -8 0 -6 -5 -6 -1 0 1 2 -4 -7 3 -1 14 2 2 5 9 5 8 10 8 7 9 13 10 10 3 -2 1 4 4 -3 0 8 1 -8 -8 -9 -12 -13 -3 -14 -12 -11 -16 -6 -13 -4 -8 1 -11 -9
5568 -9 -13 -9 -1 -4 5 -4 1 8 -2 3 6 9 8 12 5 7 7 5 5 -3 1 -7 -6 -3 -7 -9 -8 -5 -10 -7 -9 -6 -10 -11 -13 -3 -15 -7 -5 -12 -13 -7 -10 -10 -3 -1 0 -2 5 -2 1 -1 8 1 5 7 3 4
5626 4 8 -2 -7 4 5 -2 -2 1 -6 -4 -1 -7 -17 -11 -9 -12 -14 -9 -17 -8 -14 -11 -9 4 -1 -3 9 7 1 0 12 10 1 4 2 11 -2 6 1 5 -2 3 0 -1 13 4 1 -8 -3 -10 3 -8
5678 -8 -10 -11 -5 -8 -17 -9 -1 -23 -9 -5 -10 -9 -5 -5 -1 8 1 -7 -1 -2 -1 10 6 0 4 -2 4 7 10 15 2 10 10 3 -5 -4 -2 -8 -7 -2 -9 -7 -5 -3 -14 -7 -7 -12 -3 -12 -16 -7 -1 -3 -12 -8
$$ packed form
5305ejJkj1J5orM%J1nNJlRkkJ0%klrJ0qJ4mOLmmmJ0j3oNL%rJ2mqKJ%n%MkljN%
5357djPlOkKOm%rQMmJN%qJ3j6QpOMlj5KJ1lj5LRr%NNj8NQj6J4JmKJ0okNjoRPJ
5409A1j2J1Jl%%llRppQ%j0K%Kj2RLj1OoJ%MloJ2Jj7OJ4j1JO%%QpjOJ1j6OlN%n
5458@jKmOJj3PJqPrkNN%oPoKJmJJknQLMmMkKNJklRKl%lqP%J5k2NLLo%j3Qlj%n
5515a0KQoJjNJJJolJ0mJ5j2%LMmLKkjKMl%pnLL%pLQpr%jljJ0j1KJnJ0pRmRj2K
5568imMQlRrNPj0NLLjMpK%k%qMqJLmkJLnLkLmjkJ0j2QKpjOl%PKJkPpLkRpMKmJ
5626DMj0nJ1Jp%LpKLoj0OKlkNqRoLKJ3nkJ2kojJ2krLkRj3QnMpNljJ4rlrNpJ3j1
5678hkjOlrQQk2J4MnJM%MRpqOjJJ1moMoOLLNj3Q%pqJKoJNpKKKj1P%nRrmROkrM
$$ plain form
5734 -8 -3 -15 -2 0 -3 2 4 8 7 2 9 1 5 5 2 -2 4 -1 7 -4 1 -4 -4 -1 -9 -14 -5 -3 -16 -8 -10 -8 -17 -5 -10 -10 -4 -5 -13 -13 -1 0 -17 -4 -1 2 1 -5 -5 -2 8 1
5786 1 2 7 -2 -2 3 4 0 2 8 0 1 -2 -3 -7 -3 3 -6 -18 -11 -16 -7 -5 -11 -12 -14 -11 -10 -3 -4 -3 -7 3 5 0 -4 0 1 -6 2 7 0 6 4 5 1 2 2 1 0 -4 -9 4 1 3 -3 -1 -7 -11
5844 -11 -6 -15 -6 1 -6 -14 -12 -1 -5 -13 -8 -8 -9 -9 5 -5 -3 1 -2 -10 -5 4 -1 9 10 5 0 5 1 0 4 5 1 5 10 -3 -4 -1 7 -3 -2 -9 -7 -13 -7 -10 -11 -4 -7 -15 -8 -9 -18 -7
5898 -7 -4 -9 -10 -3 7 4 2 6 2 5 7 1 6 15 9 8 2 8 8 2 7 3 -6 -2 8 -6 -8 2 -6 -11 -1 -8 -6 -9 -7 2 -12 -7 -6 -8 -1 -6 0 -11 -1 1 -6 8 0 3 -1 4
5950 4 2 2 2 4 4 10 13 7 10 6 0 0 7 4 5 -3 -2 -2 -2 -1 -3 -9 -8 -11 -10 -10 -7 -20 -10 -10 -9 -6 -1 4 0 -1 1 7 6 10 1 6 -1 14 1 4 11 5 -8 -3 6 5 9 14 2
6005 2 5 0 0 -3 -3 -7 -6 3 -7 -7 -4 -7 -4 -9 -1 0 3 3 1 -4 -3 6 -10 -9 2 4 5 4 14 10 6 1 9 -3 7 4 3 5 3 1 0 -2 -2 -3 -1 6 -15 -9 -1 -1 5 -13 -13
6058 -13 -7 -2 -11 1 -7 -13 3 -14 1 1 -1 -3 0 6 6 10 8 8 -1 11 10 2 11 10 3 9 12 -1 3 4 -5 -18 -9 7 -8 -2 -4 -5 0 -8 -10 -11 -11 -6 -8 2 -5 5 -6
6107 -6 -3 0 -1 8 8 7 -5 8 11 6 4 9 9 3 2 3 4 3 3 6 3 1 3 4 3 2 3 -2 -12 -5 -4 -10 -5 -2 -7 -10 -4 -7 -9 -3 -2 -4 -2 1 6 1 8 7 2 4 -3 12 1 11 11
$$ packed form
5734hNj2J3KlNKMjnPqM%lmOnQj1Nn%LqnRKj3QkKrJ2n%Ojq%J2Jj7J3LLjo%LJ0p
5786AJNr%NJmKOqJljmMOrj2PnRKojkLJPjJmJ0KnmMJpQNpOkJmJ%jjmnJ3lKoKom
5844a1NrRPpqKJ1mqN%j%J4j0KMlqNRnJ0JnnNmjMJmMNj3jLQj0JpKoOljPlqPjrJ1
5898gLnjPJ0lkMmLKoNRojoO%oNmrMJ0j4kJ0qnJ0pKlKRj4NJkPnOj1J0KpJ4qLmN
5950Dk%%K%OLoLmo%PlJqJ%%JkoJlJ%Lj3J0%JLNNmjKOjMrNpJ5j3LPoj3NRjMNj2
6005BLn%l%mJRj0%LlLnQJL%knJRj6JJ1KJjJ0mmnQj2J0ljKkkjk%jKPk1OQ%Oj8%
6058a3ONrJ2qoJ6j7J5%kkLO%Mk%rJ2jqRjpOLj3MJrj3RJ6j5OkjNqkj%NkJ0pJ0j1
6107fLLjR%jj2J3LnkN%ojJJj%LlkKJjjJnj0PJoNLnlOlkOJkKLNnPjnKpJ5j1J0%
$$ plain form
6162 11 7 20 18 1 2 16 5 0 1 8 1 -5 2 -3 -3 -2 -7 -12 -11 1 -5 -5 -12 -9 -1 3 4 -6 1 3 7 1 2 -1 9 7 3 18 7 12 0 8 11 -1 10 5 6 2
6210 2 3 0 3 -2 2 5 -10 -7 2 -14 0 5 -3 6 -15 -6 -7 -8 -5 0 2 3 4 -1 1 -5 3 -5 9 14 5 11 7 12 5 2 7 1 8 5 8 8 12 -2 -6 5 -1 -5 -3 -9 -12 -5 -10 -6
6264 -6 -9 -17 -13 -5 -13 -10 -9 -5 -1 -10 -6 5 1 1 -8 1 0 1 12 -1 4 5 13 3 -7 18 9 4 0 9 7 5 5 9 3 -7 2 -2 -2 -5 -3 1 -8 -14 -7 -6 -2 1 0 -10 -6 0 4
6317 4 2 7 2 5 1 4 13 11 6 12 14 10 16 11 4 2 10 6 21 15 -6 -7 -8 -4 -6 -5 3 -3 0 -7 2 -1 5 -2 -7 -6 -1 -2 -9 4 -1 -1 9 7 0 5 10 4 4 7 8 10 2 15 10 13
6373 13 7 5 9 9 -1 9 -2 2 1 -2 2 -9 -9 0 -8 -8 -7 -6 -5 -8 -7 -10 -3 -6 -3 -6 -5 -9 -1 3 -2 1 12 5 9 9 2 3 -2 7 4 10 -3 1 7 -12 -9 6 7 -10 0
6424 0 4 -2 -5 -10 -9 -4 -3 -5 -16 -4 -2 -10 -6 -4 -10 -2 1 -8 1 3 -1 -13 -2 8 0 1 9 2 4 5 11 5 -2 8 4 4 9 0 9 1 -6 -6 0 -3 -10 1 -2 -7 -5 1 -6 -13 -1
6477 -1 -1 1 -6 -8 1 9 -3 -3 4 7 13 11 10 0 5 1 12 6 3 7 15 18 3 10 3 -2 -2 0 10 -1 -2 1 3 -2 -1 -4 -2 0 -6 -3 -9 -2 0 2 -5 1 -3 1 3 -4 -4 5 0 3 9
6532 9 3 -1 8 11 7 0 8 -2 5 12 15 8 12 0 -7 -3 2 3 0 -5 3 -3 -5 -8 -14 -8 0 -10 -10 0 9 0 8 0 -3 0 -3 -2 -5 8 6 10 2 9 6 12 12 8 13 12 7 4 10 4 -6
$$ packed form
6162A1mJ3kj7JJ4j1nJPpoPn%JnnJJ2o%pLQMJj0PKMoJlJ0kmJ5j1Nj2QLj2J1nJm
6210BJlLnMLj5LRj6J4NqRk1RjjLNKJJnKoQqJ4NrOmNplNoPlL%Mj4mJ1omKolPnM
6264flqMQqLJMMrMJ1m%rRjJJ1j3NJQj0j0K5rnmRkk%Moj0Rm%lKMroPJMLjj0MOM
6317DkNnLmLRknOKmOnpkQmJ5ok1jjMkJQoLpRlOpnJNjpJ3n%J0kpNNo%LJKqJ3nL
6373A3okM%j0J0j1MjlMj1%Rq%JJJlJlPlLlJmQMnLJ1pM%pJnRlOj3MOj9LJ5Jj7J0
6424@MolnJNJkj1J2KqMKoQLrRKmj2J1J0qJQpKJOopJ0m%NrRqp%OlpJ1lnKOppJ2
6477a%KpkRQj2%PLOkjj0NmJ1olMQLj5Ppn%KJ0j1jLKnJlKKoLoPKKpOmMKp%RnLO
6532IomRLmpQj0PPLpMj2pMNJlnQokloOQj0%J0RrQqlLlJlJ3kMqPlO%mNjnlOoj0
$$ plain form
6587 -6 0 -2 -1 0 -10 -4 -5 -9 1 -8 -3 -5 -6 -6 -6 -4 0 -1 -3 -6 0 0 5 -4 -1 2 6 9 14 6 2 8 10 5 12 6 9 -1 4 1 -5 3 -3 -2 4 4 -8 -8 -1 -12 -9 -6 -20 -6
6641 -6 -11 -2 -4 -1 6 -6 -4 2 -1 -4 -2 9 12 1 4 11 7 9 3 -4 11 7 2 8 12 3 11 -4 9 -12 -2 5 2 3 -5 -2 -5 -6 -8 -5 3 1 -1 -7 -4 -2 -10 2 0 -8 -2 6
6693 6 5 4 -6 1 13 -1 12 6 0 2 8 14 20 3 0 5 3 1 6 5 2 0 3 -4 -5 -1 0 -8 -5 -3 -6 -5 -5 -6 -6 5 8 -1 -4 3 -3 3 5 11 4 3 17 7 2 13 14 11
6745 11 8 2 5 5 9 8 6 -3 3 -2 0 6 -3 -2 -2 0 -7 -3 -2 -5 2 0 -4 -10 -9 2 -8 -4 7 2 -5 2 6 10 6 0 5 16 11 6 14 13 12 0 14 6 5 5 3 5 4 4 2 2
6799 2 0 -1 -10 -3 2 -8 -13 -5 0 -11 -2 -7 -4 -2 -4 -2 2 2 -1 -3 1 2 5 7 12 8 6 14 6 -1 4 4 8 -4 0 8 2 -7 5 -1 3 -8 -1 -6 3 -6 -1 -5 -13 -9 -8 -13 -1 -7 -2
6854 -2 -5 -9 3 1 2 6 -5 5 13 0 -1 5 6 15 6 3 10 9 6 -3 12 -3 6 5 4 9 8 -4 -4 -1 -4 1 -5 -9 -13 -15 -6 -8 -4 -7 -6 1 5 -2 -5 3 -2 8 11 11 -1 3
6906 3 17 4 9 11 23 14 4 20 8 11 3 11 5 -1 3 6 0 1 -5 0 -3 2 -7 -2 1 -2 0 -8 -6 -2 -3 4 -6 5 7 1 8 9 0 5 9 5 0 -1 15 9 11 12 0 9 8
6957 8 12 4 1 2 2 0 5 3 10 -1 -3 -1 -15 0 -9 -3 -6 -3 -3 0 -4 3 -1 -6 -10 11 -2 1 8 5 6 14 4 7 15 10 8 15 9 12 16 0 11 8 4 0 1 -9 2 -2 -5
$$ packed form
6587fOkJJj0OjmJ0rNkj%%KMjklO%NrLLMLNqmOKnPoLj0NloQoJO%j2%Pj1LLj4J4
6641fnRkLPj2KOllKJ1Lj1LPmKopJ5mnOMrQj5J3k1J0PlJqLljkLQkkoLKqJ2kqOQ
6693Fjjj0PJ2j4J3ooKOOOj7lNkkNjlkLpjMJqLKlJ%j%J1LrlPoOKOpjJ4j0nJ1Jl
6745A1loL%MjkrOnKOrJ%KpMJlPkmoJJ1j0MJ1npPMMmoNJ1nnQjjj2J4qj%kKj%k%
6799BkjrPNj0nQNj1RnLKkKM%lkMJLKNmkQqpN%Mj2MQorJ2oMj1PnRrNmqMJnJ2oN
6854blmJ2kJMj1J0Qj3jOJRrlPjlrJ5j5RjjNjj2%LlNommkRkMlJPMplQnJ0L%j2M
6906CJ4j3NKJ2rj0J6j2LqQooMLoJoNlNrNLlKqKMjPj0J1KoPJrNMmnjJ6oKJj2Rj
6957HMqlJ%kNkPj1kKj4J5rOlL%LmPmnmK1j3LPlJQj0LQnkPoLMj6J1lmmJj0J1ml
$$ plain form
7008 -5 -4 4 -3 5 -9 -13 -6 0 4 -4 2 2 -8 0 1 2 9 4 6 11 10 2 5 6 9 7 5 0 7 5 -5 6 0 5 9 -2 -2 0 -4 -7 -10 -4 -6 -4 -8 -2 -5 -2 -7 1 -3 -9 -9 -1 0 -7
7064 -7 -2 8 -1 6 3 2 0 4 6 -1 0 5 4 5 4 10 3 2 -1 4 9 5 -1 2 7 3 3 -1 -1 5 5 -1 0 0 -8 -4 -1 -3 -6 1 -9 5 2 -6 4 4 12 0 -2 7 -3 2 10 11 3
7119 3 -2 12 16 14 9 6 7 2 7 -2 -8 2 -2 -11 0 1 -13 -5 -12 -9 -4 0 -7 -3 -10 -6 0 -1 -3 0 0 6 4 5 3 1 4 14 11 2 2 8 8 7 7 3 -3 5 -2 2 5 1 5 2 5 1
7175 1 5 -5 -12 -1 -4 -9 -2 -9 -7 -8 -9 -10 -3 -3 -6 -4 -6 3 9 6 2 6 -1 6 9 5 9 10 4 5 5 5 4 7 -3 2 1 -7 0 -10 -5 -6 -4 -9 -10 -3 -11 -4 -6 -13 -8 -13 -2 -12 -8
7230 -8 -5 -2 4 -11 -8 7 -1 2 -1 3 10 7 4 8 10 3 -2 10 3 -7 -2 3 -4 3 4 -16 -8 -3 -6 -1 -8 -7 -13 -9 -2 -15 -5 -4 -4 -11 -7 -7 -2 -10 2 -2 0 -4 0 4 5 5 12
7283 12 6 7 6 11 -4 -1 5 19 10 -7 3 0 -4 -1 -1 6 -1 1 -10 -3 -4 -1 -8 -7 -2 -8 -4 1 4 -5 -1 2 2 3 -1 4 6 2 9 4 -1 6 7 4 12 12 7 11 7 6 -1 -1 4 3 0
7338 0 7 -1 -1 -7 -5 -6 -8 -12 -4 -6 -9 -5 -4 -3 5 2 -19 12 5 3 2 2 0 13 4 1 6 4 13 0 16 4 1 11 9 -1 6 8 1 4 2 -8 -3 -6 -7 -6 -8 -5 -6 -2 -8 -11
7390 -11 -2 -2 -5 -4 -6 5 -5 0 8 8 0 3 12 10 7 2 4 8 10 9 5 6 13 9 6 4 6 2 5 2 -10 2 1 -5 -1 -12 -1 -12 -6 -15 -3 -9 -7 -10 -12 -12 -5 -4 -6 -3 1 2
$$ packed form
7008eJQpQj4mPOMqO%j0QJJPnKNjqLJLkknPkj0J1oNMj1%KmllOkKmOlLnQmo%QJp
7064gNJ0rPljkMKpJNjJjOpjlNNmoLNm%m%O%oJ%qMLklPj0J4lqJ0%Qj2kRj0NQJq
7119CnJ4MknlJnNroJ0mrJ1Jj4QpLNMpMpMOjkL%OkJkkLJ0lr%O%j%moQpMLmMlLm
7175AMj0pJ1lnPpKjjjP%lKkROlmMpPLmMJoJ%%jLj0NjqPj0NjKnjPqPkpNnJ1j0M
7230hLLOj5LJ5qLlMPllMKpnJ2pj0NNpPJk0QNlNpJoMPj3J0J%pM%NqJ2mKmMMJ%P
7283A2oJjNj5LOJ4rj7J0lmL%PpKj1PjLpJNoMNLrML%JmNKmPnnPJlQ%nMmjp%Njl
7338@Pq%oKjkmQklMJJQlk1L1pkj%kJ3rlNkRj3J6j2lJ0kj0PKpLkj0NljJkLjMol
7390a1R%lJkJ1j0NQ%qLRklnKMKjmJPmlkKmLlj2J2joMj1J1j1OrJ2oKlk%PJkLMJ
$$ plain form
7442 2 -2 4 -5 10 5 10 -2 12 0 5 9 8 3 8 0 4 12 6 0 -1 -1 -15 -1 -2 -6 -14 -8 -3 -7 -11 -4 -9 -18 3 -4 -1 6 3 0 0 5 1 3 8 4 7 14 13 7 6 1 3 12 11
7496 11 6 6 4 8 2 -6 5 0 -5 -6 -10 -6 -1 -8 -7 -14 -5 -10 -9 5 -9 -11 -4 -6 -4 -9 4 -6 4 -5 7 4 5 4 8 5 10 9 11 13 10 3 4 8 5 1 6 4 7 -3 1 -2
7548 -2 -9 4 -8 1 -7 0 -8 -8 -5 -11 -2 0 -3 -5 1 6 -6 -3 4 7 9 5 9 3 14 7 9 1 11 5 12 8 10 4 2 9 4 -1 6 0 -6 -5 -2 -2 -20 0 -4 -8 1 -10 4 -13
7600 -13 2 -4 -4 1 -7 -5 -3 13 11 3 2 1 6 2 16 3 4 9 10 12 10 5 3 2 0 9 0 -2 -4 -3 6 -12 -5 -6 -3 -6 -8 2 -4 -2 -6 -3 -8 -9 -11 -14 -3 0 3 1 2 6 -4
7653 -4 1 13 6 4 12 7 12 -2 4 8 7 1 -2 1 2 7 8 -1 -1 -2 -2 -2 -1 -8 -7 -4 -9 -6 -5 7 0 3 -1 2 4 6 -1 -6 4 -3 9 3 8 9 4 5 3 14 8 9 0 2 14 8
7707 8 -3 1 -3 3 -2 2 1 -5 -8 -7 -9 -4 -10 -6 -5 -11 -12 -8 -9 -6 -4 -14 5 -1 3 1 0 7 2 8 6 6 7 10 3 14 10 6 16 3 -1 3 1 9 5 5 -1 0 -6 -2 -5 -3 -5 -2 -9
7762 -9 -1 -8 -6 -5 -16 -6 -9 -2 -5 0 -10 -3 -3 4 0 -6 4 6 13 4 9 9 0 6 5 10 4 3 2 5 -4 2 -2 0 -7 -7 -3 -12 -3 -6 -3 -3 -8 -9 3 -8 -9 4 1 -5 -1 -8 -5 6
7816 6 9 2 7 5 6 0 6 6 -1 11 9 8 4 8 2 -5 4 2 3 7 -3 -5 -4 -4 -7 -10 -6 -5 -2 -11 -2 -1 -7 -2 -4 -5 5 1 1 -7 -3 1 4 8 3 4 11 10 9 13 15 14 7 0 7 3 2 6
$$ packed form
7442BmOrJ5nNj2J4j2NMjnNqMQooj%j4J4jmqONmmPnrK1pLPll%NmKNmLPjojnKRj
7496A1n%kMoqJ1nnjmMNpJpRnJJ4j4kPkKnJ3j0J0rJ2lJjMlNjKKlpJMlmNkLj0Ml
7548bpJ3j2RqPq%LoRKlkONj2LPLKmMoJ1pKqJ0oPmKokPnnPooJL%j8K0mmRj1J4j7
7600a3J5o%NqKKJ6kqjjNmJ4j3JNJKknkjkRrkkJRj8PjLlkJ0oKmLnjklJ1LLkJMj0
7653dNJ2pkQnNj4OMjolLJNJr%j%%JpJLnLJJ2pLmLKKpnJ0pJ2oNJnJkJ1oJrKJ2o
7707Hj1MmOnMjolJkNoMJojMjLKj0J9oMkjPnOk%JLpJ1mmJ0j3mMkQm%oJoMlKkLp
7762iQpKJj1J0lPlNj0P%PmoJ0KPrN%rOjNojjLrOmKp%MrRlL%njJ2j1jJ3loMpLJ1
7816FLpNkJoO%pJ2kjmMopRkJMj0kJ%llMJLrRJoNkjJ0m%qMMLMnJPjjMKjppPmjM
$$ plain form
7874 6 5 5 7 -3 5 -2 0 -4 -2 -2 3 -4 -6 -5 -14 -14 -2 -3 -5 -12 -9 0 -5 6 4 9 14 8 10 4 16 12 4 14 7 9 1 17 7 15 -2 6 7 1 -2 5 3 -6 -7 -4 -12 -9 -4
7927 -4 -19 -3 0 -11 -4 -4 -3 2 -19 -2 -7 9 0 1 6 12 6 6 9 9 4 13 6 6 8 13 12 8 14 2 12 6 7 -4 -4 -8 -2 -5 -10 -7 -6 -12 -12 -6 -8 0 -5 -5 -1 0 1 -2
7979 -2 -2 3 -1 3 -5 1 3 5 8 5 10 4 3 1 9 4 8 10 0 7 -4 0 -3 -2 3 -3 -4 -3 -15 -10 -18 -11 -6 -6 -8 -6 -10 -5 -3 -2 -14 -7 -7 -7 5 3 1 1 -5 1 4 9 2 4 2 10
8035 10 5 1 7 3 2 1 8 4 -4 1 -7 -4 -1 -9 -1 1 -9 -12 -10 -4 -12 -9 -9 -7 -7 -6 -2 -2 9 7 0 -4 0 4 14 5 7 14 13 0 5 1 2 -6 3 1 2 2 7 0 -8 -2 -2 -3 -12 -2
8091 -2 1 -1 -9 -5 -14 -8 -5 -2 -3 -3 -10 -5 -6 -6 -4 6 7 2 6 3 11 14 2 3 13 7 7 8 10 4 -2 4 2 -1 0 -1 -7 -2 -7 -18 -1 -14 -9 -4 -18 -5 -18 -3 -4 -7 -3
8142 -3 -6 -8 -2 0 -8 -3 -4 -5 0 1 10 1 -2 10 2 4 3 7 7 7 1 2 4 -7 2 2 -1 0 0 -14 -5 -1 -2 -10 -9 -16 -3 -11 -11 0 -9 -11 -9 -2 -1 -9 -7 -5 3
$$ packed form
7874Fj%Kj0QpKmK%NpkJr%J2jkpLRnJ1kNNoKoJ2mqJ0pKqJ6j0Qj7QJolPkrjLqLN
7927dj5J6Lj1P%JNk1J7nJ6rJNOo%L%nRp%KNjmOj2J0oJj1%mOlnLJo%OkQn%MJJl
7979b%NmMqOKKLlNojkQnMKj0Pj1MlJNojJj2NqPN%kKmNKJj2P%%J2kk%oOLNpKkQ
8035A0nmOmjjPmqNqLLqQKj0lKOqL%K%JM%J1kpmMMJ0rKPjj3NmJqRkJ%NpqO%jrJ0
8091bLkqMrOLLj%pNj%KJ0JnMlQLj2JJ0o%JKooOklJjoNnj1J7j3NNj4J3j3J5jlM
8142clkOKqNjjNJRrlJ2qKjM%%oJKj1R%lJ%j4RMjqJpJ3q%J1rkKPJqKKQ
8191C
##END NTUPLES=NMR FID
##END=
