##TITLE=1H_Ser Bzt-S-NEA
 CDCl3
 32 sc, 
 15.6.2023
##JCAMPDX= 6.0         $$ Bruker NMR JCAMP-DX V2.0
##DATA TYPE= NMR FID
##DATA CLASS= NTUPLES
##ORIGIN= UXNMR, Bruker Analytische Messtechnik GmbH
##OWNER= root
$$ XWIN-NMR		Version 3.5
$$ Thu Jun 15 09:04:45 2023 Russian Standard Time (UT+4h)  she@DPX200
##.OBSERVE FREQUENCY= 200.13135
##.OBSERVE NUCLEUS= ^1H
##.DELAY= (6, 6)
##.ACQUISITION MODE= SIMULTANEOUS
##.ACQUISITION SCHEME= undefined
##.AVERAGES= 32
##.DIGITISER RES= 18
##SPECTROMETER/DATA SYSTEM= spect
##.PULSE SEQUENCE= zg30
##.SOLVENT NAME= CDCl3
##.SHIFT REFERENCE= (INTERNAL, CDCl3, 0, 15.7039)
##AUDIT TRAIL= $$ (NUMBER, WHEN, WHO, WHERE, WHAT)
$$ ##TITLE= Audit trail, XWIN-NMR		Version 3.5
$$ ##JCAMPDX= 5.01
$$ ##ORIGIN= Bruker BioSpin GmbH
$$ ##OWNER= she
$$ F:/spectra/data/she/nmr/H-F/1/audita.txt
$$ ##AUDIT TRAIL=  $$ (NUMBER, WHEN, WHO, WHERE, WHAT)
(   1,<2023-06-15 09:03:13.79 +0400>,<she>,<DPX200>,
      <continue with go, POWCHK disabled, PULCHK disabled
       configuration hash MD5:
       00 E9 B6 7A A2 85 ED C7 34 08 36 98 17 FE 4E 26
       data hash MD5: 16K
       23 79 2F 5B D9 EA 64 66 7C 8F CD E2 A6 54 E0 9D>)
$$ ##END=
$$ 
$$ hash MD5
$$ D7 71 35 05 9A 31 92 34 D3 64 66 23 F2 4F D4 02
##$RELAX= 
##$RELAX= 
##$RELAX= 
##$RELAX= 
##$RELAX= 
##$RELAX= 
$$ Bruker specific parameters
$$ --------------------------
##$DU= <F:/spectra>
##$EXPNO= 1
##$NAME= <H-F>
##$PROCNO= 1
##$TYPE= <nmr>
##$USER= <she>
##$AMP= (0..31)
100 100 100 100 100 100 100 100 100 100 100 100 100 100 100 100 100 100 
100 100 100 100 100 100 100 100 100 100 100 100 100 100 
##$AQSEQ= 0
##$AQ_mod= 1
##$AUNM= <au_zg>
##$AUTOPOS= <>
##$BF1= 200.13
##$BF2= 200.13
##$BF3= 200.13
##$BF4= 200.13
##$BF5= 200.13
##$BF6= 200.13
##$BF7= 200.13
##$BF8= 200.13
##$BYTORDA= 1
##$CFDGTYP= 0
##$CFRGTYP= 5
##$CHEMSTR= <none>
##$CNST= (0..31)
1 1 145 1 1 1 1 1 1 1 1 1 1 1 1 1 1 1 1 1 1 1 1 1 1 1 1 1 1 1 1 1 
##$CPDPRG= <>
##$CPDPRG1= <>
##$CPDPRG2= <>
##$CPDPRG3= <>
##$CPDPRG4= <mlev>
##$CPDPRG5= <mlev>
##$CPDPRG6= <mlev>
##$CPDPRG7= <mlev>
##$CPDPRG8= <mlev>
##$CPDPRGB= <>
##$CPDPRGT= <>
##$D= (0..31)
0 1.2 0 0 0 0 0 0 0 0.06 0 0.03 0 0 0 0 0.0002 0 0 0 0 0 0 0 0 0 0 0 0 
0 0 0 
##$DATE= 1686805260
##$DBL= (0..7)
120 120 120 120 120 120 120 120 
##$DBP= (0..7)
150 150 150 150 150 150 150 150 
##$DBP07= 0
##$DBPNAM0= <>
##$DBPNAM1= <>
##$DBPNAM2= <>
##$DBPNAM3= <>
##$DBPNAM4= <>
##$DBPNAM5= <>
##$DBPNAM6= <>
##$DBPNAM7= <>
##$DBPOAL= (0..7)
0.5 0.5 0.5 0.5 0.5 0.5 0.5 0.5 
##$DBPOFFS= (0..7)
0 0 0 0 0 0 0 0 
##$DE= 6
##$DECBNUC= <off>
##$DECIM= 32
##$DECNUC= <off>
##$DECSTAT= 4
##$DIGMOD= 1
##$DIGTYP= 9
##$DL= (0..7)
0 120 120 120 120 120 120 120 
##$DP= (0..7)
150 150 150 150 150 150 150 150 
##$DP07= 0
##$DPNAME0= <>
##$DPNAME1= <>
##$DPNAME2= <>
##$DPNAME3= <>
##$DPNAME4= <>
##$DPNAME5= <>
##$DPNAME6= <>
##$DPNAME7= <>
##$DPOAL= (0..7)
0.5 0.5 0.5 0.5 0.5 0.5 0.5 0.5 
##$DPOFFS= (0..7)
0 0 0 0 0 0 0 0 
##$DQDMODE= 0
##$DR= 18
##$DS= 0
$$ [...]
##$SUBNAM2= <"">
##$SUBNAM3= <"">
##$SUBNAM4= <"">
##$SUBNAM5= <"">
##$SUBNAM6= <"">
##$SUBNAM7= <"">
##$SUBNAM8= <"">
##$SUBNAM9= <"">
##$SW= 18.05172834244
##$SWIBOX= (0..15)
0 0 2 0 0 0 0 0 0 0 0 0 0 0 0 0 
##$SW_h= 3612.71676300578
##$TD= 16384
##$TD0= 1
##$TE= 0
##$TE2= 300
##$TE3= 300
##$TEG= 300
##$TL= (0..7)
0 120 120 120 120 120 120 120 
##$TP= (0..7)
150 150 150 150 150 150 150 150 
##$TP07= 0
##$TPNAME0= <>
##$TPNAME1= <>
##$TPNAME2= <>
##$TPNAME3= <>
##$TPNAME4= <>
##$TPNAME5= <>
##$TPNAME6= <>
##$TPNAME7= <>
##$TPOAL= (0..7)
0.5 0.5 0.5 0.5 0.5 0.5 0.5 0.5 
##$TPOFFS= (0..7)
0 0 0 0 0 0 0 0 
##$TUNHIN= 0
##$TUNHOUT= 0
##$TUNXOUT= 0
##$USERA1= <user>
##$USERA2= <user>
##$USERA3= <user>
##$USERA4= <user>
##$USERA5= <user>
##$V9= 5
##$VALIST= <valist>
##$VCLIST= <CCCCCCCCCCCCCCC>
##$VD= 0
##$VDLIST= <DDDDDDDDDDDDDDD>
##$VPLIST= <PPPPPPPPPPPPPPP>
##$VTLIST= <TTTTTTTTTTTTTTT>
##$WBST= 1024
##$WBSW= 4
##$XGAIN= (0..3)
0 0 0 0 
##$XL= 0
##$YL= 0
##$YMAX_a= 376810
##$YMIN_a= -423776
##$ZGOPTNS= <>
##$ZL1= 120
##$ZL2= 120
##$ZL3= 120
##$ZL4= 120
##$ABSF1= 10
##$ABSF2= 0
##$ABSG= 5
##$ABSL= 3
##$ALPHA= 0
##$AQORDER= 0
##$ASSFAC= 0
##$ASSFACI= 0
##$ASSFACX= 0
##$ASSWID= 0
##$AUNMP= <proc_1d>
##$AZFE= 0.1
##$AZFW= 0.1
##$BCFW= 1
##$BC_mod= 2
##$BYTORDP= 1
##$COROFFS= 0
##$CY= 11.3945322036743
##$DATMOD= 1
##$DC= 2
##$DFILT= <>
##$DTYPP= 0
##$F1P= 15.7292609196834
##$F2P= 12.9074282941183
##$FCOR= 0.5
##$FTSIZE= 0
##$FT_mod= 4
##$GAMMA= 1
##$GB= 0.15
##$INTBC= 1
##$INTSCL= 1
##$ISEN= 128
##$LB= 0.24
##$LEV0= 0
##$LPBIN= 0
##$MAXI= 10000
##$MC2= 0
##$MEAN= 0
##$ME_mod= 0
##$MI= 1.114404
##$NCOEF= 0
##$NC_proc= 0
##$NLEV= 6
##$NOISF1= 3.799351
##$NOISF2= 2.8
##$NSP= 1
##$NTH_PI= 0
##$NZP= 0
##$OFFSET= 15.70392
##$PC= 1
##$PHC0= -20627.13
##$PHC1= 16.65272
##$PH_mod= 1
##$PKNL= yes
##$PPARMOD= 0
##$PSCAL= 0
##$PSIGN= 0
##$REVERSE= no
##$SF= 200.130013532006
##$SI= 16384
##$SIGF1= 3
##$SIGF2= 2
##$SINO= 400
##$SIOLD= 16384
##$SREGLST= <1H.CDCl3>
##$SSB= 0
##$STSI= 0
##$STSR= 0
##$SW_p= 3612.71676300578
##$SYMM= 0
##$S_DEV= 0
##$TDeff= 0
##$TDoff= 0
##$TI= <>
##$TILT= no
##$TM1= 0
##$TM2= 0
##$TOPLEV= 0
##$USERP1= <user>
##$USERP2= <user>
##$USERP3= <user>
##$USERP4= <user>
##$USERP5= <user>
##$WDW= 1
##$XDIM= 8192
##$YMAX_p= 0
##$YMIN_p= 0
$$ End of Bruker specific parameters
$$ ---------------------------------
##NTUPLES= NMR FID
##VAR_NAME=  TIME,          FID/REAL,        FID/IMAG
##SYMBOL=    X,             R,               I
##VAR_TYPE=  INDEPENDENT,   DEPENDENT,       DEPENDENT
##VAR_FORM=  AFFN,          ASDF,            ASDF
##VAR_DIM=   8192,          8192,            8192
##UNITS=     SECONDS,       ARBITRARY UNITS, ARBITRARY UNITS
##FACTOR=    0.0002768,     1,               1
##FIRST=     0,             0,               0
##LAST=      2.2672688,     0,               0
##MIN=       0,             -423776,         0
##MAX=       2.2672688,     376810,          0
$$ Real data points
##PAGE= N=1
##DATA TABLE= (X++(R..R)), XYDATA
0 0 0 0 0 0 0 0 0 0 0 0 0 0 0 0 0 0 0 0 0 0 0 0 0 -10 20 -27 30 -31 32 -32 33 -43 49 -55 60 -69 77 -83 95 -106
40 -106 114 -130 139 -159 169 -190 209 -229 251 -275 304 -335 373 -413 457 -510 567 -642 726 -826
60 -826 958 -1124 1339 -1643 2089 -2790 4028 -6639 14189 -71893 -295013 34305 201718
73 201718 173624 354265 376810 116781 31119 176662 112099 -72750 24765 24958 -155121
84 -155121 -33751 49736 -135833 -127955 -9545 -34242 -62957 -4998 15645 -80011 -54574 46344
96 46344 -73337 -122191 -5878 -25245 -16282 68066 32655 -17165 1417 75366 114219 75282
108 75282 89550 49690 -37533 17751 31503 -16264 2910 -26343 -45084 -29122 -48493 -23889
120 -23889 -14154 -17631 24542 5877 -9293 -6917 -34384 3187 10345 -13369 21539 -16407 -40146
133 -40146 11980 -6217 -8149 13593 -819 12602 9454 18559 27467 -17565 11078 29459 -13848
146 -13848 32030 41348 -6867 9421 2912 -16964 -16786 -12975 17533 -12181 -30144 6469 -37107
159 -37107 -41779 19259 -2821 -9363 7519 -8563 -7809 -12873 10528 24476 -11948 16934 23026
172 23026 -24513 12110 22821 -284 19997 10698 4303 190 -11323 19017 523 -14722 19524
185 19524 -9475 -14217 13795 -12145 -9888 -9138 -15301 5584 -11784 -7819 5977 -30795 -13016
198 -13016 3274 -13588 12909 10707 4031 14453 -4411 14884 20718 -165 30919 18326 -7078
211 -7078 10053 -7112 -8375 1262 -11866 3885 -9069 -16346 12051 -10376 -8187 11855 -15642
224 -15642 -2119 6209 -8162 2966 -13017 -12485 -2039 -21012 3789 8239 -11933 17722 10779
237 10779 309 21270 6768 12480 16395 2139 16707 -468 -8487 11835 -12657 -7874 6868
250 6868 -16937 -2380 -1752 -13307 2618 -11138 -5113 4651 -17411 1725 -171 -16574 7919
263 7919 -2689 -7088 9655 -6019 6085 10842 -1810 18802 5401 1424 20160 -881 5418
276 5418 12193 -7574 7110 1388 -7030 7208 -10910 -4917 3359 -17440 -420 -4461 -17016
289 -17016 2154 -10068 -8787 3103 -14662 1156 891 -10456 12110 202 -100 16783 -1810
302 -1810 9028 13231 -2190 16075 6852 1909 16329 -4019 2236 6447 -12291 5169 -3553
315 -3553 -13443 3492 -13418 -10043 578 -15526 -941 -2735 -10178 7152 -6923 -3812 7890
328 7890 -10676 3193 5036 -7013 10663 1136 664 14680 -1073 9806 12126 -1233 14915
341 14915 5466 -543 12770 -6346 -1168 3202 -15286 -1593 -7746 -15216 -175 -14850 -8919
354 -8919 1097 -13288 3748 2111 -8385 9082 -4539 -1957 10789 -5526 6024 6215 -4887
367 -4887 10747 1350 1885 15797 -927 10660 12304 -5299 10201 2111 -3962 9937 -7115
380 -7115 -5684 -4513 -17738 -3316 -10073 -15287 1657 -14600 -8968 4913 -9506 2441 4907
393 4907 -2199 11178 2141 6458 12645 -5132 9761 9277 -6529 10181 2334 -2942 10016 4
407 4 3964 1908 -4600 12395 -853 -4228 8424 -15988 -11367 1687 -12883 -5006 -8130 -14398
421 -14398 -4543 -12486 271 6375 -9680 9826 7484 -5571 12730 4361 2253 13738 3503
434 3503 9256 4336 -2997 12696 1697 3289 13563 -6741 -185 7414 -6201 3536 -6215 -14646
448 -14646 -5878 -17219 -8168 -4478 -17722 -3470 -5931 -7434 9949 281 5421 12326 -1450 9734
462 9734 5087 -4478 10149 -206 -1572 5242 -8533 1707 5013 4675 18473 4057 2299 13570
476 13570 -4564 3223 8361 -10343 -5788 -9956 -14116 -9761 -16855 -3480 -3515 -13878 8643 -444
490 -444 -12094 12583 5179 -1410 7269 467 874 -5255 1410 11357 -11034 2527 20381 -2664
504 -2664 9588 20358 -892 3535 10600 9337 1982 -8155 3479 -13195 -26893 -125 -12606
517 -12606 -23632 5954 -345 -10361 -3247 -2798 1618 -758 12459 19195 -10157 -2653 10024 -10487
531 -10487 4978 13300 -882 4858 5063 6875 6475 -5196 6996 3434 -5448 10585 -3171 -13491
545 -13491 -3128 -11820 -3993 -1798 -8452 5278 -1854 -5896 6964 -7459 -5289 5511 2975 9819
559 9819 -712 -6660 -938 -12676 5149 17605 -4464 4226 8090 -5601 5658 7668 4539
572 4539 3047 1261 13105 -3081 -14669 3320 -13958 -13426 14562 -2923 -12807 -3884 -6469 -6601
586 -6601 -5646 5931 4493 -11667 11548 11434 -16984 1676 7860 -5936 13734 20850 7607 -3077
600 -3077 -849 10503 -2492 710 18352 -9969 -11864 10377 -11675 -18654 -5920 -7538 -4348
613 -4348 -2406 5152 -3311 -21045 2212 8456 -5045 13783 8697 -8414 3802 4148 3729 1267
627 1267 -525 10902 1931 687 11409 -6341 -3714 9468 2243 7589 2171 -8208 -1227 -9447
641 -9447 -6030 1174 -13863 -8127 -4004 -8109 233 -8213 -5881 4148 -831 13341 14692 -3302
655 -3302 5144 4292 593 11131 6303 4320 -323 -5067 5504 -4161 -4995 11330 -3588 -2946 8408
670 8408 -6219 -6223 -1720 -3995 -1086 -8115 -3990 -4130 -16472 -1016 -808 -10999 6020 4836 -937
685 -937 9433 5771 6672 5268 3601 13661 1399 679 9617 -7035 -3570 5851 -5449 533 1920
700 1920 -3214 1681 -5476 154 657 -9186 2747 -1094 -10886 1131 -6525 -8848 -938 -5862 479
715 479 92 -3176 8317 498 2241 12306 905 5284 8678 1470 7625 3199 316 5863 -5447
730 -5447 224 3758 -7447 2148 46 -6710 512 -6195 -3156 -614 -8738 1639 -3110 -9124 4086
745 4086 -4205 -4899 4797 -3022 1281 1660 -1154 8171 467 3291 9925 -2694 4917 8689 -1248
760 -1248 7069 3874 -1851 2818 -4250 482 1010 -7377 2267 -3434 -8314 2227 -6828 -4536 1153
775 1153 -7278 -464 -1988 -5751 3773 -2668 296 5941 -3152 4573 5088 -1469 8187 3339 2586 8749
791 8749 -743 4009 4500 -3843 5550 -559 -2626 3957 -6098 -2364 -622 -9273 -489 -3279 -7230
806 -7230 2685 -6222 -3905 491 -7795 1094 1435 -2827 6784 -83 370 6740 -1954 6138 6100 -61
822 -61 8893 2663 975 6528 -2353 2252 2390 -4709 3863 -2555 -5478 788 -8594 -4217 -700 -8813
838 -8813 -801 -3136 -6277 2662 -4439 -923 3326 -4320 5003 3726 -1013 7861 543 602 6095 -1883
854 -1883 5162 4866 -747 8102 1861 612 6807 -3600 1258 1740 -6572 -251 -5218 -7641 -1279
869 -1279 -8852 -4281 -2172 -8341 2092 752 -2190 5833 -1374 715 5157 -1583 6133 3559 -1313
884 -1313 6882 511 163 5884 -2301 3898 4759 -1693 6069 -986 -2676 2473 -6237 -1612 -1043 -8438
900 -8438 -927 -4921 -6621 -30 -7280 -1200 2887 -3138 6022 1874 -3316 5408 -271 3077 7072
915 7072 -763 3833 1401 -1845 6288 -2093 496 6102 -3507 2741 2029 -7214 -695 -3282 -3417 1342
931 1342 -5702 -219 -749 -6231 5063 -454 -4286 5377 -817 -222 3131 -3389 488 -3245 -1165
946 -1165 7169 -3560 1497 5845 -4783 3576 7444 -142 4850 1294 2713 1869 -4874 2330 -2174
961 -2174 -8638 4249 -3628 -7671 90 -5768 -2588 1389 -1609 3923 -2626 -809 5350 -4404 724
976 724 4930 -4148 3574 2701 -1321 3904 -2603 2201 6726 -463 6412 2307 -4245 3415 -2045 -374
992 -374 2673 -6010 408 -2249 -8220 700 -5950 -6670 3948 -1320 589 1125 -3075 1951 -2315 1932
1008 1932 8228 -3559 2142 5778 -5911 2500 4176 -1743 3080 1654 3569 1310 -2827 5996
1022 5996 -1673 -4535 9281 -745 -4475 4238 -5900 -6423 -502 -994 -832 -7336 -1633 -866 -11412
1037 -11412 3729 4905 -8796 4629 5509 -3465 2578 2143 1901 1454 3789 12039 -1167 -1731 9358
1052 9358 -4543 -436 11450 -1202 -1729 1523 -1677 -2617 -7669 -2090 -2264 -9675 3566 141 -11888
1067 -11888 -2578 -4051 -5248 4281 2175 3402 -90 -3516 5311 1116 1080 9167 931 3898 7136
1082 7136 -672 3407 -560 -1337 8532 1345 1657 2636 -7924 -4030 -1014 -3629 -836 -7506 -3535
1097 -3535 -2059 -10100 -328 -1496 -9541 4768 4840 107 2843 -1497 211 1848 5307 12398 -114
1112 -114 -846 7149 -3831 1628 9174 -1927 1280 4449 -141 -995 -6430 -2581 -2897 -6247 5397
1127 5397 -2503 -12508 -1468 -5610 -6341 3498 -778 -1012 -171 217 4901 -2890 790 6720 -2174
1142 -2174 7709 10010 -2911 1195 668 -757 5115 1723 3574 403 -4542 3338 -2341 -5976 2584
1157 2584 -4334 -2340 1848 -5683 -3650 -6183 -6379 3381 -1100 -424 2174 -4642 518 2223 -105
1172 -105 5901 261 1420 7661 -1083 3128 4202 -2301 4572 3839 1907 2399 -3891 273 -972 -4443
1188 -4443 4207 -2395 -7720 1804 -5130 -5601 -157 -3441 -1040 -1359 -192 3475 -5530 -765 5351
1203 5351 -3156 4568 7050 -2267 2983 3135 1482 3877 484 4966 1415 -2976 6354 -1937 -4418
1218 -4418 3452 -4111 -1900 1179 -3547 -1439 -4239 -4427 144 -5095 -133 1161 -5826 2215 530
1233 530 -3948 3163 -57 1381 5264 342 3852 1989 -861 5722 902 1139 6104 -2833 743
1248 743 1840 -3147 2086 -1504 -3326 693 -4891 -2501 -1278 -6031 -27 -2084 -3572 1648 -4389
1263 -4389 -1419 2233 -3814 2962 2070 -1550 4203 710 1393 4981 -273 4096 2693 -447 5778
1278 5778 -636 -1485 3598 -3267 -465 998 -4107 432 -3280 -4113 923 -5931 -961 708 -5550
1293 -5550 1248 -1587 -3769 2212 -1641 258 3575 -911 3684 1463 -652 6139 233 1614 5080
1308 5080 -605 3596 2879 -1374 2445 -1397 -1587 1482 -4003 -533 -474 -5349 973 -2431 -4360 1392
1324 1392 -4142 -1140 575 -4252 1002 -246 -1744 4238 -876 818 3924 -950 4044 3679 999
1339 999 6143 990 878 4318 -2556 1780 762 -2855 2007 -2629 -3123 1513 -4430 -840 -646 -5137
1355 -5137 837 -2426 -3785 1704 -3788 -1581 1127 -2751 2906 541 -1028 4058 -647 2519 5393
1370 5393 223 5051 2686 -492 4417 431 1082 2901 -3482 987 -740 -4530 888 -3684 -3730 468
1386 468 -4590 -1589 -678 -3585 527 -2112 -1928 2132 -3243 742 3173 -1674 3871 2989 -354 3640
1402 3640 318 3205 5264 -627 3884 444 -2910 3690 -850 -1199 1994 -3643 -874 -961 -4039 257
1418 257 -4468 -3014 2022 -4931 -1253 242 -4390 1664 -318 -435 3369 -486 2204 3211 -1537
1433 -1537 3862 1688 -431 4887 1013 1403 2534 -2121 3249 568 -1586 2976 -2683 -3092 1346
1448 1346 -3342 -1253 -1736 -3735 414 -3078 -1321 655 -5146 426 1963 -3332 3770 1151 -1927
1463 -1927 2705 1546 3362 2611 359 5074 373 -308 5132 -2105 -1235 3855 -1310 170 259 -2164
1479 -2164 -818 -3465 322 617 -5896 81 -815 -6076 1218 -1077 -3075 1006 -205 2178 352
1494 352 -849 4019 -1098 969 6826 170 825 4093 -1031 2181 1353 -298 2647 -1691 334 1182
1510 1182 -5320 -1065 -1807 -4139 1068 -1784 -1888 -1537 -4982 69 -47 -3309 3155 85 -1589 2363
1526 2363 -385 1199 1570 1241 6735 566 647 5198 -2456 -131 5030 -146 176 722 -66 -845 -4013
1543 -4013 935 -67 -6519 2016 431 -6543 463 -1042 -4533 -707 742 1133 -2637 -1013 3985
1558 3985 -3592 192 6998 -1249 561 5440 -222 649 2424 2614 1586 -1025 4307 398 -5534
1573 -5534 2395 -1764 -5706 2526 -143 -4291 -1542 -2977 -2020 -3163 -1370 2493 -4198 -709 2954
1588 2954 -3591 8 2496 -933 3418 3798 3131 2478 -1215 2874 2042 -723 5436 1371 -1916 1258
1604 1258 -1889 -806 -554 -3171 1293 -802 -3198 1086 -4482 -4469 -279 -1074 1092 -544 -1121 281
1620 281 -3910 839 4873 -3074 1831 4093 -824 1998 2288 1046 796 429 5606 848 -3168 3627
1636 3627 -1975 -4340 4614 -251 -2807 -649 -2152 -1600 -3228 -597 886 -5437 -1 2937 -5574
1651 -5574 -510 886 -2627 1631 3260 2088 1151 -898 4012 355 -103 6566 67 -901 4716 -351
1667 -351 -49 867 -1869 609 -402 33 397 -5102 -1523 -680 -4435 584 -335 -3137 818 -1947 -331
1684 -331 802 -1898 1911 1015 92 3668 -202 -53 2860 481 3983 2455 -802 2827 -632 -310
1700 -310 2997 -1770 -244 157 -2323 224 -2384 -2734 -199 -4730 310 301 -4600 321 -842 -2588
1716 -2588 1752 -27 409 812 -698 3814 479 -63 5072 -1105 825 4768 -540 1107 2292 -336
1732 -336 1240 -761 1288 131 -4199 191 -373 -4465 1005 -1556 -4471 15 -1747 -1471 -528 -1643
1748 -1643 1608 -374 -418 3472 -1562 617 3468 -830 2453 2331 -50 2471 676 1534 2178 -1228
1764 -1228 1825 658 -2328 1783 -2035 -2189 254 -2937 -1431 -331 -3049 -246 -1700 -1752 1642 -2374
1780 -2374 -40 606 -1991 2409 467 -549 3292 -623 1688 3796 -81 2540 1385 692 3168
1795 3168 -628 588 2127 -2199 655 246 -2880 904 -2353 -2532 483 -3414 -923 -427 -3292 851
1811 851 -1505 -1239 1736 -1914 537 2457 -983 2882 1426 445 3379 667 1247 1969 -459 2492
1827 2492 1391 -602 2100 -792 -1034 328 -3154 -293 -1141 -3189 230 -2268 -2410 399 -2843 -682
1843 -682 636 -2404 1742 -453 -660 2215 -769 1685 2241 -314 2764 1866 320 3558 -493 768
1859 768 1610 -1438 1074 -222 -1645 1791 -2213 -1795 374 -3339 -589 -1053 -2726 1303 -1996 -1130
1875 -1130 621 -1914 361 1352 -1643 2075 335 -852 2420 -772 1082 1889 -644 2550 765
1890 765 -787 2698 -1221 491 1600 -1506 607 -253 -1917 1123 -1848 -1148 705 -3485 -834 -722
1906 -722 -3009 369 -1606 -1105 673 -1790 1230 767 -872 2726 272 746 3295 -474 1282 2418
1922 2418 -514 2012 626 237 2457 -1337 621 1289 -2359 350 -518 -2794 -103 -2560 -2482 -814
1938 -814 -2823 -518 -1574 -2688 1387 -1140 -216 2443 -733 1610 2715 799 3015 1220 889 2902
1954 2902 -637 1831 2394 -1334 1496 351 -1442 500 -2411 -471 -331 -3007 701 -1380 -4302
1969 -4302 -478 -2364 -1846 628 -878 184 -715 -717 2630 -1388 569 4110 -167 1490 3424 178
1985 178 1203 1099 2253 2597 -578 2404 923 -3150 1897 -205 -3559 823 -1076 -2327 -1292 -2400
2001 -2400 -1817 -3255 -1901 2718 -1909 -1094 2029 -3362 300 3170 183 1171 878 1668 1926 -358
2017 -358 2841 1865 -1618 4603 1507 -792 2219 -1037 -754 375 -652 839 -2046 -2325 -376 -3785
2033 -3785 -2018 31 -3995 -783 -127 -2343 -242 -2555 -283 1711 -151 3879 1995 -1283 2124
2048 2124 1102 725 3727 826 2752 790 -797 2966 -1175 -1708 2080 -876 -989 435 -2345 -1927
2064 -1927 -3046 -862 805 -3093 -74 689 -4472 -173 2024 -1971 312 1434 1820 1048 283 3710
2080 3710 -176 -1065 6113 1038 -822 3120 -801 -2306 232 754 171 -2299 -266 609 -4599 168
2096 168 1437 -4620 -36 1083 -2540 -712 -1709 -1012 -751 -443 3216 -351 -768 3127 -754 75 3602
2113 3602 128 946 1871 396 1463 -547 190 1563 -1619 1263 1337 -3325 -206 -2380 -2120 1128
2129 1128 -2106 -324 -298 -3352 424 -1006 -2167 717 -577 686 1528 -389 1751 -415 -511 3850
2145 3850 586 1062 3014 -1277 -212 1074 324 1411 -1370 475 1097 -2937 473 -812 -4126 432
2161 432 -107 -2849 -649 -1158 -1469 -1768 -280 2652 -2039 -480 2624 -1537 241 3550 -907 324
2177 324 2036 1762 1410 -703 1540 1099 -1845 3314 690 -2671 1468 -1395 -2430 758 -788 -413
2193 -413 -1222 -1162 1038 -2507 -1385 704 -2684 753 1884 -1799 420 -102 -532 2108 358 1414
2209 1414 1504 -744 2771 1203 -627 2067 -91 655 2392 -1424 830 -152 -2035 781 -539 -1623
2225 -1623 -60 -2501 -591 -1364 -2208 1474 -1636 -1598 1471 -1777 217 1504 -1696 1030 1423 1425 2385
2242 2385 -247 1520 1579 -614 2990 1308 -1808 2040 -553 -493 724 -1775 199 -609 -1793 926
2258 926 -2776 -1602 440 -3163 123 104 -2333 289 -134 -799 973 -760 715 1463 -454 3013
2274 3013 615 -134 2859 660 743 2180 -329 795 2 -1260 1063 -1662 -1409 722 -2344 -260
2290 -260 -604 -2253 347 -1496 -1312 630 -1754 323 -444 -1308 1968 -732 109 1814 -779 1348
2306 1348 1754 -356 2668 1131 -46 2245 -377 617 857 -1579 468 -737 -1591 356 -2216 -1026
2322 -1026 349 -2296 -406 -851 -1744 104 -1463 -455 1018 -1229 715 1050 -1005 2013 630 -231
2338 -231 2208 71 947 1397 -184 2134 366 629 2103 -873 383 518 -1777 348 -572 -2093
2354 -2093 188 -2087 -1678 -594 -2569 47 -571 -1836 830 -700 19 1819 -868 1381 1947 -151
2370 -151 2624 755 857 2043 -996 685 1476 -1240 1489 -139 -975 884 -1398 111 -108 -1775
2386 -1775 -316 -1441 -2589 781 -1799 -907 -62 -1489 194 272 -1272 1903 -685 528 1434 -481
2402 -481 1511 1233 -623 2275 523 90 2109 -891 803 669 -1114 1002 -30 -1502 1016 -1500
2418 -1500 -834 319 -2147 -5 -793 -1026 459 -1889 -598 569 -2094 1029 266 -639 1584 -122
2434 -122 287 1703 -518 2101 729 -360 2582 834 183 1513 -275 300 158 -969 751 -1055
2450 -1055 -1125 594 -2096 166 893 -1766 454 -234 -1514 774 -1006 -351 634 -1298 1323 548 -1790
2467 -1790 2065 32 120 1455 -651 1520 744 -526 1336 -523 -820 1527 -957 560 520 -1998
2483 -1998 361 -706 -508 838 -1433 -95 57 -2463 -60 -592 -1119 642 -321 122 324 -797 1755
2500 1755 377 362 2922 -67 95 949 -651 508 608 151 1061 -509 451 -49 -2942 -52 458
2517 458 -2140 547 -400 -1898 -429 -893 -794 -305 -834 2295 -611 -550 2618 -526 -512 2206 418 1574
2535 1574 1197 512 1455 -758 1283 1783 -1356 328 790 -2156 272 -454 -1887 -594 -1666 529
2551 529 -1131 -2414 -108 -1268 -1249 666 -608 -63 1389 -784 937 488 670 2354 -263 1578
2567 1578 2216 -1022 788 766 -472 1989 307 -4 -533 -2305 -303 -101 -1691 979 -860 -2173
2583 -2173 -181 -1161 -1153 -280 -605 1674 270 216 2532 -1630 230 2167 -92 1193 1475 77 1029
2600 1029 11 1683 686 -1422 1428 443 -1920 1756 -13 -2343 31 -31 102 -828 -661 725 -2345
2617 -2345 -108 1741 -2099 -423 1207 -1292 -281 764 89 98 -218 1268 532 -1049 1708 321
2633 321 -231 2944 934 347 532 -653 -156 -338 364 1401 -1826 -1301 778 -1655 -1322 -115 -1705
2650 -1705 105 -238 -255 234 -1820 -3 1107 -242 1316 -4 -804 1677 213 1305 1678 -620
2666 -620 1592 793 108 1539 -375 -493 158 -234 495 -419 -815 -185 -1394 -886 830 -1788 -130 543
2684 543 -1822 33 -842 -374 -430 -482 1517 697 -926 1929 41 -360 2889 447 47 943 -241 782
2702 782 -383 -306 550 -1770 64 569 -2184 -461 -596 -1801 -45 -382 -873 -487 -1569 131 104 -530
2720 -530 1935 -463 -211 1770 239 425 1048 -7 1710 1549 1073 1129 -704 889 732 -452 1237
2737 1237 -410 -1003 750 -1615 -1140 -15 -1671 57 -338 -1400 556 -1010 -433 583 -823 907
2753 907 1158 -407 1586 -223 198 1946 298 764 1011 197 1864 -448 292 1690 -1269 756 831
2770 831 -1567 597 -430 -1585 425 -987 -319 -418 -1385 303 -686 -801 969 -789 64 1603 -737
2787 -737 426 766 82 1421 -169 187 1035 -482 950 1091 -482 1272 230 -190 614 -265 -317 129
2805 129 -1068 12 -645 -1546 519 -1591 -1164 286 -1447 416 7 -822 835 78 242 1404 3
2822 3 1100 883 113 1427 239 852 1502 -152 454 959 -1282 465 -211 -835 981 -1318 -193 -412
2840 -412 -2051 -138 -1079 -1664 127 -1139 -210 226 -936 957 267 -346 1283 -9 664 1589 64
2857 64 1401 940 -35 1524 -89 -446 1396 -1543 -670 -249 -971 -261 -716 -1119 389 -1303 -498 9
2875 9 -1136 86 -305 -671 856 -559 149 1283 -881 1602 966 69 1538 478 334 1176 -134
2892 -134 512 319 -892 620 -542 -400 165 -1592 -299 241 -1667 177 -1080 -997 487 -1380 -233
2909 -233 848 -718 1078 348 -435 1385 -224 696 1086 -300 786 667 -40 1465 -503 -157 1109
2926 1109 -1134 -159 -125 -513 -438 -1257 -611 518 -1222 -489 -422 -1459 525 -532 -1101 676 -1088 431
2944 431 470 -531 1015 -171 -275 1396 -563 629 1777 -5 477 252 145 959 -850 153 948
2961 948 -1089 1044 183 -1261 379 -400 -663 12 -626 -42 -582 -1346 594 -579 -820 1766 -303
2978 -303 -312 915 -670 714 -8 375 1924 370 553 998 -893 1251 722 -269 687 -19 -485 751
2996 751 -707 54 -168 -1522 838 -359 -791 -87 -1474 -288 -16 -1140 518 -441 -489 305 -630 456
3014 456 1425 -8 1521 752 -601 1062 503 775 1199 64 1034 78 -1283 948 -705 -633 408
3031 408 -1181 -292 -207 -846 -107 -1747 -758 475 -1633 455 374 -972 336 -66 546 754 343 1191
3049 1191 783 -524 1402 578 -350 1185 588 -30 1122 -426 -1 -468 -683 709 -908 -373 122
3066 122 -2271 -972 -286 -839 -461 -304 -97 219 -871 620 168 -705 1259 807 555 1208 -225 -181
3084 -181 583 200 1636 205 -332 1054 -976 -57 214 -1425 182 -248 -1150 462 -1300 -879 342
3101 342 -1187 513 625 -407 -126 -228 177 767 -151 725 312 -369 1275 34 -289 1284 -106 759
3119 759 1150 -74 218 -615 -175 1497 -718 25 602 -2392 195 -21 -1165 -309 -245 156 104 -538 821
3138 821 -848 -1736 1181 139 -29 1961 -570 209 953 347 1295 329 462 565 -504 902 474 -1559
3156 -1559 656 592 -678 309 -793 -1063 -485 -1008 -223 -817 -848 -65 -1520 -467 951 -671 457 563
3174 563 573 794 105 107 1023 -221 1494 1164 -29 1108 -808 -179 932 -549 -350 442 -924 -98
3192 -98 -649 -1459 -555 -1151 -104 -283 -1110 1171 -836 -1020 1544 -666 -448 1069 -825 401 584 348
3210 348 529 422 1036 1397 -559 873 823 -897 1121 461 -202 606 -1335 -710 -601 -918 468 -899
3228 -899 -1131 297 -1520 -437 813 -1563 -87 -293 -403 589 -150 120 509 -658 1668 551 -288
3245 -288 1400 202 -280 893 -335 8 473 -215 693 -768 -325 244 -1256 -106 35 -1595 144
3262 144 -919 -739 112 -484 -549 60 -407 589 33 -268 1290 -282 -111 1448 -254 571 457 -302 1478
3281 1478 80 320 939 -157 536 165 -1203 493 -1144 -840 459 -1692 -717 2 -1087 -92 -350
3298 -350 -1130 103 -664 -40 396 -733 1347 514 -199 1122 539 260 674 -3 998 287 47 863
3316 863 -404 -539 1109 -640 -127 -302 -1108 157 -271 -1167 -135 -1364 -233 -344 -1508 1001 -254
3333 -254 -701 632 -326 310 1036 -511 1322 664 285 933 313 -37 1147 74 1441 463 -415 1303
3351 1303 -664 -323 119 -1024 55 -718 -1439 318 -533 -701 -9 -577 -156 243 -1012 367 -104 -248
3369 -248 1057 10 670 1544 319 925 253 264 865 213 936 486 -841 813 56 -411 125 -979
3387 -979 -618 -346 -1255 115 -150 -1451 163 -295 -399 251 -504 -46 521 -147 442 633 406 1199 -385
3406 -385 1115 1688 -305 1050 522 -565 757 -681 182 415 -373 8 39 -1395 157 -879 -982
3423 -982 350 -1566 -485 -205 -707 644 -307 -290 625 -473 1107 930 -165 1192 665 -87 1328
3440 1328 -172 -118 925 -335 816 -100 -540 1006 -838 -379 230 -308 337 -495 -1143 510 -832
3457 -832 -668 608 -1082 -330 148 -647 1112 230 25 1063 11 869 1240 43 536 580 458 649
3475 649 -80 309 711 -271 75 -877 -729 95 -885 -221 658 -1554 46 -134 -1178 -202 -635 -565 107
3494 107 -689 166 106 -38 1571 -144 -529 177 -688 108 408 -129 1325 -127 105 1364 -297 -807
3512 -807 1029 -409 852 -242 -1032 -204 -1136 319 -64 -1386 87 -224 -1390 618 -833 -448 1089
3529 1089 -72 1015 904 -562 948 -196 -280 1556 -222 806 752 -257 39 -308 146 19 -707
3546 -707 -346 365 -1256 -8 -849 -834 -62 -547 -433 -506 -780 413 -52 -331 871 -291 82 1525 -1
3565 -1 484 650 -108 1081 205 602 921 -695 194 605 -816 795 -43 -284 -39 -1463 -445 -300 -982
3584 -982 896 -531 -418 259 -945 -800 531 -489 -211 1042 -123 663 -514 464 708 -230 1184
3601 1184 488 -464 1458 -103 -682 814 -360 184 389 -454 630 -387 -1124 576 -569 60 263
3618 263 -1300 -31 10 -276 810 -570 197 801 -730 468 319 183 1205 40 787 954 -248
3635 -248 864 969 -518 410 305 -625 731 -282 -83 -445 -682 284 -507 477 337 -1193 -616 320
3653 320 -731 450 39 -331 73 -283 1055 264 -638 774 603 111 737 16 -662 901 339 493
3671 493 480 -106 224 -1033 -450 891 -1042 -116 485 -622 -126 -183 -905 -208 -359 97 -82 -680 605
3690 605 -213 -582 935 250 328 650 -17 269 386 414 617 -50 300 830 -466 417 260 -1083 700
3709 700 -434 -244 38 -1163 -114 -214 153 -232 -602 -289 474 -519 -118 -84 -771 482 931 199 1036
3728 1036 -465 -78 111 261 905 683 -255 686 -192 -360 719 -635 -447 236 -258 -54 -148 -404 -43
3747 -43 -871 -14 -147 -1335 262 -85 -476 494 -27 124 -118 209 -142 -237 238 805 -261 217 847 264
3767 264 314 239 -459 863 -223 -716 -407 -848 199 -255 -388 454 -979 -420 533 -409 -353 -246 -858 231
3787 231 48 148 540 -182 443 356 -97 1289 -71 -258 827 -116 -141 131 -626 312 -232 -574 299 -635
3807 -635 -244 -106 -830 -93 -531 -999 913 -609 -439 -145 -42 46 429 -12 516 -50 0 621 -206 575
3827 575 957 -263 640 -5 65 24 -57 340 590 -307 -197 -147 -288 204 -659 -163 -98 -1028 -181 -393 -401 423
3849 423 -199 294 185 -207 356 201 -605 928 370 60 511 -3 208 715 -392 725 -47 -469 720
3868 720 -511 209 -228 -1013 319 -740 -809 208 -701 -331 321 -484 548 306 -819 288 1 148
3886 148 893 -231 472 881 185 268 -36 -145 584 -363 212 -178 -419 -158 246 -404 475 -1072 -429 117
3906 117 -946 -331 -271 -256 -218 -634 -207 -20 -16 9 444 -330 513 -136 322 291 -410 681 616 195 828 -15
3928 -15 -383 193 -393 -257 436 -578 27 -630 -344 497 -353 -407 -361 -830 243 -393 -268 364 -423 -644
3948 -644 645 -374 281 607 -577 231 -248 34 835 157 -111 899 -68 311 2 -229 387 -791
3966 -791 372 -177 -714 233 -885 -570 259 114 -846 198 -154 -88 -81 -656 284 -928 218 534 -298
3985 -298 445 729 268 552 173 733 639 -696 186 429 -505 742 261 -742 309 -808 -105 -347 -1234
4004 -1234 202 -296 -774 -3 -850 -148 800 -780 -60 62 -237 457 7 217 45 -6 343 793 221
4023 221 682 367 545 531 -421 462 -191 -749 595 -523 -487 336 -899 -273 -164 -944 -268 -527 -838 275
4043 275 -296 47 758 -520 230 40 -245 976 226 415 661 -760 534 555 -372 595 550 -300 461
4062 461 -51 -479 -12 -527 -375 -377 -464 299 -502 -361 113 -764 -263 87 -11 369 -400 568 273 288 971 408
4084 408 -72 726 58 310 391 835 291 -195 -788 367 -519 -849 515 -947 26 406 -438 -792 -871 -144
4104 -144 -253 -135 -238 841 138 -2 365 -721 307 383 -393 300 -86 292 299 -302 665 -374 -4 244
4124 244 -627 242 467 -644 -113 -1126 125 -221 -522 -219 -305 -727 533 -451 -194 249 -826 -241 89
4143 89 -910 478 -211 238 828 -231 401 427 -361 222 288 99 829 -541 -479 745 -319 186 -229 -823
4163 -823 2 -306 -102 -317 -996 79 -65 -664 383 30 -522 517 81 -139 846 580 570 307 33
4182 33 1134 285 300 441 49 254 -32 -738 -29 -141 8 21 -876 573 -590 -1013 319 182 -881
4201 -881 141 -40 -830 83 -258 -140 -11 363 38 -160 496 313 -484 1192 728 6 263 -21 723
4220 723 520 109 -85 248 -551 -123 -458 -369 374 -400 -50 -171 -578 266 -272 -724 146 103 575 45 -127
4241 -127 636 153 -9 740 -158 -182 307 -334 801 881 41 327 315 433 -248 -534 145 -427 -929 400
4261 400 -952 -965 454 -1115 -364 14 -199 -124 -580 56 344 68 441 307 -348 555 129 219 584 741
4281 741 -45 136 -223 246 -106 -5 658 -781 -66 76 -592 -79 -261 -572 -38 -757 149 -235 -488 -38
4301 -38 52 -194 606 281 -449 421 117 332 483 -142 768 162 -395 297 -124 594 701 -349 381 -203
4321 -203 -279 227 -409 264 -91 -795 110 251 -250 246 -619 -170 195 -622 65 61 -338 614 480 565 419
4342 419 150 399 496 -21 197 119 408 613 -1066 -94 478 -259 -473 -778 -138 316 -436 131 190 -635 -67
4363 -67 -714 -668 470 105 143 667 -29 464 11 -161 825 222 584 460 -234 1518 348 -484 358 -622
4383 -622 -459 334 240 465 75 -569 -33 -374 -186 339 -744 37 -212 -654 228 -10 -3 -111 -135 -58 221
4404 221 -393 254 723 1 473 78 409 353 -617 67 37 -119 863 192 -182 -212 -640 -439 567 -831
4424 -831 -11 -552 -735 669 -44 -14 -32 -163 -317 345 -221 141 -608 172 18 -367 -176 27 330 187
4444 187 -50 -178 898 268 331 230 -747 105 -13 -672 199 -161 186 -423 -727 -29 -538 -86 171 -665
4464 -665 136 561 -342 758 261 -144 758 362 521 718 -472 709 410 -544 494 -602 -189 314
4482 314 -359 86 -37 -684 95 -147 -251 65 -819 146 65 -48 69 -1 -335 -93 -82 -17 251 -102 649
4503 649 250 170 895 175 36 1065 440 59 -60 91 405 -799 -251 188 85 -132 -564 246 42 -911
4523 -911 -40 200 -740 35 -669 -661 135 340 88 540 -154 620 263 6 958 39 204 533 332 -101 578
4544 578 39 -390 -266 51 -327 -324 -103 -446 -374 75 -235 -716 477 -192 -303 -266 -691 745 193 -258 311
4565 311 -79 -180 331 -466 27 1025 42 389 115 381 652 82 -382 591 -91 117 85 -678 184 210 -632
4586 -632 -521 -372 139 -359 -152 484 -436 134 -289 31 216 757 250 479 -204 163 724 -293 -58 715
4606 715 -890 366 184 -480 -205 -349 224 -185 -281 205 -373 -534 554 503 213 34 147 -628 -105 32
4626 32 -78 113 -7 385 -303 361 213 -260 111 732 -373 252 262 116 506 -132 -286 -66 -381 31
4646 31 -124 -278 -530 -80 -31 -203 -230 144 -655 -58 -246 -906 274 161 -205 366 -211 177 531 231 231
4667 231 876 -67 -326 -252 152 346 -349 -343 210 -10 339 -864 -622 -91 -944 -453 421 -164 34 -366 -299
4688 -299 173 -408 358 -666 -154 168 354 -581 819 -47 -67 148 -67 368 258 -636 761 -45 -58 110
4708 110 -512 237 446 -457 40 -468 -169 72 -490 -49 362 -791 40 -6 -737 633 94 -283 -304 -157
4728 -157 250 -233 72 461 136 -282 86 278 163 648 71 332 -231 202 -195 -503 402 19 -635 347
4748 347 -258 -415 -384 -271 -410 67 -391 31 328 -237 237 -110 37 334 78 4 414 98 920 -454
4768 -454 195 201 -30 -153 960 -445 287 -406 -695 -415 -745 -804 -51 -311 185 205 -560 318 164 84 361
4789 361 -92 151 119 135 601 -210 776 484 -130 89 562 564 86 -60 403 457 -349 413 225 -457 359 -663
4811 -663 -267 294 -438 -462 -200 -348 649 -15 -618 -304 -366 -210 206 -3 299 481 126 101 124 -412 330
4832 330 -109 246 404 233 327 98 -272 24 -614 58 358 -401 161 -429 -171 186 -194 276 180 -458 520
4853 520 269 40 451 337 589 195 -417 478 721 52 46 -77 244 628 111 116 -139 -270 65 -378 22
4874 22 -101 -232 -488 -376 -403 -80 50 -162 169 -24 43 169 -430 220 226 6 -181 -604 95 -158 -616 532
4896 532 -405 -195 496 -481 -95 549 -472 325 151 -623 -100 -871 -796 75 -478 142 -357 -540 413 -353
4916 -353 -188 48 90 162 190 91 432 494 85 687 -16 -11 364 -159 987 512 64 633 -164 239 -84 -459
4938 -459 -275 -368 -363 7 -534 -701 -86 -928 13 -17 -226 353 800 208 410 400 109 83 -266 28 -536 -249
4960 -249 550 -484 451 174 40 184 96 -623 34 -869 224 -436 -495 91 138 -339 40 245 30 130
4980 130 -160 270 309 55 782 -564 258 393 -94 -212 -29 97 52 167 -76 -54 187 179 -5 -403 -14
5001 -14 275 -492 41 -678 -129 -564 -339 -96 -13 -1217 322 -408 -75 486 -58 497 368 30 296 715
5021 715 443 720 521 61 36 -503 758 99 -219 501 176 -482 -15 -709 622 -656 -245 186 -518
5040 -518 -659 -288 -2 138 -208 -237 423 196 213 89 -15 219 893 -79 182 356 658 884 370 -99 414
5061 414 -812 35 285 -667 367 -630 -379 -77 219 142 397 -95 -111 103 -112 188 361 -623 2 -158
5081 -158 -46 106 -163 517 173 247 94 -106 458 -116 203 286 208 440 246 -172 -153 -140 -157 -328 -21 -144
5103 -144 700 17 420 -516 -286 81 -382 -706 132 -181 173 114 160 516 -256 117 147 -211 494 -204 -119
5124 -119 354 -33 -504 172 -422 258 -26 -258 39 -116 -190 -321 -90 -59 140 -295 198 119 -737 182 -65
5145 -65 -262 112 273 397 382 223 -53 -342 -160 736 -323 190 858 -311 216 485 -700 125 -487 -596
5165 -596 -264 -528 -107 145 -308 59 -163 -638 375 -674 -299 -107 -243 345 16 -54 386 -185 221 235
5185 235 -133 313 -417 52 84 -426 275 244 -333 112 127 -64 219 -547 -188 22 -136 138 -32 -156 125
5206 125 -290 481 386 -180 -409 -437 334 360 -238 -409 931 -145 369 229 -196 548 -3 80 -140 -385 447
5227 447 248 -687 33 61 62 -35 -371 -231 5 -464 -623 -354 -58 316 -149 48 -80 191 86 310 12
5248 12 406 520 -316 187 -4 408 -283 -106 1071 -233 -345 137 -471 -621 127 220 -163 -155 -492 198 -450
5269 -450 -334 451 -410 -232 -76 -313 69 -381 127 -132 -60 486 69 -914 484 304 344 187 -445 234
5289 234 331 -191 -318 110 85 249 -493 179 352 -565 -246 -154 -150 279 -169 -47 298 -131 226 -220 430 -8
5311 -8 -432 -42 83 -197 544 108 -76 445 152 81 -125 -450 581 342 -212 106 -76 30 450 -289 -93
5332 -93 -355 -633 326 -413 -194 59 -224 281 496 266 109 64 299 635 81 403 47 -251 -324 354 -39
5353 -39 260 114 -76 137 -464 288 -413 -851 316 98 -464 -183 -77 216 538 -463 326 -164 -321 -7
5373 -7 157 596 76 27 375 483 -545 280 129 -182 153 335 390 143 -464 446 -282 -698 -195 269 -370
5394 -370 -140 -124 -14 -75 -152 230 -383 -159 -77 177 150 -88 178 512 -44 464 62 93 231 -40 -40 430 29
5417 29 -424 -372 -244 375 -159 -371 -483 -463 -115 -761 -171 239 -189 -179 -252 78 144 -176 -368 -83 80 35
5439 35 663 276 417 781 459 -121 822 317 187 163 344 416 372 -208 -177 -191 23 117 -43 -106 -670 -664 61
5462 61 -603 -335 -672 -513 -64 -13 -315 688 431 285 144 361 188 -97 465 298 -459 -40 287 -272
5482 -272 303 -317 -334 398 -846 786 -79 -41 -353 -254 -481 -169 -233 -135 -142 -390 244 -208 -249 139 739 362
5504 362 -55 448 175 458 12 -50 -286 -134 312 -642 123 74 -580 345 -68 -316 287 -265 -275 -110 75
5525 75 136 -332 -393 222 -453 -180 -189 -41 335 520 -372 205 322 432 538 217 562 70 -8 -100 48 -560
5547 -560 17 50 275 -191 -393 -404 -518 -31 296 418 -345 379 -599 -397 111 -126 -9 169 498 -49 -264
5568 -264 263 -114 -172 520 -134 384 164 -113 235 48 -92 336 -267 -267 -21 -635 100 -204 -232 -281 -85 -451
5590 -451 319 77 264 -392 -50 270 -3 -31 -259 -71 -44 102 187 30 112 -187 -13 555 20 298 -464
5611 -464 239 363 251 341 24 -917 726 -168 278 -185 -47 199 62 -207 -189 249 165 213 -235 173 447
5632 447 160 -136 680 -344 321 66 414 309 -166 -29 -9 -258 -321 -158 140 55 2 236 -547 -85 214
5653 214 30 -496 -270 -337 214 100 429 -394 -211 297 321 -413 7 557 -74 45 155 280 182 288 303
5674 303 341 -240 323 279 -167 -8 44 -38 145 -199 -49 -83 26 183 -737 -697 466 -334 516 -647 -247
5695 -247 -72 -445 316 649 -134 342 224 644 -20 -95 425 325 -168 -236 82 -54 -558 -368 -13 -36 -302
5716 -302 334 167 -217 -550 718 -219 793 1 110 -55 -32 -353 66 78 533 -54 34 -414 -629 150
5736 150 -66 -190 229 -123 -548 118 -208 -298 197 -35 26 6 -494 -560 -688 92 338 -332 43 394 -262
5757 -262 111 -500 225 422 -111 221 -149 -198 39 -35 -90 241 474 673 116 59 338 -76 -569 -197 -449
5778 -449 -78 93 21 -185 -178 -374 -21 -801 -17 206 -171 522 -195 -33 329 -502 22 -140 -50 45 175 326
5800 326 535 -98 283 168 -88 260 -162 -320 -257 -474 -222 101 -923 -549 -222 -676 486 46 -438 405
5820 405 -70 81 69 178 93 270 -77 318 122 123 232 72 117 337 562 21 49 125 196 -330 -392 -40 -11
5843 -11 275 -211 -156 138 -530 -264 471 -128 -255 -851 657 752 42 -225 143 162 863 -413 104 417 -544
5864 -544 404 688 505 772 231 339 480 -190 -25 -37 53 264 -220 -314 182 -241 -252 -604 -627 256 -198 -562
5886 -562 -72 23 -181 224 2 100 -71 -203 170 258 -186 318 -251 -143 144 -316 256 -42 151 481 -143
5907 -143 454 -323 209 192 62 -61 51 56 -4 217 -525 -359 -7 -498 -62 497 414 263 391 -141 563 410
5929 410 334 13 346 108 -219 734 427 66 -316 -307 34 254 -355 -443 -611 -265 -192 -48 383 325 -131 -128 169
5952 169 -541 159 -172 415 610 315 49 -318 -165 279 -14 -49 150 136 11 222 -461 778 475 -330
5972 -330 208 500 -380 -189 -392 -177 -30 376 76 442 -227 -62 124 -317 -34 4 -95 -426 9 133 86
5993 86 223 745 180 -341 -452 240 -322 117 634 124 15 -322 179 -495 -124 177 -291 488 68 381
6013 381 560 363 199 -23 -187 347 -348 501 -379 -360 507 -13 -56 128 214 -24 623 302 -392 -301 -285 402
6035 402 363 59 -71 245 -182 -302 -266 -156 -431 -510 451 -716 -222 -292 36 -31 3 307 303 -44 285 -145
6057 -145 242 606 -21 300 0 -56 -76 274 130 -113 313 470 -387 -54 164 173 -448 -70 72 -322 2
6078 2 -331 437 246 -150 -19 60 182 82 66 -89 409 74 12 570 391 528 -92 -335 -221 225 200 433
6100 433 15 -44 -51 305 188 595 -83 23 -619 -450 -266 -251 2 -307 358 427 38 -208 200 95 377 250
6122 250 -123 182 24 509 -673 -314 176 -46 -449 -103 -167 112 -362 365 10 -10 323 -10 -129 -117 -146
6143 -146 -667 343 -133 9 -127 -17 384 548 -87 242 441 112 288 559 -668 -588 -285 -79 119 -220
6163 -220 -264 -172 -366 88 -52 -201 -211 -259 173 -625 -629 -103 -243 -382 -203 -358 6 -209 -272 106 312 -105
6185 -105 -129 71 96 333 -459 214 -149 -187 182 -126 208 -234 -136 147 -67 -485 260 257 -13 237 378 520
6207 520 356 -98 -112 28 -21 189 -158 -5 -298 -34 88 355 473 13 452 758 142 -143 367 137 -242
6228 -242 -463 -152 -138 -89 184 -435 -272 -270 57 -141 -453 3 63 308 -15 -474 -400 -65 62 382 195 -361
6250 -361 603 -258 137 138 1 156 -500 7 225 -70 -127 -216 -928 462 -377 -295 -236 70 522 193 29 22
6272 22 -80 32 -16 -512 137 66 -193 55 332 261 518 -41 155 -23 205 9 445 17 214 -331 163
6293 163 -15 -122 -123 -507 542 195 153 74 69 -233 241 -23 -132 323 69 -260 -437 -464 -78 -45 -184 432
6315 432 -230 -48 -231 -19 627 -498 -313 -182 -480 46 -45 -195 -401 -44 -328 449 235 -601 -185 134
6335 134 -124 67 -145 208 -89 -468 75 -228 -150 20 105 -61 274 -522 378 392 46 551 141 3 -136
6356 -136 144 303 11 -93 120 -220 -224 617 -619 -53 98 -215 445 216 -383 -136 -405 122 67 462 0
6377 0 -58 -92 -102 24 -174 488 -180 259 -415 -712 426 22 -224 -48 -206 319 -231 -287 -228 1 253 -140
6399 -140 456 41 134 136 139 -278 -261 197 -1 -243 -246 476 -286 -650 -229 -118 -119 93 -459 -380 235 -170 528 12
6423 12 152 50 139 65 430 -271 -364 65 -326 20 322 24 -212 3 241 340 -780 -56 -125 -344 -190 277
6445 277 260 194 -243 258 196 -179 36 51 401 -170 -441 -416 158 -628 377 214 43 -233 253 31 -157
6466 -157 -652 228 324 -113 640 -605 620 479 234 119 733 -190 -136 -258 320 353 -212 368 -238 -54
6486 -54 -210 -454 -429 -105 136 -339 268 -70 -105 333 -543 199 103 42 455 145 -133 39 -589 21 -22 226
6508 226 224 172 304 -71 227 203 -86 260 288 -422 -356 495 -552 -42 351 244 152 -448 137 554 31 -363
6530 -363 -883 -32 287 142 -152 -173 -35 -266 -242 -423 354 -627 -242 -148 338 -173 195 208 -147 131 -41
6551 -41 536 -65 22 520 -397 -149 -122 -499 290 -262 226 -352 -42 104 -598 292 338 249 -261 237 237 302 257
6574 257 -244 16 -442 81 115 -250 219 -413 -157 163 -193 -327 268 -404 -263 233 -139 207 276 29 281
6595 281 102 200 -345 313 16 0 72 435 341 275 127 171 -38 -19 -49 154 -498 8 436 -345 26 -305 398
6618 398 264 170 -38 -122 36 168 -401 206 -13 447 190 37 -161 -72 -138 -416 -244 62 123 27 -141 674
6640 674 -170 208 -72 2 -406 -71 57 -365 -265 279 63 13 216 142 -458 -159 -423 220 -354 -140 54
6661 54 106 43 -290 408 -339 -284 526 -164 -104 99 -224 -143 337 20 -303 420 280 69 -189 -105 197 -1
6683 -1 -311 149 -7 415 -295 223 45 -308 204 -233 -94 320 299 -355 382 241 -142 -493 -130 7 -339
6704 -339 222 342 -37 585 83 687 24 -299 126 78 499 -704 335 331 -229 -263 383 -82 -47 315 -256
6725 -256 350 -220 -432 -169 313 -144 189 169 -310 -22 171 -57 -194 286 62 78 -137 51 -260 238 -62
6746 -62 412 361 152 158 85 65 -255 -5 -202 -139 -25 111 615 -232 379 -190 -212 -143 128 -298 -282 275 6
6769 6 272 -539 13 -178 -106 47 129 -159 49 230 265 -2 107 -145 130 113 203 -237 -364 -84 7 226 312
6792 312 -264 -45 -121 -344 142 242 505 -271 203 75 157 203 687 -51 -632 -133 6 -110 100 -238 353
6813 353 -168 -271 403 -22 270 -488 -356 204 -197 -360 252 -36 79 384 31 -53 390 -119 210 149 -102
6834 -102 130 -843 121 -226 -51 95 -72 -28 -196 -300 351 94 314 -337 -463 30 97 -85 -518 -132 357
6855 357 -19 169 59 -131 -232 -186 303 43 -203 173 -160 20 -242 -10 -252 -722 -403 -473 401 4 239
6876 239 -177 401 379 256 -178 -23 -179 -438 -220 -262 -5 -120 200 455 -120 -185 117 187 589 -111 464
6897 464 -60 -222 170 -71 138 678 377 91 7 56 -171 30 -10 50 -35 -162 259 83 -212 387 -289 -136
6919 -136 6 143 407 51 -89 -349 -274 -376 -544 -202 146 -810 180 96 -209 225 86 140 -191 62 19
6940 19 186 -327 -32 -28 -266 451 78 206 -534 -138 -230 -58 -380 38 -33 -707 46 481 -90 278 109 93
6962 93 -315 -18 93 354 -129 103 127 304 499 20 169 -57 276 -292 346 74 -124 -510 172 319 164
6983 164 -221 -356 -240 -147 212 -343 -601 256 -295 402 53 108 177 -317 -164 -28 60 305 -196 57 -514
7004 -514 -497 -112 -104 101 13 -88 39 273 140 240 -456 -43 37 69 406 -600 -355 129 200 85 271 -242
7026 -242 -185 291 240 -154 75 222 355 34 -163 -46 -397 68 136 43 422 -184 41 -316 -370 704 -249
7047 -249 -156 -150 -145 421 17 -83 -38 346 87 6 19 -307 452 276 -12 -113 107 -59 -234 -506 103 111 48 152
7071 152 -244 76 -228 -263 -253 -216 74 298 -48 -78 50 60 -271 82 -373 -582 -41 160 -181 -148 -235 72
7093 72 -2 -194 373 -33 23 -79 427 -311 -54 -46 47 -313 -251 106 -162 602 151 -161 65 -230 -189 322 10
7116 10 -102 61 169 -229 -137 186 491 379 -68 66 -109 55 -51 -95 -374 287 318 -50 -128 -30 -174 423
7138 423 -249 216 166 575 -127 374 120 52 -387 -62 -150 300 409 222 -152 -160 -60 44 299 -68 -361 86
7160 86 -538 49 3 -691 -207 295 -149 -163 418 8 431 351 -70 -180 168 198 -198 -47 176 479 -244 453
7182 453 -530 300 -133 158 177 26 10 13 117 -271 61 -62 163 131 -79 84 -209 -267 474 229 269 197 -49
7205 -49 105 274 562 -192 19 -136 -918 -69 125 575 177 112 118 246 216 10 -68 81 89 -199 57 146 106
7228 106 25 -26 -295 118 -21 -206 442 -31 -256 -413 -82 -437 739 -6 244 -102 -5 -380 -173 -123 -574
7249 -574 -222 112 47 -148 399 -76 273 -327 281 252 -421 -248 -62 -344 604 -192 220 19 -732 -124 -62
7270 -62 -467 -74 328 374 368 -1 -605 48 84 -41 -396 110 -37 -440 -23 -428 -271 418 127 104 -15 -192
7292 -192 294 -55 295 158 -33 -32 44 -67 -193 -413 -305 130 348 519 -330 -125 -190 -169 169 92 -19 -90
7314 -90 29 -31 -97 -147 -203 253 415 -225 -6 -345 241 -79 209 -152 9 12 112 -96 -70 -171 273 150 185
7337 185 194 -195 -75 -336 4 149 -212 -776 399 464 104 -332 -157 21 191 141 -65 155 43 34 -315 -384
7359 -384 -126 -16 -873 180 125 124 53 -334 53 -411 0 -58 -401 396 -24 -56 -354 -50 48 -97 215 580
7381 580 461 305 -492 125 177 577 -209 -163 233 57 -44 201 -215 -57 404 260 -85 -136 87 -101 -603
7402 -603 -89 577 -187 87 473 -513 -99 -392 -73 439 56 -102 -208 365 69 -633 -165 129 -138 -450
7422 -450 -280 288 17 -18 47 51 -16 165 -218 60 194 39 -205 285 101 89 434 -160 -241 -217 113 283 175
7445 175 151 99 37 -249 -23 33 132 -313 -164 394 129 21 -422 -153 260 -107 84 6 -40 -203 -100 97
7467 97 228 -7 8 423 -229 -36 172 202 273 236 603 114 -334 634 -505 97 -459 -327 429 233 -27
7488 -27 -51 43 383 -72 74 19 422 -123 155 -231 -57 -121 -411 60 -103 123 -119 273 -95 -87 254 -335
7510 -335 186 -175 -101 145 249 -244 -197 -261 -321 -536 274 -546 291 198 -147 36 447 -388 -44 -96 403 859
7532 859 -195 -31 371 -437 -2 -31 116 -528 157 -374 18 74 -442 343 -218 14 -88 373 349 105 -277
7553 -277 -399 -19 306 -239 -45 -391 136 -26 -685 468 -155 -353 -421 -193 48 -656 -379 -81 -236 -420
7573 -420 389 146 -407 248 -117 525 -155 103 359 194 -297 91 -254 -3 -231 -326 -138 -272 562 385
7593 385 -114 455 218 -33 223 269 171 123 415 42 -217 134 124 154 3 16 -310 -285 195 -202 -215 93 2
7616 2 -627 334 -348 -527 -128 -234 460 284 -194 427 130 -132 174 9 -233 76 -327 -291 -440 208 -214
7637 -214 105 1 311 244 -155 -190 -410 466 -265 -443 -42 -194 -198 129 -87 -24 -226 -336 -313 5 448 -260
7659 -260 -44 290 -500 242 295 105 35 1 -399 -254 450 -235 -166 139 309 608 -396 194 -84 61 -167
7680 -167 -178 -66 -364 223 -512 395 -514 -262 -437 60 371 -142 18 286 243 603 42 403 307 18 92
7701 92 -335 -148 46 -22 389 441 119 206 190 -198 171 -243 483 -200 -237 -421 58 681 115 159 -193 128
7723 128 -180 -269 357 -351 -29 -138 -241 -47 38 55 74 -373 -84 -47 -153 174 229 -457 70 224 -288 733
7745 733 396 333 477 25 -257 322 27 327 443 -154 256 144 177 -337 -345 479 -323 -83 -531 -342 -141
7766 -141 -137 513 54 -134 -32 -125 -102 404 137 -540 123 -124 224 -1 3 -44 -430 279 -5 40 -99 -443 -1
7789 -1 -302 123 -165 -467 -188 -32 140 -359 260 265 139 -576 345 -245 -68 -1 449 -32 5 -34 383 44
7811 44 89 -296 -36 -38 134 113 -140 11 -55 270 -84 -326 516 83 -44 478 -367 -198 453 98 145 393
7833 393 166 -411 -67 341 -204 387 402 218 573 -192 -71 76 752 281 407 625 242 208 590 -174 312
7854 312 -86 367 607 9 180 97 -6 227 -536 -179 50 -263 218 24 17 56 -82 292 382 43 -48 -94
7876 -94 386 35 70 -70 -226 88 456 -233 -456 222 -123 -142 -164 -14 -28 40 -244 408 278 -234 -10 -804
7898 -804 -163 208 -286 -293 117 411 654 -585 -120 66 -11 233 -48 -36 -234 -432 76 -11 277 -18 75 353
7920 353 -278 -491 -147 0 85 -271 -246 -266 -66 -106 -459 -17 406 -73 29 218 337 187 -56 65 106 93
7942 93 -126 -342 -158 361 -196 -290 97 -33 413 -87 -83 36 -240 -261 -70 43 -194 177 618 -282 -270 -340
7964 -340 118 213 350 205 223 186 -426 147 554 -316 -47 -309 429 -178 23 -341 101 -47 279 -424 -3
7985 -3 115 29 -57 -48 376 -44 159 7 -127 326 7 448 103 -340 250 35 -102 -175 -303 -377 35 28 573
8008 573 104 -323 -258 -149 578 -71 -100 23 -627 -462 205 85 -86 427 14 -139 479 191 -503 -1 -29
8029 -29 -129 224 -42 0 572 20 297 290 -63 -237 306 158 -661 -218 385 -85 395 115 724 -109 -601
8050 -601 246 16 155 -166 -377 185 -414 82 -115 -22 -150 333 -296 -116 76 183 -128 96 34 17 -150
8071 -150 171 118 324 -42 115 -148 312 -425 353 232 -168 -414 466 -342 -383 -192 -218 23 142 -405 -141
8092 -141 344 64 606 571 -331 -120 403 -193 -410 293 190 348 -107 191 -458 -151 -11 -257 120 -183
8112 -183 105 188 279 -78 -133 20 280 -335 -197 303 -262 82 186 -404 -90 -239 498 401 475 235 184 54
8134 54 168 159 526 -51 -281 121 110 54 599 883 87 -128 -98 -194 702 263 65 -178 -16 321 273 343 81
8157 81 -829 213 -315 -168 -673 -111 -35 -72 97 44 -259 -170 -59 266 -24 174 63 -165 310 -178 348
8178 348 101 165 208 323 -61 -150 161 -205 498 -74 -437 -312 569
8191E69
$$ Imaginary data points
##PAGE= N=2
##DATA TABLE= (X++(I..I)), XYDATA
0 0 0 0 0 0 0 0 0 0 0 0 0 0 0 -32 32 -32 32 -32 64 -64 66 -96 109 -128 160 -191 213 -247 287 -320 363 -417
32 -417 479 -541 608 -680 768 -860 962 -1072 1194 -1328 1471 -1628 1800 -1991 2200 -2424
48 -2424 2672 -2941 3241 -3569 3939 -4341 4798 -5311 5897 -6567 7349 -8270 9373 -10726
62 -10726 12435 -14658 17695 -22119 29176 -42276 75028 -346506 -423776 17695 -150143
73 -150143 -2909 32504 -105255 -115402 172405 211315 77874 146236 250421 49306 79092
84 79092 165147 -30799 -90329 65393 28417 -32447 6338 43996 -27443 -27800 68109 -14215
96 -14215 -116037 3193 -5913 -77024 -27800 -65116 -133434 -90034 -15765 27722 -7638 1382
108 1382 25389 -17273 46755 112066 48397 51232 45855 4012 20756 860 -7689 5649 -17802
121 -17802 6886 2916 -29356 -7652 -17138 4470 31972 -9941 4709 -5512 -46465 5843
133 5843 3463 -27820 -577 -12602 -12798 -3711 -13484 38 -28094 -16259 28278 -10667 7610
146 7610 39428 -15767 -3866 23288 8004 21967 28961 39886 18819 -22419 10057 -6543
158 -6543 -33053 26819 11388 -28180 -5156 -17274 -20756 -11820 -3458 14514 -21044 -15378 13910
171 13910 -30745 -10043 24758 -10079 1841 9239 -6176 4061 -1055 20165 20427 -10195 19708
184 19708 9780 -13943 22027 6438 -6828 10036 -2214 12484 6761 -9092 9050 -18775
196 -18775 -19950 9481 -14854 -8614 -1971 -25774 -12365 -18599 -11968 11012 -9741 10165 20150
209 20150 -11331 11502 14917 3609 21801 8222 9901 7714 -13640 10233 860 -16060 13020
222 13020 -4585 -6659 16684 -3193 1673 1645 -10055 6896 -9792 -7682 4092 -27805 -12968
235 -12968 -4047 -25424 -410 322 -5322 12656 502 10624 13156 -2934 21473 9938 -1437
248 -1437 20858 -607 -2065 11398 -7378 4308 1873 -6700 10311 -8604 -4929 7711 -16561
261 -16561 -1086 1719 -18565 60 -9268 -11985 2253 -14483 -673 2035 -12770 11035 2164
274 2164 -4198 15944 -1696 6293 15323 -865 13723 6669 -424 15958 -2643 1911 11237 -9951
288 -9951 4578 2947 -10276 5049 -9924 -9374 1655 -17231 -3044 -2793 -17087 3136 -8381
301 -8381 -11593 6348 -10098 1721 9009 -4314 13933 4962 964 17669 -144 8849 16241
314 16241 -3255 12763 5251 -6264 9424 -6336 -4742 4267 -11588 1680 -2666 -13321 4878
327 4878 -9902 -9443 4204 -13563 -1691 418 -13220 3733 -7187 -8381 7020 -7180 5778
340 5778 10515 -3148 15067 7659 2867 19523 3210 8065 13718 -4657 7393 -14 -10085
353 -10085 4507 -10836 -6874 1864 -15356 -1131 -2623 -12382 5345 -6823 -7555 3558 -12241
366 -12241 -615 732 -8782 7733 -2347 -3503 9956 -6226 5640 13718 1138 17329 9716
379 9716 1981 13238 -220 6917 9563 -6631 5657 -4484 -14650 2543 -11879 -12827 -2340
392 -2340 -13998 -3050 -4422 -8917 5197 -8054 -1038 11460 -8263 3549 7509 -7304 6973
405 6973 2371 -2064 5593 -2105 11686 10938 -2431 14651 2465 -2904 18715 4317 155 4503
419 4503 -9888 -3555 -7626 -8962 1408 -16560 -9380 317 -18256 -3464 175 -10693 5248
432 5248 -1076 -2703 3160 -5568 8607 6863 -2702 13212 91 -806 17547 5243 9866 12534
446 12534 254 12088 5812 918 7037 -12815 -9058 -4247 -16940 -4269 -7566 -14344 -1194
459 -1194 -10252 -4285 5573 -4890 8406 6745 -5594 4727 -5874 -6053 3461 -5493 4110 -736
473 -736 -8555 11899 4416 5580 23009 6931 6637 13016 2243 5951 -1608 -2176 1645 -16328 -4851
488 -4851 -2720 -21757 -146 3473 -12068 918 -767 -3350 -1114 -2504 6336 -10289 -11802 11162
502 11162 -9536 -11495 11656 -6107 -3914 16010 14042 12443 6593 15894 14113 -4845 14895
515 14895 11413 -16142 4835 1960 -22172 -13067 -9255 -7074 -3810 669 8724 -13346 -13870 10605
529 10605 -6499 -3815 12801 -6798 -5507 1879 -1419 2858 -4016 5667 13368 899 13966 10110
543 10110 -7036 6402 2908 -144 5907 -5635 52 -885 -12783 1283 -5529 -10254 7218 3089
557 3089 1633 -1962 -12192 -610 -5046 302 15342 -9302 -11056 3401 -9757 -1857 7665 1370
571 1370 3837 3345 12363 6115 -9438 10968 7351 -4903 20192 6424 -16279 -3015 -2752 -6115
585 -6115 -3300 760 3132 -13713 -2382 8358 -21988 -11465 8306 -9089 1523 11829 -6956
598 -6956 -12254 -4101 11781 7918 2801 22841 5465 -7639 19557 5285 -11521 7186 6005
611 6005 1284 1112 -2264 -7286 -22386 -5574 9935 -10544 -1474 3215 -17013 -4373 4077 -2250
625 -2250 761 -2494 5745 3642 -5901 5968 -3126 -7631 13404 6869 4312 8167 -2374 5761
639 5761 7172 3649 12194 -1455 -3607 4561 -5770 -4188 -8570 -14717 -2931 -8049 -4818 2280
653 2280 -15292 -7835 3789 -2757 8152 7260 -873 1852 -2124 6292 5281 -4680 11791 3537
667 3537 -5527 10053 -247 -3744 7734 4924 5923 2134 -393 3678 -9414 -2785 4165 -14927
681 -14927 -4815 -1483 -15421 -5380 -5205 -7119 -1092 -1720 7769 4069 -2649 10834 1120 -2575
695 -2575 13439 2205 754 6666 -1328 2188 303 214 7631 -2628 5046 8735 -5165 3302 2221
710 2221 -8037 296 -3500 -6093 -2422 -9958 -2887 -5095 -10696 2801 -4551 -5685 6181 -2056
724 -2056 2767 5673 -881 7387 2493 1319 10993 -317 3720 7490 -3803 3340 2126 -1914 5261
739 5261 -1829 917 2738 -8455 1872 241 -8695 1791 -4331 -6953 -409 -7129 -1088 -2075 -7185
754 -7185 3338 -4505 -3448 8354 -2246 2584 6417 -2074 5817 3489 3070 8819 -168 4411 5683
769 5683 -4884 5648 1866 -4601 4748 -3638 -3782 782 -7042 -689 -2929 -7421 1168 -7757 -5873
784 -5873 1199 -7654 334 1996 -5095 4159 -914 -570 7070 -200 5260 7126 -223 8326 2854
799 2854 454 7788 -1552 1614 4732 -4361 3036 -1350 -6939 1110 -6426 -3546 1301 -8496 -854
814 -854 -3361 -9001 697 -4439 -2579 4395 -4443 2118 2791 -3300 6580 1852 2055 8734 855 6032
830 6032 6564 -1759 7032 1893 -904 6387 -3198 -587 1562 -7027 -109 -3946 -8163 -58 -7042
845 -7042 -3231 2425 -6001 590 -1071 -6103 3147 -2252 -1095 4625 -3517 2787 2998 -2492 7527
860 7527 2542 2503 10194 2038 5436 6235 -1488 5669 -545 -3955 2262 -6762 -2653 142 -9542 -2628
876 -2628 -4408 -7915 1569 -3973 -786 3147 -5006 1694 407 -4061 5266 -1181 540 6382 -2075
891 -2075 3948 3975 -1254 7765 3229 2411 8959 -1734 2980 3338 -5850 345 -3238 -5868 1889 -6477
907 -6477 -3091 -1011 -9811 -322 43 -2685 4447 -2411 -1625 2249 -3932 4205 2157 -2693 7791
922 7791 -230 184 6789 -2787 2012 4413 253 4522 -1421 -1602 1889 -6715 432 1468 -7985 2750
938 2750 1014 -3617 3047 -3207 -2097 -213 -2678 4750 -3005 -5670 3115 -6567 -2418 6213 -2906
953 -2906 492 3140 352 5168 158 4550 6841 -2839 6867 5147 -5878 2026 -1036 -4345 1737
968 1737 -3556 -2221 -3308 -5984 3016 -3162 -3857 4797 -4690 -1066 3288 -5095 -282 -2205 -2656 5435
984 5435 -1781 944 4257 -4608 4258 5456 2083 7626 929 1920 4924 -3909 2294 1150 -6105
999 -6105 3905 -985 -5041 -734 -6068 -1886 -1083 -2705 4813 -3746 -4763 4631 -5307 -1379 5799
1014 5799 -2855 -126 1886 -476 707 -3685 3714 3612 -4204 9572 5191 -5072 6791 2390
1028 2390 -2790 6617 3556 745 -3404 -2213 2134 -8471 -1781 5784 -10765 -3130 4109 -9243
1042 -9243 -4751 259 -2893 -1718 -464 5326 -2531 -8364 7232 753 -2928 12795 3320 -2934
1056 -2934 6556 3220 2949 1943 3177 6569 -2527 3660 5151 -11012 -4336 679 -6009 2011 -1181
1071 -1181 -5767 -5540 -9792 -935 -457 -5158 4023 -989 -3845 3798 -2801 -368 2595 -197 9343
1086 9343 5228 -293 6621 -784 1817 8924 3861 4272 366 -1483 2961 -6087 -2869 1067 -9769
1101 -9769 -1325 2769 -8832 -5467 -5736 -5532 65 374 4665 -2584 -7927 5475 -1024 -1209 10797
1116 10797 805 -432 7526 2146 1913 903 3349 7327 1093 7144 3861 -10207 321 1757
1130 1757 -5478 3435 -833 -7176 -4593 -4725 -1817 -5768 -5775 4040 -2875 -803 6867 -6557 -4106 3378
1146 3378 293 5586 4257 1529 2624 -3023 4681 4880 -2856 6430 3711 -549 5830 -1704 -3623
1161 -3623 -573 -3595 3582 1020 -5465 -1215 -6817 -5119 1198 -4256 -527 -2109 -4699 3493 -2134
1176 -2134 -2818 4735 -2574 2367 7507 537 2694 173 2018 6340 304 5353 4562 -4943 3467
1191 3467 2388 -4808 2675 -648 -2988 -922 -3343 -250 -6169 -6250 3134 -4452 -3029 3898 -6790
1206 -6790 -3039 1910 -1212 2347 -43 1815 2813 -2225 5640 4131 -3127 6482 2909 -677 6241
1221 6241 791 -340 913 -2141 2619 -1702 -3305 2086 -6578 -2865 1357 -6802 -1012 -584 -4545
1236 -4545 1432 -2921 -2683 627 -3887 3370 2770 -1322 5207 326 288 6295 -106 3367 4327 -1193
1252 -1193 4453 1044 -1185 4335 -2374 -299 1816 -4177 939 -2689 -4888 1745 -3826 -3111 414
1267 414 -6008 -438 -387 -3647 2047 -2013 -632 2671 -1413 3642 2700 -1771 5749 1248 775 6242
1283 6242 -90 2052 3375 -1215 3535 -527 -813 3391 -4451 -1070 55 -6248 186 -1530 -4679
1298 -4679 -4 -4507 -2092 -259 -4636 1316 -618 -3609 3613 -464 73 4659 -1385 3094 3781
1313 3781 -95 5087 1048 733 4529 -1608 1987 2335 -3196 2694 -904 -2892 1664 -4803 -1814
1328 -1814 812 -4861 763 -2981 -4531 1434 -4160 -1231 2275 -3036 1883 486 -1806 4302 189
1343 189 1883 5207 -283 3603 3378 -933 4268 52 -736 3758 -2171 1271 401 -3944 1655 -2158
1359 -2158 -3321 1035 -4373 -2033 -500 -6064 -437 -2093 -3276 2222 -2663 -772 2865 -2133 2484
1374 2484 3495 485 4918 684 1645 5262 -847 3861 2622 -2335 3125 -142 -1318 2020 -3188
1389 -3188 -802 -789 -4086 542 -3348 -3566 1370 -4622 -1804 303 -4652 -21 -662 -622 3256 -1707
1405 -1707 1507 2867 -1453 4618 4052 22 4888 1035 68 3570 -598 2317 261 -2423 3030
1420 3030 -2668 -2905 1003 -4835 -1730 -245 -4241 -557 -3157 -3277 1007 -3913 -799 2280 -2643
1435 -2643 2273 1629 -1432 2740 -428 1772 4485 -440 4243 2350 -1758 5142 821 -297 2574
1450 2574 -1566 765 -87 -3106 775 -4135 -2943 1787 -4852 -1819 148 -5538 -772 -967 -1616 813
1466 813 -1776 1980 1508 -2254 4413 527 -2251 6032 1632 -77 3383 -196 1436 740 1508 4142
1482 4142 -2767 254 3140 -5290 -288 1395 -5065 -600 -900 -2742 -1789 -4621 -483 -968 -3186 3934
1498 3934 -661 -3938 2612 -1153 489 2989 820 4084 1598 1131 4488 -1498 1490 4684 -608
1513 -608 2305 629 -2850 -57 -3468 -407 2123 -4292 72 27 -5611 -613 -1780 -3258 -77 -2254
1529 -2254 2257 -316 -3803 3247 -1227 -1971 6235 1451 125 2853 1385 1577 -211 2684 4312
1544 4312 -2997 2500 5032 -5137 -86 2993 -4214 -241 1020 -394 -3354 -4190 1260 -3661 -4023
1559 -4023 4622 -2423 -5536 2956 -1828 -2246 1882 1570 1892 283 3337 4106 -2689 4215 5236 -2761
1575 -2761 4141 3673 -3131 83 527 -561 -720 -816 2060 -2919 -4010 1969 -4994 -4978 867 -3483 -966
1592 -966 1179 -2170 -723 -2987 202 4108 -419 3284 3141 -2469 2545 2141 781 3464 -89 2863
1608 2863 2941 -2219 1555 -856 -3498 2152 643 -738 -772 -3474 -1603 -3445 -1654 3084 -4625 -3622
1624 -3622 2112 -3681 -1893 1459 -1293 -13 175 3712 2256 -3739 3141 2852 -1694 6134 4427
1639 4427 -2593 1659 669 360 459 354 2686 -2750 -1320 3417 -5482 -4184 2164 -4047 -1042 1390
1655 1390 -1861 -2965 -3306 -129 947 -2335 3384 1341 -2811 3740 1181 -976 3127 1389 2425
1670 2425 3221 863 2117 -1448 -671 3465 -1258 884 1164 -3688 -1238 -1370 -2189 66 -3467 -1220
1686 -1220 194 -3582 -328 -1895 -3555 1362 -217 1148 2213 -1938 1803 1711 -545 4422 1045
1701 1045 899 3479 126 2065 1518 -948 2622 -699 -198 2449 -3660 -1450 334 -4402 -679 -858
1717 -858 -3174 -1384 -2677 -921 -269 -3201 1704 -1017 -1886 3528 -355 -1726 2937 -300 1775 2393
1733 2393 1139 2577 -665 1618 3791 -1531 1441 2273 -3108 539 51 -2413 -479 -2055 -855
1748 -855 -1491 -3363 901 -2805 -3491 1756 -1810 -1289 1516 -2174 619 584 267 2776 -1046 993 3651
1765 3651 -850 2641 2637 -750 3535 393 -174 2605 -1263 154 -152 -2937 575 -1913 -2784 503
1781 503 -2975 -1088 -331 -3625 478 -1203 -2469 1582 -1479 -763 1779 -1618 2625 1495 116 3518
1797 3518 130 1487 3849 -536 2124 2026 -1370 2204 -663 -1055 952 -2113 -417 -381 -3445 462
1813 462 -2354 -2451 263 -3143 -1732 53 -2877 564 -12 -1305 1909 -171 1202 2847 -685 2948
1829 2948 1987 -332 3706 294 1688 2161 -1467 1272 550 -1887 1360 -1355 -1231 1078 -2838 -798
1845 -798 -313 -3308 894 -1056 -1421 686 -2414 -284 1222 -1940 1834 957 36 2921 277 1640
1861 1640 3026 -570 2721 1336 -306 2057 -723 -423 1231 -1989 556 -533 -2205 732 -2061
1876 -2061 -1781 129 -2947 -620 -476 -2562 655 -738 -808 1149 -1409 379 1427 -1205 1810 893
1892 893 -311 3170 -246 498 2058 -71 2405 1177 79 2346 -701 -20 1377 -2198 -190 -138
1908 -138 -2874 69 -2070 -1951 -481 -2878 -33 -30 -2278 904 -626 -1510 2086 -850 414 2568
1924 2568 -678 2154 601 261 3164 -422 1502 3238 -571 2171 1460 -881 1497 -976 -857 -268
1940 -268 -2862 -609 -1930 -4326 276 -2796 -2540 1005 -1608 -275 -207 -1485 1965 431 455 2970
1956 2970 -207 1052 2642 555 2720 1315 1461 3110 168 1114 1510 -2615 1039 539 -1726 770
1972 770 -2043 -2590 -1535 -2658 191 -2078 -3515 1500 -1630 -1693 1847 -1623 -875 1151 924 2649
1988 2649 283 1616 2802 -1528 2967 3833 -1349 3065 2551 -517 1592 -229 -274 -112 -1309 2271
2004 2271 -2278 -3245 302 -3440 -2340 1474 -2132 -2327 -893 -1507 -250 -2028 537 1533 -2757 2798
2020 2798 2110 -1862 2508 1219 134 3711 2162 2651 812 -920 2438 -42 -688 2767 -1471 -1386
2036 -1386 863 -2431 -1527 -1948 -2628 -82 -2728 -872 -51 -4164 -737 637 -1392 1815 745 204
2052 204 1637 -673 2617 2246 -969 3921 2369 390 2719 137 -340 849 -175 2626 -1108 -1879
2068 -1879 1316 -4048 -2600 1648 -3127 -2098 -880 -1812 -1712 -2400 590 48 -3067 3785 2180 -2542
2084 -2542 2517 1351 -845 2858 2619 2264 0 669 2545 -1332 173 3430 -2241 -447 2755 -2220
2100 -2220 -1506 -439 -1407 -364 -1400 451 -1271 -4378 109 -1152 -2295 2045 -396 -1476 1717
2115 1717 -556 1135 604 108 3674 812 1771 3428 -1349 541 1359 -463 3231 26 -752 1160
2131 1160 -2414 -565 40 -2763 -140 -1061 -1849 245 -2499 -1524 -1092 -2433 1801 1041 -2348 1133
2147 1133 -1109 -611 1973 707 1873 993 43 2785 -660 1024 2334 -2014 1469 3242 -1695 -376
2163 -376 -726 -2054 -546 -1095 848 -1715 -3597 1278 -1933 -2781 2562 -1213 -2059 1444 273 -213
2179 -213 -159 192 1352 -587 3075 2510 -2297 1411 2260 -1147 2713 1298 -380 627 -430 1163
2195 1163 -241 -2096 1204 -1361 -965 1298 -2216 -1557 -856 -1844 -37 -481 -997 554 -1484 -436
2211 -436 1474 -1383 1669 741 -390 4029 250 587 2546 -520 2303 2534 -683 1113 -590 -884
2227 -884 1124 -1426 219 -32 -2783 1350 -1659 -2139 627 -2573 -1817 909 -1871 -498 -1347 -1104
2243 -1104 2098 -823 1445 1520 -1173 1389 1825 -139 2383 564 373 883 -466 1821 367 -1058
2259 -1058 1753 -1187 -1304 1839 -2124 -776 -61 -2160 -452 -1687 -2071 -335 -2554 35 527 -2550
2275 -2550 1567 -92 -586 3106 93 1005 2447 588 2650 1390 270 2154 -599 245 1341 -1956
2291 -1956 601 228 -1909 772 -1492 -1521 198 -2780 -258 -863 -2177 261 -1721 -1537 472 -1561
2307 -1561 107 1570 -1471 2107 1278 -93 2732 -193 1192 1945 -824 2677 862 -859 2404
2322 2404 -1481 -532 1318 -2161 23 -455 -2051 -106 -1770 -991 609 -2075 -33 -373 -2301 1051
2338 1051 -692 -981 1315 -386 672 1024 -927 1344 305 351 2937 -243 1438 2380 -1091 999
2354 999 730 -669 859 -919 -537 442 -2455 -265 -777 -2526 -112 -2336 -1544 155 -1561 -415
2370 -415 -34 -1378 1520 -172 -399 1846 -260 1051 1384 -368 2101 1208 522 2287 160 839 1058
2387 1058 -1261 1223 -265 -1824 182 -1780 -863 -182 -2391 -131 -675 -2208 307 -1663 -673 978
2403 978 -1465 646 294 -832 1560 214 563 1942 -475 1488 1878 -396 1596 714 -776 1625
2419 1625 -722 206 749 -811 708 -436 -1733 879 -1636 -980 507 -1530 -299 -895 -1383 -18
2435 -18 -1803 -707 511 -1190 1124 1023 -756 1623 726 203 2181 513 1344 1036 -437 1830 -510
2452 -510 -1278 1557 -955 -262 839 -1046 140 -330 -1145 704 -1093 -265 -45 -2017 -296 164 -1034
2469 -1034 1214 -1050 -516 823 -1024 990 841 -91 2732 417 108 2390 -630 935 1423 -286
2485 -286 1030 -469 -1029 977 -1519 -474 -52 -1607 505 -262 -1747 -908 -1770 69 280 -1376 1026
2502 1026 -317 -1547 1366 364 -477 1562 830 1970 917 327 2219 -755 555 2499 -523 579
2518 579 1226 -2093 -778 -559 -1202 -421 -1903 798 -828 -2845 1219 -440 -2788 1718 209 -824
2534 -824 313 -900 506 -166 860 2784 122 580 2148 -1193 575 1963 -967 871 782 671
2550 671 585 -1833 354 -450 -1421 1207 -789 -2352 -177 -1860 -903 -156 -1241 271 -550 -703 1635
2567 1635 -870 -191 1541 -151 1386 1536 313 1224 -205 661 2780 -187 1150 1249 -1406 154
2583 154 -87 -1134 116 -1131 -77 -444 -1647 213 -2015 -1904 1328 -852 -948 618 -1197 -239 -158
2600 -158 1104 1633 -797 977 2374 -1142 917 1314 -1099 1585 1204 760 278 -388 526 -1143 -725
2617 -725 2115 -1285 -1683 1081 -1487 -1155 524 -465 -869 -774 428 634 -1954 359 1123 -1608 1501
2634 1501 1710 -657 990 439 222 900 666 2088 -311 -206 2892 -903 -486 1401 -1431 831 320
2651 320 -1566 78 -1968 -1303 244 -1116 -225 89 -2229 -120 -493 -831 1346 -647 399 1694
2667 1694 -910 1245 333 -636 1573 1053 1052 967 -549 478 -1 -561 2033 -485 -707 1402 -951 -726
2685 -726 -149 -1323 59 -982 -269 -297 -2281 -302 -55 -1967 1351 533 -1094 1565 230 -68 62
2702 62 69 1781 550 1272 2705 -801 41 1284 -823 509 1243 -1074 -505 -724 -409 -795 -1712 256
2720 256 -931 -1873 989 -303 -656 421 -560 118 655 -171 1138 -283 -146 2038 620 1127 2002
2737 2002 -565 1698 -20 -780 1301 -255 -388 918 -1132 -278 -68 -1325 308 -1602 -634 146
2753 146 -2098 -271 244 -1381 580 -434 -776 693 -351 634 657 22 1194 -265 138 1569 -428
2770 -428 90 1532 -316 747 649 -356 726 -821 57 230 -1573 420 -995 -1776 871 -713 -1170
2787 -1170 29 -1617 57 139 -820 562 -1206 -90 1004 -654 707 445 -273 1313 1187 293 1322
2804 1322 -117 1127 1237 -475 607 129 -1136 399 -979 -948 -293 -1774 -702 -130 -1388 -111
2820 -111 -1388 -451 866 -1220 339 -193 -404 1181 -110 639 1297 -159 1229 1428 317 1616 473
2837 473 -504 1651 -810 -601 704 -1270 -123 -548 -1231 501 -1306 -1297 -186 -1140 -205 -315 -1029 932
2855 932 -1028 197 1013 -256 1113 1208 216 1381 145 -84 2037 -238 1508 611 -813 892 -135
2872 -135 -870 544 -664 -266 -64 -1800 178 -581 -1116 -593 -1341 60 112 -983 94 109 -339 1418
2890 1418 184 324 1077 -61 1138 1197 -358 1210 -119 88 955 -56 709 198 -891 417 -658
2907 -658 -1115 -730 -1408 63 99 -1460 780 -407 -985 7 -815 -119 529 -1091 819 929 -186 1864
2925 1864 80 478 1344 -270 926 544 -356 936 -411 138 525 -884 -249 426 -1178 359 -368
2942 -368 -1286 24 -1433 -88 -767 -1836 650 -418 -822 905 -453 250 118 -374 326 119 -102
2959 -102 1363 -106 861 1181 -530 570 920 -127 1314 -207 -32 -353 -576 455 178 -1217 1087
2976 1087 -116 -1708 239 -1236 -530 -367 -832 239 -14 -368 1158 -499 153 1154 -590 1362
2992 1362 586 219 1292 82 554 769 -219 1022 672 -709 677 -856 -830 623 -714 -126 -395
3009 -395 -1570 -725 -730 -1318 544 -1541 -458 167 -1241 325 -448 -530 1434 15 726 1610 -1013 1042
3027 1042 913 -99 1434 377 409 101 -808 959 -346 -874 1400 -893 -793 583 -1556 -1145 -609
3044 -609 -751 423 -612 -924 222 -1021 688 1112 -819 1362 935 -181 1309 598 -130 950 229
3061 229 1601 392 -192 949 -1067 -562 1680 -729 -470 -304 -1575 -326 -541 -653 32 -1969 128
3078 128 215 -1160 317 -136 -958 833 180 1269 507 -906 1111 1452 704 1294 -281 -45 568 -547
3096 -547 416 -125 -842 888 -428 -572 483 -1616 -650 -293 -275 120 -609 -572 169 -1271 377 3 -1156
3115 -1156 883 410 -286 749 -170 -216 238 -116 981 90 -216 1427 -950 -253 1188 -91 582 530
3133 530 -467 -130 -638 -679 -919 -1770 79 -161 -1639 96 -495 -1413 1428 -127 3 119 192 511 -826
3152 -826 444 1359 -761 1202 1924 251 861 324 -342 920 -172 80 -33 -1487 190 -865 -1171
3169 -1171 1029 -1517 -821 162 -1319 80 -954 -1049 684 271 238 1086 -728 40 813 731 1876 276
3187 276 -125 765 -343 -154 1302 -891 49 180 -60 560 -783 -725 -637 -1255 725 -220 -1589 337
3205 337 -664 -543 -252 -373 266 -104 -17 796 -771 -461 804 -1204 743 1752 -79 1089 521 314
3223 314 670 -252 1071 556 -787 1316 -707 -832 307 -1279 -937 87 -306 -456 -897 -220 429 -1091
3241 -1091 -74 725 -1593 53 762 -898 559 477 -607 1011 71 1006 821 -475 1086 -72 136
3258 136 1391 -898 -211 923 -825 391 -688 -529 -186 -832 -225 85 -1030 705 -360 -995 -116
3275 -116 -864 -517 570 -1131 332 392 7 1238 102 233 1411 -64 963 855 -203 1366 -280
3292 -280 -714 593 -209 -159 376 -999 -4 -1086 -1142 -31 -1478 -389 139 -867 63 528 -530 941
3310 941 26 -204 1309 -108 1702 322 74 1227 84 229 1170 -391 558 267 -397 549 -187 -368
3328 -368 187 -1129 -426 69 -1547 -150 -1049 -1127 327 -947 -185 -220 -980 473 -48 -712 665 -463
3346 -463 221 1480 118 1187 1095 -368 1372 131 242 1041 -708 120 84 -744 293 -651 -949 73
3364 73 -1203 -661 -23 -1489 374 -248 -699 349 -653 233 800 -386 485 380 -185 1347 248 828
3382 828 1208 -338 1115 436 -475 684 -138 221 108 -606 26 -225 -863 -302 -457 -1666 72 -1590
3400 -1590 -450 334 -392 386 -687 55 699 -496 199 679 -589 1060 216 10 838 -14 213 861
3418 861 -211 921 -83 -633 197 -411 -721 415 -1276 -7 2 -941 179 -688 -411 255 -1361 -239
3436 -239 130 -755 58 0 -27 840 299 669 1067 -130 884 891 -211 703 259 -116 784 -784 300 74
3456 74 -714 611 -241 -338 89 -1340 -652 -119 -1131 225 -675 -1030 525 -590 153 835 -768 767
3474 767 233 109 529 205 846 1208 -325 1607 178 265 1532 -171 -351 729 -450 139 -341 -1108
3492 -1108 58 -957 -445 523 -1797 55 -177 -1526 222 327 -345 323 -191 653 464 -113 299 -242
3510 -242 -440 1749 -140 -323 1423 -121 203 939 -379 592 -397 -451 487 -1409 -91 -490 -1334 59
3528 59 -979 -275 -129 -1374 330 -753 -433 528 -69 -664 430 -386 430 457 54 1447 173 -42
3546 -42 1381 -699 165 1080 -369 754 67 -439 254 -701 -512 -377 -1141 -112 -252 -1598 257 -500
3564 -500 -736 347 -347 1004 49 110 804 -445 372 1321 -99 440 1191 -57 -135 -58 369 616 255
3583 255 455 180 -798 35 -591 -1573 362 -614 -513 -321 -853 -361 -749 82 719 -653 6 1199 -528
3602 -528 362 776 -641 1139 -153 512 588 -94 659 237 -102 1275 418 -576 353 -548 429 224 -732
3621 -732 -360 -219 -753 419 -1034 -597 27 -491 318 -208 -405 280 -924 -205 645 -307 557 560 -57 859
3641 859 629 562 608 -143 978 536 -396 601 -291 -472 317 -52 -580 -90 -558 -291 -930 -317 49 -1156
3661 -1156 132 420 -1538 272 -41 -1044 445 471 452 139 -186 913 338 -322 1516 50 -148 1146
3679 1146 -474 -45 372 -378 -83 81 -134 650 -372 415 -133 -1054 790 -19 -1063 188 -752 159
3697 159 819 -780 737 -370 574 928 53 435 884 110 1230 847 -441 136 -852 -306 962 -28
3715 -28 335 43 -368 30 -300 -848 210 -917 -544 -134 -876 232 -594 -440 235 -255 727 184 -542
3734 -542 792 43 437 778 32 29 1375 -84 204 58 -26 580 -5 -557 252 -1286 -239 98 -746
3753 -746 145 100 -1303 -22 -136 -231 172 -344 105 -235 -246 1081 -663 -327 726 97 700 376 -41
3772 -41 771 -1 -136 997 -265 1021 -73 -681 711 -291 -743 446 -284 -369 11 -290 297 -467
3790 -467 -1061 163 -159 192 284 -523 670 259 -81 511 -101 -124 672 -232 927 878 -31 438 -302 -128
3810 -128 683 -702 165 90 -530 -150 -218 -796 249 -1095 -371 -184 -174 115 -626 -789 406 -150 271 788
3830 788 169 447 -43 -265 909 89 282 43 -385 527 445 -198 395 -241 -25 398 -523 -228 153 -610
3850 -610 20 -899 -250 218 -1580 247 -25 -708 -212 145 85 333 -357 -61 598 -123 369 406 -216 1074
3870 1074 -345 385 334 -1 141 -309 -185 -158 -401 -207 237 -435 -268 -268 -832 547 -144 -609 175 -457
3890 -457 -46 360 -624 438 72 -103 408 -122 197 595 -493 656 210 -428 834 -95 96 281 -130
3909 -130 -291 -448 -487 509 -603 -111 493 -741 -306 23 -1138 17 -110 -175 -53 -403 482 415 -37 458
3929 458 -97 -37 571 -343 266 1039 67 405 48 105 589 -154 419 434 -551 30 -215 -1029 -98 -91 -806 -235
3951 -235 -252 -226 -214 -194 324 -408 -25 536 -131 374 580 205 739 -2 105 793 -389 235 353 -665 623
3972 623 82 -517 308 -384 -49 -421 -777 -283 34 -705 50 -644 -409 -25 -876 161 252 -594 658 -521
3992 -521 17 532 -312 -148 885 -423 215 365 136 39 -710 56 248 -787 51 9 -665 78 -573 -601
4012 -601 234 -1037 -196 -350 -674 611 -268 125 404 -532 137 626 -260 1191 372 -494 387 -360 627
4031 627 393 -105 770 -450 26 613 -407 -176 368 -326 379 25 -366 -150 -920 -231 213 -242 -59
4050 -59 71 -502 28 -574 319 164 -379 846 538 -455 711 232 48 659 263 395 286 -383 1052
4069 1052 -436 -925 -93 -636 -160 96 -562 -289 -270 129 -53 -715 34 -308 -754 478 256 -299 1001
4088 1001 271 35 401 72 457 -257 -252 904 365 -141 464 388 -268 -89 -25 299 139 176 230 -472 -228
4109 -228 615 -1122 -8 145 -465 52 -289 -395 455 -125 458 -392 -25 644 30 -257 621 457 536 984
4129 984 -52 79 -484 -529 66 -335 -157 -181 -781 61 -607 -258 144 -487 -611 351 -306 458 -743 -559
4149 -559 552 -564 -128 820 -266 76 56 -17 259 306 399 533 -322 1 204 -459 380 -227 -560 36
4169 36 -311 123 -600 -1021 392 -435 -773 -20 89 -399 5 -334 337 119 19 738 -526 -219 714 -175
4189 -175 397 301 10 683 221 3 571 -963 1072 215 -519 508 -636 -144 -187 220 -186 -38 -682
4208 -682 295 23 -385 285 -261 -214 -33 -715 -121 617 -73 986 142 400 477 -470 304 492 -341 791
4228 791 -602 -70 461 -206 393 -191 -527 -113 -205 -374 224 -493 -211 -389 -359 331 324 -8 1073 -27
4248 -27 41 101 -18 -10 190 729 900 -81 579 374 -152 365 80 -310 602 -255 -267 7 -517 -268 -113 -484
4270 -484 467 -566 -258 125 -741 413 -272 121 207 224 -50 -141 -244 478 404 -327 572 436 -172 1165
4290 1165 28 -152 508 -310 782 -94 -222 290 -168 -172 138 -690 -11 -146 -329 459 -351 -553 -30 264
4310 264 203 -48 -345 429 111 -98 835 -296 -231 672 -571 579 391 -7 220 250 28 95 -291 885
4330 885 -92 -575 582 -759 -581 170 -475 -355 372 -694 -5 -221 -258 188 -34 230 302 -127 656 -158
4350 -158 472 153 -137 -136 879 -363 704 527 -148 -35 -275 -193 91 -286 138 -518 -18 -80 -649 139
4370 139 -295 -432 270 129 -595 649 183 27 279 320 626 183 59 3 33 -216 295 -490 179 175 -47
4391 -47 358 -633 107 613 -348 -679 153 -732 132 -695 -130 -47 -226 -308 196 -377 249 -323 -553 590 110
4412 110 -218 527 -101 355 831 139 675 606 77 594 -336 393 391 8 159 -401 -121 301 -338 -197 -157
4433 -157 -292 746 -523 -346 289 -639 -167 30 -294 461 -166 21 629 271 453 769 192 918 530
4452 530 -177 678 135 -103 380 63 62 -146 -118 512 -702 -842 -300 -1121 -560 -367 -803 197 -398 -962
4472 -962 200 269 286 714 -261 368 815 -219 1225 85 251 486 -63 -434 504 -323 316 -62 -505
4491 -505 326 -335 -579 -231 -491 309 -89 24 -30 -702 -58 1044 -571 289 -109 16 131 225 170 444
4511 444 212 79 610 -68 848 -264 196 668 96 -160 29 -261 74 -439 -398 84 -688 -6 -109 -566
4531 -566 -238 623 -709 111 -136 151 576 -298 496 443 132 1476 -88 -102 775 148 -27 28 -273 313
4551 313 -48 245 700 9 -315 274 -426 30 -5 -307 304 -81 -43 59 -629 -191 -696 -390 237 -530 191
4572 191 483 -75 166 331 -510 481 91 244 663 362 1015 172 -192 197 -99 -473 -286 -469 538 -325
4592 -325 -459 214 -453 -509 254 -30 -450 -327 -612 -131 -79 164 626 -163 577 683 293 522 273 -17 -179
4613 -179 -498 34 303 -90 413 870 -400 -16 -505 -828 226 -127 314 -4 -135 -351 -650 -557 194 -242
4633 -242 -161 482 -377 404 519 406 -621 42 154 467 -184 956 91 -526 285 -299 62 529 137 435
4653 435 -213 -118 627 -458 24 305 -359 -555 -30 -668 -33 -300 -143 505 265 -111 344 -152 -19 191
4673 191 466 220 -160 101 322 343 30 59 295 448 -218 -331 97 -254 5 -363 -369 -190 -738 -598 149
4694 149 -489 3 219 -22 466 -355 -133 196 -206 429 -206 -182 320 320 93 1051 -452 77 236 72 40
4715 40 -578 -89 -238 -798 77 -185 -488 326 -132 -676 -509 -502 -479 -221 -148 475 -205 -111 535 -361 -105 674
4737 674 -235 88 1007 167 406 162 371 -188 -366 472 303 -723 336 -220 -432 301 -410 25 149
4756 149 -503 -67 -165 72 -290 -341 53 -321 -258 184 3 -77 225 -159 -389 485 28 541 810 247 247 3
4778 3 -150 145 -536 34 514 -300 -412 -121 -184 -94 -5 -401 -404 -927 -296 -49 -467 -287 -226 54 504 17 -578
4801 -578 393 -369 139 23 291 94 82 -147 40 -237 411 -253 -484 228 -51 63 -31 -23 177 -543 -420
4822 -420 442 -299 -337 -71 -732 354 -251 -117 175 -106 -135 232 -330 288 -400 -197 720 351 175 340
4842 340 -177 124 294 401 270 -164 -88 -49 -253 -461 -6 -605 99 558 -224 306 -280 -724 133 -872
4862 -872 561 -144 -76 776 138 -131 371 -294 690 691 -295 249 -98 -323 291 51 352 257 93 378 -218
4883 -218 -231 16 -355 -266 -175 -537 -226 303 -365 206 146 -152 187 -301 368 -395 130 602 278 132 414
4904 414 380 281 -393 -266 87 -79 -165 448 -856 -230 -469 -452 -631 -451 -512 -65 -823 -248 50 -518 113
4925 113 -139 -684 135 115 536 260 -257 120 220 -52 866 -343 57 40 -187 249 -232 -443 386 -552
4945 -552 -785 30 61 192 -138 -618 -6 -321 174 518 -572 -201 568 -207 381 -98 -584 415 -88 146
4965 146 415 223 333 558 -271 426 105 -579 355 -553 164 57 -372 173 -195 -271 -186 13 186 -358 -207
4986 -207 195 -109 -88 290 -166 351 2 -292 242 -423 -14 268 -319 104 39 -439 187 292 -365 174 216
5007 216 -396 304 449 107 -311 -48 -106 -38 323 192 -118 -196 -223 -32 72 546 -284 469 -105 84 320
5028 320 196 346 298 -44 557 -3 443 109 -346 318 -22 -306 204 -201 -291 -33 -757 -458 -58 -605 45
5049 45 -112 -222 14 -403 -127 -115 -208 415 -81 307 777 238 10 292 -161 712 155 -295 -148 -356 388
5070 388 421 -185 158 -454 -1010 -158 -103 -79 181 -1427 -36 -166 -484 -23 -312 195 595 -89 562 -336
5090 -336 -489 396 615 -138 609 -26 -255 -304 -127 308 390 25 -76 -378 -431 285 -45 -180 244 -378 258
5111 258 -250 -539 -99 -496 410 106 247 120 -116 76 482 -330 74 192 -166 171 -156 -175 562 -590
5131 -590 520 129 458 223 10 34 144 -145 -295 -345 -572 -294 445 -175 339 64 -202 -17 -107 197 -118
5152 -118 77 -82 481 381 403 323 217 396 152 -251 -586 341 141 -523 -225 179 -884 399 180 -444
5172 -444 111 -46 -361 -266 -172 -90 215 -74 197 -1033 -308 437 66 -317 396 84 759 -94 518 85 -135
5193 -135 -48 61 -190 230 -217 -98 479 -563 -344 -33 -180 -243 192 60 280 -392 -462 -40 -15 220 -79
5214 -79 -647 622 -8 255 69 172 125 148 -550 189 -233 146 532 155 388 -208 -225 166 3 -63 177
5235 177 229 -289 -121 -271 421 77 -710 528 45 38 -441 -230 -410 -226 -109 -29 -302 517 490 -158 431
5256 431 -75 -292 210 -81 -97 407 -28 46 -209 -501 -199 310 179 247 -48 344 283 -683 312 18 -144
5277 -144 -302 -171 -440 273 48 246 239 327 349 59 1 312 -376 600 119 -309 419 121 -457 441 27 -55
5299 -55 34 -165 877 -70 -493 134 -161 -762 233 -284 -325 -129 -230 233 -21 -175 45 -59 -679 257 -294
5320 -294 324 247 -439 738 406 594 -223 532 81 572 70 395 -608 -94 497 -179 483 146 -300 481
5340 481 176 52 -238 -382 539 43 7 357 5 -112 237 146 88 -360 -60 682 158 490 12 -18 311
5361 311 295 -184 581 -208 -76 530 -297 -211 -89 14 164 -265 160 -180 -547 -146 -273 206 419 -9 269
5382 269 -97 -395 115 632 -470 118 276 96 342 -104 818 579 -702 -52 368 43 -734 -301 -241 321
5402 321 -835 -187 -27 0 -82 -902 -258 144 31 5 432 -418 460 -258 86 -3 -6 59 697 -122 141 240
5424 240 273 619 49 -220 -619 -510 -198 73 -262 -141 -408 -478 -70 126 245 -424 -285 246 -161 -172 175
5445 175 -61 -423 369 -10 -47 337 48 266 99 103 296 -208 -97 367 -248 249 -126 96 -403 -60 -596
5466 -596 -134 -277 -488 -178 160 487 -208 -107 351 -605 -249 291 -238 27 -185 376 196 -38 176 -709
5486 -709 -37 256 -42 -98 138 -345 -231 -210 30 407 -383 33 -371 -286 -26 129 -938 -302 -194 270 353
5507 353 234 165 -206 -117 498 106 -127 762 130 601 168 -58 -416 -45 307 498 -114 -85 302 -661 -67
5528 -67 -127 172 149 -485 411 -129 -232 -238 -303 -190 -67 -267 180 577 542 223 616 213 34 735 227 -120
5550 -120 -93 343 -275 -168 186 -437 -221 173 -383 -326 -7 -314 89 -194 -179 196 -191 15 -483 -59 3
5571 3 167 -635 393 102 232 -223 158 244 343 -275 -318 609 -101 127 -207 60 138 -108 765 163 182 -797
5593 -797 0 2 -2 -54 191 -149 -514 -107 -248 -7 240 80 185 690 -110 140 355 286 415 531 190 -171
5615 -171 -238 -52 24 -308 -157 -181 234 87 -406 -12 -351 -408 296 -439 136 -900 360 240 -471 -116 -90
5636 -90 -104 400 -23 134 593 -170 -119 52 318 -106 420 -205 70 275 555 697 234 32 -68 154 -132
5657 -132 17 -90 40 -225 -35 215 -311 53 126 -436 -319 -154 92 237 -693 288 -85 146 449 153
5677 153 189 -123 -157 -535 -40 148 85 -697 145 -182 350 -72 104 -763 -138 189 -189 -64 788 -168 231
5698 231 100 -94 -333 -320 401 -23 179 -225 292 -312 392 -86 91 -184 -171 272 -128 -148 -256 -227 -176 -86
5720 -86 -490 272 -193 -6 183 144 -302 -571 46 140 -517 -401 49 -112 -111 -160 -245 91 -31 -479 738 226
5742 226 -221 342 -218 -547 443 41 -386 17 -96 -31 267 -482 -379 -110 -246 101 -164 -96 3 -79 134
5763 134 -227 268 -118 -365 373 -85 -73 -388 -221 -596 53 18 -27 2 209 -76 -822 645 258 56 -351
5784 -351 164 -424 -241 74 494 147 88 -122 -418 -593 364 -150 51 -120 -556 54 47 230 148 269 236 446
5806 446 368 -96 -112 -35 -90 337 -97 205 60 -64 -550 -145 -401 -413 -390 -146 -167 -158 -66 -14 179 -150 -162 -339
5830 -339 -259 38 342 -154 4 -387 371 203 -227 3 210 153 421 42 476 283 -602 21 7 -136 424
5851 424 4 -215 226 -139 -284 292 -249 -338 153 35 47 -167 47 -109 -577 -90 468 301 267 165 -34
5872 -34 432 112 498 121 263 58 83 -477 79 -323 -108 -202 -517 -122 673 353 540 -201 235 597 -365
5893 -365 -168 640 26 246 122 -3 79 12 -103 322 -341 -117 756 165 623 -351 -209 -344 -285 -145 374
5914 374 -709 33 -28 49 -604 -511 77 -335 26 303 14 19 573 89 347 246 452 -149 -233 -260 302 138
5936 138 -239 289 -349 -38 -481 499 -207 -238 -26 -479 -427 17 206 180 -265 16 -2 -22 -657 -287 -126 -173
5958 -173 -33 6 -269 250 -173 390 92 -339 -441 371 138 -17 309 207 327 52 -424 85 -458 263
5978 263 -383 -103 -124 -286 -211 174 -242 194 237 -610 162 -454 471 -234 -213 368 -417 -97 274 69 509
5999 509 -61 -229 160 -212 156 -28 -184 235 -184 -26 291 157 346 137 431 -272 -431 -135 -80 89
6019 89 -747 -137 -423 9 453 -225 36 -390 -259 507 -262 193 72 -7 470 40 -183 384 -308 136 -35
6040 -35 -230 269 -118 -130 -130 53 -361 -34 -192 -232 -44 -254 -128 114 74 -84 341 239 -205 -61 -262 -159
6062 -159 -470 -7 -71 -69 597 -343 177 -212 63 -251 -162 626 295 -361 538 -337 -69 -82 -344 33 550 -301
6084 -301 -74 -106 -544 -48 -102 52 665 -154 466 498 -45 237 -450 350 175 -79 471 -399 -44 65 285
6105 285 -771 191 -41 136 -9 -68 -288 -203 244 153 -344 153 722 154 409 324 -147 108 116 287 972 -70
6127 -70 257 -194 -170 -126 -47 279 454 170 61 3 -463 -6 -188 -89 -357 -249 -173 -432 -207 127 274 -375
6149 -375 -79 -222 -5 157 57 -309 113 -153 -186 -291 233 737 -353 31 66 162 -170 624 -86 162 119
6170 119 -167 408 -252 -203 -186 70 123 236 -111 -46 129 115 -110 -68 14 -98 308 211 51 576 -21 -428 2
6193 2 -14 148 259 -580 54 592 -39 365 -301 223 -57 -116 -618 -525 429 233 -362 -302 260 -206 84 326
6215 326 570 378 -475 97 -100 -25 -102 196 159 73 253 -173 -115 257 191 -164 35 117 541 -460 328 -447
6237 -447 -462 -106 -182 65 184 -225 548 -140 256 266 101 -116 -266 83 -185 -377 -233 -46 -1 64 568 680
6259 680 -226 293 -33 -241 126 -103 -317 355 150 73 54 -336 -180 -161 220 -367 -143 417 -160 339 -458
6280 -458 -138 -439 245 40 115 148 93 85 717 186 -258 253 171 140 -111 79 -465 -264 325 0 -188 -442
6302 -442 217 268 -26 301 -403 -338 112 101 -381 -5 -92 175 36 268 154 -100 229 487 59 -284 252
6323 252 437 122 983 -134 254 -86 -115 -320 167 8 40 -287 -7 -123 -228 -207 166 -663 -322 -81 21
6344 21 77 -327 269 -684 112 -322 176 247 489 -267 -12 -161 -177 220 168 -474 135 145 55 -229 248 288 -312
6367 -312 346 -331 -436 32 26 -466 74 -163 -551 -43 906 -326 -273 -169 -237 -54 -118 -188 436 243 -264 81
6389 81 -137 142 -77 179 -350 -19 452 -55 732 -290 50 -45 128 122 36 -300 -517 173 316 564 -54
6410 -54 -108 -121 125 -210 450 -294 12 226 -27 292 98 80 -63 77 45 288 629 386 -198 191 501 181
6432 181 276 -538 -89 -226 -325 486 -323 527 390 488 -284 -26 464 -20 61 -294 -50 -81 281 606 -140 833
6454 833 -244 -360 168 23 -205 115 -20 -110 441 -96 4 -115 276 509 163 -25 -351 354 423 260
6474 260 -23 127 132 250 482 -52 -204 31 507 -27 234 283 -149 356 -268 -102 -158 214 -314 -126 199
6495 199 195 91 19 -305 -513 -213 233 -190 -441 -84 394 -98 135 240 -182 -150 30 -350 146 -61 17 -469
6517 -469 229 216 -65 -624 4 -469 270 499 -142 -231 59 21 -11 -199 514 182 -414 -193 9 59 -900 -133
6539 -133 35 -399 -295 -465 -120 -56 370 -152 79 796 32 357 209 -447 -707 315 229 -350 144 -225
6559 -225 5 -281 102 -396 -68 373 -353 -128 -282 -203 -270 128 36 -112 -516 64 -5 -4 -88 305 196 -250
6581 -250 -15 -86 -7 207 428 56 93 -758 124 -51 498 135 -155 494 136 33 -224 -54 360 534 77
6602 77 -60 206 45 707 33 84 -26 -42 -92 452 -416 -211 -35 51 -202 -289 642 38 -412 -172 298 13
6624 13 -90 76 -350 98 30 -94 -144 328 -318 -55 -85 189 196 193 -354 180 -57 -328 -1 171 117 43 -556
6647 -556 -264 -62 49 -124 409 228 251 -128 598 -92 -316 -374 -120 -462 271 234 242 -432 129 -5 -348 174
6669 174 -112 -209 2 220 -21 358 230 51 -57 -232 -72 -198 61 -326 -96 -132 208 687 107 120 -560
6690 -560 -86 -23 -257 -418 -183 -373 388 266 -279 496 -41 341 17 164 -230 -227 -21 -106 -537 -204 -176 -286
6712 -286 197 122 -5 -291 -154 201 -474 -136 -72 -356 -236 488 172 -99 65 62 288 293 -200 -67 345 163
6734 163 154 -253 -495 -18 238 -251 484 489 582 -67 291 37 344 -15 -185 58 161 292 616 134 -592 451
6756 451 -142 596 -276 -153 137 255 -174 -345 108 -320 -62 85 192 -559 24 595 214 -136 100 125
6776 125 69 44 175 -490 97 389 -130 130 -183 -64 52 -3 59 122 -195 387 123 -260 290 -168 336 307
6798 307 -187 39 212 46 42 -298 -2 158 -306 227 -334 -113 49 -73 -319 177 -196 523 289 513 94
6819 94 -87 253 -180 172 198 279 -87 -301 336 261 567 -49 585 -17 208 -30 -293 127 -373 92 -168
6840 -168 -84 205 -102 625 155 45 -118 23 -375 -24 338 269 -123 410 -410 206 118 65 35 101 -321 127
6862 127 -70 111 100 -20 -239 -128 -241 -244 88 -88 455 377 181 -58 676 238 -88 -133 -390 15 -144 78
6884 78 -29 -241 -217 -392 -247 -1 -102 141 263 277 59 60 53 -56 246 358 117 -3 56 69 -80 -149 553
6907 553 -131 406 -174 -23 101 315 123 -2 -210 548 62 147 340 279 9 26 254 176 227 -58 -153 73
6929 73 110 196 -356 292 -72 50 616 -163 -73 -28 -246 -232 72 -596 170 -63 107 430 26 308 104 263
6951 263 327 774 -2 -71 -472 14 -211 -159 -497 7 -46 -45 302 15 71 -279 -10 336 -102 -247 52 -212
6973 -212 198 321 170 -386 -180 143 -575 50 137 284 -249 -65 126 -285 -242 250 -199 -16 74 147 55 342
6995 342 -154 255 -214 352 -214 -292 39 24 368 -207 -173 -149 26 -270 -151 496 17 -239 -147 -151 -234 -88 1
7018 1 234 211 178 225 -286 -230 400 133 68 -108 -252 -389 23 53 -181 354 -164 3 -450 146 277 42 5
7041 5 -113 -155 -362 41 -133 456 -236 -30 61 6 24 -11 416 -134 149 245 -126 -433 -314 -185 -355 351 -244
7064 -244 -223 -216 131 -51 -136 -630 279 -366 293 -141 -284 776 306 -197 472 -225 218 219 -208 160 15 254
7086 254 122 79 -193 401 67 -206 124 -694 -479 -22 180 -974 151 237 -65 425 -428 -17 120 76
7106 76 133 432 -138 -434 106 -177 293 -104 0 -76 -204 183 -878 13 -141 358 195 122 63 -317 614
7127 614 -347 585 452 -34 81 169 321 512 157 42 -279 -233 -471 -100 320 19 58 629 458 -75 397
7148 397 389 -273 -24 -121 -107 394 -106 287 -152 -34 -486 -234 -139 -31 129 -94 -46 450 244 -227 259 102
7170 102 183 -18 -305 104 281 178 69 53 328 -225 327 110 490 -411 -90 587 -108 95 23 -189 -89
7191 -89 4 275 118 -45 34 -50 -144 50 342 -70 133 -71 13 422 513 410 -21 -184 -80 -139 -397 198 -125
7214 -125 -415 452 517 102 81 69 -182 -274 249 -227 227 -62 334 -112 6 -19 -16 276 -158 -321 70 -71
7236 -71 106 37 -196 -58 93 -37 -220 -791 -340 239 -87 24 -60 92 392 392 155 294 -371 68 276 557
7258 557 154 311 34 140 -60 165 56 213 168 -103 -85 -199 -53 89 553 -568 -577 191 120 -141 324
7279 324 -18 437 387 56 330 338 17 -422 198 -77 844 4 -41 -111 27 335 332 261 -18 60 -243 -90 -25
7302 -25 385 284 428 131 -331 -58 -375 294 -491 -334 215 174 293 60 358 -17 225 -613 -240 -82 34
7323 34 -95 -121 358 -13 -39 127 10 74 237 -186 333 -2 323 -260 -344 403 121 81 -315 -576 185 108
7345 108 48 -106 334 -134 -182 -12 -152 75 -305 -83 -89 312 -156 147 128 82 143 95 38 -24 356 364 -304 -447
7369 -447 234 453 -35 293 -143 -785 -76 -466 525 47 -67 83 466 87 6 -19 172 245 -214 -20 -578
7390 -578 -93 574 -26 220 -73 269 207 -3 -315 328 -365 -104 20 -62 -138 16 728 385 21 81 -567
7411 -567 -20 -455 -107 36 -269 -3 459 129 -134 208 120 116 318 104 -335 305 -101 533 554 -138 172
7432 172 -101 -73 22 -227 78 -506 110 204 342 -44 54 83 -206 -309 165 -116 -619 456 369 -293 -8 289
7454 289 -453 -290 -355 17 -173 469 -644 261 -337 383 306 -123 -65 233 -381 -343 -164 163 225 77 -288
7475 -288 30 557 -669 251 -78 -254 -408 -293 -271 198 -141 -104 184 151 140 255 -296 -44 -79 -60 184 -250
7497 -250 68 -357 -309 -116 -177 179 -296 195 384 -115 -506 135 -586 -234 -48 -527 61 -222 -170 -369 180
7518 180 306 381 527 184 -357 -453 220 458 -151 -8 -217 -263 -240 -489 -601 88 -163 192 47 -137 403
7539 403 -192 226 -191 -290 168 -72 145 273 252 -119 -112 -291 -260 -45 192 -249 522 -34 -88 324 -369 113
7561 113 115 -213 -173 111 364 22 -745 -480 -285 -170 -83 214 83 -219 -33 -108 38 35 531 -172 -9 -74 187
7584 187 291 -74 259 335 141 1 -486 -15 167 -148 131 83 -399 86 -208 -240 172 197 121 268 169 -73
7606 -73 346 -89 2 -517 -110 266 234 80 -20 269 -852 -151 74 -461 -556 315 -143 -31 141 -805 539
7627 539 -336 330 29 -309 -518 -144 427 32 315 193 293 -236 -332 -40 -94 -346 -68 454 258 -127 107
7648 107 -128 -297 -415 184 -63 122 79 -112 462 209 -322 -146 313 141 -333 -113 151 30 -174 50
7668 50 -284 440 321 165 563 -193 90 -76 19 -5 3 -298 -269 288 39 291 293 139 -113 384 -174 221 122
7691 122 -97 165 -19 308 -288 105 -22 -257 370 400 4 -291 55 127 -285 -129 70 160 -198 -39 -1
7712 -1 -482 33 325 -205 329 217 -76 418 -95 -644 -192 3 13 376 -170 122 293 470 281 193 709
7733 709 -114 2 -159 -198 -582 -395 196 5 -239 -491 -819 -141 -64 265 186 -88 126 17 35 204 439
7754 439 331 138 -72 283 304 -174 -542 -40 -312 94 27 -36 76 2 25 -15 520 -130 86 -13 -219 -242 120
7777 120 -29 -443 -320 -146 303 99 16 -31 214 153 93 -315 -103 17 205 184 384 -138 182 190 326 -215
7799 -215 344 205 103 98 70 149 -24 132 -181 -341 -165 -39 -434 -268 -236 -18 -110 -312 253 -65 -220 -209
7821 -209 -62 163 167 -276 272 -56 489 -815 -289 -4 -59 -387 -634 12 251 608 -119 619 -75 -552 -129
7842 -129 -330 74 344 351 284 114 124 -62 -283 252 -254 181 -236 303 40 65 -391 296 -350 -76 -216 -185
7864 -185 -317 -114 -68 0 -22 -6 -69 273 162 -191 -312 -52 -223 -269 428 130 124 65 350 -116 -334 128 102
7887 102 -128 383 205 185 162 151 443 182 146 285 -234 151 -231 -718 -213 -124 49 -258 -48 204 -677 -242
7909 -242 335 -28 -421 -109 -219 288 -624 -34 45 -170 33 -495 -304 22 -268 -95 380 -148 271 -93
7929 -93 135 148 -137 41 400 364 -406 119 310 -232 -38 -259 -51 -508 -373 -527 -121 284 -20 -528 129
7950 129 -439 -126 -327 64 -286 220 -341 -337 191 -59 697 -199 -98 -27 -150 63 61 48 538 -78 -145 94
7972 94 138 31 201 25 162 -377 147 129 295 -14 -185 243 -224 -73 -127 365 -212 -30 215 105 145 73
7994 73 316 -102 -40 35 454 -623 -51 361 118 -244 -158 163 291 -21 59 -164 64 235 230 4 -372 -733
8016 -733 16 -239 -85 -326 -78 265 -301 -109 -192 -63 51 225 41 98 67 239 -284 127 174 284 668
8037 668 -83 -499 -69 -528 154 173 504 560 19 179 -87 -582 426 151 423 127 109 302 230 -50 298
8058 298 128 -90 464 542 -237 25 58 -66 -124 590 606 7 -207 -464 396 646 -222 -56 309 -414 67
8079 67 -212 -591 -265 218 -36 -118 -217 180 134 32 -558 -63 -295 27 -286 -260 -35 -301 -450 170 -430 -156
8101 -156 -291 -132 131 -11 -285 -227 -436 311 248 9 537 458 386 -643 -56 350 174 -113 358 -467 529
8122 529 316 126 186 163 -9 81 -266 174 147 -386 15 -235 -318 206 47 -375 -83 -27 -457 -447 -54 345
8144 345 384 81 132 -116 -163 442 -184 -68 -430 30 -171 383 546 -297 -28 273 -548 -422 32 -169 -541
8165 -541 -364 -127 -170 -214 342 -14 -169 164 -22 -91 -303 324 -446 -189 173 -166 295 305 -33 -359 -98
8186 -98 47 114 217 -127 -55
8191e5
##END NTUPLES=NMR FID
##END=
