##TITLE=1H_Ser Bzt-O-NEA
 CDCl3
 32 sc, 
 15.6.2023
##JCAMPDX= 6.0         $$ Bruker NMR JCAMP-DX V2.0
##DATA TYPE= NMR FID
##DATA CLASS= NTUPLES
##ORIGIN= UXNMR, Bruker Analytische Messtechnik GmbH
##OWNER= root
$$ XWIN-NMR		Version 3.5
$$ Thu Jun 15 08:55:17 2023 Russian Standard Time (UT+4h)  she@DPX200
##.OBSERVE FREQUENCY= 200.13135
##.OBSERVE NUCLEUS= ^1H
##.DELAY= (6, 6)
##.ACQUISITION MODE= SIMULTANEOUS
##.ACQUISITION SCHEME= undefined
##.AVERAGES= 32
##.DIGITISER RES= 18
##SPECTROMETER/DATA SYSTEM= spect
##.PULSE SEQUENCE= zg30
##.SOLVENT NAME= CDCl3
##.SHIFT REFERENCE= (INTERNAL, CDCl3, 0, 15.7039)
##AUDIT TRAIL= $$ (NUMBER, WHEN, WHO, WHERE, WHAT)
$$ ##TITLE= Audit trail, XWIN-NMR		Version 3.5
$$ ##JCAMPDX= 5.01
$$ ##ORIGIN= Bruker BioSpin GmbH
$$ ##OWNER= she
$$ F:/spectra/data/she/nmr/H-F/1/audita.txt
$$ ##AUDIT TRAIL=  $$ (NUMBER, WHEN, WHO, WHERE, WHAT)
(   1,<2023-06-15 08:54:22.07 +0400>,<she>,<DPX200>,
      <continue with go, POWCHK disabled, PULCHK disabled
       configuration hash MD5:
       00 E9 B6 7A A2 85 ED C7 34 08 36 98 17 FE 4E 26
       data hash MD5: 16K
       D2 90 88 31 7D 0A E8 9A EC 35 06 6B F2 07 9D D3>)
$$ ##END=
$$ 
$$ hash MD5
$$ 26 D5 A7 E6 64 5F 44 48 F6 57 BA 96 B2 27 3E F5
##$RELAX= 
##$RELAX= 
##$RELAX= 
##$RELAX= 
##$RELAX= 
##$RELAX= 
$$ Bruker specific parameters
$$ --------------------------
##$DU= <F:/spectra>
##$EXPNO= 1
##$NAME= <H-F>
##$PROCNO= 1
##$TYPE= <nmr>
##$USER= <she>
##$AMP= (0..31)
100 100 100 100 100 100 100 100 100 100 100 100 100 100 100 100 100 100 
100 100 100 100 100 100 100 100 100 100 100 100 100 100 
##$AQSEQ= 0
##$AQ_mod= 1
##$AUNM= <au_zg>
##$AUTOPOS= <>
##$BF1= 200.13
##$BF2= 200.13
##$BF3= 200.13
##$BF4= 200.13
##$BF5= 200.13
##$BF6= 200.13
##$BF7= 200.13
##$BF8= 200.13
##$BYTORDA= 1
##$CFDGTYP= 0
##$CFRGTYP= 5
##$CHEMSTR= <none>
##$CNST= (0..31)
1 1 145 1 1 1 1 1 1 1 1 1 1 1 1 1 1 1 1 1 1 1 1 1 1 1 1 1 1 1 1 1 
##$CPDPRG= <>
##$CPDPRG1= <>
##$CPDPRG2= <>
##$CPDPRG3= <>
##$CPDPRG4= <mlev>
##$CPDPRG5= <mlev>
##$CPDPRG6= <mlev>
##$CPDPRG7= <mlev>
##$CPDPRG8= <mlev>
##$CPDPRGB= <>
##$CPDPRGT= <>
##$D= (0..31)
0 1.2 0 0 0 0 0 0 0 0.06 0 0.03 0 0 0 0 0.0002 0 0 0 0 0 0 0 0 0 0 0 0 
0 0 0 
##$DATE= 1686804720
##$DBL= (0..7)
120 120 120 120 120 120 120 120 
##$DBP= (0..7)
150 150 150 150 150 150 150 150 
##$DBP07= 0
##$DBPNAM0= <>
##$DBPNAM1= <>
##$DBPNAM2= <>
##$DBPNAM3= <>
##$DBPNAM4= <>
##$DBPNAM5= <>
##$DBPNAM6= <>
##$DBPNAM7= <>
##$DBPOAL= (0..7)
0.5 0.5 0.5 0.5 0.5 0.5 0.5 0.5 
##$DBPOFFS= (0..7)
0 0 0 0 0 0 0 0 
##$DE= 6
##$DECBNUC= <off>
##$DECIM= 32
##$DECNUC= <off>
##$DECSTAT= 4
##$DIGMOD= 1
##$DIGTYP= 9
##$DL= (0..7)
0 120 120 120 120 120 120 120 
##$DP= (0..7)
150 150 150 150 150 150 150 150 
##$DP07= 0
##$DPNAME0= <>
##$DPNAME1= <>
##$DPNAME2= <>
##$DPNAME3= <>
##$DPNAME4= <>
##$DPNAME5= <>
##$DPNAME6= <>
##$DPNAME7= <>
##$DPOAL= (0..7)
0.5 0.5 0.5 0.5 0.5 0.5 0.5 0.5 
##$DPOFFS= (0..7)
0 0 0 0 0 0 0 0 
##$DQDMODE= 0
##$DR= 18
##$DS= 0
$$ [...]
##$SUBNAM2= <"">
##$SUBNAM3= <"">
##$SUBNAM4= <"">
##$SUBNAM5= <"">
##$SUBNAM6= <"">
##$SUBNAM7= <"">
##$SUBNAM8= <"">
##$SUBNAM9= <"">
##$SW= 18.05172834244
##$SWIBOX= (0..15)
0 0 2 0 0 0 0 0 0 0 0 0 0 0 0 0 
##$SW_h= 3612.71676300578
##$TD= 16384
##$TD0= 1
##$TE= 0
##$TE2= 300
##$TE3= 300
##$TEG= 300
##$TL= (0..7)
0 120 120 120 120 120 120 120 
##$TP= (0..7)
150 150 150 150 150 150 150 150 
##$TP07= 0
##$TPNAME0= <>
##$TPNAME1= <>
##$TPNAME2= <>
##$TPNAME3= <>
##$TPNAME4= <>
##$TPNAME5= <>
##$TPNAME6= <>
##$TPNAME7= <>
##$TPOAL= (0..7)
0.5 0.5 0.5 0.5 0.5 0.5 0.5 0.5 
##$TPOFFS= (0..7)
0 0 0 0 0 0 0 0 
##$TUNHIN= 0
##$TUNHOUT= 0
##$TUNXOUT= 0
##$USERA1= <user>
##$USERA2= <user>
##$USERA3= <user>
##$USERA4= <user>
##$USERA5= <user>
##$V9= 5
##$VALIST= <valist>
##$VCLIST= <CCCCCCCCCCCCCCC>
##$VD= 0
##$VDLIST= <DDDDDDDDDDDDDDD>
##$VPLIST= <PPPPPPPPPPPPPPP>
##$VTLIST= <TTTTTTTTTTTTTTT>
##$WBST= 1024
##$WBSW= 4
##$XGAIN= (0..3)
0 0 0 0 
##$XL= 0
##$YL= 0
##$YMAX_a= 124572
##$YMIN_a= -163903
##$ZGOPTNS= <>
##$ZL1= 120
##$ZL2= 120
##$ZL3= 120
##$ZL4= 120
##$ABSF1= 10
##$ABSF2= 0
##$ABSG= 5
##$ABSL= 3
##$ALPHA= 0
##$AQORDER= 0
##$ASSFAC= 0
##$ASSFACI= 0
##$ASSFACX= 0
##$ASSWID= 0
##$AUNMP= <proc_1d>
##$AZFE= 0.1
##$AZFW= 0.1
##$BCFW= 1
##$BC_mod= 2
##$BYTORDP= 1
##$COROFFS= 0
##$CY= 11.3945322036743
##$DATMOD= 1
##$DC= 2
##$DFILT= <>
##$DTYPP= 0
##$F1P= 15.7292609196834
##$F2P= 12.9074282941183
##$FCOR= 0.5
##$FTSIZE= 0
##$FT_mod= 4
##$GAMMA= 1
##$GB= 0.15
##$INTBC= 1
##$INTSCL= 1
##$ISEN= 128
##$LB= 0.24
##$LEV0= 0
##$LPBIN= 0
##$MAXI= 10000
##$MC2= 0
##$MEAN= 0
##$ME_mod= 0
##$MI= 1.114404
##$NCOEF= 0
##$NC_proc= 0
##$NLEV= 6
##$NOISF1= 3.799351
##$NOISF2= 2.8
##$NSP= 1
##$NTH_PI= 0
##$NZP= 0
##$OFFSET= 15.70392
##$PC= 1
##$PHC0= -20627.32
##$PHC1= 17.25272
##$PH_mod= 1
##$PKNL= yes
##$PPARMOD= 0
##$PSCAL= 0
##$PSIGN= 0
##$REVERSE= no
##$SF= 200.130013532006
##$SI= 16384
##$SIGF1= 3
##$SIGF2= 2
##$SINO= 400
##$SIOLD= 16384
##$SREGLST= <1H.CDCl3>
##$SSB= 0
##$STSI= 0
##$STSR= 0
##$SW_p= 3612.71676300578
##$SYMM= 0
##$S_DEV= 0
##$TDeff= 0
##$TDoff= 0
##$TI= <>
##$TILT= no
##$TM1= 0
##$TM2= 0
##$TOPLEV= 0
##$USERP1= <user>
##$USERP2= <user>
##$USERP3= <user>
##$USERP4= <user>
##$USERP5= <user>
##$WDW= 1
##$XDIM= 8192
##$YMAX_p= 0
##$YMIN_p= 0
$$ End of Bruker specific parameters
$$ ---------------------------------
##NTUPLES= NMR FID
##VAR_NAME=  TIME,          FID/REAL,        FID/IMAG
##SYMBOL=    X,             R,               I
##VAR_TYPE=  INDEPENDENT,   DEPENDENT,       DEPENDENT
##VAR_FORM=  AFFN,          ASDF,            ASDF
##VAR_DIM=   8192,          8192,            8192
##UNITS=     SECONDS,       ARBITRARY UNITS, ARBITRARY UNITS
##FACTOR=    0.0002768,     1,               1
##FIRST=     0,             0,               0
##LAST=      2.2672688,     0,               0
##MIN=       0,             -163903,         0
##MAX=       2.2672688,     124572,          0
$$ Real data points
##PAGE= N=1
##DATA TABLE= (X++(R..R)), XYDATA
$$ [...]
2400B95R17j667p9J114k001J280L04j860J721o18m29J413k203Q41J394k295K369
2417D96m02j245J653j441J039R74k016J580N04j326J927j679L57Q96j952J408
2433G73K95j838J787j566K44J305j468K65K07k087K419p72j084K104j947M95R53
2450H5j010R85m60j037K569k054N85J284j327J057P27k330K611j193k8J477j603
2467C38Q89m42j686J842r11q02J364j891J037J95j525J746p34q88K282k507P92
2484i01J194j753K003l55p13K045j379O46J016k134J850j13j558J782j014j12
2500E04J255k673J418J31k042J765j264k19J516k511J331N19j762J380m09p67
2516a828K454k451J445J201j825K212l66l93K026k005L43R23j756J122j25j457
$$ plain form
2400 295 1212 -455 -534 580 -1421 -141 163 -1697 24 -594 -1023 390 -1813 -972 422 -1873 496
2417 496 94 -1151 502 -939 100 1074 -942 638 1142 -184 1743 64 421 1317 -635 773
2433 773 1068 -770 1017 -549 -305 1000 -468 -203 4 -2083 336 -436 -1520 584 -1363 -868 85
2450 85 -925 60 -400 -1437 1132 -922 -337 947 -380 677 1404 -926 1685 492 464 1941 338
2467 338 1227 785 -901 941 30 -772 592 -1299 -262 -67 -1592 154 -580 -1468 814 -1693 -901
2484 -901 293 -1460 543 188 -525 1520 141 787 1803 -331 1519 1406 -152 1630 616 504
2500 504 1759 -914 504 635 -1407 358 -906 -1125 391 -2120 -789 -270 -2032 -652 -1061 -1828
2516 -1828 626 -1825 -380 821 -1004 1208 842 449 2475 470 813 1736 -20 1102 977 -480
2532d80K069j552r75J143j977J755j46j841K033j417j11J454k028J540L11j045
2548a267J809r37o09J920q13N25J009j819J317o65q1J515k061P09L61j636J085
2565C62K4j646K248k092j73J306k052J348J58j364J830p57n84J789r74Q20M42
2582F85j457K026n32j075J550j785J276P16j749J512p90o73J330j472O09N68k150
2599a411J908n6k240K458j758M96J138j605O02L75o93J494q15n36J282j291R85
2616C33R93j803J132p80N2K027j712n7J073j837J283J84j523J835j669K21J036
2633G88j314Q58r48j046K487j803K92J463k659J772m73o73J856j412m4J487j301
2650f70P99K81r07J681k6j582K199j880N54N82j799J433l86l24R49q54l20N13
$$ plain form
2532 -480 1589 37 -938 205 -1772 -17 -163 -2004 29 -1388 -1499 -45 -2073 -533 -222 -1267
2548 -1267 542 -395 -1004 916 103 628 1637 -182 1135 470 389 1904 -157 552 913 -723 362
2565 362 386 -1260 988 -1104 -1277 29 -2023 -675 -517 -1881 -51 -808 -1392 397 -577 243 685
2582 685 -772 1254 722 -353 1197 -588 688 1404 -345 1167 377 -296 1034 -438 171 739 -1411
2599 -1411 497 441 -1799 659 -1099 -603 535 -1070 -468 -93 -786 708 -107 -643 639 -652 333
2616 333 1326 -477 655 -125 -73 1954 242 185 1258 -579 704 888 -635 1200 -469 -248 788
2633 788 -526 332 -616 -1662 825 -978 -686 777 -1882 -110 -583 -1256 600 -812 -856 631 -670
2650 -670 129 410 -497 1184 1158 -424 1775 -105 449 1031 -768 665 279 -45 904 50 -270 243
2668B43j907J693o12p13J208j181o6J737j736J580p12l22J353r63j44K013j904
2685d33J495K94j448J959o65j130J547j575Q69o61j313J927j343n64J793j917
2701a165J33P20q00J008k69q95R42k08n08J674j439R18N34n03J325j086k5J730
2719B086j736P03l28j421J991r96j066J732j618j94J022k157K450r37o86J132
2735b3j571Q29R31j290J554qj299J770j228J58J261j297N35O68j137J638j282
2752B09k15J385j763N97M51j200J040o46n33J135j146L0P86j162J457r59p76J449
2770A39o71m33J268q29J39N60p25J314q42O12O64j039O28n3j329J540n29l44Q74
2789I44j791R14L77j388J733p46r36J339j504R14M97j899J529r3j008J628j790
$$ plain form
2668 243 -1664 29 -583 -1296 -88 -1269 -1335 402 -1334 246 -466 -788 565 -398 -542 1471 -433
2685 -433 1062 1356 -92 1867 1202 72 1619 44 913 252 -1061 866 -477 -1041 752 -1165
2701 -1165 -1032 -312 -1112 -104 -373 -1268 -326 -534 -1042 632 -807 111 645 142 1467 381 356 2086
2719 2086 350 1053 725 -696 1295 299 -767 965 -653 -847 175 -1982 468 -469 -1155 -23
2735 -23 -1594 -765 166 -1124 430 422 -877 893 -335 -177 1084 -213 322 990 -147 1491 209
2752 209 -6 1379 -384 213 664 -536 504 -142 -675 460 -686 -656 130 -1032 425 -534 -1310 139
2770 139 -532 -965 303 -526 -387 173 -552 762 -80 532 1196 157 785 732 -597 943 414 70 944
2789 944 -847 67 444 -944 789 43 -893 446 -1058 -144 353 -1546 -17 -110 -1118 510 -1280
2806a280P36P70j047Q55K6o28R44n46j53J203j126J136P72k128J672j045k17J726
2824A670k150J021L02j846J833l40j392R17j271O67K07p15J038q5q59J098l77
2841b82L46N18j125J523p18r04J985j144J49J332j976J030N91j237R70n62p98
2858c02R87j262k9P45j806J741j119p6Q62q38L61J081j426J100n21K56J077j289
2876d58P34Q45j337R70L17r59J232j384n88J914j556N60M69j579J329q33p27J458
2894D07j409R51l63j205J196o44J20J256q40J43J003q56R74L9n33J065j038Q81
2912A147O38j981Q12J88j093J524j426j24J310k355R69L91r09J718j201p11J066
2929c7j254J228R9q30J164p77j56R04k56L64M65j204Q10k19p53J957j413K45J221
$$ plain form
2806 -1280 -544 226 -821 34 60 -568 376 -170 -323 880 -246 890 1662 -466 1206 161 -56 1670
2824 1670 -480 541 843 -1003 830 490 -902 15 -1256 -589 -382 -1097 -59 -144 -1003 95 -282
2841 -282 64 582 -543 980 262 -642 1343 199 348 1680 -296 734 1325 88 1058 496 -302
2858 -302 685 -577 -606 139 -1667 74 -1045 -1121 -259 -1097 -736 345 -1081 19 -502 -246 831 -458
2876 -458 276 1121 -216 754 1071 112 1344 -40 -628 1286 -270 290 759 -820 509 -324 -1051 407
2894 407 -1002 -51 -414 -1619 -423 -1067 -947 309 -531 -388 615 -241 733 772 239 1304 266 1147
2912 1147 1785 -196 616 804 -289 1235 -191 -315 995 -1360 -391 0 -909 809 -392 -1103 -37
2929 -37 -1291 -63 36 -794 370 -407 -563 341 85 449 914 -290 520 301 -452 1505 92 337 1558
2948A558j906O40J55r43P47o06o31J603j555O82M32j431J722m94o34J278j682
2965a065L07J061j265J402p81J9J124j150M55R52j464J289n19m17J777j549N9
2982B35J108j878Q87q5p33J055p55Q4L56j415J343J89j384J603j372K07J229j454
3000g80J91Q19r00R88l2q21J429q93M25O60j379J364j99p86J039l51p03P93j766
3019i02J558r64p85J111o57K80Np11N82O69j737J434l4j99O83q60O77K57j37Q30
3039A100l22p37J761j442K90M67j153Q07m79k00P06j234n7O37p99M36n70o74J228
3058b35o73J59N57q84K79J016q88J721j148j48J524q82j9P11j066J519n66o37
3076C40N84r28J55R86j666N75P73j645J094j024k3M65j174O53O39j078J281l77
$$ plain form
2948 1558 -348 292 447 -496 251 -355 -986 617 -938 -256 176 -1255 467 -27 -661 617 -1065
2965 -1065 -758 303 -962 440 -341 -322 802 -348 107 1059 -405 884 365 -52 1725 176 235
2982 235 1343 -535 352 267 -466 589 -166 -82 274 -1141 202 391 -993 610 -762 -555 674 -780
3000 -780 -589 230 -670 318 286 -535 894 1 426 1086 -293 1071 872 86 1125 774 71 864 -902
3019 -902 656 -308 -1093 18 -639 -359 -354 -1065 -483 186 -1551 -117 -151 -350 333 -527 150 407 270 1100
3039 1100 778 41 1802 360 650 1117 -36 771 292 92 798 -436 -493 144 -655 -219 -789 -1463 -235
3058 -235 -908 -749 -192 -1076 -797 219 -669 1052 -96 -244 1280 398 379 1090 24 1543 977 340
3076 340 924 -4 151 1137 -529 46 819 -826 268 -756 -779 -314 -1488 -835 -196 -1274 7 -370
3094c70j66J074j561L34J151o17J050l95n33J054j056M38O94k141J466l7n36Q94
3112G43r52k9L65j249M09P58p99N74o85L0J064p52JL76q20J270n46m92J110p19
3132c43Q81Q5r20Q24n77j81O55r99L90M24q60R93k43k68P27l74j05J73j462J183
3152CO6p32R31n55k70O94j028R44Kr14J108n23o6O63p41O19L17o64J044k91j382
3173g75J980q34J83j08m28Q76m66j121J302j059L90J93j226P83j37j172J689p35
3191f65L03Q39j250Q64l92l7L13jq6J215j193Q38Q7p08J014r64pO70j385J387
3211H42P3j851J495p67j110J550j498M63O14j332J217j52j59O27n64L01R87j480
3229g44R46M63o99J089n84n19J054l01m98Q3n6P5Or79J706j166M89j07j149R43
$$ plain form
3094 -370 -536 538 -1023 -689 462 -155 895 500 -33 1021 -35 403 1097 -1044 422 385 -151 743
3112 743 -209 -238 127 -1122 -713 45 -754 -180 -865 -835 229 -523 -522 -146 -966 304 -242 -734 376 -343
3132 -343 538 623 -297 527 -50 -231 424 -575 -185 239 -621 372 129 -139 588 214 109 282 -1180 3
3152 3 69 -663 268 -287 -557 137 -891 53 55 -859 249 -274 -340 323 -418 201 518 -146 898 607 -775
3173 -775 1205 371 554 446 18 894 428 -693 609 -450 -60 133 -1093 -310 -447 -1619 70 -665
3191 -665 -362 477 -773 91 -301 -338 -25 -26 -112 1103 -90 748 835 127 1141 177 170 840 -545 842
3211 842 915 -936 559 -208 -1318 232 -1266 -803 -189 -1521 -304 -456 -615 12 -552 -251 736 -744
3229 -744 202 665 -34 1055 471 -48 1006 705 207 290 234 309 315 -664 1042 -124 365 258 -891 52
3249E2k8j014Q88q49L25Q40j205O30M97q56J737q92q83J346p89P19J21r09J215
3268I45o16k67J012j750J234l1j283R44n22l25Q39m82j96L40n22N31j59j73O73
3287A92o54L86Q45j295Q35J16q32J254m66q05J008o06Q49L54j664J088j040M82
3305D7L73r61M36P23j642J000j5n26M86n96o0Q05m78N05j88o59R97j004L83Q27
3325D53q18R03k80n42J475j075k71O16j166J256l95o21Q78j067K18J548j336N47
3343C23k34j136J122q4n21J011j175M77L47j119P94R7r58J747j616J584M30j807
3361g18J529l41q9j53l15J47J022j148M17l19k49O49l02o46J347r15j50P06j802
3380a330R44k64LO52r27J216J14j076J121n46p59J958n99k37O65j081R68k50n83
$$ plain form
3249 52 24 -990 -102 -951 -626 214 -991 -361 136 -720 1017 125 -758 588 -201 518 639 -270 945
3268 945 329 62 1074 -676 558 527 -756 188 -334 -659 180 -302 -498 -158 -680 -149 -308 -481 192
3287 192 -462 -76 769 -526 309 425 -407 847 381 -424 584 -22 827 1181 -483 605 -435 47
3305 47 420 -541 -105 618 -1024 -24 -39 -565 -79 -675 -735 70 -408 97 -91 -750 247 -757 -374 453
3325 453 -365 538 258 -284 1191 116 -155 461 -705 551 156 -465 413 -654 -436 1112 -224 323
3343 323 89 -1047 75 -9 -530 481 -694 -217 130 -989 -195 -98 -1056 691 -925 659 1089 -718
3361 -718 811 470 381 228 -87 60 1082 -66 351 32 -217 432 130 -516 831 -84 -234 472 -1330
3380 -1330 -386 -650 -647 5 -922 294 408 -668 453 -93 -852 1106 507 270 935 -146 822 572 -11
3399a1J104n89o18Q70j212M85M73q75Q91j789K75R29q53m9L15p51J314j02p56
3418i49J266P7l41L37q81J329j30o78J003q57l0M95o40N19n42n59J581j390N26
3437A36k63j126R87j34q65J711q66k10Q41n62M66N05p65L61p9p21J290o45L20
3456C81M72n75K99m62NN81p77L04M53p86K17N26j088P88o77J1O93p62k05N19l79
3477d62J32L09m71N86o94O13om55J351o71l76J274j165J27M85p15M63m3n61J101
3497H22q72m20P81q51J092l34o69J142j257j17J114q03L73q4p15R06m08o17J672
3516G55j273L58J65l38P13k29l19R42m80l74P80p76J28M06n12N51j85n23O89j047
3536e69O49l7j327J291n78L02N04j425Q97p2p85J976j296N48L80o52N94j9l00
$$ plain form
3399 -11 1093 504 -114 756 -456 29 502 -373 518 -1271 -996 -67 -920 -969 -654 -1405 -91 -193 -949
3418 -949 317 394 53 390 -491 838 708 30 1033 176 146 641 1 520 -22 -581 1000 -390 136
3437 136 -127 -1253 -266 -400 -1265 446 -420 -630 211 -351 115 620 -145 216 137 -584 706 61 381
3456 381 853 278 577 115 120 701 -76 228 681 -105 112 638 -450 338 -339 -328 365 -397 -602 -83 -462
3477 -462 -330 -21 -492 94 -600 13 7 -448 903 232 -144 1130 -35 92 577 -138 325 282 -279 822
3497 822 -50 -470 311 -540 552 218 -451 691 -566 -683 431 -372 1 -83 -798 108 -300 -917 755
3516 755 -518 -160 5 -333 380 151 -168 774 294 -80 700 -76 52 458 -54 497 312 -211 478 -569
3536 -569 80 43 -1284 7 -571 -269 235 -1190 -293 -365 -1150 826 -470 78 458 -194 400 381 81
3555H1N73J41r41N94k81N9J041k020Q46J80j049R06o05m4N7J77o5n9q1Q89j273
3576h74N13L42m86N07N16r79P26n03j0M67m15J14J69j12Q05o37K71O96q43L7J39
3597D43o24N17k69l23j94n28J96O14o65P33k85J02L03n01p5O22n38Q69M40j417
3617e80J114q9j135J617j424J280l36q69J095o38J37J28r29R4N52k93O42n25l85
3636e44Q88j356P88J044j400P06q0p76J025l59l07Q58p72K35L30m51J168j046
3654d9m31J242j300R58N0o81J238j229l4N46q10K94O00j005M93N32k82L51j267
3673g84N22O29k60p1M5o91P92k79nM37m40K87j12l63Q40j9r73R20p83O45J81m93
3695B5M26p09m59O99l37J94m48J68P30n70o59O59J35j83L12o06P11L91k26R10
$$ plain form
3555 81 654 795 -146 448 167 226 1267 -753 93 273 -776 130 -475 -519 -462 -285 -350 -409 -490 399 -874
3576 -874 -361 -19 -505 2 518 -461 265 -238 -248 219 -196 -82 87 -25 780 143 414 1110 267 304 443
3597 443 -181 336 67 -256 -450 -978 -782 -168 -833 -100 -385 -283 20 -481 -556 66 -472 397 837 -580
3617 -580 534 445 -690 927 -497 783 447 -422 673 35 172 300 -629 -535 17 -276 366 -159 -544
3636 -544 344 -1012 -224 820 -580 126 46 -730 295 -64 -371 487 -285 -50 280 -171 997 -49
3654 -49 -480 762 -538 420 470 -211 1027 -202 -236 310 -500 -206 394 -611 -118 414 132 483 -784
3673 -784 -262 367 107 36 81 -610 182 -97 -102 335 -105 182 70 -293 547 528 -445 475 -308 337 518 25
3695 25 451 -258 -717 -18 -355 -161 -609 -441 289 -281 -940 -281 -146 -329 -17 -623 88 479 253 1163
3715A163q52j46j70k8K95l53p4P15l88J17J01n96L12L9q76OM40m02M92L23p01
3736e83L34o46N99K1%M76K09l42n0M12k35O91j464J951j434OR84r43q6P18o45
3757b7O95j092M3L29l12j21M52j096P99M04o09J216j627M61N06m77K59J1K2N49
3777C85k89k93P31m07J44J45k11R85r83o66P22l30J50L50j029J201m40m38R3p88
3797i68M81K55o23J103m93k60Q99o36M7J17M9P9M07o37M30K9P2R18j567R24k07
3818D19j115N76L61n91N27p33Q32m0j163J170o73k67O63k92M56k4r65P82M02o26
3838c01M91J55q10Q41p7l34K56m49J321q13j78O08p55L16J2o81M29J56k02J83
3858A68o42O40J06q20M66J17o43K53m3J96K70j242J448n82k29J060n22J67j08
$$ plain form
3715 1163 311 165 -5 -33 262 -91 -165 550 162 279 380 -216 96 135 -741 -735 -295 -697 -205 118 -583
3736 -583 -249 -895 -296 -275 -275 201 410 68 18 430 195 886 -578 1373 -61 -55 929 -14 -100 618 -27
3757 -27 668 -424 -381 -52 -364 -485 -33 -1129 -330 74 -535 681 -946 -485 21 -456 -197 -186 -164 385
3777 385 96 -197 534 127 271 416 205 1190 207 -459 263 -67 83 433 -596 605 165 -273 -180 -968
3797 -968 -487 -232 -855 248 -245 -505 394 -242 -195 -78 -29 50 457 -180 250 279 351 1269 -298 626 419
3818 419 -696 -120 241 -350 177 -556 276 236 -927 243 -430 -697 -34 -326 130 106 -859 -77 325 -301
3838 -301 190 345 -465 376 299 -35 221 -228 1093 280 102 710 -45 271 283 -398 31 187 -15 168
3858 168 -474 166 272 -548 -82 35 -608 -355 -398 -202 68 -1174 274 -308 -537 523 1 168 60
3877F0j85P78p3m18P96r49M22m4m31M18j04q15M19K30n36K2o21P25J61o05J082
3898C32k33j179R11l02N62L79o48qJ46j65M33j54J70Q23j089N54m46o4M51m76
3918cJ49J93r94R15k47l78M42j084Q77K08q07N35qj47N13k50k56L72n72O05M03
3939D66k45L5j11j86N07k79PR32j198M37q83N12M85r58j03J115j095O98r29P04
3959h9k93J29k14j39K79p6N7N6M97n25N17O15l23p19Q99r97P56k12j42P0K33m31
3981e2Q8m58O17Q4m39M59p69m40Q96p71Q5N69P7j86N03L25n57m62P00l1m41N83
4003C80j08J78k13k28k66K89J6M84rj039J270j000K69K5m58L22l33L92qp0k3K39
4025A09l62M13l35n00O43K31m56M95m85K56L22o26O84l99o7K27J5J38L34n57J99
$$ plain form
3877 60 -125 653 580 162 958 9 431 387 -44 374 270 -545 -126 104 -432 -410 -1031 -306 -145 -750 332
3898 332 99 -1080 -169 -471 91 470 -178 -186 -40 -205 228 74 244 1067 -22 532 86 22 473 -3
3918 -3 146 339 -655 260 13 -365 77 -1007 -130 78 -729 -194 -202 -349 164 -86 -342 30 -542 63 466
3939 466 221 256 145 -41 466 187 194 1126 -72 365 -518 -6 479 -479 -582 533 -562 136 -793 -89
3959 -89 -382 -253 -467 -606 -327 -403 -346 -290 207 -318 199 814 491 -228 671 -326 430 218 76 146 379 -52
3981 -52 36 -422 195 279 -160 299 -470 -910 -14 -785 -700 -131 -54 -240 263 588 31 -431 269 238 -203 380
4003 380 272 450 237 9 -257 32 48 532 523 -516 754 -246 23 48 -410 -88 -421 -29 -37 -107 -130 109
4025 109 -253 160 -175 -675 -32 199 -257 238 -247 9 331 -295 389 -10 -77 150 165 303 637 80 279
4046B79o06J63L78m34O61J12j012P79n91l12J031n70J29m15J3K57Q3n70N89J82
4066A46k18N38q24Q10m69m62J098j88m68j05r3L70L67q31K32M98r03L15K20j82
4086a49o1O2n59M31J6P42j205J040l04k80n4P51m86J32r6k3N95r22N84l31j49
4107b66J022n88N8N13j101K65J95l61M70J2l91K63l31r44J164k80L2m0N1L83k00
4128g4J59L44m75K44m8n61J008q76k04O85j22K26O20j077K44m0j33O49k60m61
4148a52L50l06J05K78r06M06j8L79j43k60L54L55j69J61j63m7l4p7O45k51q26
4169c19N29j07j96M70q97J51M72m37M61K16k11l37r8o4M10p9j7j79O3M5K18l8
4191E6L7m82L05Q1m42M66n07J25Q61o26K08N02q87M88m1k41N1l00M0Q08q79L47
$$ plain form
4046 279 -327 -164 214 -220 441 553 -459 320 -271 -583 448 -122 7 -408 -395 -138 -55 -625 -36 146
4066 146 -72 466 -358 452 -17 -479 619 431 -37 -142 -235 135 502 -329 -97 401 -502 -187 33 -149
4086 -149 -210 -148 -707 -276 -260 482 -723 317 13 -267 -321 430 -56 76 -20 -43 552 -370 214 -117 -266
4107 -266 756 168 226 739 -362 -97 98 -263 207 219 -172 91 -240 -1184 -20 -300 -268 -308 -257 126 -74
4128 -74 85 429 -46 198 150 -411 597 -279 -483 202 80 306 926 -151 93 53 -80 569 309 -152
4148 -152 198 -108 -3 275 -631 -225 -243 136 -7 -267 87 442 273 434 271 224 190 113 758 507 -319
4169 -319 210 103 -93 377 -520 -369 103 -334 127 343 132 -205 -303 -367 43 -36 -53 -232 -169 -124 94 56
4191 56 93 -389 -84 -3 -445 21 -486 -361 500 -126 82 584 -303 185 144 -97 -46 -346 -306 502 -377 -30
4213c0Po6Q16j074J86J22n17O84M4p50J374j032L6J022q80L43L16p84M05k19K51
4234B54M9l42J24L97q7Ko29p6K96l4M6j08j30N81l10l1k40m72K86N40p19K28J51
4257b24l8L75k67j02J021n82L98k84n38J132l45l00N2P8o08M99o19O15r0n16O70
4278C27l21ol0k87R4l84K43K78j42J34J73n06L97M2j42P68o24j56R73r53P75q40
4300a87J10O36j091Q44J38P8n23J42j78L69k02J29j44k44l4K91l62J29l48L55
4320i2L52k07j35N62n93L5P40q74Q69l95j6J40l70K96p26N26l2K30j59L18n52
4341h3O96l61n54O11n41m17J069m19l65M19m98Q01m05k27Q03l68r5P59j162M66
4361A29q09O91O21r29K11J57k62j64j35M86J1j49m6j3K69J51J69m35J17n0o82
$$ plain form
4213 -30 -23 -89 727 -347 -161 -39 -556 128 172 -578 796 -236 -200 822 -58 285 601 -183 222 3 254
4234 254 303 -39 85 482 395 397 -232 -308 -12 -46 0 -108 -238 343 33 2 -238 -710 -424 116 -603 -375 -224
4257 -224 -262 113 -154 -256 765 183 581 297 -241 891 546 246 298 376 -232 267 -352 263 173 -343 327
4278 327 6 0 -30 -317 -223 -607 -364 -86 -228 -94 79 -427 -30 12 -130 638 14 -142 831 -122 653 -187
4300 -187 -77 559 -532 312 450 528 5 147 -31 338 136 265 121 -123 -157 134 -228 -99 -447 -92
4320 -92 260 53 -82 480 -113 -78 662 -212 657 262 246 386 16 312 -414 112 80 310 151 469 -83
4341 -83 613 252 -302 309 -232 -649 420 1 -364 55 -443 358 -47 -274 529 161 66 825 -337 129
4361 129 -680 11 632 -297 -86 71 -191 -355 -490 -4 7 -142 -188 -201 68 219 388 -47 70 20 -662
4382f62O19l91L03j12J43J54M4L69r0J16m95K2m62Q15o29P42p0l24J74m9J2m9
4404A80n4l7l82L42P1k14k9J7K90R0n38j53Q2J54o0J70L22j71n7k13m2P03n94
4427a23j0M00j6M97r58J22O81o89K27J88l60O8l78k72N8N92l72O03n02j95K92
4448a47m79J040m15l39P27k17k57m9K3R93p31k11N02m3M72j150QJ33PN5J20l69
4470c27N35n26m44N36J65m42O26l93M61m72n79N96Q57o37j31j91K52O99o65J81
4490A01K40K01n53J81J42k78K20j32j08K23l74j37MR8K64m94K97k9L12k83p22
4511h27R65K64k46Q7p30N27K17l91P5L58n26M67p56O59Q24j651N77K78k94J99
4531G6j93K96j0K6l69L29p65Q20K38m68j3j30l3K69o24Q15j08n84P80l40k10O49
$$ plain form
4382 -662 -43 -434 -131 -243 -100 54 98 467 377 493 -2 20 -442 373 -256 486 416 92 266 217 229 180
4404 180 126 89 -293 49 120 -94 -123 -106 184 274 -264 -417 -335 -181 -241 -71 251 80 23 -190 -232 471 -123
4427 -123 -133 267 251 748 -210 -88 593 -96 131 319 -41 27 -351 -623 -565 27 -345 258 -244 -439 -147
4448 -147 -626 414 -1 -340 387 170 -87 -136 -113 880 149 -62 440 397 869 -281 -273 -140 -133 -78 42 -327
4470 -327 208 -318 -762 -226 -61 -503 123 -270 191 -281 -860 -264 593 -44 -175 -366 -114 585 -80 101
4490 101 341 542 -11 170 312 34 254 122 14 237 -137 -274 -270 -172 92 -402 -105 -134 178 -105 -827
4511 -827 138 402 156 243 -487 40 257 -134 -59 299 -227 240 -516 143 967 -684 -107 171 -123 76
4531 76 -117 179 169 195 -174 155 -610 210 448 -20 -33 -163 -196 73 -551 264 156 -428 352 12 -198 451
4553D51j178Q26j33k5L46m28L4M62j19j33j50J30K66k55k45L84k02k3l05K58K21
4574A82j54Q1J24n58J05M62k6L12m05m66O58m19N62j82m97M81n48O10l90n8P6
4595e0K56m79n4K15l93M49R9l56K00j75NK78k47L72m05j21L65k60P59m58N61n52
4617Il27O09N08q24J80k61K09j08k46J82M55q26L16K20o81J008m68l61J62R1j70
4638c23M10j07p6J23p9K39k54l02M14j49K96K47n61J49N2L10j62l70K92L8j75
4659A2n2l08M01L29q01K87J58m73O14k42p4P14j132P18k16J14k73L91k54M73j205
4680h19P02K64l17J29j15o7K92J96l21N33m65l52L62l00L20l53O26l04l14M90
4700A87m42L70J11k77k25N08j37k1K61j32j69K01l39K84j04L9L91m49J78K4o93
$$ plain form
4553 451 -727 99 -34 -59 287 -141 -107 355 236 103 -47 83 349 94 -151 233 31 8 -297 -39 182
4574 182 28 109 233 -325 -220 242 216 528 123 -343 315 -104 458 276 -221 260 -288 322 -68 -126 -50
4595 -50 206 -273 -327 -112 -505 -56 43 -313 -113 -288 -283 -5 -252 120 -285 -406 -41 -301 458 0 561 9
4617 9 -318 291 799 -25 155 -106 103 -5 -251 -69 386 -440 -124 96 -585 423 -45 -406 -244 -153 -323
4638 -323 87 -20 -96 27 -52 187 -67 -369 45 -104 192 439 -122 27 79 389 227 -143 149 187 12
4659 12 -40 -348 53 382 -419 -132 26 -447 167 -75 -149 565 -567 151 -65 49 -224 167 -87 386 -819
4680 -819 -117 147 -170 -41 -156 -223 69 265 -56 477 12 -340 22 -278 42 -311 315 11 -303 187
4700 187 -255 115 226 -51 -276 232 95 74 335 203 34 235 -104 180 76 115 506 57 235 259 -434
4721d34K90o6O5N26k43L31L02j106P48q25j17N99k60K37N50q25Q1K96k84M85m08
4742e8N85j68m33L14n1l85L93l07Q9Q42q83l06N51j62K72n95J04L54J93l45M03
4763D07o33L33l96M30k21m48K56N25l51Pj91K67n3l23R16j02p30O38j06m88O12
4784C49j93k96L11n78O34j64L61o27J77M63n06l53K49J96l03K18l01K78P06r25
4804c04qj85Q19m45M6n6K86J20K41l57l90mj3j60L42P49n73P1n93O21l16m06N79
4827F4K53l9j22m46R7L99l62J61k68K7N19q1j31Q37j065l27O27l30O49j09o53
4848c00Q60p49R1N76m13j24J9K12j40j2j39n0m35R58j69l20R3l4q2M47j66k37
4870a14N83o86M63nk07m12m6L97j49N8M05L5l75j02l71L27j14k14O50j51l81K1
$$ plain form
4721 -434 -144 -210 -145 381 138 469 771 -335 413 -412 -529 70 -190 47 597 -228 -147 149 -135 350 -58
4742 -58 527 359 -74 240 189 -196 197 -110 -21 821 -62 -368 183 21 293 -302 -198 156 349 4 407
4763 407 -226 107 -289 141 -80 -528 -272 253 -98 -91 -282 -15 -68 -391 525 423 -307 331 225 -263 349
4784 349 156 -140 171 -407 227 63 424 -203 -26 437 -69 -422 -173 23 -280 -62 -363 -85 621 -304
4804 -304 -312 -497 322 -123 -77 -133 153 273 514 157 -233 -237 -250 -410 -68 681 108 179 -414 207 -109 -515 64
4827 64 317 278 156 -290 -193 206 -156 5 -263 -236 283 202 71 908 -157 -484 143 -187 462 353 -300
4848 -300 560 -189 -98 478 65 -59 -40 172 32 20 -119 -169 -604 354 185 -135 -42 -76 -158 289 123 -114
4870 -114 469 -217 246 241 34 -378 -424 -27 -176 -118 287 322 -53 -155 -526 -199 -313 -527 123 -28 -409 -388
4892c88J91j96J02O40j62o1j56K83j85l3m20k73Q12k18M87l07J01j87L43n25j55
4913c07J82M92n12R3L47K06m10R3r3l88m6N16J32l20o8J65M6ro98Q66n07L9O1
4936a20K35N3m62N48L3l61K30K92m25R5m74M93p1n98M18L02K62n81R7j54K46Q7
4958A45K5K78n68N5K7q4M49q54P59J96q87P01r5j26L04m21m01M47l8j31M26n7
4980A50K05r16K96J99K60m42j28K70jl99J77L93Kj62k98M60l07K07M7L44o77J229
5002I09j093J26N42m0m18O04p49K76m36k58M56M90p56K6Q7l08P97p2j11L39n43
5023a32K43J1j98l7L12l30q4L17L52m72O2N83n38L9n01M29k90K66J55J07l37M8
5045EL56o6m09j75J95J90k66N59o77J22J22n36J262o52K09J55M2n03j84L83n88
$$ plain form
4892 -388 -197 -393 -291 349 187 126 -30 253 68 35 -385 -658 154 -64 423 116 217 30 373 -152 -307
4913 -307 -125 367 -145 -52 295 501 91 184 91 -297 -343 173 305 -15 -83 82 128 119 -579 287 -220 -181 -120
4936 -120 115 168 -294 254 287 -74 156 448 23 118 -356 137 66 -532 -114 188 450 -131 -34 -188 58 145
4958 145 170 448 -120 -65 -38 -122 327 -527 232 428 -459 242 147 21 325 -96 -497 -50 -88 -219 207 150
4980 150 355 -561 -265 -66 194 -248 -376 -106 -107 -506 -329 64 66 -96 -394 66 -241 -34 13 357 -320 909
5002 909 -184 -58 484 444 26 630 -119 157 -279 -537 -81 409 -347 -321 -234 -542 255 183 72 411 -132
5023 -132 111 122 -76 -113 199 -131 -215 102 454 -18 44 627 89 128 -373 56 -234 32 187 294 -43 5
5045 5 361 295 -114 -289 -94 96 -170 389 -288 -166 -44 -580 682 30 239 394 436 -67 -251 132 -456
5066d56Q94j118J320n74l5J59m3n0j8j99O01l99J35Mo90P03j32o6K2J49q6k56
5088a35n5J0L96m87RL7p5K78M25k76j05K27m72L28j36k87P98m65q6l74N59n7J31
5111A88o1K08l73j85J30n85M65l03N16K09p33N68l50m54O06K00l5J77l23RK16
5132I0L07J73L19q17L48k14j43l91k44M63M49j32j24m72M13J10n20N50l75k98
5152e08M96R0l59j49K06N3J5O72l06j37l75N75%m05K25m65O55L25n62l0l0j96
5174b10K27k09J94r9l22M84l69N88r2n49M70m16o0M09m43L89J83l58J79j97Q5
5195a16L18l60o8M11j8m48M65l21O0k11L69k15O06o25K73K60k89q6m39L02l34
5216d66M84k13K47R6k42M23l40J3k35M99k89J92m10P31n58J84L1l40M57q47L20
$$ plain form
5066 -456 438 -680 640 66 31 190 147 97 79 -120 481 82 217 221 -469 234 102 36 58 207 121 -135
5088 -135 -190 -180 216 -271 -262 -225 -300 -22 403 127 22 249 -223 105 -31 -318 480 15 -71 -445 114 57 188
5111 188 127 335 -38 -223 -93 -678 -213 -516 0 209 -524 44 -306 -760 -154 46 11 188 -135 -126 90
5132 90 397 570 889 72 420 206 63 -328 -572 -109 340 208 84 -388 25 135 -385 165 -210 -508
5152 -508 -12 78 -281 -430 -224 -171 -156 516 210 73 -302 273 273 -132 93 -372 283 608 46 16 -14 -210
5174 -210 17 -192 2 -97 -419 65 -304 284 192 -357 113 -303 -363 46 -397 -8 175 -183 -4 -201 -116
5195 -116 202 -158 -226 185 167 -281 184 -137 -77 -288 81 -134 472 -153 120 380 91 5 -434 -132 -466
5216 -466 18 -195 52 148 -94 329 -11 2 -233 266 -23 169 -241 490 -68 116 147 -193 264 -583 -263
5237b63m57N36k93J78J58j83o7P00p92Q55o30r0Q42j49p52O29k09J81k53r4M21
5258B68l30K71n8j30l53J77Q6N4j20P8M69l84M3j58K18K6n49J0L80j4p95O33j67
5281c45O88o92O25k08l1l39J31K55k42M02J04n48L00l47N95m88J24j79m61R40
5301B84k98P1n1K42m65K3j07K25J77P0J74k94p3l74Q08l25j95l10K46k32Q61n66
5323a09J39P23q87o7N37k42K12L99o19K56m60O14J28o45lJ7n26M79n18M94k84
5344c62N1K12J70q1q0Q2l17K71L27m64P75q26k1K71j05L02l41J65o23m9M86K05
5366D8J22k47j89KK4J15J39Rj46k72M97K27j30j78j13K7L40k29m0j70J28O54q28
5389b10J89J43k59L72l53L18k04j08J35L0k21m7k18L64m61J52P87n16J62o9m74
$$ plain form
5237 -263 -720 -184 -477 -299 -141 -324 -391 309 -483 372 -258 -348 494 345 -407 222 13 194 -59 -153 268
5258 268 -62 209 151 21 -332 -155 -69 -15 -135 -57 412 28 71 -87 131 157 -392 -382 -2 -16 -811 -178 -345
5281 -345 343 -349 276 68 37 -302 -171 84 -158 244 348 -200 100 -247 348 -140 -16 -195 -656 284
5301 284 -14 57 6 248 -217 -194 -301 -76 101 171 345 51 -22 -396 412 87 -108 -418 -172 -404 457 -109
5323 -109 30 753 -134 -201 336 94 306 705 86 342 -118 496 624 -21 -24 -7 -533 -54 -572 -78 -362
5344 -362 -311 -99 71 -10 -90 -8 -325 -54 273 -191 584 -242 -263 8 -97 205 -136 29 -594 -643 -157 48
5366 48 170 -77 -266 -264 -240 -125 14 23 -123 -395 102 329 199 21 -92 -65 275 46 6 -164 -36 618 -210
5389 -210 -21 122 -137 235 -118 200 -4 -112 23 53 -168 -215 -433 -69 -530 -378 409 -107 55 -14 -488
5410d88N02j54n09R04o24N21k45l08K9Q82o07r0J23l24N89m14L41j32K0q3Q57
5431G90p26J56k92l89K17J51o1J81r3M7o08N01l9k63J78Q74m79J31l77K56N0j02
5453A03J13J27n86k71R10n80O27k33k27N29p12L39J50m63K75l46L36j33J10k35
5473a67l91J50P40m65l49Q89r16M45N98l74k51N02l44K33j10m98Q52k12q03O50
5493A79Q0M27j144L25j90J17k87P28o57N47p99J10O95q6k93k07L33L24l10R0j33
5514a51J91k53N54m59L65L95N8p77l44L54L04p00K69L05o68P45o47K69p4N1K70
5535E7J4n38P38p24N4J92k51O91n95L61K48k12m42K11N37k95J12k22n55L68J05
5556a46q9L50j53L07n61M48r10M77P19q62LM67k55J00J88p2j00J43l40K99J98
$$ plain form
5410 -488 14 -140 -649 255 -369 152 -93 -401 -372 510 -97 -187 -64 -388 201 -213 128 -4 16 -67 790
5431 790 64 220 -72 -461 -244 -93 -154 27 -66 -19 -627 -126 -165 -428 -250 624 145 276 -101 155 205 103
5453 103 216 343 -243 -514 396 -184 443 210 -17 512 -200 139 289 -174 101 -245 91 -42 68 -167
5473 -167 -558 -408 332 -133 -482 407 -509 -64 534 160 -91 411 67 300 190 -308 544 332 -471 179
5493 179 259 686 -458 -133 -323 -206 -493 235 -422 125 -674 -564 131 45 -248 -455 -122 202 -108 -18 -151
5514 -151 40 -213 341 -118 247 642 700 -77 -421 -67 237 -463 -194 111 -557 188 -459 -190 -264 -213 57
5535 57 71 -467 271 -453 -399 -207 -458 233 -362 -1 247 35 -407 -196 341 46 158 -64 -619 -251 -146
5556 -146 -235 115 -38 269 -292 156 -754 -277 442 -420 -417 50 -205 -105 83 11 -89 54 -286 13 211
5577B11L4j39k20j79R33q60K29J69m52K20l57J49K02l01L60L10r04N01j59j4K07
5598f0L16k77K87k56M48o6q32J7J61%K05r4J70k70M28rj51n63N30l18L16N68m08
5621A42K89m36l84Q60k74L51m48l50N3K3j80Q93n39J0m29L27m7M72k68n9j47J5
5643a26j63K81K45l56N21l50R1L49l33j09j28J14J32J07l67L51j04n54L85l45
5663c59K20K93j90m17L40m24L83n4M7L42k97j28M77p84O58q5J00P7K67m44k7k9
5685c4l66N56K93j24l94j32L97k66P5N06j307P43o9j48K95K70q7l48J71m67J13
5706c23K59n17N13M40k44O1l39K1K2j35L1M14K53m43l79O7L16j25N66o92M37p21
5728e18K56Q00o02J74l73l65P20k46K70l99M21p53P99n00n7L16l81P07J02l1l29
$$ plain form
5577 211 245 106 -114 -293 640 -220 9 178 -274 -54 -411 -262 -60 -361 -1 309 -595 -94 -253 -267 -60
5598 -60 256 -21 266 10 458 392 -440 -423 -262 -262 -57 -151 19 -251 177 168 17 -546 -16 -334 -18 550 142
5621 142 431 -5 -389 471 197 548 100 -250 -197 -174 -354 539 0 10 -419 -92 -139 333 65 6 -141 -126
5643 -126 -289 -8 237 -119 402 52 143 492 159 50 -78 36 168 275 -92 259 155 -399 -14 -359
5663 -359 -139 154 -36 -453 -113 -537 -154 -208 -161 181 -116 -244 233 -551 107 22 122 199 466 22 -5 -34
5685 -34 -400 156 449 325 -69 -201 196 -70 5 511 -796 -53 -122 -270 25 295 208 -140 31 -436 -323
5706 -323 -64 -581 -68 372 128 189 -150 -129 -107 -242 -211 203 456 13 -366 -299 17 -108 458 -234 203 -518
5728 -518 -262 538 -64 110 -263 -628 92 -154 116 -283 138 -615 184 -316 -373 -57 -438 269 371 340 11
5749A1j61J09K50r6l03M44k56Q3l48M95k63q8K21M6k62j17K27j91O73q33J14j58
5771d03Q09k15q5j3l80K62K34o8M0k38k0N57o70k15N32r5o77N30K17j72ql70L60
5794h8o3k56O21ok1l28K47J09o95J47L07L96m75J55K2J87k43n55P49j60k64j4
5816b28J37L64o1n23K25m8m3L37l45N23o43k8M75l23L61l14J93m94L02L56k28
5837ej56J81j49R8l9j17K98l8K11L3j52q9k08j54K0J22K31j65j08N38q07L76m26
5860e05P87n83K76M5J84L95l23j90L82k55q55M24M79j1n62J15L71o4o56M35L63
5881B52p13K63J39K64j17J01J96j106N95Q7l81M21Q9k24J47K13J63o6k09m51O56
5902C19l03n0K5L00M07j101J29L7l36Q07o8L52p28J03K6m6M70p69N14j80r9j24
$$ plain form
5749 11 -150 -41 209 113 -190 254 -2 81 -267 228 -35 -123 98 144 -118 -235 -8 -199 474 -359 -245 -403
5771 -403 406 191 106 93 -287 -25 209 141 181 -57 -77 480 -190 -405 127 32 -645 -115 102 -70 -78 -448 -88
5794 -88 -151 -407 214 208 187 -141 106 215 -480 -333 -26 370 -105 50 72 259 16 -539 210 50 -214 -228
5816 -228 -91 273 212 -311 -86 -134 -177 160 -185 338 -305 -333 142 -181 180 -134 59 -435 -133 223 -5
5837 -5 -161 20 -129 -31 -70 -187 111 73 284 317 165 76 -132 -286 -266 -144 87 -78 -186 352 -455 -79 -505
5860 -505 282 -301 -25 20 204 599 276 86 468 213 -642 -218 261 250 -312 -197 174 110 -546 -111 252
5881 252 -461 -198 -59 205 88 189 385 -721 -126 -39 -420 1 90 -134 13 226 389 323 114 -337 319
5902 319 16 -34 -9 291 698 -403 -274 -237 -573 234 166 518 -210 -107 -81 -127 343 -426 88 -92 -191 -315
5924c15L90K16m69k88M53m48N62o3j31K41j23k15J59k55L60J94l51O58l87l76
5944a88O63q05N80p27j05Q87J09l41l30M11m37O14j66m91Q71l70N0l50K46J86
5964C07m72jp7j31P2K0O56n89J54k51M89k1J46j73m18O96l24l20Q49k07o55K07
5986d3m03N86k53J07j99o9J60m72R74k01M3L28p62J72J86l16J06j26N71n20k90
6007d21M70l24R9P9l8o6L87k67j79K06lm87N02k57L0O95o16k4L94o59M91j52L6
6030a04N3J34k9M28j23l80n69Q38l19j79K6K07J16l66O7L63j95K35l30P1n3k80
6052c89M49m37J11M79n40O87m31M96k68L04o4m7m74J56j99k38R2O72j83j31p1
6073b6J80J83j30k35J55K02q2o88L32K02j20j78K07p64O58K2m08P35q30O82n08
$$ plain form
5924 -315 75 291 -178 -466 -13 -461 101 38 -93 148 25 -190 -31 -286 74 268 -83 575 188 -188
5944 -188 475 -330 250 -477 -582 305 414 73 -257 154 -283 331 165 -326 545 175 225 -125 121 307
5964 307 -165 -166 -243 -374 -302 -282 374 -215 -61 -312 177 156 302 129 -289 407 83 -237 612 405 -250 -43
5986 -43 -446 140 -113 -6 -205 -274 -114 -586 388 187 230 558 -204 -32 154 -162 -56 -182 389 -131 -421
6007 -421 49 -275 -176 -97 -135 -201 186 -81 -260 -54 -57 -544 -42 -299 -269 426 -190 -214 180 -479 12 -140 -104
6030 -104 -51 83 54 482 359 -21 -590 248 -71 -250 -224 -17 99 -267 -200 163 -32 203 -127 -56 -109 -389
6052 -389 60 -377 -266 213 -327 360 -71 425 157 461 397 350 -124 32 -167 -405 -313 359 176 45 -26
6073 -26 154 337 207 -28 127 329 247 -441 -109 93 -27 -205 2 -762 -104 -82 -490 245 -585 97 -411
6094d11N27l19QJ1O53R1r19L76m41L27k28J083o26l18M3J26L31L54j131P16o03
6115c50L30J08j22o57P99p32N16M59n48K88j37K54q31R27k90J43n5Q2l54L91o81
6136d60P21n02k0P12m93p6J74J34N69p50k13O22o00K58J47K00l69r7K58m7p3J19
6158B14p7L19r12p2J37Q58j46o3m70M84K91n95j36Kj22K49J2K7j72j44Q9j05o2
6181c94O17m64M14j3k28K61N8m00l73L51M87L19q39L10L40q57N99J71l24j63N1
6202g7K39J75k06r3J86k04L29r66K0J64M87m7m30j18Q01m68N98k79k99M78n44
6223b54J72M06J7M3k42J51q4l02l44O77K87n77O82p10j52M11J46J4k31m15P09
6244D04q3k22l18j0j00N57J07k49K06m40M64n43R38m53m97L66m18L84m9l02K88
$$ plain form
6094 -411 116 -203 -195 -184 469 560 -359 17 -424 -97 -325 758 132 -186 -143 -17 314 668 -463 253 -350
6115 -350 -20 88 -34 -691 108 -624 -108 351 -197 91 -46 208 -623 304 14 157 102 184 -170 221 -460
6136 -460 261 -241 -261 451 -42 -118 56 190 759 9 -204 418 -182 76 223 423 54 -43 215 168 95 214
6158 214 137 456 -456 -528 -391 467 321 258 -212 272 563 -32 -168 -166 -288 -39 -27 0 -172 -316 -227 -332 -394
6181 -394 223 -241 173 160 -68 193 251 -149 -522 -171 316 635 -204 106 446 -411 188 359 35 -128 -77
6202 -77 162 337 131 38 224 20 349 -617 -597 -433 54 7 -423 -541 260 -208 390 111 -188 290 -254
6223 -254 -82 324 341 384 142 293 209 -93 -437 240 527 -50 632 -78 -230 181 327 341 110 -305 404
6244 404 321 99 -219 -229 -329 228 335 86 292 -148 316 -227 711 258 -239 127 -291 93 44 -258 30
6265C0k07K23k62j21M09o8J17Po4Q1j49J97l3m23Q6j25K46k58N82K13m03J48o1
6288A65K34k03K43l48j38J64q9k76k1J94M4J27N12q83N08J97j062P31K99j70O9
6309B97M4n88L78J94L1p07L55o2p5N92n88O8Q0j74M07M07j405Q88M66l40m12k60
6331d04K12O4m44O82o02M19L34q37J20Q63n59p4N96n53J05Qm49K99k16L60P14
6352F38n87j33P7n13O62j16M57j32o90N61m04l2M20k82j93O36o05M47j86k96J9
6373b52j22K45j62K15OO19m65l56J59J34K06l40K12K80n32K8O29n70K57N7l22
6394g4l77M18p07J92P02j45n8K16l5j60k2l05l82O12L58k08J43m91N6N94l68O7
6416B6R1k00P12o70J7L69J7o22J68l36Q50n18L86Q8r16L44q4J27R8N84l19J2m82
$$ plain form
6265 30 -177 46 -216 -337 72 4 121 128 64 145 -4 193 160 -263 -177 -302 -56 -314 268 481 78 226 165
6288 165 399 196 439 91 -47 117 28 -248 -269 -75 -31 96 608 -275 233 430 -632 99 398 228 297
6309 297 341 -247 131 325 356 -351 4 -58 -133 459 -129 -61 19 -155 252 659 -746 142 608 268 -144 -404
6331 -404 -192 -128 -572 110 -492 -73 261 -576 -456 407 -152 -226 370 -183 -78 -70 -519 -220 -436 -76 638
6352 638 51 -82 -5 -518 144 28 485 353 -337 224 -180 -212 208 -74 -267 369 -236 211 25 -271 -252
6373 -252 -374 -129 -291 -76 -70 549 84 -272 -113 21 227 -113 99 379 -153 -125 504 -66 191 248 -74
6394 -74 -451 -33 -740 -548 154 9 -49 167 132 -28 -50 -355 -737 -125 233 25 168 -323 -267 327 -41 26
6416 26 117 -83 629 -41 -24 345 362 -260 -92 -428 422 -96 290 378 -538 -194 -278 -151 -53 531 212 224 -258
6439b58j3M49kj14J73l18k0K17l57O05k90k36q8p9N38o6k79N36l11o4j6M7J75
6462B29n21L02N73p78K79O0o34M99q6n15O17K29m7k07RJ7J86l91j25p7N41k77
6484a17J07j7k94K27L17J9j73J31K90o64L45l97L17J37m66Q70l62m08k52L91N76
6505E77p26l23K85L07j06N5k64k77N85n0j9j40k7K21q42J065o85O52K9l94j63
6526b40J05K48o52M59j18l1K63m20J020l85p54M15j58r7M37j11L54m48oP81o06
6547E6J64n19K76o2L4N8L13p53P58p79m55J001j25J91m65J16m28P95m32J7J16
6568a23n38R08p64J71R55l54jk96K11k9j20N4j97J08J29K9k92P73o71l7K44o88
6590e28J31P75m02m81JL05L42o16J67L29R6m59J99j03N54q5j60j11M80K79n64
$$ plain form
6439 -258 -271 178 176 62 235 -83 -103 114 -243 362 72 -164 -252 -331 207 141 -138 398 87 23 7 54 229
6462 229 -292 10 583 -195 84 144 -490 9 -77 -592 25 254 207 0 9 26 212 -179 -304 -381 160 -117
6484 -117 -10 -27 -321 -94 223 242 69 200 490 -174 171 -226 91 228 -238 632 270 -138 -390 1 577
6505 577 -149 -472 -187 120 14 69 -195 -472 113 63 44 -96 -123 98 -744 321 -364 288 317 -77 -240
6526 -240 -135 113 -539 -80 -198 -229 34 -386 634 249 -505 -90 -248 -345 92 -19 335 -113 -119 662 56
6547 56 220 -299 -23 -85 -51 7 320 -433 325 -454 -909 92 -33 158 -307 -191 -619 176 -256 -239 -123
6568 -123 -661 247 -517 -346 609 255 254 -42 169 140 20 74 -123 -15 114 143 -149 624 -47 -84 160 -528
6590 -528 -397 378 -24 -505 -504 -199 143 -473 -306 23 119 -340 -141 -244 310 225 65 -46 434 713 149
6611A49j18K59o2o3L09j31m99P09n63K54l88m13N87L81l51j64j62k11O49J57J6
6632C45j14n05L94l7k5N13o53p3K32n4K0J35o22L93O04Pp33k82LL67J4k2J47J52
6656B06m85j58L34j37O88l74j72J42j22K12J33q33N12m6r3L48J9m1M05j68n62
6677a92J26j59M56l37J12L22n8l08l58O58M0N7l77M87q04N97l1r0r7n3m1K16n06
6700c40M11l18M48lr3p5N9k20k17O31o40R04o71j30P82m36m51K92j04P3J68o90
6722f20L52M12l84j4O37k84k76J91j90j19J08k21O07jk82K64l27K72o05N66k35
6743a49n28J058l97L20K04r4l97j47J17n47N72k45K78k17K6O3l04o7N3J15J27
6764a59J53j29L62l92P17l79n03N25q01N91K86j10m37J0K16L64l77k7L11n65L28
$$ plain form
6611 149 31 290 228 165 474 343 -156 553 -10 244 -144 -557 30 411 60 -104 -266 -477 172 329 345
6632 345 231 -274 120 83 58 571 -82 -155 77 23 43 178 -444 -51 553 560 -173 -455 -452 -85 -71 -93 54 206
6656 206 -279 -437 -103 -240 448 74 -98 44 -78 134 267 -566 -54 -100 -193 155 174 133 538 370 -192
6677 -192 -66 -225 231 -106 6 328 270 -38 -396 262 302 359 -18 469 -335 262 231 141 44 -9 -50 166 -340
6700 -340 71 -247 201 198 105 30 89 -131 -348 283 -357 547 -124 -254 528 92 -359 -67 -171 -98 70 -620
6722 -620 -268 144 -240 -254 383 99 -177 14 -176 -295 -187 -408 199 198 -84 180 -147 125 -480 86 -149
6743 -149 -677 381 -16 304 508 414 17 -130 -13 -560 12 -233 45 -172 -146 -83 -387 -454 -401 -286 -159
6764 -159 -6 -135 227 -165 552 173 -330 195 -606 -15 271 161 -276 -266 -50 314 -63 -90 221 -344 -16
6785a6N69q13P16m80J44n3k05n6L47l42M00l44L35m21M91k39n9K5m88M08K87j12
6807I4n3L90n01M53l23LK41l56K17N05m73J06m20j04J53l31M92m03K2O34j73j39
6829C4K59J48m42K10j56L6J45k37K01J74n59n31K45L98L26J62m78J57J64j57J0
6850A09l18R0j79P0Q6k4q9J24K41j40J11K47j81M9j22j09j13k29L40j26O17o1
6872C93l70K09j33j36k14M30J07j77p61N80N2l2Q1k20n0K66l7L01l64k02N74j69
6894A28J1J2l67M65m23J26j96j41K06J011o28n01N28m44K57K64k27m66J11K48
6914b6r5j38O80m86N52o74K1M6J22MN36n55L71J36k45l44Q61o16k58q3L36K99
6936D44k75p7j94K4j90P79p10K99q9k31R93j045J27J82J47l47Q1J06J28R2j3l27
$$ plain form
6785 -16 553 -260 456 -24 120 67 -138 -194 153 -189 211 -133 202 -219 272 33 -26 -1 -489 -81 206 94
6807 94 41 431 -70 383 60 63 304 -52 165 670 197 303 -117 -221 -68 -399 93 -310 -288 346 173 34
6829 34 293 441 -1 209 53 89 234 -3 198 372 -187 -718 -473 -75 251 413 -65 92 256 99 109
6850 109 -209 -119 -298 -228 -142 -166 -255 -131 110 -30 81 328 147 196 74 -35 -148 -377 -37 -163 454 393
6872 393 23 232 99 -37 -251 179 286 109 -652 -72 -20 -52 29 -191 -241 25 -12 289 -75 -277 297 128
6894 128 139 151 -216 249 -174 -48 -244 -385 -179 832 204 -297 231 -213 44 308 81 -385 -274 -26
6914 -26 -121 -259 421 -65 487 -187 -166 -120 2 6 542 -13 358 494 249 -95 766 150 -108 -191 145 444
6936 444 169 92 -102 -78 -268 511 -199 100 11 -220 773 -272 -145 37 184 -163 -82 24 152 244 231 -96
6958i6M7J81m8M14o52N99k53r2J95J61p80J53J95Ok56P38m96j67m5M78j99J95
6980B78m21k14K85k42L29j55K50K41m80M96j89l24R9L51k47n24P06m33k58L05
7000a47K56k50m27P58p78O91o09N10L44p14L61o6N9M17n75O34k32J09m75j50J29
7021a55J83K00j39J08m35J81N87m99p1J09j83j5J65M45k51l51j14Q6M05q2j91
7042a7k6L57k82m52L45m06Q64m33j32M85q7k20j86L19J42k83K48R5m48j41M34
7063A76MJ01K00p12M50q3k65P6J97j64j00l13M98j0l64K69k51M66K34p92K76k15
7085c22p8P76m69l43P96k96k66O90j2k55p0n72R9JM68j54nL74m33K42k73J57P0
7108A25j10r8K11j8n19R74m31m20N33%k71J84l89N67j55K48n03J17j74K76j2k85
$$ plain form
6958 -96 -49 132 84 498 -154 445 192 100 295 456 -324 -171 24 30 -226 512 16 -151 -196 282 83 278
6980 278 -143 -357 -72 -314 15 -140 110 351 -129 367 178 -146 -47 304 57 -467 239 -194 -452 -147
7000 -147 109 -141 -568 190 -588 103 -506 4 348 -366 -5 -71 -12 405 -170 464 232 341 -134 -284 -155
7021 -155 28 228 89 197 -238 -57 530 31 -40 69 -114 -129 36 481 230 -121 -235 -149 256 174 -17
7042 -17 -43 314 32 -420 -75 -481 383 -50 -182 303 216 -4 -190 129 271 -12 236 331 -117 -258 176
7063 176 180 281 481 -231 219 136 -129 -53 144 -20 -120 -433 65 55 -309 -40 -291 175 409 -383 -107 -322
7085 -322 -400 376 -93 -436 360 64 -202 488 476 221 151 -421 -322 -321 147 -7 -12 362 -71 171 -102 55 125
7108 125 15 -83 128 110 -409 565 134 -286 247 247 -24 160 -229 338 183 431 -72 45 -129 147 135 -150
7130a50L28j28J5j73L42l58j99N03q9o39P03j72l31N35J59N75p83j06J57l67L31
7151A53k30Q4J03m5j83K8M8j84O90n60J00L73m32J40k41N1M21m87l13j18N84L85
7173C67l47J34L4l03N37J26j030N87m55L79K56j55q6K79P8n06n28P09j80JK56
7194A53n9k67K27L27j36O0j26q7K42l38l06L66J25j07m28J58R3N32m59M16L10
7215F96r47K53M26l31l71K29J3l8M84ll04k38M50m93L16m41N88k28J46k54m7M4
7237e0J2j36k34M64m19K89j38j75K9J78L67l16R3R42n59p11L18k25m9N98K37l95
7259A20j92Q6J47l05j13K04J34l81K03K98o3m7l95M21k65j80M29j26J20K26n61
7280b40J77K65n13M17k13K66l47O18l1j91R1J81k04J89l66j87M47l44j19K79R
$$ plain form
7130 -150 178 50 65 -108 234 -124 -323 180 91 -548 155 -17 -348 187 346 921 138 32 189 -178 153
7151 153 -77 7 110 65 -118 -90 -42 -226 464 -96 4 377 -55 85 -156 -105 316 -171 -484 -602 -18 367
7173 367 20 154 188 -115 422 548 -482 105 -350 29 285 130 44 323 401 -105 -633 76 -104 -103 153
7194 153 94 -173 54 381 245 305 179 92 334 -4 -310 56 181 74 -354 -196 -103 429 -30 386 696
7215 696 -251 2 428 97 -274 -45 -32 -70 414 411 107 -131 319 -174 142 -299 289 61 207 -47 -94 -50
7237 -50 -38 -174 -408 56 -363 -74 -212 -387 -358 -180 187 -129 -36 906 347 -364 -46 -271 -320 278 515 120
7259 120 -72 14 161 -144 -257 -53 81 -300 -97 201 138 91 -304 117 -148 -328 101 -25 95 321 -240
7280 -240 -63 202 -311 106 -107 159 -188 430 399 208 299 480 276 465 99 -88 359 15 -104 175 184
7301A84m52L35l21L68m78L58K78j75k56O27o64M09k92J06J69m34N4K97m5k87n8
7322b77M73m40K72m4K74j7p44M01k43OL75j79M31K44k39j129P84o0J62L38K04
7343E92l47n22J66p7K3J55J1k01J61m80O50l08P65m93q2k41j75L34p6j48M50q52
7365f95N25L51n87O65l88k77N71m08P7N53j95m76K15K50n76k50J64N44k65N41
7385C39M45j204L89K27J32l4j7r5k29r5Opj62K39j21k00Q0M28O4l27k58L48k52
7408c04L82k92k65J67N17k40o7K98o63N29M3l25M41k26l05M96q12P68L9m05l19
7429e43O81K19l00l71O70n13k07k0M48r0L47l0J37n48k78N95m31K19L16l26K55
7450B30j41j36j99K35p5j89L23J26j38K11R1p50M4R9L56n12L68K74Rp0l12L11
$$ plain form
7301 184 -268 67 -254 114 -364 -6 272 97 -159 468 -196 213 -79 27 196 -238 -184 113 68 -219 -277
7322 -277 196 -244 28 -16 258 241 -503 -102 -345 -339 36 -143 288 532 293 -836 -52 -112 50 388 592
7343 592 245 -277 -111 -188 -165 -10 1 -200 -39 -519 131 -177 588 95 13 -228 -403 -69 -145 -293 157 -695
7365 -695 -170 181 -406 259 -129 -406 165 -243 -166 387 192 -284 -69 181 -395 -645 -481 63 -202 339
7385 339 784 -420 -31 196 328 294 277 182 -47 -142 -136 -143 -305 -66 -187 -387 -307 121 185 -142 -400 -52 -304
7408 -304 78 -214 -479 -312 205 -35 -102 196 -467 62 105 -220 221 -5 -310 186 -626 142 181 -224 -543
7429 -543 138 357 57 -314 356 -157 -364 -384 64 -26 321 291 428 -120 -398 197 -234 -15 301 -25 230
7450 230 89 -47 -246 -11 -86 -275 48 174 36 247 338 -412 -368 -269 87 -425 -57 217 226 156 -156 155
7472A55k44j51N41n1m20J73k25R0L62k08N37r62J035o79n75O54L7j90Q2J68l82
7493b53l0j4J72j50K19N78o92N5K38j30K10j7l63M82J38n65J08J09N6k6o2o62
7515e99N23j01L73l99K80K88j64K39k04n42O43j62k48k3k21L74l04M0M52M25j030
7536c60O54J98m20j0k87J60j48J91J89k64L12J23m87R1J4k2L86n80N20o5k45K61
7558B11K44n05k23j5J40L13m66P07k79K77m00J30k38m0L26m15K24m6R6K51p02
7579d10N52k33K3k14L90m82M44j90L0N40o95k03J49J3j35K73J58k79J8r1O45K02
7601E05l05j22o7K08k40l31M22M63o10K76M50p13n78N79M04l89m00P13m18n4M81
7622B74m93P07k98k97L79k76M10o14J21J39o01K46L66n74K42L06P8q3n52M54J2
$$ plain form
7472 155 -89 -240 301 250 -170 3 -222 -132 230 22 559 -403 632 -47 -622 32 69 -121 -39 129 -253
7493 -253 -283 -297 -125 -275 -56 522 -170 -115 123 -7 203 186 -177 305 443 -122 -14 95 151 125 63 -599
7515 -599 -76 -177 196 -203 77 365 201 440 236 -306 337 175 -73 -96 -317 57 -247 -207 245 670 -360
7536 -360 294 492 72 62 -225 -65 -213 -22 167 -97 215 338 -149 -58 -44 -66 320 -260 260 195 -50 211
7558 211 455 -50 -273 -288 -148 165 -301 406 127 404 4 134 -104 -144 182 -233 -9 -55 41 292 -410
7579 -410 142 -91 -68 -282 108 -374 70 -120 -90 450 -245 -448 -299 -286 -421 -148 10 -269 -251 -342 303 505
7601 505 200 78 11 219 -21 -352 70 533 -77 199 649 -64 -642 -63 341 -48 -448 265 -153 -207 274
7622 274 -219 488 190 -107 272 -4 406 -208 -87 52 -549 -303 63 -511 -269 37 115 32 -520 -66 -54
7643e4M96k10L2J42k31J03p18L57m11P82q67P51m91N04p4j39K9L41m94L79M17
7664F44k35l14j77K23k46K60o97O14M0j93j61kN98K30o75K97l99L46j21p2J12
7685G2j17K37p25P44k39l41M97m93M31o9r1L45N4om18K39m81Q87L4j133O06l2
7707Ak32L66n57N91q3n26L27O10m15K81m63j32O39j000L58k50L18n8Poq0k4N5
7730b73q9K03k48M84j01N09m77L21q01L05P0J15j88N54jr38N45m70R86j11o58
7751b63J33l40r9M16M38o91R88r81N28l46j12K94j75o5J30J42J5K35k00J22j5
7772A54n0K55r92M10J92lK49o33Q98p32L10P8J79n42M46n68M53n69P34m64Q8J90
7794H3J76J28p85L52j28K66R6m86O29j09K10p44K1M52l2o83J63M10J25J98q10
$$ plain form
7643 -54 442 232 264 406 175 278 -440 -83 -494 288 -579 172 -319 185 111 -28 1 342 -152 227 644
7664 644 409 95 -82 141 -105 155 -542 72 112 -81 -242 -244 354 584 -91 206 -193 153 32 -40 72
7685 72 -45 192 -533 211 -28 -369 128 -365 66 -3 -94 251 305 299 -119 120 -361 526 560 -573 33 1
7707 1 -231 135 -422 169 86 -440 -113 497 82 363 -100 -232 407 -593 -235 -485 -167 -225 -218 -224 -304 -328 -273
7730 -273 -362 -159 -407 77 -24 485 8 329 -472 -167 -97 18 -170 384 383 -555 -10 -480 506 395 -263
7751 -263 -130 -470 -569 -153 285 -406 582 -399 129 -217 -329 -35 -210 -275 -145 -3 12 247 47 169 154
7772 154 104 359 -633 -223 -31 -34 215 -418 480 -252 58 136 315 -227 219 -349 104 -465 269 -195 -107 83
7794 83 259 387 -398 -46 -174 92 188 -298 331 222 432 -312 -291 161 129 -554 -391 19 144 342 -468
7815d68J6Q22m56K51k50P8k67M62j30l35N14k58Jj23L01k25j88r6k3O10J92o61
7837b33K28q1n6l0L13p4k97O03l6k41n40Q92n30K39r5j48K79q1K04o74P79j67
7859B54j9M9q73Q31J24m89k77N36L8k33L21p49M82K24q2q3l1M2k12J1L9K15p34
7882f16M83L34j48jL2k49j7Q6PL18o37Q48l09M39n1j25p55M33o69Q65J66n13j90
7905b69M9N26j01k50nK44o51O18j76K22n88L69J82J47m69N78r8k84qp20N74q9
7927a99M35l65o1O9L94m75q3J42Rr6M0P9L14Q4p97J20N43q7J18K07l43K9k44n25
7951f92K55J68P24o57K9M1l61M88p85P66L74o5K03m97K04k59o2j6L25o11K99N5
7973g4K45l5Rl41J96K93l72Q4J29k82L83l00M5L3q6K45l66ML78J24m05j41M96
$$ plain form
7815 -468 -452 370 -86 165 -85 -7 -274 188 58 -277 237 -21 -20 -143 158 -67 -255 -351 -374 236 428 -233
7837 -233 -5 -86 -142 -172 141 67 -230 373 337 96 -444 448 -82 157 62 -86 193 112 316 -358 421 254
7859 254 235 284 -589 242 366 -123 -400 136 174 -59 262 -487 -5 219 137 54 23 65 -147 -136 -97 118 -616
7882 -616 -133 201 53 52 84 -165 -182 -96 -89 229 -408 440 131 570 519 394 -361 72 -597 268 434 -79 -269
7905 -269 -220 306 205 -45 -50 194 -457 161 -15 207 -381 -12 170 317 -152 426 328 44 36 -684 -110 -199
7927 -199 236 -129 -190 -121 273 -202 -285 -143 -134 -230 -190 -111 203 287 -510 -390 153 66 184 391 48 77 -167 -692
7951 -692 -437 -269 455 -202 -173 -132 -493 -5 -790 -24 350 285 488 -9 195 -64 -126 -142 183 -428 -129 -74
7973 -74 171 136 145 -196 0 293 -79 5 134 -148 235 -65 -20 13 -73 172 -194 -190 188 312 -93 -234 262
7996B62k17J4L21k83m00L59K3J63k94l73M17L67p56Q88o52K55j51R1o57M68K27
8017G2j64K29J18l69P6N6j1K18j63L5o01K96m9L02m92O6N69m27k68J42L53O8J27
8040A83q5n20M93N91r00M96j56j86J08j83N00n98J53O19l40k42m9K10k56Q61r08
8061b09M12o60J099p79J49l62L17j20J88O17q65K83j78K75k22J91p6k86P08j72
8081C10m61k24M61p66J219K24r74K46L60k61l96q3Q54o45J29Q3k87K30l88M60
8101I1O45m24r20M59k22J21K65r9N00k46l99R6r6l63J48O50l30R3k64O37P5m73
8123e6L9K59m84P4K67N9j78n11K96L41K58p15k01N28j21r9M8O3M0L7k48J87J48
8146C1o3j41L36L23n52K07P5J90kj95q3o79M53L1M28l27J26J43m39O78p37J05
$$ plain form
7996 262 45 59 380 97 -303 56 79 242 -52 -425 -8 359 -397 491 -161 94 -57 34 -623 -155 72
8017 72 -92 137 255 -114 -38 18 7 225 62 97 -504 -208 -257 45 -447 -381 188 -239 -507 -365 -12 56 183
8040 183 98 -422 71 662 -238 258 102 -84 24 -159 341 -257 -104 515 175 -67 -116 94 -162 699 -209
8061 -209 203 -457 642 -137 12 -350 -33 -153 35 652 -213 70 -108 167 -55 136 60 -226 482 310
8081 310 -151 -375 86 -680 539 763 -211 35 395 134 -262 -345 509 -136 -7 76 -211 19 -369 91
8101 91 736 312 -608 -149 -371 -250 15 -84 416 170 -229 -133 -229 -592 -444 206 -124 -31 -295 342 417 -56
8123 -56 -17 242 -242 -168 99 158 -20 -531 -235 106 364 -351 -552 -24 -145 -244 -196 -133 -93 -56 -304 -117 31
8146 31 -32 -173 163 486 -66 141 216 406 404 209 126 -553 -100 -69 359 32 158 301 -138 540 -197 -92
8168i2K00N01k57n50J06l94R45n99J44K22j72l46P37m84R3k62J86K48j73L03p97
8189d41N50R2
$$ plain form
8168 -92 108 609 352 -198 -92 -486 459 -140 4 226 54 -292 445 -39 54 -208 -22 226 53 356 -441
8189 -441 109 201
8191B01
$$ Imaginary data points
##PAGE= N=2
##DATA TABLE= (X++(I..I)), XYDATA
0@%%%%%%%%%%%%%%%%%l2O4o4O4o4O5r7J28j28J60j92K14k46K84l21L57m15M73
35B50n31N96o65P42q30R23j027J143j267J402j548J708j884K077k293K522k775
52a457L062l377L730m126M574n089N683o373P195q195R438j1034J3172j6195K0846
67A1854k9003M7588j79346j4996J54091l5999N1041m4258J6892K5242J8021L6817
79E7944j2030k3900N3350l7820J2300K3154o2671o724J877k9229M4238m006N39
92A7022J848n1749J6087O819k9662M1674j7883k0337L1106k1854J0964P134l8775
105d7606K5826J804P187M7012j9951N239P992l8777L4490Q440j8367K9776k6214
118A6851r343J2562l2275J6651q264l2418L1407q199P113L0202l6015K447j572
$$ plain form
0 0 0 0 0 0 0 0 0 0 0 0 0 0 0 0 0 0 0 -32 32 -32 32 -32 33 -64 64 -64 96 -96 118 -128 156 -165 192 -223 250
35 250 -281 315 -350 392 -438 485 -542 601 -666 736 -812 896 -988 1089 -1204 1318 -1457
52 -1457 1605 -1772 1958 -2168 2406 -2683 3000 -3373 3822 -4373 5065 -5969 7203 -8992 11854
67 11854 -17149 30439 -148907 -163903 -9812 -45811 5230 -39028 -22136 3106 21127 57944
79 57944 45914 22014 75364 37544 49844 72998 10327 3603 5480 -23749 20489 16483 17022
92 17022 18870 -32879 -16792 -9973 -39635 2039 -15844 -36181 -5075 -26929 -15965 -8831 -47606
105 -47606 -21780 -19976 -12789 34223 14272 19511 27503 -11274 23216 31656 13289 43065 16851
118 16851 7508 20070 -12205 4446 -3818 -36236 -4829 -13028 -5915 24287 -11728 -9281 -10853
131a0853k2611M2335k992j1081K0578l2235O056J1570k3837K3131j1390r732L8261
144A7200j4587Q687J5472l6677J4758M292p386L3262j7339m524N704l5629K0285
157C518L446k6073K4311j5207p796K6842j7046Q823n173k4673K7068q905O59L1590
171B1384l0876j215R831k3271K3810q82q553K5178j7514J0585J6883k4679J7631
184A8312o795j7191L2198j2347k432J2946l2390M552j745j6106K4108j5835n065
197a7790J9378k4531J2443O710k3421K2359n964l163K8381j4846O010M498k3141
210a3077K2552l210n566K7991k0650k04J3885k2198J4256l225j6960J9974j5975
223b407l2J6333k5821P287m963j8860K3381q259k124J8789k2357Q512P669j4301
$$ plain form
131 -10853 -33464 8871 5879 -5202 15376 -16859 -10803 767 -23070 61 -11329 -21061 17200
144 17200 2613 11300 26772 -9905 4853 9145 1759 35021 17682 13158 18862 -16767 3518
157 3518 6964 -19109 5202 -10005 -17801 9041 -8005 818 -4355 -29028 -1960 -10865 -10206 21384
171 21384 -9492 -10707 -876 -24147 -337 -1219 -9772 15406 -2108 8477 25360 681 18312
184 18312 11517 -5674 26524 14177 11745 24691 -7699 -3147 -4892 -20998 3110 -12725 -17790
197 -17790 1588 -22943 -10500 -3790 -27211 -4852 -10816 -13979 14402 -444 5566 10064 -13077
210 -13077 9475 6265 699 28690 8040 7836 21721 -477 13779 10554 -6406 13568 -2407
223 -2407 -2439 13894 -11927 -4640 -9603 -28463 -5082 -13341 -15465 3324 -19033 -10521 -2852 -17153
237a7153K3045o380n439K3320j6049Q910J1242k2130J4628n437r599K3325j5341
250F942J050P629k3251J2354m219j4828K1287j6610k712J5101k0877J0070K145
263e919j6661J9521q470N0K0654j7576R273O285j6274K0002m680m927J9454j6833
277C899N524Q503j8933J4061p019j1352J8021j5324J686R929k2102J0389j049
290c767j3436J9284j2388j418J4423j8665J2593L314j4148J9867r639k512J8795
303A2303j5227Q126N808j6290J7063o845n140J7798j7301M185P706j9169J3969
316F986l138j1693J6449j5461J960J0855j8212J2450j178j3481J7753j1329M75
329g564J3936j7118J0261K759j3760J7390p123l566J6156j6071Q582N468j5532
$$ plain form
237 -17153 5892 -488 -5927 17393 1344 10254 21496 -634 13994 8557 -1042 22283 6942
250 6942 7992 15621 -7630 4724 505 -14323 6964 -9646 -12358 2743 -18134 -8064 -5919
263 -5919 -22580 -3059 -11529 -11479 9175 -8401 872 7157 -9117 10885 6205 1278 20732 3899
277 3899 9423 17926 -1007 13054 6035 -5317 12704 -2620 -934 8995 -13107 -2718 -3767
290 -3767 -17203 2081 -10307 -11725 2698 -15967 -3374 -60 -14208 5659 -3980 -6492 12303
303 12303 -2924 5202 11010 -5280 11783 4938 -202 17596 295 4480 12186 -6983 6986
316 6986 3848 -7845 8604 -6857 -4897 5958 -12254 196 -982 -14463 3290 -8039 -7564
329 -7564 6372 -10746 -485 2274 -11486 5904 -1219 -4785 11371 -4700 3882 9350 -6182
342f182J6615n095p033J6140j4565M207P937j6996J2684m792j0476J5824j5335
355g067K272R055j7081J0180K18j2204J6008r366o59J3040j5802J0873L019j2607
369a0121J7559p398l143J5348j4880P643O715j4164J5420n390p227J4881j3899
382A344L560O801j7516J1556m603j1431J3508j3268J26Q489j6134J1035J097j0257
396a5693J6745q918N61J3486j3590J1225N274j2244J5187n779m093J3219j3824
409A556O209M587j3973J2947o131p674J4030j5269K100O650j6515J0329l307r788
423a4249J2432j1301K75R422j4218J3443J638j0029J8508p374j50J5021j1387
436B031R179L488j1186J2973q524m296J2661j6553L521M728j6282J1327m337q508
$$ plain form
342 -6182 10433 5338 -1695 14445 -120 4087 12024 -4972 7712 2920 -7556 8268 -7067
355 -7067 -4795 4260 -12821 -2641 -2423 -14627 1381 -7985 -8644 4396 -11406 -533 2486 -10121
369 -10121 7438 40 -3103 12245 -2635 5008 11723 -2441 12979 7589 362 15243 1344
382 1344 4904 11705 -5811 5745 1142 -10289 3219 -10049 -9923 -1434 -17568 -6533 -5436 -15693
396 -15693 1052 -7866 -7305 6181 -7409 3816 9090 -3154 12033 6254 2161 15380 1556
409 1556 7765 12352 -1621 11326 5195 -2479 11551 -3718 -1618 5032 -11483 -1154 -4461 -14249
423 -14249 -1817 -13118 -12843 -3421 -17639 -4196 -2558 -12587 5921 -1453 -1603 13418 2031
436 2031 11210 14698 3512 16485 7961 3665 16326 -227 3294 8022 -8260 3067 -1270 -9778
450i778J1435j1878K703O410j3642J2311k469r083J5622j0509M63J1323j1997
463i089J0761K718q595J5028p488P78J2528j3187P471L024j3387J2261p355p360
477a892R422j4482L584L655j3783J1492m550p112J4241j0732L306R215j1448J1391
491B307j307q546J4102q525M66Q775j2612Q894O61r453J4398p266j641J1765j2230
506b12O777K819j0934J1286o191o380R933j3588L679M049j3609J1058l830p028
520a2171J3559r747L597Q484j2761J0321l77p093J3234j0143M51R487j3434R764
534C171K573j0016J2651n878j828J1041j0256P607J711j1534J1040p480o704J1196
548G294j4213J804M506j3148Q206l061o642J1138p938N214Q273j1978J2976P76
$$ plain form
450 -9778 1657 -10221 -7518 -1108 -14750 -2439 -4908 -13991 1631 -8878 -8415 2908 -9089
463 -9089 1672 4390 -4205 10823 3335 4113 16641 3454 10925 13949 562 12823 5468 -1892
477 -1892 7530 -6952 -3368 287 -13496 -2004 -6554 -13666 575 -10157 -6851 2364 -9084 2307
491 2307 1000 -7546 6556 -1969 -1503 7272 -5340 3554 4215 -5238 9160 1894 253 12018 -212
506 -212 6565 9384 -1550 9736 3545 -2835 7098 -6490 -2811 1238 -12371 -1313 -5143 -12171
520 -12171 1388 -8359 -4762 3722 -9039 1282 905 -6188 7046 -3097 -2646 6841 -6593 3171
534 3171 5744 -4272 8379 2501 673 11714 1458 9065 10776 -758 10282 2802 -3902 7294
548 7294 -6919 -5115 -609 -13757 -5551 -8612 -15254 -4116 -12054 -6840 1433 -10545 2431 3207
562C207q013J4163p069M11R324r631P356N2r307J1445q570j730J0840j3435M160
577C203K424j2014Q179n459n771Q912j1984L244L370j0691J1084j487n851J3259
591D18o782L505R879q302J0818R9o680J1995q746J93Q141j2213N421J13j0916
606c057R255q239l361P777j1120N628K990j1465J0241n419m950J0679q576M302
620e315N707r792J0809k320m959J3084q757L177J0073j0275Q419j070p341R719
634A1159q379m45P402j3094O189O08j1414R708o910k758Q235j0696O851K719q510
649i335J0559m701l897J1023r759M599O374r665R051k353n295J1509q220K448
663B338P016j1274Q955L43q440R109q357j685P455j0289P345P6j0056Q665o576
$$ plain form
562 3207 -4806 9357 2288 2699 12023 2392 9748 9800 493 11938 3368 1638 12478 -957 3203
577 3203 5627 -6387 1792 -3667 -9438 -526 -12510 -9266 -5896 -16587 -5503 -6990 -12841 418
591 418 -6364 -2859 7020 -1282 9536 9635 2955 14950 6204 6397 14538 2325 7746 7859 -3057
606 -3057 6198 -2041 -5402 2375 -8745 -3117 -127 -11592 -1351 -6770 -11720 -1041 -9617 -5315
620 -5315 392 -9400 1409 -911 -5870 7214 -1543 1634 11707 1432 9851 8781 1440 11159
634 11159 2780 2335 9737 -3357 2832 3440 -7974 1734 -5176 -7934 301 -10395 -3544 -825 -9335
649 -9335 1224 -3477 -7374 3649 -6110 -1511 4863 -4802 4249 1896 -3399 8110 -110 2338
663 2338 9354 -1920 7035 7378 -1062 8047 -310 -1995 5460 -4829 2516 2592 -7464 1201 -5375
678e375j932R231r410M550L646r079R829l611m307J0544r336M048O071r080R266
693E055k158n966J0180p796K520O766r628P631m15p965R191q051j242P042r370
708d206N193Rq539Q541o225l135Q975q812M919M109r528R992l287l528R975q435
724c982M522O026q985R317j715n915J0036q344J582P372r926O900j961q074Q410
739E263q748k54O676j0845M562J998q669R200n781l154R111q157N773N443q122
754e704R495l571l274J1052p790M382M976q806Q107k702n595R082q404n52N336
769F032j0270O487j087q388Q340p567j305O874q953N990J712p933J0214m721j364
784e939R676q378N862M695p860R791k511m669R560q508L128M677r420O280k569
$$ plain form
678 -5375 -7307 1924 -7486 -2936 710 -8369 1460 -2151 -6458 4086 -5250 -1202 4869 -4211 5055
693 5055 2897 -3069 7111 -685 1835 8601 -1027 6604 6189 -1776 7415 -636 -1878 5164 -4206
708 -4206 987 996 -7543 998 -5227 -8362 613 -8199 -3280 829 -8699 1293 -1994 -5522 4453 -3982
724 -3982 540 6566 -2419 6898 5183 -732 9304 960 2542 9914 -12 6888 4927 -3147 5263
739 5263 -3485 -3739 2937 -7908 -3346 -1348 -10017 -817 -6598 -9752 -641 -8798 -3025 2418 -5704
754 -5704 3791 220 -3054 7998 208 4590 9566 760 8867 6165 570 9652 1248 696 6032
769 6032 -4238 2249 1162 -7226 1114 -6453 -7758 -884 -9837 -3847 -2135 -10068 146 -4575 -5939
784 -5939 3737 -4641 1221 5916 -1944 7847 5336 667 10227 1719 4847 9524 104 6384 3815
799C815o640Q316q573j126O023r921O638K35p670Q907o564r04P936p475N749K243
815I89o270R421n267j220Q964q679N111L746p916Q498l467m097P725q197J911
830A252M422r053P072k602o323Q340p612j02N970r075O576N51p179R131n124r93
846d749P287p871O211K230o590R056m353k792O989q019M808L549q134Q508l482
861B648m428Q534q517K413M620q804O949j924o458Q077p637L67O296r334N834
876a364O95p220R627n200j172O892p290N679K714n803Q559m333k615P460p325
891f96L803L860q058P152k739m736P432o584Q59L701q854O665j450o055O712o365
907e353m76N232q500O273R92o007Q584m509o1Q054o655N605K945o065Q383m131
$$ plain form
799 3815 -2825 5491 -3082 -4208 1815 -8106 -1468 -1233 -8903 4 -6560 -7464 472 -7003 -1254 989
815 989 -5281 4140 -1127 -2347 6617 -2062 3049 6795 -1121 7377 3910 -187 7538 -659 1252
830 1252 5674 -3379 3693 1091 -5232 3108 -4504 -4606 1364 -7711 -1135 -584 -7763 1368 -3756 -4749
846 -4749 2538 -5333 878 3108 -3482 5574 1221 -1571 5418 -2601 2207 5756 -2378 6130 2648
861 2648 -1780 6754 -1763 650 5270 -3534 3415 1491 -4967 3110 -4527 -4160 2136 -7198 -1364
876 -1364 -669 -7889 1738 -3462 -4634 2258 -5032 647 3361 -2442 6117 1784 -831 6629 -696
891 -696 3107 6967 -1091 6061 3322 -1414 6018 -566 293 3994 -4860 1805 355 -5700 1012 -5353
907 -5353 -5829 -597 -9097 -2824 -1832 -7839 745 -3764 -3825 4229 -2426 3179 6124 59 8442 4311
923D311k417P207p276K468K265p825N828k921n098P093p587P06M673q959O054
938a478n40o398P986n726J37O235p300N934J564n539R195l538k80P461o768M355
954E300K832o458O816m203k972N943q249K110K004q673N898k036o076P467p186
969g483J734M791p119O870q34m311Q457n427P37P339p644N649J273n066Q351m747
985B570p71O183p920M070J589o632O326l914l940N756p483K127K149p809O262
1000a437k319l558P894n970J764N144p399O521Nm247Q439n023K40N689p735N453
1016C461J056o185P048l880j756O457q226L967J819p089P432l610l939N674o524
1031d295K531K711p397O473j996l657P262n829P30N098p153O990J6n074Q382o020
$$ plain form
923 4311 1894 9101 1825 4293 6558 -1267 4561 1640 -3458 3635 -3952 -3246 1427 -7532 -1478
938 -1478 -2018 -8416 -430 -6156 -6019 216 -7084 -1150 414 -5125 4070 532 252 7713 945 5300
954 5300 8132 1674 8490 4287 1315 7258 -991 1119 3123 -5550 348 -1688 -7764 -297 -7483
969 -7483 -5749 -958 -8077 -1207 -2041 -6352 2105 -3322 -2585 4754 -2890 2759 4032 -1034 7317 2570
985 2570 1799 7982 62 4132 5721 -911 5415 1501 -2439 3317 -4166 -2039 110 -7699 -1437
1000 -1437 -3756 -7314 580 -5390 -3626 1518 -5881 640 645 -3602 4837 -186 54 5743 -1992 3461
1016 3461 4517 -1668 5380 1500 -256 6201 -2025 1942 3761 -3328 4104 494 -3445 2229 -4295
1031 -4295 -1764 947 -6450 23 -1973 -5630 1632 -4197 -3467 1631 -5522 1468 1484 -3590 4792 -1228
1047a228J065M998o862N270J113n988P150m296j642O276p029L621J352p097P001
1062C704m033l387O788p898J769L337p500N973j703l638P201m846J246M357n556
1077d186N742N67m850P906l572M54M962o453L765J306o476P346m415k338N497
1092E255p463K009J982p385O540k921l330N412p154L296K974p068P080j295m011
1107f079Q534m868J605N609n859O124L2m406P156m649j181N876q023L757P84o915
1123b503O178m768j495M455p784L646J662p241P121l473k507P190n776K906L514
1138A125n721O191q37k590P420n284J663M448o185N724q75m959N818m273j298
1153C67M208p122L745k01n892N995m383k224O412o650L026K196n579O265j857
$$ plain form
1047 -1228 -163 4835 -2027 3243 4356 -1632 5518 1222 -420 5856 -1173 2448 3800 -3297 3704
1062 3704 -329 -3716 3072 -4826 -3057 280 -7220 -1247 -2950 -6588 613 -4233 -2987 1370 -4186
1077 -4186 1556 2123 -2727 5179 1607 2061 7023 570 4335 5641 -835 6511 2096 -242 5255
1092 5255 -2208 -199 1783 -5602 938 -1983 -5313 99 -7055 -3759 -785 -7853 -773 -2068 -6079
1107 -6079 2455 -2413 -808 4801 -1058 5066 5098 692 7848 3199 2018 7894 -129 3628 4412 -2503
1123 -2503 3675 -1093 -2588 1867 -5917 -2271 -609 -7850 -729 -4202 -6709 481 -5295 -2389 1125
1138 1125 -4596 1595 758 -1832 5588 304 1967 6415 230 5954 5079 120 5938 1665 367
1153 367 4575 -2547 1198 997 -4895 1100 -3283 -5507 905 -5745 -2719 -523 -6102 163 -1694
1168a694k833P970n884K293L453n772O465j319l204O390n178L19M773p008M786
1183C557j074m157N396n136p32N295p471L637J003n634O361l823k132O283o012
1198d639L411K133n379O105k016j933O240o156K795K699n396N178j002l794O185
1213D431m624R38L871o403M318l10m833O630m652o69L990n861K847Q57n165N775
1229A140l160j655N206o385L348K588n616O263k207j824O049n638K613L314n683
1244a647N313j087l310O336m973N87L417o578M134m0n003N969n446KL377o666
1260e615L740J104n202O029l913p32N779n588L325K682m653N499j092k482O508
1275E389m632J697K757m694L840o38l471M845m508JK131o188M138j375m410N277
$$ plain form
1168 -1694 -4527 3443 -2441 -148 3305 -2467 3998 2679 -525 5865 687 1006 5779 -1229 3557
1183 3557 2483 -1674 3722 -1414 -2146 3149 -4322 -685 318 -5316 1045 -2778 -4910 1373 -4639
1198 -4639 -1228 905 -4474 1631 -385 -2318 3922 -2234 561 3260 -2136 3042 2040 -1754 4431
1213 4431 -193 745 4616 -1787 2531 2221 -2612 4018 -634 -1303 2687 -3174 -327 530 -4635 1140
1229 1140 -2020 -3675 1531 -4854 -1506 1082 -4534 1729 -478 -2302 3747 -1891 722 4036 -1647
1244 -1647 3666 2579 -731 5605 632 1219 4636 -1942 2192 2152 -2851 3118 -2328 -2326 1051 -5615
1260 -5615 -1875 -771 -5973 56 -3857 -4589 1190 -4398 -1073 1609 -3044 2455 1363 -1119 5389
1275 5389 757 2454 5211 517 4357 3719 248 5093 585 586 2717 -3471 667 -708 -5118 159
1291A59m866M22M007n510L805J088m554O110k023r71N282m304K975K102m707N476
1307D491j267j806M881m918J160K458n751L984j785l742N031n106r3L534o220
1322e149L046L95l927N023k321p13M689n188L628J743m009N567k303j009N537
1337E009m929K288J746m453M752k530k526N093m945O73K266n271L998j985l414
1352d228N847m315Q7L159n207L933J9l767O000k959j019N120n260L841J185m142
1368a706M748k003j637M605m593K378J419m482M340j796k701M435m436Q07K730
1383B108n498M212j540k481N059m414K30L297m943L397O33l719N217k990p08M617
1399B477m510K798J737m409M863k152j494N064m537K032J355m526M494k190j589
$$ plain form
1291 159 -4707 -4285 -278 -5788 -1983 -895 -5449 661 -1362 -2333 2949 -1355 1620 3722 -985 4491
1307 4491 3224 1418 6299 1381 2541 4999 -752 3232 1447 -2295 2736 -2370 -2463 1071 -5149
1322 -5149 -2103 -1708 -5635 -612 -2933 -3646 1043 -4145 -517 1226 -2783 2784 481 -528 5009
1337 5009 80 2368 4114 -339 4413 1883 -643 4450 -495 178 2444 -2827 1171 -814 -4228
1352 -4228 1619 -2696 -2609 550 -4657 -724 -705 -4472 1528 -1431 -2450 2670 -2590 1251 2436 -1706
1368 -1706 3042 1039 -598 4007 -586 1792 3211 -1271 3069 1273 -1428 3007 -1429 -622 2108
1383 2108 -3390 822 -718 -3199 1860 -2554 -2324 973 -3970 -573 60 -3659 1558 -1432 -2140 2477
1399 2477 -2033 765 2502 -1907 2956 804 -690 4374 -163 1869 3224 -1302 3192 1002 -587
1414e87L803n109J085K599n448L967n98l823M717m134L24L780n133L906J07l007
1430c551M728k456J44M122m081L006J922m545M831j462j915M143m424J500J775
1445C737n193M378k865k297L484m500J124J676m326L384r05l115N486l666J290
1460b308K568m039M464p3k411M987k423L36M234m743K664O43l916M541k643j356
1476E25L285m943J287J467n355M121k336k449M408m121P04K817m306K835L87j659
1492c333N327k902m67M296l770K569J644k857M102k272j068L511m845J827J066
1507B828m733L804j643k921M792n035J496J590m777L610j038k359N322l760Q77
1522a947L082m109L520o7k089M702k929J85L596m632L268J78l282L571j907j260
$$ plain form
1414 -587 3216 -1893 -808 1791 -3657 310 -288 -4111 606 -3528 -3204 576 -4557 -651 -544 -3551
1430 -3551 1177 -1279 -1135 2987 -1094 1912 3834 -711 4120 2658 743 4886 462 1962 3737
1445 3737 -1456 2922 57 -2240 1244 -3256 -2132 -456 -4782 -1398 -2303 -5418 68 -3598 -2308
1460 -2308 260 -3779 685 612 -1799 3188 765 1101 5335 592 3256 3899 -17 4524 1881 525
1476 525 3810 -1133 154 1621 -3734 387 -1949 -4398 10 -4111 -3407 -590 -4896 -2061 -1674 -3333
1492 -3333 1994 -908 -1375 2921 -849 1720 3364 507 4609 2337 1269 4780 -65 1762 2828
1507 2828 -1905 1899 256 -2665 2127 -2908 -1412 178 -4599 -989 -2027 -4386 936 -2824 -1947
1522 -1947 1135 -2974 546 479 -1610 3092 163 348 3944 -688 2580 2758 -524 3047 1140 -120
1538a20K796m200K331K42l363L524k165j439L611l458Q88J769m000L472q67k175
1554c154M792l866R86L148m543L663k96k461M468k971J57L734m718L187N51l775
1570a098L661k064p99L486m168J316J064l912L833k297j139L472m171J007J968
1585A59l978L187q85j903M021k949J229K780l632L605j46k712M460k150n4K255
1601C287l653L071l78l079M280l456r66L585m793J951N70l837L737j874j558L161
1617D8m004J708J976l775L898m02k030M559k780O54L724m152L321K39k046L768
1633D706l642J64K964m694K526j20l468L046k343j345K532l939J798Q50l466L722
1649g09j573j479M364l899K542J693l326L749m87j334M126l022J012K111l282
$$ plain form
1538 -120 2676 -1524 807 1049 -2314 1210 -955 -2394 1217 -2241 -1353 416 -3584 -112 -979 -3154
1554 -3154 1638 -2228 -1242 1906 -2637 1026 730 -1731 2737 -234 -77 3657 -1061 2126 2677 -1098
1570 -1098 2563 499 -300 3186 -982 334 1398 -2514 1319 -978 -2117 1355 -2816 -1809 159
1585 159 -3819 -632 -1517 -3420 601 -2348 -1119 1661 -1971 1634 1488 -1224 3236 1086 1032 3287
1601 3287 -366 2705 2327 -752 3528 72 -894 2691 -2102 -151 419 -3418 319 -1555 -3113 48
1617 48 -3956 -2248 -272 -4047 -149 -551 -2581 1978 -802 -148 3576 -576 2745 2984 938 4706
1633 4706 1064 1228 4192 -502 2024 1904 -1564 1482 -861 -2206 326 -3613 -1815 -965 -4431 -709
1649 -709 -2282 -3761 603 -3296 -754 939 -2387 1362 875 -459 3667 645 1657 3768 486
1664D86K027J24k785L881l257m49J949l587J658Q5l335L027j823j115L277m042
1680c879J713J304k627M249j566p53L382l533K032J853k111K173j34k063L857
1695C897k750l9K766n063L518r19k804K940k761O24J707l609K487m51k641K801
1711b97j468l22K892l251J702J498k644L424j952o95L790l045J269J670l389L010
1727B192q96k381M035l246N92K049l921L223o55k334L060l053M7K318l389K150
1743b09L62k816L055j818n51L320l708K237Q62k372L118j080j753L644k528J128
1759H91J158k700K829r68j811L413k168j47K157m224K754p68j804K261k518k60
1775a905J991l310K409j31k169L526k285q13L715l186J724J742k806L534j522
$$ plain form
1664 486 2513 2637 -148 3733 476 27 1976 -1611 47 132 -3203 -176 -1999 -3114 163 -3879
1680 -3879 -2166 -862 -3489 760 -806 -1559 1823 -1710 322 2175 64 2237 2103 40 3897
1695 3897 1147 1108 3874 -1189 2329 1410 -1394 1546 -1215 -591 1116 -2493 -6 -457 -3098 -297
1711 -297 -1765 -2087 805 -2446 -744 754 -1890 1534 -418 -1113 2677 -368 901 2571 -818 2192
1727 2192 1296 -1085 2950 -296 296 2345 -1576 1647 992 -1342 1718 -1335 -1288 1030 -2359 -209
1743 -209 153 -2663 392 -1426 -1977 1343 -2365 -128 734 -1638 1480 400 -1353 2291 -237 891
1759 891 2049 -651 2178 1210 -601 2812 644 497 2654 -1570 1184 416 -1388 873 -1645 -1905
1775 -1905 86 -3224 -815 -946 -3115 411 -1874 -2687 1028 -2158 -434 1308 -1498 2036 514
1790E14p44L478k945J699J368l406K699n10k173L076l414M24J162l804K567r32
1806i41j866K273k152j36L020l459K019O82k603L551r70n90L401k727J680J272
1822B454k320L124j148j167K449k732J172J180l046J684j190k394L051l119N78
1837a424J492l259K076j19k463L573k372O42K683l602L480J36k636L973j061j121
1853bL020k916J376J275k266K652j724j567K571l376J796Mk660K170q98k301L438
1870E92k705M82J611k936K539l13j497L390k421M34K577l324L057k15k154K990
1886B107j333k06K013k730Q12J361l388L317k143j086L492l084N48J257l537K729
1902A29m83k415K942k138K18K237l103K866J09j983L072k271M26K516l448K423
$$ plain form
1790 514 -230 3248 303 2002 3370 -36 2663 2153 -20 3056 -358 66 1228 -2576 -9 -941
1806 -941 -2807 -534 -2686 -2822 198 -3261 -1242 -560 -3163 388 -582 -1172 2229 -498 1182 2454
1822 2454 134 3258 2110 943 3392 660 1832 3012 -34 1650 460 -1934 1117 -2002 -1424
1837 -1424 68 -3191 -1115 -1234 -3697 -124 -2496 -1854 829 -2773 707 843 -1793 2180 1119 -2
1853 -2 3018 102 1478 2753 487 3139 1415 -152 2419 -957 839 843 -1817 353 -545 -2846 592
1870 592 -2113 -1631 -20 -2956 -417 -730 -2227 1163 -1258 -824 1753 -1571 1486 1271 -883 2107
1886 2107 774 568 2581 -149 663 2024 -1364 1953 -190 -1276 2216 -868 -320 937 -2600 129
1902 129 -354 -2769 173 -1965 -1747 490 -2613 253 362 -1621 1451 -820 -394 2122 -1326 1097
1918A097J67k420K878j358j62K289l114J402R33l053L460j861j811K807k622J098
1934b70J039l112K692k53k648K286k193R85J601k989K853j56j184K969k193j2
1950e85K897k892K036R50k600L305k113r13K319k935J852N28l067K512j385j633
1966a724K628k903J230M62l173L116o66j563K456j831N37K190k993K737Qj721
1982a210L879j699n12K747k739K217J6k945K973j857o01J427k480O38Q44l193
1998b495K702j779j068K463k647J025J497k348K343m22j538L980k586N08L158
2013B793l683L166j80k243L454k455O1J764k882J078Q74l018K356j447j175K037
2029E00k798J407M33k577K263j077q65K921j941Q94J869k378J997K75j694K833
$$ plain form
1918 1097 1264 -1156 1722 364 202 2491 -623 779 1712 -1341 2119 258 -1553 1254 -1368 -270
1934 -270 769 -2343 349 96 -2552 -266 -2459 -1474 127 -2862 -9 -165 -1349 1620 -573 -585
1950 -585 2312 -580 1456 2406 -194 3111 998 85 2404 -531 1321 1849 -1218 1294 -91 -1724
1966 -1724 904 -1999 -769 -307 -3480 -364 -1030 -2593 -137 -1968 -1431 759 -2234 503 511 -1210
1982 -1210 2669 970 458 3205 466 2683 2699 -246 2727 870 269 1696 -784 -146 698 -2495
1998 -2495 207 -1572 -2640 -177 -2824 -1799 -302 -2650 -307 -729 -2267 1713 -873 -365 2793
2013 2793 -890 2276 2096 -147 3307 852 913 2677 -205 873 1747 -1271 1085 -362 -1537 500
2029 500 -2298 -891 -458 -3035 -772 -1849 -2714 207 -1734 -840 1029 -1349 648 923 -771 2062
2045B062j764M36J400k439K477j00k092K551k137r21K657l792K293K05k779K650
2061G07j519j655K913k193P32J328k876K483m46j024K999k752J095K123k613K436
2077A738r73j735L026j956O19J071k409K403q60j815K873j921k03J598k857J021
2093c80Q76k118K607j707m55J902k333J092J254k957K446q48q19K677k588J781
2109D30L69k167J820N67j846K838j739O02J426k826J467N42j867K328j761p56
2125e73J727k235R46N35k317K040q84j188J964k342R51J234k496L351j208q69
2141a364L478k547O13J845k386K373j30j766L415k703J66J196k304J271r7k655
2157a595K445j655q05J705k585J196O12k376L016j571p09K749j941R24J352k000
$$ plain form
2045 2062 298 734 2134 -305 2172 2072 -20 2531 394 -527 2130 -1662 631 836 -1943 707
2061 707 -812 -2467 446 -1747 -1015 313 -2563 -80 -526 -1550 1449 -1303 -208 1915 -698 1738
2077 1738 765 -970 2056 100 719 1790 -619 1784 924 -891 1982 61 -142 1456 -1401 -380
2093 -380 496 -1622 985 -722 -1177 725 -1608 -516 738 -2219 227 -621 -1440 1237 -1351 430
2109 430 799 -1368 452 1019 -827 2011 272 874 2300 -526 941 1483 -384 1944 183 -573
2125 -573 1154 -1081 -135 400 -1917 123 -761 -1949 15 -2327 -1376 -142 -2638 713 -495 -1364
2141 -1364 2114 -433 180 2025 -361 2012 1882 116 3531 828 994 2190 -114 1157 1060 -1595
2157 -1595 850 -805 -1610 95 -2490 -1294 -682 -3058 -42 -1613 -2322 427 -1514 -590 762 -1238
2173a238K606n75q64K489j833N71J604k571J792N1k643K520j648m16J938l341
2189a558J212K68k251K436k139l60K441k384J454P24k418K857r13o48L427k906
2205g58J158J708k439K141n13r61J954j671J61J544l254K514j278j901K480k009
2221a124J52J463k766J746P00k493K506j256l23J647k173J599R30j822K446q02
2237D30o84K306k231Q81P65k254K450j052o40J917k022O43J126k926J654o08j725
2254a970L041j977k03J581k787K195%j407J966j179p0J481k078K700m33j860K061
2271A061j085n88K822l022J208J246k238K244j49j927K313k293K75R82k489K336
2287F96p71j628K366j421r44K209k101J383q75n88K453j659j95J800j908J397
$$ plain form
2173 -1238 1368 793 -71 2418 585 1156 2760 189 1981 2032 -611 1909 261 -155 1783 -1558
2189 -1558 -346 -78 -2329 107 -2032 -2392 49 -2335 -881 -157 -2575 282 -631 -1279 2148 -758
2205 -758 400 2108 -331 1810 1297 336 2290 619 780 2324 -930 1584 306 -1595 885 -1124
2221 -1124 -972 491 -2275 -529 171 -2322 184 -1072 -1395 252 -1921 -322 608 -1214 1232 430
2237 430 -254 2052 -179 702 1467 -787 1663 611 -29 1888 -134 509 1635 -1291 363 -245 -1970
2254 -1970 1071 -906 -1109 472 -2315 -120 -120 -1527 439 -740 -810 671 -1407 1293 860 -1000 1061
2271 1061 -24 -612 2210 -812 396 1642 -596 1648 1499 -428 1885 -408 -133 849 -1640 696
2287 696 -75 -1703 663 -758 -1702 507 -1594 -211 -1086 -1674 779 -880 -1075 725 -1183 214
2303B14J338k294K445r80q83L018k693O46J055k115J822j015r72J628k033Q23
2319DN51k127J195k76j629K186j241r9J201k180J959O30j903K526j658L59J798
2336A296j834K149J83j813K445j152o72J498k191Q05J108k224J545j290p28J431
2352E56k012P95L39k238J900m48j337K399j865J053J358j975K335M42j621K094
2368A775j220l04K348k456J158P16k367J977j145m60J809k235J10J157k566J267
2384d36k53n85J601j977L44J130k012J836J28r36K056j454k8J591j541K040l11
2401A193j218J846j182p46J523j547J014L64k602K325j230n22J588j868K70P35
2417e7j814J559l20j337K486j605J59J351k038K231j64j948K428r71k47K346k778
$$ plain form
2303 214 1552 -742 1703 723 -160 2858 165 811 1866 -249 1573 558 -414 1214 -819 4
2319 4 555 -1572 -377 -653 -2282 -96 -1337 -1436 -235 -2415 -456 174 -1729 797 -861 -502 1296
2336 1296 -538 1611 1794 -19 2426 1274 602 2100 -91 714 1822 -402 1143 -147 -875 556
2352 556 -1456 -661 -322 -2560 -660 -1108 -2445 -46 -1911 -858 500 -1475 860 1302 -319 1775
2368 1775 555 251 2599 143 1301 2017 -350 1627 482 22 1831 -404 -294 863 -1703 -436
2384 -436 -689 -1274 327 -1650 -1306 -176 -2188 -352 -224 -1160 896 -558 -586 1005 -536 1504 1193
2401 1193 -25 1821 639 -107 1416 -131 883 1247 -1355 970 -260 -782 806 -1062 -792 -57
2417 -57 -1871 -312 -632 -1969 517 -1088 -929 422 -1616 615 451 -1497 931 -40 -287 2059 -719
2434g19J581j15o82J834j520m86J644j809P04M4j141J611j222n94J564j117L05
2451a18P78k198J878r92j124K844k423O64J178k004K227j144n56K181j615P43
2467C19J509j538M94M55j303K269k249j17K093k464Q33M52j978J880p56j129J042
2484a88j392P13P14j954J792m19j054J946j227R65R66k182K227l46q42K298j561
2501D56J97J193j949J856l52j387J389j558m3J444k129N65O94j945J444q81q98
2518a904K164k378R39J123j944J969j69j329K812j625N85J463j920J542j95r56
2534A77J436r75L05R30k135J211n86j433K129j692J92J392k826J312Q92k365J706
2551c30k74p72J830j239q6K023j946J706k06p51J599j265L64J270j834Q77L02
$$ plain form
2434 -719 862 747 65 1899 379 -107 1537 -272 432 476 -665 946 -276 -870 694 -423 -118
2451 -118 660 -1538 340 -652 -1776 1068 -1355 -691 487 -1517 710 -434 -990 1191 -424 319
2467 319 1828 290 784 1239 -64 2205 -44 -161 1932 -532 301 753 -1225 655 -101 -1230 -188
2484 -188 -1580 -867 -153 -2107 -315 -734 -1788 158 -1069 -104 862 -1320 907 561 -281 2017 456
2501 456 653 1846 -103 1753 1401 14 1403 -155 -198 1246 -883 -318 376 -1569 -125 -1006 -1904
2518 -1904 260 -2118 -1179 -56 -2000 -31 -200 -1529 1283 -342 243 1706 -214 1328 1133 177
2534 177 1613 638 943 1873 -262 949 363 -1070 1059 -633 -441 951 -1875 -563 329 -2036 -330
2551 -330 -604 -1376 454 -785 -871 1152 -794 912 706 -45 1554 289 653 1923 89 966 1268
2568A268j080J353j122n90J564k383R72k95r87K150j499r77J700j144K62J075
2584B67j902J808p79m88K274j668M03O52j325K002j23j575J913j120l52J312j758
2601d59J356q30l93J028r98k4J394j810P59k50j363K019j436l90J843j627J119
2618f2M73j632J263j93j051J987j487J226J92j202R85o5l79J636j740Q9J588k202
2636e74J537p99j038J533p64j50J053k054O57J121k186J720r72l48J208j421J589
2653A12K07j587J742r64k2J827j059N47N90j808J745l5j053J342n37j072J077
2670A052j531Q68m8j140J326j223m85J442k130J002N05j421J758j120j42J425
2686A38q50j45P01l67J825m90q47J704j241N88J51j277J420n92j076J201j064
$$ plain form
2568 1268 188 1541 419 -171 1393 -990 -18 -313 -1300 850 -649 -1626 74 -1070 -808 267
2584 267 -1635 173 -606 -1094 1180 -488 -85 567 -758 1244 1121 -454 1459 339 -13 1299 -459
2601 -459 897 67 -326 702 -296 -320 1074 -736 23 -227 -1590 429 -1007 -1397 446 -1181 -62
2618 -62 411 -1221 42 -151 -1202 785 -702 524 716 -486 499 434 55 1691 -49 40 1628 -574
2636 -574 963 164 -874 659 -105 -255 798 -1256 -599 522 -1664 56 -916 -1264 -56 -1477 112
2653 112 319 -1268 474 -490 -512 1315 256 803 1393 -415 1330 1295 242 1584 1047 -25 1052
2670 1052 -479 389 341 -799 527 -696 -1181 261 -1869 -867 -362 -1783 -25 -1145 -1287 138
2686 138 -712 -857 -156 -523 1302 812 -35 1669 428 1016 1167 -110 1310 718 -358 843 -221
2703b21m46J324k042J455q80o81J239j42m38P72j418Q79O66j551K028q66j08J482
2721A052j460O83R06j492J922j195m05J837j180k41P53j823J554p96q01O38j107
2738a155L3J169j602R10kq54J448j023L01J226p68K06K73q80J206p38K69J469
2756A488j746J153J5q88R35M7j182J638j600j77J313j913J085m86p25J489j270
2773h24k96J289k120J841O47j493J542j274k64J374o26P42q2r33K232j770k31
2790b46J228j311Q41J37j171J716k30j130J539k425J491L17j650J486j001p66
2806a175J518r94NP74j440J016K76r15P68m83j95J443j529J242K19j000J620j053
2824I7M0J054r83L06L24q28O26k19q56J115j044m82J365j692J347m18j358J652
$$ plain form
2703 -221 -667 657 -1385 70 -810 -1491 -252 -394 -832 -60 -1478 -599 67 -1484 544 -322 -430 1052
2721 1052 -408 275 1181 -311 1611 416 11 1848 668 427 1180 -643 911 115 -686 -48 -1155
2738 -1155 -1122 47 -1555 -645 -647 -1501 -53 -1076 -775 451 -317 -111 162 -718 488 -250 19 1488
2756 1488 -258 895 910 22 957 1004 -178 1460 -140 -317 996 -917 168 -318 -1043 446 -824
2773 -824 -1120 169 -1951 -110 537 -956 586 -688 -952 422 -204 538 456 -477 1755 -15 -246
2790 -246 982 -329 512 649 -522 1194 964 -166 1373 -1052 439 756 -894 592 -409 -1175
2806 -1175 343 -651 -646 128 -1312 -296 -20 -935 -167 -650 -845 598 -931 311 530 -470 1150 97
2824 97 137 1191 208 514 838 10 636 417 -439 676 -368 -850 515 -1177 170 -248 -1606 46
2842D6j405O43N31j015R90M47r69O74Q7m06J536j639J666K54j553J638r39o74
2860h8J921j804Q58l9j352J181p28j180J318r06M56M01k016J550j034L24Q06n50
2878h82K04J261r45J184k91p26J351j144L67Q76j242N20J97m03J202j464k11J026
2896H80j393O16L40r74Q15j328l21J383j181K28M40n65P04j05l83J776j085j67
2914c20J152q51Q21L36j097J187q95n52J212j497J193j44j280J340p89n62J184
2931D38j501J26Q78r93P19l76k27J573j375O14O87j930K299p83o22J190r43J34
2949i2Q58j185J268l57o87J781j191j62P17j354O26L89j116Q04p66O8Q99q39k86
2968f25P79j229J018o8o70J337j216O33N80j206Q48Q6m61N85o01L37O93j491J450
$$ plain form
2842 46 -1359 -716 -185 -1200 -210 237 -732 -58 29 -377 1159 -480 1186 1440 -113 1525 586 -88
2860 -88 1833 29 887 848 -504 677 -51 -1231 87 -819 -363 38 -1978 -428 -1462 -1138 -332 -882
2878 -882 -678 583 -362 822 531 -195 1156 12 379 1255 13 533 730 327 1529 65 -146 880
2896 880 -513 103 443 -531 284 -1044 -1365 18 -1163 -935 -495 -1060 -356 -461 -844 932 -153 -320
2914 -320 832 -19 802 1138 41 1228 333 -219 993 -504 689 545 -735 605 -184 -746 438
2931 438 -1063 -937 -59 -1052 -333 -709 -936 637 -738 -124 563 -1367 932 149 -473 717 -226 -92
2949 -92 766 -419 849 492 -195 1586 395 233 950 -404 222 611 -505 299 -467 -399 500 -339 -625
2968 -625 154 -1075 -57 -125 -795 542 -674 -41 539 -667 181 267 -194 391 -210 127 820 -671 779
2987G79k24o73J519j615L25K94n13P70j334J65R21q91m94J469r82J67K96j403
3005a424J487n07j32P92j213L96O05r45J956n00p50Q94l14j39J015j173R91m84
3023E55p57J329r40m81J110j771M66r8l21J148r60o64J117j374J528n9r78J030
3041a20K20r85J062J00J31Q31j925K225n43j003J484j422J43O58j169R00l21j043
3059g77J499j775J60R27j792J418k44k44J83k08K61Q40p85N78O71o17Q54j56l85
3078D08R46o90l29P13j562J256m2j323J615j376j1M93p10O46Kq83Q56n29j30J087
3098D37j647P46M14j388J412j39k85J385j450Q14O15r19M45j04p70J598j076K7
3116A15J259j825J241r10j06O62p77J68P87j779J021N23j540J511p31j29Q61j624
$$ plain form
2987 779 555 -118 1401 -214 111 405 -108 662 -672 -507 414 -477 -971 498 -484 -317 -21 -1424
3005 -1424 63 -444 -576 216 -997 -601 4 -941 1015 515 -235 659 345 206 1221 48 1039 555
3023 555 -202 1127 187 -294 816 -955 -489 -587 -908 240 -720 -1384 -267 -1641 -113 -172 -1150 -120
3041 -120 100 -885 177 277 408 1239 -686 1539 996 -7 1477 55 198 856 -313 587 266 -777
3059 -777 722 -1053 -893 34 -1758 -340 -584 -828 -645 -853 -592 248 -537 41 712 95 949 793 408
3078 408 1354 664 335 1048 -514 742 700 -623 992 -384 -395 98 -612 34 36 -847 9 -520 -650 437
3098 437 -1210 -464 -50 -1438 -26 -165 -450 935 -515 299 914 -5 440 336 -434 1164 88 115
3116 115 1374 -451 790 -120 -226 436 -341 -173 614 -1165 -144 379 -1161 350 -381 -510 351 -1273
3134a273J238K87p02Q13n03K9J187j081M39L22j375J451q12q81J911j245M90M95
3152G90j489J270n82n08J018q82j8J087j523J28N77m10Q30k51j157J159o91M14
3170b38J85o81J684p20q14J107q00Q0J299j219J007p63K7K34l49N78Q4j572J690
3189H19j137m85J059j96n12K55r42O50J95n61J192j198j63J044n15O39N72j025
3207c09J142n46m79J456j040J98M68q50N69j80r53J229n20m98J205j953J519o24
3225a66j229J683j011n78J521j017M08N02q28J243q89j0J405j195P43L39p85P24
3243H60m99M72P32j420J2K46n49P77r4j053J51q43R10K35r38M98l67j49M34J77
3263d08n9J078j224Q62O51j258J393j383J27J631j063m3M36j371J247j62n58O47
$$ plain form
3134 -1273 -35 252 -450 363 -140 -111 1076 -5 434 756 -619 832 20 -861 1050 -195 295 790
3152 790 -699 571 -11 -519 499 -383 -401 686 -837 -709 -132 -542 288 37 -1120 39 -652 -238
3170 -238 -53 -734 950 230 -584 523 -277 -197 1102 -117 890 127 154 388 39 617 701 -871 819
3189 819 -318 -803 256 60 -452 -197 -1139 -489 -294 -855 337 -861 -1024 20 -495 144 716 -309
3207 -309 833 287 -192 1264 224 422 890 40 609 429 -524 705 185 -313 892 -1061 458 -166
3225 -166 -1395 288 -723 -1301 220 -797 -389 113 -715 528 -361 -371 1034 -161 582 921 136 860
3243 860 361 833 1565 145 157 403 -146 631 537 -516 -365 -1208 -298 -63 -1001 -503 -870 -1019 -585 -408
3263 -408 -467 611 -613 249 900 -358 1035 -348 -221 1410 347 304 740 -631 616 454 -104 543
3281E43n62K57k1j017J021j21j013J305q99K66J79l14K7O17q56Q89l79J9P52j207
3301e14Q22k23n95J726q56N0N21j002O87J94j196P81m30l11O32j45l83M94o12
3320c60r0l4L1J252r06l14Q57j231O13J80q49J471j098M53M89n54k25O40j034
3339g09J446o84J22O61l67l50L6n19J524r84p93J210j135M33K49j128R36r64Q0
3358i36R06r96Q71J99j047J629n29l78P09j76J36L05p82J041K74j279Q84n09m
3377C18M74q99k96R87j183N05L25q44O82r41L99O17j205Q26p98l61J538o42J24
3396c74P37p51P10P15j368R40m07p54J458p59M63q7p60R39p45m94P65q68M18K31
3416Ij052J123o93l32Q83l21NM30n99M12K71o44J375j411P14N38o94P24p9p30
$$ plain form
3281 543 -19 238 217 -800 221 100 -913 392 -507 -241 -62 -376 -349 268 -588 301 -78 -59 693 -514
3301 -514 308 85 -510 1216 360 410 931 -71 616 810 -386 395 -35 -346 286 141 -242 252 -360
3320 -360 -450 -484 -453 799 -107 -421 436 -795 -182 -2 -851 620 -478 -25 464 -90 -315 325 -709
3339 -709 737 53 175 836 469 119 155 -364 1160 176 -617 593 -542 -109 140 -988 -52 -1016 -936
3358 -936 -30 -1026 -155 44 -1003 626 97 -281 428 252 388 693 -89 952 1226 -53 831 322 318
3377 318 792 -107 -403 584 -599 -94 231 -613 69 -872 -473 144 -1061 -235 -1033 -1394 144 -498 -374
3396 -374 363 -388 322 1037 -331 609 202 -552 906 147 610 523 -237 702 -43 -537 228 -640 -222 9
3416 9 -1043 80 -613 -945 -62 -383 -378 52 -547 -135 136 -508 867 -544 170 708 14 738 659 -71
3436g1R36n26k40Q73j297P95l01r03J516j071l96O63m64M28k48j030J164O6r28
3455a034J113o93O06J088j441N92L07m56R16o37j8M67n21j16j01m67J128q65K14
3474H2J84p07O7l72K53J237j260M9J240j069l49J03L31j69M56j163J544n49K21
3493A29K66j397J435o14PJ537j255o36J156q51J017k99n79N16l43k28P07p51K4
3512a59L90q22J174o21k59M16r17%Q63r52O27O82r63R27p34O34O05o15n46N59
3532B89j18J287j527p9R09r53J173k16o89O24m16m53J072r04k09K22j059J103
3550E6R9j088J106j086J042j27n11J084o69k12J181j141O96O48q90O27p55R4N51
3569G05q57o1P82m54k30J82o59N38l29l08J420j495K49L61o16L96k59O83K9l04
$$ plain form
3436 -71 865 339 99 972 -325 470 169 -734 782 -289 -685 -22 -486 -58 -306 -1336 -172 -106 -1034
3455 -1034 79 -614 -8 1080 -361 231 538 82 998 361 343 810 289 173 72 -395 733 -132 82
3474 82 266 -441 -374 -746 -493 744 -516 -467 773 -296 -645 -542 -211 -380 76 -1087 457 -92 129
3493 129 395 -1002 433 -181 -174 1363 108 -528 628 -223 794 495 -84 432 89 -139 568 -183 -159
3512 -159 231 -591 583 -38 -297 119 -798 -798 65 -887 -260 422 -541 386 -348 286 891 276 -270 289
3532 289 171 1458 -69 -148 761 -192 981 765 76 700 284 -169 903 -1 -210 12 -1047 56
3550 56 155 -933 173 -913 129 2 -509 575 -94 -306 875 -266 430 1078 188 815 60 154 705
3569 705 -152 -213 569 115 -115 67 -592 -54 -383 -691 729 -766 -517 -156 -772 -376 -635 48 77 -227
3589b27K08K39k95N21l09r9K66l49K68J47m35L77k2q53J258r53K01K42p70J87
3609c98K14k02K42l13j15K67k11M75q5l20M65k64k71J027n51N86K02q38R6R8k87
3630a83Q31l21k31K76j083M65J9m40P71o5n68M32n16P56M5p40O87o04L63R24j054
3651b36L39P5n37J90q6k27J191j175M19L38p18J245n24j198J289l51L27p6p54
3670d69O21K94r93Q8L88n72J056q24P08J37j050N87k09l81Q42m08Q4K24m57L63
3690B9j80K42J72p69J069j22l57J16k27k38Q39n72l63O12l01R8k0p68Q17r73K59
3711f37P96o40J56K12m35R19j70l66O90k63o7O29r16N08j41l9O53j019K92K37
3731C99k76K60l93o43J474r51j34Q97j415O26k70j13O16m53j9L57p60O63L64m77
$$ plain form
3589 -227 -19 220 -75 446 137 38 304 -45 223 370 -65 312 290 -563 695 -258 -57 185 -585 -398
3609 -398 -184 -386 -144 -457 -572 -305 -516 -41 -126 -446 19 -245 -516 511 -40 546 748 -90 6 104 -183
3630 -183 648 327 96 372 -711 -246 -227 -667 104 39 -529 -97 -613 143 188 -552 135 -469 -106 818 -236
3651 -236 103 178 -359 -169 -255 -482 709 -466 -47 291 -427 818 294 -904 385 34 361 285 -469
3670 -469 152 446 -547 -459 -71 -643 413 -411 297 434 -616 -29 -238 -619 223 -185 -101 123 -334 29
3690 29 -151 91 263 -506 563 441 84 200 -27 -265 574 2 -361 251 -50 48 28 -740 77 -896 -637
3711 -637 159 -481 -325 -113 -548 371 201 -165 525 262 195 824 -92 416 275 236 889 -130 162 399
3731 399 123 383 -10 -653 821 -130 -264 633 -782 -156 -426 -539 77 -376 -395 -38 -798 -135 229 -248
3751b48N1J65p3O88j167Q04O89r51M89K5l9jn65n8M69r72J108o22n06M46K97n23
3773d94J83o5P25k49j124J043mm19L93j56Q96n67l32O45Q0p41P50Q6k57L8o53
3794b22J292p06o90O64l86l79O25q52O91p92j50J094q37L78K70l53RP31n14L91
3814B64L7j37K31K98k95j22j64L1kn70P82n04K49j93j6Nm18M89K64m91j5K19k40
3837b98J28j15J35N75m96N7J72l26M38p04j58Q06l11l59O48m77Q34l32m02M05
3857B20k87j60N73o72Q75o1j254R17m38J28J24K27l92L35j087O93K78m77O07k33
3877h4k56O50k94m25M99L7K36k14k91K11kN20Q1m81O06o78P7K83l98J85n62m91
3899g91N07K85l28K98J07n96N92l50j97N56M8J30j52J31j99m67Q39n91M32L27
$$ plain form
3751 -248 -197 -32 -105 583 -584 220 909 -42 447 472 433 432 -133 -191 278 -694 414 -208 -714 -268 29 -494
3773 -494 -311 -376 349 100 -1024 19 15 -404 -11 -167 729 162 -170 475 555 -186 564 650 393 431 -222
3794 -222 1070 364 -326 338 -48 -427 198 -654 37 -755 -905 189 -648 -270 0 -353 -344 387 -127 264
3814 264 301 164 395 693 398 276 112 143 141 -429 353 -151 98 -95 -111 -106 -524 -35 229 -262 -277 -58 -298
3837 -298 -170 -285 -150 425 -71 -14 158 -168 270 -434 -592 214 -97 -456 192 -285 549 217 -185 220
3857 220 -67 -227 346 -326 549 488 -766 151 -287 -159 -35 192 -200 135 -952 -259 19 -458 149 -84
3877 -84 -340 310 16 -409 90 127 363 149 -142 69 67 587 668 187 793 115 192 475 77 262 -300 -791
3899 -791 -284 1 -327 -29 78 -518 74 -276 -473 83 131 261 109 240 41 -426 413 -178 254 581
3919E81j54k39P96j014M87L31r19M65m89k16O66m05k62K84k07K43n81J4Q52k76
3939d3K42j68o01M09k47P9N55m9M12j29q25Q09L69p20L68m21J12j86k4L49m25
3960a34J71k71p42N71K76J55j65M46m96P8m0n27J191l78j97N50j310J639q18L9
3980C8L38j45l61N90l01l2J85m28L2L05n88jJ65k10P12r42P40j35n77N31o4n54
4002g02Q71k63L51k86k40N00m36Q0M7J87k4M30n60K70k81KK08m77P42L5n93O18
4024D79l11k88L01m18M06L8p19Q57n54j34N64n30J40M32j170J312j37n28M67k05
4044BP9M85q9l25o9K68J51l80l74P73m86L9Q1k60K83J16k77J42k12L48k7n84N51
4067B35m88M31j67j59j02M24m84N00k81n6R8o7P10l59m71N53J33m30R6k67L89
$$ plain form
3919 581 427 188 984 -30 457 788 -131 334 -155 -371 295 -110 -372 -88 -295 -52 -633 -619 233 -43
3939 -43 199 31 -570 -161 -408 -329 226 177 589 460 -365 444 813 93 461 40 152 -34 -58 291 -134
3960 -134 37 -234 -976 -405 -129 26 -139 307 -189 -111 -151 -678 513 135 -62 488 -822 817 -1 38
3980 38 376 231 -130 460 159 127 312 -116 -84 221 -367 -368 -203 -413 299 -643 97 -38 -615 -84 -148 -702
4002 -702 169 -94 257 -29 -269 231 -205 -125 -78 109 85 515 -45 225 -56 -54 154 -323 419 454 -139 479
4024 479 168 -120 181 -237 169 207 -512 345 -209 -343 221 -309 -169 263 -907 405 268 -260 207 2
4044 2 81 566 477 152 83 351 502 122 -252 521 35 74 155 -105 178 294 17 159 -53 295 268 -316 235
4067 235 -253 178 11 -148 -250 174 -310 190 -91 -147 -49 -116 594 235 -236 317 450 20 116 -151 238
4088B38K72j185J48O01n50R06q15M77K14p33N6l18M26nk85M95J10l2q5J70K7M99
4110F31l5j184J030n75J91M16n35J24j6l86P13r06K5N16n19L25L8j90K77o73M97
4131b36L73o36L33O45m76o7j71M63L74r06j91J351q60O14m91j95O9N7o1K27N8
4152B74m98N6Q0Q49j664O64l82L36L22l88j89P72k59R6L13q91O62j57J31m95P0
4173b98L76K46n72L58k22l99N14m77O52k83k65O19o17R1K40R3m16N07n06K77L95
4194C13r26K57Q91q73N05O7r08R26l70Q3n0L97k41J35k08K22o1L84m2m96O10p51
4216a36QL36K8k39K79l87n7k23M29J03K94m40J90j041N46M55o49L54M37J96L2
4237E15m82O7J19l49M43M33n34L94q04K34O0n66O56j96r10P93J08l35l11M75k75
$$ plain form
4088 238 510 -675 -527 74 -476 430 -385 92 306 -427 -371 -689 -263 -268 -553 -58 52 20 -65 105 132 631
4110 631 596 -588 442 -133 58 474 -61 63 47 -339 374 -532 -507 9 -510 -185 -147 -337 -60 -733 -236
4131 -236 137 -499 -166 479 3 -64 -235 228 602 -304 -495 856 -4 610 119 -76 -7 50 -11 216 274
4152 274 -224 -168 -88 761 -903 -239 -621 -285 37 -351 -540 232 -27 69 382 -509 153 -4 127 -368 -298
4173 -298 78 324 -248 110 -112 -511 3 -474 178 -105 -370 249 -368 -277 -37 56 -360 147 -359 -82 313
4194 313 -613 -356 535 -338 167 234 -674 252 -118 -35 -85 312 71 206 -2 220 159 543 501 5 615 -136
4216 -136 -128 208 236 -3 276 -111 -168 -391 38 141 435 -5 185 -856 -310 145 -504 -150 287 483 515
4237 515 33 100 219 -130 313 746 212 606 -198 36 96 -470 186 -10 -920 -127 -19 -354 -665 -190 -465
4258d65M54j66J34K28o38Q87j170P40M9k25M07j68K66j95l81O0M88o57P14l84
4278b2j47L17L21j221O57L67l46l62J25N77n95M31K3o96K37M65m79P56j65k31
4298A2L7j80J42J52m45Q12k03k20M50j083N35J04l92M82n0m23P44q44N91n78k94
4319f51O36J06l44L89m50J53K17n28O58J61n41K93l92N8O12k81lj27L3L79m24
4340d6P42n15p86R54k11k57O81R9l85O5n94L5j05m7M64j36M2M2n81K77O76q11
4362c97O86J39n39J28m55K38M21j99j16j32l04Q07K61o38K92l90P82k64l06N82
4382E96o11n97P98j29j16N53q63N10K7n69L04k85L41M20n64P9l58P89M52n25j84
4403F8M85o30qM66q94M49j82J5J40P3j69J25m06R20l64k90R8j34j11q2J06N28
$$ plain form
4258 -465 -11 -177 -43 185 -453 434 -736 4 53 -172 235 67 333 138 -243 -183 305 -352 362 -22
4278 -22 -169 148 469 -752 -95 272 -74 -436 -311 266 -329 102 125 -571 -334 131 -348 408 243 12
4298 12 49 -131 11 163 -282 530 327 107 557 -526 9 113 -279 203 153 -270 474 -370 221 -357 -651
4319 -651 -15 91 -253 136 -314 -161 56 -472 186 347 -194 99 -293 -235 377 96 93 -34 -1 378 -46
4340 -46 696 181 -605 349 138 -119 562 661 276 341 -253 -218 -323 -370 94 -42 0 42 -539 -262 414 -397
4362 -397 289 428 -111 17 -438 -200 221 22 -94 -226 -530 277 538 -100 192 -198 584 320 14 596
4382 596 -15 -612 186 57 -59 494 -369 141 168 -401 -97 -382 -41 379 -185 -106 -464 325 777 252 68
4403 68 553 -77 -85 381 -513 -64 -246 -231 -91 -18 -187 -62 -468 452 88 -202 -104 -238 -349 -431 -325 203
4425B03j72m49M46k90j9N98n42K00K85j46J51J5j29j9k28r6R0L66O2p88j73N26
4447a09R8k01M91l69p0J17p83N60Q3J93k7j78r0M56j21j75n1j47P18j59l46J3
4469i7M35M45p45P50n24o14M04j1j09m5m23j88P81l31m9M15j016R55k04L3O63
4490E25q17j55N56k89j5P14k56j65k00K14N5l06K24L42q08L14M3m65N81l84M62
4511A70R2o50L65k76N19k62J95K80O8o96L53j41o25M99m00L85P5K75K94k39k84
4532cL06p71M26K14k91k65nK57K73m04K07k12k63K58K47k85J63K05o87N26R6O4
4554E6l69O28j79k12PM61n85K39J00p90M94O12n04J18K3k19N99q41O89j91o72
4575e36P48R2l60O10r58L94L98o67O24r50N12O3l74M78J21m63N47p5q3K50n87
$$ plain form
4425 203 31 -418 28 -262 -281 317 -225 -25 260 114 265 280 151 132 -96 -192 -102 264 326 -462 -635 -109
4447 -109 -11 -212 279 -90 -160 -43 -826 -266 -183 10 -17 -195 -285 171 50 -125 -176 -323 395 236 -110 -97
4469 -97 338 783 38 788 264 -350 54 43 -66 -111 -534 -722 59 -272 -321 94 -922 33 -171 -138 525
4490 525 -292 -447 109 -180 -195 519 263 98 -102 112 167 -139 85 427 -381 -67 -24 -489 92 -292 170
4511 170 262 -388 -23 -299 220 -42 153 433 501 -195 158 17 -608 -109 -509 -124 -49 226 520 281 -3
4532 -3 303 -468 -42 172 -119 -384 -389 -132 141 -263 -56 -268 -531 -273 -26 -311 -148 57 -630 -104 -8 56
4554 56 -313 315 136 -76 -69 392 -193 46 146 -644 -150 462 -42 76 99 -120 479 -362 327 136 -536
4575 -536 212 304 -56 554 -404 -10 388 -279 345 -605 -93 -30 -404 74 195 -268 279 204 121 371 -216
4596b16K82l48K80K80P7j68k91k7K44p65J79N20j49l56O50p13M76L48k7j8n23
4617b65J54K83Q3k64M4o02P79J66n01N5Q24r66N05o11O4m0L70k40l47J30O00o48
4639d27m95P88k52N75n55j86P78O3m27O39k50n7q4m34Q80Q4l63m79K47K81j55
4660A71j64K83k33j20O75r03Q4j56N11M54r90j46K77m41L77K82k7l48M38J86M37
4681F47m48k14P19j200J251l57p85R02n97J32L05J03p27Q33j418N38M95P7n05
4700b49L22p7L41o15J31K50m89O91r22O70N9k02J0l40K53M74k10l13K06m39K1
4721d28L43LL62m34N8K59mJ83k10j18N1K95n77K70k34L39l92K51r5j7p36J046
4743B15o43j32O64k02K25k75m74R81p75O88k80l47L21K40l13N42p97q4N35m37
$$ plain form
4596 -216 66 -282 -2 278 355 187 -104 -131 113 -652 -473 47 -102 -458 192 -521 -45 303 276 258 -265
4617 -265 -111 172 255 -9 35 -567 212 378 -123 -68 756 -210 295 -316 -252 -292 78 -162 -509 -379 221 -427
4639 -427 -922 -134 -386 189 -366 -552 226 289 -138 501 251 194 110 -324 556 640 277 -202 45 326 171
4660 171 7 290 57 -63 612 -291 -207 -363 148 602 -388 -534 -257 -698 -321 -39 -66 -414 24 210 647
4681 647 199 -15 704 -496 755 398 -387 515 -82 50 355 458 -269 564 -854 -316 179 256 -249
4700 -249 73 -4 337 -278 -147 103 -386 305 -617 53 112 -90 -80 -420 -167 307 97 -216 -10 -449 -428
4721 -428 -85 -82 280 -154 -96 163 159 342 132 14 65 360 -217 53 -181 158 -234 17 -78 -95 -831 215
4743 215 -428 -560 104 -98 127 -148 -622 359 -416 272 -8 -355 -34 206 -107 435 -362 -446 89 -348
4763c48L95L49o72M43m7r75R26j96K20r7q8N23p18Q5L20k19J80K7k05J034p67
4784A70o06J438j262P66m12K85o69M38qJ23k52K21J63l24k65L32j59j89M07o07
4804d10K32m78M21o75J264m84P5K04n78K62L53L35m64N89m00r2N27o34m5N35q25
4825b88R32q28j65N12k20q5J58j16m22N33j3k4j66N04n02k44R4O54k8k96k70L8
4847b42J32K76k19K12o59R30N4m88M37k77o70P11j65qP7r98P13L95j01j14O3o3
4869dMm33J70j2j29Q1Q0J97N47o72L51j9m57M37J55m89O59m10k22N57q89P60l95
4892a33J34j40%J047r97k23J8L47P3m20J22Lj02M30l82K68q24R53j59n39R71p27
4914b80J90K23O9K18l52J6K65n30K60k36m8L11kn38L87pJ82l90k41M23K19J70
$$ plain form
4763 -348 47 396 -276 167 120 -855 71 -125 95 -2 -90 433 -285 -200 120 -99 81 108 -97 937 170
4784 170 -436 1002 -260 506 94 379 -290 148 140 263 11 232 395 71 -194 138 -21 -210 197 -410
4804 -410 -178 -656 -235 -910 354 -130 -55 149 -429 -167 186 521 57 646 246 154 681 47 2 537 -288
4825 -288 644 -184 -349 163 -57 -142 16 -100 -522 11 -2 -26 -192 312 -190 -434 -340 314 286 -10 -280 -242
4847 -242 -110 166 -53 159 -500 430 484 -4 433 156 -514 197 32 24 101 -897 -184 211 110 -4 59 -4
4869 -4 0 -433 -263 -275 -404 -323 -243 -46 501 -171 180 161 -296 141 296 -193 466 56 -166 391 -498 262 -133
4892 -133 1 -139 -139 908 -89 -312 -294 53 126 -294 -172 -169 -271 159 -223 45 -779 174 15 -524 447 -280
4914 -280 -90 133 202 420 68 84 349 -181 79 -157 -205 106 104 -434 -47 -54 128 -262 -503 -80 139 309
4936C09O4p05M59l03L09o7%m69K05K98n24O19o1N50J48j063J71L09l34L25o52
4957d12O00q36o8L57K43oj49m61k09R60j22J57l80m94J145j63J10n9m47P07L82
4978H55n85K76j151O03j05P0R4J64R5k7p0l34J22j64P40l45m35o1K67K6k35K38
5000C8l38L75N08m51j40l46M94r1Q8J68N7r47P84r3L49m08l97N50K83n15O3n13
5022d82N56q5o91R03j40j02L07k59m78L07o6K28o48O17K25l59K50p0K45j45j99
5043h6j82R65q74K9k5j40O39m35m60K50K74j70N23n20N88k25kl59k65O97m83J35
5065a26J44k42m73J026m6M0k31k15N30k19o14L52k6j86O31n40L78n71M19M91o33
$$ plain form
4936 309 373 -332 127 -176 133 66 66 -403 -198 100 -424 195 134 684 832 -231 -60 249 -85 240 -412
4957 -412 188 -648 -716 -359 -116 -122 -271 -732 -941 19 -103 54 -326 -820 325 162 272 213 -234 473 855
4978 855 270 546 -605 -2 -107 -37 57 221 316 289 219 -115 7 -157 583 238 -197 -258 9 35 -200 38
5000 38 -300 75 583 132 -8 -354 140 49 137 305 362 -585 199 106 455 47 -350 200 483 -32 31 -482
5022 -482 74 -11 -702 201 61 -41 266 7 -471 -164 -230 -2 -650 -33 192 -167 83 13 258 113 -86
5043 -86 -268 697 -177 -148 -173 -313 326 -109 -569 -319 -45 -215 308 -212 376 151 149 -210 -475 222 -261 -126
5065 -126 18 -224 -697 329 283 323 92 -123 407 188 -426 -74 -100 -286 345 -195 183 -388 31 522 -111
$$ [...]
8191C15
##END NTUPLES=NMR FID
##END=
