##TITLE=1H_Ser Bzl-NEA
 200.13MHz,CDCl3 ,
 8 sc
 
 13.3.2025
##JCAMPDX= 6.0         $$ Bruker NMR JCAMP-DX V2.0
##DATA TYPE= NMR FID
##DATA CLASS= NTUPLES
##ORIGIN= UXNMR, Bruker Analytische Messtechnik GmbH
##OWNER= pz
$$ XWIN-NMR		Version 3.5
$$ Thu Mar 13 14:07:19 2025 Russian Standard Time (UT+4h)  she@DPX200
##.OBSERVE FREQUENCY= 200.1313
##.OBSERVE NUCLEUS= ^1H
##.DELAY= (6, 6)
##.ACQUISITION MODE= SIMULTANEOUS
##.ACQUISITION SCHEME= undefined
##.AVERAGES= 8
##.DIGITISER RES= 18
##SPECTROMETER/DATA SYSTEM= spect
##.PULSE SEQUENCE= zg30
##.SOLVENT NAME= CDCl3
##.SHIFT REFERENCE= (INTERNAL, CDCl3, 0, 14.3821)
##AUDIT TRAIL= $$ (NUMBER, WHEN, WHO, WHERE, WHAT)
$$ ##TITLE= Audit trail, XWIN-NMR		Version 3.5
$$ ##JCAMPDX= 5.01
$$ ##ORIGIN= Bruker BioSpin GmbH
$$ ##OWNER= she
$$ F:/spectra/data/she/nmr/H-C/1/audita.txt
$$ ##AUDIT TRAIL=  $$ (NUMBER, WHEN, WHO, WHERE, WHAT)
(   1,<2025-03-13 14:06:08.84 +0400>,<she>,<DPX200>,
      <created by zg, POWCHK disabled, PULCHK disabled
       configuration hash MD5:
       00 E9 B6 7A A2 85 ED C7 34 08 36 98 17 FE 4E 26
       data hash MD5: 16K
       6B 5F 2F A9 BE E3 81 11 A8 E8 1B 0D 7E 0F 5D EE>)
$$ ##END=
$$ 
$$ hash MD5
$$ AF 59 67 3A 36 A7 80 6F 70 05 41 E2 62 C9 64 1F
##$RELAX= 
##$RELAX= 
##$RELAX= 
##$RELAX= 
##$RELAX= 
##$RELAX= 
$$ Bruker specific parameters
$$ --------------------------
##$DU= <F:/spectra>
##$EXPNO= 1
##$NAME= <H-C>
##$PROCNO= 1
##$TYPE= <nmr>
##$USER= <she>
##$AMP= (0..31)
100 100 100 100 100 100 100 100 100 100 100 100 100 100 100 100 100 100 
100 100 100 100 100 100 100 100 100 100 100 100 100 100 
##$AQSEQ= 0
##$AQ_mod= 1
##$AUNM= <au_zg>
##$AUTOPOS= <>
##$BF1= 200.13
##$BF2= 200.13
##$BF3= 200.13
##$BF4= 200.13
##$BF5= 200.13
##$BF6= 200.13
##$BF7= 200.13
##$BF8= 200.13
##$BYTORDA= 1
##$CFDGTYP= 0
##$CFRGTYP= 5
##$CHEMSTR= <none>
##$CNST= (0..31)
1 1 145 1 1 1 1 1 1 1 1 1 1 1 1 1 1 1 1 1 1 1 1 1 1 1 1 1 1 1 1 1 
##$CPDPRG= <>
##$CPDPRG1= <>
##$CPDPRG2= <>
##$CPDPRG3= <>
##$CPDPRG4= <mlev>
##$CPDPRG5= <mlev>
##$CPDPRG6= <mlev>
##$CPDPRG7= <mlev>
##$CPDPRG8= <mlev>
##$CPDPRGB= <>
##$CPDPRGT= <>
##$D= (0..31)
0 0.7 0 0 0 0 0 0 0 0 0 0.03 0 0 0 0 0 0 0 0 0 0 0 0 0 0 0 0 0 0 0 0 
##$DATE= 1741860368
##$DBL= (0..7)
120 120 120 120 120 120 120 120 
##$DBP= (0..7)
150 150 150 150 150 150 150 150 
##$DBP07= 0
##$DBPNAM0= <>
##$DBPNAM1= <>
##$DBPNAM2= <>
##$DBPNAM3= <>
##$DBPNAM4= <>
##$DBPNAM5= <>
##$DBPNAM6= <>
##$DBPNAM7= <>
##$DBPOAL= (0..7)
0.5 0.5 0.5 0.5 0.5 0.5 0.5 0.5 
##$DBPOFFS= (0..7)
0 0 0 0 0 0 0 0 
##$DE= 6
##$DECBNUC= <off>
##$DECIM= 32
##$DECNUC= <off>
##$DECSTAT= 4
##$DIGMOD= 1
##$DIGTYP= 9
##$DL= (0..7)
0 120 120 120 120 120 120 120 
##$DP= (0..7)
150 150 150 150 150 150 150 150 
##$DP07= 0
##$DPNAME0= <>
##$DPNAME1= <>
##$DPNAME2= <>
##$DPNAME3= <>
##$DPNAME4= <>
##$DPNAME5= <>
##$DPNAME6= <>
##$DPNAME7= <>
##$DPOAL= (0..7)
0.5 0.5 0.5 0.5 0.5 0.5 0.5 0.5 
##$DPOFFS= (0..7)
0 0 0 0 0 0 0 0 
##$DQDMODE= 0
##$DR= 18
##$DS= 0
##$DSLIST= <SSSSSSSSSSSSSSS>
$$ [...]
##$SUBNAM0= <"">
##$SUBNAM1= <"">
##$SUBNAM2= <"">
##$SUBNAM3= <"">
##$SUBNAM4= <"">
##$SUBNAM5= <"">
##$SUBNAM6= <"">
##$SUBNAM7= <"">
##$SUBNAM8= <"">
##$SUBNAM9= <"">
##$SW= 18.0517328524113
##$SWIBOX= (0..15)
0 0 2 0 0 0 0 0 0 0 0 0 0 0 0 0 
##$SW_h= 3612.71676300578
##$TD= 16384
##$TD0= 1
##$TE= 0
##$TE2= 300
##$TE3= 300
##$TEG= 300
##$TL= (0..7)
0 120 120 120 120 120 120 120 
##$TP= (0..7)
150 150 150 150 150 150 150 150 
##$TP07= 0
##$TPNAME0= <>
##$TPNAME1= <>
##$TPNAME2= <>
##$TPNAME3= <>
##$TPNAME4= <>
##$TPNAME5= <>
##$TPNAME6= <>
##$TPNAME7= <>
##$TPOAL= (0..7)
0.5 0.5 0.5 0.5 0.5 0.5 0.5 0.5 
##$TPOFFS= (0..7)
0 0 0 0 0 0 0 0 
##$TUNHIN= 0
##$TUNHOUT= 0
##$TUNXOUT= 0
##$USERA1= <user>
##$USERA2= <user>
##$USERA3= <user>
##$USERA4= <user>
##$USERA5= <user>
##$V9= 5
##$VALIST= <valist>
##$VCLIST= <CCCCCCCCCCCCCCC>
##$VD= 0
##$VDLIST= <DDDDDDDDDDDDDDD>
##$VPLIST= <PPPPPPPPPPPPPPP>
##$VTLIST= <TTTTTTTTTTTTTTT>
##$WBST= 1024
##$WBSW= 4
##$XGAIN= (0..3)
0 0 0 0 
##$XL= 0
##$YL= 0
##$YMAX_a= 323238
##$YMIN_a= -405462
##$ZGOPTNS= <>
##$ZL1= 120
##$ZL2= 120
##$ZL3= 120
##$ZL4= 120
##$ABSF1= 10
##$ABSF2= 0
##$ABSG= 5
##$ABSL= 3
##$ALPHA= 0
##$AQORDER= 0
##$ASSFAC= 0
##$ASSFACI= 0
##$ASSFACX= 0
##$ASSWID= 0
##$AUNMP= <proc_1d>
##$AZFE= 0.1
##$AZFW= 0.1
##$BCFW= 1
##$BC_mod= 2
##$BYTORDP= 1
##$COROFFS= 0
##$CY= -3
##$DATMOD= 1
##$DC= 2
##$DFILT= <>
##$DTYPP= 0
##$F1P= 0
##$F2P= 0
##$FCOR= 0.5
##$FTSIZE= 0
##$FT_mod= 4
##$GAMMA= 1
##$GB= 0.15
##$INTBC= 1
##$INTSCL= 1
##$ISEN= 128
##$LB= 0.25
##$LEV0= 0
##$LPBIN= 0
##$MAXI= 10000
##$MC2= 0
##$MEAN= 0
##$ME_mod= 0
##$MI= 1.114404
##$NCOEF= 0
##$NC_proc= 0
##$NLEV= 6
##$NOISF1= 3.799351
##$NOISF2= 2.8
##$NSP= 1
##$NTH_PI= 0
##$NZP= 0
##$OFFSET= 14.38212
##$PC= 1
##$PHC0= -473.6141
##$PHC1= 16.79221
##$PH_mod= 1
##$PKNL= yes
##$PPARMOD= 0
##$PSCAL= 0
##$PSIGN= 0
##$REVERSE= no
##$SF= 200.129724274929
##$SI= 16384
##$SIGF1= 3
##$SIGF2= 2
##$SINO= 400
##$SIOLD= 16384
##$SREGLST= <1H.CDCl3>
##$SSB= 0
##$STSI= 0
##$STSR= 0
##$SW_p= 3205.1282051282
##$SYMM= 0
##$S_DEV= 0
##$TDeff= 0
##$TDoff= 0
##$TI= <>
##$TILT= no
##$TM1= 0
##$TM2= 0
##$TOPLEV= 0
##$USERP1= <user>
##$USERP2= <user>
##$USERP3= <user>
##$USERP4= <user>
##$USERP5= <user>
##$WDW= 1
##$XDIM= 8192
##$YMAX_p= 0
##$YMIN_p= 0
$$ End of Bruker specific parameters
$$ ---------------------------------
##NTUPLES= NMR FID
##VAR_NAME=  TIME,          FID/REAL,        FID/IMAG
##SYMBOL=    X,             R,               I
##VAR_TYPE=  INDEPENDENT,   DEPENDENT,       DEPENDENT
##VAR_FORM=  AFFN,          ASDF,            ASDF
##VAR_DIM=   8192,          8192,            8192
##UNITS=     SECONDS,       ARBITRARY UNITS, ARBITRARY UNITS
##FACTOR=    0.0002768,     1,               1
##FIRST=     0,             0,               0
##LAST=      2.2672688,     0,               0
##MIN=       0,             -405462,         0
##MAX=       2.2672688,     323238,          0
$$ Real data points
##PAGE= N=1
##DATA TABLE= (X++(R..R)), XYDATA
0 0 0 0 0 0 0 0 0 0 0 0 0 0 0 0 0 0 8 -8 8 -8 8 -8 16 -16 16 -23 24 -29 32 -37 44 -49 55 -62 70 -78 90 -102
38 -102 112 -125 139 -154 171 -190 209 -232 256 -283 311 -344 377 -417 459 -507 560 -621 690 -770
58 -770 864 -972 1106 -1269 1480 -1754 2138 -2709 3650 -5470 10326 -52971 -120350 10048
72 10048 143939 247154 323238 321628 184520 45364 -21344 -65813 -115649 -125781 -135080 -159119
84 -159119 -124087 -10372 83191 116352 98946 30287 -61523 -88304 -23868 62004 103060 96634
96 96634 41063 -45266 -93643 -74642 -49987 -52497 -58053 -62832 -66010 -25724 52762 87790 54263
109 54263 10300 -22794 -36025 25872 144224 208554 182515 108969 1649 -110841 -158560
120 -158560 -145497 -137486 -137913 -108013 -57688 3617 89292 153707 136591 63659 -7516 -55297
132 -55297 -59964 -13224 36864 36067 -8027 -53173 -76323 -64283 -11497 44633 60435 48331 37031
145 37031 31012 33278 42609 30357 -20186 -70530 -76056 -41906 10803 68642 89246 46372 -18195
158 -18195 -61891 -78861 -67932 -34440 -14070 -24032 -30583 -12330 14322 42607 67685 61507 24160
171 24160 1119 9383 25302 37323 33479 -4377 -60400 -88765 -71585 -28585 22607 63859
183 63859 67801 37819 11445 -2682 -17348 -28618 -34286 -44581 -49822 -25070 21294 55584 63462
196 63462 45771 2460 -42237 -52306 -32301 -8237 11824 20092 5264 -13674 -12318 1870
208 1870 12047 20429 28015 23891 20206 31682 36694 18647 -12441 -47717 -79031 -82607 -49889
221 -49889 -5274 29410 47750 46946 25537 5049 538 -3490 -13248 -17649 -16390 -12914 -1150 18393
235 18393 28392 20493 4765 -9696 -18063 -11984 8297 20037 14693 3295 -10939 -26395 -26652
248 -26652 -11428 2272 8655 16028 21232 18230 15150 12289 -3525 -24097 -33492 -34122 -26018 -4383
262 -4383 18646 24863 19089 12700 4913 -4466 -2561 6010 5156 -186 220 -1100 -5846 -4328 -2583
277 -2583 -7888 -10849 -4547 3750 9404 16818 19300 7419 -7547 -13432 -16964 -17001 -7644 3194 5702
292 5702 5416 8335 7296 2281 -147 -580 -6569 -7488 -848 3233 4348 8073 7480 -1399 -6057 -3924
308 -3924 -2235 -2176 2886 6544 1392 -2246 -1112 -4159 -6887 -3437 -1992 -3417 -744 5072 5184 2496
324 2496 4270 3988 -870 -1223 2733 1329 -1315 -89 -1845 -6765 -7243 -4337 -2818 -817 4125 6640
340 6640 4739 5252 5706 650 -3259 -2474 -3605 -5629 -2790 1422 1997 2069 4265 3768 684 893 1116
357 1116 -2541 -3836 -2734 -5462 -8280 -5865 -2881 -1807 2418 9074 11759 10904 12071 10188 2340
372 2340 -4371 -7229 -12872 -16114 -12949 -9192 -5731 366 6871 8968 9755 12186 10650 5017 2264
387 2264 -97 -4920 -8373 -7372 -7020 -6337 -2631 1545 3695 5011 6884 4940 351 -1846 -3744 -7034
403 -7034 -6691 -2419 -592 1405 5794 9018 8439 7372 6770 1766 -5219 -8624 -11460 -15128 -13316 -8265
419 -8265 -4690 1341 10723 16706 17553 17749 15790 6781 -3108 -9375 -14658 -19317 -17771 -12746 -9146 -2688
435 -2688 6343 11895 13008 14963 14183 7842 1684 -681 -5031 -10171 -10158 -8916 -9269 -5249 1334 5493
451 5493 6961 8817 8338 3121 -1819 -3825 -8039 -10977 -7922 -4327 -1236 5331 12701 14867 13353
466 13353 11500 7025 -1480 -8141 -11559 -15122 -17483 -14764 -10359 -6350 538 8410 12691 14218 15709
481 15709 14385 8152 2378 -1533 -6878 -11135 -9699 -6971 -5410 -886 3434 4184 2427 1077 -1691
496 -1691 -5533 -7194 -5877 -5118 -1227 5638 9587 11346 14192 14204 10122 5733 585 -6731 -14103 -19012
512 -19012 -21400 -21355 -16810 -9159 -2627 5868 15626 21629 24945 25894 21712 12711 2750 -6942 -14900 -19520
528 -19520 -20626 -18810 -16794 -12301 -4952 2513 9010 14425 15187 11904 6910 3812 1041 -1720 -1396
543 -1396 -781 -1870 -1106 2540 3446 774 -2913 -8676 -16121 -18091 -13512 -6175 1469 10628 16106 15468
559 15468 16338 17921 14491 9352 4181 -4872 -13840 -16790 -16393 -17066 -17008 -14869 -13526 -9599 2443 16416
575 16416 25965 30606 29268 18831 5561 -3681 -10553 -16704 -21082 -20985 -16715 -10228 1106 11466
589 11466 13892 8896 1744 -4641 -6091 -391 7832 11871 10277 6845 1971 -2248 -1313 478 -2715
604 -2715 -7272 -9896 -10572 -8713 -3898 -1346 -4221 -7946 -6936 -826 9963 23258 28975 23548 13086
619 13086 993 -9033 -13600 -13042 -14251 -17253 -18118 -13808 -5736 4803 13276 14838 9411 4530 3429
634 3429 5919 11495 12650 5421 -6160 -16085 -19185 -14105 -4700 3231 5009 2447 702 1253 2871
649 2871 4109 2204 -4100 -8423 -6108 3127 13325 19804 16788 3394 -11037 -16954 -15135 -8244
663 -8244 -181 3281 -117 -3708 -2586 1080 4658 5920 3678 -1617 -2774 3801 11013 13047 8351
678 8351 -3584 -18108 -23788 -16283 -3531 8163 14694 13472 5720 541 1082 1976 -435 -3989 -7791
693 -7791 -10166 -4777 6139 12939 11085 2512 -8246 -16127 -13216 -821 9272 12429 8896 668
707 668 -6760 -6740 -1746 1727 1376 -91 -1085 436 5640 10708 7707 -2825 -13486 -18381 -15020 -2409
723 -2409 12037 17705 13276 3586 -4526 -8491 -5728 341 2319 -269 -1764 -767 1622 5795 6111
738 6111 -1129 -10286 -14018 -9625 207 11922 18433 12825 447 -9002 -12484 -9156 -1189 4921 5208
753 5208 3106 1942 3061 4224 3539 -1203 -9610 -14455 -11092 -1598 9357 15474 12968 2167 -8330
768 -8330 -12045 -8148 -669 6157 8156 4915 1037 410 896 -29 -1719 -6278 -10001 -7900 837 9950
784 9950 13348 10379 1412 -9174 -13269 -9016 -459 6380 9001 6083 370 -2565 -2249 -915 -1724
799 -1724 -3523 -4897 -3830 1458 8717 11018 7504 -638 -9862 -13728 -9868 -1120 6494 9423 7473
814 7473 2622 -1609 -2949 -1052 -747 -1681 -2285 -2206 655 4703 7145 4589 -1957 -8645 -11271 -7719
830 -7719 498 7910 10510 7690 2415 -3517 -5943 -4107 -2017 -608 -341 1054 2999 4735 5440 3743
846 3743 -1716 -7428 -9694 -7083 -1255 5192 8053 6298 1902 -2573 -3930 -2426 624 2554 2320
861 2320 1133 503 -73 -279 -1277 -3431 -5369 -5548 -2140 3181 7979 9614 6277 652 -4688 -6942
877 -6942 -6273 -2693 240 1641 1937 1541 1684 1264 377 -898 -2529 -2645 -517 2489 5061 5619 2535
894 2535 -2083 -5806 -6765 -4560 -705 2664 4553 4178 1655 -330 -2136 -2940 -3688 -3382 -1376 2009
910 2009 5119 7113 7103 4351 -633 -5132 -7183 -6813 -4808 -1564 1138 1852 1432 1023 532 282 680
927 680 1394 1987 2788 3685 3684 1624 -739 -3386 -6070 -6812 -4432 -1781 1283 3243 3840 2949 966 80
945 80 -765 -1167 -498 512 964 2231 3230 2352 617 -1071 -2382 -3440 -3437 -2056 -626 -290 441 593 158
964 158 162 791 1723 2526 3250 3048 2242 630 -1096 -2221 -4354 -4691 -3335 -2280 -646 1665 2840 2864
982 2864 2730 1868 928 -93 -46 -255 -112 20 97 -867 -1356 -1013 -1282 -1145 50 638 696 940 976 396 -50
1003 -50 150 95 163 856 1177 1003 1391 416 -789 -1848 -2417 -2425 -2182 -1087 -141 1072 1478 1647 2004 1853
1023 1853 1622 1232 812 41 -479 -833 -1191 -1636 -1653 -1345 -1618 -1088 -109 295 655 1189 1360 749 951 782
1043 782 769 937 1183 1163 609 633 -174 -1741 -1959 -2068 -2831 -2755 -1689 -862 -209 1064 2384 2491 2724 3176
1063 3176 2714 1680 1168 365 -1534 -2687 -2846 -3313 -3638 -2584 -944 -265 230 1779 2214 1967 2171 2670
1081 2670 1858 827 434 98 -929 -1166 -1266 -1911 -2212 -1413 -834 -1071 -195 916 267 266 615 1262 1273 1405
1101 1405 2568 1701 627 -89 -1134 -1812 -2414 -1872 -1856 -1678 -363 988 1187 1791 2377 1912 1010 940 715
1120 715 279 -140 -356 -1550 -2393 -2782 -2095 -998 -78 788 1489 1719 2026 2303 1493 1037 -117 -798 -1457
1139 -1457 -1361 -579 18 -109 -450 -538 -987 -1092 -241 181 502 966 1275 1330 1084 1141 710 77 -771 -823 -1150
1160 -1150 -615 258 -80 -124 -975 -1154 -809 -12 667 1800 1610 1143 722 475 -164 -535 -829 -1038 -1299 -725
1180 -725 402 533 983 1129 458 -474 -572 -383 -253 -382 67 34 -990 -660 -305 39 244 391 593 248
1200 248 736 1124 889 650 -435 -900 -1257 -1409 -660 -318 -186 59 266 -248 -281 57 311 562 381 604
1220 604 472 680 1072 639 30 -163 -559 -1137 -1352 -922 -841 -904 -903 -225 37 783 1754 1572 1642 1233 497 111
1242 111 -200 -108 -824 -832 -1049 -927 -1062 -1086 -497 453 512 855 817 897 1041 816 824 -181 -1031 -1053 -930 -824 87
1265 87 547 789 255 -67 -656 -720 -175 -40 67 155 368 47 92 507 230 -176 -297 -584 -223 480 897
1286 897 1122 389 -246 -1152 -1300 -728 201 645 815 759 275 160 240 147 -195 -533 -807 -436 191 877 1158
1307 1158 709 -428 -1217 -1458 -870 273 753 1078 440 183 -115 -146 -89 279 -164 -323 -697 -13 472 905
1327 905 337 -932 -1842 -1802 -1365 114 1846 1847 1461 644 261 209 478 854 216 -606 -1262 -1196 -636 -711 -676
1348 -676 -1221 -1945 -1540 -195 1552 2961 3293 2297 996 -372 -754 -425 -12 -375 -908 -1331 -1818 -1082
1366 -1082 -582 -232 -602 -664 -641 663 2108 2917 2925 1066 -248 -1214 -1850 -410 326 640 443 -709 -1578
1385 -1578 -1529 -1094 -990 -1137 -878 -416 552 2507 3796 3806 2264 -86 -1898 -2332 -1578 -189 -8 -255
1403 -255 -900 -1654 -1605 -880 -323 199 495 1112 1795 2805 3178 2512 533 -1825 -3804 -4022 -2552 -650
1421 -650 1025 1782 1279 213 -6 214 214 169 -134 -451 332 1232 1628 1572 618 -1469 -2428 -2763 -1895 214
1441 214 1410 1412 652 -171 -511 -400 77 912 783 649 604 815 1109 21 -798 -2107 -3352 -2691 -1696 -116
1461 -116 1605 2736 1942 738 328 -26 185 583 325 8 -737 -765 -864 -788 -856 -1147 -1373 -887 354 1666
1481 1666 2353 1958 843 -782 -1948 -1944 -948 217 1393 1385 1193 805 656 109 -563 -1402 -1945 -1956 -1207 331
1501 331 1179 1372 337 -136 -490 -918 -159 1173 1512 1058 860 247 -990 -1100 -1467 -1566 -1408 -605 264
1520 264 1175 1536 1680 648 -695 -1140 -1426 -976 359 955 1766 1416 963 378 -60 -947 -975 -927 -1407 -1005
1540 -1005 -195 122 281 197 -101 179 712 1207 1754 1668 1447 252 -939 -1691 -2282 -2193 -1939 -700 -97 832
1560 832 1846 1806 1678 1144 787 63 -445 -563 -431 -593 -233 -714 -1076 -1343 -968 -407 158 987 1293 1911
1580 1911 1244 788 9 -526 -912 -587 -262 87 734 981 653 -117 -842 -1419 -2059 -1933 -1103 -93 529
1599 529 1508 2038 2004 1532 1096 681 276 10 -477 -908 -1088 -1334 -1881 -1483 -1591 -583 -310 657 1782 2417
1619 2417 2486 2155 1604 586 -690 -993 -1501 -1389 -1134 -727 -464 -47 -48 239 274 23 238 234 529 373 633
1640 633 658 159 193 -2 -162 168 489 290 -141 -522 -459 -1171 -820 -1053 -625 34 436 1116 1379 1320 1120
1661 1120 935 37 -399 -1065 -1105 -1075 -756 -165 -267 -255 365 587 1029 711 546 195 -250 -537 -770 -927 -853
1682 -853 -812 -617 153 276 963 1023 1107 674 337 144 -281 -669 -1112 -1094 -1260 -586 -231 489 883 1174 1131 694
1704 694 518 307 75 -529 -723 -818 -564 -170 -41 42 92 485 390 -101 144 47 -178 -142 -32 -155 231 292
1726 292 326 360 380 74 57 128 -89 -515 -896 -868 -919 -424 -97 360 897 1131 1535 1503 1389 307 -227 -1132
1748 -1132 -1802 -1793 -1468 -1344 -898 -331 28 475 1170 1431 1640 1572 840 769 -53 -424 -330 -1021 -1198 -1179 -1067 -800
1770 -800 -34 609 228 422 -351 -153 -94 184 478 746 596 681 574 663 756 169 -271 -708 -1451 -1151 -1169 -765
1792 -765 -579 -290 -88 -14 903 1540 2129 1917 1371 916 62 -995 -921 -1190 -1603 -1206 -1116 -381 460 819 1330
1813 1330 372 308 -131 -188 76 369 190 471 -206 -279 143 57 250 456 -241 -271 -460 -440 -143 -381 -236 -757
1835 -757 -807 -1 935 1327 2098 1683 863 308 -311 -934 -1154 -1377 -1691 -1253 -562 136 812 1236 1222 1047 503
1856 503 321 559 346 333 -84 -467 -1102 -1207 -857 -408 -195 174 468 513 492 634 531 0 -438 -448 -294
1877 -294 274 567 684 675 357 -170 -369 -561 -565 -491 -140 -707 -295 -135 562 863 1013 928 992 535 116 383
1899 383 90 -481 -1390 -1624 -1605 -1502 -496 42 983 906 1057 913 689 972 471 -37 -266 -560 -670 -730 -647
1920 -647 -350 -115 -388 -290 -56 178 409 469 439 227 267 -27 -150 -192 10 32 -190 176 215 97 -38 -622
1942 -622 -848 -862 -679 -171 -113 110 630 553 749 467 267 474 83 -185 -642 -591 -324 -684 -220 13 206
1963 206 127 316 526 332 519 422 7 -88 -212 -228 -411 -276 -69 -170 -197 51 51 132 267 565 441 392 84
1986 84 35 -83 -332 -315 -100 -153 -260 -120 -153 243 343 -211 -26 -356 -502 -156 -66 371 432 370 444 382 -177
2009 -177 -212 51 -163 -466 -271 -196 -193 94 -66 -251 -22 -114 247 426 483 505 111 65 30 26 7 -68 287 -414
2033 -414 -399 -569 -14 133 89 147 5 -8 -252 344 15 -254 143 -62 74 256 550 677 543 229 -346
2054 -346 -819 -773 -909 -1002 -439 -417 19 325 779 1165 932 710 513 180 149 146 28 5 -434 -323 -815 -979
2076 -979 -294 -856 -556 -18 285 413 671 860 664 175 -412 -298 -346 -160 16 -76 49 -94 -249 -497 -352
2097 -352 -495 -433 -238 -198 337 174 927 678 821 158 -52 -22 -517 -514 -755 -732 -982 -786 -846 -152 351 450 877
2120 877 1282 1140 931 326 57 -253 -471 -682 -690 -686 -180 -46 95 217 219 104 489 626 703 484 209 -68
2142 -68 -210 -804 -499 -709 -318 -81 15 81 22 296 211 -90 -605 -553 -333 220 305 599 1053 982 750 242 -70
2165 -70 -641 -1021 -758 -385 -163 -368 -84 121 21 183 432 520 412 519 299 379 48 123 -256 -521 -452 -653
2187 -653 -119 -239 506 736 249 205 140 -476 -462 -778 -717 -537 -74 199 229 617 462 507 657 164 176 -150
2209 -150 -225 -264 -456 -353 -395 -418 134 286 336 666 521 268 -126 -26 -593 -379 -437 -193 96 177 349 438 231
2232 231 -252 72 -522 -523 -487 -448 -345 -139 -10 99 32 326 603 183 634 554 370 -72 -188 -765 -689 -794
2254 -794 -689 -415 -6 359 533 818 697 476 178 81 -546 -388 -470 -178 110 172 362 182 326 99 -339
2275 -339 -269 46 -114 -108 -122 -53 -133 68 275 309 217 505 212 224 -111 -207 -304 -692 -490 -657 -374 10 123 556
2299 556 865 535 842 657 378 39 -653 -500 -717 -357 -455 -369 -42 -248 334 302 545 962 181 268 18
2320 18 -42 -23 -441 -137 -53 -330 79 -33 116 147 -64 -198 -455 -200 36 -49 22 109 241 174 143 522 208
2343 208 78 -257 -101 -428 -553 -613 -178 -85 9 -152 188 498 645 616 183 82 91 -47 -549 -278 -340 -178
2365 -178 -449 -159 257 82 93 274 98 -27 122 -135 -175 -63 -122 3 -85 187 148 313 178 94 -420 -245
2387 -245 -164 204 -9 -438 19 -312 98 91 378 181 284 115 -103 150 -275 -133 -102 -248 -319 -137 212 535
2409 535 219 117 338 208 -228 -240 -423 -326 -428 -660 -119 -67 333 357 226 -197 311 64 135 156 -32 -94
2431 -94 7 -411 -146 -265 -7 -23 -155 -60 -207 139 310 58 -12 -195 31 92 42 163 355 238 1 -125
2453 -125 -235 -293 -293 113 -80 -138 69 -72 -69 205 126 -210 -195 -106 190 106 278 184 165 -152 -374 -144 -208 -14
2477 -14 -51 13 -124 -147 -68 175 -127 -281 -180 -191 38 333 229 235 219 -312 -285 -484 -350 -35 263 259 142 255
2501 255 290 390 58 -215 -189 -196 -311 159 2 256 149 95 -308 -36 -71 246 212 64 -66 -216 -45 -104 96
2524 96 -179 -285 -200 232 149 180 211 57 87 -237 106 142 -13 283 121 -17 73 -276 -20 88 -246 -147 193
2547 193 142 67 -2 36 -62 -170 -392 -63 212 146 268 -17 -184 -439 -170 -53 -137 -63 398 68 83 417 304
2570 304 -180 -164 -222 -541 -470 -97 196 -110 19 186 145 75 -128 268 -83 57 145 -100 229 55 -277 -63
2592 -63 -226 -516 -382 -233 207 228 -98 146 172 -390 243 161 -37 328 16 129 246 206 0 -409 -138 -243
2614 -243 -260 -182 -304 34 111 242 312 22 459 382 295 300 241 -418 -125 -516 -338 -493 -433 -290 -16 177 76
2637 76 219 387 282 -96 -97 234 45 65 -78 -83 -230 -180 -181 -105 10 58 286 66 212 -135 -64 66 -99 -89
2661 -89 -125 -7 -118 152 129 325 -148 -334 -140 -132 -338 72 76 139 250 492 375 480 154 -47 -354 -423 25
2684 25 -352 -192 -250 -66 -2 -224 1 0 341 216 399 76 -15 -10 115 -101 -216 -161 -205 -86 -65 186 -25 -115
2708 -115 72 144 -239 -106 40 -67 47 -77 135 385 -33 83 138 -346 -206 -129 -189 -167 -463 -170 -77 88
2730 88 228 308 449 195 196 147 38 -123 -22 -409 -106 -132 -284 -67 -56 -56 -78 174 193 40 44 -197 -143 -13 -27
2755 -27 -210 -136 -192 361 165 87 115 154 166 -21 -386 -51 -157 -175 42 43 195 93 280 -104 -52 247 -74 -164
2779 -164 -24 -219 -156 -31 107 -113 190 327 342 441 -152 34 -49 -118 -231 -259 -209 -68 -168 -42 1 -35 340
2802 340 325 412 -129 -83 138 -9 -21 125 145 -247 62 -24 73 -38 119 -444 -171 65 -78 249 -208 -38
2824 -38 43 24 -8 210 313 216 31 -98 440 -35 -85 -217 -496 -158 -328 -92 76 155 45 101 10 -20 -169
2847 -169 181 140 -50 -36 -217 6 212 35 -36 -351 29 124 233 -245 -133 136 45 6 -118 114 217 183
2869 183 -6 97 -10 -1 -68 -123 -195 94 -324 -75 -136 21 59 20 31 -201 12 113 80 108 66 -127 42 97
2893 97 -92 -198 -215 193 270 -14 160 89 208 -320 -249 19 222 -103 169 239 243 155 64 79 77 70 -168 103 -74
2918 -74 105 -77 -115 357 375 257 -266 -214 133 -138 -10 -272 -132 -174 -192 35 71 -34 202 202 252 -7 -33 9
2942 9 -221 -5 2 -101 -364 -85 -215 38 46 -153 -76 142 -57 -18 268 17 208 -113 -17 -77 -83 118 -3 -105
2966 -105 177 -184 -55 46 100 92 -151 -45 112 -45 -13 164 -174 156 104 36 -173 -135 315 306 162 233 120
2989 120 16 -76 -183 -134 -43 -61 -28 107 -19 58 69 201 193 212 -134 -13 105 -32 -152 -174 246 23 -76 25
3013 25 187 -107 197 -146 58 164 -17 -92 -170 -66 -426 180 39 74 129 164 105 -115 -38 -11 -98 -114 12 -76
3037 -76 -148 20 -36 100 165 33 90 -250 -60 -58 77 -40 183 223 489 96 364 263 39 -53 -456 -107 138
3060 138 -68 -95 41 -14 -210 -47 -59 12 151 84 229 -31 197 -118 -204 -223 -84 -9 -168 -200 -15 -148 135
3083 135 241 87 -8 -1 196 237 27 -75 169 -155 -20 245 -104 -362 43 -27 -88 64 -265 -2 -49 255
3105 255 356 -78 238 161 -97 -7 -150 -116 -67 -161 -205 -165 -60 41 92 112 -100 373 7 -32 163 105 91 -47
3129 -47 -122 -418 -134 -154 68 166 -13 121 105 304 399 361 145 47 8 -227 239 92 -54 -65 -140 -236 -35 178
3153 178 -148 133 42 -53 -43 25 212 265 268 21 13 35 -260 133 -28 -53 5 83 -275 -267 -262 22 187 81 90 61 437
3180 437 237 261 89 -126 -353 -219 -197 71 29 -61 52 -125 28 -49 161 -27 186 8 -100 200 -92 -153
3202 -153 197 -143 -371 -45 -32 50 -283 -107 -182 -152 -251 7 -58 157 257 -62 91 112 192 -44 -194 -325 -342
3225 -342 -135 -217 -46 176 175 96 118 139 112 272 -276 -97 31 119 -254 -41 -52 -193 -30 -213 -18 -59 354
3248 354 66 -19 44 -14 -256 126 133 231 71 84 6 -136 50 -349 -355 -335 -1 -7 81 145 10 161 79 34 46 352
3274 352 266 209 -184 -152 -174 -285 -65 -100 -123 -84 212 52 266 -69 98 -192 -75 -297 -330 -22 29 -277 -151
3297 -151 173 -207 -109 -283 3 -15 -45 11 -54 -69 93 57 -167 36 -120 103 221 53 254 218 114 104 -55
3320 -55 42 27 24 0 222 -63 27 325 308 -189 -283 -306 -297 244 180 157 -105 55 -270 -62 -271 -104 -90 26 8
3345 8 -151 -130 300 174 148 77 60 -98 119 -45 73 33 17 42 -74 165 98 -191 11 144 71 4 88 124 15
3370 15 138 32 -37 -372 190 -49 -85 -382 -96 33 176 -90 318 -140 174 110 144 63 -117 188 51 26
3392 26 -208 134 -56 -51 -104 -12 -129 -3 -304 -27 33 148 -192 110 -25 -78 -222 -25 84 -77 196 -18
3414 -18 -215 -131 362 -190 -269 -123 169 -104 357 -21 -113 -37 -3 -82 -220 -181 -225 -53 -110 137 37 484 220
3437 220 103 50 199 7 37 186 -121 104 -207 0 178 66 78 -23 92 148 -71 32 -88 -95 41 320
3459 320 -403 -63 160 -135 116 -81 -11 -30 -49 -214 364 139 63 -136 -36 298 -65 162 -1 -39 186 -99
3481 -99 112 -12 127 -58 -243 158 54 34 136 -156 8 -183 -36 -234 -234 -180 83 168 158 91 90 -5 -25 -126
3505 -126 1 -261 -135 -208 146 177 17 96 187 107 181 -22 49 18 -123 -67 -256 -108 36 179 35 -92 119
3528 119 160 88 -30 223 -77 -165 -219 -238 -85 160 -308 -159 139 -133 -166 15 -11 -31 -39 33 -41 96 -31 206
3552 206 -126 -47 -24 17 -40 22 24 40 -28 -141 -2 -57 126 207 -6 346 257 145 -158 -117 65 -196 -255 153 -16
3577 -16 -47 -98 -336 28 -8 -54 -46 -8 164 -301 -75 26 314 -54 149 -100 74 16 -160 35 91 -56 -187
3600 -187 29 -1 126 79 257 266 215 199 211 120 -28 192 -22 -208 -493 -516 -189 -137 -131 155 -16 28 -59 145 -21
3625 -21 354 -6 -13 129 -68 -245 16 7 -173 -85 106 239 30 178 -39 29 -81 -100 -84 -295 216 -131 -52
3648 -52 16 -133 -68 -407 95 -279 -56 80 -98 -295 20 -145 9 180 -46 -118 181 37 -132 217 118 -74
3670 -74 -40 84 -164 -57 165 -38 230 285 150 -172 -46 -121 12 3 44 22 33 -3 -61 -92 -247 124 -110 -72
3694 -72 -44 171 84 -72 173 163 -91 132 -56 -121 -17 -23 -75 -122 218 -332 -11 131 20 -336 -102 19 318
3717 318 -75 118 283 -73 118 -82 -87 35 -8 -88 -7 -111 -75 -35 41 3 174 164 199 -26 413 165 49 -21
3741 -21 68 -176 -112 -165 39 83 -283 -76 -154 -138 -93 -114 -102 -329 122 122 -90 -241 211 -103 367 -161 -120 292
3765 292 26 -133 -94 -266 -1 61 42 -3 -20 28 97 230 -244 11 -9 -112 -393 -13 -236 -192 30 33 -142 -153
3789 -153 -50 29 -107 86 -192 337 -88 262 30 226 -191 312 12 97 47 -178 -281 -6 271 -92 248
3810 248 11 -81 -5 154 31 154 -46 45 -212 140 -2 23 154 -50 -320 -9 124 25 -55 -159 146 168
3832 168 199 -206 21 -3 -102 -212 114 -296 -68 22 -24 64 73 -97 -36 -54 -136 167 96 -110 -184 302 308 347 96
3857 96 198 115 117 -156 167 -72 -96 37 112 146 177 150 -85 -72 -101 0 52 20 -200 58 126 -11 121 -259 -83
3882 -83 155 122 -120 169 173 -61 230 -192 -213 -86 15 -140 259 -11 -32 144 208 96 24 -124 -19 136 -193
3905 -193 -43 74 -101 -69 -90 -136 212 377 -165 114 85 -62 -204 -188 81 123 -175 -147 55 -13 37 68 184
3928 184 -8 136 -202 29 44 -117 8 -17 -107 251 -128 124 -211 -298 -411 -80 -39 -11 317 -3 62 -80
3950 -80 -47 188 51 -65 64 -144 109 -241 32 -1 -30 53 17 183 41 -13 -36 -131 59 -96 -72 181 89 -10
3974 -10 237 5 -239 129 236 -248 -74 -214 -60 231 125 173 -266 -58 -193 -121 116 29 222 27 62 -97
3996 -97 24 -70 -221 -132 -199 220 2 -455 152 -262 -196 103 -237 -5 -59 -66 -79 65 -101 151 -163 64 84
4019 84 -156 84 -84 -98 -60 107 30 180 40 72 -7 147 311 142 77 96 158 -89 -55 -57 -127 -52 -115 -101 -82 213
4045 213 28 -194 27 -170 207 0 83 45 203 -270 -60 -250 -189 193 210 -4 337 -208 -14 296 -278
4066 -278 -138 186 162 86 164 109 -67 60 129 102 105 -18 26 -215 -237 -96 -16 -154 246 71 0 -92 108 -104
4090 -104 412 -94 5 -34 -230 -333 -57 -81 119 93 -71 182 129 276 300 -29 118 214 354 51 155 255
4112 255 1 -133 -210 -165 -152 -150 -191 19 -190 -238 -13 317 -84 98 -41 183 228 289 123 -124 134 -186 -20
4135 -20 38 -79 -41 -70 198 -64 -124 119 -24 -37 -33 172 58 370 77 -76 116 -87 -89 -109 -322 -113 -124 -40
4159 -40 -142 111 198 -30 30 189 37 53 428 -36 -39 95 -163 -266 -81 -75 -275 76 -58 261 257 -22 -114 98
4183 98 -84 -225 129 255 -436 -119 -176 62 -194 -22 -88 -196 30 -232 135 159 303 -144 51 75 47 4
4205 4 60 -49 71 -247 -89 -69 28 -107 404 59 135 19 -121 92 -291 -9 134 -52 -129 291 -28 150
4227 150 -8 97 -212 -199 -53 -29 77 190 42 -127 -77 -156 -155 6 41 -282 -161 -89 56 150 -151 -119 76
4250 76 -31 -154 260 256 -84 195 92 101 247 111 102 93 126 -72 -20 -23 -144 22 27 197 36 -235 -28 80 156
4275 156 -79 52 -90 47 148 -7 150 -174 -96 93 171 415 -76 -268 -23 379 -104 340 23 -103 -50
4296 -50 151 68 -103 -67 -100 -159 -130 107 243 -57 1 190 -107 -301 -4 13 -109 -56 -319 149 -156 186 46
4319 46 -10 277 -225 -6 223 77 -82 -143 110 -104 90 39 65 -126 -303 -159 -200 -87 -61 -232 -174 -145 128
4342 128 -98 111 -20 -109 39 -92 59 -130 23 -82 -302 -170 51 -127 18 -106 113 215 -83 198
4362 198 67 76 -21 -2 -176 -92 -82 92 -468 -35 -359 -6 -19 10 -123 201 -115 -59 -45 -326 -147 113 104 137
4386 137 0 144 93 -43 -22 -24 83 -103 -115 186 22 -39 -201 -30 306 -97 -35 -129 38 44 -367 31 -407
4409 -407 21 46 72 204 -60 -84 18 -214 -25 -66 -47 49 103 4 -12 168 -21 -3 2 209 33 291 -77 22
4433 22 116 -64 -134 -38 -55 -128 34 34 150 -42 178 -2 -42 -9 26 69 -257 191 344 -262 -64 -309 -186 -200
4457 -200 -273 -68 340 240 -72 -79 -72 -17 -152 -184 -1 76 330 72 194 213 -15 47 15 326 -48 112 -47 -24
4481 -24 69 -128 -47 225 55 356 109 51 -159 336 -11 25 252 18 114 -47 47 270 -77 48 -70 -190
4503 -190 1 -77 -40 -169 -121 -285 -61 316 -52 273 98 -156 24 129 -175 -67 -160 -8 21 47 160 320
4525 320 201 125 41 -48 -198 73 90 14 -41 -41 144 29 -37 -16 141 -5 -104 -273 67 162 -128 17 -83 -58
4549 -58 -149 -142 -11 -2 38 -113 -68 -181 -11 -5 63 -52 -39 49 4 126 7 237 162 -61 170 -61 125 -62 31
4574 31 -41 120 81 -59 124 -335 -129 -146 116 -19 -106 278 169 -410 371 -86 -29 -239 -5 122 -16 -151
4596 -151 31 -98 -180 -42 -2 -40 -66 -88 21 -75 98 -40 81 -346 -325 196 -74 162 -28 -1 -318 -169 270
4619 270 -195 160 32 -45 70 -122 9 -53 -156 -90 35 80 39 149 -175 285 -296 -315 76 -94 -247 18
4641 18 -72 -26 24 59 74 129 -94 -61 -26 106 -187 -137 -111 114 206 -165 -160 -127 -174 218 48 71 163 29 145 107
4667 107 -161 200 -226 36 -14 -58 -193 188 60 -43 -138 44 119 -178 -28 -1 113 -53 45 -39 68 194
4689 194 -200 -26 -184 -225 -197 42 26 -71 -34 -28 -103 -147 305 132 257 336 100 205 -135 -306 -136 7 103 -177
4713 -177 -55 -312 -25 -232 -145 97 -104 -305 61 -164 19 -205 54 -27 78 8 -136 217 -27 26 -271
4734 -271 -194 -3 -23 121 -172 60 -31 -22 -17 -105 -24 -118 -3 15 264 93 74 -220 159 -198 0 -125 -74 48
4758 48 166 -13 63 64 131 73 -113 -110 196 -75 -76 278 -347 72 -250 113 49 -29 -249 -153 110 -181 190 6
4782 6 -169 -139 14 76 -134 -15 -191 54 -193 59 115 227 64 -231 -212 -201 128 -115 45 27 10 -9 123
4805 123 102 -98 -21 236 -364 299 -12 -107 96 260 -112 -43 -96 17 -316 -66 -25 7 -117 -1 18 -66 -234
4828 -234 -78 57 -33 34 -121 55 111 262 -123 145 -54 -105 137 -143 -128 -176 -25 -215 129 -186 51 -16
4850 -16 176 -21 -155 -103 13 59 -8 -274 221 169 211 -5 -141 63 -3 137 -291 261 -89 1 289 -164 -217
4873 -217 -249 -57 -44 224 134 -76 -214 81 39 -115 -139 48 128 -107 63 281 64 -122 -46 283 65 46 77
4896 77 -97 -12 214 -54 -80 32 -138 -63 -334 -169 -14 -35 -273 -53 142 -227 -39 63 7 111 -160 94
4918 94 228 -52 -118 52 56 -80 -1 -81 213 -79 26 42 -113 -39 48 119 411 34 -130 -39 71 142 12 -79
4942 -79 -19 -103 -132 121 -85 -130 -110 43 115 -81 10 106 94 31 57 162 216 85 205 161 -11 -16 32 -92 14 -96
4968 -96 -342 183 -189 66 54 -75 54 206 -27 -53 -176 -67 251 277 -64 -197 -15 -48 294 23 -60 -173
4990 -173 96 -43 -29 19 134 -96 119 25 51 27 -183 -147 235 46 4 -46 150 112 -248 67 -266 -83 -23
5013 -23 -116 -218 -187 -100 252 27 115 -59 -53 41 -285 93 -201 -147 -20 36 -58 133 205 -358 162 -107 49 -273
5037 -273 47 28 146 160 -17 300 19 -100 -51 -61 177 68 -34 83 120 77 167 300 -177 106 -88 -45 47
5060 47 162 81 169 41 170 14 -93 -329 -149 -225 87 65 -231 61 79 -141 -142 42 -41 83 -304 -211 122
5083 122 153 114 -72 -83 45 -253 153 -97 -33 70 122 -46 -70 198 310 -58 -219 -185 -20 126 -78 96
5105 96 10 14 70 17 36 -172 42 86 -469 -141 168 -20 141 -51 139 185 -46 -97 -195 122 15 -81 195 -141
5129 -141 -166 -90 8 117 -191 26 -99 173 -72 276 393 354 -120 2 -68 153 18 -165 206 -248 129 111
5151 111 62 -29 279 315 -92 -47 107 -221 135 -116 278 -49 -90 212 46 136 -90 15 -77 66 7 215 1
5174 1 -165 -107 -122 354 381 28 -230 28 -56 -128 35 -180 -8 44 -196 -265 107 107 71 100 -28 62 79 -55 -19
5199 -19 -62 -137 92 -47 60 -116 309 139 6 88 -19 -78 136 88 -58 52 -267 -15 -93 38 249 96
5221 96 326 143 -173 -105 -89 -336 -13 -118 36 -192 94 39 -197 -35 51 143 42 274 -78 287 213 -22
5243 -22 -99 -211 -135 -69 83 -41 104 193 93 240 -285 40 -12 127 -157 147 -151 -4 249 88 12 47 4
5266 4 -119 -33 -138 14 -63 -185 -233 -28 31 162 -59 -152 101 69 16 78 48 -27 45 38 151 18 -123 155 124
5291 124 -4 -169 -104 -209 208 -102 -79 163 127 200 -160 -86 93 3 13 -6 -100 -235 154 -14 -171 -46 36
5314 36 3 -55 -51 -118 72 55 349 -90 -192 23 -460 -147 83 -169 94 69 144 -121 227 264 16 -26 -73 -87
5338 -87 394 51 83 14 -144 155 -43 101 -5 -175 103 96 -45 116 -49 310 -15 -202 -49 264 -36 -1
5360 -1 -92 170 -482 151 23 -162 21 -85 287 78 55 135 -71 -257 -78 -113 -48 -233 -17 83 236 -68
5382 -68 -163 7 2 101 -200 43 -6 -74 -272 -34 -31 -102 237 -150 85 -231 -27 -352 -313 88 -216 2 -41 -39 45
5407 45 75 108 109 75 -324 91 429 -57 222 153 -289 139 49 -151 289 -31 46 10 -68 -185 -349 20 48 220
5431 220 -42 162 -90 -5 -48 -132 -46 317 313 103 76 -135 96 -137 117 46 -63 -76 -197 33 -3 -47 272 -95
5455 -95 90 269 -114 5 -109 17 83 -345 47 -162 180 89 -206 -38 111 114 -25 -128 117 122 153 9 -16
5478 -16 21 78 -116 -192 -276 -74 26 120 104 137 96 -264 51 -98 32 -212 -245 -283 -127 74 131 23 67 118 -124
5503 -124 236 -79 101 62 190 -70 -233 -276 136 98 -23 -31 -37 -49 47 -103 -265 -274 -84 -33 37 -51 237 111 4
5528 4 -12 -204 210 -74 -392 51 -144 -158 141 -246 -115 -54 -37 50 62 -64 253 84 -180 38 -7 39 265
5551 265 51 -200 126 10 -108 86 285 46 -195 -207 -8 -63 108 368 3 -132 192 114 121 106 -101 -229
5573 -229 52 -201 95 142 -92 -55 -4 -221 -88 -11 0 59 -18 12 19 140 -9 -100 2 -102 13 -232 -270 25
5597 25 -133 -71 -2 -21 -53 -36 12 -77 -101 124 2 145 -70 -263 -200 23 -88 -127 -5 -206 -241 -7 -20 214
5621 214 91 60 -54 120 158 254 290 6 -58 -67 -105 -223 190 38 1 -184 -86 26 81 -45 -43 50 -161 -76 131
5646 131 -22 361 -35 -43 87 -37 -173 53 4 -209 -11 35 -124 54 -86 -73 260 -191 -40 170 245 -142
5668 -142 45 180 -214 -251 -73 34 166 -52 -24 -173 15 315 -7 77 -262 4 -151 6 -137 -106 -94 -175
5690 -175 -35 90 -52 -139 119 36 -20 -155 -142 116 163 66 -67 -334 69 21 -32 -4 -42 -23 32 -90 -319 117
5714 117 119 97 -139 -107 -184 209 193 44 -182 -22 -134 47 118 -64 -237 -154 52 87 -40 153 27 -123 26
5737 26 122 27 39 -91 -149 48 -14 77 -280 67 -111 138 -53 -69 172 -14 123 227 -319 -221 -33 -77 145
5760 145 -110 205 -197 136 143 3 318 -13 197 -297 -13 143 -41 -28 -53 -4 -63 245 198 82 -78 78
5782 78 -29 227 182 -275 90 145 -35 117 7 -100 1 85 -269 -180 -10 -13 15 -77 -163 -49 -2 166 40 -138
5806 -138 -107 52 -217 87 -197 -25 126 77 96 131 -16 113 282 -169 -158 112 33 -105 -108 -16 141 -66 199
5829 199 89 -8 24 65 -32 -272 -54 -144 4 -88 180 360 137 -41 63 72 -14 161 -5 64 28 -198 -151 191
5853 191 111 -78 148 -66 -64 32 -2 -111 5 -87 -113 -1 -73 -15 76 -115 -9 -26 -176 189 -206 3 145 -111
5877 -111 183 3 -253 -86 207 -37 229 -93 74 98 -113 -38 177 -123 149 -274 4 -49 79 -33 34
5898 34 0 -129 -105 -58 358 -11 -12 -311 -47 -28 -59 -162 -52 -245 -154 -102 -168 -182 -39 -57 -45 154 -103 -41 39
5923 39 -13 117 -14 -42 -124 -212 87 16 168 205 148 276 169 36 -199 -264 82 -38 30 -52 102 278 21 138
5947 138 -12 3 72 147 -33 -136 -83 176 108 130 24 70 105 114 -80 88 112 -139 -27 -37 -35 -86 183 186 117 -8
5973 -8 -2 -24 25 44 -432 -210 -116 -10 -51 299 -314 36 -261 -253 -116 -34 168 189 5 11 -266 -258 43 -289 -100 28
5999 28 53 52 -33 76 187 257 -303 -261 138 120 254 -70 -196 -105 106 14 -5 76 -205 -142 -223 117 -147 11 60
6024 60 -111 63 81 173 79 -44 -55 -91 269 -55 25 58 -82 52 -283 -75 -144 225 9 112 -25 -37 119
6047 119 207 243 -145 106 -157 15 70 -222 315 161 215 42 -212 107 297 187 -123 58 -131 90 -97
6068 -97 1 -109 -39 184 -67 -223 -63 59 -325 62 27 -96 -78 199 267 40 83 26 145 214 133 36 80 -8
6092 -8 -118 176 178 -51 -6 -101 17 -130 -75 226 47 -115 -108 -20 176 32 -148 141 77 -137 41 206 173 -83
6116 -83 220 -139 -60 100 -138 -84 -7 36 125 -6 -193 76 258 41 43 -181 -56 1 319 -3 -331 -113 -93
6139 -93 210 -37 2 -51 35 141 -68 -146 -97 61 -204 178 21 -143 -229 -131 -141 -216 -74 -110 -134 -87 -160 -275 -10
6164 -10 97 -36 193 107 -222 -59 -124 -194 201 -110 77 -246 -286 84 70 -165 -65 -47 -21 72 -150 -169 62
6187 62 27 -234 281 -147 -26 -47 177 -20 -59 -80 -45 117 174 -348 -93 222 -13 42 197 61 159 -39 284
6210 284 221 -46 111 118 -1 172 97 -196 176 -314 46 45 184 124 184 96 -167 -180 -129 220 -37 -110 -73 -117 -28
6235 -28 -174 20 -169 -135 -70 230 138 15 -250 -48 13 -47 -23 -100 -73 -117 -248 -59 46 -191 -214 -7 -90 -193
6259 -193 93 25 25 88 110 193 -19 206 -227 21 -53 -84 88 -37 -6 91 -54 105 -149 79 168 -154 -391 -124
6283 -124 -15 116 -60 93 77 -243 -213 129 -64 -25 38 208 8 -2 -296 -244 144 -47 159 54 -168 -140
6305 -140 -119 -53 26 -82 20 26 -77 -68 -47 -25 -38 -324 20 39 -59 -204 81 318 95 -38 39 -55 175 73 -113
6330 -113 -240 -70 36 77 58 54 49 -178 -156 35 65 -175 31 30 -186 32 -33 -131 -88 -321 141 -3 -229 -80
6354 -80 -170 -261 -15 -26 121 -14 384 -17 -265 -187 150 -63 152 -196 -66 -56 -144 25 -306 205 97 59 17
6377 17 340 -219 -93 -129 20 93 -63 1 366 -60 19 108 0 26 175 -49 35 62 -315 142 -131 124 -86
6400 -86 -167 93 -35 -56 -115 -140 -35 91 48 -32 61 53 -19 82 -137 -16 60 -40 319 219 121 158 464 16 49
6425 49 -210 249 229 62 121 -70 104 20 -120 -88 -201 -136 -146 -34 89 53 -36 -8 207 -50 -95 61 25 -263
6449 -263 38 -42 -87 2 87 -78 157 -79 224 89 206 100 183 -157 14 -187 -155 196 -138 17 -79 4 123
6472 123 -177 -52 100 -302 74 26 -212 -24 -143 156 43 68 141 183 -70 200 -271 -3 18 -157 -46 -170
6494 -170 25 -119 74 128 -51 -65 51 207 -59 -309 451 110 -291 164 144 33 103 164 -89 289 -158 141
6516 141 139 4 363 -325 -23 -108 -49 -205 191 -41 -202 2 51 54 311 212 41 180 116 -182 -65 -104 4
6539 4 -80 -111 32 -30 -180 -113 -104 -36 104 86 46 -132 -150 -18 -197 24 72 200 -6 111 74 -101 -349 243 175
6564 175 -36 49 -83 -251 -37 -280 -191 -114 -162 -65 -168 46 170 -22 -34 74 143 -187 163 -89 164 97 51
6587 51 -34 40 -174 -11 -71 174 13 -31 225 140 -239 -23 -71 -257 -32 -207 273 136 298 -220 197 -110
6609 -110 -155 -170 -87 -81 76 -55 24 -34 53 -218 151 -124 -79 -36 37 -76 157 -41 216 -88 -25 145 -230 -258
6633 -258 133 24 55 124 173 -82 -182 244 103 -216 79 -22 -6 2 -43 -20 75 -126 76 -93 -8 -33 127 17
6657 17 181 -178 130 -233 7 331 -27 173 131 -85 -88 -69 -76 151 -79 132 -64 199 -32 -169 -147 22 13
6680 13 41 -99 -21 63 -225 217 -163 -43 -138 55 -13 -90 -81 176 -225 -457 125 -161 165 -25 -183 37 58
6703 58 -53 -120 274 -74 67 310 -84 -24 -8 344 15 57 219 -20 -269 53 16 -150 28 -66 151 338
6725 338 -9 -28 -199 -89 182 -170 96 -75 146 54 -180 -185 86 -112 -196 161 88 280 49 13 165 171 75
6748 75 339 -201 72 325 9 -169 61 78 167 -64 -252 78 95 -57 -85 -39 -179 -236 -90 42 2 185 -32
6771 -32 311 -25 409 299 83 -121 -121 -44 41 -210 56 -42 -120 19 68 -158 182 -168 -197 98 -335 -195 100
6794 100 31 -137 27 -107 213 -24 -16 -111 -24 -339 34 17 -135 151 -78 256 -224 -6 180 37 -61 25 -247
6817 -247 157 224 -128 -102 -55 -205 43 -11 116 -136 -241 133 -107 119 8 270 -223 -169 115 162 94 264
6839 264 -97 -114 -2 22 13 -39 50 -163 -21 -4 129 -23 96 -112 83 -86 -80 -4 35 -102 84 23 62 -264
6863 -264 -69 254 -40 -176 118 45 13 175 -179 213 -5 126 -97 -150 -10 -38 9 -148 299 108 131 -182
6885 -182 212 -129 10 269 -138 -10 137 142 -48 203 -138 86 -20 -41 141 -20 111 18 176 128 119 -162
6907 -162 7 204 101 -149 -261 98 -144 -210 -139 -233 -47 -2 -46 -37 -105 -40 251 22 50 -122 231 173 79 32
6931 32 42 -270 -111 -84 -91 -48 -20 31 83 69 -77 121 -5 -1 269 330 42 217 -281 148 308 49 -200 -44
6955 -44 -75 -259 -25 117 -98 21 -65 158 72 -28 -112 -276 39 43 63 60 -16 132 152 -19 -75 30 -175 110
6979 110 -37 188 450 184 -132 -62 -15 -38 -70 -128 -21 -29 -248 -89 210 -63 -55 187 -48 -111 -77 -59 11 370
7003 370 -42 -61 253 26 380 1 179 -210 -118 224 24 -86 -43 139 -70 -288 -57 -87 50 -74 196
7024 196 56 52 19 -71 191 72 134 -82 -2 274 3 -5 70 205 -161 -135 269 -63 312 -146 31 47 62 -19
7048 -19 -37 107 -206 -41 -74 90 247 -60 508 173 -143 21 238 -92 90 113 105 -80 -196 -63 173 -68
7070 -68 8 -117 62 -99 109 110 200 109 36 79 -86 -87 -128 -74 -20 -4 -29 11 -277 -347 -93 -207 -69 351 -52 -3
7096 -3 176 102 57 25 -180 -227 -53 87 -175 -170 205 -40 -190 -69 224 207 -68 39 47 -6 -183 265 255 16
7120 16 -129 -70 163 -21 38 -50 203 91 96 -14 -16 161 96 198 323 70 -87 25 -327 -179 -168 -32 -153
7143 -153 144 -107 54 138 57 -49 -97 -40 88 114 33 -119 -25 13 -128 132 121 93 87 -8 54 163 -79 45 -198
7168 -198 -83 -168 71 105 103 -10 -72 -18 50 -70 23 173 37 -116 -152 -81 -253 192 169 54 -221 77 -5 -17
7192 -17 -25 -58 -266 7 -87 -120 -31 89 156 9 203 82 255 -234 -21 -59 -134 191 -183 -1 58 90 97 -140 -112
7217 -112 -16 94 84 -49 -138 182 -105 -129 66 -152 -52 96 108 232 -179 -130 -130 26 -4 85 118 -22 -147 12
7241 12 34 -254 -393 -244 -95 243 -36 6 -37 -325 44 -81 -106 77 -87 246 -332 -4 -9 -89 -190 -46 145
7264 145 -37 -163 -117 14 4 -163 14 -75 271 -168 127 98 -54 87 91 245 -33 -240 83 -42 74 22
7286 22 -79 76 -247 231 -101 2 119 -84 -42 -37 -55 196 90 -199 -35 -198 -108 -115 -24 36 -24 -163 16 139
7310 139 -321 -152 177 39 98 265 380 -25 99 105 145 -107 44 -125 -172 71 -49 -240 -286 -45 -172 70
7332 70 3 -200 79 -345 94 193 65 -3 -66 207 55 138 267 -68 -271 134 -7 -79 -105 113 28 -339 -99
7355 -99 42 120 -209 14 -75 -34 60 215 -104 146 -57 -77 267 109 -151 -33 -162 -156 -95 -187 249 11 38 12
7379 12 237 -100 -3 84 60 182 101 -109 30 -46 -46 -210 192 -90 -142 27 307 -12 96 -154 -74 -81 143 118
7403 118 81 7 25 55 -183 -4 68 -57 14 352 54 -262 -259 -53 -4 -49 -114 106 -29 -141 111 -134 -36 -76
7427 -76 151 163 -56 -23 95 -93 378 23 143 108 -2 124 29 339 283 -42 81 -51 12 8 116 -26 35
7450 35 -118 -28 12 326 -50 -107 -208 254 233 -14 5 172 62 -24 75 -174 -444 30 -123 -74 82 16 19 11 -164
7475 -164 -24 143 -174 100 -89 16 -288 -74 1 156 -59 97 47 -15 93 -163 -65 85 -35 -142 -17
7496 -17 -105 3 55 189 260 165 -58 278 -198 -57 -6 154 -31 67 -19 7 -294 -22 -244 231 -93 -111 140
7519 140 -108 108 -75 251 -82 248 -53 -86 115 336 -40 -75 -185 -26 164 110 -352 72 22 64 118 -141
7541 -141 -40 136 7 147 116 40 -220 77 13 -169 119 35 -60 -87 108 18 10 -59 -71 -130 14 -163 253 110
7565 110 -166 -120 -97 225 127 -52 -49 -159 -218 -101 98 112 82 174 -70 -13 -184 34 -41 -49 -169 20 105 -43 122
7590 122 -105 -112 -5 -388 -139 -147 147 -108 -451 -74 197 54 -152 -16 -47 -99 -4 -215 -241 -174 -31 156 91
7613 91 193 -199 -57 191 -9 -253 148 -278 85 -243 144 -44 58 174 -137 354 131 -147 -148 90 19
7634 19 71 -174 -155 -133 -49 -83 -157 -99 -23 51 -22 -173 64 89 283 383 8 26 42 146 133 -178 29 -173 78
7659 78 203 2 -66 198 -17 45 -29 7 -9 -105 107 -27 -87 116 -161 -92 233 -168 -45 -12 152 -220 115
7682 115 93 -5 170 72 -5 141 94 -147 143 296 -65 -29 44 119 -138 -45 -222 -68 193 168 106 133 128 -108 -61
7707 -61 302 4 -118 -172 66 49 -156 276 -77 48 -171 -11 183 -57 -232 272 -98 -190 33 -57 293 -150
7729 -150 22 -13 -106 -386 -181 143 98 -199 124 -74 -39 -51 -26 -70 115 93 -30 201 -187 26 -5 -59 -123 -155
7753 -155 167 -39 -152 -52 -68 238 -177 -115 -105 -38 -98 -194 -369 -167 55 14 37 51 193 -32 178 60 45
7776 45 360 -27 -66 -77 6 -173 -17 78 -132 -89 -87 91 -74 66 59 121 -98 -21 84 -81 25 64 -255 -166 -107
7801 -107 -189 -123 286 110 -30 256 -145 -144 -95 -72 130 -47 137 -109 -95 162 23 46 194 269 100 141 214 183
7825 183 166 393 329 -46 -53 -87 105 -50 298 176 49 -69 -154 -132 -176 -116 -58 -198 -52 6 -126 -79 -116 -103 -71
7850 -71 152 46 -192 146 -241 326 -33 -59 51 107 -55 135 -94 -84 57 123 114 -115 158 -84 -203 -326
7872 -326 128 -251 -20 -72 38 -55 -9 -88 -275 -229 -104 -192 31 -101 -123 -77 -93 -221 -250 48 -42 -138 -245 -121
7896 -121 -89 8 -164 -44 38 -190 -165 -98 -73 -183 50 -29 -138 6 22 -11 -229 76 15 54 -11 447 -39 44
7920 44 34 -112 -269 -86 40 -18 86 -224 -96 -22 -194 -114 -213 -18 -82 17 146 -22 211 360 -105 -179 190
7943 190 48 -2 62 -45 -77 124 -58 -225 -160 -118 88 0 119 57 -15 -229 118 29 -13 131 -40 -287 -131
7966 -131 287 -131 -156 49 75 -51 42 69 67 163 -3 22 -5 146 105 72 -86 -60 -70 -121 -56 189 195 176 -134 -61
7992 -61 -14 -183 126 -84 104 173 -8 37 13 73 186 124 25 4 60 49 -194 -339 -113 -380 -234 228 50 -145
8016 -145 -176 -128 13 -153 -33 -43 3 -48 215 6 -162 -227 -132 -65 -119 14 122 295 245 -21 56 67 -94 14
8040 14 -117 -74 63 27 49 -195 132 12 -86 -30 -99 91 93 -74 88 -26 66 -149 -66 3 -160 125 269 18
8064 18 14 -202 -51 94 31 91 73 109 133 -43 -203 67 -67 292 -208 -83 221 121 56 119 -36 -181 85
8087 85 -91 269 -64 344 97 -5 68 -84 -130 68 97 -9 -103 52 1 -149 -151 -4 7 -126 -199 36 -145
8110 -145 -192 53 -38 102 117 75 -92 -37 -147 -216 253 -46 54 325 79 -100 277 -88 -105 158 137 -268 223
8133 223 51 232 -68 -49 100 -50 -168 -111 5 -29 -144 -48 -181 139 4 187 148 -147 -68 -372 -135 -268
8155 -268 67 32 -165 21 229 -5 -228 -18 13 62 -126 -53 -77 23 -45 54 18 159 -197 -13 11 133 -98
8178 -98 -113 -70 66 -45 -219 147 -79 -51 -178 -118 -66 -19 -59
8191e9
$$ Imaginary data points
##PAGE= N=2
##DATA TABLE= (X++(I..I)), XYDATA
0 0 0 0 0 0 0 0 0 0 0 0 8 -8 8 -8 16 -16 17 -24 32 -36 41 -51 64 -72 87 -97 114 -134 153 -177 201 -230 260
33 260 -296 333 -375 421 -472 528 -588 654 -728 807 -894 990 -1092 1206 -1329 1465 -1616
50 -1616 1778 -1959 2161 -2383 2635 -2918 3237 -3610 4039 -4548 5156 -5909 6857 -8099 9805
65 9805 -12304 16343 -23973 43646 -213708 -405462 -164499 -84994 51688 98973 98342 69367
77 69367 138238 162295 138137 85705 47908 -21689 -29283 15065 37009 -19136 -80702 -137128
89 -137128 -154698 -98210 32490 130443 145372 98692 37322 -24141 -35936 4865 33814 10647
101 10647 -14273 -22372 -21866 -1856 30054 4032 -85992 -158003 -170731 -141010 -51077 73109
113 73109 133324 110561 81412 67621 62272 88460 123324 95679 15718 -47454 -80775 -98180
125 -98180 -84880 -63130 -77551 -96604 -66126 3773 80775 145955 158603 90604 -14939 -89764
137 -89764 -110850 -88546 -37004 6547 9730 -6088 -4122 11539 26689 35816 22990 -16215 -41603
150 -41603 -18935 29042 62619 73172 48743 -11471 -57548 -49486 -8345 35342 66886 59615
162 59615 10438 -37848 -56827 -62429 -67404 -62123 -58099 -54283 -17782 49690 101472 112567 86506
175 86506 26164 -41389 -70181 -51701 -17516 9120 23293 15125 -5583 -7072 10908 19819 15832
188 15832 8167 -6449 -18644 -8635 14810 19395 111 -24343 -44029 -46740 -13727 34364 58389
201 58389 53668 29796 -10102 -45383 -51983 -40724 -33514 -26209 -10974 3645 21175 49125 65638
214 65638 51742 23701 -1557 -20488 -20625 -779 13453 5681 -13291 -31117 -43144 -38372 -11706
227 -11706 13938 22175 23771 23039 15056 6756 1087 -9980 -28736 -38474 -30545 -10226 17654 45044
241 45044 51335 30842 4735 -15448 -30408 -29346 -15057 -3446 -1405 3431 10657 11543 11451 12675
255 12675 4866 -7517 -8429 -1414 3682 11225 13272 -1610 -21821 -29702 -26262 -19013 -2084 18136
269 18136 24363 19664 18179 13389 2301 -5538 -9922 -17434 -19654 -9687 3074 9704 14819 15834
283 15834 4708 -6830 -6694 -3405 -2126 3232 7586 2263 -4207 -4364 -4064 -6581 -5461 -1188 -1433
298 -1433 -295 6853 8820 4768 2565 -820 -8780 -10348 -3238 3226 4493 7668 9470 2941 -2353
313 -2353 -976 -1403 -4134 -1435 827 -1937 -1269 1894 -462 -4741 -4250 -2323 -3963 -1275 6091 8292
329 8292 5489 6073 4905 -994 -3436 -2372 -3570 -5164 -3555 -2003 -3545 -1938 2472 2026 873 4505
345 4505 4640 1291 914 1422 -1937 -5227 -4379 -2632 -2240 1266 6499 6484 6551 7538 3622 -2610 -4853 -6261
363 -6261 -10206 -10855 -7181 -4256 -2971 2380 8004 8694 9717 13226 10819 5807 3176 -1388 -8341 -12434
379 -12434 -12892 -13664 -12084 -4708 1946 5197 9204 13364 11279 6749 4013 113 -5108 -7101 -6079
394 -6079 -5587 -4076 285 2475 2562 4027 5297 1818 -480 -1202 -4387 -7849 -7190 -4694 -3012 1003
410 1003 6711 10224 10176 11362 10044 3605 -1886 -6372 -13351 -17303 -15099 -11420 -8375 -1451 7162 11697
426 11697 13934 17925 17992 11647 5134 -675 -9865 -16472 -16882 -16464 -14335 -7708 1043 6150 10067 15474
442 15474 15465 9715 5018 637 -6200 -9710 -7778 -6595 -5588 -1546 3164 3610 4333 6495 4995 762
458 762 -1075 -3497 -8051 -9260 -7134 -6171 -4837 854 7074 10994 14574 17764 15552 8206 1290 -6416
474 -6416 -14829 -19476 -18484 -16454 -12276 -3733 5210 9597 12422 14989 12330 6306 3002 -177 -4789
489 -4789 -5732 -3265 -2171 -1129 1846 3699 2242 675 -808 -4525 -7793 -7938 -9032 -9348 -5154 926
505 926 5908 10796 16100 17735 16380 13374 8557 1072 -5967 -13042 -20263 -24910 -23472 -19980 -13769
520 -13769 -3844 6356 14140 21072 25722 26265 22137 14494 3842 -8210 -17286 -20016 -19021 -15172 -8707
535 -8707 -3214 -283 2049 4696 5676 3794 2307 1704 198 1477 6561 9788 9133 6957 3374 -2687
551 -2687 -5587 -5037 -5587 -8798 -10583 -12644 -15207 -12073 -3131 3537 9285 16206 19659 20077 21719 20768
567 20768 11871 -1117 -13353 -24203 -30372 -26680 -17238 -10162 -3667 3202 6972 10949 17658 21852
581 21852 19048 12361 5369 -907 -5892 -7215 -7496 -10667 -15530 -15429 -10068 -1659 8033 13960 10902
596 10902 2249 -4687 -7080 -5609 978 8951 10613 9889 9609 8670 6257 3088 -4313 -15215 -23086
611 -23086 -22513 -15501 -5342 4352 7764 3663 370 2771 8177 15357 21042 19255 9971 228 -6180
626 -6180 -10827 -13746 -16579 -20194 -21451 -15054 -1321 13124 24068 25253 15335 1818 -6683 -7739
640 -7739 -3183 2014 3874 980 -3834 -4034 -1629 532 -705 -5078 -10217 -11755 -5106 5252 12572
655 12572 13265 6442 -3892 -9953 -5154 4722 11663 14128 8944 -1916 -9738 -10318 -8015 -7126 -7151 -7477
671 -7477 -7049 -1413 10031 18008 16432 8153 -2604 -12026 -11674 -1927 6773 8219 3140 -4582 -11428
686 -11428 -10967 -2671 4484 5314 4009 2549 1542 5179 9462 7421 -2553 -12287 -16564 -13256 -1584
701 -1584 12617 18303 11858 1454 -8845 -13619 -10000 -2378 1711 1319 701 2244 5429 8878 9781
716 9781 2830 -8024 -13797 -11255 -2394 9139 15377 10314 -1927 -12159 -14914 -10255 -1106 7808
730 7808 9515 5934 3615 3857 4252 3286 -1031 -9090 -14834 -11592 -947 9739 15722 13300 1632
745 1632 -10914 -14737 -10452 -1891 6321 9029 5676 1573 428 1432 2097 79 -4014 -8463 -7554
760 -7554 426 8910 12856 9844 -444 -12122 -16836 -12098 -1632 7513 11496 9004 2947 -1400
774 -1400 -1666 -944 -1599 -3611 -5245 -5053 109 7967 12088 8216 -986 -10078 -15250 -11092 -569 8851
790 8851 11968 9469 2511 -3755 -5511 -3185 -1392 -2080 -2874 -2631 397 5381 9330 7445 529 -6798
806 -6798 -10575 -8334 -599 7514 10565 6656 -398 -6157 -8104 -5206 -800 1298 1454 1795 2911 4851
822 4851 6298 4967 -728 -7154 -10085 -6985 -733 6412 9686 6283 -452 -5736 -7963 -5298 -845
837 -845 2779 3484 2244 1718 1918 2010 1090 -838 -4308 -6040 -2851 2339 7166 8413 4651 -2640 -8294
854 -8294 -10366 -7424 -1552 3856 6633 5700 4286 3372 1607 -168 -2745 -5666 -6534 -4319 -104 4480
870 4480 6496 4627 -204 -4377 -5968 -3423 989 4841 6429 4391 1354 -1528 -3042 -4256 -4693
885 -4693 -4565 -3018 -455 3122 6400 7382 4522 -34 -4861 -6419 -4741 -923 2988 4931 4137 2319
901 2319 -292 -1949 -2639 -2956 -2953 -2623 -1341 1008 2613 2913 1844 431 -1758 -2050 488 3329 5127
918 5127 4882 3278 -683 -4808 -6662 -6723 -5657 -3428 -442 2266 4134 5591 5593 3507 970 -940 -2088
935 -2088 -1985 242 1511 1701 364 -721 -2759 -4006 -3455 -2021 -485 1346 2746 2457 2081 1342 444
952 444 -1109 -1517 -481 565 1953 3246 3010 1128 -718 -2938 -4967 -5213 -4030 -2025 62 2266
968 2266 3819 3794 3289 2388 1530 112 -806 -393 -430 -1438 -986 -1328 -2179 -2405 -1604 -919 -116 1606 2800
987 2800 2842 2429 1742 49 -1250 -1231 -1428 -1369 -685 82 2 88 177 -445 -976 -810 -596 -165 316 973 1078
1008 1078 1437 1453 1189 588 379 406 -388 -739 -1092 -1732 -2048 -2138 -1730 -1193 131 997 1976 2134 2311 1983
1028 1983 1686 754 428 -257 -1377 -938 -785 -954 -948 -812 -898 -1266 -848 -404 -201 294 645 1087 1110 1746 1540
1049 1540 1061 1216 1649 453 -150 -576 -1298 -2585 -3238 -2949 -2497 -2455 -433 904 2038 3009 3999 3438
1067 3438 2415 2229 968 -88 -1020 -1477 -2345 -3019 -3189 -2143 -2105 -1269 441 1115 1393 1596 2467 2173
1085 2173 1398 1280 679 17 -317 -323 -1025 -1163 -1060 -1499 -2345 -1578 -667 -401 399 1464 1493 1273 1167 1742
1105 1742 1443 1452 949 172 -913 -1482 -1802 -2104 -1985 -2106 -1172 -335 964 2080 2516 2649 2297 1047 245
1124 245 -689 -1111 -1393 -1362 -1611 -1640 -1471 -667 259 253 339 732 1087 1445 1423 1961 1782 503 -577 -1275 -1717
1145 -1717 -1467 -767 -152 131 -108 -194 -40 -227 -3 177 49 -155 878 1470 1824 1537 658 -392 -1459
1164 -1459 -2064 -1652 -1207 -345 178 495 14 29 476 596 300 334 131 154 84 481 47 -193 -609 -938 -1072
1185 -1072 -636 548 1182 1075 565 444 -117 -590 -604 -570 -1263 -887 -856 -149 368 1054 1147 670 633 278 -52
1206 -52 256 329 310 -222 -223 -434 -802 -906 -576 -144 -305 -575 -650 -327 -16 629 853 579 777 685 667 576 905
1229 905 230 -750 -943 -1210 -926 -1332 -755 -436 -486 -318 -37 547 1047 1749 1771 1257 687 392 -706 -1258
1249 -1258 -1209 -1051 -937 -591 -327 40 638 352 470 111 -139 -73 77 276 517 548 -213 -225 -596 -486 -345
1270 -345 202 435 289 235 -56 -112 -382 -277 -539 -882 -717 -225 274 900 1376 984 -195 -859 -716 -461
1290 -461 1 588 506 326 -132 -639 -452 -76 36 -219 -188 -316 322 794 1074 765 -302 -1055 -1246 -432
1310 -432 329 1214 954 228 -281 -770 -699 -269 407 369 245 -237 494 1029 1215 621 -137 -956 -1219 -787 209
1331 209 633 706 -110 -1294 -1856 -1408 -357 618 1607 1697 1444 1320 1282 1210 417 -628 -1747 -2399 -2245 -989
1351 -989 249 539 -151 -975 -1408 -1069 780 2254 2757 2664 2070 795 120 -300 -761 -1357 -2195 -2480 -1936
1370 -1936 -187 882 1598 624 -568 -1445 -1127 -50 1492 2453 2520 1771 804 -209 -194 -106 -1064 -1719 -2153
1389 -2153 -1652 -836 373 955 536 -857 -1048 -748 1029 2651 3549 3217 1564 -354 -1288 -1870 -2021 -1666
1407 -1666 -1873 -1868 -1271 260 1528 2149 1992 718 -321 -415 611 1427 1856 1435 -426 -2081 -2346 -2580
1425 -2580 -1527 -183 563 446 826 988 1524 1217 395 -676 -1511 -1863 -277 1459 2193 2230 146 -1693
1443 -1693 -2908 -2975 -1850 -774 300 1013 1111 1617 1941 1753 1203 -97 -970 -1145 -730 507 1039 305
1461 305 -577 -2010 -2829 -2227 -1195 395 1832 2673 2251 2044 1223 858 -371 -1538 -2175 -2366 -1272 217
1479 217 1751 1733 839 -12 -945 -1324 -821 169 538 513 434 401 -280 15 471 173 -244 240 746 808 1252
1500 1252 692 -501 -1930 -1962 -2275 -1489 109 1215 1572 1235 1156 1032 -126 -81 41 -373 -232 -2 67
1519 67 239 193 -305 -1018 -1311 -783 109 568 617 1191 617 -592 -1029 -625 -465 228 1136 1743 1668 1148 797
1540 797 -499 -1676 -2082 -2368 -2163 -1026 367 1747 2181 1975 1501 501 497 -55 -306 -424 52 -559 -808
1559 -808 -1178 -1276 -1444 -1559 -647 397 1207 2266 2672 2384 1097 318 -816 -1628 -2117 -1545 -839 -481 439
1578 439 811 528 -168 -127 -330 -574 99 599 814 1042 1079 765 287 57 -162 -337 -496 -27 -289 -763 -1011
1599 -1011 -1362 -1494 -1292 -786 450 1139 2298 2996 2248 1728 931 -176 -1237 -1846 -1903 -1995 -1745 -1157 -680
1618 -680 -96 96 720 838 936 1102 1658 1054 853 152 -153 -650 -1496 -1412 -1090 -959 -302 258 409 673 533
1639 533 -128 -572 -735 -752 -289 220 1007 1099 1303 904 616 -42 -58 -502 -1324 -1104 -1074 -914 -574 194 -69
1660 -69 344 445 446 1130 737 633 325 -33 -590 -1042 -1013 -803 -267 -240 355 433 810 760 703 654 206 -357 -842
1683 -842 -817 -920 -813 -511 -289 181 630 1212 1320 1141 717 5 -407 -952 -813 -1178 -1042 -837 -118 61
1703 61 124 792 671 704 665 713 251 -30 -578 -577 -607 -527 -132 -170 43 48 161 95 439 -93 14 -237 -15 -23 56
1728 56 287 646 844 960 540 358 -194 -632 -660 -946 -894 -925 -833 -182 314 582 1182 1386 1420 1475 1100 578
1750 578 221 -988 -1378 -2160 -2015 -1453 -657 -156 254 765 1018 1366 1096 1287 581 -14 -142 -326 -94 -267
1770 -267 -96 -548 -731 -522 -554 -229 202 578 -112 -240 -157 -124 237 986 685 1068 927 1148 946 658 351
1791 351 -705 -1616 -2184 -2062 -1444 -1143 -161 527 807 1047 1193 1697 1324 1190 350 -61 -478 -559 -629 -853
1811 -853 -1230 -1032 -1063 -576 85 548 1152 907 386 -133 -459 -541 93 -159 182 317 421 748 697 331 -39
1832 -39 -647 -1349 -1612 -945 -603 -450 28 245 150 445 1062 1193 1534 1051 343 -265 -606 -738 -1148 -1478 -1288
1853 -1288 -1241 -760 238 948 1895 1658 1140 594 174 -337 -258 -184 -404 -571 -357 -393 -3 89 23 160 -128 -135
1875 -135 12 305 534 472 139 -170 -147 13 575 763 704 338 -100 -398 -815 -928 -818 -909 -636 82 430
1896 430 1136 1551 1733 1180 790 83 -407 -639 -985 -682 -930 -687 -773 -275 302 393 285 596 531 805 556
1917 556 799 366 63 -325 -782 -723 -624 -272 -130 160 99 -317 73 265 226 292 77 -256 5 -12 50 270
1939 270 118 161 165 -105 3 2 -205 -452 -504 -545 -583 -373 275 295 1122 881 678 291 145 -84 -511 -225 -425
1962 -425 -552 -375 -231 96 265 402 177 -181 293 236 356 112 -28 -80 -337 -404 -275 -204 -295 -163 -83 257
1984 257 414 604 452 338 123 -45 13 -308 -231 181 0 239 -176 -166 -132 -389 -133 -79 -296 -354 -132 -124 170
2007 170 122 187 343 460 170 208 -1 -77 -182 -256 -238 -740 -534 -92 41 76 -151 -30 -168 290 33 314
2029 314 483 260 168 -53 -383 -179 127 -125 -260 -224 13 173 95 66 -180 -318 -667 -467 -394 88 320 626
2051 626 673 329 527 551 122 -25 -186 -508 -751 -987 -532 -308 -595 -222 -33 217 406 799 856 781 149
2072 149 144 169 -35 -118 -505 -287 -595 -754 -592 -371 -287 -156 12 254 107 -46 724 617 390 15 -35 -45
2094 -45 -133 207 201 2 -65 -318 -592 -919 -662 -686 -483 95 728 913 1473 1062 1121 596 -227 -816 -1148 -1009
2116 -1009 -821 -693 -405 -104 -12 203 208 642 608 436 591 604 326 192 -81 -692 -970 -1136 -728 -736 -124 239
2138 239 543 548 706 424 605 -23 -134 -336 -209 -109 432 627 284 232 238 -65 -268 -423 -592 -77 -393 -327
2160 -327 -268 -45 241 602 814 679 919 499 74 -221 -97 -613 -909 -863 -436 -366 314 146 458 335 100
2181 100 390 -133 -84 -168 6 -10 -160 -215 -95 -391 -78 -199 333 533 464 459 -4 -235 -565 -931 -566 -596 -432
2204 -432 -181 728 910 720 929 287 46 -446 -490 -529 -491 -345 -54 -235 -61 30 336 347 312 338 44 -80
2226 -80 -165 -12 -115 -24 -23 80 105 249 530 403 187 -282 -162 -453 -617 -595 -665 -178 -61 49 429 775 820
2249 820 697 610 331 45 -92 -462 -486 -657 -756 -423 -399 -140 245 264 287 487 105 71 91 -282 -458 -414 -481
2272 -481 -296 -180 539 528 443 225 72 -243 -386 -377 -443 -88 -45 159 272 691 531 685 271 -18 -51 -273
2294 -273 -230 -214 -516 -561 -442 -297 7 6 248 324 821 626 540 355 5 -234 -631 -780 -989 -481 -155 226
2316 226 258 519 133 204 27 6 305 90 -3 19 190 173 102 139 108 -57 -207 -253 -165 -304 -296 -419 -58 19 42
2341 42 366 314 403 256 392 169 338 93 -459 -334 -498 -549 -536 -230 -177 47 188 406 360 369 460 -13 -145
2364 -145 -301 -9 -453 -206 -87 26 274 196 203 123 179 161 55 -389 -113 148 131 -53 200 -162 139 -142
2386 -142 281 166 204 -61 -263 -275 -222 -181 -304 -103 71 111 160 250 140 56 119 -90 -188 -31 -191 -28 -35 42
2410 42 -200 210 148 321 242 -51 1 7 81 -65 -343 -128 -50 -381 -204 -191 218 426 243 -191 -115 -24 -70 -75 86
2435 86 -39 75 -171 -41 166 -53 -18 203 53 -54 64 304 48 172 -161 -135 -78 -123 55 360 491 82
2457 82 -82 -197 -522 161 -110 86 -79 -393 -112 122 335 166 50 -70 276 -224 90 264 -53 -32 -50
2478 -50 84 -116 -116 -165 -113 150 -44 -234 67 154 557 35 -325 -155 5 255 -5 277 99 13 -150 -29
2500 -29 -75 -80 139 -48 170 265 -26 176 41 -167 -193 -392 -58 -238 129 123 221 108 -178 221 -261 81 -37
2523 -37 135 82 36 81 47 125 -163 -255 -151 172 -93 -5 363 309 -11 -68 -282 -131 -72 -119 -225 33 -34 161
2547 161 174 273 141 104 -236 -51 -171 -7 345 238 26 -70 -193 -229 43 -431 -119 -178 -340 97 48 189
2569 189 80 128 184 -46 -33 -13 76 33 -46 -422 -565 51 -392 -14 372 263 352 161 396 298 188 237 232 -54
2593 -54 -226 16 -235 -212 -239 -294 -113 -377 208 -217 -240 2 213 -134 -253 121 225 46 111 190 451 153
2615 153 44 -210 -370 -368 -538 -523 -239 113 166 298 465 231 145 135 141 -115 -213 -432 -196 -360 -6 -270 -87
2638 -87 75 9 -146 379 194 359 377 265 -53 -22 -69 -417 -248 -42 -228 84 -75 189 245 -53 12 138
2660 138 -164 -64 284 31 51 233 205 97 302 3 -62 -125 -290 -266 -421 -236 -59 -195 170 -128 381 273
2682 273 281 347 -92 137 -324 -328 -139 -459 -154 -194 -392 -243 47 144 187 334 159 89 435 111 284 -110 135
2705 135 57 32 66 11 -242 -42 -39 45 73 -148 -68 -422 -125 233 -89 -75 316 290 423 123 -216 -363 -331 -330 -350
2730 -350 -200 -310 227 125 102 120 171 -20 56 104 0 264 -11 18 -97 9 -138 -70 -32 57 83 148 112 50
2754 50 265 86 -118 -60 193 40 31 -160 64 97 192 -227 -107 115 -15 -72 -188 -285 -84 37 -12 -7 292 -41
2778 -41 598 163 113 -182 -241 -98 -423 -410 17 -53 239 460 239 253 308 47 153 2 -293 -175 -126 -101 161
2801 161 -319 32 -88 247 225 252 180 267 198 113 115 170 -97 -216 -354 -51 -27 -74 108 -135 -142 -35 -263 -172 -81
2826 -81 -156 -215 -14 -143 109 480 14 191 26 -195 336 -93 58 204 -301 -144 -228 -62 344 -154 -23
2847 -23 128 74 164 227 -135 58 -70 -25 -207 -39 40 216 240 -201 92 -278 -263 27 -29 102 -23 -80 -98 217
2871 217 8 16 -28 117 212 46 57 -228 71 -246 -14 97 131 -43 90 98 41 -126 208 34 -121 255 83
2894 83 153 -222 91 150 -59 200 -98 -114 -426 -110 -234 -89 272 98 -58 151 -98 202 71 -405 -14
2915 -14 63 -30 -43 -15 361 161 95 219 77 100 135 194 33 -175 102 -64 -402 104 -38 -36 -71 -19 -72 -55 -70
2940 -70 76 -230 57 52 225 124 172 -29 -92 118 -147 -107 45 -38 -98 33 -5 -178 84 96 -251 28 -199
2963 -199 -121 115 157 99 178 60 -25 178 -38 49 38 -57 -18 -155 315 -86 33 53 -103 -222 -86 61 149 -215
2987 -215 36 138 -97 -120 123 140 -59 -53 -272 19 -153 -33 -69 162 68 188 123 -69 311 56 -248 94
3009 94 263 94 344 -21 7 182 16 -100 -20 -14 201 -16 -118 260 -4 -87 -46 -222 28 -86 -9 135 -114
3032 -114 301 -108 79 1 -185 -213 159 -228 -263 -170 -81 175 196 230 -216 180 -102 -74 -73 54 106 -164 -95 145
3056 145 332 -27 43 124 -64 -25 -317 -233 -237 -259 -249 1 -81 6 34 218 194 272 35 295 145 -13 99 -275
3080 -275 -101 -172 -22 -132 280 -78 25 98 -115 -87 95 55 63 -100 216 -108 -181 22 -105 -61 -76 -245 -215
3103 -215 29 -73 258 176 306 62 -128 14 341 105 7 -188 -159 -29 -212 -260 44 -75 -373 -377 -96 225
3125 225 647 42 248 334 126 40 -181 -483 -104 -337 -93 -95 -345 239 -100 -68 -14 -217 280 157 220 329
3147 329 -111 -159 2 -255 25 -279 82 -100 11 -358 -248 138 279 5 8 101 187 301 152 80 47 -245
3169 -245 -160 -238 -251 -435 -155 129 -171 87 -87 -130 -273 237 -105 -17 101 117 176 265 51 -198 -301 -653 -313
3192 -313 -62 -37 -147 146 188 300 112 -76 26 18 102 -118 -91 334 -94 128 -65 -212 -128 24 -89 -182 -3
3215 -3 -103 141 20 215 239 126 19 11 86 105 138 -153 -331 -21 -250 -77 -269 122 25 298 10 72 304
3238 304 56 158 -15 -217 -16 0 -4 -228 9 8 81 -119 -170 -9 179 111 239 68 122 29 102 380 -20 -71
3262 -71 50 121 -101 26 -81 -154 -216 193 -421 -305 213 91 -3 -332 76 -80 127 -177 63 -69 -52 -345
3284 -345 -302 -300 -9 101 -64 -103 -198 29 254 117 211 -45 -154 -227 -106 -216 247 231 359 411 -73 129 183
3307 183 -23 -95 -20 -184 73 178 21 272 -142 -25 -375 223 187 115 -81 107 341 43 85 295 -91 -116
3329 -116 -61 -96 -181 397 -174 216 -122 -203 186 1 48 -184 256 107 68 -328 -28 134 94 119 141 -129 74
3352 74 224 133 -104 -108 -51 -292 -25 -101 6 -125 -60 -72 92 37 -4 -39 86 -193 242 154 -7 73 200 -122
3376 -122 69 -286 -134 -99 -16 -119 -31 116 -56 -14 95 289 104 -210 -20 76 111 -24 -55 47 4 -127 -10
3399 -10 68 33 26 -220 27 15 -31 8 -103 122 -169 67 -173 -51 -60 -39 310 -101 -22 111 -164 -58 -79 14 12
3424 12 -113 -189 269 492 212 -90 17 -74 -43 81 -297 114 14 87 142 142 256 -51 -228 30 -261 -29 -106
3447 -106 -37 -67 64 -321 -244 91 -169 -145 -296 30 234 215 -46 -36 35 -305 -167 218 -69 185 -16 -83 -65
3470 -65 33 27 -48 -139 208 -106 9 -73 -3 233 -91 -17 -49 -107 76 34 -35 39 -295 140 15 75 245 36 -79
3495 -79 -30 90 -7 -269 222 -36 173 -231 -92 -1 -60 -128 -26 115 -147 -34 99 -196 -45 -41 171 1 159
3518 159 299 51 -58 248 -150 100 -80 -195 112 -267 -254 -43 -70 44 -163 -310 -195 -237 133 -153 -170
3539 -170 -149 -39 -226 78 -103 -8 -7 272 108 -194 -156 -56 -214 -213 109 225 -102 172 191 -270 -63 176 54
3562 54 -202 46 -310 -19 192 -167 -73 226 301 155 -190 154 -56 -43 105 -215 -49 -203 -126 -9 -59 -216
3584 -216 -91 10 163 224 70 336 -21 127 111 145 -116 70 228 -17 -98 -124 -234 -232 69 5 -69 3 -84 42
3608 42 26 199 169 162 112 -35 135 39 211 -208 -249 -138 -4 -312 -28 286 78 -51 49 177 -72 207 73
3631 73 -13 -56 -156 -49 -118 48 117 -187 145 187 -4 9 -88 53 -119 66 244 97 83 -46 -4 81 91 -33
3655 -33 -45 71 -24 86 -64 -66 -174 200 211 33 149 -254 231 -60 -139 -46 -74 104 -192 -93 -306 -241 63 -88
3679 -88 -100 -84 348 -34 259 195 -29 -42 -310 -96 -99 -166 -129 -52 135 92 -149 81 -19 2 15 96 77 305 -275
3704 -275 143 74 -30 359 -203 -350 -39 -120 -371 -49 -52 -239 -117 -129 259 111 178 137 -101 -3 73 150 181 48
3728 48 98 -135 -150 -162 77 -152 -155 -25 171 47 64 37 -105 -123 12 -204 -86 -57 -203 230 -10 -148 -124 -53
3752 -53 -27 -123 -12 101 -148 -102 -46 102 -39 391 -267 -196 48 13 -190 -154 78 79 54 -133 208 208 -79 30
3776 30 -86 50 10 105 89 -65 -161 80 84 -208 82 -38 106 90 49 -22 142 -77 -322 112 98 174 28 40
3800 40 41 -50 -23 286 -239 215 -15 -262 -72 -50 -227 -185 105 -6 82 -285 83 6 104 39 -28 99 -186 60
3824 60 49 -58 -224 -123 33 -112 88 -289 -131 135 -51 -105 -43 -3 80 -81 -200 24 -13 38 34 124 341 -172
3848 -172 84 -256 -216 203 90 167 -37 -81 -31 29 162 -48 -260 81 54 -174 137 125 -85 -229 -198 277 -123
3871 -123 -207 -49 10 -86 -80 -221 -331 -266 -156 -25 105 -287 -208 190 188 -42 -116 -36 175 -31 20 -51 -111 -234 -158
3896 -158 165 52 -21 -91 -218 -43 10 -78 -319 -49 -155 -125 -163 170 -95 158 121 -125 -21 402 42 326
3918 326 -111 15 97 -110 -212 103 113 20 -234 163 144 19 72 -17 89 -20 -112 -210 34 -134 -23 -127 -266
3941 -266 17 74 39 -32 43 -82 -186 -155 -150 4 77 170 -7 14 146 59 80 -32 -68 39 90 -70 184 -14 -195
3966 -195 64 174 103 181 90 -86 -99 -141 -164 59 5 -156 71 7 -58 96 -188 -46 349 -19 -120 142 -63
3989 -63 -65 -205 -54 -249 -116 320 -100 370 -55 87 188 -81 -140 100 -112 30 3 90 -17 -88 8 -13 73
4012 73 176 238 62 1 -127 67 -41 -56 360 200 -39 131 -87 -5 -300 -7 161 2 102 -125 -130 -201 -120
4035 -120 120 93 -49 187 174 10 -81 -25 -132 89 61 -101 159 -30 -165 -13 -134 117 290 -344 33 333
4057 333 -30 81 196 -208 30 269 165 28 -175 -256 129 -53 -381 -180 30 -119 73 93 -167 76 137
4078 137 -142 12 -192 -114 151 -360 -230 -184 215 -148 -48 15 -70 -164 -10 -85 -205 46 -160 -105 62 -68
4100 -68 -127 -126 -87 -67 -176 8 -93 -140 -37 310 120 162 -5 65 54 71 24 132 8 -320 -107 -19 -211 -152 181
4125 181 220 54 11 35 -99 92 279 188 22 -63 85 -87 106 94 -84 -225 -234 147 281 -37 -197 71 153
4148 153 148 -70 342 135 182 444 37 15 71 -199 -265 -85 -380 -100 -46 298 -261 -108 -81 -12 151 71 -95
4171 -95 42 273 -208 138 -260 -15 -90 -231 168 -226 60 283 48 -31 249 -45 129 94 310 238 -283 -343
4193 -343 -173 -145 249 -158 -239 -122 -94 -75 -37 -86 -294 92 -97 125 94 390 27 -7 -54 113 -174 -58 -232
4216 -232 33 10 106 73 85 239 -181 228 18 134 43 -30 2 119 -58 317 -27 -58 -193 -70 6 -126 69
4239 69 21 59 86 64 13 4 -195 69 -59 79 162 -114 -26 -265 137 97 -161 -137 37 45 161 -179 255 103 29
4264 29 274 -140 -7 -203 29 -3 -236 177 -76 -33 -228 -52 83 -109 127 -57 156 221 -93 102 22 -218
4286 -218 -43 113 190 89 -213 156 20 10 -129 -39 -20 -130 63 -96 -135 -32 132 124 81 -314 -196 178 -394
4309 -394 -7 172 7 -18 -43 10 146 -71 83 -250 -190 104 475 163 6 -36 38 105 76 170 236 -105 143
4332 143 -100 -187 -205 -95 -67 -71 -272 228 245 -361 -80 -119 109 216 -33 90 -30 -111 319 -169 -10 -142 242
4355 242 -35 -149 29 39 -23 37 -83 1 -14 291 -113 27 12 -73 -330 -216 51 227 11 -82 152 -59 35
4378 35 -25 41 127 -39 -99 23 124 -2 -183 161 125 6 104 79 -366 -47 126 -29 -132 -298 -285 37 -53
4401 -53 -56 107 -195 148 157 -61 84 -93 40 -143 -216 83 33 -171 -50 30 56 30 191 31 -45 -66 41 -100
4425 -100 21 -103 -364 70 -205 -66 -98 128 -78 -46 -18 -327 11 32 -164 84 177 255 25 99 -147 -112 389
4448 389 -62 -116 18 70 19 142 -41 21 77 113 25 -55 209 -29 255 -285 -190 72 -117 -232 -66 20 -70 -108
4472 -108 -6 80 69 110 -128 111 312 -48 -38 -83 37 -120 -35 -29 -22 3 167 54 3 47 -93 -471 243 140
4496 140 -133 16 18 68 -265 -249 -263 138 -116 39 215 56 -271 -96 205 -119 -4 -115 -230 166 -88 69
4518 69 27 195 78 50 192 -38 2 -144 -65 107 110 72 17 197 -107 -53 -232 -314 -27 -119 -214 304 -202 168
4542 168 3 126 -4 -106 88 124 57 52 257 61 51 289 143 -19 153 -299 59 -132 -52 -238 -114 176
4564 176 -297 5 19 41 -14 202 -337 -162 94 -194 -229 -142 -144 109 -90 -27 261 -14 -159 -191 15 -34 -103 -169
4588 -169 -178 -181 -152 -68 8 64 -110 -33 32 -79 -232 45 5 216 242 -374 -145 86 -5 21 -74 255 -85 -109 -246
4613 -246 -172 34 -185 39 178 175 -293 -39 -232 204 37 -114 1 -191 -98 -74 69 -4 -107 178 74 -160
4635 -160 97 38 -204 275 -43 -53 -51 113 73 -153 -173 -53 184 -34 48 -185 -1 149 171 -184 28 -4 -56
4658 -56 127 -48 95 -51 -85 -60 101 113 -56 -32 -186 335 -115 -160 -43 7 -131 57 -11 111 -108 -191 -81
4681 -81 46 -50 -123 219 3 -119 9 -25 -131 -167 210 -16 99 58 -288 47 -36 -1 -297 192 66 70 92 15
4705 15 11 130 99 68 52 76 -82 -325 11 51 -49 -3 -181 -153 12 -360 25 270 170 202 166 171 -86 -34 117
4730 117 266 265 328 124 -15 135 -101 -78 -6 -132 -78 118 223 -20 200 27 68 111 -212 200 -203 -31 325
4753 325 193 -150 -21 106 -98 -14 56 -12 -108 126 -387 16 -237 -41 178 40 70 159 54 142 68 -147 -31
4776 -31 -121 289 -262 75 58 39 72 -219 123 -62 -27 -74 -246 -232 179 -149 229 201 102 -71 420 -93 147
4799 147 -9 0 185 -325 200 -33 50 -233 -250 72 -26 327 326 78 -107 -97 -143 -212 16 47 -75 -116 41 -102
4823 -102 214 -6 -72 -133 105 70 -183 -86 -79 189 -379 -125 92 -399 -25 -174 2 -168 95 -19 -38 127
4845 127 -428 141 -164 184 140 -88 -53 259 191 -189 229 -49 77 -143 -236 161 21 -65 -41 -32 120 -118 -82
4868 -82 -244 -151 -153 -227 -30 -115 110 7 -117 -48 -78 -60 -110 -78 -95 61 13 191 213 -11 -24 147 -22 123 -87
4893 -87 -110 -78 -125 2 -185 -13 -89 0 92 68 146 283 162 52 -61 16 -258 80 -25 99 19 -54 -216 337
4917 337 -1 -246 108 174 8 22 -26 -25 93 235 76 58 186 89 81 116 -314 -45 17 40 -129 -227 -157 -27 63
4942 63 182 -22 -274 112 155 48 -86 185 -24 -192 280 -77 -9 98 46 -157 -20 120 -76 -1 -58 -57 -48
4965 -48 -55 -218 181 -38 -177 91 -258 88 -155 214 303 259 142 28 4 74 62 -66 -62 166 -38 -275 -94
4988 -94 138 -26 -77 -189 87 5 87 -55 -70 -73 25 -10 -17 -103 115 104 146 -200 -140 -398 -34 -27 56 9 24 100 277
5015 277 143 78 293 172 65 65 182 -143 67 3 -51 -29 -172 0 -223 -233 -27 47 -50 45 -22 -252 -157 116
5039 116 107 116 -157 17 -5 108 273 112 -26 47 -109 242 -37 -15 319 -35 -68 -464 -56 -256 261 -302 146
5062 146 118 -41 144 225 185 141 -3 90 -226 -48 19 136 197 -42 122 -80 116 48 -205 124 246 -113 -53
5085 -53 -66 200 -106 58 -13 41 113 -13 360 41 279 -170 -72 218 -9 -59 91 23 -69 -117 106 75 294 -41
5109 -41 -3 -49 -123 31 230 75 92 50 -125 -68 -88 -37 -156 45 -135 -200 -46 111 -275 -31 56 225 -59 75
5133 75 162 61 -44 -168 -8 -22 72 -119 50 167 97 187 69 -8 -66 -70 140 115 -85 -50 138 -156 67 151
5157 151 49 -206 -297 -35 -247 -46 -64 122 135 235 -85 118 45 -74 325 0 -52 132 -49 170 -167 85
5179 85 -78 -11 269 74 167 -170 181 -96 89 38 66 -127 168 -27 169 -45 -78 44 -33 93 61 -133 -252
5202 -252 -188 -191 362 69 -259 -78 45 -7 -119 186 47 55 -257 274 74 -288 -213 -162 17 -234 -267 72 39
5225 39 -95 60 -130 -86 -120 -100 -88 -146 67 325 302 229 181 115 237 119 -68 -186 279 -77 -46 -15 -185 41
5249 41 130 269 -33 -130 -37 -54 -207 -265 353 14 -114 120 86 20 56 152 -107 -82 -176 -89 198 -26 -16 30 -73
5274 -73 141 80 418 43 -235 122 221 30 222 -194 83 -81 -4 162 384 149 93 -166 264 -131 -348 -163
5296 -163 -89 146 -18 69 108 -48 -59 -108 -216 -139 -201 -345 101 69 -14 -183 -96 138 -32 18 153 -112 -19 -341
5320 -341 -36 -91 25 337 -41 -113 4 -34 34 -24 -96 12 -242 342 53 202 213 77 159 59 -41 -119 138
5343 138 -128 -126 219 138 -237 175 143 -224 23 -122 -24 -3 -72 195 -13 174 -171 -10 -341 -157 145 -314
5365 -314 98 71 28 106 -86 -19 -127 -180 161 -256 -46 79 110 258 -41 -107 -62 -196 25 19 -76 -89 -188 150
5389 150 33 106 -152 24 176 -127 248 -154 -12 -139 -201 146 -12 -161 -50 -169 -80 46 59 95 -187 243
5411 243 -156 14 -87 25 -386 -306 -352 -30 149 182 76 5 263 -167 -11 -106 -108 117 -217 -158 186 -7 -38
5434 -38 -255 40 130 17 -246 -39 130 103 -180 -229 -141 -154 106 68 -154 -91 35 -272 74 146 34 61 -96
5457 -96 -13 -193 -212 75 136 -4 -317 -51 134 66 44 -258 78 -94 36 14 128 -18 40 34 36 33 90 -120 97
5482 97 -85 146 -74 -118 -55 198 55 -22 307 126 71 -82 43 -134 138 -21 -100 246 -248 112 -102 172
5504 172 131 -370 -151 -114 64 -104 -116 93 93 -308 -59 76 -123 86 -303 181 43 -130 224 -118 -123 -97 -392
5527 -392 -181 -126 16 -51 -195 -27 -56 146 -23 -70 274 -210 -63 -21 102 73 -19 -42 -39 61 102 42 100 -116
5551 -116 58 58 125 -33 164 165 36 -123 -144 84 8 226 -67 -245 -254 48 55 -224 76 99 97 163 105 49 123 -150
5577 -150 233 -92 -35 -226 -430 -202 92 176 -136 -162 -70 224 61 137 -107 163 22 2 79 -233 37 -69
5599 -69 -107 83 49 22 30 77 -48 -302 57 189 -198 -45 -219 -229 65 -33 234 -54 90 -214 -56 75 116
5622 116 84 16 -121 56 116 -12 14 -44 50 190 450 93 -116 264 -165 -35 -195 -178 236 150 -100 72 90
5645 90 -140 212 283 -193 -186 132 176 -157 299 68 -13 -382 99 197 47 41 229 -56 54 -81 -86 33 -118 20
5669 20 -296 147 -48 -20 -246 -57 199 -23 18 14 -371 199 61 -140 86 65 117 41 -174 -37 -85 -24 152
5692 152 -38 184 -76 -176 -218 95 -49 -91 31 82 -363 -76 160 -15 147 -82 170 -36 -202 -68 138
5713 138 -190 -318 -224 120 -135 195 -259 50 -174 195 -106 143 -41 17 193 -83 157 -181 -78 -78 75
5734 75 170 145 -207 -12 21 -78 -26 -27 37 -94 30 -18 -141 -59 57 -121 46 68 -74 -62 -101 -153 93 -270 -225
5759 -225 16 95 21 -46 -99 -92 21 72 67 -48 153 -93 -139 267 180 -1 -95 -61 -125 -169 139 -2 -34 -5 -5 -41 -8
5786 -8 -148 183 -80 -48 237 59 -36 -186 36 -87 -195 -60 -16 -35 99 125 141 91 -180 -142 157 107 -119 69
5810 69 51 -57 53 5 253 140 20 3 -95 26 -84 121 -127 -189 75 51 43 -9 211 -138 36 -47 -277 19
5834 19 165 236 82 2 -12 224 69 -209 160 82 12 20 72 -128 110 -226 -205 17 210 -117 138 -139 86
5857 86 341 92 2 141 219 116 -141 -28 99 -262 -112 5 197 -61 -269 -125 265 195 94 1 267 87
5879 87 10 185 199 -43 72 101 153 -49 42 -186 -47 -37 -274 -46 187 -33 -142 -85 -64 54 184 163 -33
5902 -33 22 -89 87 -86 8 223 54 -107 17 -168 -38 -75 -273 -119 38 -44 94 22 101 107 -194 335 209
5925 209 45 55 178 -97 -9 87 -20 -70 188 220 30 -69 -209 64 -100 -200 105 13 11 133 -14 -77 37
5948 37 118 92 -130 325 -22 -199 -3 -91 -147 213 137 -213 -137 -149 114 18 -10 -44 79 21 -142 197 -164 68
5972 68 255 96 38 175 0 40 108 62 -91 -171 152 -279 -136 107 13 -116 -168 -155 98 -20 32 378 256
5995 256 -40 86 116 -12 -49 -58 -136 -111 -130 -127 154 -88 108 112 10 -20 -340 -38 143 -12 49 108 -61 2 54
6020 54 47 -93 63 179 -217 151 272 -101 -108 -177 -79 -122 -144 -118 226 -202 -190 121 79 73 -13 -73 28 116 -98 2
6046 2 -32 191 53 70 125 89 -7 277 109 -136 102 -108 -52 -6 -94 -16 -49 -28 196 20 -121 81 -21 -127
6070 -127 -303 3 219 -112 -4 35 71 -104 267 81 -17 192 -85 -68 -117 75 113 -35 -54 76 182 -163
6092 -163 -242 44 65 -426 5 -46 -126 97 214 32 146 -11 -152 53 12 -139 -245 -22 -319 -110 -155 34
6114 34 264 9 -59 64 -46 -393 -260 100 -96 -251 143 158 183 6 -201 -328 93 103 133 -13 32 88 -303
6137 -303 109 142 -111 85 120 -95 -151 -87 82 63 39 27 -37 260 96 189 17 61 -62 -61 157 -27 49 68 87
6162 87 139 -135 93 17 -128 79 195 -59 -63 -196 -96 -161 0 174 -48 -86 38 -161 24 -102 -40 274 -130
6185 -130 -28 -32 -7 126 -94 -34 97 -59 176 50 -16 -193 155 59 -143 88 65 127 -43 2 246 258 -93
6208 -93 51 -43 18 -39 -234 55 -238 6 -83 192 7 219 -109 252 -101 54 146 -104 -167 -156 -302 8 -103
6231 -103 -5 181 215 -59 -138 -5 159 -108 33 -31 76 17 -332 -109 97 -215 -46 69 37 -314 -69 115
6253 115 147 134 -203 -79 80 171 8 109 -59 134 381 33 181 40 147 96 -23 -157 -33 348 -171
6274 -171 -92 120 -114 -233 -315 121 -103 -269 32 -200 18 139 -58 -47 22 31 107 -95 289 -24 -67 -294 -44
6297 -44 -36 146 -269 -133 134 113 15 -134 147 -99 24 78 166 92 -16 57 53 9 -43 -82 -165 129 -99 101 189
6322 189 -257 -110 -99 -193 -211 -160 -243 37 190 50 33 188 123 -112 -49 7 -194 -24 83 -83 366 94 181
6345 181 -239 221 -82 -212 -60 93 8 -190 59 -167 -193 48 -76 -143 133 222 126 -83 5 208 -39 -23
6367 -23 143 -84 94 -224 -300 -36 82 75 349 13 175 -83 -150 201 -49 342 -48 133 -66 187 53 63
6389 63 16 5 0 -114 -206 -128 21 57 -118 42 -57 -52 -80 -168 73 153 -192 -277 -201 -89 24 -74 -110 -42 -244 177
6415 177 -31 -41 -15 -67 252 6 -82 53 -18 -36 -104 32 206 209 215 -43 -197 -35 -37 175 -113 -88 -179 -72 225
6440 225 -159 23 -46 -22 -175 -139 -119 -1 -40 211 43 201 -109 -166 -121 -36 245 93 369 -212 -353 -148 -236
6463 -236 152 -366 116 109 -71 -143 243 139 -86 59 -309 -183 -117 9 -37 69 -100 -62 -89 -133 -51 201 -57
6486 -57 -88 -19 138 83 -20 47 -131 308 -67 -164 -7 -147 -174 22 -51 -30 56 -176 -151 -61 97 -226 -262 76
6510 76 113 186 -118 112 -5 -5 54 -370 -256 244 -68 -230 46 35 108 -1 -55 -153 61 -104 -244 -37 -90 -9
6534 -9 -128 -14 -227 -223 -302 -63 -77 -49 -147 129 116 31 -260 -84 35 -104 34 131 23 306 5 -69 199 -61
6558 -61 186 -103 -158 74 50 48 60 -59 161 -303 -183 -32 -58 -156 -63 199 67 30 64 -164 -97 255 95 75
6582 75 173 270 -10 -21 101 74 151 28 47 -60 -41 -15 -263 -39 -123 120 -86 -73 -144 4 96 -227 -61 -145 6
6607 6 -112 98 -73 -275 251 -165 -63 -124 -97 16 55 168 -165 -134 247 -135 27 -250 -192 -32 107 214
6629 214 49 15 67 32 188 279 108 83 -45 138 184 -207 84 135 -243 -73 -40 -9 -60 115 108 -137 22 -156
6653 -156 56 31 -135 -192 88 -101 -128 -167 -212 408 116 19 68 -1 -20 -178 166 0 -151 191 -38 -89 -84 -157
6677 -157 94 132 12 94 -17 19 -109 -151 152 -92 29 -44 47 -79 150 76 124 -10 -142 -25 10 -21 -136
6700 -136 -105 -105 31 51 -99 364 302 62 -199 61 16 47 159 36 140 41 -59 -145 273 316 -250 -228 -34 226
6724 226 -10 -107 63 239 -52 -119 72 64 -22 -60 -63 80 -73 143 -107 -108 49 -139 -32 -52 50 42 217 -344
6748 -344 117 -6 -160 -204 -176 -74 -11 87 -75 205 -172 -67 7 18 -32 31 22 -10 -32 -193 -15 54 171 -68
6772 -68 -79 9 190 -119 -17 248 -47 -45 -301 35 84 81 77 182 -81 -24 132 -113 -46 120 -84 341 1 -146
6796 -146 204 53 43 37 -31 -86 54 -109 -186 -203 -28 130 -87 -221 -68 113 -74 -88 63 -82 -100 -209 175
6819 175 -2 115 128 -66 -113 -164 -130 5 -186 -123 25 -180 150 -57 -176 9 62 -143 131 -36 -21 322
6841 322 38 210 53 -386 99 -99 3 -56 -119 0 87 160 -173 -78 -49 -169 -114 -69 163 -98 24 -31 278
6864 278 -328 141 16 70 -66 -23 83 -76 282 -12 -91 -189 -95 -77 91 -363 -261 76 71 -180 -73 -100 91
6887 91 -30 -381 81 122 118 -80 71 215 280 -143 -72 -100 -135 -217 -108 195 71 -154 -155 -200 146 2 60 -410
6911 -410 -169 -70 -153 -50 231 42 -46 -32 -161 -7 132 25 170 204 -103 -91 -14 -74 53 146 -12 57 21 32
6935 32 34 164 6 -116 -198 -209 -182 18 -277 -140 -118 -76 279 -59 53 131 60 41 58 -156 -222 131 -189 74
6959 74 15 -58 -182 153 178 -52 94 95 -124 149 -301 319 -1 216 28 -70 -110 -183 171 33 -235 -118 -131
6982 -131 68 304 -40 -68 -140 123 -16 92 -62 15 -36 -50 -50 143 -237 -226 336 -263 168 229 -106 -18 70 74
7006 74 -73 -57 47 -223 30 -82 43 289 -108 181 -76 -90 33 -124 196 143 -3 104 28 -201 -147 -9
7028 -9 -94 135 -5 60 -37 -115 -173 -126 167 -58 -140 59 -46 -49 -166 -182 60 155 -309 -72 -9 -190 -77 201 29
7053 29 -120 -50 155 160 -7 -122 -235 52 6 174 -397 -218 -114 188 173 175 -35 1 -75 19 95 -37 57 -75
7077 -75 52 -30 -203 -30 86 106 155 -142 26 -285 222 -47 -104 -186 -122 118 -150 384 -120 8 -115 -64 -65
7100 -65 -24 193 14 -47 -55 54 -352 -201 -98 -151 -59 -388 7 -98 -9 -83 -171 39 9 114 250 -178 -6 160
7124 160 -2 -33 249 168 197 -47 119 182 308 218 149 -195 33 -125 186 -100 -307 134 -11 -140 -168 -228 -309
7147 -309 -72 26 44 -70 27 -59 -178 -245 47 140 -74 -238 -119 154 27 -5 171 -24 -182 -65 158 236 -106
7170 -106 -101 -15 -100 -83 -19 117 -187 232 -141 -38 196 -53 -119 -70 38 28 -45 86 67 8 -25 83 -60 67
7194 67 73 -139 -38 209 -3 -13 181 -32 -161 69 190 16 138 74 182 -34 26 26 -4 177 52 1 -53 310
7218 310 82 -149 176 -41 -258 -182 116 51 141 -207 -164 -118 -27 -99 327 -16 -223 26 -139 181 -211 -265 -178
7241 -178 -227 -143 57 50 -6 -137 -89 -102 -217 -76 165 246 -166 -177 -60 191 -241 98 -95 -5 432 -95 17
7264 17 -271 118 -201 -31 77 146 106 23 -207 -30 41 11 253 240 2 -86 78 178 -122 -104 -168 -127 123 -151
7288 -151 -29 144 137 -145 -80 6 -250 -50 49 82 51 159 188 -25 -6 74 135 20 53 -57 102 163 -114 -29 -58
7313 -58 39 -183 254 -145 225 20 17 44 -108 133 2 213 -7 -109 116 -21 -57 17 -54 -14 3 297 62
7336 62 -438 343 40 -189 -15 101 -113 96 236 -483 -179 -2 -191 -229 -2 -169 -21 154 81 -17 -3 -334
7358 -334 -221 155 -40 27 91 152 323 -175 39 -56 -152 25 38 24 37 63 -13 88 -18 -11 97 244 -104 165
7382 165 123 -153 147 -169 -80 20 -120 -62 101 -99 60 7 37 15 125 -52 -53 -70 67 -141 108 67 -59
7405 -59 106 86 -222 -26 -97 -50 226 63 40 -19 -181 147 -300 -200 -186 -30 310 15 164 212 -31 -65 285
7428 285 50 108 80 -186 229 -214 -104 126 -106 150 8 -28 13 111 -141 -130 261 -59 101 1 -177 -169 86
7451 86 -64 -198 225 -52 -153 -48 -91 206 -160 -290 -62 151 270 -185 247 104 -165 19 -195 279 253
7472 253 -352 -188 -72 -107 -175 -233 -98 -429 -241 -123 -303 267 28 148 15 -128 60 -49 285 -146 -158
7493 -158 -19 69 1 202 -130 69 -263 26 -462 -17 211 44 -91 -78 85 127 -122 -104 -67 -205 36 -104
7515 -104 -113 55 15 -130 87 92 -367 -292 -235 -304 153 277 -28 245 -94 21 -2 -246 304 -36 170 -30 -131
7538 -131 -44 -97 22 39 -138 -202 -96 -285 12 2 -125 -114 107 -77 -127 323 -272 -89 179 198 146 -118 -82
7561 -82 -3 -203 137 -12 24 249 -241 150 263 -4 -44 -8 46 -287 127 173 50 -220 152 -246 283 66
7583 66 22 -97 -163 -127 -200 -2 124 8 168 -45 13 102 -108 191 26 -58 93 90 -27 19 171 3 255 -49
7607 -49 160 319 -27 -227 -1 127 -167 -107 30 74 -231 267 123 -17 -175 -65 72 -18 -76 -166 178 -66
7629 -66 -114 -145 -187 237 94 193 48 -173 172 75 210 191 16 90 372 90 259 132 -404 -72 123 -35 126
7652 126 -55 132 -45 47 99 51 -219 -212 -103 -79 -121 -63 291 -74 -114 51 150 -10 88 80 -38 -12 37 194 2
7677 2 -68 43 536 111 0 247 -185 -91 127 56 -98 -76 91 -24 -47 38 44 175 151 67 -287 -6 -222 -60
7701 -60 -145 -160 -101 192 157 -3 62 -105 30 -264 79 78 -137 99 -121 49 4 -229 222 278 -169 113 116 12
7725 12 -82 70 37 262 228 135 -58 312 -40 -173 -112 -72 142 -32 -54 17 -67 114 18 -90 -33 90 -133 -289
7749 -289 -4 -117 -197 -279 178 1 -29 92 42 -14 52 -17 32 3 369 28 -189 8 32 -111 -117 -263 -243 81
7773 81 -44 28 71 78 15 -269 -53 144 53 71 -15 173 74 87 -109 -375 -13 21 -433 -157 -58 41 26 -60 48
7798 48 214 -15 -137 -21 31 -62 -9 -236 -165 58 -79 121 -110 51 185 -215 -116 177 -60 51 -2 -161
7820 -161 258 111 177 83 46 -201 -96 14 -75 -106 18 209 243 -69 152 133 39 106 -55 24 -165 -135 -102 -115
7844 -115 -59 -40 -38 191 -85 228 -13 119 96 207 -160 24 117 -161 116 266 -52 312 -77 -34 175 -80
7866 -80 -1 -260 105 -25 40 -22 96 203 -32 108 105 -141 130 -227 149 -44 211 -33 162 85 -17 55 -53
7889 -53 26 6 144 75 18 -50 93 142 -51 -87 26 0 273 -167 29 159 -171 230 0 -85 -359 62 175
7912 175 -125 51 -90 67 14 -51 -43 -44 -237 180 -150 -6 84 -71 123 232 120 -138 -57 260 167 -47 -95
7935 -95 -248 5 -28 159 9 122 -7 -63 397 -105 258 -73 48 -57 -126 100 205 -109 91 70 -177 222
7957 222 -158 297 51 -188 -124 80 117 0 43 197 90 158 92 14 58 -151 -237 -115 38 -278 -110 229 -98
7980 -98 -238 166 -11 156 -37 8 -85 -59 122 346 37 -154 -83 37 46 261 32 -23 138 -159 -10 -324 -15
8003 -15 -10 279 56 281 -149 129 -16 -82 -38 -39 -319 -206 -186 104 -39 -16 56 -52 173 159 133 226 -73 60
8027 60 134 -50 -44 -84 132 -95 -69 123 195 128 -217 -30 70 149 20 -316 -150 -35 94 38 25 302 -149 -39
8051 -39 -58 96 -146 124 160 -73 202 -115 93 -154 -59 -285 30 -25 14 172 133 -244 -187 20 -94 -15 -22 -24
8075 -24 -14 -105 74 -91 -111 -23 -284 6 -39 0 -55 1 317 -258 154 71 -293 34 72 -89 3 -82 -51 27 -44
8100 -44 118 143 31 -201 107 -134 -201 125 -129 -255 -95 -4 -175 -63 165 -34 -68 -234 93 -61 163 -87
8122 -87 215 -13 -155 120 18 -148 -164 56 103 -103 -51 100 54 -454 124 -295 -152 57 -43 33 -13 29 -327
8145 -327 243 62 22 -91 88 188 133 152 176 -112 83 -241 129 4 128 5 160 244 47 -171 -228 -90
8167 -90 87 -24 -340 376 100 143 -419 -136 92 68 124 25 131 24 -151 86 -170 89 21 -11 49 235 210
8190 210 79
8191G9
##END NTUPLES=NMR FID
##END=
