##TITLE=1H_Ser BuN
 200.13Hz, CD3OD.
 8 sc
 
 17.4.2026
##JCAMPDX= 6.0         $$ Bruker NMR JCAMP-DX V2.0
##DATA TYPE= NMR FID
##DATA CLASS= NTUPLES
##ORIGIN= UXNMR, Bruker Analytische Messtechnik GmbH
##OWNER= pz
$$ XWIN-NMR		Version 3.5
$$ Fri Apr 17 15:33:21 2026 Russian Standard Time (UT+4h)  she@DPX200
##.OBSERVE FREQUENCY= 200.1313
##.OBSERVE NUCLEUS= ^1H
##.DELAY= (6, 6)
##.ACQUISITION MODE= SIMULTANEOUS
##.ACQUISITION SCHEME= undefined
##.AVERAGES= 8
##.DIGITISER RES= 18
##SPECTROMETER/DATA SYSTEM= spect
##.PULSE SEQUENCE= zg30
##.SOLVENT NAME= MeOD
##.SHIFT REFERENCE= (INTERNAL, MeOD, 0, 14.3821)
##AUDIT TRAIL= $$ (NUMBER, WHEN, WHO, WHERE, WHAT)
$$ ##TITLE= Audit trail, XWIN-NMR		Version 3.5
$$ ##JCAMPDX= 5.01
$$ ##ORIGIN= Bruker BioSpin GmbH
$$ ##OWNER= she
$$ F:/spectra/data/she/nmr/H-C/1/audita.txt
$$ ##AUDIT TRAIL=  $$ (NUMBER, WHEN, WHO, WHERE, WHAT)
(   1,<2026-04-17 15:30:47.14 +0400>,<she>,<DPX200>,
      <created by zg, POWCHK disabled, PULCHK disabled
       configuration hash MD5:
       00 E9 B6 7A A2 85 ED C7 34 08 36 98 17 FE 4E 26
       data hash MD5: 16K
       27 74 83 6F 77 56 49 B0 42 F0 8E B7 62 AB BB F9>)
$$ ##END=
$$ 
$$ hash MD5
$$ 60 F6 19 8B 75 01 D5 90 E5 FE 1A B1 A0 52 06 A8
##$RELAX= 
##$RELAX= 
##$RELAX= 
##$RELAX= 
##$RELAX= 
##$RELAX= 
$$ Bruker specific parameters
$$ --------------------------
##$DU= <F:/spectra>
##$EXPNO= 1
##$NAME= <H-C>
##$PROCNO= 1
##$TYPE= <nmr>
##$USER= <she>
##$AMP= (0..31)
100 100 100 100 100 100 100 100 100 100 100 100 100 100 100 100 100 100 
100 100 100 100 100 100 100 100 100 100 100 100 100 100 
##$AQSEQ= 0
##$AQ_mod= 1
##$AUNM= <au_zg>
##$AUTOPOS= <>
##$BF1= 200.13
##$BF2= 200.13
##$BF3= 200.13
##$BF4= 200.13
##$BF5= 200.13
##$BF6= 200.13
##$BF7= 200.13
##$BF8= 200.13
##$BYTORDA= 1
##$CFDGTYP= 0
##$CFRGTYP= 5
##$CHEMSTR= <none>
##$CNST= (0..31)
1 1 145 1 1 1 1 1 1 1 1 1 1 1 1 1 1 1 1 1 1 1 1 1 1 1 1 1 1 1 1 1 
##$CPDPRG= <>
##$CPDPRG1= <>
##$CPDPRG2= <>
##$CPDPRG3= <>
##$CPDPRG4= <mlev>
##$CPDPRG5= <mlev>
##$CPDPRG6= <mlev>
##$CPDPRG7= <mlev>
##$CPDPRG8= <mlev>
##$CPDPRGB= <>
##$CPDPRGT= <>
##$D= (0..31)
0 0.7 0 0 0 0 0 0 0 0 0 0.03 0 0 0 0 0 0 0 0 0 0 0 0 0 0 0 0 0 0 0 0 
##$DATE= 1776425446
##$DBL= (0..7)
120 120 120 120 120 120 120 120 
##$DBP= (0..7)
150 150 150 150 150 150 150 150 
##$DBP07= 0
##$DBPNAM0= <>
##$DBPNAM1= <>
##$DBPNAM2= <>
##$DBPNAM3= <>
##$DBPNAM4= <>
##$DBPNAM5= <>
##$DBPNAM6= <>
##$DBPNAM7= <>
##$DBPOAL= (0..7)
0.5 0.5 0.5 0.5 0.5 0.5 0.5 0.5 
##$DBPOFFS= (0..7)
0 0 0 0 0 0 0 0 
##$DE= 6
##$DECBNUC= <off>
##$DECIM= 32
##$DECNUC= <off>
##$DECSTAT= 4
##$DIGMOD= 1
##$DIGTYP= 9
##$DL= (0..7)
0 120 120 120 120 120 120 120 
##$DP= (0..7)
150 150 150 150 150 150 150 150 
##$DP07= 0
##$DPNAME0= <>
##$DPNAME1= <>
##$DPNAME2= <>
##$DPNAME3= <>
##$DPNAME4= <>
##$DPNAME5= <>
##$DPNAME6= <>
##$DPNAME7= <>
##$DPOAL= (0..7)
0.5 0.5 0.5 0.5 0.5 0.5 0.5 0.5 
##$DPOFFS= (0..7)
0 0 0 0 0 0 0 0 
##$DQDMODE= 0
##$DR= 18
##$DS= 0
##$DSLIST= <SSSSSSSSSSSSSSS>
$$ [...]
##$SUBNAM0= <"">
##$SUBNAM1= <"">
##$SUBNAM2= <"">
##$SUBNAM3= <"">
##$SUBNAM4= <"">
##$SUBNAM5= <"">
##$SUBNAM6= <"">
##$SUBNAM7= <"">
##$SUBNAM8= <"">
##$SUBNAM9= <"">
##$SW= 18.0517328524113
##$SWIBOX= (0..15)
0 0 2 0 0 0 0 0 0 0 0 0 0 0 0 0 
##$SW_h= 3612.71676300578
##$TD= 16384
##$TD0= 1
##$TE= 0
##$TE2= 300
##$TE3= 300
##$TEG= 300
##$TL= (0..7)
0 120 120 120 120 120 120 120 
##$TP= (0..7)
150 150 150 150 150 150 150 150 
##$TP07= 0
##$TPNAME0= <>
##$TPNAME1= <>
##$TPNAME2= <>
##$TPNAME3= <>
##$TPNAME4= <>
##$TPNAME5= <>
##$TPNAME6= <>
##$TPNAME7= <>
##$TPOAL= (0..7)
0.5 0.5 0.5 0.5 0.5 0.5 0.5 0.5 
##$TPOFFS= (0..7)
0 0 0 0 0 0 0 0 
##$TUNHIN= 0
##$TUNHOUT= 0
##$TUNXOUT= 0
##$USERA1= <user>
##$USERA2= <user>
##$USERA3= <user>
##$USERA4= <user>
##$USERA5= <user>
##$V9= 5
##$VALIST= <valist>
##$VCLIST= <CCCCCCCCCCCCCCC>
##$VD= 0
##$VDLIST= <DDDDDDDDDDDDDDD>
##$VPLIST= <PPPPPPPPPPPPPPP>
##$VTLIST= <TTTTTTTTTTTTTTT>
##$WBST= 1024
##$WBSW= 4
##$XGAIN= (0..3)
0 0 0 0 
##$XL= 0
##$YL= 0
##$YMAX_a= 267694
##$YMIN_a= -371224
##$ZGOPTNS= <>
##$ZL1= 120
##$ZL2= 120
##$ZL3= 120
##$ZL4= 120
##$ABSF1= 10
##$ABSF2= 0
##$ABSG= 5
##$ABSL= 3
##$ALPHA= 0
##$AQORDER= 0
##$ASSFAC= 0
##$ASSFACI= 0
##$ASSFACX= 0
##$ASSWID= 0
##$AUNMP= <proc_1d>
##$AZFE= 0.1
##$AZFW= 0.1
##$BCFW= 1
##$BC_mod= 2
##$BYTORDP= 1
##$COROFFS= 0
##$CY= -3
##$DATMOD= 1
##$DC= 2
##$DFILT= <>
##$DTYPP= 0
##$F1P= 0
##$F2P= 0
##$FCOR= 0.5
##$FTSIZE= 0
##$FT_mod= 4
##$GAMMA= 1
##$GB= 0.15
##$INTBC= 1
##$INTSCL= 1
##$ISEN= 128
##$LB= 0.25
##$LEV0= 0
##$LPBIN= 0
##$MAXI= 10000
##$MC2= 0
##$MEAN= 0
##$ME_mod= 0
##$MI= 1.114404
##$NCOEF= 0
##$NC_proc= 0
##$NLEV= 6
##$NOISF1= 3.799351
##$NOISF2= 2.8
##$NSP= 1
##$NTH_PI= 0
##$NZP= 0
##$OFFSET= 14.38212
##$PC= 1
##$PHC0= -3718.933
##$PHC1= 23.99229
##$PH_mod= 1
##$PKNL= yes
##$PPARMOD= 0
##$PSCAL= 0
##$PSIGN= 0
##$REVERSE= no
##$SF= 200.129724274929
##$SI= 16384
##$SIGF1= 3
##$SIGF2= 2
##$SINO= 400
##$SIOLD= 16384
##$SREGLST= <1H.CDCl3>
##$SSB= 0
##$STSI= 0
##$STSR= 0
##$SW_p= 3205.1282051282
##$SYMM= 0
##$S_DEV= 0
##$TDeff= 0
##$TDoff= 0
##$TI= <>
##$TILT= no
##$TM1= 0
##$TM2= 0
##$TOPLEV= 0
##$USERP1= <user>
##$USERP2= <user>
##$USERP3= <user>
##$USERP4= <user>
##$USERP5= <user>
##$WDW= 1
##$XDIM= 8192
##$YMAX_p= 0
##$YMIN_p= 0
$$ End of Bruker specific parameters
$$ ---------------------------------
##NTUPLES= NMR FID
##VAR_NAME=  TIME,          FID/REAL,        FID/IMAG
##SYMBOL=    X,             R,               I
##VAR_TYPE=  INDEPENDENT,   DEPENDENT,       DEPENDENT
##VAR_FORM=  AFFN,          ASDF,            ASDF
##VAR_DIM=   8192,          8192,            8192
##UNITS=     SECONDS,       ARBITRARY UNITS, ARBITRARY UNITS
##FACTOR=    0.0002768,     1,               1
##FIRST=     0,             0,               0
##LAST=      2.2672688,     0,               0
##MIN=       0,             -371224,         0
##MAX=       2.2672688,     267694,          0
$$ Real data points
##PAGE= N=1
##DATA TABLE= (X++(R..R)), XYDATA
0 0 0 0 0 0 0 0 0 0 0 0 0 0 0 0 8 -8 8 -8 8 -8 16 -16 16 -21 24 -28 32 -37 40 -46 53 -60 68 -77 85 -94 105
37 105 -119 130 -144 160 -178 197 -216 238 -262 289 -317 350 -384 424 -466 518 -569 633 -705 789
57 789 -888 1008 -1151 1332 -1567 1876 -2305 2935 -3931 5686 -9351 19808 -107321 -371224
71 -371224 28053 81772 80905 163223 -154084 -173877 23302 23987 171366 58013 -238490 -57880
83 -57880 89486 -13454 83997 45575 -160527 -50130 58904 -5159 73003 15265 -115564
94 -115564 -9835 -29101 -5184 164642 -35927 -142643 24817 -60404 23435 186028 -56496
105 -56496 -140845 -45174 -21264 151550 102518 -130780 -89673 -57807 12172 213656 46793
116 46793 -209300 -89218 40484 76108 122534 -23473 -156171 -59838 36782 124151 100708
127 100708 -134543 -122364 66968 19067 40036 91236 -86830 -98596 31954 34797 68955
138 68955 26651 -76365 -19991 -14109 -8544 124687 43204 -106506 -37444 -7776 25072 131597
150 131597 27075 -114170 -71553 3647 109260 119018 -57903 -112877 -36852 24396 137883
161 137883 94636 -120767 -119581 22886 75610 101994 23415 -111947 -77260 26334 92082
172 92082 96552 -47014 -112648 145 29420 44279 84943 -35261 -105942 -9699 43757 61330
184 61330 35072 -48385 -45943 -24085 -3931 90339 63370 -78069 -78067 -7254 32184 80132 37406
197 37406 -73988 -86817 -20908 70624 107457 -13555 -114505 -61412 14342 84273 87055 -55308
209 -55308 -122440 -34766 48173 90753 38906 -84435 -96516 -10607 63571 84490 -8293 -97219
221 -97219 -51009 11886 41503 62533 -6946 -88571 -49875 20917 51491 42804 -23529 -62803
233 -62803 -41920 -3321 65369 65775 -45722 -84567 -26306 22837 66049 47572 -46448 -86454
245 -86454 -36351 51395 96286 16721 -85635 -70374 1253 63696 82898 -5247 -94528 -59899
257 -59899 24901 85953 64174 -45141 -88482 -25603 43801 80303 36868 -58353 -68389 -8623
269 -8623 50193 77431 17149 -64898 -53623 7491 54119 60570 6554 -54734 -49918 3851 64345
282 64345 67284 -12241 -65984 -33650 19127 62421 59813 -19682 -70718 -37720 34352 85421
294 85421 40678 -49843 -66314 -18941 45730 83218 24588 -65821 -67479 2022 70886 69830
306 69830 -10952 -70537 -46167 17659 68206 52838 -23614 -71043 -36725 29719 70277 35902
318 35902 -43263 -64415 -20665 34164 64309 24578 -51166 -66498 -13738 49957 61158 -345
330 -345 -60498 -52756 -4612 49028 58629 -7940 -72772 -55256 15151 65063 40815 -32028 -68880
343 -68880 -40961 22089 68113 34353 -50078 -76120 -23197 44448 63064 8933 -58088 -63555
355 -63555 -10899 51482 60858 -6706 -70837 -54309 11387 59329 43436 -23117 -65759 -41120
367 -41120 20350 61218 35629 -35033 -67276 -27427 36526 60546 19110 -43391 -58377 -16568
379 -16568 41944 62634 11348 -56615 -55965 3207 55376 52436 -5665 -55913 -45311 11568 63964
392 63964 50313 -22454 -65104 -30558 34739 62566 30670 -28514 -58650 -23287 44740 68622
404 68622 19262 -48680 -54422 1459 52918 56342 6521 -51575 -48594 11957 63744 50156 -15995
417 -15995 -56311 -31003 23990 59292 38249 -23052 -56877 -25408 37175 61034 23219 -34499
429 -34499 -54987 -13600 44829 56527 12376 -45027 -53624 -1133 52262 52693 -3119 -57870 -45570
442 -45570 15766 56573 40149 -18710 -59870 -37775 26770 62617 26299 -39132 -59245 -16572
454 -16572 35585 48690 16218 -40357 -62337 -10667 49991 48198 -6682 -53414 -43973 3082
466 3082 42884 41617 -11485 -59676 -42748 17322 51837 24827 -26732 -52221 -33418 21837
478 21837 52454 20311 -34659 -59245 -21185 37188 47563 11827 -43091 -60941 -5542 48884
490 48884 44499 -3300 -55139 -47348 9805 51863 42264 -20997 -61580 -30024 26065 53480 24553
503 24553 -30527 -52200 -22998 38219 55461 5286 -35766 -41462 -9741 40236 44928 8902
515 8902 -39019 -50447 10166 51389 32380 -1206 -40096 -39042 12524 51665 43069 -15879 -56245
528 -56245 -22798 29158 53074 29121 -27091 -50897 -18226 41915 60299 9108 -39319 -43351
540 -43351 -4039 51581 50981 -2480 -46852 -40669 18276 55241 31181 -11903 -45850 -31577 27235
553 27235 54135 23664 -27378 -46576 -11425 31116 41307 15830 -28821 -44104 -8394 35008
565 35008 40660 6918 -32773 -42754 -8679 41134 45952 -4588 -49653 -39748 10361 45184 32839
578 32839 -12239 -53929 -41803 25415 59500 17206 -38331 -51885 -16705 34252 44932 6932
590 6932 -42174 -53273 -1190 45875 30692 -8947 -41180 -40871 7245 41833 25342 -16637 -44944
603 -44944 -26618 12226 33705 24922 -18337 -48574 -24744 21688 41259 14194 -27118 -42723
615 -42723 -21428 27186 46075 9200 -36159 -48573 -7581 43463 40118 -182 -45572 -48307
627 -48307 13866 54039 31825 -17865 -54000 -26197 30109 47232 23265 -30141 -53074 -6010
639 -6010 41633 42039 2993 -35090 -30821 2320 35331 37725 -1294 -33812 -26506 9241 37340
652 37340 27436 -884 -29012 -30188 13241 42042 26470 -4532 -35571 -28201 19563 47847 30499
665 30499 -20420 -49337 -12724 36008 45797 17552 -32496 -47880 -1973 47644 46109 -3333
677 -3333 -46928 -35030 17425 49733 30527 -19437 -46835 -19461 29053 41717 13437 -24246
689 -24246 -39176 -10770 30198 35129 4919 -28112 -33310 -2986 27381 27168 3606 -27084 -35036
702 -35036 -2407 29431 28270 -282 -35795 -34730 4814 32687 28300 -7623 -47155 -33348 16797
715 16797 41943 22216 -26776 -52736 -18477 30419 42456 5815 -41871 -45400 -892 37873
727 37873 32047 -9515 -44699 -34155 12131 38527 18470 -19229 -39269 -20865 17979 31062
739 31062 12400 -19269 -37313 -13645 19962 26470 11562 -19645 -36532 -10219 23645 30886
751 30886 9276 -26500 -36091 -4916 30292 35768 3433 -37727 -34176 8410 39734 32116 -9893
764 -9893 -43834 -24294 22956 44014 21569 -22976 -42003 -10255 33884 40903 8049 -31193
776 -31193 -33365 4559 36571 31241 -438 -30997 -24670 13264 34986 23956 -5935 -29323 -17275
789 -17275 15939 32634 21798 -9746 -29433 -13429 17037 33985 20988 -16052 -33388 -10727
801 -10727 24822 37596 12864 -25535 -34642 -3315 34326 36257 -80 -34957 -30926 9368 39703
814 39703 27105 -13253 -39082 -21290 20398 37873 15512 -23437 -37437 -9469 24928 31660
826 31660 5098 -29169 -31087 -2089 25260 25640 -3283 -29716 -26251 -124 25912 23166 -8222
839 -8222 -32244 -24822 5524 29106 18400 -14213 -34569 -22482 12566 32166 13197 -22986
851 -22986 -36509 -14827 19512 32790 5963 -31293 -34914 -5076 27405 29323 -5301 -35592
863 -35592 -28685 4568 32603 22511 -16065 -35447 -19183 13045 32406 14143 -21364 -31515
875 -31515 -11527 18662 30754 6851 -23991 -27014 -5948 22772 29472 1440 -25767 -24213 -534
888 -534 27851 27319 -4391 -27447 -21252 6862 33155 23757 -12124 -29320 -15607 14999 35371
901 35371 17173 -18599 -28656 -8739 23353 35634 7791 -23593 -24421 -1422 29277 31898 -1239
914 -1239 -25877 -20656 5412 32620 25740 -8988 -26148 -15550 12152 33407 18862 -14329 -26335
927 -26335 -11379 17572 33050 10906 -20361 -24120 -5995 21809 30592 2787 -23569 -22462 -2189
940 -2189 25966 26844 -4232 -26030 -22105 3962 30564 20177 -12340 -28468 -18430 11098 31496
953 31496 12918 -19348 -28303 -12248 17175 28764 4538 -23639 -26184 -7394 20933 25686 -3492
966 -3492 -26080 -24507 -2309 25207 20764 -10092 -28465 -22031 6111 27783 12561 -15858 -27471
979 -27471 -16836 10625 27217 8269 -20972 -27263 -10635 16713 26022 841 -23807 -24056 -5915
992 -5915 21903 23589 -5665 -24390 -22526 646 27510 18804 -10626 -25731 -18498 10015 28411
1005 28411 12534 -13877 -25549 -13149 16267 29232 7536 -19436 -23405 -5374 20641 26999
1017 26999 1140 -21988 -18860 499 24977 23655 -5242 -21137 -15929 5662 29394 19100
1029 19100 -10400 -21774 -12290 13495 29252 12261 -12743 -21754 -8391 19789 29547 5314
1041 5314 -18617 -19340 -1084 22838 25202 -187 -19662 -17070 2843 26203 21986 -6409 -22837
1054 -22837 -15083 10437 28399 14597 -13142 -22094 -9224 14377 25765 8387 -16606 -21319
1066 -21319 -5768 17901 24519 838 -20037 -18358 -2682 19810 20927 -5179 -20781 -17871 1010
1079 1010 24537 16005 -10410 -23184 -16596 8821 23856 8285 -14513 -23788 -11861 13515 22895
1092 22895 4990 -19796 -25985 -4892 18351 19478 -4489 -23165 -18442 -617 17775 17703 -8848
1105 -8848 -24252 -15254 3890 22371 11328 -14601 -21426 -12798 9183 21995 5455 -15241 -21630
1118 -21630 -10156 14803 20909 1323 -18060 -20852 -3527 18168 17899 -1916 -19042 -18368 2333
1131 2333 21353 16895 -7382 -22246 -14504 8347 24821 12907 -13398 -20642 -7970 14306 24372
1144 24372 5316 -16140 -18235 -2359 20147 21820 -56 -16661 -14873 2810 21599 15709 -4039
1157 -4039 -14356 -12659 4910 23549 15208 -7358 -16697 -9335 11766 21864 10646 -9323 -16545
1170 -16545 -5964 15034 21759 7625 -12737 -18004 -3103 19357 21861 178 -18172 -15080 1358
1183 1358 21748 17897 -5892 -19915 -14307 8718 23883 10193 -12822 -17901 -9271 12832 21062
1196 21062 2996 -14189 -16299 -5477 14430 17823 -1222 -15242 -16581 -2103 16048 13970 -5059
1209 -5059 -16173 -15417 267 15604 11757 -7191 -18143 -15420 2708 19427 8926 -12927 -20305
1222 -20305 -11899 8167 20932 4201 -14975 -21339 -8683 16440 18253 -4559 -19154 -18680 -1871
1235 -1871 19393 13319 -9707 -19811 -14804 4778 19463 7838 -12564 -18268 -8619 8848 17523
1248 17523 3057 -13042 -14349 -6592 10655 16260 -313 -12268 -12181 -5227 13608 15437 -1869
1261 -1869 -12061 -14394 -1792 18724 14387 -3892 -13401 -15120 4530 23418 12349 -8659 -16846
1274 -16846 -9896 12406 22906 6034 -12990 -16257 -3845 16464 20507 1220 -14756 -13665 1711
1287 1711 21273 16279 -5947 -12792 -8063 4896 20608 11038 -7728 -11525 -7077 8779 19121
1300 19121 6227 -7404 -10879 -6164 10122 18048 4497 -7976 -12921 -5717 14515 18299 939
1313 939 -11799 -13685 -1881 17321 15994 -3280 -15488 -14005 3752 20570 10669 -9370 -17013
1326 -17013 -10280 9902 20180 3485 -13963 -14768 -5241 11892 16376 -2250 -15441 -12550 -1667
1339 -1667 13415 11028 -5889 -13761 -11600 22 13438 7208 -7156 -12861 -11789 1711 14326
1352 14326 6231 -8997 -15098 -10270 5521 14598 4035 -11396 -16592 -8205 9774 16036 -717
1365 -717 -15340 -15423 -3854 14832 14376 -5877 -16534 -12948 2357 17399 9096 -9760 -16423 -9223
1379 -9223 8388 16915 3363 -11535 -13311 -4450 11175 14514 137 -11673 -10331 -1117 11428
1392 11428 13357 -1148 -11556 -8857 874 13485 11833 -2601 -10530 -8256 3356 16420 10499
1405 10499 -4559 -11816 -7633 7666 17973 7542 -8309 -12807 -3127 12544 17394 3190 -12066
1418 -12066 -11270 1264 16057 15098 -2324 -12965 -7834 4432 16693 11544 -5836 -11961 -5794
1431 -5794 7992 15311 6778 -6991 -11100 -3152 9377 13771 3803 -8802 -11053 -2202 9629 13290
1445 13290 1357 -11311 -9875 -696 11850 12297 -2968 -13092 -9822 2131 13747 9171 -6579
1458 -6579 -14411 -8607 6525 14025 4929 -10217 -14571 -4793 8811 12189 1501 -13828 -13776 -420
1472 -420 9971 10848 -3488 -14568 -10010 1272 9902 7652 -6381 -13730 -8568 2677 11416 5280
1486 5280 -8624 -13540 -6486 5456 11097 3049 -9531 -13768 -4141 7935 11125 660 -12424
1499 -12424 -12259 -288 9695 10219 -2552 -13778 -9169 2400 12044 9371 -6110 -13258 -6400 6055
1513 6055 13544 5720 -8998 -11892 -2823 8849 12323 3126 -9625 -10487 571 10662 11305 471
1527 471 -10573 -7551 2723 11568 10867 -2372 -10330 -5832 4375 13133 9150 -4897 -10690 -4299
1541 -4299 7995 13652 5451 -6572 -9480 -1674 9844 12324 4042 -8548 -10122 1606 11174 11376
1555 11376 58 -11428 -6448 4006 11402 10432 -4031 -11337 -4868 4965 13239 6992 -7699 -9561
1569 -9561 -2770 7614 11632 2346 -7784 -9935 -2450 9070 9414 557 -10014 -10488 1749 9461
1583 9461 8006 -1739 -11349 -6930 2059 8122 7334 -6274 -12949 -5576 4003 10619 3936 -9796 -11240
1598 -11240 -3539 5168 9172 398 -9962 -11195 -2721 7943 8190 -1837 -11699 -10683 1693 8596
1612 8596 5816 -4285 -12578 -7626 3460 7851 6008 -6944 -12858 -3334 4559 9239 3294 -9331
1626 -9331 -10164 -2048 5275 9538 1140 -9789 -9175 -366 8361 8712 -1538 -10067 -7620 2389 9423
1641 9423 7606 -2623 -10583 -5539 4692 10483 6985 -5746 -10277 -1531 7074 10824 4032 -7931
1655 -7931 -7985 913 8402 10422 1849 -8904 -6864 3119 10357 9026 -1006 -8879 -3978 4791 9449
1670 9449 7591 -2491 -9055 -2614 6271 10644 5984 -6208 -8092 -281 6820 10397 3293 -7070
1684 -7070 -7326 128 8666 9884 788 -8928 -7164 2963 9531 7077 -1710 -9719 -5637 4763 9301
1699 9301 6562 -5529 -11274 -2286 6125 8479 2928 -8884 -9206 9 5836 7780 -596 -9720 -7206
1714 -7206 -51 6683 6593 -2775 -9460 -6504 1346 6910 4816 -4051 -10226 -5662 2447 7031 4280
1729 4280 -6374 -11678 -4400 4619 7734 1153 -9295 -9513 -2117 5018 7778 -504 -10815 -8640
1743 -8640 558 7551 6297 -3675 -11050 -6288 3309 7673 4172 -5478 -10170 -3529 5260 7762 2394
1758 2394 -7670 -7563 -680 5297 7177 705 -7098 -6279 -48 6359 7035 -647 -6517 -5721 1510 8158
1774 8158 6570 -1683 -7705 -4734 4389 8355 5993 -2954 -8675 -2201 5853 9567 4879 -6320 -7566
1789 -7566 1263 7245 9671 964 -7510 -4453 1586 9006 8820 -2193 -7273 -3289 4738 8945 4311
1804 4311 -2444 -5878 -2831 5523 8578 3715 -3878 -7146 -69 6261 7030 3144 -5490 -6318 100
1819 100 5134 8088 1120 -7909 -5200 820 7098 7170 -2390 -7363 -4848 1696 9496 5026 -5762
1834 -5762 -8357 -3740 5083 7846 1992 -6508 -9280 -2105 6427 6201 -1635 -8617 -6703 385 5013
1849 5013 4372 -2563 -9074 -5553 909 5510 2875 -4562 -7639 -2865 1420 4925 2801 -4235 -7422
1864 -7422 -4878 2938 6349 416 -6851 -6589 -2395 3472 5945 -40 -7286 -8101 -354 6963 5679
1879 5679 -3166 -8535 -4908 2927 5716 3885 -3464 -8104 -3006 4094 7727 1503 -6449 -6553 188
1894 188 4317 6151 628 -6224 -5333 1675 6610 5367 -1676 -4847 -2659 1851 6303 5732 -882 -5244
1910 -5244 -2158 4191 7834 3286 -2054 -5666 -1864 4631 7731 4191 -3358 -6923 650 7703 7382
1925 7382 1985 -5961 -3881 1538 7136 7742 -986 -7984 -3942 5350 8284 4457 -3697 -4116 -2018
1940 -2018 3648 7211 3529 -5225 -5995 -233 5160 5485 -656 -3753 -4458 -234 5365 5865 -230 -5960
1956 -5960 -5065 1007 5124 3274 -675 -5971 -4093 -80 5833 4872 -3857 -7676 -3003 3570 4991
1971 4991 1590 -5131 -6686 -2639 4672 5928 -960 -8148 -6124 346 4524 3138 -2146 -6582 -4678
1986 -4678 1564 5270 2482 -5511 -7646 -2679 2412 4034 616 -3611 -5615 -3349 3376 4993 -106
2001 -106 -5825 -5339 21 3071 2984 958 -4915 -6117 181 5246 4722 -1841 -6774 -3366 1938 5468
2017 5468 4266 -2186 -6430 -3497 4021 8273 1492 -5536 -4504 -145 5161 5088 1265 -3562 -5285
2032 -5285 721 7140 4808 -482 -4480 -2634 3172 5118 4652 182 -5825 -2278 4658 6479 3143
2047 3143 -2868 -4102 335 3508 6024 3127 -3292 -4594 -52 5792 5803 -50 -2592 -3162 564 5764
2063 5764 5743 998 -5205 -4743 3612 6914 2645 -2005 -5094 -1804 3517 5057 3421 -3264 -7171 -336
2079 -336 5476 4421 -226 -4249 -3602 -235 3153 4429 -63 -5908 -5527 1458 5090 1914 -2163 -4921
2095 -4921 -3969 1215 4381 2566 -3286 -7185 -2579 3299 3436 -117 -4036 -5642 -2567 2796 4446
2110 4446 -353 -5960 -5932 417 4247 1627 -1401 -4729 -5552 269 4794 2725 -3001 -7158 -2970 3639
2126 3639 3222 887 -2465 -5553 -2726 3097 5259 774 -5499 -4473 871 3716 2401 -421 -2726
2141 -2726 -4447 -294 5611 3725 -1546 -5103 -3031 3305 4461 1788 98 -4555 -3363 3876 5486
2156 5486 2328 -3003 -4773 796 4456 4092 1686 -2433 -4158 610 5980 5013 -795 -3391 -1676
2171 -1676 2199 5137 3537 511 -3689 -3381 4090 6514 2029 -1788 -3468 -141 4351 3923 2891
2186 2891 -1399 -5421 26 6029 4672 -238 -3567 -2074 1177 3141 3644 776 -4090 -4225 1764
2201 1764 6130 1881 -2386 -3485 -2167 2207 3463 2264 -1517 -6004 -2146 4919 3958 -383 -3936
2216 -3936 -3995 -344 2231 3193 95 -4893 -5110 613 4408 1581 -2899 -3833 -3851 -223 3677 1877 -2599
2233 -2599 -6025 -3779 3687 3177 -1092 -2269 -4481 -2329 2236 2948 546 -4771 -5762 650 3702 956
2249 956 -1542 -3482 -3589 -875 3528 3227 -2263 -5431 -2940 2738 4238 163 -2431 -3381 -2692 1954
2265 1954 4219 901 -3534 -4789 216 4405 2038 -205 -2363 -3414 265 4479 3724 -652 -4190
2280 -4190 -1796 2664 3592 1746 -478 -2562 -2327 2367 5450 2723 -2424 -3226 707 3733 3635 1214
2296 1214 -1284 -3132 -567 5193 4829 -118 -3404 -1993 2827 4571 2107 180 -2338 -3012 2629
2311 2629 5981 2371 -2365 -3233 46 3264 3219 1853 -1138 -3579 -1000 4119 4521 -324 -3223 -2130
2327 -2130 1077 2881 2342 78 -2575 -3474 752 4994 1765 -2620 -3059 -1940 1376 2824 835 -1384
2343 -1384 -4604 -2721 3556 3761 -609 -3682 -3693 38 1785 2222 507 -4276 -4557 387 3600 1479
2359 1479 -3168 -3860 -2171 79 2586 1506 -2330 -4278 -2712 2115 3261 -1168 -2981 -2758 -1792 1294
2375 1294 2572 457 -3027 -4884 -444 3580 1423 -1576 -2993 -2544 -179 2622 2978 -1396 -4532
2390 -4532 -2745 2278 4025 819 -2239 -2542 -1252 1953 3894 1284 -2935 -3619 186 3955 2912
2405 2912 -715 -2108 -1445 -6 3208 3759 -452 -3153 -1222 2644 3657 1346 -626 -1583 -1141 1798
2421 1798 4600 2230 -1818 -2462 146 3613 3244 932 -1342 -1852 -373 3440 4521 788 -3769 -2134
2437 -2134 2387 3804 2125 -648 -1781 -2240 1305 4787 2445 -2254 -2949 133 3207 2921 365 -1704
2453 -1704 -2359 -842 2305 3203 -180 -3320 -2264 831 1923 1446 -411 -2224 -2341 178 2825 1939
2469 1939 -2392 -3318 -1097 727 1799 787 -1618 -3691 -2573 1401 3059 159 -3226 -3103 -9
2484 -9 1679 2057 -190 -3103 -3498 -753 2851 1816 -2482 -3957 -1897 912 1904 1207 -1568 -4079 -1155
2501 -1155 1343 2556 -293 -2948 -2678 -102 814 1967 285 -2169 -2676 -589 1999 1792 -1083 -2747
2517 -2747 -1639 -560 1794 2326 -1254 -2973 -3037 1034 4437 463 -1748 -2385 277 2914 2934 1790
2533 1790 -1598 -3009 362 3388 2690 168 -1913 -1734 644 3085 2237 -197 -1652 -1926 2029 2738
2549 2738 1802 -1455 -1208 -88 1923 2614 2423 -805 -2099 318 2606 2983 466 -682 -1418 182
2565 182 2671 3035 405 -1977 -1708 988 2943 1722 -101 -1798 -1525 980 3535 2180 -1300 -3186
2581 -3186 -415 2343 2659 227 -1864 -2157 -642 2234 2589 -235 -3137 -2254 764 2024 1080 -1500
2597 -1500 -1715 -1800 -461 2126 1443 -1855 -2814 -1730 1051 1621 -413 -1348 -3074 -1687 1566 1558 147
2614 147 -2625 -3146 -306 1093 1229 -433 -2938 -2598 -424 1776 1285 -1887 -2977 -1753 162 1913
2630 1913 686 -1960 -2704 -1983 1374 2583 -502 -2571 -2037 -513 1698 1089 11 -1573 -2505 181
2646 181 2222 1339 -818 -2068 -1249 811 1690 1512 -116 -2222 -1245 1056 2759 1478 -1071 -1404 -195
2663 -195 1549 2707 741 -971 -1327 75 2605 2493 759 -1740 -1255 1038 2294 2458 177 -1774
2679 -1774 -1319 2069 2993 1390 -734 -1080 -317 1551 2689 1551 -1023 -1171 -93 2487 2482 440 -1230
2696 -1230 -1058 55 2300 2368 -75 -1466 -1367 1042 2323 1163 -540 -1399 -1206 554 2240 1110 -1330
2713 -1330 -2121 -1062 1389 2379 -195 -1661 -1862 -724 1428 1413 -574 -2087 -2279 73 1778 1135 -1120
2730 -1120 -2021 -1620 -176 1328 866 -1507 -2506 -1456 766 1719 -209 -1730 -2105 -1222 759 1384 -492
2747 -492 -1908 -2485 -515 1547 905 -846 -2142 -2068 -120 1441 831 -1132 -2267 -1209 454 1341 507
2764 507 -1168 -1911 -1175 811 1825 121 -1815 -1604 -543 1377 1680 -36 -1414 -1697 -133 1752
2780 1752 1511 -618 -1636 -1052 1040 1845 1232 -526 -1446 -624 1214 2344 1099 -650 -980 -312 1785
2797 1785 2610 527 -871 -1119 166 2146 2043 33 -716 -518 707 2399 1898 60 -1340 -580 1303
2814 1303 2424 1181 -527 -1013 -134 1539 2209 699 -935 -1169 220 1827 1922 -122 -1000 -688 -282
2831 -282 1501 1906 -247 -1598 -946 395 1954 1066 -1195 -1509 -891 682 1679 303 -1401 -1882 -643
2848 -643 937 1564 -382 -1508 -1502 -451 1155 1287 -774 -2159 -1401 -399 1149 907 -1077 -2010 -1216
2865 -1216 -296 1384 231 -1948 -1798 -772 176 1042 57 -1675 -1688 -855 531 968 -527 -1643 -1542
2882 -1542 -399 901 622 -670 -1578 -1060 -101 1071 720 -826 -1870 -833 316 1091 658 -1368 -1377
2899 -1377 -453 875 1813 517 -1456 -955 78 1292 1528 -302 -986 -610 547 1826 1660 -47 -862
2916 -862 -417 941 2009 1227 -435 -1078 -125 1246 1927 1055 -938 -702 278 1314 1654 707 -796 -824
2934 -824 403 1570 1499 -1 -1047 -442 860 1638 1458 -110 -943 -202 1055 1691 1074 -837 -1149 -63
2952 -63 1112 1644 665 -1059 -1137 -10 948 1336 -148 -1045 -1120 347 1195 744 -458 -1509 -953 302
2970 302 1226 597 -628 -1857 -671 727 1211 393 -1105 -1894 -427 470 1007 -354 -1491 -1741 -417
2987 -417 808 488 -642 -1577 -1337 133 527 327 -757 -1956 -987 275 677 78 -1366 -1807 -535
3004 -535 453 790 130 -1580 -1386 66 733 658 -379 -1778 -1203 478 824 763 -343 -1028 -712 215 920
3023 920 454 -379 -1391 -358 816 926 638 -824 -938 -68 935 1442 402 -787 -1339 314 1192
3040 1192 1270 280 -816 -754 843 1138 1004 325 -947 -330 1233 1382 1163 -116 -582 226 1145 1164 489
3059 489 -596 -751 279 1522 1472 22 -525 -441 603 1806 639 278 -529 -645 1124 972 496 76
3077 76 -981 10 859 970 1047 -492 -1172 -142 829 967 333 -1039 -1197 -410 1088 974 -530 -1030 -955
3096 -955 52 1293 113 -707 -1354 -1285 710 649 -180 -587 -1700 -562 672 104 -319 -1360 -1451 -153
3114 -153 230 378 -143 -1492 -1153 -120 553 369 -762 -1236 -1049 -94 709 80 -496 -1352 -1326 299 893
3133 893 14 -848 -1456 -333 563 618 -76 -807 -1049 -409 647 801 -302 -1312 -513 135 1050 508 -854
3152 -854 -691 -635 294 939 412 -459 -1038 -235 1299 854 123 -322 -633 299 784 992 380 -259 -171 455
3172 455 1231 1276 47 -364 -261 569 1647 775 -82 -468 -586 1028 1148 714 -99 -766 235 1239 1240
3191 1240 453 -436 -589 724 1077 919 204 -537 -425 425 1164 839 -376 -447 -434 311 1339 34 -419
3210 -419 -607 -481 392 851 156 -620 -865 -56 630 304 6 -947 -1276 -166 428 640 -233 -1196 -778 -279
3230 -279 351 422 -835 -885 -804 -160 748 9 -1063 -978 -615 495 301 -361 -1000 -1100 -541 315 213 -449
3250 -449 -1228 -648 198 367 168 -489 -1127 -512 -13 761 168 -867 -918 -240 336 908 93 -617 -546 -499 533
3271 533 562 -399 -477 -760 173 552 310 -118 -834 -423 415 836 686 -314 -750 98 818 967 769 -139
3291 -139 -467 47 956 1134 188 -488 -228 367 718 742 282 -273 -232 399 1080 854 -2 -473 -228 735 896
3312 896 592 -252 -530 103 621 1027 375 -302 -355 202 707 773 342 -393 -334 458 518 787 -14 -504 -103
3333 -103 257 675 381 -179 -866 -521 411 626 79 -530 -793 -254 407 406 212 -772 -770 -224 509 501 -189 -1002
3355 -1002 -1078 -694 78 15 -276 -620 -1068 -416 178 -562 -933 -1345 -653 -472 426 -69 -683 -1112 -506 442
3375 442 390 -396 -928 -1028 -314 326 36 -405 -637 -688 -25 356 -56 -555 -1161 -270 103 394 210 -679 -884
3396 -884 -339 306 346 111 -508 -877 -237 443 381 245 -571 -250 30 686 562 108 -390 -165 481 901 816
3417 816 115 -433 37 828 878 497 -78 -515 -14 905 542 296 -113 -268 453 1192 815 398 -656 -71
3437 -71 564 920 273 -1020 -218 231 1361 734 196 -571 -784 399 464 899 41 -276 58 462 399 434
3457 434 344 -388 -610 243 422 399 -61 -503 -436 156 526 313 -413 -806 -387 227 244 96 -488 -682 -289
3478 -289 349 347 -158 -683 -962 -2 74 66 -341 -887 -743 44 80 122 -427 -940 -440 240 549 168 -185 -865
3500 -865 -574 222 6 -176 -582 -974 -459 -149 125 14 -831 -637 -17 27 224 -66 -756 -424 268 332 378
3521 378 -271 -778 -431 178 482 328 -325 -268 -493 550 552 354 -187 -395 275 738 271 77 -366 -167 253
3542 253 494 528 102 -55 14 292 655 395 -491 -55 -257 713 883 246 -168 -209 -362 1086 579 187 -83
3563 -83 -305 470 905 400 304 -390 -32 739 441 395 -233 -389 91 432 684 352 -351 -4 -71 556 532 -127
3585 -127 -294 -489 -120 692 288 15 -303 -518 226 357 41 112 -279 -515 175 299 11 -347 -756 -612
3605 -612 -43 349 -212 -939 -543 -436 97 276 -186 -651 -907 -136 101 186 -618 -708 -659 -98 179 -293 -456
3626 -456 -482 -446 206 348 -123 -523 -482 -315 222 367 -1021 -789 -1142 -58 107 -83 -575 -205 -909 -446
3646 -446 432 75 -21 -1065 -245 -1 308 316 -487 -563 26 547 653 112 -441 -168 78 515 660 27 -246
3667 -246 -89 -42 896 740 -208 520 66 274 966 72 -117 -111 283 617 1361 378 419 -636 260 348 -1
3688 -1 -161 -34 174 341 672 299 38 -127 -277 166 526 329 266 -83 35 491 597 -52 -71 -216 -158 291
3710 291 513 88 -37 -506 164 588 184 -65 -561 -304 -293 449 107 -18 -505 -394 -269 227 -180 -231 -452
3731 -452 -270 -172 55 -53 -239 -548 -176 150 -103 -102 -511 -680 -65 -84 176 -306 -786 -393 -243 598 220
3752 220 -194 -462 -457 -5 344 7 -415 -505 -467 119 136 26 -379 -617 -360 94 -160 -28 -505 -43 561 180
3774 180 372 65 -312 -37 -29 245 447 -334 17 -32 -288 976 418 -185 95 -679 -71 -160 259 -142 99
3795 99 247 454 490 -303 -719 419 394 371 1046 -342 -571 161 591 265 322 67 81 -161 493 -226 201
3816 201 -224 -340 329 147 38 224 137 -154 -524 743 517 -55 240 -216 185 507 684 -142 -415 -135
3836 -135 26 250 92 -42 -556 127 202 3 -250 -656 -740 -162 199 228 -512 -509 -377 -285 110 -158 -323 -681
3858 -681 -391 37 255 -60 -557 -617 -279 -29 46 201 -316 -368 -244 152 -161 -331 -318 -555 120 125 -109 -325
3880 -325 -736 -308 -22 234 94 -173 -610 -290 -172 182 175 -263 -390 -363 18 532 -90 -321 -318 80 118 337
3902 337 -77 -95 -435 -8 248 237 -141 -135 63 145 467 189 -46 -133 24 355 216 199 -188 13 242 610
3924 610 282 115 146 -208 332 529 625 196 2 -13 159 480 95 167 -351 28 601 -645 -152 -307 -409
3945 -409 820 35 849 -194 -563 -634 -10 513 168 -126 321 -89 244 709 -159 -314 -202 -230 -12 254
3965 254 229 -301 -331 -10 -163 165 -191 -269 -484 -474 181 -144 79 -458 -165 156 -8 -35 -169 -11 -287 -46
3987 -46 203 30 -527 -256 -324 -305 107 -76 -320 -633 -42 81 191 -181 -499 -488 -314 263 27 -44 -227 -411
4009 -411 -28 318 -145 -401 -214 -389 7 -212 -4 -243 -441 -104 -29 403 -530 267 -394 137 -170 112
4029 112 -256 -152 -328 340 575 88 -68 -358 68 160 837 443 839 -367 740 258 -20 211 94 -367
4049 -367 68 630 485 130 240 -170 433 806 595 -53 28 22 68 141 381 22 -266 269 280 431 81 150
4071 150 -176 98 356 654 216 -187 -14 103 436 182 67 -5 -200 -292 291 332 21 -321 -71 -95 133
4092 133 252 -559 -238 -182 -179 434 -29 -507 -85 -143 221 219 -193 -283 -373 -133 -8 63 -232 -393 15 -38 -156
4115 -156 -253 -66 -470 -304 -17 253 -140 -684 -504 -135 -224 -49 -381 -86 -429 -96 228 5 -541 -118 -187
4136 -187 1 -264 278 59 -609 -442 -79 124 -196 -253 -40 44 -155 51 167 -114 -137 -32 182 613 -274
4157 -274 -114 -66 -94 439 170 -153 -150 32 351 552 103 -137 -253 -33 -180 639 46 -124 -225 11 616
4178 616 540 -93 -8 166 156 244 625 177 84 -49 205 480 228 298 120 65 31 477 286 52 -442 -37 -80
4201 -80 201 254 -117 -136 -416 -274 370 114 -321 88 51 442 13 -174 -430 -240 -79 226 243 -160 -362 -81
4223 -81 300 223 -208 84 -328 -307 318 -37 45 -647 -598 -31 -60 -255 51 -160 91 -564 -83 236 -394 -270
4245 -270 -291 59 -26 -135 89 -198 -501 -37 219 -135 -396 -214 -78 -244 -209 -103 -30 -336 -52 191 140 -79
4267 -79 -345 -184 291 -46 127 193 49 -60 -3 504 180 -363 -74 192 280 185 166 74 -441 -117 413 117
4289 117 257 -20 25 -1 46 695 77 -55 -247 301 477 -25 -102 43 132 67 221 426 -1 -105 90 455
4311 455 354 29 98 189 -9 4 222 370 78 -357 330 188 97 -23 151 53 -15 177 409 -53 -364 21
4333 21 469 235 -21 -288 -25 -192 158 175 259 -197 -549 92 239 97 -161 -224 -622 -11 -154 -91 -210 -211
4355 -211 -211 -44 -83 -97 -286 -583 -133 69 280 -204 -665 -358 -65 -44 -324 -113 -84 -211 -213 168 126 1 -319
4378 -319 89 -88 -242 -64 159 -106 -257 12 283 42 -407 -166 47 114 -105 67 -262 -447 -3 268
4398 268 182 -159 -45 -69 161 83 53 276 -240 -256 405 135 213 50 -89 205 91 9 283 44 -1 64 415
4421 415 330 311 -337 176 248 35 290 130 -211 -385 367 348 210 55 72 107 18 51 234 193 34 -146 516
4444 516 501 -4 -231 356 347 -118 97 374 250 -125 104 322 -111 -346 -225 -52 -69 -86 334 187 -98 -63
4466 -63 -67 255 -109 -142 -349 -109 -86 143 -66 -386 -171 100 322 -130 -32 -42 -219 -167 -252 -72 -93 -348 -334 96
4490 96 93 0 -329 -47 -83 -162 23 -113 -496 -79 37 422 -41 -248 -163 -406 -350 193 87 -223 -371 -120 -90
4513 -90 -129 -15 -138 -118 -264 12 357 178 36 -220 -32 256 103 55 -290 -5 -124 294 457 4 -304
4534 -304 28 175 32 -64 72 141 -114 249 204 300 -195 -302 233 156 153 344 -84 89 95 400 463 139 -176
4557 -176 322 75 379 141 0 125 -146 244 507 287 35 -198 178 183 144 66 264 -289 -157 38 175
4578 175 83 -160 9 136 -18 -27 165 -570 -89 89 278 139 -281 -258 138 -145 156 335 -222 -228 -150 410
4600 410 -194 -302 -347 -21 31 -38 -198 -107 -333 -385 295 36 32 -382 -351 60 -65 101 103 -379 -320 -436 -62 24
4624 24 48 -240 -13 -7 119 24 22 -523 -97 -98 -151 93 115 -180 467 -333 75 -45 -62 -256 -107 155 246 32
4648 32 26 -66 65 82 398 128 -107 183 -136 291 -152 96 290 -452 -115 504 286 108 -95 48 362 62
4670 62 171 21 -92 -73 -22 196 298 4 -271 409 388 174 246 172 -9 9 247 547 -17 -109 119 87 200
4693 200 91 -30 101 -85 62 452 128 -121 -117 475 161 17 -16 -55 -121 -146 -247 496 -276 -243 -233 333 73
4716 73 75 182 8 -372 26 -135 148 -402 -517 95 152 -130 47 -239 -343 -326 300 -33 -349 -360 -351 175 -87
4739 -87 -44 -106 -82 -169 69 196 -142 -266 -23 41 134 85 71 -188 -284 -254 369 -53 -26 -207 51 123 -107 46
4763 46 13 -721 -156 116 188 -140 -145 -195 -33 366 128 139 -55 -339 0 130 136 -5 -121 96 138 90 326 251
4787 251 -2 47 453 390 244 -1 239 -79 316 380 231 73 53 37 197 192 65 255 142 195 106 90 100 -133
4811 -133 17 149 287 300 64 19 -16 51 392 -12 -289 -186 -138 -82 -82 57 281 -131 45 163 -57 -230 7
4834 7 -262 172 283 -238 112 -422 85 -162 123 238 39 -252 -123 195 113 -19 35 -196 56 -88 -19 269
4856 269 81 -155 -202 192 -214 -78 -198 -181 -105 -22 315 -132 -399 180 -186 223 -74 -110 -212 -101 -149 172
4878 172 79 -138 -117 -107 34 -191 -59 17 6 -105 231 149 113 98 -260 139 -1 -68 27 -231 -359 62 200
4901 200 48 -362 -541 186 496 444 -143 -89 -445 215 16 448 164 -38 -401 393 -42 222 309 96 138
4922 138 375 555 90 -58 329 125 258 117 126 123 -93 5 300 469 193 -53 99 -106 91 -242 147 111
4944 111 -20 343 211 239 -100 -197 -146 224 274 -38 -5 -228 -134 -21 338 6 -65 -505 -195 154 27 -261
4966 -261 179 -378 -292 605 257 -292 -533 -92 -33 292 -247 92 -833 318 609 -556 -878 305 -99 634
4986 634 163 125 34 -504 -798 -96 44 232 -178 11 -24 215 -295 -109 99 93 -344 364 188 -417 76 -86
5008 -86 -147 -244 -62 205 180 -37 270 -86 -124 -198 109 70 -191 -25 1 21 -128 -82 58 154 144 -102 5 267
5032 267 271 338 113 110 86 115 181 137 48 37 -185 271 160 361 389 -56 253 220 258 444 178 141 -34 268 164
5057 164 179 111 -131 293 -28 477 -42 -114 -231 58 -153 -18 128 -164 26 -226 108 -61 -34 -161 -42
5078 -42 20 11 -15 177 -144 -56 -73 103 183 -139 -127 -118 86 72 61 88 -213 41 -6 65 -79 -108 -238 -93 55 60
5104 60 386 -510 -475 240 -447 -381 -339 -129 625 406 257 -41 -143 -157 -806 111 139 -459 55 152 -304 12
5126 12 288 239 -339 -125 -183 -273 324 -396 -238 -52 212 -191 -173 -191 -309 98 129 316 95 -103 -30 -102 -103 -45
5150 -45 173 8 96 93 358 192 -274 115 98 115 241 -21 179 123 23 3 248 -1 -50 188 -128 98 271
5173 271 215 2 27 -209 225 243 161 132 -10 343 145 -75 33 -56 -153 147 225 413 -49 -4 31 8 193 -69
5197 -69 12 -99 49 350 370 37 -286 -23 67 128 141 177 140 29 -106 -35 -130 -177 213 111 42 17 -236 -143 -79
5222 -79 143 36 337 -118 -307 -61 213 -148 -198 -230 -123 -198 99 -106 -16 -97 -137 38 -226 -39 -440 -192
5244 -192 -64 -113 -82 -52 42 -69 -71 58 237 -288 -228 0 -184 53 -129 -314 -296 -237 112 -179 155 112 48 102
5268 102 194 195 -12 203 210 -128 -57 -5 123 -76 -145 31 -23 -102 149 211 -181 -322 53 392 279 48 -42 -28
5292 -28 132 345 122 -191 153 84 341 242 55 -108 22 -33 143 279 122 -152 104 -32 54 -210 47 232
5314 232 22 225 249 316 -263 20 -21 169 56 301 118 -24 34 136 -173 -36 50 181 -74 207 -11 -223
5336 -223 241 30 92 87 126 -270 -15 -1 117 289 -247 -49 290 -15 120 90 3 -275 11 -146 75 -80
5358 -80 -256 -199 12 95 19 -91 -399 -124 -113 -77 -196 12 -157 -287 69 20 116 -180 -274 -170 303 -88 -137
5381 -137 109 -253 33 -40 131 410 -21 -380 -142 -98 -46 -124 6 30 -9 -77 5 57 -14 253 -320 -111 320
5404 320 -196 -74 32 230 419 -120 -165 252 147 125 362 54 104 301 224 166 183 398 65 -13 228 -163
5426 -163 -64 271 15 -136 59 291 184 12 -120 -127 447 190 36 81 157 -70 -23 148 296 -61 98 129
5448 129 -28 180 -59 83 123 -114 64 191 -99 -52 -202 -148 -55 153 -218 279 -328 -183 76 -63 -226
5469 -226 22 116 -49 159 70 -408 42 -173 -209 107 -49 -368 4 -10 -3 115 -256 -106 -250 10 -317 78
5491 78 -386 -4 -240 118 -69 -262 -91 -156 -107 -98 25 -71 181 121 104 27 163 -36 -220 -134 337 202 1
5514 1 -200 36 -133 -261 -119 -133 -342 -76 -201 214 162 154 122 -52 178 75 107 -26 -2 -72 51 41 214 71
5538 71 -18 -110 59 50 286 -36 40 -256 72 116 142 295 208 342 198 228 -12 122 -46 1 160 72 -54 88
5562 88 92 29 402 224 -250 -65 133 69 34 170 -52 -170 487 -36 -221 79 17 -130 196 29 -2 -8 60 -62
5586 -62 166 -1 -113 -13 80 1 127 -40 -41 85 175 -26 -252 40 -142 -211 -39 -293 -6 -239 -137 -81 -373
5609 -373 47 -171 -73 -19 -189 -81 128 165 -178 -248 -165 -67 -51 4 65 21 -208 -271 94 82 -80 44 87 22 -112
5634 -112 -36 -30 273 -59 190 -65 184 -167 -34 17 -5 -184 125 368 -108 87 97 99 -58 22 -33 102 155 -105
5658 -105 71 354 -140 -16 270 44 -5 124 -215 30 366 29 398 -109 151 123 189 47 95 178 29 -22
5680 -22 163 13 -141 -65 391 -60 124 100 84 -176 334 7 -94 -54 82 -49 34 4 244 -80 -47 -223 -26
5703 -26 114 14 -358 -211 62 64 -36 -498 -234 -222 -55 -53 -59 -3 -238 21 104 2 167 -105 456 -472 -52
5726 -52 -172 -225 237 -167 -86 15 -45 -261 -49 -316 -96 -82 -68 51 120 -312 -12 123 -102 137 -355 -45
5748 -45 -10 129 -23 -74 82 -149 175 -6 55 -323 206 59 6 -133 -14 -141 -295 97 160 211 57 10 108
5771 108 -75 -145 -138 235 170 84 171 302 -96 42 68 -75 50 118 -24 29 30 230 42 -33 126 -109 131 179
5795 179 402 357 -14 32 15 -40 2 96 72 58 11 262 209 -74 212 -274 -232 -324 454 5 143 71 41 16 160
5820 160 31 126 24 -232 172 -149 -204 106 42 19 275 147 -145 67 -4 -5 -238 -137 17 7 231 240 -13
5843 -13 -96 10 2 72 37 -152 -198 -193 -51 39 -66 -47 32 -85 -39 -169 -76 -218 27 -23 -228 125 103 -154 -217 -138
5869 -138 -172 -106 73 -145 -376 -81 -27 184 14 87 73 -107 -61 -107 -25 -250 195 -179 -115 -33 171 -109 -102 326
5893 326 128 286 90 -170 -219 109 -41 -194 -229 -171 -105 -146 -17 -210 -140 -143 303 71 12 -239 -288 -13 162
5916 162 156 141 294 220 275 -476 -168 67 190 -600 -62 -208 298 -157 756 342 17 744 518 212 575 -564
5938 -564 215 37 467 -491 -223 164 -254 -4 424 596 -508 46 175 109 138 537 -112 -216 -499 228
5958 228 -194 -725 -226 -212 113 -335 66 3 199 -47 242 -130 -356 317 -506 -298 -333 121 -87 -212 -350
5979 -350 -175 110 -2 -64 -42 -36 -39 -80 -76 -297 -228 -325 -206 -77 -254 -410 117 -81 -241 364 114 -13 213 -23
6003 -23 251 145 -142 52 80 1 11 118 167 -69 31 28 244 22 156 -144 134 15 -258 -15 59 -244 168
6026 168 465 -226 -162 40 -308 29 -58 403 -220 -68 -82 372 -7 522 -137 896 -150 -491 168 -375
6046 -375 -377 -8 -75 -216 695 -48 295 225 580 363 951 -95 -197 62 905 103 316 -537 -47 -88 283
6067 283 21 -254 -69 699 196 86 -297 496 -39 -423 -138 -267 39 37 -79 -112 -57 -42 29 -300 -116 105
6089 105 30 -432 -116 -56 -350 38 40 -134 -192 125 -123 -25 3 -45 -11 -330 -24 -152 -98 38 -165 -31 -95 2
6113 2 -96 220 -147 -121 134 -55 150 -18 -82 -317 -51 -133 66 38 -127 -175 -208 114 -36 -112 -45 93 53 277
6137 277 4 -131 -318 -112 -125 -5 29 144 -164 56 98 58 -105 -1 -28 -25 44 255 -204 -110 -203 54 400
6160 400 -11 255 40 209 357 341 125 1 317 76 157 51 -125 110 83 149 291 114 58 -30 283 211
6182 211 153 156 25 -302 -330 -22 228 -60 31 -79 200 -61 183 250 86 -401 -85 -71 14 63 -84 -317 98
6205 98 -11 243 45 36 22 -336 -50 13 273 34 -18 -234 -19 -98 184 32 -233 -12 -236 82 -93 164
6227 164 -187 -4 94 -144 78 -7 -92 -405 86 -121 -65 36 123 -29 -101 251 -106 -147 -69 77 169 -330 -256
6250 -256 -229 381 -83 -69 -271 -303 140 -420 -80 109 -445 -461 -357 221 -170 -181 211 24 -890 -831 0 -199
6272 -199 -193 -419 19 -310 186 -146 -604 -258 -771 746 733 2 -518 -14 -728 -301 -373 -357 640 369 229
6293 229 135 297 -82 -144 310 -329 242 -269 163 -52 53 323 0 27 -74 -17 188 -65 52 -109 -7
6314 -7 -190 70 -164 -34 -38 151 -70 114 -33 142 -217 6 -82 4 74 -192 -98 237 -28 -49 83 223 -85
6337 -85 -2 46 6 123 -257 -187 225 189 302 -13 23 60 79 -327 113 -1 -56 -96 40 48 -97 -5 -209 -157 -252
6362 -252 -108 -152 -261 -85 -43 -270 -325 -205 136 -222 70 154 26 -140 42 -94 -23 -99 22 78 4 -291 59
6385 59 28 -23 13 128 -223 -16 -3 356 -256 302 93 208 -114 -383 107 49 -81 231 272 51 -78 118
6407 118 15 -56 207 -104 -211 73 -52 -150 151 28 105 -105 282 243 67 89 103 108 88 34 2 -72 -38 96
6431 96 -33 113 76 56 -50 21 -1 118 113 14 257 153 -18 -227 99 -2 -27 40 269 -292 56 29 -62 95
6455 95 -99 -246 113 -90 1 -91 215 82 -298 61 -83 -111 -11 -107 120 193 -156 -17 -77 -77 63 117 -173
6478 -173 -95 -273 -29 88 -162 -178 -89 134 -188 -101 142 -103 -215 -134 74 -238 2 84 165 2 8 214 39
6501 39 -87 -307 -154 -237 275 107 -28 104 14 149 124 134 -55 117 -63 -52 31 141 147 45 314 62 37
6524 37 67 -55 -217 105 44 80 -36 -250 61 -131 -298 -24 161 219 -165 -319 214 50 130 208 175 79 214
6547 214 191 32 -110 83 202 78 316 30 -72 303 189 65 384 82 -146 87 129 8 33 -52 62
6568 62 100 -235 -129 24 151 10 -7 -148 -14 -244 105 -10 -16 181 157 71 -26 -139 -179 -361 -27 108 137
6591 137 45 -110 -19 -179 -161 -133 94 26 -101 114 146 -36 -309 62 -118 -119 -373 -20 -28 49 -54 -149 -23 -208
6615 -208 172 -254 -142 188 -170 -108 42 -274 31 -245 -300 78 -261 -388 120 -78 -11 -20 -85 125 172 -154
6637 -154 -59 130 264 96 19 76 -62 -63 -136 169 203 23 18 -139 191 102 -131 28 228 128 247 247 -147 101
6661 101 -113 273 -10 -127 73 38 114 38 11 -182 74 138 69 198 -17 -145 112 18 27 -101 -80 80 76 63
6685 63 49 38 136 -43 -101 196 155 -71 -348 67 -214 180 43 -174 -93 115 111 2 291 123 -25 -157 1
6708 1 132 -28 -141 -161 -215 -25 208 35 -16 -444 36 -99 -4 22 34 86 186 -78 96 265 224 -34 -64 201
6732 201 -112 -413 -211 -47 -118 -37 -161 -28 -249 -94 -18 123 -228 -282 -12 -154 -65 209 71 231 -23 243
6754 243 164 -37 -153 -294 -90 90 188 -98 -71 75 -205 129 140 -16 93 -188 53 185 79 -54 228
6775 228 30 283 -53 53 7 -39 142 -57 45 -29 26 50 16 15 172 97 -244 -104 -196 -220 -51 106 181 -157
6799 -157 -68 -62 -47 -28 51 125 76 30 509 -55 -1 33 282 -155 -24 118 -73 48 -6 94 556 -133 -22 33
6823 33 148 80 187 -69 -102 -196 167 -124 -423 -119 -604 398 -185 -315 41 345 -300 220 -1080 137
6843 137 -220 135 1308 120 104 -120 -294 373 -92 86 62 363 -30 93 -87 -527 -21 -106 -199 -463 251
6864 251 195 -269 391 213 -238 -277 -225 19 -418 -40 6 -192 -50 -90 202 -176 1 179 110 86 16 -36 199
6887 199 296 175 -153 257 264 307 -21 100 207 -194 -148 100 -121 75 -121 -55 131 99 -46 -89 218 47 -45
6910 -45 190 181 97 28 -13 185 -63 280 169 348 126 221 135 -91 -144 25 14 -68 8 201 -59 -48 -344 105
6934 105 -14 -251 80 -38 -95 276 298 161 -57 165 -272 -237 -31 -349 -79 159 -914 159 -1117 244
6954 244 439 424 789 5 383 -93 -261 -50 94 -145 -212 -126 103 -95 28 -73 -48 27 132 134 153 -154 44
6977 44 46 -84 435 20 115 -38 -122 -125 -103 59 -44 -47 -83 -70 -90 -244 -246 -25 92 -158 9 12 -187 73 -42 273
7003 273 -153 -142 89 -181 -140 -37 -16 314 -99 -110 -48 120 -90 4 25 -16 119 -130 0 77 204 41 131
7026 131 -27 193 -35 -161 -210 -107 260 177 -109 26 56 8 120 234 -246 147 317 81 -18 140 92 77
7048 77 178 -3 172 64 55 48 224 -41 285 -4 -106 32 190 155 -213 -210 -26 -57 -83 95 -89 -36 -2 259
7072 259 115 -100 194 64 124 334 -52 -81 -298 -55 -45 280 -33 -65 276 -267 -176 135 -86 9 -153 -276
7094 -276 -15 -170 -10 3 96 83 98 -184 123 -305 -13 159 -92 -273 -64 -92 -109 -104 200 -23 97 -91 -84
7117 -84 -91 -39 127 82 -76 216 285 178 119 51 122 2 84 -17 -16 247 235 29 -226 366 -47 177 -16 -116
7141 -116 127 -49 0 -320 -15 -90 98 55 238 -85 136 -46 91 26 193 209 -112 69 -164 -60 175 -109
7163 -109 -226 -101 -20 123 70 -11 294 442 7 -266 94 38 210 -5 33 302 -157 9 -125 138 131 90 -338
7186 -338 -93 -26 -38 -225 179 182 -63 124 -72 -39 93 -110 -32 -39 33 -61 -286 -136 -212 80 -18 -103 -89 -20 20
7211 20 -27 84 -43 91 -63 -165 144 27 102 -181 324 -12 -66 120 120 135 -252 7 97 -77 -49 -113 -63 -142
7235 -142 147 -255 173 -342 149 118 -50 -154 36 4 -125 -292 -132 -1 34 59 285 -30 72 187 -231
7256 -231 -39 10 148 -116 -2 -49 142 -77 -8 -35 -154 -61 94 -36 6 32 -193 -117 -207 -74 68 40 64 26
7280 26 245 -217 61 239 -30 213 -325 49 -47 51 -226 -250 101 -23 -11 -293 -149 -37 174 -142 12 143
7302 143 52 148 50 77 -142 80 -63 114 27 -20 45 284 136 219 -39 -13 -182 54 53 238 161 -192 120 31
7326 31 115 -278 281 -257 167 79 48 -164 118 -134 -202 -104 -124 187 -284 772 67 -387 -587 116 497 671
7348 671 227 -917 313 353 -36 -146 -139 -218 315 72 -103 318 -133 -187 -45 -13 47 -28 280 61 26 -5 -316
7371 -316 205 44 -58 87 -256 -318 -260 373 24 135 -424 -33 62 -34 406 -471 209 228 -147 156 -47 -108
7393 -108 -101 16 530 104 -353 -241 153 -84 -85 -250 438 -581 43 -97 469 125 -120 -637 139 399 -98
7414 -98 -44 -44 1167 98 -117 -15 -96 -7 -158 -32 318 1014 -540 -39 -57 240 -95 -435 947 -247 469
7435 469 -100 -363 414 -69 -161 521 529 753 262 190 -302 -564 799 360 -159 -460 291 161 202 -312 -767
7456 -767 262 -420 -231 386 -819 -311 -577 301 405 -163 -126 251 250 65 -314 -181 145 249 74 168 157
7477 157 363 -298 -209 86 350 32 -70 -80 -389 -130 15 -14 316 33 -40 -148 -120 4 -226 -37 55 128
7499 128 116 144 156 60 -1213 185 162 558 474 -81 -130 -177 127 163 -37 -36 -212 107 -100 204 -103 260 216
7522 216 50 10 -112 39 -137 -13 -112 219 72 7 43 -120 82 452 -163 -100 -106 -24 71 -121 -276 -92 -274
7545 -274 68 112 32 -36 13 -119 -284 -296 116 62 -86 -29 75 122 26 97 107 243 161 -61 -128 -76 -185 97 -80
7570 -80 337 -322 87 -86 -17 61 -19 12 -66 200 -140 62 -97 -112 -9 146 23 -206 -235 -120 11 -15 -264
7593 -264 86 154 -70 -64 -159 82 248 -271 -57 38 186 -186 112 -57 -203 105 144 197 87 -44 -101 61 -147
7616 -147 -32 -74 -121 -134 0 78 -243 -119 -91 -445 71 44 187 65 -276 84 -50 -10 22 -42 -165 195 31
7639 31 88 98 -11 284 -188 -375 58 -42 7 -59 165 -146 -167 -149 -155 -90 -50 -23 202 -41 -218 -160 219 44
7663 44 -74 80 356 39 36 132 90 111 131 -105 31 -124 66 -370 -103 -35 -27 298 251 139 -170 222 41 365
7687 365 -91 -33 34 53 25 15 117 -109 -26 -244 -11 -211 -77 -49 175 -42 8 330 -402 -154 -187 -117 5
7710 5 -92 247 168 -162 -29 -55 -185 -52 52 42 -193 166 -188 308 -48 -58 35 -127 224 -33 48 -172 21
7733 21 -36 119 86 -19 -42 6 -321 89 347 208 -160 63 -91 -160 225 -119 -118 -28 5 -32 -132 145 288 88
7757 88 112 222 -290 160 38 -27 108 -124 -302 -143 11 160 33 72 17 56 124 -158 95 -263 164 -126
7779 -126 -210 -129 130 132 291 162 -217 -44 32 110 -69 135 -2 -332 -19 -12 18 101 -142 -61 24 -22 -186 87
7803 87 -162 -2 -1 -351 35 48 21 250 -99 -90 28 -60 -99 38 4 242 132 -15 26 126 42 78 152 -120 99
7828 99 139 66 87 -179 22 -66 -64 -86 -143 -41 -43 -148 -44 150 -76 102 47 90 -143 -247 24 40 51 -205 118
7853 118 -68 -37 82 -10 -184 -68 -22 242 12 50 -256 -93 36 109 -105 -339 27 -128 178 -146 -96 51
7875 51 67 219 -142 -58 224 -135 175 239 -131 -83 -32 122 -116 15 -10 -49 -56 -12 -93 255 14 -23 32 8 117
7900 117 161 5 -95 315 -79 -20 134 -120 -131 -29 92 -163 219 -228 1 291 -185 -21 34 -139 -305
7921 -305 114 -37 26 -166 -165 160 -69 35 -109 101 1 -74 277 146 23 13 -27 233 117 138 -147 159
7943 159 -176 80 -71 8 118 -135 260 226 35 59 -24 -50 140 -24 39 -128 30 -244 -195 -17 65 47 190
7966 190 -27 -172 31 171 178 55 -115 125 -45 44 -5 321 15 88 52 7 -89 90 -177 13 -213 69 60
7989 60 -52 174 -176 -151 72 196 126 49 168 -21 -127 -119 169 21 -143 -64 -66 -52 241 32 -48 125 -106 -244
8013 -244 -85 51 -28 49 -66 -159 187 -70 -32 -163 210 320 -196 120 -20 -97 117 146 -106 205 -120 -121 171
8036 171 -196 26 11 150 -26 -31 141 -146 -181 -3 -105 115 7 -132 -24 34 -60 118 315 -88 -190 30
8058 30 -88 -252 -272 -49 -19 -245 71 8 -29 -113 -59 -42 -70 73 -76 186 -108 172 -51 -222 176 113 -5
8081 -5 46 -36 -226 15 82 -377 -80 -75 129 -139 -9 -74 8 -7 207 213 20 409 -101 -30 97 75 213 48 -363
8106 -363 847 248 -430 -37 -141 530 -246 607 -574 -419 177 -773 618 404 -37 -11 276 -47 -189
8125 -189 360 -78 224 120 -215 -826 -344 443 378 52 -288 671 -389 -443 -240 -195 -837 -56 -427 -490 871
8146 871 1043 -36 1093 686 -354 373 173 510 -586 94 -232 136 117 -583 -130 213 -707 483 190
8165 190 -560 194 251 355 -898 260 40 -421 -97 496 260 13 -967 -859 457 -683 632 132 -12
8184 -12 -107 -101 122 -138 479 -331 179
8191A79
$$ Imaginary data points
##PAGE= N=2
##DATA TABLE= (X++(I..I)), XYDATA
0 0 0 0 0 0 0 0 0 0 0 -8 8 -8 8 -16 16 -17 24 -32 35 -45 56 -64 74 -89 105 -121 143 -164 191 -218 249 -283
32 -283 322 -366 413 -466 523 -586 654 -731 814 -904 1003 -1109 1229 -1357 1499 -1652 1821
49 1821 -2006 2209 -2434 2683 -2958 3268 -3616 4012 -4468 4995 -5614 6356 -7262 8397
63 8397 -9869 11858 -14712 19169 -27164 45942 -185845 -2165 267694 -9747 73630 -156635
75 -156635 -196239 96365 103890 66848 30312 -242485 -68816 172935 23020 -3830 33345
86 33345 -150154 -55904 120322 22806 6741 15548 -119473 -15414 56144 -2657 108341
97 108341 -13083 -182311 39814 49297 -3395 144533 -50585 -185266 20285 62308 109891
108 109891 78133 -162277 -104354 50186 55852 154179 23255 -232560 -68739 140371 92941
119 92941 55381 -51026 -156349 -13186 113785 101108 44130 -134072 -125705 114934 85409
130 85409 -7742 49245 -70960 -104209 75919 76089 26658 7255 -83716 -25937 45018 11043
142 11043 81657 32326 -130286 -40124 61048 36888 82930 948 -138780 -47619 68734
153 68734 98459 68462 -92448 -131054 15175 76994 95848 40026 -144929 -120113 79238
164 79238 105211 44901 -27725 -124550 -58688 77264 89127 37868 -76507 -123325 20546
175 20546 77940 22365 29342 -49550 -113086 12747 78374 35986 -3820 -68560 -54528 12643
187 12643 21821 59319 32113 -100048 -82946 35862 57108 46406 -1837 -94351 -72334 28650
199 28650 82263 66685 -49805 -129266 -29723 68708 76667 38890 -81333 -121974 9668 91389
211 91389 67239 -4644 -100943 -79197 40888 86880 51806 -39188 -103369 -27053 60234 53030
223 53030 29944 -27961 -86263 -23155 62061 57786 15250 -41509 -61266 -7461 37454 61567
235 61567 39958 -61162 -82058 13852 63131 55679 17272 -62004 -72291 11512 80411 76391
247 76391 -15387 -99019 -44870 52868 78324 49680 -33829 -96868 -26043 70968 84070 26534
259 26534 -69293 -83855 14739 76416 63669 896 -76328 -57123 30389 68898 51643 -14915
271 -14915 -78316 -37841 42112 63313 32709 -25157 -64663 -29991 35062 64312 35565 -42672
283 -42672 -75868 -12118 49064 55065 23346 -47054 -75183 -10020 58725 66769 3563 -78168
295 -78168 -62144 16596 61762 55004 -14327 -86115 -54189 33899 74609 36026 -47761 -82589
307 -82589 -24317 46209 61364 17691 -55057 -74282 -10825 53172 56926 -369 -67240 -60609
319 -60609 9067 51993 44479 -8923 -69897 -54569 18660 62676 39537 -29761 -72468 -32988
331 -32988 29306 55461 33059 -35023 -76169 -27913 47558 65836 13706 -55819 -63268 -5881
343 -5881 50703 60740 6240 -66874 -61754 15021 67703 49462 -18691 -67985 -40684 28233
355 28233 66020 41944 -31065 -72154 -24843 47726 65951 20862 -44176 -59614 -7641 51584
367 51584 60535 11389 -51691 -55356 7246 61863 53260 -5972 -55623 -41013 19227 60054 47704
380 47704 -14213 -64011 -34416 36828 65446 31532 -31214 -58788 -19262 41506 64815 24454
392 24454 -46131 -62336 -2047 58428 54943 -127 -49975 -48831 4959 60253 52636 -13311 -64582
405 -64582 -41715 28223 61438 31412 -26298 -61464 -31200 35662 61965 20856 -45109 -61719
417 -61719 -9925 44002 49543 6352 -48991 -55776 -3263 50356 46044 -10537 -56771 -47326 9035
430 9035 54056 36837 -21814 -60623 -40605 22052 56711 26752 -34627 -65843 -27112 38061
442 38061 54009 10727 -45894 -59859 -13865 45231 52944 -3287 -59988 -51270 8917 50995
454 50995 34844 -14012 -53169 -46664 14732 60919 30782 -32745 -59141 -23678 30594 48154
466 48154 20414 -32018 -58207 -17902 42782 52978 5010 -44741 -43923 -3574 42307 49611 -675
479 -675 -48175 -43264 8385 56425 40481 -13422 -48632 -39047 23657 64460 29952 -26465 -53715
492 -53715 -22228 40288 58052 21148 -37538 -55659 -1797 52250 50689 3479 -44938 -39703
504 -39703 8150 53436 48109 -14858 -48317 -23441 17156 50809 34123 -16172 -43585 -30381
516 -30381 30226 60660 15182 -26874 -38955 -19886 33441 52687 18154 -35621 -54559 -2229
528 -2229 49492 43517 1631 -45199 -44376 6535 51651 44507 -18002 -56320 -29481 18877 52978
541 52978 30381 -31952 -55029 -22709 34293 53249 5691 -39630 -45531 -13624 39193 46029
553 46029 -4498 -47726 -42770 5784 41735 27276 -11353 -43294 -37507 8379 41327 24680
565 24680 -19307 -45325 -30749 10975 44279 26732 -29204 -56544 -22855 30327 45508 9908
577 9908 -36181 -51516 -18675 41903 53796 -7088 -56737 -40805 9100 47042 33503 -17441
589 -17441 -50504 -34815 20746 54714 17553 -31200 -41474 -19284 27175 46679 9905 -32737
601 -32737 -39762 -6076 33512 35103 7976 -29028 -40963 -1855 40868 38630 -2195 -37266 -30096
614 -30096 5741 41703 40490 -8805 -44289 -29350 18356 55052 29172 -22534 -44822 -24125
626 -24125 36417 60242 12301 -36517 -44944 -2705 51088 44081 -685 -39728 -40649 16345 56010
639 56010 29963 -17851 -41180 -17332 23653 39795 22937 -18526 -38674 -12414 25486 38666
651 38666 12644 -20958 -30697 -15290 25221 42610 7615 -26028 -34251 -12980 32238 42662
663 42662 5105 -38439 -45109 3979 47506 32014 -11247 -45220 -37863 16416 51736 24802
675 24802 -29840 -53975 -19944 34259 45382 5342 -40683 -45620 -3105 40124 32466 -10626
687 -10626 -39979 -32715 4637 36621 23728 -16660 -38488 -24883 11189 32288 14782 -16371
699 -16371 -33627 -24314 12213 34556 14479 -19376 -38232 -22070 21316 36367 10693 -24901
711 -24901 -44697 -15600 34895 40295 1703 -39381 -43292 3943 45712 33294 -14138 -47677
723 -47677 -28923 22808 46478 18870 -26293 -42677 -13389 32054 41832 4963 -31188 -31759 -357
736 -357 33924 31418 -1362 -26359 -26478 4971 34867 25234 -2653 -24156 -25579 8003 36900
749 36900 25648 -5727 -30124 -23184 15175 39666 25043 -12932 -39127 -18150 28486 43870
761 43870 15457 -25628 -40202 -5476 39370 40402 1383 -35251 -33768 9114 44481 30318
773 30318 -12424 -38682 -22150 21480 40739 16325 -19219 -34381 -13309 25444 34719 6678
785 6678 -22712 -30256 -6695 25728 28376 3284 -24084 -29693 -2691 25902 25891 1059 -29429
798 -29429 -31771 2044 31437 25951 -8626 -37614 -27870 10925 36757 20032 -21440 -42119 -19642
811 -19642 22628 37374 7602 -31623 -39259 -6966 30885 30479 -4970 -36118 -32451 5319 32481
824 32481 21472 -12991 -36461 -22830 13169 29785 14381 -17633 -33539 -14682 15123 28215
836 28215 11947 -20832 -32437 -10146 20117 29457 6534 -25296 -30348 -4700 26625 30498 256
849 256 -30668 -28005 4911 32101 27324 -7593 -35483 -22125 15672 36230 20677 -17107 -35457
862 -35457 -11390 24382 35740 12078 -25240 -30854 -26 28949 31485 3164 -28306 -23833 8002
875 8002 30419 26212 -4160 -28604 -16677 12553 30481 22751 -9784 -28503 -11882 16794 31696
888 31696 17869 -16209 -28776 -7210 21155 32812 11129 -23702 -27964 -409 26410 29893
900 29893 2665 -29256 -24806 6472 29763 26088 -7548 -33277 -17846 12829 29913 19257
912 19257 -17249 -32764 -10745 17500 29443 10838 -24286 -29830 -4868 20643 26623 2702
924 2702 -28436 -26800 425 23095 23425 -5364 -32221 -21914 6314 23923 18697 -12579 -32827
937 -32827 -16391 10025 25137 14044 -19401 -32004 -12134 14307 27748 7087 -26383 -29737
949 -29737 -5876 20063 26142 -1137 -30768 -25030 2153 23450 21429 -8635 -31709 -18809 7739
962 7739 25175 17730 -15407 -30386 -12522 12336 26812 12464 -20984 -27859 -7066 18822 28370
975 28370 4014 -24264 -22231 -381 22196 25599 -842 -26679 -19143 6710 25698 22202 -7315
988 -7315 -26759 -12248 11771 27485 18947 -13874 -25696 -7446 15899 30250 12583 -19690
1000 -19690 -22789 -2262 21936 28915 3709 -21710 -18947 2825 26042 26028 -2584 -24910 -15278
1013 -15278 10245 27069 20493 -8831 -25970 -9162 14624 26553 15083 -15550 -23772 -4317
1025 -4317 16392 27179 8682 -21451 -21814 -123 20799 24580 -125 -23260 -18398 2555 23629
1038 23629 22084 -7953 -27149 -13946 9397 23382 14646 -13755 -26360 -10194 11930 23449
1050 23449 10020 -19856 -26322 -6283 16984 23023 941 -24832 -22371 47 18986 18008 -5392
1063 -5392 -26110 -18923 4180 19770 15093 -11334 -27634 -12942 8004 19542 11590 -16558 -25881
1076 -25881 -8735 10055 21801 6532 -22072 -23533 -5039 15806 21826 -1728 -23668 -19092
1088 -19092 -203 20586 18232 -6053 -24870 -18772 7532 24789 13611 -12345 -24693 -8657
1100 -8657 12393 20398 10167 -16075 -23346 -2462 15866 22054 5101 -20472 -18023 1766 17991
1113 17991 20841 -1276 -19664 -13968 4040 22433 19318 -6131 -20227 -10820 10045 23734 13212
1126 13212 -9467 -19615 -7124 14555 23432 10320 -13541 -19679 -2465 18719 24187 5186
1138 5186 -20021 -17447 5356 22091 20190 -3066 -20928 -10958 8463 22412 16810 -10131 -20325
1151 -20325 -6306 12823 21170 8921 -13411 -16151 -3673 11254 21295 6128 -16244 -17701
1163 -17701 -955 15791 17841 -996 -17676 -15185 342 16907 16086 -4582 -19675 -14886 4595
1176 4595 19993 12968 -11935 -22409 -10374 9351 19474 7741 -17161 -22788 -6012 13738
1188 13738 19301 -517 -21616 -17539 112 15840 15310 -6244 -21738 -12050 2377 15573 11207
1201 11207 -10663 -20016 -9839 5025 16904 6209 -13225 -18829 -7809 7681 16491 4886
1213 4886 -14344 -17578 -5995 10557 18721 2924 -19240 -16391 427 15240 17698 -3387 -21057
1226 -21057 -13617 3650 21032 15438 -11407 -20412 -7114 10063 22328 9343 -15747 -17248 -1596
1239 -1596 13852 20514 2461 -17058 -13409 3262 16825 16639 -1929 -15663 -8268 5495 15852
1252 15852 14929 -4495 -14800 -4984 5805 16475 14530 -7074 -14152 -4912 6702 20169 11067
1265 11067 -10831 -13883 -4625 12041 23120 4969 -15666 -13793 599 17548 19009 -2344 -18427
1278 -18427 -11253 5915 18536 14426 -7974 -19090 -7477 9105 19968 8991 -14747 -15620 -1285
1291 -1285 9173 17234 4058 -16526 -12558 436 11059 14744 -1956 -15827 -10567 -184 10915
1304 10915 12966 -4070 -16335 -11046 -208 14468 12244 -9023 -18774 -9570 4460 15601 7969
1317 7969 -13088 -19028 -7260 9380 17882 1833 -17907 -17256 -2400 13428 16228 -4934 -21127
1330 -21127 -11957 3495 13984 11016 -9568 -19200 -7698 6051 13673 6690 -12219 -15150 -4041
1343 -4041 6866 13633 3570 -12830 -12116 -3162 8098 14488 1787 -13299 -12159 -694 11956
1356 11956 14015 -886 -14449 -11268 2362 15224 14303 -4928 -16936 -7432 7299 17854 11173
1369 11173 -10978 -16405 -2456 11514 18421 5143 -13980 -12723 1907 15217 16403 -1340 -14652
1382 -14652 -7941 5447 15414 12202 -4256 -13053 -4716 7683 13769 10035 -5742 -12632 -2598
1395 -2598 8023 14212 7828 -8673 -11746 -1904 8440 15443 5067 -11216 -11387 -19 12428
1408 12428 14491 407 -14529 -11364 3553 15043 11858 -5102 -16301 -7945 6800 14347 7686
1421 7686 -10376 -15475 -3450 9335 12858 3361 -12838 -13882 -749 10222 11310 -1780 -13847
1434 -13847 -10862 1021 10783 8377 -4098 -13757 -9814 2990 10226 7288 -6767 -15520 -7063 4552
1448 4552 10315 5841 -9487 -15329 -5324 6379 11866 2527 -13301 -14610 -2628 10830 12026
1461 12026 -1911 -14866 -12813 1505 12520 8324 -5041 -14881 -9113 6033 12878 5494 -7713
1474 -7713 -14948 -4216 8598 10863 3758 -10052 -12815 -599 9359 11433 1639 -10868 -9772 1614
1488 1614 11287 10549 -858 -10830 -8422 3759 13010 9364 -2594 -11985 -6454 8262 13400 7459
1502 7459 -5655 -12475 -2344 10685 13391 5333 -8839 -11265 1565 12343 12846 1259 -11309
1515 -11309 -8516 4567 13447 9901 -1891 -10793 -7118 6922 13316 7218 -4692 -11240 -3254 8938
1529 8938 11772 5427 -6749 -11510 -881 9042 11140 3074 -9808 -10547 832 10726 10158 -1515
1543 -1515 -11157 -8457 2400 10933 7756 -3585 -12087 -8775 4867 11449 5106 -6755 -14224 -5223
1557 -5223 7856 8813 2906 -9450 -13460 -1094 8311 8704 -61 -12911 -10206 1580 8387 6826
1571 6826 -4070 -12070 -8170 1500 9482 5350 -6249 -12597 -7864 5243 9499 1748 -7835 -12403
1585 -12403 -4236 7632 7674 1528 -9052 -12839 -1039 8391 7405 66 -12515 -9974 2758 8334
1599 8334 7222 -2946 -11833 -6371 3697 10187 5753 -6133 -10978 -4912 8045 10874 2384 -6798
1613 -6798 -10171 -1689 9935 9419 2334 -7871 -10005 3137 11140 7666 570 -9557 -6580 6061
1627 6061 9427 7370 -1152 -9352 -4218 6610 11063 6776 -3861 -9382 -1918 8413 10920 4401
1641 4401 -5247 -9332 -206 10485 10436 2034 -8066 -8761 3935 11145 8196 -707 -9691 -5624 5323
1656 5323 9971 6193 -2983 -10007 -4231 7103 10235 3492 -5773 -9892 -1537 8473 7969 1228 -7011
1671 -7011 -9424 -126 8269 7162 -510 -9851 -8122 2867 7585 5545 -2848 -10741 -6803 3417
1685 3417 8261 4467 -5519 -11372 -5314 5721 8400 830 -7326 -10827 -3656 7323 7112 -433 -9241
1700 -9241 -11291 746 8579 4884 -2765 -11348 -8425 3784 7266 3351 -4437 -11067 -4644 4447
1714 4447 6646 2733 -6550 -9966 -3146 5166 6885 1225 -6879 -9117 -1498 7090 6784 316 -7884
1729 -7884 -9311 969 8548 6160 -1836 -9522 -6337 4186 8307 5522 -2820 -10179 -4026 6581
1743 6581 9787 3472 -5781 -9027 -602 8803 8528 1330 -6519 -7415 2374 9453 7376 -351 -7579
1758 -7579 -4830 5058 8628 5772 -1318 -7238 -2648 5010 8607 5035 -3336 -6275 -1551 5694 9067
1773 9067 3878 -4593 -7011 -718 8273 8226 1812 -5466 -7650 1147 9114 6968 -49 -8812 -6802
1788 -6802 4863 8486 5052 -3361 -9333 -2680 5562 7443 4539 -6312 -9051 -848 6100 6778 -305
1803 -305 -7086 -6018 -942 5902 5692 -1797 -7442 -7014 1291 6721 2711 -2737 -7605 -6462 2459 5450
1819 5450 3291 -3640 -10156 -4742 4233 6044 2313 -6855 -9613 -2751 3825 7051 590 -9778 -8477
1834 -8477 -331 6323 5285 -2730 -9185 -6891 1680 7929 3913 -5634 -9009 -3760 4577 6671 1675
1849 1675 -5114 -7904 -2013 5299 5849 1303 -6050 -5980 1000 4672 4493 348 -4803 -5700 -146 6588
1865 6588 6780 -1019 -7336 -3764 2292 6176 5381 -2101 -7079 -3330 4664 9342 4713 -5088 -6753
1880 -6753 -764 6624 8086 1624 -5828 -5859 1533 7551 7232 -249 -6967 -3766 3727 7532 4882 -987
1896 -987 -5734 -2210 4982 7631 3388 -3550 -4982 619 4140 5992 3238 -3629 -6443 -527 5826
1911 5826 5931 1013 -5144 -4495 200 5663 5683 -397 -6210 -6357 2236 7561 4266 -2749 -7412 -4188
1927 -4188 4069 6437 2577 -5532 -8932 -1837 4964 5490 9 -8000 -5514 387 3005 4308 -1801
1942 -1801 -7612 -5893 2035 4944 2142 -3786 -6695 -3423 2148 3458 3048 -3842 -6932 -3916 3004
1957 3004 4411 307 -5101 -6850 -2756 2624 5286 1312 -6152 -7521 450 5417 3904 -1576 -6544
1972 -6544 -6107 695 5326 4041 -3115 -7838 -3628 4355 6642 1026 -4556 -5686 -1657 3944 5864
1987 5864 1841 -5632 -5531 1275 5589 4098 -245 -3773 -3356 472 6938 5222 -1666 -5392 -2574
2002 -2574 4073 5661 2742 -689 -4308 -3028 3906 7408 3625 -3142 -5543 569 5955 5910 2616
2017 2616 -3280 -4640 499 6903 7259 -374 -6701 -2763 3777 6530 3977 -1586 -4051 -2670 3274
2032 3274 7956 2713 -3657 -4433 -1032 5157 5224 844 -2307 -5680 -1525 6458 4893 -543 -5282 -4415
2048 -4415 1870 4099 3084 139 -5347 -4518 1670 5405 3201 -3608 -5216 -2195 1380 4854 2043
2063 2043 -3554 -6888 -3849 4659 5994 -1489 -5323 -5382 -759 3594 3245 -577 -5561 -6474 943 5892
2079 5892 1532 -3971 -6087 -2978 1128 2983 1829 -2698 -6834 -3860 2818 4958 -327 -4663 -4617
2094 -4617 -1776 2832 4205 286 -4589 -6393 -333 5491 2930 -2192 -4107 -3830 722 4801 3413
2109 3413 -1838 -5618 -2995 3344 5681 1030 -2892 -3417 -2101 3038 6241 1622 -3772 -5319 585
2124 585 6869 4240 -1183 -2386 -3193 904 5883 4831 -650 -5118 -2330 4486 5621 2158 -1619
2139 -1619 -2167 -1367 2390 6757 3449 -3206 -4041 -155 5373 5321 -126 -1737 -2582 -867 5805 5301 -222
2156 -222 -3790 -3523 2885 5912 2083 -694 -3331 -3076 2485 6031 2830 -3283 -4801 -699 3593 4033
2172 4033 964 -2862 -3722 -2303 4100 5346 -1475 -4776 -3402 252 4277 2398 -1058 -3541 -5182
2187 -5182 596 5464 2078 -3742 -5517 -1609 2161 2553 774 -2315 -4973 -3453 2140 4666 -929
2202 -929 -5561 -3800 -991 2361 2452 -1175 -3871 -5487 -1264 5258 2456 -3458 -4845 -3267 1373 3091
2218 3091 1161 -2105 -5361 -3587 2694 4179 -125 -4484 -3563 -944 1879 3770 728 -3892 -4560
2233 -4560 -837 5144 3540 -2426 -3434 -2501 262 4634 2637 -958 -3862 -3296 3294 5853 614
2248 614 -2420 -2574 -822 2177 4499 2631 -2970 -4268 226 5298 4436 -697 -2726 -1335 678 4276
2264 4276 4547 -74 -3464 -2348 2855 6260 2014 -2154 -1643 -1271 2454 5156 2717 -2207 -3710 92
2280 92 4592 4215 -114 -1802 -1857 -385 3266 4921 305 -4225 -2695 2096 4392 2105 -1319 -2682
2296 -2682 -2317 720 4690 3076 -3121 -4342 -1180 2916 3642 -419 -2590 -2881 -2226 2760 4675 -797
2312 -797 -4819 -3462 626 3141 1444 -1433 -3047 -3668 -291 3554 2062 -2866 -5180 -1951 1853
2327 1853 2209 115 -2437 -3714 -2850 1053 4055 -119 -5022 -3655 -372 1852 2188 -1148 -3372 -3855
2343 -3855 -1320 3803 2918 -2808 -4072 -2569 1256 2800 809 -1613 -4150 -3249 2433 4251 359
2358 359 -3882 -3383 132 2005 2696 617 -2907 -3183 -35 3640 3679 -1621 -3247 -659 1046 2693
2374 2693 2638 -308 -2729 -2281 1874 4850 1681 -2155 -1924 -128 2085 3495 2460 -1650 -3055 -140
2390 -140 4302 4010 -36 -2924 -1257 1355 3179 3811 335 -2906 -1795 2074 4789 2213 -1930 -2264
2406 -2264 -68 2167 3427 1971 -1606 -3326 -182 3821 3019 -64 -2212 -1232 23 2340 3088 241
2422 241 -3054 -2540 1331 3515 1800 -1307 -2474 -1874 548 3121 2482 -1837 -4599 -1637 2728 2938
2438 2938 -137 -2955 -3460 -1349 1708 3109 -237 -4551 -3529 925 3070 815 -1854 -3186 -2100
2453 -2100 35 1966 1695 -2484 -4126 -1414 1310 2010 -239 -1903 -3388 -2301 530 2112 463
2468 463 -3755 -3881 136 2150 1074 -914 -1734 -3038 -787 2060 2698 -1352 -3541 -1685 1017 2430
2484 2430 1432 -975 -2945 -1702 1885 3886 1239 -2688 -2997 248 2974 2295 325 -2063 -2190 -68
2500 -68 3339 3077 -675 -2535 -595 2131 2994 1715 714 -1849 -1088 1568 4120 1787 -1797 -1719 610
2517 610 2165 2853 2099 -366 -1285 -488 3278 3954 271 -3000 -1839 1345 3259 2486 -120 -1883 -2559
2534 -2559 1939 4260 2355 -1170 -1654 142 2013 2444 2389 -767 -1458 -106 2583 3425 -42 -1854
2550 -1854 -2181 -314 2229 1716 26 -2530 -2001 688 2813 1269 -1204 -2084 -958 -139 1948 1469
2566 1469 -1605 -2903 -1526 1351 1963 -167 -2004 -2608 -1372 780 2061 103 -3209 -3595 -23 2743
2582 2743 856 -1654 -2853 -2390 175 1786 1082 -1623 -3911 -1649 1564 1863 -269 -2367 -2299 -1028
2598 -1028 333 2015 440 -2736 -2987 -552 1585 1799 -911 -2084 -1741 -478 2378 1824 -828 -2405
2614 -2405 -1880 1279 2552 458 -744 -2050 -1122 1850 2392 1204 -1661 -2496 449 1968 2413 947
2630 947 -2067 -1744 224 2873 3115 -590 -2069 -458 1284 2842 1547 -412 -1008 -908 1771 3403
2646 3403 1243 -874 -1479 253 2269 2375 1373 -420 -1435 403 2217 2878 755 -2016 -1553 995
2662 995 2217 2351 -291 -1542 -729 592 3289 1542 -891 -1264 -360 2611 2582 174 -1258 -2137 -475
2679 -475 1783 1987 -292 -2161 -1887 241 1801 1792 -214 -2269 -1949 325 1926 887 -1635 -2026 -1020
2696 -1020 297 1555 801 -1777 -2725 -1289 1048 1412 -389 -2144 -2127 -801 659 1274 -333 -2669
2712 -2669 -2160 -295 1487 1248 -1505 -2780 -1701 -273 1483 764 -1727 -2778 -1648 944 1764 -79
2728 -79 -1852 -2081 -335 1091 1570 -36 -2122 -1835 -38 1405 1517 -383 -1849 -1055 244 1474 1643
2745 1643 -868 -1946 -852 806 2085 1393 -843 -1420 -556 1034 2208 772 -1036 -1395 217 1865
2761 1865 2196 669 -1479 -972 748 2067 2605 181 -1895 -280 1106 2250 1688 -467 -1273 -17
2777 -17 1047 2406 1549 -1007 -1275 258 2010 2147 557 -1020 -859 196 1805 1837 589 -1611 -832
2794 -832 731 1306 1764 -514 -1771 -650 355 1893 1277 -1471 -2003 -530 908 1823 461 -1359
2810 -1359 -1414 -489 1102 1401 -83 -1882 -1380 -133 1003 625 -982 -2425 -1588 156 1186 873 -1685
2827 -1685 -2291 -787 464 1120 397 -1633 -2187 -664 532 1221 -481 -2288 -1655 -406 542 786 -680
2844 -680 -2421 -1642 -197 1055 1016 -1209 -2248 -1095 209 1097 769 -1273 -2014 -472 646 1146 482
2861 482 -1426 -1783 -271 1080 1270 352 -1728 -1281 635 1270 1496 -301 -1764 -609 768 1627 1144
2878 1144 -607 -1291 -353 1151 1780 952 -944 -1406 25 1272 1671 938 -666 -1248 553 1633 1686
2895 1686 571 -1231 -561 994 1373 1822 -106 -1340 -163 1169 1831 1448 -300 -1282 126 1131
2911 1131 1821 890 -589 -1290 218 1150 1618 437 -935 -1001 680 1397 1018 129 -1432 -839 736 1349
2929 1349 985 -372 -1555 -680 726 1298 520 -930 -1471 -437 933 1232 502 -1236 -1881 -302 533
2946 533 310 32 -1457 -1689 -26 874 253 -760 -1919 -1266 343 596 656 -1429 -1947 -967 332 697
2964 697 -278 -1508 -1693 -869 750 563 -469 -1678 -1578 -203 905 370 -674 -1683 -1429 -5 1073
2981 1073 253 -671 -1438 -987 553 924 327 -938 -1508 -500 787 912 80 -926 -1180 -181 1003 1234
2999 1234 175 -1003 -1001 615 1540 983 306 -1033 -933 1036 1563 890 -161 -1035 -178 1345 1592 524
3017 524 -273 -487 258 1237 1448 232 -273 -518 579 1699 966 313 -568 -605 686 1625 1021 118 -840
3036 -840 -408 1030 1798 595 -343 -1054 -243 1327 1495 300 -482 -1014 -16 1372 829 -43 -874 -1182
3054 -1182 146 1321 833 -54 -1318 -856 262 1093 662 -884 -1363 -462 494 1011 -256 -929 -816 -657
3072 -657 668 632 -554 -936 -1479 -550 718 349 -482 -894 -1624 84 465 167 -581 -1659 -980 292
3090 292 370 136 -1380 -1706 -802 240 1053 -171 -1154 -909 -858 732 724 -703 -787 -1279 -196 1210 141
3109 141 -540 -1026 -1000 669 1014 99 -36 -1318 -842 1044 894 483 -897 -1044 -105 547 1004 59 -594
3128 -594 -439 -389 1197 1586 134 -562 -588 388 1505 805 -42 -501 -407 946 1641 929 3 -607 89 1132
3148 1132 1488 914 -700 -447 206 1057 1116 180 -377 -579 662 1524 1132 -228 -203 144 337 1206 707
3167 707 -1 -515 -337 606 1260 1050 -802 -944 13 848 902 337 -578 -743 178 905 1060 -191 -1091 -537
3187 -537 -138 1045 274 -481 -940 -735 298 735 190 -789 -1085 -498 174 585 -323 -1083 -965 -160 110
3206 110 251 -245 -1066 -850 -501 273 603 -609 -1324 -1083 -107 856 -327 -886 -1166 -796 340 384 180
3225 180 -687 -1182 -513 159 424 134 -915 -916 -157 196 929 -80 -1075 -573 35 590 323 -583 -854 -649
3245 -649 439 1063 434 -229 -386 -262 779 890 158 -523 -460 85 680 842 385 -357 -53 319 818 839
3265 839 69 -616 -148 676 1111 882 121 -380 56 865 1282 549 -243 -363 142 1166 1091 286 -299 -190
3285 -190 396 1198 773 262 -491 -150 437 1040 780 116 -763 -271 529 982 461 -408 -609 -207 625 724
3305 724 -72 -643 -441 -118 476 626 -140 -333 -806 92 680 540 -211 -729 -790 -33 389 255 -162 -1040
3325 -1040 -488 464 500 118 -972 -1083 -557 111 242 -163 -794 -957 -326 244 517 -197 -871 -1101 -101
3344 -101 202 129 -629 -848 -649 4 569 12 -565 -809 -430 151 66 406 -186 -1176 128 -171 1124 145
3364 145 -450 -242 -215 1212 686 -201 -577 -505 186 731 329 -368 -196 -244 561 718 632 -347 -798 221 492
3385 492 791 418 -452 -575 241 697 912 192 -376 -26 509 795 713 172 -122 -240 521 1037 892 115
3405 115 -411 299 543 783 306 -50 -277 21 592 734 513 -468 -469 180 853 619 266 -343 -516 518
3425 518 779 435 -277 -643 -138 492 590 254 -526 -331 -414 267 486 73 -206 -476 32 377 -179 -309 24
3446 24 -244 -409 406 -82 -617 -535 -197 -152 100 79 -495 -907 -585 81 319 -177 -596 -1176 -135 94 327
3467 327 -465 -782 -719 -146 425 431 -513 -757 -708 -210 577 41 -676 -888 -569 128 355 301 -415 -547 -149 124
3489 124 470 33 -330 -439 -112 487 539 33 -519 -182 -187 474 681 -275 -297 -435 191 1068 300 -8 -180
3510 -180 -233 606 854 267 81 -371 113 787 977 584 -459 -315 207 645 893 -212 33 81 544 856
3530 856 746 -237 22 102 576 958 341 233 -107 -66 756 918 311 -228 -330 -78 591 429 320 -415 -229
3551 -229 87 320 718 -274 -489 -259 172 541 309 -261 -491 -536 267 531 -229 -326 -592 -259 420 185 -209
3572 -209 -576 -908 -158 144 80 -137 -796 -637 -141 92 211 -455 -754 -386 -325 213 -53 -831 -474 -477 -146
3593 -146 355 -732 -667 -654 -612 -11 383 -58 -663 -534 -26 449 296 -122 -606 -371 59 421 170 -493 -465
3614 -465 -153 -117 755 -64 -415 -516 -61 436 510 133 -285 -84 -199 374 246 -164 -179 -286 337 463 663
3635 663 -370 482 534 404 1110 485 -570 215 134 152 1302 268 -298 -223 73 346 612 135 -287 -143
3655 -143 391 656 579 526 -425 28 560 925 631 -199 -307 46 115 1022 524 -420 -438 -119 516 728 221
3676 221 60 -252 -330 268 -84 286 -761 -359 -90 219 201 164 -583 -24 409 -141 138 -451 -928 -370 -128
3697 -128 84 -29 -495 -261 -273 6 92 -502 -679 -373 140 307 -59 -436 -609 -601 32 69 -181 -406 -382 -445
3719 -445 -162 -287 -80 -497 -715 -16 54 54 -158 -361 -352 -115 192 -33 23 -402 -118 1 84 267 -387 -452 -62
3742 -62 225 287 162 -236 -418 -115 151 582 259 -318 -302 350 452 655 123 -439 -186 58 470 573 -1
3763 -1 258 -101 396 498 422 118 -125 356 199 521 723 -179 -340 41 209 911 442 183 -531 -16 151
3784 151 290 159 -222 963 220 763 303 -89 -880 5 967 515 751 162 -1109 -127 157 -189 73
3803 73 -142 -557 37 253 79 -246 -626 -322 396 458 538 -437 20 199 -93 290 -120 -150 -431 -125 -342
3824 -342 192 -401 -299 -360 -89 299 185 -59 -565 -434 -382 -15 -71 -349 -288 -389 -130 406 325 -479 -618 -529
3846 -529 306 95 21 -530 -371 -323 49 4 -145 -460 -199 17 63 218 -131 -513 -322 -166 134 489 -362
3867 -362 -280 -467 369 202 358 -211 -262 -27 392 505 148 -169 -194 28 215 544 429 57 -250 170 353
3888 353 336 77 -357 -77 244 256 357 149 -320 -66 577 530 366 -24 -161 -278 429 740 494 -34 -282
3909 -282 -23 488 414 18 -204 -121 54 201 431 -31 -148 -36 295 278 406 -321 -364 36 254 486 78
3930 78 -146 -94 -173 284 410 378 -199 118 132 705 147 -751 115 -281 55 335 476 -407 -522 -156 288 18
3952 18 -342 -414 -450 -351 253 -323 -18 -395 -125 -444 315 22 -20 -779 -314 -111 343 438 -89 -132 -630 97
3974 97 444 -32 -287 -740 -8 55 -23 -108 -397 56 -99 109 695 -328 -276 -364 -367 126 254 27 -365 -184
3996 -184 438 350 346 -351 -177 -144 104 315 129 78 45 -151 515 495 378 16 129 322 366 545 192 63 -249
4019 -249 5 934 660 28 -271 75 642 538 449 228 -5 130 -11 411 17 -81 -372 -64 434 572 491
4040 491 -235 255 161 365 458 -385 258 -304 -312 -98 308 -46 -66 -672 -375 1188 -380 -153 -183 -92 183 395
4062 395 372 -526 -727 -368 50 599 45 -312 -555 -60 168 484 -279 -284 -234 -116 307 -244 -322 -405 -348 -158
4084 -158 181 -68 -313 -597 -264 21 40 -147 -535 -329 -174 -247 203 -219 -418 -124 -451 -135 305 -284 12
4105 12 -19 -303 245 27 -284 -165 -298 154 122 271 -35 -199 -257 343 387 345 -456 -261 26 51 273 -35
4127 -35 -397 -209 89 290 159 -121 247 449 185 246 95 173 -69 154 489 633 148 145 80 157 306 38
4149 38 310 -15 85 170 162 506 96 -527 309 29 -57 417 4 -45 245 232 620 3 -114 149 -68 286
4171 286 504 -33 -205 -376 195 232 221 -217 -195 -51 -100 88 314 -238 -472 -225 203 221 79 -438 -38 -130
4193 -130 -230 100 7 -124 -501 -79 -79 242 -71 -112 -183 -260 53 326 114 -559 -266 177 364 -275 -185 -483
4215 -483 -327 -112 327 152 -182 -400 -8 4 -166 -312 -262 -194 -198 69 137 -7 -391 -301 236 239 101 -107 -239
4238 -239 16 -80 460 304 -608 -526 -39 253 15 190 333 -289 -153 365 535 -110 -289 -42 528 353 127
4259 127 44 -248 -155 27 157 496 -8 -397 287 625 197 141 -23 106 153 354 310 238 -292 -163 107 685
4281 685 -15 191 1 217 110 356 439 0 124 77 191 129 190 180 -7 -19 129 17 88 -522 5 174
4303 174 107 123 61 208 -557 -146 76 258 -310 -280 -41 -44 177 -25 -135 -440 -387 157 -246 -81 -265 -355 -131
4326 -131 -186 -250 -2 -290 -681 -260 264 -198 -656 -651 -322 -294 -70 -149 -395 -525 -455 89 209 -128 -312 142
4348 142 -312 -485 -152 368 -59 -575 -216 44 304 -296 -98 219 21 68 167 -208 -460 -253 446 374 -113
4369 -113 -70 -265 -239 -25 142 143 -255 -238 228 363 420 150 189 -267 -179 306 354 291 -282 -80 387 260 217 -34
4393 -34 -164 77 57 512 347 -263 -318 214 142 106 11 171 40 -223 120 419 147 -552 -64 306 466 -7
4415 -7 76 88 -310 -124 81 369 134 -97 247 403 10 89 -37 -96 -359 213 222 -68 -110 -228 -162 -30 55 127
4439 127 -315 -446 26 125 81 -353 -204 46 -55 -5 29 191 -260 -178 75 218 -205 -272 -249 -147 -154 137 -10
4462 -10 -108 -499 -88 94 -11 -521 -558 109 -206 17 -24 -49 -338 -600 -1 50 -179 -371 -255 -266 232 238 128
4485 128 -229 -347 -191 235 429 -70 -80 -79 34 86 351 393 -558 -64 336 95 41 -82 -135 127 28 443 222
4508 222 47 -73 165 503 112 21 232 58 361 354 146 -7 -196 -41 445 316 208 -141 151 371 148
4529 148 472 337 -321 -330 119 235 466 125 -54 151 72 121 332 18 -248 -189 396 223 70 84 -89 -232
4551 -232 39 84 236 -184 -386 -79 41 -28 -162 159 -198 -331 92 71 -112 -397 5 115 -51 -81 37
4572 37 -174 -353 277 213 136 147 -90 -71 243 33 -270 -75 -248 -269 -21 361 45 -267 -445 113 -232 -465
4594 -465 6 43 -301 -633 209 196 -380 -284 12 -139 -115 -49 63 -166 -371 444 510 -27 -308 -482 36 195
4616 195 316 -160 -187 90 535 472 256 -266 -84 140 168 335 -156 181 -410 -68 488 624 -171 154 62
4637 62 211 148 282 112 -154 -55 189 225 287 -176 -61 -115 -247 366 120 10 -145 158 360 55 367 -14
4659 -14 217 75 -173 159 346 157 -401 110 424 -118 20 -167 407 327 165 -38 269 -205 -383 108 88
4680 88 151 -28 -196 117 77 164 201 88 -166 -71 474 -128 -262 -227 -89 -445 26 442 -121 -166 -371 2 10
4703 10 -297 -66 -325 -345 -174 -203 -16 18 -209 116 13 16 -119 -140 -199 -55 -98 -44 312 -354 -362 -105 34 -191
4727 -191 72 -212 -150 -146 135 89 -204 -424 -99 208 48 438 -142 75 -164 122 224 -132 -119 -157 233 327
4749 327 71 -72 56 20 199 265 182 -201 -98 -90 333 -232 210 304 15 72 238 363 144 190 -22 160 318
4772 318 141 266 32 13 58 404 284 22 -72 139 368 15 342 81 -43 -135 138 102 225 -174 -171 38
4794 38 0 156 316 -222 -239 81 103 128 -54 -97 94 -213 279 107 235 -439 -484 -22 209 36 -326 -249 -204
4817 -204 -114 -198 -123 -410 -45 -219 39 -91 -250 -169 -58 44 -45 -146 51 -435 -288 79 107 -232 -214 -35
4839 -35 -452 -175 -48 216 6 -283 -31 138 116 -94 -211 -258 -229 344 237 29 -349 68 -49 386 -377
4860 -377 -12 88 -17 30 15 240 126 180 -108 216 -78 127 303 -166 126 57 376 -109 96 -101 142
4881 142 163 20 27 297 76 284 234 208 -216 24 -172 -133 116 54 24 165 100 322 2 219 -29 66 279
4904 279 381 371 363 -56 281 53 221 88 -236 247 64 -90 286 -43 197 45 -73 315 125 -83 -380
4925 -380 -284 469 174 26 -54 -252 -72 128 -116 -31 -85 -229 -81 -5 -66 67 -162 -110 -68 -6 279 -143 -76
4948 -76 -175 -32 80 -211 123 -275 -372 171 193 49 -261 -272 120 -112 10 289 -337 -318 97 65 282 -380
4970 -380 -271 250 311 259 35 -392 -390 51 -253 712 562 361 515 -490 -130 -53 455 -283 -947 475 126
4991 126 165 249 420 -640 -106 152 509 -5 114 -126 123 324 523 177 -91 -243 568 189 68 94 -4
5012 -4 -108 240 261 135 1 114 -80 327 -93 -97 122 26 58 72 456 473 -86 -17 54 -35 207 32 -22 -29 27
5037 27 303 37 -159 12 -68 49 183 220 -136 -126 185 235 103 217 -44 70 -288 185 158 -139 -232 -171 -75
5060 -75 -87 35 -76 -52 -58 -5 -218 -21 -61 -135 -36 145 -174 -35 -124 -96 152 -232 82 -144 -160 -160 -126 10 27
5085 27 -65 -79 107 -295 -180 -64 -207 -166 -390 -157 7 -347 -139 -324 -43 77 -124 -58 -245 -78 -296 -272
5107 -272 -69 -665 622 611 -541 38 370 474 50 -6 -100 129 -188 282 34 -53 186 40 -318 396 36
5128 36 -28 469 173 82 -282 192 36 237 306 110 -248 94 -135 416 475 -59 -71 154 250 226 -183 95 -270
5151 -270 232 304 146 81 24 -319 -109 152 20 42 -24 -238 20 26 366 262 -185 234 412 -18 -191 157
5173 157 103 76 -29 180 15 18 -220 -186 -156 -74 19 -247 -90 -30 27 -213 -18 -220 -54 -63 61 -70 -255 -302
5197 -302 110 139 57 -155 139 -161 -235 93 -139 -122 -146 -324 -52 8 16 -34 -121 -84 158 -130 -227 124 -82 -82 217
5222 217 468 24 51 -12 0 -62 -17 116 -95 -125 -196 -119 299 73 21 -14 -91 -50 282 -70 60 94 134 293 116
5247 116 241 -222 131 239 108 -163 258 -24 224 288 440 -294 26 221 118 29 -99 58 34 207 158
5268 158 277 18 28 -162 94 166 148 -137 187 -138 6 87 198 -148 -6 178 58 224 288 -127 59 9
5290 9 -78 143 264 -42 17 126 221 -19 151 86 -258 -70 43 -18 33 -161 -100 -204 -54 117 -330 53 -203
5313 -203 -56 -77 -324 110 -271 -187 -343 -132 -201 -158 -258 -337 -313 -39 167 -191 -123 -109 38 -155 -40 -207 -67
5336 -67 -179 -339 -166 -92 -86 -108 102 -349 42 -35 -44 -143 -46 20 -320 -108 33 -303 -106 -39 -240 -30 -102 -195 55
5361 55 193 18 121 -54 -32 26 17 51 -260 -288 10 -93 192 -134 -22 -22 61 312 -30 -30 160 -47 238 0
5385 0 -130 -33 60 207 253 139 -139 -82 -39 266 44 180 117 -58 411 145 59 252 128 -154 -164 -122 165 60
5409 60 47 -45 125 164 81 112 110 77 7 -245 109 -46 -236 -215 -201 -41 10 -113 385 -105 418 63 40 -151 146
5434 146 55 -184 -202 -225 -328 -211 -233 -214 273 -52 -50 -46 -28 46 -74 -357 -99 -90 -63 56 14 -259 66 -357 116
5459 116 107 -31 235 41 -159 -53 -24 -226 -205 140 -14 129 166 13 -366 -313 -14 241 -312 -23 -156 6
5481 6 -3 78 281 -333 8 298 -242 -110 48 117 248 101 128 24 3 251 82 299 29 12 137 -251 273
5504 273 249 66 14 34 176 180 25 35 -9 161 -157 183 290 157 299 67 159 178 -116 -83 132 80 13 111
5528 111 215 81 334 -191 -65 157 116 74 14 -101 -95 -160 295 120 217 -212 -15 -277 348 -97 -193 -47 -60
5551 -60 106 -154 -243 -207 -11 -154 204 31 162 8 75 -142 -16 -257 103 -138 -52 -205 61 76 -109 88
5573 88 54 80 -77 -238 -185 -80 117 -30 -153 -172 -7 -83 -120 -187 7 16 -61 5 28 -166 -136 -257 -114 136 141
5598 141 7 -122 -220 -125 92 320 161 -9 -215 -96 -40 -90 100 -251 68 -201 -180 7 -69 81 -232 -8
5620 -8 242 125 -5 37 -130 70 219 115 14 -82 136 62 60 274 117 -49 71 258 404 -28 176 49
5642 49 274 273 55 175 328 221 32 68 225 51 -42 59 -9 94 194 97 51 -203 86 145 152 -48 30 56
5666 56 170 -87 30 -342 -91 -3 231 -129 -22 -151 -79 57 -94 -32 88 -56 -84 123 -139 313 -21 -66
5688 -66 -116 196 56 -257 -140 -128 -64 38 -76 67 -236 -123 -271 298 -26 -45 -120 -106 52 -47 103 140 88
5711 88 -141 -35 18 -92 -32 -36 -129 -70 -64 102 87 84 -67 -42 254 -155 73 63 -116 -194 -177 83 225 -119 -115 210
5737 210 94 -11 138 -319 127 239 8 -235 -27 63 10 113 34 185 67 53 10 250 151 403 -60 237
5759 237 349 135 -150 -18 -97 -156 25 124 -56 134 18 -64 282 144 71 -91 32 8 74 46 246 61 313
5782 313 -167 73 -83 58 35 320 63 106 83 80 -111 -90 -104 -72 203 70 57 -171 199 78 99 -111 -109 -62
5806 -62 64 -69 -171 -44 201 -39 -157 -39 -122 -242 -49 202 -311 -203 -102 -89 293 85 2 -67 23 129
5828 129 -337 50 86 -100 151 -39 -328 -269 -508 115 -75 -9 -91 -48 25 -196 73 97 68 147 -124 -74 -172 -108
5852 -108 -149 -251 -239 158 -36 -29 -36 -192 -41 106 -393 129 40 124 265 -137 -256 -39 254 -84 32 176 126
5875 126 178 -192 73 76 352 146 212 57 -27 -153 113 139 108 99 -98 89 -203 118 111 22 -110 86 202 175
5899 175 -126 -135 -11 -11 13 -133 -60 -511 -11 247 52 212 564 -62 100 -52 711 512 272 390 299 -225
5921 -225 -623 -25 -28 -120 259 15 -73 294 -79 784 440 734 -627 -268 920 168 -3 -16 1 -58 -117 112
5943 112 -106 -305 -296 265 59 -359 -224 522 -541 -150 -209 375 321 149 118 58 -199 -466 -176 -186 -305 -357
5965 -357 -199 810 130 95 -97 -301 129 -6 188 248 27 -87 -47 -280 -99 139 -115 -123 -142 -211 -172 41
5987 41 -27 -109 -35 51 -61 144 -113 70 109 235 -61 88 193 104 -42 269 181 -93 29 68 179 312 259
6010 259 -14 -85 35 86 169 127 78 96 -181 46 131 186 -11 -147 196 250 -27 195 176 146 114 77 -592 269
6034 269 806 118 -29 32 -652 -353 377 -853 290 440 -144 759 821 -170 -667 416 -388 952 534
6053 534 740 -124 672 -27 260 502 205 175 269 -589 -461 43 376 -44 -460 -605 526 417 -926 -15
6073 -15 -498 122 -506 -149 -333 -21 -249 -206 -23 308 31 215 -345 -12 -53 -78 32 -52 377 123 -138 -64
6095 -64 -134 -42 -289 -248 -182 166 37 -300 -104 88 18 151 -113 -238 95 151 -30 209 -22 316 -94 -154 91
6118 91 -74 50 92 -80 -5 130 38 132 -105 -139 19 6 25 -33 94 229 51 -41 -23 261 -46 185 160 266
6142 266 281 -35 36 -4 -184 343 -241 206 -116 274 339 203 -33 -160 92 98 118 -252 182 -141 143 145 122
6165 122 158 -206 -149 11 109 136 -22 -68 261 74 -156 99 -94 48 -227 167 98 50 -95 49 -35 15 -297
6188 -297 -120 -213 -34 5 -80 106 25 -124 -141 -577 565 -121 -279 -244 -289 -119 -257 -71 -271 122 -12 -149
6210 -149 -143 -263 -218 37 203 18 -66 -77 -290 -41 -266 -412 165 151 -27 -54 67 87 214 -124 145 -173 -157
6233 -157 325 78 17 127 -372 72 141 48 -167 -184 66 240 40 98 -361 -383 -469 -12 -9 -82 75 -79 406
6256 406 -322 -550 -404 243 503 59 -34 -537 -90 315 726 -432 -272 645 -89 510 -121 -654 -36 -451
6276 -451 77 384 -31 -20 191 -230 80 -133 131 571 -78 -357 335 419 559 317 584 0 -621 -399 145
6297 145 -333 -13 100 64 44 298 -5 -131 -110 -272 178 -126 -103 -82 -170 -79 -240 -90 -176 -76 -45 166 -120
6320 -120 -316 -169 -102 -230 -223 -58 -22 -15 -207 35 -233 -39 -18 39 40 -185 -174 -280 -36 139 34 20 46 -125
6344 -125 115 -34 -218 -104 70 -27 99 116 -206 42 224 9 58 -152 93 -170 99 127 -170 -114 93 139
6366 139 -87 350 -31 220 -223 -9 -114 154 43 34 89 131 -32 -3 205 98 280 360 261 87 -115 211
6388 211 -32 326 17 20 -57 99 269 112 112 171 -1 66 105 -342 130 31 78 125 112 99 -62 -53 87 -330 -148
6413 -148 413 -122 -32 144 -13 224 77 -269 8 55 -191 -177 134 -38 267 17 -247 23 158 -88 234
6434 234 91 120 50 -50 130 -166 -211 -147 235 -289 59 -107 -163 69 67 -83 -357 -148 -142 171 -283 74 -47
6457 -47 70 211 -54 -98 -222 -256 93 -55 23 -46 -230 -176 -200 133 -279 -142 161 -41 -103 6 -73 38 53
6480 53 -48 150 13 -252 -303 -152 122 -27 191 189 63 -94 -104 -274 -220 169 16 183 327 -85 220 82
6502 82 -48 -51 -66 243 168 73 254 209 -11 -4 -119 117 -80 -235 130 85 104 268 168 -132 -175 45 30 -123
6526 -123 -143 159 -136 18 228 -106 328 -255 184 -121 91 -193 -122 32 -341 -135 -47 233 19 10 -51 66
6548 66 -301 37 -37 295 -2 -112 -91 1 -265 10 -114 -47 52 21 35 -154 0 -12 132 6 27 -54 159 -75
6572 -75 -275 86 -54 45 -179 -41 -479 -83 53 59 -108 -277 -286 200 20 -194 -322 -281 -71 0 10 25 -69 -35
6596 -35 153 97 210 -8 -121 -61 50 -2 58 -174 93 298 20 84 -164 59 -54 -139 24 84 271 229 -198
6619 -198 38 17 37 -27 -76 -227 176 -25 107 -90 87 -99 -53 289 217 -198 11 103 -1 83 -148 206 69
6642 69 -131 -79 278 104 461 272 -59 -200 426 -25 -169 96 172 212 -18 130 152 -38 205 198 320 59
6664 59 -178 18 -94 -224 173 30 109 -147 37 -233 -129 162 102 81 129 -84 -204 51 -88 -162 -4 6
6686 6 -84 -142 -55 -31 -97 -60 -22 -155 18 -46 284 -49 -360 -264 63 11 -107 -171 63 110 25 29 10 177 200 -210
6712 -210 -281 -181 135 76 -358 56 115 20 -237 -415 1 -26 -121 -147 -92 -174 -200 -66 -131 -30 -91 -158 278 207 63
6737 63 -178 -132 -6 -245 102 -209 -73 -33 72 -51 70 -159 143 34 122 258 161 15 -247 -243 111 -39
6759 -39 168 -23 200 184 -112 102 201 -4 119 269 179 359 194 284 -34 -16 9 -219 222 127 68 62 187 -20
6783 -20 -194 165 -130 -294 -44 -246 -120 -136 98 165 122 79 9 -407 -159 -90 290 -5 -67 -95 4 140 41 -72
6807 -72 -9 -33 -173 -129 103 10 -349 102 222 -138 130 -97 15 -58 136 11 -235 -259 106 -21 239 -156
6829 -156 24 -109 146 -380 -62 -218 -241 216 142 -280 380 7 -1032 -340 312 197 -139 -260 -489 -720
6849 -720 -385 202 529 -232 -44 -582 -426 -30 -198 305 244 148 296 50 -416 5 46 -29 -275 32 -22 384
6871 384 164 -85 -77 292 -6 -4 -244 130 -38 21 -172 -5 20 34 96 172 58 -296 -45 -176 184 159 81 60
6895 60 91 -242 -128 40 -247 -103 139 90 137 -78 130 146 61 228 189 276 -53 222 -17 -115 -10 194 212
6918 212 17 -368 96 83 90 9 -173 348 140 20 -204 -69 -41 73 -60 -25 -81 -221 317 -91 213 -249
6940 -249 -32 -218 -227 -139 141 294 -379 184 377 -113 86 -1021 24 -89 -324 631 1071 482 -282 -259 -151
6961 -151 -111 -52 134 -6 27 -176 95 -26 3 -223 -39 -75 42 8 -18 48 142 48 130 90 -196 -55 -144 -151 235
6986 235 -96 -234 35 28 -100 -25 36 16 -86 -138 143 282 57 79 -75 -177 81 197 144 66 327 99 0
7009 0 57 249 -166 -95 -25 -72 -201 250 197 -259 36 116 228 133 94 3 264 314 -49 152 115 -260 -98 96
7033 96 -22 -65 25 99 -84 109 147 71 119 -222 -161 -39 -52 338 18 -7 -146 -49 -41 132 172 -106 -38 -28 -19 25
7059 25 259 332 -236 205 -85 -25 118 -295 -21 153 -291 1 195 -113 -40 95 -11 48 -257 26 -124 -85
7081 -85 -7 -304 -239 180 -48 -293 164 158 28 46 100 5 227 33 -221 57 102 69 153 -60 160 -301 -155 105
7105 105 16 -103 -160 121 -47 -3 28 98 73 193 5 -139 -71 56 -194 -127 -39 190 -186 236 -293 -124 77
7128 77 57 229 262 34 -190 104 -70 120 69 -41 6 85 301 112 188 -240 19 145 204 11 209 236 97
7151 97 195 -55 207 119 -91 134 43 80 -24 -190 91 -138 -55 170 -85 177 112 136 -136 227 26 -30 -257
7174 -257 205 -38 -242 190 -75 -44 -50 -455 -93 -135 -107 121 134 0 75 -129 -22 -95 -52 169 -56 -255 -208
7197 -208 247 154 -125 -191 168 -5 27 -14 -75 -1 94 43 148 34 -115 103 -49 58 88 -136 -75 -1 -67 -271
7221 -271 44 -117 -42 -250 -180 -275 217 -201 -196 103 -31 251 -29 -301 71 262 104 62 88 49 -45 109 -221
7244 -221 50 -7 -85 -344 -66 -3 -195 -4 -47 -117 66 63 201 58 -166 166 68 -226 -57 -45 -142 -57 79 52
7268 52 80 -99 216 14 213 -27 259 154 -82 65 1 -107 71 -100 163 82 -29 234 -51 -130 -208 -86
7290 -86 96 -137 66 119 -293 -232 14 67 88 -35 -54 -32 167 -60 -172 -51 -30 -186 -47 -118 17 -64 -77 -80
7314 -80 71 -103 -4 6 108 -65 74 -240 95 -47 -38 114 29 -107 148 98 -69 267 -353 32 -157 -25
7336 -25 -25 59 -130 -43 -161 436 94 -294 -856 395 -2 -86 -666 -73 145 -198 191 -158 -505 -18 -165 162
7358 162 166 162 138 108 -156 -122 -33 -42 -190 30 -48 -128 -56 -247 207 -54 -334 -330 129 -10 -5 103 -280 -188 -419 -56
7384 -56 410 -107 197 178 -47 350 76 -98 157 -10 -200 -13 -199 -418 -579 131 705 90 -398 -27 1
7405 1 257 -25 312 -642 -91 -101 -610 69 90 -378 -363 -1355 527 -56 -94 -615 316 -533 -486 191 205 -196
7427 -196 -275 -182 -466 -409 -957 421 -598 605 943 68 -290 79 330 -145 -31 284 -343 -233 227 590
7447 590 -533 -141 388 287 -979 -156 -337 -423 -16 465 534 -9 434 -212 -84 1131 242 -77 16 123
7467 123 -107 -282 -35 -508 -53 -91 -173 109 293 118 -94 -244 -376 269 -354 296 -51 -40 -466 513 -30
7488 -30 181 350 -62 72 -109 -9 -139 24 28 45 161 -256 -157 -495 -93 327 155 58 169 170 48 209 289
7511 289 113 -16 42 314 133 -104 123 90 122 306 77 -196 129 -100 -41 -292 35 84 205 178 2 44
7533 44 42 268 -79 -102 -111 218 400 206 23 -41 144 9 134 100 -74 177 -38 161 47 16 -33 76 -319
7556 -319 -91 -6 150 167 340 47 168 225 159 253 -14 193 23 -34 -43 -107 14 3 38 -66 -200 -93 77 307
7580 307 -47 -262 81 -169 48 44 23 52 105 -78 42 84 -64 -81 -25 114 -146 -85 161 80 -63 -140 43 -330
7604 -330 -190 123 91 -190 -102 150 24 -59 -122 -114 -107 108 66 40 -62 -150 -94 42 55 145 115 10 -141 -70 -229
7629 -229 -111 52 319 110 -97 -74 15 128 9 -204 -104 19 -27 -151 168 73 87 319 156 325 37 -94
7651 -94 103 -201 72 -30 148 -176 -9 -178 50 -31 -7 -72 51 -243 -242 -281 91 36 -35 -180 -12 30 103 -521
7675 -521 444 -270 -6 208 -313 78 187 94 -181 188 -77 -62 -294 107 -127 129 -78 9 -141 51 21
7696 21 24 -21 -124 206 -177 -104 -185 -62 -320 12 -174 -89 210 -230 -116 -162 -37 142 71 12 -14 -44 -185 -11
7720 -11 115 81 -70 -203 363 -75 164 -192 -82 -156 26 -1 122 133 126 148 65 134 12 93 -63 -71 -31 -26 33 52
7746 52 -110 312 -136 38 -58 25 -6 146 196 82 81 -189 -4 3 2 -27 -116 105 -58 225 -111 -209 -51 182 -89
7771 -89 180 29 61 -120 176 -48 -5 80 38 165 -18 94 -291 -55 -87 -55 90 -116 -135 96 41 -147 9
7794 9 -58 -240 115 -188 -32 -74 -164 92 144 -310 -202 -59 -229 61 -232 -109 -193 123 31 -81 459 159 14
7817 14 118 261 67 40 92 -223 175 -67 57 -327 -115 150 131 -2 18 -35 -46 -60 -8 -300 -36 -109 154
7840 154 -204 -72 194 148 -84 -174 368 64 183 -25 239 13 58 213 -193 -299 -94 128 81 -128 12
7861 12 24 16 -3 -91 8 16 51 98 -51 137 228 -30 189 85 120 -218 92 91 79 71 215 28 -110 -138 26 97 -49
7888 -49 41 10 -12 -122 -75 -106 -64 -30 177 -57 -1 -34 -6 -92 110 130 255 -218 -6 99 -51 -175 -260 106 -69
7913 -69 113 -155 49 263 71 106 225 -131 -76 173 -62 16 -26 38 -138 -88 -161 -24 82 340 -16 -136 28
7936 28 25 152 -60 -32 -115 13 -27 -34 168 -283 89 -175 -313 77 -148 25 -195 -76 -73 258 49 -128 -57 -146
7960 -146 47 -67 54 70 26 -37 37 -18 14 40 -87 188 -1 136 104 38 213 -23 31 88 -40 -14 135 -101
7984 -101 -52 -305 54 -40 -262 -116 -17 157 57 98 -255 -159 31 -162 -21 -140 -43 7 128 164 67 -200 72
8007 72 0 233 148 100 -123 66 49 -119 -158 74 36 199 153 -138 -223 -96 -41 -196 -34 19 317 275 133 70
8031 70 94 -92 249 -18 105 288 105 -97 -216 -105 71 -112 236 1 -32 268 -72 -1 304 -22 -122
8052 -122 -73 -64 -24 139 163 -263 -96 -141 -9 86 255 -34 -114 102 -6 186 -197 48 -228 179 179 -112 75
8075 75 -88 -203 -155 -81 -174 -152 -193 83 108 79 84 -89 178 93 90 106 26 111 144 -93 93 46 -26 109 9 -88 67
8102 67 -119 121 27 -255 -420 169 -293 -501 -134 -738 1019 -1093 -806 88 86 711 495 1148 598 -1287
8122 -1287 -164 -155 -398 212 431 530 -600 209 -96 874 -520 -946 -156 438 -430 22 402 -266 375 -1053
8142 -1053 -265 -713 645 -145 736 286 464 609 819 -897 -966 -603 -189 12 261 62 -280 -730 -35
8161 -35 -239 207 117 946 171 755 -630 195 648 -677 317 -264 175 217 616 -170 171 -794 -144 198
8181 198 -327 -469 270 119 1103 -488 -181 -123 214 -174
8191a74
##END NTUPLES=NMR FID
##END=
