##TITLE=1H_Ser AmSTPisN
 200.13Hz,CDCl3.
 8 sc
 5.6.2026
##JCAMPDX= 6.0         $$ Bruker NMR JCAMP-DX V2.0
##DATA TYPE= NMR FID
##DATA CLASS= NTUPLES
##ORIGIN= UXNMR, Bruker Analytische Messtechnik GmbH
##OWNER= pz
$$ XWIN-NMR		Version 3.5
$$ Fri Jun  5 15:41:40 2026 Russian Standard Time (UT+4h)  she@DPX200
##.OBSERVE FREQUENCY= 200.131
##.OBSERVE NUCLEUS= ^1H
##.DELAY= (6, 6)
##.ACQUISITION MODE= SIMULTANEOUS
##.ACQUISITION SCHEME= undefined
##.AVERAGES= 8
##.DIGITISER RES= 18
##SPECTROMETER/DATA SYSTEM= spect
##.PULSE SEQUENCE= zg30
##.SOLVENT NAME= CDCl3
##.SHIFT REFERENCE= (INTERNAL, CDCl3, 0, 14.3821)
##AUDIT TRAIL= $$ (NUMBER, WHEN, WHO, WHERE, WHAT)
$$ ##TITLE= Audit trail, XWIN-NMR		Version 3.5
$$ ##JCAMPDX= 5.01
$$ ##ORIGIN= Bruker BioSpin GmbH
$$ ##OWNER= she
$$ F:/spectra/data/she/nmr/H-C/1/audita.txt
$$ ##AUDIT TRAIL=  $$ (NUMBER, WHEN, WHO, WHERE, WHAT)
(   1,<2026-06-05 15:40:20.17 +0400>,<she>,<DPX200>,
      <created by zg, POWCHK disabled, PULCHK disabled
       configuration hash MD5:
       00 E9 B6 7A A2 85 ED C7 34 08 36 98 17 FE 4E 26
       data hash MD5: 16K
       C4 C9 44 D6 D6 C6 D7 BA D1 5A F2 B4 0D 30 96 46>)
$$ ##END=
$$ 
$$ hash MD5
$$ 5C A3 25 60 5D A7 F6 0A 8B 34 A7 16 A3 62 DE F6
##$RELAX= 
##$RELAX= 
##$RELAX= 
##$RELAX= 
##$RELAX= 
##$RELAX= 
$$ Bruker specific parameters
$$ --------------------------
##$DU= <F:/spectra>
##$EXPNO= 1
##$NAME= <H-C>
##$PROCNO= 1
##$TYPE= <nmr>
##$USER= <she>
##$AMP= (0..31)
100 100 100 100 100 100 100 100 100 100 100 100 100 100 100 100 100 100 
100 100 100 100 100 100 100 100 100 100 100 100 100 100 
##$AQSEQ= 0
##$AQ_mod= 1
##$AUNM= <au_zg>
##$AUTOPOS= <>
##$BF1= 200.13
##$BF2= 200.13
##$BF3= 200.13
##$BF4= 200.13
##$BF5= 200.13
##$BF6= 200.13
##$BF7= 200.13
##$BF8= 200.13
##$BYTORDA= 1
##$CFDGTYP= 0
##$CFRGTYP= 5
##$CHEMSTR= <none>
##$CNST= (0..31)
1 1 145 1 1 1 1 1 1 1 1 1 1 1 1 1 1 1 1 1 1 1 1 1 1 1 1 1 1 1 1 1 
##$CPDPRG= <>
##$CPDPRG1= <>
##$CPDPRG2= <>
##$CPDPRG3= <>
##$CPDPRG4= <mlev>
##$CPDPRG5= <mlev>
##$CPDPRG6= <mlev>
##$CPDPRG7= <mlev>
##$CPDPRG8= <mlev>
##$CPDPRGB= <>
##$CPDPRGT= <>
##$D= (0..31)
0 0.7 0 0 0 0 0 0 0 0 0 0.03 0 0 0 0 0 0 0 0 0 0 0 0 0 0 0 0 0 0 0 0 
##$DATE= 1780659619
##$DBL= (0..7)
120 120 120 120 120 120 120 120 
##$DBP= (0..7)
150 150 150 150 150 150 150 150 
##$DBP07= 0
##$DBPNAM0= <>
##$DBPNAM1= <>
##$DBPNAM2= <>
##$DBPNAM3= <>
##$DBPNAM4= <>
##$DBPNAM5= <>
##$DBPNAM6= <>
##$DBPNAM7= <>
##$DBPOAL= (0..7)
0.5 0.5 0.5 0.5 0.5 0.5 0.5 0.5 
##$DBPOFFS= (0..7)
0 0 0 0 0 0 0 0 
##$DE= 6
##$DECBNUC= <off>
##$DECIM= 32
##$DECNUC= <off>
##$DECSTAT= 4
##$DIGMOD= 1
##$DIGTYP= 9
##$DL= (0..7)
0 120 120 120 120 120 120 120 
##$DP= (0..7)
150 150 150 150 150 150 150 150 
##$DP07= 0
##$DPNAME0= <>
##$DPNAME1= <>
##$DPNAME2= <>
##$DPNAME3= <>
##$DPNAME4= <>
##$DPNAME5= <>
##$DPNAME6= <>
##$DPNAME7= <>
##$DPOAL= (0..7)
0.5 0.5 0.5 0.5 0.5 0.5 0.5 0.5 
##$DPOFFS= (0..7)
0 0 0 0 0 0 0 0 
##$DQDMODE= 0
##$DR= 18
##$DS= 0
##$DSLIST= <SSSSSSSSSSSSSSS>
$$ [...]
##$SUBNAM0= <"">
##$SUBNAM1= <"">
##$SUBNAM2= <"">
##$SUBNAM3= <"">
##$SUBNAM4= <"">
##$SUBNAM5= <"">
##$SUBNAM6= <"">
##$SUBNAM7= <"">
##$SUBNAM8= <"">
##$SUBNAM9= <"">
##$SW= 18.0517599122864
##$SWIBOX= (0..15)
0 0 2 0 0 0 0 0 0 0 0 0 0 0 0 0 
##$SW_h= 3612.71676300578
##$TD= 16384
##$TD0= 1
##$TE= 0
##$TE2= 300
##$TE3= 300
##$TEG= 300
##$TL= (0..7)
0 120 120 120 120 120 120 120 
##$TP= (0..7)
150 150 150 150 150 150 150 150 
##$TP07= 0
##$TPNAME0= <>
##$TPNAME1= <>
##$TPNAME2= <>
##$TPNAME3= <>
##$TPNAME4= <>
##$TPNAME5= <>
##$TPNAME6= <>
##$TPNAME7= <>
##$TPOAL= (0..7)
0.5 0.5 0.5 0.5 0.5 0.5 0.5 0.5 
##$TPOFFS= (0..7)
0 0 0 0 0 0 0 0 
##$TUNHIN= 0
##$TUNHOUT= 0
##$TUNXOUT= 0
##$USERA1= <user>
##$USERA2= <user>
##$USERA3= <user>
##$USERA4= <user>
##$USERA5= <user>
##$V9= 5
##$VALIST= <valist>
##$VCLIST= <CCCCCCCCCCCCCCC>
##$VD= 0
##$VDLIST= <DDDDDDDDDDDDDDD>
##$VPLIST= <PPPPPPPPPPPPPPP>
##$VTLIST= <TTTTTTTTTTTTTTT>
##$WBST= 1024
##$WBSW= 4
##$XGAIN= (0..3)
0 0 0 0 
##$XL= 0
##$YL= 0
##$YMAX_a= 274906
##$YMIN_a= -93507
##$ZGOPTNS= <>
##$ZL1= 120
##$ZL2= 120
##$ZL3= 120
##$ZL4= 120
##$ABSF1= 10
##$ABSF2= 0
##$ABSG= 5
##$ABSL= 3
##$ALPHA= 0
##$AQORDER= 0
##$ASSFAC= 0
##$ASSFACI= 0
##$ASSFACX= 0
##$ASSWID= 0
##$AUNMP= <proc_1d>
##$AZFE= 0.1
##$AZFW= 0.1
##$BCFW= 1
##$BC_mod= 2
##$BYTORDP= 1
##$COROFFS= 0
##$CY= -3
##$DATMOD= 1
##$DC= 2
##$DFILT= <>
##$DTYPP= 0
##$F1P= 0
##$F2P= 0
##$FCOR= 0.5
##$FTSIZE= 0
##$FT_mod= 4
##$GAMMA= 1
##$GB= 0.15
##$INTBC= 1
##$INTSCL= 1
##$ISEN= 128
##$LB= 0.25
##$LEV0= 0
##$LPBIN= 0
##$MAXI= 10000
##$MC2= 0
##$MEAN= 0
##$ME_mod= 0
##$MI= 1.114404
##$NCOEF= 0
##$NC_proc= 0
##$NLEV= 6
##$NOISF1= 3.799351
##$NOISF2= 2.8
##$NSP= 1
##$NTH_PI= 0
##$NZP= 0
##$OFFSET= 14.38212
##$PC= 1
##$PHC0= -4216.012
##$PHC1= 7.992291
##$PH_mod= 1
##$PKNL= yes
##$PPARMOD= 0
##$PSCAL= 0
##$PSIGN= 0
##$REVERSE= no
##$SF= 200.129724274929
##$SI= 16384
##$SIGF1= 3
##$SIGF2= 2
##$SINO= 400
##$SIOLD= 16384
##$SREGLST= <1H.CDCl3>
##$SSB= 0
##$STSI= 0
##$STSR= 0
##$SW_p= 3205.1282051282
##$SYMM= 0
##$S_DEV= 0
##$TDeff= 0
##$TDoff= 0
##$TI= <>
##$TILT= no
##$TM1= 0
##$TM2= 0
##$TOPLEV= 0
##$USERP1= <user>
##$USERP2= <user>
##$USERP3= <user>
##$USERP4= <user>
##$USERP5= <user>
##$WDW= 1
##$XDIM= 8192
##$YMAX_p= 0
##$YMIN_p= 0
$$ End of Bruker specific parameters
$$ ---------------------------------
##NTUPLES= NMR FID
##VAR_NAME=  TIME,          FID/REAL,        FID/IMAG
##SYMBOL=    X,             R,               I
##VAR_TYPE=  INDEPENDENT,   DEPENDENT,       DEPENDENT
##VAR_FORM=  AFFN,          ASDF,            ASDF
##VAR_DIM=   8192,          8192,            8192
##UNITS=     SECONDS,       ARBITRARY UNITS, ARBITRARY UNITS
##FACTOR=    0.0002768,     1,               1
##FIRST=     0,             0,               0
##LAST=      2.2672688,     0,               0
##MIN=       0,             -93507,          0
##MAX=       2.2672688,     274906,          0
$$ Real data points
##PAGE= N=1
##DATA TABLE= (X++(R..R)), XYDATA
0@%%%%%%%%%%%%%%%%Oj4J6j6J6j6K4l2L2m0M8n5O3p2Q4r4J06j20J38j56J74j97
38a05K21k45K74l06L38l74M16m61N09n61O19o83P50q25R10j003J108j226J356
57G12j505J680j880K118k407K762l213L806m631N858p906J2134l5914R9979J13666
72A85259o7675j10665p0145J9240L8525K1354q765J1522L4855L4860r759m4354
84C4252n8769l8629N908O3228P6783L1703l6753o6043m9540n955K6345K7446K233
97A2209m001J7906K3915j7309n7824m5682R208M7114L7806m107l1269j6880J8312
110a0602K0931j6456m0880j7213K6019M5492L0815k478l3484l6847n478K9298
122a0883L3217L433k7453k7554J1370N0241L8860k1669o6424m3660J9189N9923
$$ plain form
0 0 0 0 0 0 0 0 0 0 0 0 0 0 0 0 0 0 6 -8 8 -8 8 -8 16 -16 16 -24 24 -31 32 -40 44 -50 56 -64 74 -82 92 -105
38 -105 116 -129 145 -161 177 -197 219 -242 267 -294 325 -358 392 -433 477 -526 582 -644 712
57 712 -793 887 -993 1125 -1282 1480 -1733 2073 -2558 3300 -4606 7528 -28386 71593 185259
72 185259 117584 6919 -63226 -43986 -5461 15893 7128 18650 53505 88365 78606 34252
84 34252 -24517 -63146 -57238 5990 82773 114476 77723 11680 -37860 -43815 -17470 9976 12209
97 12209 8208 26114 50029 32720 -25104 -70786 -61578 -14464 23342 19235 -12034 -28914 -10602
110 -10602 10329 -6127 -47007 -64220 -38201 7291 38106 35628 2144 -34703 -40181 -10883
122 -10883 22334 25767 -1686 -29240 -17870 32371 71231 49562 -16862 -60522 -41333 18590
134A8590M6768j207m0755l6105o1K1080O357j4946j0467J0864K2361J6849n675
147C3653l0455l5341j0204K1772L2134J8020q776k7108k2399K355J7892M216j4311
160a8552o745J8794K5934K831k7313l1972l997K8811K8928p32k3784j4268J0127
173a1938K0977J1474n912j6878j1219N783J6447J0948r27p893o119J375R403M425
187A9946j3184k0582m638K1559K9476J1726j8824l4994k2148Q572K5170J4291
199A6370l299n245j40j824j0639j5331r418P399K3530K1280J168j9080k4180j5931
213c5340J416J8500K0653O763o567o008o07j417p828r649q66J5910K5814J3079
227C3853j5138k7126j3010Q443J7525J1403o9r271n220M852O087l617q065l821
$$ plain form
134 18590 65358 64151 23396 -12709 -12770 8310 14667 -279 -10746 118 22479 39328 33653
147 33653 3198 -32143 -42347 -20575 11559 29579 20803 -6305 -28704 -26349 -8457 -4241 -18552
160 -18552 -25297 -6503 19431 22262 -5051 -37023 -41020 -12209 16719 15987 -7797 -22065 -11938
173 -11938 9039 20513 14601 -2277 -13496 -7713 8734 19682 18755 10862 4743 6118 15521 19946
187 19946 6762 -13820 -18458 3101 32577 44303 25479 -9515 -31663 -23091 2079 16370
199 16370 13071 7826 7686 5862 -4777 -20108 -29526 -22127 1403 22683 23851 4771 -19409 -35340
213 -35340 -33924 -15424 5229 11992 5425 -583 -1190 -2607 -10435 -20084 -20950 -5040 20774 33853
227 33853 18715 -8411 -21421 -12978 4547 15950 15881 6610 1390 6242 12329 8712 647 -3174
241c174K645O419R890M480r758j7353n888Q921J1424L059o967j1432m120Q657
255c197R910n098j5017n832P817R908K648m559q401m276L551N088k19j752L027
270f402L456n11J11J184k231l625K185P258M596Pj673m374k069O329Q046j476
286A0811p524K08P281K167n378m603j418M021Q339M803p321j1527j276O865M091
301I539j688k773m389m933N69N046K43m948l784j383J717N341N003m784r852j648
317a2724Q089N601k808n633m290M51Q800Q617k055q082k499N549L526J462K514
332F518l3m760k686L773L237O4P66Q41k008n71L601K10n968l009N490N515j198
349I782m042l709m223l73L622J683j862j34J722l981p893j554M549M150J668j11
$$ plain form
241 -3174 -529 5890 15780 20260 10502 -6851 -12739 -3818 7606 10665 3698 -7734 -11854 -3197
255 -3197 6713 1615 -13402 -19234 -11417 -1509 1139 -3420 -11821 -16097 -12546 -7458 -7677 -9429 -6402
270 -6402 -2946 -3457 -3346 -2162 -4393 -8018 -5833 1425 6021 6028 4355 -19 -2088 4241 12287 10811
286 10811 3287 3495 10776 12943 7565 2962 1544 5565 13904 18707 11386 -141 -1417 5448 9539
301 9539 7851 5078 689 -4244 -3675 1371 1614 -3334 -7118 -8501 -6784 -1443 3560 -1224 -11076 -12724
317 -12724 -4635 966 -1842 -7475 -11765 -11314 -2514 6103 4048 -4034 -6533 -984 2542 4004 6518
332 6518 6485 1725 -961 2812 6049 6113 6879 7720 5712 5141 8742 8952 2984 -25 5465 10980 9782
349 9782 5740 2031 -2192 -2565 1057 2740 878 744 2466 -1515 -9408 -10962 -6413 -2263 -595 -706
365g06l584m846j276J777Q66J994N948L806l656m684n60l70j039J497N829M723
381E719L023K06n841p051M13Q465N600j901j781Q44r0j321j698k268k370J460
397A409L849J72k105M95M69l927m532J25K088m76j164P74J694J628j279o212q551
414a5543j575P836R314L102j674k907m169m443k029M73L970Q085P365N67m238
429D134m140m270m895o04Q583J2833P310j788r770j2512m676N475P716L498J735
444H629K818L13m462n963l101j312k62J707L375L123L378k408j0296j0468j336
459a6265Q125Q343K230k869l448j237J742K79m264m163l17L455M989Q355O275
474A1230m117j3446j1532l84R452J4228Q731k584j0060n329J657M75k002M40M411
$$ plain form
365 -706 -4290 -9136 -10412 -8635 -7769 -5775 173 3979 323 -4361 -4921 -5291 -6330 -4833 996 5719
381 5719 8742 8948 3107 -3944 -3531 4934 10534 8633 6852 7696 7606 6285 4587 2319 -51 1409
397 1409 5258 5430 3325 3820 4289 362 -4170 -4045 -1957 -2433 -3597 -2823 -1129 499 -780 -6992 -15543
414 -15543 -17118 -9282 32 3134 1460 -1447 -5616 -10059 -12088 -11615 -7645 440 7805 8372 4134
429 4134 -6 -4276 -9171 -9775 -1192 11641 18951 17163 7393 -5119 -9795 -4320 3396 6894 8629
444 8629 11447 11760 7298 1335 -1766 -3078 -3340 -1633 1742 4865 8243 5835 -4461 -14929 -16265
459 -16265 -8140 203 2433 -436 -3884 -5121 -3379 -3100 -7364 -11527 -11844 -8389 -3400 4955 11230
474 11230 7113 -6333 -17865 -18249 -8797 5431 14162 11578 1518 -3811 -2154 -1679 -3681 -3241 1170
489A170P091P495M790l052j1230j1781n303M151J3339J5022L340j1811j5305o613
503h697J425M590L594Q40l24J477K772j734o835n289l513k525K459J1352J1969
518A1561J161j0299j3904r280J045J0635J1027K113k642L51J149l837n155k265
532h340Q91K767Q348J0940O235k511j0726j5085j1163N778J9065J5900j70r144
546A2785r317n823j435J388P66N77N596P385R29o194o940o068o734r83Q344J0712
562D988N081k534p766j0745n625L642O368K010K031M553J455k777l855r13k442
577f529k440K160N704N506N049K844n883j1537p353K673P112P668Q137K742n349
592A0504p685m205m89J095L133L624K227L160L494l450j2059j0528J8P502P548
$$ plain form
489 1170 8261 15756 20546 17494 6264 -5517 -10820 -6669 6670 21692 25032 13221 -2084 -8697
503 -8697 -7272 -2682 912 1752 1428 2905 5677 3943 -2892 -8181 -11694 -14219 -11760 -408 11561
518 11561 12722 2423 -11481 -20761 -19716 -9081 1946 4059 1417 1768 2917 -920 -6075 -8340
532 -8340 -7449 -4682 3666 14606 20841 18330 7604 -7481 -18644 -12866 6199 22099 21929 12785
546 12785 3468 -2355 -3790 -2402 -1636 -1059 4537 11922 12851 6657 -283 -6351 -13085 -14068 -5724 4988
562 4988 10069 7535 -231 -10976 -16601 -12959 -6591 -4581 -2550 2003 3458 681 -3174 -4087 -6529
577 -6529 -8969 -6809 -1105 4401 9450 12294 6411 -5126 -12479 -9806 -2694 4974 13111 15853 10504
592 10504 2819 -1386 -1875 -780 2353 5977 8204 11364 14858 11408 -651 -11179 -11161 -3659 3889
607C889M445q23o100p069m732j958J245O893O892n10n666k048J559K47k436j755
623g927m99J962M581L297k161m139J95J281k413j696M640O908K013j235j754m65
639B588J732J558k641n378N69R233Q707k90p270p936n319j387L628N414L837P93
655G838l450p057m860O98L034M68k11K729L574j35k910o472o080j32O675P069
671G78J144k411l158l094k892J584M975L367P62k85l29o99Q04J077j693k148K039
688a79M910K241k95j257j137j647j360l86P41K065J641o52k307K41K176j055l821
705h1j969J231L423K000l41m209n011j089K223J761P74J425M19k688k847o24J655
722c948M93P53J94p20L20J268o62l265j301L827M993J845j127k575k111N56K875
$$ plain form
607 3889 8334 7511 1411 -5658 -10390 -12348 -11103 -4210 2682 2172 -3494 -5542 -3983 -3736 -6172 -7927
623 -7927 -8426 -6464 -1883 1414 -747 -4886 -4691 -3410 -5823 -7519 -2879 4029 6042 4807 3053 2588
639 2588 4320 5878 3237 -2141 -1572 7661 16368 16078 8808 872 -4447 -5834 -2206 3208 7045 7838
655 7838 4388 -2669 -7529 -6831 -3797 -3329 -3540 -811 2763 2628 -282 -6754 -12834 -12966 -6291 778
671 778 1922 -489 -3647 -6741 -9633 -8049 -3074 293 1055 770 441 -258 546 1623 -70 -2218 -179
688 -179 4731 6972 6677 5420 4283 2636 1276 890 1631 3696 5337 4685 2378 2619 4795 3740 -81
705 -81 -2050 -819 2604 4604 4263 54 -4957 -6046 -3823 -2062 -1288 137 556 -2132 -4979 -5603 -3948
722 -3948 -3455 -2702 -2508 -3228 -2908 -1640 -2302 -5567 -6868 -3041 1952 3797 2670 95 -2016 -1460 1415
739A415J841l18L78R1j676j029K626K850l68k174p91M0o23O59k8j805j284J467
757A271J295j320k046n8k0k12R52J792j525k918r83MM52J743J719j286l663m40
775e243K212J293L52J561P0k064q15P51l4j21J908J823m94O3J951k30k760n41
793c18K882K241n7r94j973k743O1K999J797l35o88j43k565j881J269K103j79p86
811F90j14j348j927l6M9j470r6L450K221k339l417j017j61R70K840K382k005l086
829d414n96J23M6K398M008N57j880j119J432m11o02O23J176N58K086Q03j797k847
847A44L12K167J039J41P52r04k325k46J064M92j40M51j225l112r98K902K226j323
865A417r93j01k268j842J065J353o86J9J169j76k677o7M76n15l70L305L944k53
$$ plain form
739 1415 3256 2938 3316 3407 1731 702 3328 6178 5810 3636 2845 2885 2262 2921 2893 1088 -196 1271
757 1271 2566 1246 -800 -858 -878 -1090 -138 1654 129 -2789 -3772 -3768 -3316 -1573 146 -1140 -4803 -5243
775 -5243 -3031 -1738 -1386 175 245 -1819 -2634 -1883 -1917 -2038 -130 1693 1199 1262 3213 2983 223 -318
793 -318 2564 4805 4748 3754 1781 -962 -901 2098 3895 3560 2872 2729 164 -1717 -448 1655 1476 690
811 690 576 -772 -2699 -2735 -2686 -4156 -4252 -802 1419 -920 -4337 -5354 -5515 -4545 -1705 677 -1328 -4414
829 -4414 -5010 -4887 -4841 -2443 1565 2122 242 -877 555 144 -458 165 1341 1899 3985 4788 2991 144
847 144 456 2623 3662 3803 4555 3651 1326 1080 2144 2636 2496 2947 1722 -1390 -2388 514 2740 1417
865 1417 424 323 -1945 -3787 -2722 -1369 -2055 -2036 -867 -1043 -3720 -3787 -3311 -3826 -4196 -891 3053 2800
883B800k934l457k085J073M584N166K32k608j747m61m3J248J322no13P08J556
900D736K20j359j515k183p04L065L719l44l071k293o61N84J186O12k199l221Q1
917c347L005J791q84q21j909k997p63J722K609J703Q72j119k931k412K00J739
933c542J101J816J895Q2p82q28j266j943Q9K234K966K635J869j606m018m523P84
950c037L644M150K662q02l519l253P55K096j16j929q50L03J308J843J77k779k927
967b274p12R41J016P92J044j367j278N1P82j156j507m32O41J340K061J094j575
984e39k903q32K16J11J277K956L204O76j113l155m033k61M241M902J809j137k600
1001B819k295j560J049J328l67o37J285J789Q76n32k006m449k642L733N194J012
$$ plain form
883 2800 -134 -3591 -5676 -4603 -19 5147 5379 2771 1024 563 520 1768 3090 3085 2472 3180 4736
900 4736 4956 3597 2082 -101 -805 2260 5979 5635 2564 271 -390 194 1380 1992 -207 -3428 -3347
917 -3347 -342 1449 565 -256 -2165 -5162 -5925 -4203 -1594 109 981 -138 -3069 -5481 -5281 -3542
933 -3542 -2441 -625 1270 1352 570 -258 -1524 -3467 -3378 -1144 1822 4457 6326 4720 702 -3821 -3037
950 -3037 607 4757 7419 6617 3098 -155 600 2696 2580 651 -199 104 1412 3255 3432 653 -2274
967 -2274 -2986 -2045 -1029 -237 807 -560 -1838 -1787 -1005 -2161 -3668 -4100 -3459 -2119 -58 1036 -539
984 -539 -3442 -4274 -4058 -3947 -2670 286 3490 4166 3053 -102 -4135 -4396 -155 4747 6556 5419 2819
1001 2819 524 -1036 13 1341 974 337 1622 3411 4287 3755 1749 -2700 -5342 -1609 3585 4597
1017D597k922l153j791o8J750J703j858k565J72J829M11P8M19j108k604q71K225
1034c756K476J931K015q78k899j785M37L69Q43K246K403n71k458o38K17k44M18
1051A26k7K2K334M597J857n194o676j471M106M556L025n78m109m260l45K048J345
1068A356k16j057k022j909J948L691l23m570l354J345L571L282K08l785l614J131
1084d318L852P26k347j514N10R77J580K293J71j142q34q19r21J527M241K029j995
1101D016k286p7J93j275J64J936J254N58l53k351k952O7K105k84k450M45L165
1118A875J452k628l443j776N99L947K618j677l901j578P30R50J135O16p56j875
1134c712m86J865J691Q94l84j628j127J888L777k31l305j760K436K791J001j139
$$ plain form
1017 4597 1675 -1478 -3269 -3337 -1587 116 -1742 -4307 -4135 -2306 -1895 -1817 -1398 -2506 -5110 -5981 -3756
1034 -3756 -1280 651 2666 1788 -1111 -2896 -2459 -2090 -1247 999 3402 2831 373 -265 -48 -292 126
1051 126 99 121 2455 7052 8909 3715 -2961 -4432 -326 4230 7255 6677 2568 -1692 -2037 11 1356
1068 1356 1140 83 -1939 -3848 -1900 1791 1468 -3102 -6456 -5111 -1540 1742 1950 -1835 -5449 -4318
1084 -4318 -466 260 -2087 -3601 -3091 -2114 -534 1759 1930 788 -46 -865 -1786 -259 3982 6011 4016
1101 4016 1730 1653 1846 571 735 2671 3925 4483 4130 1779 -1173 -1106 999 715 -1735 -1290 1875
1118 1875 3327 699 -2744 -4520 -3921 26 2644 967 -2934 -4512 -3782 -2832 -1697 -1081 -1837 -3712
1134 -3712 -4198 -2333 -642 252 -132 -1760 -2887 -999 2778 2547 -758 -2518 -82 2709 3710 2571
1150B571l171k070K233M086J442j997j999j024n26P61J465J064q36m66K14L15
1166B062r60q51n78p71J057J954j48k985k117J23J052J064Q17m40r59K20N03l07
1184a264r92P18J588Q34q05j037o55k10R66K049N05q02o89j12j79J201J286l10
1202B092j392j38R91Q61q00o64o5J36J887J414j838l033j627K065J813M95n89
1219A608k414j718Q7K140O89p83q87J27J21L25J92j298j198P65J715Q36n85j187
1237a465j391j094K377K844M10j842j246n10M91J420J212n89j044J96J829L52
1253A950j510k8M07P19Q75M89j008j771q47J580Q70j05M2q5j646p59N74L58J15
1272B20K00K92r88j036l81J51Q9P07J156l84k013nM42M3L21O93l53p45K76J038
$$ plain form
1150 2571 -600 -2670 -437 3649 5091 3094 1095 71 -455 306 1771 2835 1999 1533 1747 2062
1166 2062 1102 251 -327 -1098 -41 1913 1765 -1220 -3337 -3214 -2162 -1098 -281 -721 -1680 -1460 -957 -1264
1184 -1264 -2256 -1538 50 884 79 -958 -1613 -1823 -857 1192 1697 895 206 94 -85 1116 2402 2092
1202 2092 700 562 1553 2414 1614 950 885 1021 2908 4322 2484 -549 -2176 -111 1702 2197 1608
1219 1608 -806 -2524 -2437 -297 392 -391 -1278 -1151 -1030 -705 -513 -1811 -3009 -2244 -529 307 -278 -1465
1237 -1465 -2856 -3950 -1573 1271 1681 -161 -1407 -1917 -1426 -6 1206 617 -427 -231 1598 1950
1253 1950 440 412 819 1538 2413 2902 1894 123 -724 856 1726 1621 1663 1578 -68 -827 -253 105 220
1272 220 420 712 -276 -1312 -1693 -1542 -1453 -746 410 26 -1987 -1992 -1550 -1507 -1186 -493 -846 -1591 -1315 -277
1292b77n54j280L42J521J103K56l7j581j407R85K140J366n21j065p18q22O72K022
1310B145Q42j304j256M61K47N0m64m89p07O42J241J78j800j582j02N39J013J239
1328H93k3j931j515M00J63R84R32K36j454j176Q52P52n30j21J227L23o69M57L16
1347A16j152k65J061J374r9L31M43j049q11K29J037P03J4Q9p91j187L3J507O43
1366B226p24n0n32j256j77P95O34k47m37j24q26l60K49J70n67J9R92N89j195p05
1386a526o41m35O95J670R76r77j079l02QP7J294J436o12o24J91J59p97K20J044
1405G77M04o0K97K36j120o12R46N55k49k14Q79r70p35j89Q22J23k58k08j069o41
1425a286O55N84K89m97R7n12l37k66n30O1L50J258j10l31p53j18p53o7J499J347
$$ plain form
1292 -277 -831 -2111 -1769 -248 855 1111 1074 -507 -1914 -929 1211 2577 2056 991 273 -549 123 2145
1310 2145 2987 1683 427 888 1135 1185 721 232 -475 167 1408 1586 -214 -1796 -1898 -1359 -346 893
1328 893 870 -1061 -2576 -2176 -2013 -1029 -97 139 -1315 -2491 -1639 -887 -1417 -1538 -311 12 -657 -200 116
1347 116 -1036 -1301 -240 1134 1035 1366 1809 760 -51 178 1215 1918 1932 2021 1230 43 76 1583 2226
1366 2226 1502 1452 920 -336 -513 282 916 669 232 108 -718 -1078 -829 -659 -1226 -1207 -215 374 -821 -1526
1386 -1526 -2167 -2602 -1907 -237 739 -238 -1317 -1619 -1611 -1534 -240 1196 584 -40 151 310 -487 -267 777
1405 777 1181 1121 1418 1654 534 -78 868 1423 1174 960 1839 869 134 -55 767 890 632 424 -645 -1286
1425 -1286 -631 -47 242 -255 -158 -670 -1007 -1273 -1803 -1742 -1392 -134 -244 -575 -1328 -1446 -2199 -2266 -767 580
1445E80M07p73j501p85Q93J078J289M17j228k12R30n6k95k10R3J74K8P09J84r48
1465G74n88n37K12P51R51J10j209j286K8R34P55N21r34j540p64P68O06Q15L27
1484F94n59j633q24P29R44L22j87l1n18m3Q62L96j145k06O08J242N64l39j91j183
1504d98j265O41J650J425K07p60k096j121J489K031N08r30o95n01K86P00M18m79
1522A010j061J03N65m42J06K72m75r59m90J188P69m34j304m36j50J094J806J33
1540A295k047p65K37L72L34P33M77n54n17q17K62K84R24R92q29m46M58L54j01
1559F46k77O45J29M70Q71l67j320m78j22N17m0N05P87q16j757j30P86M49L50k51
1579E97o71q32L78Q35k08k12j43K94m60r5j00j2l20l15P01M99l78k25l54r41Q89
$$ plain form
1445 580 987 214 -1287 -2072 -1179 -101 1188 1605 377 165 1095 1039 744 534 627 801 829 1538 1722 774
1465 774 186 -351 -139 612 1563 1673 464 -822 -794 140 895 1416 482 -1058 -1822 -1054 -448 367 694
1484 694 135 -1498 -2322 -1593 -649 -327 -514 -545 -1063 -1106 -244 152 -993 -1199 -591 651 1215 876 685 -498
1504 -498 -1763 -1122 528 1953 2160 1400 -696 -1817 -328 1703 2211 1281 586 85 371 1071 1489 1010
1522 1010 -51 52 617 175 281 553 78 -881 -1371 -183 586 152 -1152 -1588 -1738 -644 1162 1295
1540 1295 -752 -1517 -1280 -908 -574 159 636 82 -435 -1252 -990 -706 218 1210 381 -65 393 747 646
1559 646 369 1014 1143 1613 2484 2117 797 319 197 714 674 1179 1966 1150 -607 -737 49 498 848 597
1579 597 -74 -906 -528 307 99 -113 -256 38 -422 -517 -617 -629 -949 -1264 -563 -64 -442 -667 -1021 -1962 -1073
1600a073K009j22o77q74r7N61L79N28Nj0l6N72q10p81L01J046L02k57k19J60l87
1621E20o12o2Q60Q3J107l97j652n60O43R17n84n68k04J75j29m04q2o82P39J066
1641A74j38j171j63O05N49p09N64O05j15l56l44j87n5O89Q04n6k52k38o9Q6j12
1662A11O17N50K47m27q16j10N14P14L41q37k08K25M7n75n56l32J80O08P25n81
1682D37j229m7K9K24M26N03L99j077j098K6P64P38l6m40o20L7M44J82j35o25O12
1703d86N12M12k91l09k14j40P61O20k7p1k36q83K5O29P36J08o36j82k86m01M45
1724H6M41l91M32N9j5r28m38P84J77j27r8l1l28k22R3k91n18N56Q54K92q85n83
1746a081O6n20J122R05l36j46p75o5K35L95Q22J17n28n38J47L63J81Q5k54k16
$$ plain form
1600 -1073 936 814 137 -737 -834 -273 106 634 639 629 593 1165 355 -426 -125 921 1223 966 747 907 520
1621 520 -92 -154 706 789 1896 1499 -153 -713 -70 847 263 -305 -509 -334 -463 -867 -949 -1631 -892 174
1641 174 36 -1135 -1298 -693 -144 -853 -289 316 201 -155 -499 -686 -741 -52 752 696 444 206 137 223 111
1662 111 728 1278 1525 1098 282 172 686 1400 1741 904 696 921 968 393 -163 -495 -315 293 1018 437
1682 437 -792 -839 -810 -586 -160 343 742 -335 -1433 -1407 -643 95 59 -381 -1001 -964 -520 -338 -473 -1098 -486
1703 -486 26 438 147 -162 -376 -516 245 865 838 767 531 -352 -327 302 1038 1146 510 328 42 -359 86
1724 86 527 136 568 627 612 -316 -754 30 207 80 -18 -49 -377 -599 -506 -797 -1315 -759 95 387 -498 -1081
1746 -1081 -1015 -1535 -413 492 156 10 -765 -830 -595 -200 622 739 211 -327 -180 183 364 449 195 -21
1766b1M88O42m39n54l18K32O62L18K32j91j074n96N80P71j41J13k29j082j39K17
1786e29O38k84k52L13J08k93J79l90m79L89M12M96l76p52K64k11j05Q36L31kn05
1807b12l90O6j06J66J229k3m42j40L5l11J21L79M97l33q2j15j46J13p7K92p4l52
1829I5Q39q3o13o01L35l20L41L88J38o98j095N38O36J7J2L27p79l11K95J22k6
1850d43R5M4J66J78j04Mn99k80P31Q75q6k76j89o53R9O08N74J2l66j21j70Q5Q
1873A92P20K1n40K2J22l28k43K59l6N1L15N8m28n46L5J73J30n0M06J48j208K06
1895e21M3l04M18J96N63q91p69N12O55j65L16J15l14l24K61M12o16J18N09k21
1915gJ37M41p2l03k46J32M62K78J9j90q42n22Q02N65L00j94q70j12j63K70N90
$$ plain form
1766 -21 467 1109 670 116 -202 30 692 1010 1242 1051 -23 -619 -39 732 591 704 475 -607 -746 -529
1786 -529 109 -175 -427 -114 -6 -299 -120 -510 -989 -600 -188 308 -68 -820 -556 -767 -872 -36 295 293 -212
1807 -212 -602 -536 -642 -476 753 730 288 148 183 -128 -7 372 869 536 454 339 193 306 229 521 447 95
1829 95 934 851 238 -363 -28 -348 -7 381 519 -179 -1274 -736 -100 -83 -71 256 -523 -834 -539 -417 -443
1850 -443 -348 -304 -138 40 -64 -60 -659 -939 -208 667 581 305 116 -537 -438 170 744 756 390 269 99 184 192
1873 192 912 933 393 415 537 209 -34 225 189 240 555 613 185 -361 -326 -153 -23 -73 333 481 -727 -521
1895 -521 -478 -782 -364 -168 395 -496 -1265 -753 -98 -263 53 168 -146 -470 -209 203 -413 -295 214 -7
1915 -7 130 571 499 196 -50 82 544 822 841 651 -191 -713 89 654 954 760 -110 -222 -385 -115 475
1936D75J51o42m2k04l7l0R9j11m84N63L89J07n14l57l79J20M46M89J72k37m34
1957d60m86K47M86O43J37o65o2j31L42O1N80p2m56l07O64K11j60k84K22j48n4
1978C08K98k75k20l35N27RJ0J37K69r54m93K58M38K02k7k65n0l79J98p7j38K62
2000b97J12L79n52k15j19M18l1M5Q9j94J54L08m20m31N88M97K36l61r9M5N2j11
2022I3L62N8p5J13L13j134L8O29J52j74m28K76m09K38on5k32J85M96q1q10l46
2044g97L99K57L93J29j59l71n41L8Q2J05M57Qo02j62M71K49m12J8M27Q3L48j58
2066B62m10l39K06J078r4m06j58J66m46l9K64N50n03M05j05o94J69M20L84k74
2086D36n25L41O21m47q46N5k39N15O77m54m48o00N03j42k15M08K79M13n08o31
$$ plain form
1936 475 626 -16 -58 -262 -299 -329 -230 -341 -825 -262 127 234 -280 -637 -1016 -896 -450 39 211 -26 -460
1957 -460 -946 -699 -213 430 567 -98 -160 -291 51 112 692 620 164 -143 521 732 572 288 510 362 308
1978 308 606 331 111 -224 303 312 322 459 728 -226 -719 -461 -23 179 152 -113 -163 -542 -344 -421 -559 -297
2000 -297 -185 194 -358 -573 -692 -274 -305 -260 -171 -365 -211 97 -323 -754 -166 331 567 206 107 152 204 93
2022 93 455 513 438 551 864 -270 -232 397 549 375 -53 223 -186 52 46 -9 -241 -56 440 359 -451 -797
2044 -797 -398 -141 252 381 222 -149 -690 -652 -570 -465 -8 0 -602 -764 -293 -44 -456 -438 -11 72 420 262
2066 262 -148 -487 -281 797 703 297 139 305 -141 -180 84 634 131 536 431 -263 -94 326 710 436
2086 436 -89 252 873 426 -420 -365 -604 -89 588 134 -314 -914 -411 -553 -768 -360 -81 332 -176 -807
2106h07j74J70Q34M96n29o12J39L96Jl6r1L27J13n08L56q8J85P7q8j5k1O26J06
2129H57q51m51N26O40K23j86o62o06J44N33L42j77k56j37j95k75K41Q7L85j68
2149A4j76k7L67m26k97J98m41P05M25j82q15J67PL39q4L46k28j78P7P8J9J0M55
2172C53P5k33m37L24p7K07k04M39j31J47k02k02n6J49M91l15j07j16K91k25m06
2193b35R6j68M35J88K8o39m45K66M06J07l57M50m62k55k9J94p3L64k67M9J53P7
2215a17L41n59k4J78K86L02K2k82o69N58L74L16l22k33j29J4J14J57J26J81p0
2236E64j81j59N3J9m16J17J6J41K08n01j38m55M27M05J56l4m15l30K2M77k00j29
2258c53L19K59n50J01k3K82k25K18N9j78l6j58J9O2l2L08J20r8MK82n76L0J95
$$ plain form
2106 -807 -981 -811 23 519 -10 -622 -483 -87 -86 -122 -213 114 227 -281 75 -13 172 249 161 146 125 751 857
2129 857 6 -445 81 721 944 758 96 -510 -366 167 509 332 76 -61 -256 -531 -290 -203 182 14
2149 14 -162 -189 178 -248 -545 -347 -788 -83 342 160 -655 -488 -481 -142 -226 120 -108 -286 -209 -131 -112 -102 353
2172 353 428 195 -242 82 5 212 8 447 316 463 261 59 3 152 643 328 221 105 396 171 -235
2193 -235 -139 -307 128 316 344 -295 -740 -474 -68 39 -318 132 -330 -585 -614 -420 -493 -129 -396 -347 -194 -117
2215 -117 224 -335 -359 -181 105 407 429 147 -522 36 410 726 404 171 42 56 170 327 453 634 564
2236 564 383 224 277 296 -120 -3 13 154 362 -139 -277 -732 -305 100 256 222 -193 -523 -501 -24 -224 -353
2258 -353 -34 225 -325 -224 -247 35 -190 28 87 -91 -127 -285 -266 -204 -236 72 192 94 98 380 -196 -166 29
2281B9L89j9j0m5n01J47o7O71Kj58k10j14m06L43Nq0J78M6k58J08k38P5l28K49
2305a92J48K57l40k74j06j53K00L01K67j76n68O1M09J9L0R5M05l64j10K52l35
2326a74O1K45Q7k8o6p6K00k59R3K67P1j1R0k56k71J71L4QO8K2j66j49l00N54j22
2351I3k58J45q8q7k00J15L4J56j41R1J27l31J37RM2k31M42J84q6l22n2r0Q9M25
2375B03J92J2j98j64j33k2N0L66m0j88K20j19P7k57R4j0j06L58L24o44k12j77
2397c74L02J34J47L9J2n27r0K27JJ35m1J4m65K33P8J51k53K51j69L4k23J55p6
2420c05J66l4K80k3m4J03l24J02N5K6L76j36m28M75l69O2R8M0J56J53m46L10m09
2443a16k15L59J49K26k64O3k33P1k66J51j56M38L3j51l36M3K34j12J40L99l25
$$ plain form
2281 29 418 399 389 344 -157 -10 -77 594 596 438 228 114 -292 51 56 -24 154 200 -58 50 -188 -113 -441 -192
2305 -192 -44 213 -127 -401 -507 -660 -460 -159 108 -68 -636 -575 -166 -147 -117 -22 383 19 -91 161 -174
2326 -174 -113 132 219 191 125 49 249 -10 83 350 421 410 500 244 -27 144 178 186 254 276 110 -39 -339 215 93
2351 93 -165 -20 -108 -195 -395 -280 -246 -90 -231 -140 -13 -344 -207 -198 -156 -387 55 239 153 -169 -221 -311 -222 203
2375 203 395 407 209 45 -88 -110 -60 306 266 78 298 179 256 -1 93 83 -23 335 659 15 -197 -374
2397 -374 -72 62 209 248 260 -267 -357 -130 -129 6 -35 -21 -486 -253 -175 -24 -277 -26 -195 -161 -384 -229 -305
2420 -305 -139 -173 107 84 40 143 -181 -79 -24 2 378 242 -186 289 -80 -18 80 120 276 429 -17 293 -116
2443 -116 -331 28 177 403 139 202 -31 40 -226 -75 -231 207 240 89 -247 -204 30 -82 58 457 132
2464A32l4l29j6J39N7K97l67j51P9R8M2K22j69j7n4L56O0o24p0L23J22J51q2j65
2488@R7k07m7J23L4P4K63l75r7R7J12k47On7oL15l08n7k6N3K13N9O9j03l35Q0
2514b70l99N82N3J60O6m32q9j67M94K14m8j10l02OK96K06j77o3K11l53J16j6J64
2537A42j6j38k11L50K53n7j96n65N06j63L62q4qK6m22K56N0q4R6L49o05l88M9
2560d98L03K30K13n07L18l72M17j6K1j51p8K93k44j20K04k04J84l68K77KR6L26
2582C26k89n7l16M43J72K68m95J51k36J93q8K35j56k06J78J91k96J6L2k98J83
2603d9J51J21Jj51l43L22j65K09L81o09j90J07J09k40K87K5J54l44P7qKj7K79
2626A09k55J19m4k81L12L6L7l9J07n3j2p7K68j65k7J32k71L45k12j17o3L8L05
$$ plain form
2464 132 98 -231 -247 -108 -51 246 -121 -272 -193 -95 -53 169 0 -17 -71 285 345 -279 -349 -26 96 247 165 0
2488 0 97 -110 -157 -34 0 74 337 -38 -135 -38 74 -173 -167 -224 -230 85 -223 -280 -306 -253 -40 19 88 -15 -350 -270
2514 -270 -669 -87 -34 126 192 -240 -329 -496 -2 212 164 54 -248 -242 54 260 83 20 231 -122 -6 -22 142
2537 142 126 -12 -223 127 380 323 127 -438 68 -95 267 183 175 201 -221 35 85 1 97 446 -159 -547 -498
2560 -498 -195 35 248 -259 59 -313 104 88 109 -42 -120 173 -71 -191 13 -191 -7 -375 -98 -96 0 326
2582 326 37 -20 -336 107 279 547 52 203 -33 160 72 307 151 -55 123 314 18 34 66 -232 -49
2603 -49 102 223 224 73 -270 52 -113 96 477 -132 -322 -215 -106 -346 -59 -34 120 -224 -147 -155 -153 -170 109
2626 109 -146 -27 -71 -352 -40 -4 33 -6 101 48 36 -41 227 62 35 167 -104 241 29 -88 -151 -113 192
2649A92M3j39J1k7l71M15q6q4k41M62j26J34o42J27K11J07l5J26j23k5J07kJ28
2672A62r6K31q4m09r1L15Q5k84R2J28l9K55l36K16l61K30J41R4j58j19J2K08M1
2695B33l60J84J21J30m45j43J57K11Q9M6l20K28j13n1k09j66K90K5O0r5j1j56
2717b95P4N3j10L84K05n51L9pK71k31J36K36oj96p8J12Q0p7K1J88j24n20L32k67
2741c31J01M31k12J6n8kmK86j40m8j23j23J45m30O76k66r3R1J95KK0j15k90J95
2765g7K54k62r9M01k92P0j73j1j06J64K52n9m1J15j05j63P2K25j91Q3J38J78n05
2788a32J13M23n93M97m32J32N4K3j76J02j56J96M9k10J89k34N38k66k29%L34k52
2810c0j01K00k33j00J04N71n57M34o05J90J58j1k58K13N3l13L39L5q0j91J83L7
$$ plain form
2649 192 235 96 107 80 -291 124 38 -46 -287 175 49 183 -459 -332 -121 -14 -49 77 -46 -71 36 34 162
2672 162 66 297 213 -196 -287 28 113 -171 -79 49 10 265 -71 145 -216 14 155 249 91 -28 -16 192 233
2695 233 -127 57 178 308 -137 -280 -123 88 177 223 -97 131 18 -33 -242 -408 -118 -93 -33 -128 -139 -295
2717 -295 -221 -168 -278 106 311 -240 -201 -208 63 -168 -32 204 198 2 -76 36 116 39 60 248 124 -396 -64 -331
2741 -331 -230 201 -11 5 -53 -55 -59 227 87 39 -84 -207 -62 -492 184 -82 -175 -84 111 113 133 18 -272 -77
2765 -77 177 -85 -184 217 -75 -5 -178 -189 -295 -131 121 62 21 136 31 -132 -60 165 -26 57 195 373 -132
2788 -132 -19 404 -189 308 -124 8 62 85 -91 11 -145 51 100 -110 79 -155 383 117 -112 -112 222 -30
2810 -30 -131 69 -164 -264 -160 411 -146 288 -317 -127 31 20 -238 -25 28 -285 54 89 9 -182 1 38
2832C8l91M77O0k88K70O3m8l31K66R0k74LQ2J11M2J1j60J0N4J48j72K0j8m4M9
2857F8L0j18J70k09J95j1k66L5J30p0J11k02rK42k31nl0L67k45R8k30K02k2RJ5
2882B4m8j55K77k55J37J20j92j7K88q1p2q7J76j61J2mL32l42LN8J2n0P5K32l63
2907h1p2K08R2l34L92k51K49l69K19r3J4J88m29L57M0k20L2j9N6K3j3j1j29J8
2931a33M21L7l91j14L80n2j31PK0O7j31o4l6J67k25K58j94J28K28j02k15K76n6
2954A45k63J68q2j02K36q3J80N0l02R4j97P1N5N8mk85P9J1L84l79K55M1j16k1
2978gJ2k48K85n3L1L0q7R2K16l29J85K1k8q6j32N9j14r6K67k47L8L57j67j31N8
3003g4J76k50K86j05L06k74j88J20R2j21l96N14k95Q3Q1p0K64n4m5K2j6j4j48
$$ plain form
2832 38 -353 124 184 -104 166 229 181 -150 116 206 -68 -65 17 128 170 181 21 31 85 233 61 81 63 19 68
2857 68 98 -20 150 -59 136 125 -141 -106 24 -46 65 -137 -146 96 -135 -140 -170 197 -48 50 -180 22 0 9 24
2882 24 -24 -179 98 -157 -20 100 -92 -109 179 98 26 -61 115 -46 -34 -38 294 -48 -45 13 25 -25 50 282 -81
2907 -81 -153 55 147 -187 205 -46 203 -166 53 -40 -26 162 -267 90 130 -90 -58 -77 -21 2 -11 -22 -151 -133
2931 -133 288 325 -66 -180 200 148 17 24 44 111 -20 -84 -120 47 -178 80 -114 14 242 140 -75 201 145
2954 145 -118 50 -32 -134 102 19 199 249 -53 41 -156 -85 -30 28 24 -261 -182 -171 213 -166 89 130 14 -7
2978 -7 5 -243 42 -11 20 50 -37 55 271 -58 127 148 120 34 -98 -39 -153 -249 18 -229 -191 166 -1 -132 -74
3003 -74 102 -148 138 33 339 65 -123 -3 89 -32 -428 86 -209 -126 -45 -115 149 95 50 72 56 42 -106
3026a06m0J1J35l8l0L57k75J28j14m4n3Q3j81K50j83o0J62nJ7m6L6k58M76l92
3050a70J84j92L2K02pn2j91J09J04j21K66m41K66J15j01m1j97N09J46n90J03J43
3072G6j15K54k76L0O5n7K23k3l00n9J94n8j78M38l7k85K12j57K5M2j53Q8L32q4
3096A97j18k64K80q7l01N65k81J07L1k82K30j87J88m5J11j10k69L23MQ9j38r6
3118e3J58j27j70K34jj61r4J95j13J33J22r7J0J97k04qJ30r6J7K53k22Lj62O8
3142A2P4l24O86m20lk40Q6j2K70j68L4j69J03q1J19j4k73M57J81m38m8J15j78
3165b31K2J42J51j66J90k27P6L0L30p23K43J17K05k31K7J61k90L16m12L51k76
3186a95M36l25k1M01k43N1r2k35J45o6k96M26L00k45r6L6j20n3K07o9j93J62J71
$$ plain form
3026 -106 -146 -135 0 -38 -68 289 14 142 28 -16 -69 14 -167 83 -100 -160 2 -3 14 -32 4 -254 222 -170
3050 -170 14 -178 -146 56 49 -3 -194 -85 19 -102 164 -277 -11 104 3 -38 -235 274 420 -170 -67 76
3072 76 -39 215 -61 -31 34 -23 200 177 -123 -182 12 -46 -224 214 177 -108 104 -53 -28 14 -139 -51 281 197
3096 197 79 -185 95 8 -293 272 -9 98 129 -153 77 -110 78 33 144 34 -235 88 92 181 43 -53
3118 -53 105 -22 -192 42 41 -120 -214 -19 -132 1 123 26 36 233 29 21 151 55 72 325 103 106 -56 12
3142 12 86 -238 448 28 25 -215 -129 -141 129 -39 -5 -174 -71 -152 -33 -47 -320 137 318 -120 -168 -53 -231
3165 -231 -209 -67 84 -82 108 -119 -43 -13 317 -406 -163 -46 159 -72 -45 116 -174 142 -270 81 -195
3186 -195 241 -84 -105 296 53 104 12 -223 -78 -144 -440 -14 286 41 -55 -19 -139 -192 15 -54 -247 -85 86
3209H6l00J85j77J53K6P6Q1m43M15k67L72k31q0K15q4k70J62O6j28M15k40N2m4
3232D0N5P9k9k04J71l16K18K15k59J55J69k92m7P1j79J60n6n8rJ97k53RL08p7
3256F8j23K2J34k61J59N5p2l6j89M71K8l2l71k16L60J71j88K26l59K26m8o1L33
3279B97n6m04J13j3l2M6K7R4r1L7K20k29k59K42p6L67m50J8P5K10k23L04l90Q9
3303h4RK4k6K5m2l6J84j71K09j74J88o5j17j22Q9L5M02k35Q6n3k5j42L0K13l85
3328a83J23Jm6j0R5r8K51k62J72J0M1k45K14k50K65P6m41L14J28m44M13r4N7j76
3352h9N0J07OQ6j20p7k4k22N10l54j56J80Q6L8j6k02k7L32L7j53rr6K16J57l50
3377i0J68q2J75l77L62K47l71K08j79N5j6k68J75n3L2Rq0M67m20l3O3Q9J7j79
$$ plain form
3209 86 -214 -29 -206 -53 -27 49 130 -313 102 -165 207 -24 -104 111 27 -243 -81 -15 -143 272 32 84 40
3232 40 95 174 145 -59 112 -204 14 229 -30 125 294 2 -45 26 -153 7 -49 -107 -116 81 -172 -163 145 68
3256 68 -55 -33 101 -160 -1 54 -18 -54 -243 228 256 224 -147 -363 -3 168 -20 206 -153 73 25 -36 297
3279 297 241 -163 -50 -63 -95 -49 -22 72 -19 18 238 9 -250 -8 -84 283 -167 -149 -74 136 -87 217 -173 -84
3303 -84 -75 -51 -77 -52 -94 -130 54 -117 92 -82 106 41 -76 -198 -109 -74 328 93 179 126 101 -41 -11 202 -183
3328 -183 -60 -59 -105 -115 -20 -118 133 -129 43 53 94 -151 63 -187 78 154 -287 27 155 -289 124 30 87 -89
3352 -89 -39 68 74 160 40 -37 -61 -283 227 -127 -283 -103 -17 21 5 -197 -224 108 145 -8 -17 -113 103 260 -90
3377 -90 78 -4 171 -206 156 403 32 240 61 116 100 -168 7 -46 -14 -5 -85 382 -38 -71 -8 81 98 -81
3401h1L2L6Q3nJ8l6J33j59n5K4m5J90M4n1J25l52K46k78N4J96k80L29k57M6K10
3426A67q9l1j70J67l17L44K3J2J6j66p9N7j59K9K38j21K01j92mK07k24R9j05J98
3450A01l0j11j43l6j8J35J32p4Ol3K34k68J22Q2K1j71J94O6k05P9p5p0q8L6K74
3475A60j26p0P1k38J1K26j80K63k09O6M2J32Qj82L07l53J48j89J98k14J34J57
3497A62K3p7j91jp8J6K69j22j49M6N0m2J18j35K32l0j21Q9J35m1r9N1j15L9O5
3522I4O2k95J52O7k90K45J21rK77k39j62J88j88k65K3J97L5L23l97K15j65J8J92
3545A99m47L50j61j78R8L09l59K04q1n8J85j95m3j92L70M1l4k15L91j67r4k72
3567c49O0L18R8l21L34j63j10J11j90j2L38j02J73m1o3m1J5O0J73k86j40L41l39
$$ plain form
3401 -81 -49 -13 70 65 83 47 180 21 -34 -10 -55 135 179 128 253 -99 147 -131 -77 119 -161 168 -89 -43 167
3426 167 78 47 -123 44 -273 71 94 106 122 -44 -123 -66 -225 -196 42 -79 122 -70 -74 133 -91 8 -97 101
3450 101 71 -40 -183 -219 -237 -102 30 -44 -38 -71 163 -105 17 99 120 -51 143 209 4 83 8 -62 -150 -114 160
3475 160 34 -36 35 -203 -192 34 -146 117 -92 -26 16 148 156 -26 281 -72 76 -113 85 -129 5 162
3497 162 185 108 -83 -84 -162 -146 123 1 -148 -102 -52 -94 24 -111 121 91 -30 59 194 153 54 105 -10 29 94
3522 94 156 -139 13 80 -210 35 156 147 424 185 23 211 23 -242 -219 -22 13 336 -61 154 -11 7 199
3545 199 -248 102 -59 -237 -139 170 -189 15 -66 -124 61 -134 -177 -369 1 42 8 -207 184 17 -77 -349
3567 -349 -289 29 127 -194 140 -23 -133 -22 -212 -224 114 12 185 144 81 40 55 115 288 2 -138 203 -136
3590a36K71j04j03l8ok87J80K59k00K50k8r2L2j83J00Q6K08k55Q9L09n00j33J79
3613a02k11L57Q5P7n0j19k68J89J14m3k6j1K0J49j59m14L08J37mj27j51L93k18
3636g4J01J54N1l27kR9j7J68P8k21J84R0m10J99o0K22k94J44l1j66J68n3J26k17
3660h8j1L23j56J81l36r2L14k20k02J23J26J34Q8J81k28o6m06L02J77k53J65j86
3682a30K07k31L48l8j32j08L63k86n1p1j15M70k43lO9L85l69K96n04J12K01n8
3704A12k62p9l1M49k02L13p7l67j5K35j07K7p6o4N2L2Q8j92J68j22J12K19K9j5
3728B27Q1m09J72k87L46o1l5k88O9p7K84j17J36J87j96j28K51o08M60j81M2OL96
3751B70j03j89K02l49K85J51q6o8j56l43M05j14lm4K30l2j25L6K2J98l10K66k08
$$ plain form
3590 -136 135 31 -72 -110 -116 -403 -223 36 -164 86 58 -34 -2 -185 -85 1 209 -46 43 352 -148 -281 -102
3613 -102 -313 44 129 206 156 37 -231 -42 72 29 3 -8 12 161 2 -412 -104 33 29 -98 -249 144 -74
3636 -74 27 181 232 -95 -97 2 -15 153 231 10 194 284 -126 73 13 235 -59 85 54 -112 56 3 129 -88
3660 -88 -99 224 68 249 -87 -179 135 -85 -287 -164 -38 96 184 365 137 71 -335 -33 144 -109 56 -130
3682 -130 77 -154 194 156 24 -84 279 -7 -58 -129 -244 226 -17 -20 49 434 65 361 -143 -31 170 112
3704 112 -150 -229 -260 189 -13 300 223 -144 -159 76 -31 -4 -80 -144 -92 -60 28 -164 4 -118 -6 213 242 227
3728 227 308 -101 71 -216 130 69 34 -254 -185 -262 22 -95 41 228 32 -96 155 -453 7 -174 -132 -126 270
3751 270 167 -22 180 -169 116 267 181 113 -43 -386 19 -95 -98 -142 88 56 -69 -33 -11 187 -123 143 -65
3774f5J95J3k33L39k14k04j14K38M3p3r7J48R5P2n8k57L86j75J98k34pJ66J01
3797B63m25L25Q5n97L38l2R4N0k18J20J10m12J91L73j56Q0j77N4j52j50J70nj39
3820b10K56n0J3M8J42rk73J90k9K01j68j93K9J95k5k9J56k52l14M21k0p2K06k13
3844@j44M52k25j5k4j5o7M4L5N7N4j63R9j60KL2R7l0pR8j05kJ00N3k51J6p4J47
3872Dq3no3L87l69K20Q5l22L34l15O9K15K6Qj39k06K36l05M09L1j26k27K33k3
3896G4J0r2J45j88L04m11P3r9J52J85j33K5L9l02R2L21j96J66j36k54M01k85P7
3919c2n3P5J55l64L19k8k0%k13J07k2l9j40r8K37oK18j51K82j52K56j35pj34j71
3944a16J85o7J3O8k48L3K92k93K89j7J08j5l95L7POl3L06m32M50l67J76lk56K84
$$ plain form
3774 -65 130 143 -90 249 35 -169 -283 -45 -2 -75 -172 -24 71 143 85 -172 214 39 237 3 -4 162 263
3797 263 -162 163 248 -349 -11 -43 51 101 -117 3 113 -299 -108 265 109 189 12 66 -86 -236 -66 -71 -210
3820 -210 46 -4 9 57 199 190 -83 107 78 279 111 -82 -53 142 117 88 244 -8 -322 99 79 7 213 0
3844 0 -144 308 83 68 44 29 -38 6 41 98 152 -11 88 -72 -70 -38 59 29 22 120 15 13 113 166 -85 -69 -143 4
3872 4 -79 -84 -147 240 -129 91 176 -146 188 -127 -58 157 183 191 52 -154 82 -223 186 217 91 -136 97 74
3896 74 84 -8 137 -51 253 -158 -85 -184 -32 153 20 45 84 -218 -126 195 -1 165 29 -225 176 -109 -32
3919 -32 -85 -10 145 -219 100 72 52 52 -161 -54 -76 -115 -255 -353 -116 -122 96 -55 227 75 331 196 189 55 -116
3944 -116 69 2 15 83 -165 -132 160 -133 156 139 247 232 -163 -126 -119 -113 -146 160 -272 178 -189 -13 -16 -272 12
3969A2J51J02j47l94N20m17J43K90l05j9K09k91m1O3K88ro2j75J8K87k09k06M14
3992B22p4l49K10p1J4l0R9j33K18j06K18q7k68J07J96k50P0p0k4q7L42k15q6J93
4016C9k8k27M1Q7j28K78L9kk13K66k05lJ97j31J89q5j54Q9n8j9k38N24k6j97m7
4041a2m2j40J66k5K1j69J25O9J11q7l1L6P0J07j38j7J84k43M4q8K01J34n4o48
4065d26L36L03l75K63j16j69L98o3k17NJ54j17q5L7J22o5k12K2O3m9J09j06J87
4088aJm8R8k08J32o0L11L2k59j84L96k71J66q1J18j21J01j58J52P8n7j13k7k47
4112b50J19J25J04m34L47L2K81l87J36j01j00l7L10K4k56J57J81j90j58M7J71
4133A21n9p1q3K34r2k72L66rl63J42Nn2J00M5j37j2O4K23j59P9l68L30J7r5P9
$$ plain form
3969 12 163 265 118 -276 244 -173 -30 260 -45 -64 145 -146 -187 -124 164 155 93 -82 -64 223 14 -192 222
3992 222 148 -201 9 -62 -48 -78 21 -112 106 0 218 131 -137 -30 166 -84 -14 -84 -108 -195 147 -68 -154 39
4016 39 11 -216 -175 -88 -216 62 101 99 -114 152 -53 -56 141 10 199 114 -40 49 -9 -28 -266 258 232 35 -12
4041 -12 -54 -194 -28 -53 -32 -201 -76 -7 104 17 -14 22 92 199 61 44 228 -15 29 -59 142 276 222 -426
4065 -426 -90 213 -162 101 -15 -184 214 151 -66 -61 93 -24 -109 -72 50 -15 -227 -205 -142 -191 -82 -188 -1
4088 -1 0 -48 50 -158 -26 -86 225 257 -2 -186 210 -61 105 24 142 21 122 -36 116 194 137 24 -3 -250
4112 -250 -131 -6 98 -336 11 43 324 -63 73 -28 -128 -165 145 169 -87 70 251 61 -97 -50 121
4133 121 62 -9 -92 142 50 -222 144 135 -228 -86 -81 -133 -33 12 -125 -137 -73 150 -9 70 -298 32 49 -46 33
4158C3K58m79q9L53j67O1l7Q7j28J32J36k32K11k25J15j22j42P4m2L78j90R2K3
4181A00K6j3p8N6K6Kl08J18R2m7l4r0N6J14j69M65l45J69K42n08K12k62K75Kk18
4206a17J28J27J84k87k29K60jl74M10j48R5q0r4R3Q4j22O3j60N4j43K58j85J01
4229h3K10j50p9K41k54K90q1j14O0j0j61K05q7J43L9l78N29k22K16k21j19k8J96
4252A42k33K17l35K95m71K20K68q9KJ19l1j32K09j60j2R2j00l40P6M13j08k33
4274a91M64l36r0J23p0J48jJ20j24L6J28l07P6J38k97J10K3J5Oj27J04m5R3j8
4298b2L2k60R0Q1l74N98p2l8J10j58j45J76k43K65j2R8k54m6J0K01j29j70M06
4321A44j08J5j64K59j18j31j75M26P9k85p2l2j2K69j77N5R4j53J28n9k17J69K8
$$ plain form
4158 33 291 -188 -277 76 -91 -30 -67 20 -108 24 160 -72 139 -86 29 -93 -235 -161 -203 175 -15 77 100
4181 100 126 113 35 91 117 119 -189 -71 21 -26 -60 -150 -94 20 -149 316 -29 140 382 -126 86 -176 99 101 -117
4206 -117 11 138 322 35 -194 66 65 -309 101 -47 48 -32 -126 -33 51 -71 -8 -168 -114 -257 1 -184 -83
4229 -83 127 -23 -102 139 -115 175 94 -20 40 30 -131 74 -13 130 169 -209 320 98 314 93 -26 -54 142
4252 142 -91 126 -209 86 -385 -165 103 14 16 135 104 -28 181 21 9 101 1 -339 -263 150 42 -191
4274 -191 273 -63 -153 -30 -100 48 47 167 43 79 207 -100 -24 114 -183 -73 -50 -35 -29 -156 -52 -97 -4 -22
4298 -22 10 -250 -160 -79 -453 145 73 35 145 -13 -158 18 -225 40 28 126 -128 -174 -164 37 -92 -262 144
4321 144 36 51 -113 146 28 -103 -278 148 227 -58 -130 -162 -174 95 -82 -27 67 -86 42 -17 -234 -65 -37
4344c7K10k40J70k17R0R1k13K23k04J86l9o0J57j34j64L72j8o2r6n6Mq5K94o5
4368A07j48oN2l1n8R4J05l8O5l7n5n5Lj27k04K22q1J6L9mJ82NK23j44k09J29q1
4395c6q4R1N4J88q5k00k62O22l76J98j60L73k78j8j14R1J08n2k56K87r5R0j61
4418g5K1J58l9L5j70k3j54J26N89n97J39j6p0J57q2j8N0k20L32j18J24k07L5R9
4442G6k19J68m9j0MP6l07K75j71l7J37m2n2M15m24L55o33M58n9J57N1k0j06m8
4466eKR4j93P6J02j02j3J60l19M55m18m6K82lj43J87q4j48J72o4pj88L01j09j04
4491a15j27M99k58k41K47o7M9j04J75l0j9K34k03j94K49j61M5j62K16j79J65l7
4513a8N7n1O1P5J27r9o5k90K57Q7N3m02K6J36M3p6J72l17L00R9j15l4L4k0N5M1
$$ plain form
4344 -37 173 -67 103 -114 -24 67 -146 77 -127 59 20 -40 117 -17 -181 191 173 111 15 -41 -37 -122 172 107
4368 107 -41 -47 5 -26 -84 10 115 77 142 105 50 -5 -2 -129 -333 -111 -192 -176 -137 -141 41 46 269 125 -84 45 -36
4395 -36 -120 -29 25 213 128 -72 -334 288 -88 110 -50 323 45 27 -87 4 112 60 -196 91 -4 86 -75
4418 -75 -54 104 65 100 -70 -93 -247 -121 468 -129 10 -6 -76 81 -1 -19 31 -189 143 25 149 -58 -23 76
4442 76 -143 25 -24 -34 -30 46 -261 14 -157 -194 -57 -99 -151 264 -160 195 -438 20 -39 118 169 149 43 -5
4466 -5 -3 91 -102 -26 76 -26 -39 121 -198 257 -161 -207 75 72 -71 116 32 -116 56 -8 -15 -203 98 -11 -115
4491 -115 -242 257 -1 -242 5 -62 -13 -117 58 28 9 243 40 -154 95 -66 -21 -183 33 -146 19 -18
4513 -18 39 -12 49 124 251 152 87 -203 54 141 194 -208 -182 -46 -3 -79 93 -224 76 175 60 26 60 40 95 136
4539A36j86K2L10m64J36j06K56k19K48p0K5l14P6j11J48k2K14j13J72j85j99L40
4561I4m4j83K07J0l50LQ7J80K48l08J77j12J79k48K0p0K68l67M03k65p5o4M8L57
4585A95j81j68K66l08J70J00p5J9j93R0K18j32J47k97L30l03J80Q4r7k4K38k27
4607C2l08K74k2J57j27J93k43J01j24Q7j79K98m9L2j85m3P1P8j84J81m5j04J44
4630C5m7K20k41j08K16J19j78j17J20J66k93M09m03O5l19M7K83J21m74L66l2J14
4652F9j67M5K80j70k16L74k82q6J0R5RO9K25l39K23l63P5L4L08n9N3l16J3L65
4676B49nk63J4n5J47r5j4mk95QL93p7l57L16N4n23L40J83K3J5j1j62N4J99Mj11
4702B7r8J81l30K92l06J66J43j65J8m1J3p9O1N6j41J02m4J78j82J82K57j69j32
$$ plain form
4539 136 -50 -28 282 -182 -46 -152 104 -115 133 63 88 -226 -150 -261 -113 -135 79 -34 138 -47 -246 94
4561 94 50 -133 74 84 -266 -263 -176 4 252 -56 121 9 188 -60 -40 -110 158 -209 194 -71 -146 -210 -162 195
4585 195 14 -154 112 -196 -26 74 -1 18 -175 -85 133 1 148 -149 181 -122 58 142 45 21 259 32
4607 32 -276 -2 -24 133 6 199 -44 57 -67 20 -159 139 90 122 -63 -106 -35 43 -141 40 -5 -109 35
4630 35 -12 208 -33 -141 75 194 16 -101 19 185 -108 301 -102 -37 -356 -309 -26 95 -379 -13 -45 69
4652 69 -98 -53 227 57 -159 215 -67 -153 -143 -48 -39 30 255 -84 139 -224 -149 -115 193 134 187 -129 -116 249
4676 249 244 -19 -5 -60 87 -8 -22 -26 -321 -313 80 3 -354 -38 16 -507 -167 16 39 54 43 -119 -65 134 138 27
4702 27 -71 110 -220 72 -234 -68 75 -90 -72 -113 -100 -179 -118 -62 -203 -101 -145 33 -149 33 290 121 -11
4725a1o4L19k54J30o2j41l6L71j54J42j34j27J29o6N1Pj26M4j42J02J57k02J30
4748F3r8K23j58j96P4j2K1J61j84L07j54j75L3J13j50M03m29J22j49K2J15j36
4770a84K12K45j81k4M6r6J49k65q2K49J04l92K37L7m4l56J41K70j44j31L90l51
4792a70J70l42M24k6M6p6J51q3k46K3l9M28p0n36L52J79j95K9P8k03J24J28l10
4815a64J02k6K08q4Q7j8p2P0l00J54r7J76Jl3j7R0J14k78kj28O18m53k91L78L8
4840G3l54q3L11n4m0J14l4K03O2m96L23O4J56j72j8J26k3Q1o0l07J14l9j67J50
4864g0K07j35p4K50o8p3Qm3rk60K54M4M8O3J82j54l89K92J20j45j00K03l96M47
4888B02k6J53n34M38k56N8N3o5j30L51k78K17j7p5q7j00P1j9K69k91J55k38m1
$$ plain form
4725 -11 -75 244 -10 120 58 -83 -119 252 98 240 106 -21 108 42 93 100 -26 18 -124 -22 135 -67 63
4748 63 -35 188 30 -166 -92 -104 -83 78 -106 201 47 -128 -95 18 -132 271 -158 -36 -185 -163 -48 -184
4770 -184 28 273 92 68 114 18 167 -98 -180 69 173 -219 18 55 11 -345 -204 66 -78 -209 181 -170
4792 -170 0 -342 82 56 102 26 177 94 -152 -129 -168 260 190 -346 6 185 -10 19 97 -106 18 146 -164
4815 -164 -62 -88 120 36 123 105 33 103 -197 -43 -140 36 37 4 -13 77 191 -87 -89 -217 401 -52 -343 35 73
4840 73 -281 -364 -53 -107 -147 -33 -67 136 198 -298 25 89 245 73 55 181 158 239 179 -128 -14 -53 -220 -70
4864 -70 137 2 -72 178 110 37 45 2 -7 -267 -13 31 79 142 324 170 -219 73 193 48 -52 151 -245 202
4888 202 176 329 -205 233 -23 35 88 23 -107 244 -34 183 166 91 4 -96 -25 -44 225 -66 89 -149 -190
4911a90K95l23J78L9j24QJ22l4m0K00r4l1R5m8n1j76K99o4k56L75nj59N5M6q5
4936C2J00o5j89K12Q3k35O4J92j32k12J80O9j45n3R8K23k00k49J89L20m29J24
4958b3j52j3P1j2K30K9r6k1l0J08j71p0K75q3J1k55M54m28J88qJ72m43L98k78
4982a47J0K48j87j2L9N9P9oR6j54j96PJ85J02j92L13k48J8j96M35j72r4O2j42
5006i3J23K4l25L35m61J25J69j17L38k57PK50oj29j89L86k33K09m6O2j04J01k28
5029e9PJ73l1l74K33L93m96J69J92k16Q2J42m17J99L9J75p5j18k05J95Rk8j20
5052a31R8j39K92J04l27J7JJ99j11m7L47k88J74j84Qr7o1J71j30J65M9j6l54J53
5076a07n9J72P3M9j3k72N10k32OK8J2k36N6j08J16j3J18j37N40p17J68L30n50
$$ plain form
4911 -190 105 -218 -40 -1 -125 -117 5 -29 -69 131 37 6 101 53 2 -174 125 61 -195 180 175 16 71 117 32
4936 32 132 67 -122 90 173 -62 2 194 62 -150 30 99 -46 -99 -1 222 22 -227 -38 282 -147 -23
4958 -23 -175 -188 -117 -129 101 130 34 13 -17 91 -80 -150 125 42 53 -202 252 -176 12 4 176 -267 131 -147
4982 -147 -137 111 -76 -88 -49 10 89 83 179 25 -171 -164 21 123 -69 244 -4 14 -182 253 81 -13 49 -93
5006 -93 30 54 -271 64 -397 -272 -103 -220 118 -139 -132 118 112 -17 -206 180 -53 156 110 172 68 169 -59
5029 -59 -52 121 90 -284 -51 342 -154 15 207 -9 73 215 -202 -3 36 211 136 18 -187 8 17 -11 -131
5052 -131 -33 -172 120 224 -103 -86 -85 114 3 -44 303 15 189 5 13 -84 -145 26 -104 61 110 94 -260 -107
5076 -107 -166 6 79 128 115 -157 353 121 127 155 167 -69 -13 -121 -5 -18 100 -37 503 -214 -46 284 -266
5099b66L46k23L7j22K82L1k65J77k86K88q5l7R9L55l43K52l42R4N9J32k46J79
5121A16j36L6j26J57j14L4P5j56J72R0k14j23K93%p7q3J59J36N2m47m9J77j11
5144a39Q6Q5l3j6J17K48k77k78N57m90N7J36J12k14Q1K67m23Q6J65k89J53k11
5166b20M5J02j05M2J94q1j90N17l60Q6l5m6K28J05k94j66L01l42K13j9K1o1k78
5189c43L72N0r6P9J84m4k47l6P2j72P5oK4K67n0k72n2L90j59J35k12J2oJ46m7
5214F4R5j21J86j19k15J75J86Q8l04k41K43q1K0J59m8j38J06l57J31P2l62M83
5236B2m5J16j25K16m51N2O14k60j35M5K03k48j72K94m8j50K68k27K66j16J49l57
5258h9J51j32P3j87J02R7Q7j90R0N8n6j53K58J0Q1k81J78j2K0j55J95j75j03n1
$$ plain form
5099 -266 80 -143 -106 -228 54 85 -180 -3 -289 -1 -86 -123 -24 331 -12 240 -102 -8 51 183 -63 116
5121 116 -20 16 -110 47 -67 -33 42 -114 58 148 -66 -189 104 104 27 -56 103 239 291 -156 -205 -28 -139
5144 -139 -53 32 -1 -17 100 348 71 -207 350 -140 -83 53 165 -49 32 299 -124 -38 127 -162 -9 -220
5166 -220 -175 -73 -178 -136 58 -23 -213 304 -56 30 -5 -51 177 282 -12 -178 123 -219 -6 -25 -4 -65 -343
5189 -343 29 79 -17 62 246 202 -45 -81 -9 -181 -106 -112 -88 179 129 -143 -195 195 36 171 -41 -29 -35 111 64
5214 64 159 38 224 105 -110 65 251 339 35 -206 37 -44 -24 135 87 -51 55 -302 -171 -99 -461 22
5236 22 -23 93 -32 184 -267 -215 399 139 4 49 252 4 -168 126 78 -72 196 -31 235 119 268 -89
5258 -89 62 -70 3 -184 -82 15 102 -88 2 60 4 -149 109 119 200 -81 97 85 105 -50 145 -30 -133 -184
5282a84k4j34K81L80l61J48l2j33K47k27jK52k9N1k42L2j10L04m70M00k86J54
5304A6J32k05J38j29l03K42J82l91J92J36j56J90N5j79k25J49K6K20J34p9L7l34
5326a52J44J5K81l32p9K69l14J36J20l06J75J8mK39l10N9J62k89J93j06N8J66
5348A43l1o2J97j03N9j53k1k5J93l85L49l70m8J66Q6J20k03J51J23k65J94k81
5370a66j1J91M4p7l2K36l70L19k39K96n3l37L58m47K37M1O8J06j16K14o05L57
5392A4J62n9j83jQ3o2K41j91k0J2K03k89LL11j40n8L5nJ39l18K54j48J5J93k32
5417d1j9j78J63L15l55J35p8m3q0K57M1J0o5kn3n2L2L7J71m88J77J31J13k82M37
5442B83k85J09k41J95p1l05M70j73J9pm1o4L18l52N4K72k94R6j28K08J17k74J64
$$ plain form
5282 -184 -208 -342 -61 319 -42 106 74 -59 188 -39 -40 212 183 234 -8 24 -86 218 -252 148 -138 16
5304 16 148 -57 81 -48 -351 -109 73 -318 -126 10 -146 44 99 -80 -305 -156 -130 90 224 145 182 -152
5326 -152 -8 7 288 -44 -123 146 -168 -32 88 -218 -43 -25 -29 210 -100 -41 121 -168 25 -81 -23 143
5348 143 112 50 247 144 203 50 29 4 197 -188 161 -209 -257 -91 -5 115 -88 63 186 -79 115 -166
5370 -166 -177 14 58 -19 -51 185 -185 134 -105 191 138 -199 159 -288 -51 -10 58 164 48 262 -343 14
5392 14 176 117 -66 -67 16 -46 195 4 -16 -4 199 -90 -87 224 84 26 61 56 195 -123 131 -17 -2 191 -41
5417 -41 -60 -238 -75 240 -115 20 -58 -101 -181 76 117 127 62 60 7 -45 -13 24 195 -293 -116 15 128 -154 283
5442 283 -2 107 -134 61 -10 -315 155 -18 1 -6 -47 -111 207 -145 -91 181 -113 -17 -145 63 180 -94 70
5465G0L05j41j95k73K60L87j99k96J79j15J64j87j36L04j00j75O9O8N3j40J02
5486DQ3p3j5r8P3M4M08m74J93k07r4k24N75k23KL45j08j84J39j52K35k52k68L49
5510G8j50J75k6l9O8J15j37n7N6m1j23J87j33j47J89r1J11K3J3L0k5N5j97K7Q0
5535D1j40Q2n6O6n4N1K78K88o89j29L39J7p4J10j85J51k63M61o23M98m5n40J01
5558c15K40K15K0J53l87N0K80j30J94m06J53k4J41l89n0L46j87J58l1K0p9L4k1
5581a5p8J42PJ32k33j04J40N3j52J10j2pK97k01k59j6K56k25Q9k6Q4J21j72N8
5605a1J91j51M9Nj38J33M8l03O9J06j07K27m1m37K96K20k2Q0k48O3M3l0j6K8n7
5630cJ19l72L72m9j32jk02J26O8J28k06K60k86K71k82J09J02o4J84k37J83n1N0
$$ plain form
5465 70 375 234 39 -234 26 413 214 -82 97 -18 146 -41 -177 127 27 -148 -79 -11 42 -98 4
5486 4 87 14 -1 -99 -26 18 426 -48 145 -62 -156 -380 195 -28 -26 319 211 27 166 14 249 -3 -271 78
5510 78 -72 103 77 38 106 221 84 27 83 42 -81 106 -27 -174 15 -76 35 58 71 101 76 131 -66 -39 41
5535 41 -99 -17 -73 -7 -61 -10 268 556 -133 -262 77 94 20 130 -55 96 -167 294 -329 169 124 -416 -315
5558 -315 -75 140 160 313 -74 -24 256 126 320 -86 67 43 184 -205 -255 91 -96 62 31 51 -28 6 -15
5581 -15 -93 49 56 188 -45 -149 -9 44 -108 2 -10 -17 280 79 -180 -196 60 -165 -76 -102 -18 103 -69 -11
5605 -11 180 29 78 83 -55 78 126 -177 -108 -2 -109 118 77 -360 -64 156 134 214 -34 29 72 42 26 54 -3
5630 -3 116 -256 116 67 -65 -66 -268 -142 -74 54 -152 108 -178 93 -189 -80 22 -42 142 -95 88 37 87
5653H7J84l43j03K00j51n8Q2M3Jj10m4K50L9p1P3o8q8J37j63K03j43m5K70k54
5677g2j37M23j16p9J04j34K16k43J28n0k6Q8j13K31j17l23N17n02J99k89J91L89
5699B85Mj93K58n47K25k7Q7J43j40j04k52K55j16J96j98K13P6j67kM10k67j87
5721d8m3K17j09j68J18j24L39q9j43nJ13Q1l5O3j02k3m3j62M46m69K30kJ55j99
5745bj95nP5M9M5J12J05j13j82K80k37J01J89j31K4j68J81j52J12k23l1L03l89
5768b52Q9K01k4k9K7k30L57n7L1j94J6K47l82J22j15J64M6J03j14J17k28j7r3
5791b15J69m3j7J16Qk74L40o7k8m4k93L88j59J61j96K12mQj87N00m68O3J11j17
5815c6K09k09J89j15K13k15J0N6J99l20p1Q3J64K2q1r2o4J88n1ol47M15k51J79
$$ plain form
5653 87 271 -72 -175 25 -126 -184 -102 -59 -58 -168 -212 38 77 6 79 11 -77 60 -103 100 -43 -88 182 -72
5677 -72 -209 214 98 19 123 -11 205 -38 90 40 14 102 -11 220 103 -220 297 -205 -6 -295 -104 285
5699 285 289 96 354 -193 32 5 92 235 95 -9 -261 -6 -122 74 -124 89 165 -2 -4 406 139 -48
5721 -48 -91 126 17 -151 -33 -157 182 93 -50 -55 58 139 104 167 65 42 -1 -163 283 -186 44 42 197 -2
5745 -2 -197 -202 -127 -78 -33 79 184 71 -111 169 -68 33 222 91 115 -53 128 -24 88 -135 -166 137 -252
5768 -252 -163 38 14 -15 12 -218 139 82 113 -81 -65 182 -200 -78 -193 -29 17 120 6 123 -105 -122 -215
5791 -215 -46 -89 -106 10 18 -256 84 17 -11 -55 -348 40 -119 42 -154 58 54 62 -125 375 -93 -30 81 -36
5815 -36 173 -36 153 38 251 36 46 102 301 -19 -90 -7 157 179 98 6 -58 130 79 73 -274 141 -110 69
5839F9mk70J43q1P2O6L8o8J02J89j82k73K26J30j81n6K18j55J6O6R8J66m31J10
5863HNq2P2k62M38j11K40l03q3k6J42lJ1k4j70j83j8N03l04Q6N8J24J61l93K04
5888I0j40M3M1o9j27K67O0k57K29j03l3J98pk20J49J3k63P3P0j27R5j14M91k44
5912A15j44n5K46j79J3J68N3j17j73J83k23o0K34j72J31M5K89m61K5O2q8j3k2
5935a43J86J5j0k68J24L6J8J7K50L7k85Q9q8J25r2P3j84J25j58K10k68L47j83
5958b7K43j47k09K29J89k22qj40L35r3j99M0N2j4%J9j11L02k34m0j48J31J26p1
5982Cl7L20m25J41j58J80J9j58M2M22j81k43o4L15m14OL31l35J51J00j85K84o8
6005D6l5L76n00J35J1k13J42Q0J08r5k07K58k30K85k82J83q5k4L17j49k45N6K66
$$ plain form
5839 69 65 -205 -62 -143 -71 -5 33 -35 67 256 74 -199 27 157 -24 -80 138 -17 -1 65 163 329 -102 8
5863 8 13 -69 3 -259 179 68 308 5 -78 -104 38 35 46 22 -148 -331 -349 154 -150 -64 -6 118 279 -114 90
5888 90 -50 -7 34 -35 -162 105 165 -92 137 34 1 199 192 -28 121 134 -129 -56 14 -113 -18 -132 359 115
5912 115 -29 -84 162 -17 -4 164 217 100 -73 110 -113 -173 61 -111 20 65 354 -107 -82 -20 -108 -121 -143
5935 -143 43 58 48 -220 -96 -60 -42 -25 225 262 -23 66 -22 103 11 84 -100 25 -133 77 -191 156 -27
5958 -27 216 69 -140 89 278 56 48 -92 243 150 -49 -9 43 29 29 48 -63 239 5 -35 -183 -52 74 3
5982 3 -34 286 -139 2 -156 24 43 -115 -73 349 168 -75 -139 176 -238 -232 99 -236 -85 15 -170 114 46
6005 46 11 387 -113 22 33 -180 -38 42 150 55 -152 106 -124 161 -121 62 -23 -47 270 121 -124 -68 198
6028A98l17N0J80k60L83p3l13Q2J83j49L2j22J96M1k53J66l2q7k3K31k29L00r1
6051I3J82m23K3J0M7kK5N1j19L93k08j68M21m68J75K73k56K3j61j3L65l48o8L18
6075A65r6k37K52j85J65o4J95n6j05r3R1k56J35L60k17K02m67P3J04n8k8K99j07
6098G2l53K78J61k15n2o6J18O6J32m9m09M42j88K16q2P6N2l88K33p5L8j0J30j26
6122Ar9K29r4O4k57J70m1j44Q4L3p8J81j2k27M35k14J1K69O4q1l04j96j11K74
6146d3K17k94J05P6j78j06L03J55l27J96l61M64l85K52l65L73l72L3K11J07m47
6167c86N47j84k3K5j08J28j94K04NK04l47J63j9J09k2K6n2j4k66J43J17l11L03
6190D8j68J57L6j33K64m01rK72K04l41J9J65o7J58l99J6K36k52L0L2K89j54jj26
$$ plain form
6028 198 -119 -69 111 -149 234 161 -152 -70 113 -36 -4 -126 70 111 -142 24 -8 -95 -118 113 -116 184 93
6051 93 275 -148 -125 -115 -68 -70 -45 6 -113 280 72 -96 325 -143 32 305 49 72 -89 -102 263 -85 -153 165
6075 165 69 -168 84 -101 64 0 195 139 34 -59 32 -224 -89 271 54 256 -211 -138 -34 -92 -120 179 72
6098 72 -281 -3 158 -57 -109 -175 -57 9 141 92 -317 125 -63 153 71 147 199 -189 44 -31 7 -3 127 1
6122 1 -98 131 37 101 -156 14 -27 -171 -87 -54 -132 49 37 -190 245 31 42 311 375 294 -10 -206 -317 -43
6146 -43 174 -120 -15 61 -117 -223 80 235 -92 104 -257 207 -178 74 -291 82 -290 -257 -46 61 -386
6167 -386 161 -23 -46 -21 -129 -1 -195 9 14 218 -129 34 15 124 102 128 76 62 -204 -61 56 -255 48
6190 48 -120 37 73 -60 204 -197 -206 66 270 -71 -52 113 46 204 -195 -179 57 -195 -165 -133 156 2 1 -125
6214a25K57o2l12l7J41J20J84m56K51m8K33K9m1l99J08K49J82l16O9J34k8r7l04
6237b68M28j98j5K43j87J14l2k37L67k37J60J70l47J38J69j71k51L17R5m17J34
6258b5qo6L9K8K13l16J72k29L93m5l67J96J49O2k11PJ61l49L59k28J08j09j3K84
6282B05k26O8k45M17l10j24o2K61J19j81j96K51j19K49j48K67q7j67j19k03K32
6303a18K4N9Rr8R9J88j07p7K56k15k4k03rK54jj7kK7K9k38J8q7j4K15j84L77m57
6330b96K63J85k63Q9M8N3j72L06k86J1J12K41k34J27l12L6K21k41M60m93J99m
6352E0J17p3k33n5M1K03k5J19J24j43k11J41R9l8r6j04P8jK33k09L24l36J9n2
6376b8l6M2P7Oj50O9qj07j58K41OJ99l61K93j38R2l05K25j58J84k88L53j83K61
$$ plain form
6214 -125 132 70 -242 -279 -138 -18 166 -290 -39 -87 146 175 134 -265 -157 92 274 -42 27 161 133 36 -268
6237 -268 160 -38 -53 190 3 117 85 -152 215 -22 138 308 -39 99 268 97 -154 163 258 -159 -25
6258 -25 -33 -99 -60 -32 181 -135 37 -192 201 156 -211 -15 134 196 -15 -8 153 -196 163 -65 43 -66 -79 205
6282 205 -21 47 -198 219 -91 -215 -277 -16 103 -78 -274 -23 -142 107 -41 226 139 -28 -147 -350 -118
6303 -118 -94 -35 -26 -124 -25 163 56 -21 235 20 -4 -207 -216 38 37 20 18 45 74 -164 -146 -233 -247 -32 -216 161 -296
6330 -296 -33 152 -111 -22 26 79 -93 213 -73 -62 50 291 57 184 -128 -92 129 -112 348 -145 54 50
6352 50 167 94 -139 -194 -153 50 25 144 268 125 -86 55 154 116 20 -84 -6 -7 226 17 341 5 24 -28
6376 -28 -64 -22 55 61 -89 -20 -28 -135 -293 -52 -46 153 -208 85 -53 39 -266 -41 -199 -15 -303 50 -133 128
6400A28P7l40P1J33N5K02l83j26L16p9J41j43k97M86m59j01M53l41K79q0p9P6
6422a1j1j45R5L3m5J1j2J41Oj07m1k7O9N5J31m9k4J26j96M55n24o9L43j58j97
6447a51J41K5j17j96L86l13Q7J59P4j10N0N2J61j62k16N2o0K1l2J15j85K45k65
6470b39P9J32p8K17j23K01r0j06qr1O3J58M9j52M0Q7q1l1O9n8Q4k97R4k11J65
6495a27M9J34J26j35K26j82K7l27K32P9J4j60o2K68k58q9J81j54M5k6P7K65Pm24
6519b14L88k62j06Q4j23K06M1L7o0k26J28j58M45R7j66k50K24j33P5j07K20P2
6541B12l43N2m8K82p1r4j12L70l26J87l02k7J83P5K2j42k28J89K36j83N01l25
6563A08j93J09K22J01j95j88K3j45K21j69o3n8M36j71k75J46Mk28N08m09K08J88
$$ plain form
6400 128 205 -135 -64 69 124 326 -57 -183 133 54 195 52 -245 241 -218 -319 134 -207 72 -8 -87 -11
6422 -11 -22 -167 -72 -39 -84 -73 -85 56 62 -45 -86 -113 -44 11 142 93 69 195 -1 454 -70 -139 204 46 -151
6447 -151 -10 15 -102 -298 88 -225 -138 21 95 -15 35 87 248 86 -130 -78 -138 -117 -149 -34 -219 26 -239
6470 -239 -160 -28 -106 111 -12 189 99 -7 -15 -106 -43 115 164 12 52 139 58 27 96 38 122 -175 -81 -292 -127
6495 -127 -78 56 182 47 273 91 118 -209 23 102 116 -44 -106 162 -96 -185 -4 -158 -113 -139 -62 203 210 -214
6519 -214 174 -88 -194 -110 -233 -27 14 51 -9 -235 -107 -265 180 277 111 -139 85 -48 27 -80 140 212
6541 212 -131 -79 -127 155 84 -10 -122 248 -78 109 -193 -220 -37 38 60 -82 -310 -121 115 -68 433 108
6563 108 -85 24 246 347 152 -36 -13 -158 63 -106 -169 -227 209 38 -237 -91 -87 -315 193 -216 -8 180
6585A80k13k9J67l41J37o9R7r5J39j14J75J97k80p3R6K81j77l0J27l44J62J5r9
6608i1O7m0J67k33K61k37P9K87l67M7k35J31M17j76k41p7L26K4m58K15P7K34j60
6631A7o5J75k84J37j33L04l6j05J46j61n6j48R1M9N9P0n52L39L89J2j67j4m8J50
6655A69r9J34j37j29Mp0%K2l02L19Q4j79K28p4J24r9p4j51O8J42J66j28k57K30
6679iJ32j41J0k2J0L30j90p6J9l46J76l9K04n9J84j53J53j09J3j7rNNR6K4K7j40
6706G8j80mN7j24R0o7k6L21k57K16q9j48L74l54K82k15J04j32J38N9k06L91k43
6729F5Kr6J20r7r6Q8N0j16O4K20l83p0K10l2J72J8k28L16l18K18j90J69m5k8j1
6754BQ5j07M5O4j13J1p4K92k63L10P9k95r3n7r2K58J66k15JM2j63J34Jj18Ok1
$$ plain form
6585 180 -33 -62 105 -236 -99 -168 -71 -166 -27 -141 34 231 -49 -122 -26 255 78 48 175 -169 -7 8 -91
6608 -91 -24 -64 103 -130 131 -106 -27 260 -107 -60 -295 -164 253 77 -164 -241 85 109 -349 -134 -57 177 17
6631 17 -48 127 -157 -20 -153 151 115 10 156 -5 -61 -209 -118 -69 -10 60 -492 -153 236 248 81 67 19 169
6655 169 70 204 67 -62 -58 -128 -128 -106 -408 -89 -5 -184 44 -30 94 -5 -79 -230 -162 -20 146 18 -239 -9
6679 -9 123 -18 -8 -30 -20 310 120 44 63 -283 -107 -146 58 -1 183 30 183 74 87 70 61 66 71 167 191 218 78
6706 78 -102 -106 -49 -173 -83 -150 -176 145 -112 104 15 -133 241 -113 169 -46 58 -74 64 123 -83 308 65
6729 65 67 -29 91 -6 -102 -14 36 -80 -16 204 -179 -249 -39 -71 101 119 -109 207 -111 107 -83 86 41 13 2
6754 2 87 -20 25 89 -24 -13 -87 205 -58 252 331 36 -57 -114 -206 52 218 3 4 46 -117 17 18 -100 -94 -115
6780a15Q1JJ64j19k06J30J13Q3j18j33O0p1K15K5J12k59p5J45M0J56j99j6K23
6803B37l13Q1K39r4j30r2qJ76r1j30L59l37q6K8J15J54k04J2o6L32k26L16l61
6826h9J09J76j21j66k1O8J26K0j54J46L07m46K4j85J82m8J61L9o5j69J40k03J95
6849B6nN3j87k01L49N7P8l23K36k35K20j59J20k05N2L37j11J39j18J68k18l39
6871b66J72K86k05m1j52m5K21j18J54M6M0K8o6o8J17J69k32l12P0j1K66J7k08
6894a38l8L18k42J21o3M63n36J44P4j06r2j84L63k5p6j01L87j46j23j9M5k9r9
6917a02M1M1j4K07l43N9n5K71j37J53l41L15k21Q8Nj36N16k18Ol04O1m6M88j34
6941B00n0k49L23k35K19j83o7K9kO6p7J40o1k80J19L45j94r3lJ93j75R3j21q4
$$ plain form
6780 -115 -34 -33 131 12 -194 -64 49 132 14 -119 -59 -130 85 110 222 -37 -112 33 73 229 30 14 237
6803 237 -76 5 244 150 20 -72 -80 96 5 -125 234 -103 -189 -161 -46 108 -96 -84 -150 182 -44 272 -89
6826 -89 20 196 75 -91 -112 -44 82 102 -52 94 401 -45 -21 -206 -24 -72 89 128 63 -106 34 -169 26
6849 26 21 74 -113 -314 35 92 170 -153 83 -152 68 -91 29 -176 -124 213 102 241 123 291 73 -266
6871 -266 -94 192 -13 -54 -206 -251 -30 -148 6 52 92 120 54 -14 103 272 40 -272 -202 -213 53 70 -138
6894 -138 -176 142 -100 21 -42 421 -115 29 103 -3 -95 -279 84 59 -17 -118 269 123 0 -19 26 -3 -102
6917 -102 -61 -20 -34 173 -170 -111 -166 105 -32 121 -220 95 -126 -38 -33 -169 347 129 135 -169 -108 -154 334 200
6941 200 150 -99 224 -11 208 25 -42 -13 -15 51 -26 114 53 -227 -108 237 43 -50 -53 140 -35 58 -63 -147
6965a47M67k75J30k72kJ15l6jN9j18P8r5J96j95L0k13K99j22J89l26L02nq9j27
6989a58M97m34O7J24k74K99l26K00N8p3lJ76l71M10o1l61L73l00J44J96l81L40
7011A42j51J27K4p1MK5j47J03p3R9j35K0M3n6j7J00n7J45p2j76R7M5J74Q2nl5
7037B35j11o7k07J46p4p8O5K2M0K3M8k61L84k71L80l18j16K19K07k82J47j58j41
7060a68k38O20k38P2j02o1J83p2lk74J29R4J85o8q9J71j1J1K16k15k59k33L18
7083c2j25J49j40K18r8m19L84J01J0J83j21j50j25K14K63o61L88j55J58M6k25
7104a37J11l12J69P2K04R1l03L11k80J77j93K20j82J31R2j57n7k9j5M4K67n8o2
7127A04n0J23l41J89j63L01j90K46k47j7K3L8j2M0o1K68k02K26k16j14L90k02
$$ plain form
6965 -147 320 45 175 -97 -99 16 -20 -21 38 -80 -2 -97 99 -96 -66 -279 20 -102 87 -239 63 58 -31 -158
6989 -158 339 -95 -28 96 -178 121 -205 -5 53 -20 -23 153 -218 192 131 -230 143 -157 -13 183 -198 142
7011 142 -9 118 142 71 75 100 -47 56 -17 82 -53 -33 10 -46 -63 37 -20 125 53 -123 -26 19 193 275 270 235
7037 235 124 57 -150 -4 -78 -156 -91 -69 -29 -6 42 -219 165 -106 274 -44 -160 59 266 -16 131 -27 -168
7060 -168 -406 214 -24 48 -54 -115 68 -4 -7 -281 -152 -58 127 59 -30 141 130 141 357 142 -117 -350 -32
7083 -32 -157 -8 -148 70 -28 -447 -63 38 48 231 110 -40 -165 49 312 -349 39 -116 42 88 -137
7104 -137 -26 -338 -169 -97 107 198 -105 206 -74 103 -90 130 -52 79 171 14 -43 -72 -87 -43 224 166 104
7127 104 54 177 -164 25 -138 163 -27 219 -28 -45 -22 16 4 44 -17 251 49 275 59 -55 335 133
7149A33k14m2L13p7m23K17J22j41j6L05J65l87J20Q1J1r5L1K4O5l57K93j46m5
7172f3M20l33Q5m2J37k93j51M0K29rj69K45m1o4K63m72K32O8J3k41K53k08J02
7195An7J62k46o3K03j91K06J36q9Nk44K53p9R1K33l36O2L8j80j06J55j1l3j53
7219b43L21j20l2LM8j43K56k18l7K68j00K6J27k94qJ59j58K78j32r3R3J74J9l5
7243A59j64Q8L7j05J52q3q6J56l46J44R0Q7Rk34J13k74K25k31L02p3P6r4J47q
7267H7J5M2J1j41J37k4j53j6Q4N8r8J2%j41J66J41O2k96J31j00K14k68l4J59k98
7292b50L10k5r2k93R5L92j69P2p2L4q6N1j44L16P5k50K81o20J07K31m9M5o1J5
7316h7J15Q0j83L3P5P7Ok3k77qK21k55J59J20J06j89k22M42r7J13n48R7L18J04
$$ plain form
7149 133 -81 -123 190 113 -310 -93 29 -112 -128 177 342 -45 75 156 167 72 103 127 192 -165 128 -18 -63
7172 -63 357 24 109 67 204 -89 -240 -200 29 20 -149 96 55 -9 254 -218 14 82 95 -146 107 -101 1
7195 1 -56 106 -140 -203 0 -191 15 151 62 67 -177 76 -3 88 321 -15 47 85 -95 -201 -46 -57 -90 -243
7219 -243 78 -42 -74 -71 -23 -166 90 -128 -165 103 3 29 156 -138 -146 13 -145 133 1 -92 1 175 194 159
7243 159 -5 83 120 15 167 84 -2 154 -192 -48 42 129 138 -96 17 -257 -32 -263 39 -34 42 -52 95 87
7267 87 102 144 155 14 151 127 -26 -42 42 100 2 14 14 -127 39 180 242 -54 77 -23 191 -77 -111 48 -250
7292 -250 60 35 -57 -350 -255 137 -32 40 -32 2 -84 -33 -177 139 214 -36 245 -375 -268 -37 -86 -41 -102 -87
7316 -87 28 108 -75 -42 33 110 116 93 -184 -192 29 -226 -67 53 159 -30 -252 190 93 206 -342 -245 73 177
7340A77J46m14J01J32k29P7j53r5J19K89j77Q6k29K08m0J53j93K55p6k93K85l72
7362b43K38lQ8L5j59L8J49k94j50J13K7K95l09M22k59m2J76K2j47l7j46R1N3K3
7386a9J43l79N01k99J45j40K04k06o0K00j4n8J27j21K6Q4j59j02M56k00r5r9J91
7409A26J62j29j06n2j23R4Q8nJ78j98Ml29K63J15k88Q5L27k04j56J33m5j19J23
7432e6j2J32M7J07R2j44l74L12O9K3l95J14m3oJ46j3K31m79L18p8J23N1j49k17
7456b01K80j20MK97m10j58K29j88L80O9m14L55k9j81R7k57K70j57oK09K6o3J40
7479A72k7k82L56r2q5o2N3J25rl84J07o5k13K95L02j5j34j98Q0J61J48k62O5l07
7503b71J14K70j39N6j69J94L9j83P4j22k4O1J74Nk81K59M6j8j49J80J28k30j89
$$ plain form
7340 177 323 -91 10 142 -87 -10 -163 -258 -139 150 -27 59 -170 38 -2 151 -42 213 137 -156 129 -243
7362 -243 -5 -8 80 115 -44 -6 143 -151 -301 -188 -161 134 -175 247 -12 -54 122 144 -3 -40 -186 -95 -42 -19
7386 -19 124 -255 246 -53 92 -48 156 -50 -110 90 76 18 145 24 50 134 -25 -127 329 129 34 -65 126
7409 126 288 159 53 1 -122 -28 60 55 233 35 39 -290 -27 88 -200 -115 212 8 -148 -15 -60 -179 -56
7432 -56 -68 64 111 218 310 166 -208 104 173 196 -199 -85 -128 -134 12 -1 230 -249 69 -9 114 165 16 -201
7456 -201 79 -41 -37 260 -150 -308 -79 -267 113 182 -232 123 94 -87 10 -247 23 -134 -140 69 95 32 172
7479 172 145 -137 219 127 42 -20 33 158 149 -235 -128 -193 -406 -111 191 176 42 -156 -76 85 233 -29 36 -271
7503 -271 -157 113 -26 30 -139 55 94 -89 -15 -137 -161 -100 74 79 -202 57 103 85 -64 116 244 14 -175
7526a75L13k85J81J90l43K35l00r3M34j06j97J43p2l3K56k11J69O8K0m5R4k77
7548c4o7j41K86o7l0p1L39l04K95k10J84J28n26j38M26K23m77K55j39j05J06K8
7570c9N6K32k11j4L01L7l88j06K52k07rK83q3j74L39k58J09R9l32m9J21O2rK0
7594C2J10j73p7J22J22Oj60J10p5K6o3o6K29k80L40l19J55O2O4k47J92m1K3K06
7618B98m37K34j34Q0J07j25L13j31r4j91J72j48J79m04J08J36L6kk12q5Q0K52
7640C2j22J16j77J39L04MJ6k71j84K85j53j61J57N7J07k97J2K05O7J30k36J3j14
7663g1N4J04l61J72J33j13R9P6k16J51Q9k20J94p4m1K6o5J5K11o6j49K56kk92
7687i0M23m51P1K52p2O4m56L74k1o6J66l03j09L73k14r6R9L8k91O02j55k6K6K2
$$ plain form
7526 -175 138 -147 34 224 -119 116 -184 -277 157 51 -146 -3 -75 -108 148 -63 106 174 194 149 243 -34
7548 -34 -101 -242 44 -23 -53 -124 215 -89 206 -4 180 308 -218 -356 70 293 -184 71 -68 -173 -67 -39
7570 -39 17 249 38 24 325 362 -26 -132 120 -87 -96 187 104 -70 269 11 120 219 -113 -162 -41 21 12 32
7594 32 142 -31 -108 14 136 142 -18 92 17 43 -20 -86 143 -137 203 -116 39 101 165 -82 110 69 92 298
7618 298 -139 95 -39 41 148 23 336 205 111 -80 92 -56 123 -281 -173 -37 -1 -3 -215 -300 -220 32
7640 32 -90 26 -151 -12 292 296 312 41 -143 142 -11 -172 -15 42 149 -148 -136 69 136 266 30 43 -71
7663 -71 -17 87 -274 -102 31 -82 17 93 -123 28 117 -103 91 17 -24 2 -63 -48 163 97 -52 204 202 -90
7687 -90 333 -118 -47 205 133 197 -259 115 94 28 194 -109 -218 155 -59 -155 -56 -18 -309 293 138 112 138 160
7711A60j04N4k21J10K5k37M63j00j78O1r2k73M12k19K6q9J26J19j29j12Q2J75
7733E9j27J88l03L11K92n41O8j75J17K47k55K19l30L96n18L21J98k39R5j35L59
7754B47r1q3j28j70J18J66l48K62K12n1k66L87k65L4m9P4j55K71k0l87L30p2j75
7777a59K63k20J46K2j83J11j04qK57j25J21Ql5j15J74k15J90j16k5j30J79J54
7799A90k01j39L23j26r5rk11J83J5K57j71R2k33J85L0l35R5K34R9j49m49L82M2
7822IL37k46K8j51L9L06l26K84k15k33J63K12j89p0K0k78O32k31k9Mk04K57J28
7845B47n91M65O5m3k03L5J40j48j81M27j66k30L00k12J55j79Q1n0r3L36l7j82
7867f4rJ3r9L16q0k8j74J16J41m01K57j13L71k32O2r6QL0q5K9L9Q3l2k5nk2l7
$$ plain form
7711 160 56 110 -111 -1 24 -213 250 150 -28 33 -59 -332 80 -139 -113 -202 -76 43 -86 -198 -116 59
7733 59 -68 120 -183 128 420 -121 -53 -228 -111 136 -119 100 -230 166 -352 -31 167 -72 23 -112 247
7754 247 156 73 -55 -225 -107 59 -289 -27 185 134 -132 255 -10 24 -25 49 -106 165 145 -242 88 16 -159
7777 -159 104 -116 30 52 -131 -20 -124 -132 125 0 121 129 94 -21 153 -62 128 12 -13 -143 36 190
7799 190 -11 -150 173 47 -48 -57 -268 -85 -70 187 16 108 -125 60 90 -245 -150 84 183 34 -415 -33 9
7822 9 346 100 128 -23 16 322 -4 280 65 -168 -5 207 18 -52 -32 -310 322 91 62 66 -138 119 247
7845 247 -344 121 186 143 -60 -25 115 -33 -214 213 47 -183 117 -95 60 -119 -38 -88 -181 155 118 -64
7867 -64 -73 -60 -159 157 77 49 -125 -9 132 -269 -12 -125 246 14 76 -20 -12 18 -67 -38 1 84 52 27 22 0 -37
7894c7Q2K96o78K11P6K00j99p3N7K56k16j44K94mq1Q4j13R6K23m34m6J79lj20
7918i4J13O2k8J1k27L05k28k2PK60p5k61K83q5j96L31l83K09r6K82j81R8lR9k64
7943h3R0k0n6P6J7k28J34j97K68J01k35O9M4m6J40Q7k76J50K2J06k51m0l2M14
7967B54l03j44K9J75R6j74mJ89k50K80j59q4J75K85l24j16j3K13J29m11L13k27
7989g1Q0J44k06L5j35L39k14K01l58M20j86j10J99j41j85N2j00J36m1Q0q8k8J67
8012a0qJ23rk7j68k5K18j64J65j56q6M17l10P9j35J65j58K03J34l11M3l06L78
8035E2p3K02J3m32L20Q3R0l66J97k01L7K07r7r3k6JqJ31J06o8J08M2r3j0k36J12
8061bM5j85L40j53J25k5p2L8j34K52j81P4n9qJ6l1m8m2P9l12L27j79M0l1R9J67
$$ plain form
7894 -37 45 341 -337 -126 -50 150 -49 -122 -65 191 -25 -169 125 121 40 124 11 107 330 -104 -150 29 26 -94
7918 -94 19 81 53 64 -163 142 -86 -108 -101 159 84 -177 106 21 -175 156 -227 -18 -114 168 -13 85 82 181 -83
7943 -83 7 -13 -69 7 24 -204 -70 -267 1 102 -133 -64 -20 -66 74 161 -115 35 57 163 -88 -128 -160 254
7967 254 -49 -193 -164 11 107 -67 -71 118 -132 148 -11 -95 80 365 41 -75 -88 125 254 -157 156 -71
7989 -71 9 153 -53 -18 -153 186 -28 173 -185 235 49 -61 138 -3 -188 -136 -236 -100 -141 -61 -149 -177 -10
8012 -10 -18 105 96 69 -99 -124 94 -70 95 -61 -147 270 -40 39 -96 69 -89 114 248 -63 -20 -326 52
8035 52 -21 181 194 -238 82 165 255 -111 86 -115 -78 129 32 -61 -87 -86 -94 37 143 75 183 225 132 122 -114 -2
8061 -2 43 -142 198 45 170 145 73 111 -23 229 48 122 63 55 71 40 -8 -50 29 -283 44 -135 -95 -126 -27 140
8087A40k58j32M39K1j1J55l57L14N2k50l6k99M30l22Q5r9J15J2Q3l65L75j57M8
8110a7j05K65p4j7q0K15m19K54Pl7K30p6l06K94j10P1l18L25l5j59L07j90Q8l00
8134a87L00j11K62k00k46J99j7mK08l11J68pj53K43k1R1m0l68J03j2L07l28j9
8157a43J14K08j50j65K85j68P3k74M37l03k78M80o4n6P5J22r1o9l91K11K4K00
8179G7j52m6K84j59k6k54K34J28j5k10J14o6
$$ plain form
8087 140 -118 -250 189 210 199 354 -3 311 363 113 77 -222 208 -114 -29 -128 -13 -1 82 -283 92 -65 -17
8110 -17 -122 143 69 52 -28 187 -232 22 29 -8 222 146 -160 134 24 95 -223 102 67 -92 215 25 113 -187
8134 -187 113 2 264 64 -182 17 0 -4 204 -107 61 54 -99 144 123 214 174 -194 -91 -103 204 -124 -143
8157 -143 -29 179 29 -136 149 -19 54 -220 217 -86 -364 116 52 -4 71 193 102 33 -358 -147 -123 77
8179 77 -75 -121 163 4 -22 -276 -42 86 71 -139 -25 -91
8191i1
$$ Imaginary data points
##PAGE= N=2
##DATA TABLE= (X++(I..I)), XYDATA
0@%%%%%%%%%%%%qJ6j6J6k3L1l2M0m8N6p2Q1r0J07j29J51j71J95k24K57k93L33
34A77l77M25m77N34n98O67p43Q29r20J017j125J244j372J515j673J842k027K233
52A171k461K716l001L318l678M092m574N137n808O628p652Q975j0762J3321j7318
67i896K4510m1517J61298J40511k02928j22685m2800P7664N8591L0184k3292l609
79D6031M964O827m0695m9829l2970J5234M0989O0552L2375k2371p6497o2251j1028
92h8669M1243M6218K1289j2543j3614N154R857k2220m2921j7417L5043N2680K3378
105C7478k2163l4056m022K7940J4741k5743l4195O560M6415M3644R126k7775m6742
118h792l0386J2123M0444K7227p653k6773j3822J7189L3736P084m4066n8332q400
$$ plain form
0 0 0 0 0 0 0 0 0 0 0 0 0 0 -8 8 -8 8 -15 16 -16 24 -24 32 -40 41 -49 58 -71 80 -91 104 -120 137 -156 177
34 177 -200 225 -252 282 -316 351 -392 437 -483 534 -591 653 -719 796 -877 965 -1062 1171
52 1171 -1290 1426 -1575 1743 -1935 2157 -2417 2720 -3088 3540 -4112 4863 -5899 7422 -9896
67 -9896 14614 -26903 134395 274906 71978 -50707 -93507 -15843 42748 72932 49640 46031
79 46031 50995 57822 17127 -32702 -65672 -50438 -9449 51103 83478 61107 -15390 -77641 -88669
92 -88669 -47426 -1208 20081 7538 -6076 -922 8935 -13285 -56206 -73623 -38580 14100 37478
105 37478 15315 -18741 -22763 5177 19918 -5825 -40020 -33460 12955 56599 65725 37950 -8792
118 -8792 -39178 -27055 13389 40616 32963 6190 -7632 9557 43293 50377 6311 -52021 -60421
131f0421N4699O2484J2094m2516n5919k3330K2455L5579J0258j6849j4097O787
143h776J4831K936j6433k5693j4542J2449L1316K2680r06k1570k3412n604J7655
156a5069K0778j698j7910k399K3014K1812o105k9420k1767Q990L1546K1245j0586
169B2431k3798l747J8684J5786m806j8707j5455J34J7095J9532K464j5098j7891
182c376p725N270J0955M654j0161j4662J319J9429J6209o207k6918k4838m66K4125
196a2392K4504J852j5495r711K375K640o088r495q75J2853K1274J1424r400k1560
210h094j6065j491J2667K0318J5042j216j1079n970O06k570q473m142Q618K0322
224A8473J9057j140k6937k9869o043J8923K0762Q310n203r816n713l45l72p034
$$ plain form
131 -60421 -5722 56762 68856 26340 -29579 -52909 -30454 5125 15383 -1466 -15563 -8776
143 -8776 6055 8991 -7442 -33135 -47677 -35228 -3912 18768 17862 -3708 -27120 -32724 -15069
156 -15069 5709 4011 -13899 -16298 6716 28528 22423 -6997 -28764 -19774 11772 33017 22431
169 22431 -1367 -5114 13570 29356 24550 5843 -9612 -9478 7617 27149 29613 14515 -3376
182 -3376 -11101 -5831 5124 9778 -383 -15045 -13726 5703 21912 15705 -11213 -36051 -36517 -12392
196 -12392 12112 13964 -1531 -11242 -8867 -6227 -12315 -21810 -22685 -9832 11442 22866 13466 -8094
210 -8094 -24159 -25650 -12983 7335 22377 21161 10082 4112 4718 2148 -6325 -10467 -1849 18473
224 18473 37530 36390 9453 -20416 -26459 -7536 13226 21536 16333 6517 804 459 87 -6947
238f947o561L710J0791R023J901q831j6975j3454M625J8389J4225j469j3262j4274
252a9109k609J1051J0708k522q760J860R942M194n107o887l415M075R929P372
266A0722k973p986o41M777K957K339L084j344o113k507M166L262q2k70n62o53
282H176J074l42o386n882M194J0199K064q645q930k808L635P063K557o842q712
297i585K02M799j179m506k67J673J672K977K986n395r244j875O294Q772P260K582
313G166p978j2192q15J2159Q876j442l968j608J597K398K465l423m432M180R355
328A2338L572n886n514l981k965J846P532M000l354n621m718l156J846O637K630
343E206n075l762J175o03m779l008J300K441K955K076k774o190o62N051J689k236
$$ plain form
238 -6947 -13508 -9798 993 10016 11917 3086 -13889 -27343 -22718 -4329 9896 8427 -4835 -19109
252 -19109 -21718 -10667 41 -2481 -11241 -9381 561 4755 -352 -7239 -10654 -6579 3350 10722
266 10722 7749 -237 -878 3899 6856 9195 12279 10935 4822 2315 6481 9743 9661 9391 8829 8176
282 8176 9250 8908 2522 -3360 834 11033 13097 4452 -4478 -7286 -3651 3412 5969 -873 -9585
297 -9585 -9383 -4584 -5763 -10269 -10536 -8863 -7191 -4214 -1228 -6623 -15867 -17742 -11448 -2676 4584 7166
313 7166 -812 -13004 -13819 -1660 7216 5774 1806 198 1795 4193 6658 3235 -1197 2983 12338
328 12338 15910 10024 4510 529 -2436 -590 6942 10942 7588 1967 -2751 -5907 -4061 2576 5206
343 5206 131 -3631 -2456 -3059 -7838 -10846 -9546 -7105 -4150 -2074 -4848 -11038 -11700 -6649 -4960 -7196
359g196K229M822j76m028j011P4J699L858M281n05k624J525K483j278j206K741
375E688J689l346k060K908L590J604o56m343n655j57N040K583k656j293K347j
391E282m574o062m640m04N253P060K829k487l673m184o354k332N215P123K573
406F25n70j970k848k634j138j126O83O780J0662L324o358q302k742J257K744M551
422B938L665J700J017O41k963m380j007N12j131K10N644P651P58o539j0447o909
438h640N92O466M270L41J01K149m63n360p161l967j561K941O190N656K624q11
454C367p841j2630p128P918J5924J0662o79o956o822l664L90K102J160J709N339
469B851N211J077o06k626o654p778p71R327J3053P093l874j1961r602R69P782
$$ plain form
359 -7196 -4967 -145 -321 -4349 -5360 -5286 -3587 271 4552 4047 1423 2948 5431 4153 2947 5688
375 5688 7377 4031 1971 4879 8469 10073 9417 5074 -581 -738 4302 6885 4229 2936 5283 5282
391 5282 708 -5354 -9994 -10398 -5145 1915 4744 2257 -1416 -5600 -11954 -14286 -9071 -1948 625
406 625 55 -1915 -4763 -7397 -8535 -9661 -8978 -2198 8464 11788 5430 -2872 -5614 -4357 -1613 2938
422 2938 6603 8303 9320 9961 6998 2618 1611 2123 992 1202 6846 14497 15255 8716 -1731 -8640
438 -8640 -8048 -1582 2688 3029 3130 5279 4816 -544 -7705 -11672 -13233 -10292 -4102 1554 4178 3367
454 3367 -4474 -17104 -24232 -16314 -390 10272 9593 2637 -4185 -7849 -7459 -5357 -4197 -2488 2851
469 2851 8062 9139 8533 5907 -747 -8525 -9296 31 13084 20177 16303 4342 -5260 -4291 3491
484C491L972k014j991J464L493L679J336p056j1474q107K78P722J1503Q877l545
499A1628j5666j3370r36O365N358L944K844J345P89l25n793r925n217L828Q767
514f364R220J0486L998r871j7473j1803K545J4232J6989Q711m613j0733n998o19
528a293p25J089M538M840L317K736J060l933q431q888o330O94J1614J5839L510
543A9637j1690j3735m333J388L670K624k51j204L216N996p72q166p415m035k004
558a7074L268J1973J2008J649p884j0646p943j893P312J0342N316J998J343k336
572G433p767o496j67L192M592O752N808M42m358o606q783o827L596J1843J0011
587A2665K577k435o489r476n412L040N340K952R02j374l005o78J554k930q853
$$ plain form
484 3491 7463 5449 3458 4922 8415 12094 13430 6374 -5100 -13207 -12929 -5207 6296 15173 11628
499 11628 -4038 -17408 -18344 -11979 -6621 -2677 167 1512 2301 1976 -3817 -13742 -18959 -15131 -6364
514 -6364 2856 13342 17340 7469 -10004 -21807 -19262 -5030 11959 20670 16057 5324 -674 -1293
528 -1293 -2018 -929 3609 8449 11766 14502 15562 11629 3198 -5690 -12020 -11326 288 16127 19637
543 19637 7947 -5788 -10121 -8733 -5063 -2439 -2690 -3894 -678 5318 4546 -3620 -11035 -15070 -17074
558 -17074 -13806 -1833 10175 11824 3940 -6706 -14649 -16542 -9230 1112 6428 8426 9769 7433
572 7433 -334 -6830 -6997 -3805 787 7539 13347 13789 9431 2825 -5958 -12785 -9189 2654 12665
587 12665 15242 12807 6318 -3158 -8570 -5530 -190 2762 3664 2290 -715 -1393 161 -2769 -11622
602a1622n460N523Q258M244k63k089m360m528k79J375K235M456N468K12m064j424
618b318K218r24m704j151L786P000N289Q48n255p270j722K408K492L685P014M414
634A5810k901p382n643n35L441L996j044m664q7N261J272o505p150k967J016K929
650e153M260J792j888k753k150j829n50L236L198j291k007K183N114R68m590n603
666g063l378K484P197O620J138k800l710k615j642J707M806M201J635Q5j516k256
682D893k389j560j496R44N722N431o45o258n077l342o31K518M287K551j25k545
698B278m467m126M84M048K418k183k208O40J086j243j425r32r2K458K434j27k103
715c060p91J106M75P64K190P04j845j664q8J286L251L539q70m646k251L074L850
$$ plain form
602 -11622 -17082 -11559 -3301 943 680 -1409 -5769 -10297 -10576 -9201 -6966 -2510 2958 3170 -894 -2318
618 -2318 -100 -1024 -5728 -6879 -3093 3907 9196 10044 4789 -2481 -4203 -1795 697 4382 11396 15810
634 15810 12909 5527 -116 -651 2790 6786 5742 1078 991 6252 7524 1019 -6131 -9098 -8082 -5153
650 -5153 -893 899 -989 -3742 -5892 -7721 -8271 -5035 -1837 -3128 -5135 -2952 2162 3130 -1460 -7063
666 -7063 -10441 -7957 -760 5860 6998 4198 488 -2127 -3769 -2062 2744 6945 8580 8665 7149 4893
682 4893 2504 944 -552 392 6114 11545 10900 4642 -435 -3777 -4408 -1890 2397 4948 4823 2278
698 2278 -2189 -6315 -5831 -1783 635 -1548 -3756 -3116 -2030 -3273 -4698 -5630 -5722 -3264 -830 -957 -3060
715 -3060 -3851 -2745 -2270 -1506 684 1388 -457 -2121 -2209 -923 2328 5867 4997 351 -1900 1174 5024
732E024J293p65j101j108o35K11l73r13P15K261K74j999l13p42k865k243J432
749a847L310J634j040k929l796j660K650L906J98j169r32j716j853N54K611J073
765a006l25Q45j33j460j383R39q5J60K942L502j82l068j679J27N30K123L006K73
783E126k169j743n9n18J083L248J019l146k363J1J59r59K65R40p55J20P17j081
801a05l537j067K615Q52n78N86K74l069k345J273K219R10M60j57k488j896K536
818c517L394J33j494O60O50m85M54Q11n75k29K103J732q98m32J293p21q72J621
836C628K530j072l010j369k40L37K495K326j387l876j110J034n43m37K114J345
852B765j887j690m35j416j126R0K069N93JJ440l14l372k206J146J962K051J048
$$ plain form
732 5024 6317 5552 4451 3343 2708 2919 2546 1633 2348 4609 4883 2884 2571 1829 -1036 -3279 -1847
749 -1847 1463 3097 2057 -872 -4668 -6328 -3678 228 426 -743 -1675 -3391 -5244 -4690 -2079 -1006
765 -1006 -1331 -486 -619 -2079 -3462 -2523 -2608 -2448 494 3996 3814 746 -933 -806 -276 1847 4853 5126
783 5126 2957 1214 1155 637 1720 4968 5987 2841 478 489 648 -311 -46 894 139 259 976 -105
801 -105 -3642 -4709 -2094 -1242 -1820 -1234 -960 -4029 -6374 -5101 -2882 -1972 -1512 -1669 -4157 -6053 -3517
818 -3517 -123 10 -1484 -824 -174 -659 -205 606 31 -198 1905 3637 2739 2307 3600 2879 2007 3628
836 3628 6158 5086 2076 707 467 804 3299 5625 4238 362 -748 286 -257 -694 1420 2765
852 2765 878 -812 -1247 -2663 -3789 -3699 -1630 -1037 -1036 404 90 -3282 -5488 -4342 -2380 -329 719
869G19k80k293j637Q48J381J026K151M51j576j131J587K202Q4j529q48l63M08
886A200K877J818j936k640Q20J190o90r54o64j058n14K466K834m90l722l860k268
903e591P84L945M558N5m043l721j308O3P44J594o2L56J249J520j328l022q39K78
921d768J040K870K714L58j861j869j186m99J776L215J974j096j008m15j94O4J211
938B326R80j453j056J138J556Q89O37q97l710l135J96L549K502N34j326k530j950
955a750K46N67j921j698N23L332K708L67k843m735k854J283M188L702J728n34
971B309l047l620m03J227J654J296J540J002m82r62r00j339m50K624K535M97n56
988B925K13N80q99j433j133j082Q29K943J891j852k749n69k2n2N87l86j775j058
$$ plain form
869 719 439 -1854 -3491 -2643 -1262 -236 1915 2366 790 -341 1246 3448 3532 2003 1155 792 1200
886 1200 4077 5895 3959 1319 2139 3329 2639 1685 1021 -37 -551 1915 4749 4259 537 -3323 -5591
903 -5591 -4807 -862 3696 3751 -292 -4013 -5321 -5258 -4514 -2920 -2982 -2626 -1377 143 -1185 -4207 -5046 -4768
921 -4768 -3728 -858 1856 2214 353 -1516 -2702 -3201 -1425 1790 3764 2668 1660 1245 1051 1115 2326
938 2326 3306 1853 797 1935 3491 4380 5017 4120 410 -2725 -2529 1020 3522 4056 2730 200 -1750
955 -1750 -1504 -937 -2858 -4556 -4033 -701 2007 2374 -469 -5204 -8058 -6775 -2587 1115 2843 2309
971 2309 -738 -4358 -4761 -3534 -1880 -584 956 1958 1476 514 -386 -1725 -2175 449 2984 3481 2925
988 2925 3138 3718 2819 1386 253 -829 0 2943 4834 2982 233 -336 -358 -410 177 -209 -1984 -3042
1006c042K431K771P62k225l948l701m87M214O094Q09l590l807j729l13J576J537
1022b648J42N36K075J460j540k107n38Q0L18K676L957Q99j477j895k434k133R78
1039a651M344J882l05j146l01j867k332J600L218J34j465j637o79J326L253O33
1055E007m526m991n8M212K969j14k278l447j510J158K060o13j811l13R0J682L590
1072A107K238l511n892j990M929N615L268j294m923l874J544L984J198j563M21
1087A257K234K99q86m21n69q61N03J323M46K69J074j052l548j899K131J750m03
1104A647j438n67k53n56m57p98k55J089J062j971k654J324M985J307k532l310
1120c377j807J307L306J795j329k402K55K265J72j170j8L89K79K074K094L91k149
$$ plain form
1006 -3042 -611 2160 2922 697 -3251 -6952 -7439 -3225 2869 3678 88 -3719 -5448 -5761 -4185 -2648
1022 -2648 -2506 -1970 105 1565 25 -2082 -2620 -2540 -2222 454 4411 5310 3833 1938 -496 -2629 -1651
1039 -1651 2693 4575 4270 3124 2823 956 -1376 224 3442 3576 2111 474 -205 1121 4374 5007
1055 5007 481 -4510 -4568 -356 2613 2499 221 -3226 -4736 -3578 -1518 -2131 -3942 -4255 -4165 -2483 1107
1072 1107 3345 -166 -6058 -8048 -3119 2496 5764 4470 -453 -4327 -2783 1201 2399 836 1257
1087 1257 3491 3790 2904 2483 1914 1053 1556 2879 3325 3594 4668 3616 68 -1831 300 2050 1647
1104 1647 209 -358 -611 -1167 -1624 -2422 -2677 -1588 -526 -2497 -5151 -3827 1158 2465 -67 -3377
1120 -3377 -5184 -3877 -571 1224 -105 -2507 -2252 13 185 -985 -1003 -614 -335 1739 3833 4224 2075
1137B075k615j296J239L693L599j267m759k838J616L053K25r84j722k73J847J378
1153B971j231l101j125K074J244M01p9j461j880k10J383J424l33j266j719j252
1169d160M07K385Q60j234r57Q93J337q48K00J3P40R76J289j205k050k95J486J618
1187A455J13L82k74o38n66L38j97k52R51J093J49p41n64j825o73R79K535J012
1205C277j622k230j459j26J714J503j486j756m10J211N98o55q56m78M66K163J527
1222A381j466k532m83J378J580J241L64j408k562K99K210J341j99n77j26k60M56
1239F37J228o67r97k50J526J198l02q05j455p86J636K285K80k020j589p47J37
1256f91R55Q78q3j127m78M20m40q34K44M02J15j15M72n51j764L59P91N90K63J12
$$ plain form
1137 2075 -540 -1836 -597 3096 6695 5428 669 -2169 -553 2500 2725 1741 19 -254 1593 2971
1153 2971 1740 -1361 -2486 -412 832 1233 1154 -307 -2187 -2397 -1014 410 77 -1189 -2908 -4160
1169 -4160 -3753 -1368 -508 -1742 -2699 -1806 -469 -1317 -1117 -1104 -364 612 1901 696 -1354 -1649 -163 1455
1187 1455 1568 1950 1676 1038 472 810 613 361 1312 2405 2554 1813 1249 -576 -1249 -270 2265 3277
1205 3277 1655 -575 -2034 -2160 -446 1057 -429 -2185 -2595 -1384 -786 -1441 -2297 -2775 -2309 -146 1381
1222 1381 -85 -2617 -3100 -1722 -142 1099 1463 55 -2507 -2208 2 1343 1144 567 441 181 637
1239 637 1865 1198 201 -49 1477 2675 2373 1568 113 -673 963 3248 3528 1508 -81 -828 -691
1256 -691 264 1142 1059 -68 -546 -126 -566 -1400 -1156 -754 -639 -754 -282 -833 -2597 -2238 -1447 -857 -594 -482
1276d82K64r48n19P57K12k1O31J324l91j428n47J29N90J816J430o54k151n70Q82
1295C24Q74P69N03q02j600N53Q59K89j562Q9Q34L09j32N79j449k674K6K036J434
1314A259k67r38j583j651N26K273N92q60r29K56j37l68J172R6o05M8O11O20k87
1333a72p27N04k52O91J321R81j435j293K93M03P95R71L82q12j182J00M45n6O80
1352A637Q96l46j651o44J13J29J51L36J87o35k94P8p29r19r4J090K64p8L28l43
1372e24k106l27J098R77P02K62l21j742j79R52J212j97j93K51m53k05R49R50n16
1391E90k02O43J45j12j14J09l19j59O53R12p15j100o66M05O98N20P84j227q16
1410B9l86m41n21O27J084L0p14k07m62p36j66R12L33L6J150j2j669j270M83J078
$$ plain form
1276 -482 -218 -1166 -1685 -928 -716 -737 -106 1218 827 -601 -1148 -1019 -429 1387 2817 2163 12 -558 324
1295 324 1198 1967 2470 1668 68 621 1480 1769 207 296 1130 1439 1307 1886 437 -2237 -2211 -175 1259
1314 1259 992 54 -1529 -3180 -2654 -381 211 -649 -1578 -1322 -1459 -1827 -655 -559 -1164 -1116 -505 115 -172
1333 -172 -899 -395 -647 44 1365 2346 911 -382 -89 314 1109 2080 2462 1650 468 568 1013 957 1637
1352 1637 2533 2187 536 -108 5 134 285 621 808 173 -121 -43 -772 -1691 -1785 -695 -431 -509 -181 -524
1372 -524 -2630 -2957 -1859 -882 -180 82 -239 -1981 -2160 -1208 4 -193 -386 -135 -588 -793 156 1106 590
1391 590 388 1031 1176 1064 950 1059 740 581 1234 2146 1431 331 -335 70 768 1288 2072 845 29
1410 29 -357 -798 -1319 -692 392 422 -292 -499 -961 -1697 -1863 -951 -618 -582 568 556 -1113 -2383 -1900 -822
1430h22Q54M9Ok75o84L90L88M01L63J91j45n15L9P03K80j2l29L13K22O17k43j090
1452G01o90R95J198j69j114j122p82L14J239J215k25j248p68r42m12Q36J617N97
1470A240j085j258J47J67l53J83K2j58N06Q94Q7q42j086r8pQ73J550M37o62j218
1490f61k94J67J346J396M21j576j658L83O52P33O80j7j171j049L48J060O46Rn52
1509H63r70l16J261Q82j132j208o08J234J012r6m06j829q84L64J570N70K00k72
1527B35j172j647nJ724J507J73o00r96R9O73Q14l15j047J03J369m1o59kj44Q6
1547A55QJ021K45j57j51M6j292k7J572J010n49j235o26J89K6R88J18n92r55l13
1567e19k65j51j9J136Kj222l1K76M31m16j96K45J46P13O42j075j342m28J130N22
$$ plain form
1430 -822 32 81 87 -188 -872 -482 -94 307 670 861 716 201 240 943 1223 1211 882 1195 1417 2034 1791 701
1452 701 11 1006 2204 2035 921 -201 -983 -669 570 1785 1560 312 -456 -1398 -1810 -974 643 1240
1470 1240 155 -1103 -956 -789 -1142 -959 -937 -1095 -589 305 392 -450 -1536 -1634 -1641 -768 782 1219 557 -661
1490 -661 -955 -788 558 1954 2375 799 -859 -476 176 909 1589 1572 401 -648 -300 760 1406 1415 863
1509 863 -107 -423 838 1720 588 -620 -1228 6 1018 922 516 -1313 -2197 -1833 -263 307 507 235
1527 235 -937 -2584 -2589 -865 642 815 215 -781 -682 -9 805 490 -557 -454 915 874 215 213 69 155
1547 155 163 1184 1429 1272 1121 1167 -125 -152 1420 2430 1881 646 20 209 235 1223 1341 749 -206 -519
1567 -519 -784 -935 -954 182 184 -1038 -1069 -793 -362 -778 -974 -729 -583 130 772 -303 -1645 -2073 -943 -421
1587d21K11M99m21q95q2N24P21L79L41k55q78K58R64r7r21Q8J075O05m72o44p39
1608a60j88P24J150l30j126k04K86k23l65M89M38J14j052j62j29K64L25L79q78
1627f48l35M72J48j120p83Q17J052P57p40n89j89K88O65K73l20M67Q09n8j058
1646i2m27N77O49M06K14m53m58L1O2j45J7O93M89o09l97k58J77m6j34L0oJ89j49
1669C60n99j142p7J143Q22n08j273l28p3P39O18K79m79J92l20j09j02L00J82l54
1689g29L58M31L64lp52l80j22J190J174k51j378n96K87P16N85J91j33n07k03p
1709B35J93p1N17J54m35n15k17L98p80J41K6N09L4K39n05r58L05L84L28p3o7j70
1731c28k45n78P5K45Q75K69l31n59o83L25R15K98k9k25K84k39Q8p8J99o0J87L68
$$ plain form
1587 -421 -210 289 -132 -1027 -1109 -585 136 515 856 601 -277 -19 945 848 -73 15 1090 1695 1223 579 -160
1608 -160 -348 376 1526 1196 70 -134 152 -71 -436 53 491 605 -447 -609 -738 -474 -149 230 -648
1627 -648 -983 -511 -363 -1483 -2266 -1449 -397 360 -380 -969 -1158 -870 -205 68 -252 215 1024 966 -92
1646 -92 -519 58 707 1113 1327 874 416 447 509 364 381 1074 1563 954 557 299 476 430 296 326 320 509 360
1669 360 -239 -1381 -1458 -315 507 -1 -1274 -1602 -1675 -936 -318 -39 -518 -326 -646 -755 -857 -557 -375 -729
1689 -729 -371 60 424 421 -331 -711 -833 357 1531 1280 -98 -694 -407 309 894 1085 952 445 242 235
1709 235 428 357 874 1028 593 78 -139 259 -521 -380 -354 155 189 428 -77 -1035 -730 -346 -18 -91 -158 -328
1731 -328 -573 -1151 -1076 -831 44 313 -18 -577 -1260 -935 -20 278 249 24 308 69 157 79 278 218 405 773
1753G73K52l87p3j06q02K72J124O29n34r12p08n7P80R49K32j048m67J59k10O0
1773g4J13j57j57l04K11L77n89k86J78K49M6N83k45p07n98M76N18L77K05J25r42
1794f01k40K19Q27J7Q9j5p2l72J13J18K66j40K60M13n40O6j31r1m41Q79L68q0
1816I12k41k66l40n59J74P42K28l82l93k28l24j89M90Q55p78j15j15l21P2L94
1836c84p5M2m77N33M2k29J02J61p8K91P06L5r57n87K66L58P79O1K80o83l75R1
1858i8N36N6j67K21J25m13k83M05m03j55N54N47k25l50n05j28m31M69L10M7k06
1879i4k44n74n3M29K21L73m87m9j13p3j20K91M00j2K8j26l08M0N67q7k99K93K78
1902B81K52n31q7j31l6Q39N20j32p95l51J27M51j94R81l18l72o99q2Q7O56k76
$$ plain form
1753 773 1025 638 565 459 -343 -71 1053 1682 1148 236 -472 -529 251 1200 1432 384 -83 76 -134 -74
1773 -74 39 -118 -275 -579 -368 9 -580 -866 -688 -439 -393 190 -55 -762 -1360 -884 -366 11 216 341 -601
1794 -601 -841 -622 205 222 311 296 224 -148 -35 83 349 209 469 882 342 408 277 186 -255 624 992 912
1816 912 671 405 65 -494 -320 422 650 268 -125 -353 -677 -866 -376 479 -299 -414 -529 -850 -778 -384
1836 -384 -459 -417 -894 -361 -319 -548 -446 -285 -363 -72 634 669 -288 -875 -609 -251 528 589 869 186 -189 -98
1858 -98 438 494 327 548 673 260 -23 382 -21 -176 378 925 700 350 -155 -283 -714 -245 65 112 -94
1879 -94 -338 -912 -965 -536 -315 58 -429 -478 -591 -664 -784 -493 -93 -105 -77 -203 -511 -471 96 9 -290 3 281
1902 281 533 2 -85 -216 -252 587 1107 975 180 -171 -44 407 213 1194 876 504 -195 -277 -190 466 190
1923A90K95k04n11N6N24o52k24n8L52Q0L94l50n29m25J25M65P07J07l01o23l54
1944i36J90Q80L04k0l63n78K78J82N60O0k02J53K7j42l96N10Kr6k48M70L8j21
1966E52q6m81k91M03P56N8k68p94k23K8J18L33L15k82k61j72m00K00K69J48r6
1987a74j72J41L68l58l38l70L62O17L17J7q18j50K28L90P2%J16O9m90j99J16M48
2009A92N57Q8o35j88J5K07O4n8n9K58q7m35qO4k42L62P2j29l42pj16k16K03J45
2033b95N02N4l73k56o18N69N27kj82J6j4j90j09j49R0J32J93q0J35l33J22n9P3
2056b47L76O13J54p95p44P39K86J82j88o3l64J48K78J82n28k78N89K5k18j36j1
2077@l57k2P24j01j43M29m02q19j36Q92L35k53m47o47L55J71j7R8j4PM05O2p31
$$ plain form
1923 190 485 281 -230 -174 350 -302 -526 -584 -232 -152 242 -108 -637 -1062 -937 -472 235 342 41 -582 -936
1944 -936 -746 134 438 418 55 -523 -245 -63 497 557 355 508 535 393 -3 507 509 413 165 635 673 552
1966 552 466 -15 -306 97 853 911 643 -151 -374 -346 -228 105 420 138 -123 -295 -695 -495 -226 -78 -174
1987 -174 -346 -205 163 -195 -533 -903 -541 76 393 410 -408 -558 -330 60 132 132 248 317 -173 -372 -256 192
2009 192 749 837 202 14 29 236 300 242 183 441 354 -81 -89 -25 -267 95 167 38 -304 -311 -427 -643 -440 -295
2033 -295 207 261 -112 -368 -986 -417 110 108 -74 -58 -72 -262 -371 -520 -430 -298 -105 -185 -50 -383 -261 -320 -247
2056 -247 129 742 896 101 -643 96 382 564 376 313 -51 97 375 557 29 -249 340 365 147 11 0
2077 0 -357 -379 345 244 101 530 128 -691 -827 65 400 147 -300 -947 -592 -421 -438 -340 -354 -347 58 120 -611
2100f11L5O48K73L3m89q1M08J06l68Or6K78N66J0p63k67J94M51J7K74J97k86j50
2123C85l32k10M46L30L36j034k98J01N38km23j47j56L47J53r6o45r8N97Q7L14
2144A93J88l69j85n22L33O52K79%n69l91l11O52J35J62j95j32K26pM4L7j96K63
2166B87jJ57l3j60N9l40j46M07K35K41j01q91J7l3L42J05l55J43K99k39k04k72
2188d83N18k9M4l89l6k15K68J61k08m9O5M49k37l73Q8J11NK93K74n6k58l22J41
2211b38K22K98J20N4l10j28J60K10K3N2l07J54j25o8K47k60l60O66L4j35n7k73
2233b1l29J16L83K47j09j82n06k2NM28J59m72m8K24l2N6n1l4j43QN62Ol42k69
2257c66J07K36Lr5M17q0j14k14N2M3J94K93j0l49j27j6R3J69J66K44n71j07K58
$$ plain form
2100 -611 -576 72 345 378 -111 -192 216 322 -46 -40 -136 142 708 718 -45 -312 -118 333 350 624 821 535 385
2123 385 53 -157 289 619 955 -79 -377 -276 262 260 -163 -310 -466 -119 34 -62 -707 -805 -208 -121 193
2144 193 381 12 -173 -695 -362 290 569 569 0 -391 -702 -50 85 247 52 -80 146 139 183 220 24 287
2166 287 286 443 410 250 309 -31 -177 230 465 706 605 -286 -269 -302 40 145 -210 -67 232 -7 -211 -483
2188 -483 35 6 50 -339 -375 -590 -322 -161 -369 -418 -353 96 -141 -514 -426 -315 -310 -17 257 201 -57 -379 -238
2211 -238 -16 282 402 456 146 18 178 388 411 463 156 310 185 117 364 104 -256 410 444 309 252 -21
2233 -21 -350 -234 149 396 287 105 -401 -423 -418 10 169 -303 -351 -127 -159 -103 -154 -188 -331 -323 239 245 -97 -366
2257 -366 -259 -23 -20 -115 302 222 108 -106 -54 -11 183 476 466 117 -10 -26 67 236 402 646 75 -32 226
2280B26m16m8L39J8J17m56K09J54l38J56J94j77R1N3k02k82k17N9M34j0q3K82
2302A03o82k19M32N50M4l70OJ14l59N92j9n9j06K21L72k49p6m06J9l63R14m0J73
2325E92p14n7K12P0J67J13l9l31j30K51j71K8l7M1L00l36o0n2o4r3N11m48J24
2348a23L9O3k93K20l58L87J34J05K26q98R8L23r8K24KL44l27k12Q8K32j97L38
2370C17P0m60J21J77O9k52K63L9K6j19L3j44j87K4J0N76l75l60K9j32k5J62M75
2393C37l05j82m03K33K0J08o2J68j19L5M8r2l9O5l93N03OL16j19m92M73k18R2
2416b0O6K99J69n46L02K22j67m0K48j68j79j21n8j19N3L6N60j54k53n8j86j18
2438b32K73N0m9Ol3J11l90l4%J70J80j53k68K83Kk73N11q0j03K32l13Rk62J01
$$ plain form
2280 226 -190 -238 101 119 236 -220 -11 143 -195 -39 155 -22 69 122 -80 -362 -579 -520 -86 -96 -179 103
2302 103 -579 -798 -366 184 228 -142 -136 -22 -381 211 192 133 27 248 620 371 295 -111 -92 -455 459 419 592
2325 592 -122 -179 33 103 270 383 344 13 -117 134 -37 -9 -46 -5 295 -41 -101 -153 -217 -310 201 -247 -123
2348 -123 -84 -21 -314 -94 -452 -65 69 174 400 -498 -400 -77 -175 49 51 395 68 -144 -56 176 -21 317
2370 317 387 -73 48 225 294 42 305 344 370 251 284 140 -47 -23 -13 563 188 -172 -143 -275 -300 -138 337
2393 337 32 -150 -553 -320 -300 -192 -254 -86 -205 -170 -122 -214 -253 -188 -581 -78 -72 244 125 -367 106 -112 -20
2416 -20 46 345 514 -32 270 492 325 285 533 365 186 65 7 -112 -59 -23 537 383 130 72 -114 -232
2438 -232 41 91 42 48 15 126 -264 -298 -298 -128 52 -101 -369 -86 -84 -357 154 74 -29 203 -110 -101 -363 -262
2462b62K88L8J72j98l9j92k1J51j35M79J81l41l8k20J33Q8K70J61m74j83K58K3
2484A39m8j56J66Kj8j02K2l59L8K01K37L5l28K54k86o6m4L44n2J92m14J79j67
2507b31R6j05K16N3R2m38K61k32L23M97l27j82L06j45M2q4k8j23l0J41J87j11
2529A78j36J16l13J33J15K19P8m16j2j56J53K90K17n24l6K04k89K59j09l05L98
2550F4l28K99J5o9j09m7J43j79L57l3P0l10n21P76k5o6K83k05k40q5P0L1j5K84
2574A60J35j97k55Q6Q3K67j62Q5L2j54q7J52k87j23L16P3P7k44m6n6j39K07K24
2597A47P1m44J59J4K9k77N23n6j25N2j49J11k83K76j40j2m7L82l68r4P3K48L9
2620A29J97l3l18k7pM70l41J36R2l16O7P4k82J58L7K12p8l67K48K36m09q8Q1J95
$$ plain form
2462 -262 26 64 236 38 -1 -193 -214 -63 -198 281 462 121 83 -137 -4 84 354 515 41 -142 116 139
2484 139 91 -65 101 103 85 -17 5 -354 -316 -115 122 157 -171 83 -203 -269 -313 31 -21 171 -243 -64 -231
2507 -231 -135 -240 -24 29 121 -317 -56 -288 35 532 205 23 329 184 226 142 114 -9 -39 102 289 178
2529 178 42 158 -155 -22 93 312 390 -26 -38 -194 -41 249 466 -58 -94 110 -179 80 -29 -334 64
2550 64 -264 35 50 -19 -128 -175 -32 -211 146 113 183 -127 -648 128 103 37 320 115 -125 -210 -140 -109 -124 160
2574 160 295 98 -157 -71 12 279 117 202 234 80 -7 145 -142 -265 51 124 201 -43 -89 -145 -284 -77 147
2597 147 218 -226 -67 -53 -24 -301 222 166 41 93 -56 55 -228 48 -92 -104 -151 231 -137 -231 -158 90 129
2620 129 326 293 -25 -52 -59 411 70 206 298 -18 49 123 -159 -1 36 248 170 -197 51 287 -122 -210 -129 66
2644F6j99J58R9K30n03l27M22M23j44j68j17j94m7L89Rm3k80L13k29J0j6J87j63
2667a24M7J72j70J42l36O34K6n72M45l2J16k25j11j79J14O1J36O4l85P0K26j86
2689f7m3J94j45K06j3k09J94k70L25k61J2L81j80k41p3J3J0M66n9l1k69k34j24
2712d18K64PL57n7j01R2l41J97N6N6j5K53n07j0L50m6m71M32p5J78k16J09K61
2735C55k42j6MJ41j33J04j86J23l62J61K05K79m27k21M3L99k39n1K8M3j49K02
2757F1Jm47K36P9j10J26kq6K43j42j0J51J58j4j24k39Lj16L77k23K55j31j58K3
2781h9M27k45R5o9nj11r5J20j22Rm2J96o4L3m3j71j98K56K14m9J89k10j32M5r2
2806a53l0j16M25j70J80k72K83m2k21J02K09j28J12O8p5l0j45L3q1K90J14j10
$$ plain form
2644 66 -133 25 124 354 -149 -476 -54 369 225 57 -60 -254 -301 88 97 54 -226 87 -142 -132 -148 39 -124
2667 -124 -77 95 -75 67 -269 365 391 -181 264 232 348 123 12 -167 -53 8 144 208 -177 -107 119 -67
2689 -67 -110 84 -61 145 132 -77 117 -153 172 -89 -77 304 124 -117 -190 -177 -167 299 240 209 -60 -294 -418
2712 -418 -154 -147 210 153 52 144 -197 0 56 112 97 350 -157 -167 183 137 -334 98 23 201 -15 94 355
2735 355 113 97 101 242 109 213 27 150 -212 -51 154 433 6 -215 -172 227 -12 -63 -35 8 -141 61
2757 61 62 -385 -149 -70 -180 -54 -56 -142 101 -41 -51 100 258 244 120 -119 -116 -232 145 -78 177 46 -112 -89
2781 -89 338 93 188 119 114 3 -92 28 -94 -85 -127 69 5 38 -5 -176 -374 -118 96 47 236 26 -106 -61 -153
2806 -153 -183 -299 126 -44 136 -136 147 105 -116 -14 195 67 179 247 172 142 -3 30 -51 239 353 243
2828B43k96R5q2K75j02Q2j84p7j34L21n1j67l6J50k33K91j97n9L03j60m7O9qq2
2852h6n6K45p9l4j68K57R3j60j02Q3K23M4p6j34J05l36K70l58K25mM2n9k2l7J67
2877D3K33k39j14K97k57k31J83N16l65O8j40J40Q5k06J55j59r5K38l51L24j6j72
2899f3L38o55N29k49J11j77L1M4k38L10P5j81K08l4p7l5q0K62L9J30l00k9R5p4
2923b0P2J45j04%p1O2r9o2J75k10P3k05L21nK8m15J64l8N04j77m47L4L72l18K35
2948A4Ok28J23J38J2k29%K91j51k61K77M1J1q8L59k89l36M28l06N3N0r3QkJ1J52
2974ij7r3K03J6P6j08l7L81l85k11K57j71J60j5L2J9J1l68L88k42K00r6p4L5K07
2999A59m31K9K9p8L19r0J82p5K1j96O0N7j25L00pJ7j47R8n7n6PR0J69j99j78P6
$$ plain form
2828 243 -53 42 -40 235 133 215 31 -46 -180 141 90 -77 -113 37 -196 95 -102 -161 142 -18 -65 4 -4 -86
2852 -86 -142 103 24 -10 -178 79 172 12 -90 -7 216 260 184 50 155 -181 89 -269 -44 -48 -6 -65 -87 -124 43
2877 43 276 37 -77 220 -37 -268 -85 431 66 134 -6 134 219 13 168 9 -86 152 -199 125 109 -63
2899 -63 275 -380 149 -100 11 -166 -135 -91 -329 -19 56 -125 83 49 -28 -63 -143 119 158 288 -12 -41 54 -20
2923 -20 52 197 93 93 22 84 -15 -77 98 -112 -39 -244 77 72 100 -315 -151 -189 315 138 -309 -275 97 -221 14
2948 14 20 -208 -85 53 65 -164 -164 127 -24 -285 -8 33 44 -44 315 26 -310 118 -188 -135 -85 -178 -170 -172 -161 -9
2974 -9 -26 -119 84 100 176 68 31 412 27 -184 73 -98 62 47 79 98 109 -259 129 -113 87 -9 -83 -48 159
2999 159 -272 -243 -214 -292 27 -63 119 44 65 -131 -71 -14 -139 161 154 171 24 122 65 9 16 106 275 76 -102 -26
3025b6K13j59j35L13K8j03o8l29M27k3l81J49J55j56Q3l1l5L54j77j02J53N6k71
3048f5K60o7M0m97L89K35l51J15k66O5K15q2L0j20L44l31J77j05l4J0J61k36r
3071a22R1J35r0RQ3j00Q3j07O5j04q5K34k65J40J56m2l57M52m86N01m14L62k8
3094A11k1J07j85n7k14R9K97P8k85K8l49L13N5l32M81j35j87K27N7l22K52K02
3116B20k63j87K76r1l27L05K31l66J20L40k59K11k17J76j94J40k40J96ON6j41
3137hj9j74J44J31m14L44L6J83j72o4Q6j92j05M32m35Q8J32K6K4l0k3R4J57j40
3161A01p7k10q7L05J46k38k89L92p4J3o3M7j32J00J14j0j37J84j6J46j77P4l71
3184b59K47n5q4K43k51L35q4j28J1J15j73K36j2l81J33L19l19J84J49j62j82j69
$$ plain form
3025 -26 187 28 -107 206 234 131 63 -266 161 138 -243 -94 61 -95 -12 -43 -78 276 99 -3 150 206 -65
3048 -65 195 128 168 -329 60 295 -56 59 -207 -142 73 -9 21 -99 245 -86 91 -14 -48 -38 123 -113 -122
3071 -122 -31 104 14 23 106 6 89 -18 47 -57 -142 92 -173 -33 123 81 -276 176 -310 191 -223 139 111
3094 111 90 197 12 -45 -259 -160 137 215 -70 -42 -391 -78 -23 -355 126 -9 -196 31 88 -234 18 220
3116 220 -43 -230 46 -45 -372 -67 164 -202 -82 258 -1 210 -7 169 -25 115 -125 71 77 133 -8
3137 -8 -27 -201 -57 74 -340 4 40 223 51 -13 73 -119 -224 208 -227 -139 -7 19 43 13 -10 84 241 101
3161 101 24 -186 -273 32 178 -60 -349 43 -31 -18 -81 -34 -166 -66 48 38 -99 85 69 215 38 112 -259
3184 -259 -12 -67 -151 92 -159 176 92 -36 -25 90 -83 153 141 -240 -107 212 -107 77 226 64 -118 -287
3206b87K00O3J34j14j30L51N1k93j72J51K47k42l8L71j06j21P2l33L21L52m93
3227a6O2N6k4L3J2P3L6r7j19l94K85K81l29J52j85Q5K53k24o4K63j6k21J52l7
3251A7j5j81K82j00j07K03J0rj92K61m81J71K86p9m89L86J87m1o0L41l25L8Q1
3274A84k63K9K01O3j71k5p8RN0K3r7q1j1L10K5K4q5M6k69L8J68r7j03J53j99K36
3300H0k12L4J98j60J97o2J13Rj45k42N0L92l28o6L13m02M6J55P1k02K66r4J73
3323A84Nk23j27JL10k83J21j96K46j69K75J76k68l1j06J66q7j38L02k41QK04k02
3346g3K14k65K00M0p7M1j03L06l57k56K38q6L26j28j20J63jk52K11J53jl96L13
3369I0M8q3K82l49J11j10J19n2k31J00J30Q5j96J38N0j41J37j63l18N32j44Q6
$$ plain form
3206 -287 -87 -24 110 -4 -134 217 268 -25 -197 -46 201 -41 -79 292 186 65 137 -196 125 477 -16
3227 -16 46 102 78 111 123 196 232 135 16 -378 -93 188 -141 11 -174 -89 164 -60 -124 139 123 -98 54 17
3251 17 2 -179 103 3 -104 99 109 100 -92 169 -312 -141 145 66 -423 -37 150 109 49 390 65 103 184
3274 184 -79 -50 151 214 43 18 -60 -51 -1 22 -75 -156 -167 143 168 192 107 153 -116 -78 90 -7 -110 43 -156 80
3300 80 -132 -98 100 -60 137 75 188 197 52 -190 -140 252 -76 -142 171 -231 -185 -30 41 -161 105 11 184
3323 184 189 -34 -161 -160 150 -133 -12 -208 38 -131 144 320 52 21 -85 81 -6 -144 158 -83 -75 129 -73
3346 -73 141 -124 76 116 39 80 -23 283 -74 -330 -92 -178 148 20 -100 63 62 -190 21 174 173 -223 90
3369 90 138 55 337 -12 99 -11 108 56 -175 -75 55 140 -56 82 132 -9 128 -35 -353 179 35 121
3391A21j52j2J44j79J69p5j50j77L03J59K4l58L27k21l5J15j58J14q1k0R1J41
3413I0j47L34j20n3j12P1k13J92k48M31k87R4p6K06M5j95j43L46j47p7j52K34
$$ plain form
3391 121 -31 -43 101 -78 91 16 -134 -311 -8 151 175 -183 144 -77 -112 3 -155 -41 -122 -142 -51 90
3413 90 -57 277 157 104 -8 63 -150 42 -206 225 -62 32 -44 162 207 12 -131 215 68 -9 -161 73
$$ [...]
8191a39
##END NTUPLES=NMR FID
##END=
