##TITLE=1H_Ser AmS3705N
 200.13MHz, CDCl3,
 8 sc
 
 2.9.2025
##JCAMPDX= 6.0         $$ Bruker NMR JCAMP-DX V2.0
##DATA TYPE= NMR FID
##DATA CLASS= NTUPLES
##ORIGIN= UXNMR, Bruker Analytische Messtechnik GmbH
##OWNER= pz
$$ XWIN-NMR		Version 3.5
$$ Tue Sep  2 15:27:15 2025 Russian Standard Time (UT+4h)  she@DPX200
##.OBSERVE FREQUENCY= 200.1313
##.OBSERVE NUCLEUS= ^1H
##.DELAY= (6, 6)
##.ACQUISITION MODE= SIMULTANEOUS
##.ACQUISITION SCHEME= undefined
##.AVERAGES= 8
##.DIGITISER RES= 18
##SPECTROMETER/DATA SYSTEM= spect
##.PULSE SEQUENCE= zg30
##.SOLVENT NAME= CDCl3
##.SHIFT REFERENCE= (INTERNAL, CDCl3, 0, 14.3821)
##AUDIT TRAIL= $$ (NUMBER, WHEN, WHO, WHERE, WHAT)
$$ ##TITLE= Audit trail, XWIN-NMR		Version 3.5
$$ ##JCAMPDX= 5.01
$$ ##ORIGIN= Bruker BioSpin GmbH
$$ ##OWNER= she
$$ F:/spectra/data/she/nmr/H-C/1/audita.txt
$$ ##AUDIT TRAIL=  $$ (NUMBER, WHEN, WHO, WHERE, WHAT)
(   1,<2025-09-02 15:25:48.04 +0400>,<she>,<DPX200>,
      <created by zg, POWCHK disabled, PULCHK disabled
       configuration hash MD5:
       00 E9 B6 7A A2 85 ED C7 34 08 36 98 17 FE 4E 26
       data hash MD5: 16K
       5A E3 B9 78 4A C7 C2 56 47 94 52 45 48 AA FD 3E>)
$$ ##END=
$$ 
$$ hash MD5
$$ CF AA 70 6D 5B 9E 6F C5 F3 7B D2 E6 19 E7 AB 23
##$RELAX= 
##$RELAX= 
##$RELAX= 
##$RELAX= 
##$RELAX= 
##$RELAX= 
$$ Bruker specific parameters
$$ --------------------------
##$DU= <F:/spectra>
##$EXPNO= 1
##$NAME= <H-C>
##$PROCNO= 1
##$TYPE= <nmr>
##$USER= <she>
##$AMP= (0..31)
100 100 100 100 100 100 100 100 100 100 100 100 100 100 100 100 100 100 
100 100 100 100 100 100 100 100 100 100 100 100 100 100 
##$AQSEQ= 0
##$AQ_mod= 1
##$AUNM= <au_zg>
##$AUTOPOS= <>
##$BF1= 200.13
##$BF2= 200.13
##$BF3= 200.13
##$BF4= 200.13
##$BF5= 200.13
##$BF6= 200.13
##$BF7= 200.13
##$BF8= 200.13
##$BYTORDA= 1
##$CFDGTYP= 0
##$CFRGTYP= 5
##$CHEMSTR= <none>
##$CNST= (0..31)
1 1 145 1 1 1 1 1 1 1 1 1 1 1 1 1 1 1 1 1 1 1 1 1 1 1 1 1 1 1 1 1 
##$CPDPRG= <>
##$CPDPRG1= <>
##$CPDPRG2= <>
##$CPDPRG3= <>
##$CPDPRG4= <mlev>
##$CPDPRG5= <mlev>
##$CPDPRG6= <mlev>
##$CPDPRG7= <mlev>
##$CPDPRG8= <mlev>
##$CPDPRGB= <>
##$CPDPRGT= <>
##$D= (0..31)
0 0.7 0 0 0 0 0 0 0 0 0 0.03 0 0 0 0 0 0 0 0 0 0 0 0 0 0 0 0 0 0 0 0 
##$DATE= 1756812347
##$DBL= (0..7)
120 120 120 120 120 120 120 120 
##$DBP= (0..7)
150 150 150 150 150 150 150 150 
##$DBP07= 0
##$DBPNAM0= <>
##$DBPNAM1= <>
##$DBPNAM2= <>
##$DBPNAM3= <>
##$DBPNAM4= <>
##$DBPNAM5= <>
##$DBPNAM6= <>
##$DBPNAM7= <>
##$DBPOAL= (0..7)
0.5 0.5 0.5 0.5 0.5 0.5 0.5 0.5 
##$DBPOFFS= (0..7)
0 0 0 0 0 0 0 0 
##$DE= 6
##$DECBNUC= <off>
##$DECIM= 32
##$DECNUC= <off>
##$DECSTAT= 4
##$DIGMOD= 1
##$DIGTYP= 9
##$DL= (0..7)
0 120 120 120 120 120 120 120 
##$DP= (0..7)
150 150 150 150 150 150 150 150 
##$DP07= 0
##$DPNAME0= <>
##$DPNAME1= <>
##$DPNAME2= <>
##$DPNAME3= <>
##$DPNAME4= <>
##$DPNAME5= <>
##$DPNAME6= <>
##$DPNAME7= <>
##$DPOAL= (0..7)
0.5 0.5 0.5 0.5 0.5 0.5 0.5 0.5 
##$DPOFFS= (0..7)
0 0 0 0 0 0 0 0 
##$DQDMODE= 0
##$DR= 18
##$DS= 0
##$DSLIST= <SSSSSSSSSSSSSSS>
$$ [...]
##$SUBNAM0= <"">
##$SUBNAM1= <"">
##$SUBNAM2= <"">
##$SUBNAM3= <"">
##$SUBNAM4= <"">
##$SUBNAM5= <"">
##$SUBNAM6= <"">
##$SUBNAM7= <"">
##$SUBNAM8= <"">
##$SUBNAM9= <"">
##$SW= 18.0517328524113
##$SWIBOX= (0..15)
0 0 2 0 0 0 0 0 0 0 0 0 0 0 0 0 
##$SW_h= 3612.71676300578
##$TD= 16384
##$TD0= 1
##$TE= 0
##$TE2= 300
##$TE3= 300
##$TEG= 300
##$TL= (0..7)
0 120 120 120 120 120 120 120 
##$TP= (0..7)
150 150 150 150 150 150 150 150 
##$TP07= 0
##$TPNAME0= <>
##$TPNAME1= <>
##$TPNAME2= <>
##$TPNAME3= <>
##$TPNAME4= <>
##$TPNAME5= <>
##$TPNAME6= <>
##$TPNAME7= <>
##$TPOAL= (0..7)
0.5 0.5 0.5 0.5 0.5 0.5 0.5 0.5 
##$TPOFFS= (0..7)
0 0 0 0 0 0 0 0 
##$TUNHIN= 0
##$TUNHOUT= 0
##$TUNXOUT= 0
##$USERA1= <user>
##$USERA2= <user>
##$USERA3= <user>
##$USERA4= <user>
##$USERA5= <user>
##$V9= 5
##$VALIST= <valist>
##$VCLIST= <CCCCCCCCCCCCCCC>
##$VD= 0
##$VDLIST= <DDDDDDDDDDDDDDD>
##$VPLIST= <PPPPPPPPPPPPPPP>
##$VTLIST= <TTTTTTTTTTTTTTT>
##$WBST= 1024
##$WBSW= 4
##$XGAIN= (0..3)
0 0 0 0 
##$XL= 0
##$YL= 0
##$YMAX_a= 150735
##$YMIN_a= -203197
##$ZGOPTNS= <>
##$ZL1= 120
##$ZL2= 120
##$ZL3= 120
##$ZL4= 120
##$ABSF1= 10
##$ABSF2= 0
##$ABSG= 5
##$ABSL= 3
##$ALPHA= 0
##$AQORDER= 0
##$ASSFAC= 0
##$ASSFACI= 0
##$ASSFACX= 0
##$ASSWID= 0
##$AUNMP= <proc_1d>
##$AZFE= 0.1
##$AZFW= 0.1
##$BCFW= 1
##$BC_mod= 2
##$BYTORDP= 1
##$COROFFS= 0
##$CY= -3
##$DATMOD= 1
##$DC= 2
##$DFILT= <>
##$DTYPP= 0
##$F1P= 0
##$F2P= 0
##$FCOR= 0.5
##$FTSIZE= 0
##$FT_mod= 4
##$GAMMA= 1
##$GB= 0.15
##$INTBC= 1
##$INTSCL= 1
##$ISEN= 128
##$LB= 0.25
##$LEV0= 0
##$LPBIN= 0
##$MAXI= 10000
##$MC2= 0
##$MEAN= 0
##$ME_mod= 0
##$MI= 1.114404
##$NCOEF= 0
##$NC_proc= 0
##$NLEV= 6
##$NOISF1= 3.799351
##$NOISF2= 2.8
##$NSP= 1
##$NTH_PI= 0
##$NZP= 0
##$OFFSET= 14.38212
##$PC= 1
##$PHC0= -1561.359
##$PHC1= 9.79228
##$PH_mod= 1
##$PKNL= yes
##$PPARMOD= 0
##$PSCAL= 0
##$PSIGN= 0
##$REVERSE= no
##$SF= 200.129724274929
##$SI= 16384
##$SIGF1= 3
##$SIGF2= 2
##$SINO= 400
##$SIOLD= 16384
##$SREGLST= <1H.CDCl3>
##$SSB= 0
##$STSI= 0
##$STSR= 0
##$SW_p= 3205.1282051282
##$SYMM= 0
##$S_DEV= 0
##$TDeff= 0
##$TDoff= 0
##$TI= <>
##$TILT= no
##$TM1= 0
##$TM2= 0
##$TOPLEV= 0
##$USERP1= <user>
##$USERP2= <user>
##$USERP3= <user>
##$USERP4= <user>
##$USERP5= <user>
##$WDW= 1
##$XDIM= 8192
##$YMAX_p= 0
##$YMIN_p= 0
$$ End of Bruker specific parameters
$$ ---------------------------------
##NTUPLES= NMR FID
##VAR_NAME=  TIME,          FID/REAL,        FID/IMAG
##SYMBOL=    X,             R,               I
##VAR_TYPE=  INDEPENDENT,   DEPENDENT,       DEPENDENT
##VAR_FORM=  AFFN,          ASDF,            ASDF
##VAR_DIM=   8192,          8192,            8192
##UNITS=     SECONDS,       ARBITRARY UNITS, ARBITRARY UNITS
##FACTOR=    0.0002768,     1,               1
##FIRST=     0,             0,               0
##LAST=      2.2672688,     0,               0
##MIN=       0,             -203197,         0
##MAX=       2.2672688,     150735,          0
$$ Real data points
##PAGE= N=1
##DATA TABLE= (X++(R..R)), XYDATA
$$ [...]
1836B28J04o08J21N09k32o24O17J30l41J54M14o66K06n1q5j26J98K84k61n34P30
$$ 228 332 -276 -155 354 122 -502 115 245 -96 58 472 -194 12 -39 -124 -250 -52 232 -29 -563 167
1857A67j15j46n9L03m08J7K20K14p7J4K14k63r4L50l29k10K53N5m03Q4K23J35
$$ 167 52 -94 -153 150 -258 -241 -21 193 116 130 344 81 -13 337 8 -202 51 106 -297 -213 10 145
1879A45m17Q5P0q4q1J53K33j55L13N8p4j52J21k26p2J63Q3l61J89j13P6J17j42
$$ 145 -272 -187 -117 -201 -282 -129 104 -51 262 320 246 94 215 -11 -83 80 163 -198 -9 -122 -46 71 -71
1902g1L1nR9P6L86m94N3J61j75m49O07k76o6L18l44M27k31L21m38p3L06k63q8
$$ -71 -40 -45 54 130 516 22 75 236 61 -388 219 -57 -123 195 -149 278 47 368 -70 -143 163 -100 -188
1925a88K28p8J56M5M1p85P42K55q77M91K82n20N4K53N5k09j59M11q7m81M52l32
$$ -188 40 -38 118 163 204 -581 161 416 -461 30 312 -208 -154 99 154 -55 -214 197 110 -371 81 -251
1947b51J30O5j46J85O5K42k70K59l53K30o2j00J81o4l16K36n1l97J69J76N6N1
$$ -251 -121 -56 -202 -17 48 290 20 279 -74 156 94 -6 175 111 -205 31 -20 -417 -248 -72 -16 35
1969C5j31K14o1j72L56m1k28K50kk42O3K87j47l09%J59J89p11O61K22n11Q5K86
$$ 35 -96 118 57 -115 241 200 -28 222 220 -22 41 328 181 -128 -128 31 220 -491 170 392 -119 -34 252
1992B52m58j14M34q5k02p1K75K88n10M64j20J04Kl3l00p3J27M1Q0l33L98j90l86
$$ 252 -206 -320 114 29 -173 -244 31 319 -191 273 153 257 259 226 -74 -147 -20 21 101 -232 166 -24 -410
2015d10O63N0q30L66L52k60m0K46Jr3j19N03k25k0l08o8k02R2L41j39k33Q9L09
$$ -410 253 303 -527 -161 191 -69 -109 137 138 45 -74 429 204 184 -124 -192 -394 -302 39 -100 -333 -244 65
2038F5l18j13P14l98j98O48k07k19K0M57n06j37J68K68n4n37N63l84j51N47l47
$$ 65 -253 -366 348 -50 -248 400 193 -26 -6 451 -55 -192 -24 244 190 -347 216 -168 -319 228 -119
2059a19j52J92L58m8k02L4J79l97L68J9k38j68K03L25k37k24M00l14k43N13n1
$$ -119 -271 -79 279 231 29 63 242 -155 213 232 -6 -174 29 354 117 -107 293 -21 -264 249 198
2080A98j54l9K13o30P3M52J01k74j16K38J46n39Q03j49n69P5O76k01l44N43m26
$$ 198 44 5 218 -412 -339 113 214 -60 -176 62 208 -331 472 323 -246 -171 505 304 -40 503 77
2101G7l84r6N10m68J13L21k36j28N3O15m10pN48l92m09O4K45J23k82LQ2l33L02
$$ 77 -307 -403 107 -361 -248 73 -163 -291 -238 377 -33 -40 508 116 -293 -229 16 139 -143 -140 -58 -391 -89
2124h9J84l45J46M87j78m65M11K80n75l7M14K07p40L91oj41m15O32K4n46L91M4
$$ -89 95 -250 -104 383 205 -260 151 431 -144 -181 233 440 -300 91 85 -56 -471 161 185 -361 30 74
2146G4k14j77M44Q1m05J67L62n01L3J42l49J64L48m8nl65N21K57p31J95J16l66
$$ 74 -140 -317 127 208 -197 -30 332 -169 -136 6 -343 -179 169 121 116 -249 272 529 -202 -7 109 -257
2168b57J88L74j35n09K14L09l65j03O12M3p29L48N02m53p4K32j58m23M75Q0k17
$$ -257 -69 305 170 -339 -125 184 -181 -284 328 371 -358 -10 492 39 -35 197 39 -384 91 171 -46
2189d6j31K49k4k98J39J20j66N9N50j88l86M28J52n38K2K11j0m13J86K72l73J06
$$ -46 -177 72 48 -250 -111 9 -157 -98 452 264 -122 306 458 -80 -58 153 143 -270 -84 188 -185 -79
2211g9L14m6n43L05J17Qn69Q31j97l78L66Ok25n3L15j52k13K09J42n1j09K27j08
$$ -79 235 189 -354 -49 68 76 -493 338 141 -237 129 135 -90 -143 172 20 -193 16 158 107 -2 225 117
2234A17l95O9M90o00J19K10j82qJ61K32l98q1L28J60m08O03j54m21M57J29k06
$$ 117 -278 -209 281 -319 -200 10 -172 -180 -19 213 -185 -266 62 222 -186 417 263 -158 299 428 222
2255B22k54J15j57l77J7M97jp07P41oj08K22Rk09O7J43J32n22J06K93k44j87K77
$$ 222 -32 83 -74 -451 -434 63 62 -645 96 90 -18 204 213 4 71 214 346 -176 -70 223 -21 -208 69
2278F9j56l78L7N47J19k37M8JJ36j66K08k06k03J84K31n66M04J72l78j96K73K44
$$ 69 -87 -465 -428 119 238 1 49 50 186 20 228 22 -181 3 234 -332 72 244 -134 -330 -57 187
2300A87l86NN98k18l23L96q3l09M7m2J04j31J9K60k23L67L75m87l51M50p3j90
$$ 187 -199 -194 404 186 -137 259 176 -133 -86 -128 -24 -155 -136 124 -99 268 643 156 -195 255 182 -8
2322hL02r5k54k13L07qj57l11K91J91l11K82J91j90N0J21j42N0j5j05Q1k9K28
$$ -8 294 199 -55 -268 39 31 -126 -437 -146 45 -266 16 207 17 67 188 46 96 81 -24 57 28 256
2345B56k94j41K91j50k17K64o2K99m20K92kj88L7R5O4m99O94k91RM9j49jQ4j06
$$ 256 -38 -179 112 -38 -255 9 -53 246 -174 118 116 -72 -35 60 124 -375 319 28 37 86 -63 -64 20 -86
2369h6J62r8l01L70K90m58K41J6j36j46L15l4L9n4l9n0l12J41J02j85M04j62M
$$ -86 76 -22 -323 47 337 -121 120 136 0 -146 169 135 174 120 81 31 -281 -140 -38 -223 181 19 23
2392B3K47m54J76j96K67k19j11K17L63n57J61K22k02J28K45k77J12o5N2k81L81
$$ 23 270 -184 -8 -204 63 -156 -267 -50 313 -244 -83 139 -63 65 310 33 145 80 132 -149 232
2413B32o62M79j69j67L6N2P6J76k02J60O9q6K50j78L23q2m06J75k2j2P8j31M7
$$ 232 -430 49 -120 -287 -251 -199 -123 53 -149 11 80 -6 244 66 389 307 -99 76 54 42 120 -11 36
2436C6r9O1k09K41j36L1K25k76J80J76m77R1R1J33j04K5j44P9J72j03j4K08j13
$$ 36 -63 -2 -211 30 -106 -75 150 -126 54 230 -247 -156 -65 68 -36 -11 -155 -76 96 -7 -21 187 74
2459G4j36J93j94L36k90Q8j41o5O2k56P5M9m2L18K32j86Q9J90m18J07j14k09n6
$$ 74 -62 131 -63 273 -17 71 -70 -135 -73 -329 -254 -205 -247 71 303 117 206 396 -22 85 -29 -238 -294
2482b94L71k60J81j09mo4k8M21m17J11M0J28%R2k78qJ51R2k76Nk03M39k62j3K16
$$ -294 77 -183 -2 -111 -115 -179 -207 214 -203 -92 -52 76 76 168 -110 -118 33 125 -151 -146 -349 90 -172 -185 31
2507C1m1k4M3J27k51k48N25k4j72J10J04k90j98J11L52m1K90o39M5o9K05N4j53
$$ 31 -10 -34 9 136 -115 -363 162 138 -34 76 180 -110 -308 -197 155 114 404 -235 -190 -259 -54 0 -153
2530a53L11J2j80M8m1j67P0o1p2J95k28L6K56j2L00k46J98k65J5R6n5r8l3J23
$$ -153 158 170 -10 38 -3 -170 -100 -161 -233 -38 -266 -230 26 14 314 68 266 1 16 112 57 -41 -74 49
2554D9j97J20K60k90j06L02l14R8L11j45q4k3M9m3k13K91j36j58O0J68k41K4K18
$$ 49 -148 -28 232 -58 -164 138 -176 -78 233 88 4 -19 30 -13 -226 65 -71 -229 -169 -1 -242 -218 0
2577@N4l15L57J35j17l22N2k4K43J29j63m41L26j39J58L1p9L65l10j50K22O0k36
$$ 0 54 -261 96 231 114 -208 -156 -180 63 192 29 -412 -86 -225 -67 -36 -115 250 -60 -210 12 72 -164
2600a64J42K23k89K50k43J99j82P7O7P6k98R0J93k49J79j50L8J8M3k88J74O2J13
$$ -164 -22 201 -88 162 -81 118 -64 13 80 156 -142 -52 141 -108 71 -79 -41 -23 20 -268 -94 -32 81
2623H1L1k88L51P0n19L31K78k28j19M13l00j35K5J57L2m48K23K30m86J83J85l68
$$ 81 112 -176 175 245 -274 57 335 107 -12 401 101 -34 -9 148 180 -268 -45 185 -301 -118 67 -301
2645c01J38K81k16p7J45J92j62k7K96l42j9K84j2k64j49L30j60k06M61j66j21
$$ -301 -163 118 -98 -175 -30 162 0 -27 269 -73 -92 192 180 -84 -233 97 -63 -269 192 26 -95
2666i5q9K48J32k54L14j29p9k65K49k49P5J4K20j15k60L16o4k25J44M12n66L63
$$ -95 -184 64 196 -58 256 127 48 -217 32 -217 -142 -128 92 -23 -283 33 -31 -256 -112 300 -266 97
2688I7L11o16K73j34J0K64l08J59j9j44J7M67o46K26J72%k51j26L43k51J0J89
$$ 97 408 -208 65 -69 -59 205 -103 56 37 -107 -90 377 -269 -43 129 129 -122 -248 95 -156 -146 43
2710D3N2n81N31k62K30n0K51l10o4K46K43k2k15K2K08l32K54j10m12J99M7j39
$$ 43 95 -486 45 -217 13 -37 214 -96 -160 86 329 307 92 114 322 -10 244 134 -278 -79 -32 -171
2732a71j31K75J48l20K48O6pn3J97p8l49J42M4l85L2L11J22m22L70j16P2nl3J19
$$ -171 -302 -27 121 -199 49 115 108 55 252 174 -175 -33 11 -374 -342 -31 91 -331 39 -77 -5 -10 -43 76
2756G6O9Oj95J67j70K53Q2n04K38R4l22J29J0J82j83L6J48j90k20L03L66n12K0
$$ 76 145 151 -44 123 -47 206 288 -216 22 116 -206 -77 -67 115 -68 -32 116 -74 -294 9 375 -137 -117
2779a17O1k88K18R6O2p8K6J96j08P6M5R6o5j54K89l17k63K25k12j08M07k87M06
$$ -117 -56 -344 -126 -30 32 -46 -20 176 68 144 189 285 220 66 355 38 -225 0 -212 -320 87 -200 206
2802B06l36M9K15p0n0K42j50ook93J28K0J93k58J09K5q9p0J40k49K76m47M45J09
$$ 206 -130 -81 134 64 14 256 106 100 94 -199 -71 -51 142 -116 -7 18 -71 -141 -1 -250 26 -421 24 133
2826A33N7n6L0J26l53Q8j66j89M20l08L04j66J0K17p0k69k5K87j89n3K77k58K03
$$ 133 190 134 164 290 -63 25 -141 -330 90 -218 86 -80 -70 147 77 -192 -217 70 -119 -172 105 -153 50
2849E0P4k02m7K70r0l4J2J04j7j9p8K6Qk15J45l47L52J87k81jJ47k67R6P0p4K10
$$ 50 124 -78 -125 145 55 21 33 137 120 101 23 49 57 -158 -13 -360 -8 179 -102 -103 44 -223 -127 -57 -131 79
2875G9k17M13M8l53K91o3J8m03k2o8K71k51P0L54k37K2K14k65L0R3K7p1j53J18
$$ 79 -138 275 323 -30 261 198 216 -187 -209 -277 -6 -257 -187 167 -70 -48 166 -99 -69 24 51 -20 -173 -55
2899e5m7JJ9K06j19J12j52k43L63k95J47P5J03j43J26n5Q0l29m6K11J8r1J10j58
$$ -55 -102 -101 -82 124 5 117 -35 -278 85 -210 -63 12 115 -28 98 43 123 -206 -252 -41 -23 -114 -4 -162
2923a62R4m9K10J49l23P9K4l35L87O6J22m60N7j0K40K1j59J4m7j54J52P1n1J68
$$ -162 -68 -117 93 242 -81 -2 22 -313 74 140 262 -198 -141 -151 89 110 -49 -35 -82 -236 -84 -13 -64 104
2947A04k1m6r1K1J87j06j08k29J89j00M05m40L0J57K45k7j34J87j23pJ35l21J98
$$ 104 83 37 -54 -33 154 48 -60 -289 -100 -200 205 -235 -205 -48 197 170 36 223 100 93 228 -93 105
2970A05q6M6o2k15K80k79L11m19K18L10n5n1k0k26J07l9j54L21p5k46L26n3r4
$$ 105 19 65 3 -212 68 -211 100 -319 -101 209 154 103 83 -143 -36 -75 -229 92 17 -229 97 44 -50
2993e0N8j20O6K43k09J18j52K48j43k48L39m29N35j05l29K27J29k52q9K26mk45
$$ -50 8 -112 -46 197 -12 106 -46 202 59 -189 150 -279 256 151 -178 49 178 -74 -163 63 59 -186
3015a86M2M59k91J14p3p9n3jR6Q4L6p3K75m95J00J68L3k60K49o0M7l1o8l9L49
$$ -186 -144 315 24 138 65 -14 -67 -68 28 112 148 75 350 -145 -45 123 156 -104 145 85 132 101 33 -6 343
3040C43m63J26j5j14K11J8j87J07j38J60J29l42N41l11j77K29O0j83M1j21K19
$$ 343 -120 6 -9 -123 88 106 -81 26 -112 48 177 -165 376 65 -112 117 177 -6 35 -86 133
3061A33K94m76j85L56l60K23q3K97j62l8J0j07J79k62J81j3L2k14j71M43n6p2
$$ 133 427 -49 -234 122 -238 -15 -98 199 37 -1 9 -98 81 -181 0 -13 19 -195 -366 77 21 -51
3083e1j0M31k95p6j14O0J45K80o49L34l48K78l5K72%j53m1M7k41K02M30n72J25
$$ -51 -61 370 75 -1 -115 -55 90 370 -279 55 -293 -15 -50 222 222 69 28 75 -166 36 466 -106 19
3106A9k99M59k28K74k15k01k4J26j8k3K57l75L67j11OJ67k28K49o9J08k46o0n
$$ 19 -280 179 -49 225 10 -191 -215 -89 -107 -130 127 -248 119 8 14 181 -47 202 133 241 -5 -65 -70
3129g0K5K3j68M79k74l2M1R8J01j13l8j9M0k11o1J28p4j55K32K87o5k77J94k7
$$ -70 -45 -22 -190 289 15 -17 24 122 223 110 72 53 93 -118 -179 -51 -125 -280 -48 239 174 -103 91 64
3153F4j08J57k01K78l76L37j01j75J25k2r0N0j65K64k16L35k08K0P6K10k54j39
$$ 64 -44 113 -88 190 -186 151 50 -125 0 -22 -112 -62 -227 37 -179 156 -52 -32 44 254 0 -139
3175a39K66p9Pj88r9J75j01j4q9K92k6o8J39Kj08K12k52M68l99k00J94K67m11
$$ -139 127 48 55 -133 -232 -57 -158 -172 -261 31 5 -63 76 78 -30 182 -70 398 -1 -201 -7 260 -151
3198a51m4J11N0k1L06j26j94Q8j41J08J91l20J21K41k46N2R1J12k96M9K7j88N13
$$ -151 -195 -84 -34 -55 251 125 -69 19 -122 -14 177 -143 -22 219 -27 25 116 228 -68 -19 8 -180 333
3221C33l65q6o6k0L04k97L89j23j21K91q3l18P5j3J38k07l4J12K73jp2L68k32
$$ 333 -32 -118 -184 -204 100 -197 192 69 -52 239 156 -162 -87 -100 38 -169 -203 -91 182 181 109 477 245
3244B45j08K4n01L38k57K18M5r1J1m5p8N3J52j15L18n0m17k2M10k09j09M58l10
$$ 245 137 161 -340 -2 -259 -41 4 -87 -76 -121 -199 -146 6 -109 209 159 -258 -280 130 -79 -188 270 -40
3267d0Qj87J6K73O5J4j70k59K05J66k3l1n7M1j57K69n5l8k13N2j7K0N3N1j39l3
$$ -40 -32 -219 -203 70 135 149 -21 -280 -75 91 68 37 -20 21 -136 133 78 40 -173 -121 -138 -118 -65 -14 -153 -186
3293a86N1K05j24j3l4M27m32J01q2J51q6K3L6o9p4J55J25j40j93J36K2L55l77
$$ -186 -135 70 -54 -67 -101 326 -106 -5 -87 64 -22 1 37 -32 -106 49 174 34 -159 -23 -1 354 -23
3316b3p2N1R6j37j77M45r4L3k94M82l64P4k18K51K59k58ok55J93k29K89K42j82
$$ -23 -95 -44 52 -85 -262 183 89 122 -172 310 -54 20 -198 53 312 54 48 -207 -14 -243 46 288 106
3339A06j51j25J45q0J50j38n1O1n1K94l47J65J88r2K8j66j22j31K09P6R4j59J46
$$ 106 -45 -170 -25 -105 45 -93 -144 -83 -134 160 -187 -22 166 74 102 -64 -186 -317 -108 -32 62 -97 49
3362D9J2J51l94P9J45P9n9Q4k93K79l21K90p5L8R6mj75k15J88J27k7r4J42j84
$$ 49 61 212 -182 -103 42 121 62 146 -147 132 -189 101 26 64 160 156 -19 -234 -46 81 54 -40 102 -82
3386h2L35l58L68m11K09k50J62L7j33J27R6O8k53K46j17J55k21K30oj97Rj72P
$$ -82 253 -105 263 -148 61 -189 -27 10 -123 4 100 168 -85 161 44 199 -22 208 202 5 14 -158 -151
3409a51K37k69J56K21KKj39N5L4J18k27k8r0K8kj40j11M28j90J85j78J86j5J46
$$ -151 86 -183 -27 194 196 198 59 114 148 266 39 11 -79 -51 -53 -193 -304 124 -66 119 -59 127 112 258
3433B58k98K21j0j75J87k60P4k7N4N9q6j07j23J48L6o5n4o7M27k52J57N7r0M4
$$ 258 -40 181 171 -4 183 -77 -3 -30 24 83 -3 -110 -233 -85 -49 -114 -168 -235 192 -60 97 154 64 108
3457A08k75J66r7K12j82r0N5N6J22j11N7r8m7K81j04j39K65l30L6o8qJ54oJ71
$$ 108 -167 -1 -98 114 -68 -158 -103 -47 75 -36 21 -77 -124 157 53 -86 179 -151 -115 -183 -191 -37 -43 128
3481A28J79k51n2J57k70J66K37n51L33k72K60L8j1j74j06J60Q8j36M9j6K05q6
$$ 128 307 56 4 161 -109 57 294 -257 76 -196 64 102 91 -83 -189 -29 59 -77 -28 -44 161 75
3503G5o3J12j50Om1M0j85J31j21L8J41k70j7L21o7J20J16N3k54J31k00J21l1j82
$$ 75 12 124 -26 -20 -61 -21 -206 -75 -196 -158 -17 -287 -304 17 -50 70 186 239 -15 116 -84 37 6 -176
3527a76K85k1o8k74J71J2k9R2J72R6j02J23m15J96m7J14j88n7J25R3j38j49mj6
$$ -176 109 88 20 -254 -83 -71 -100 -8 164 260 158 281 -134 62 15 129 -59 -116 9 102 -36 -185 -189 -205
3551b05M65l27K47k29qJ80j97L67k91j02k2R7Q5j45R6P3k14O0J6J47O0K05m58
$$ -205 260 -67 180 -49 -57 123 -74 293 2 -100 -122 -25 60 -85 11 84 -130 -70 -54 93 153 358 -100
3574a00J00R1j32J12N7J58l48k2J84k19l5J76j59L94j53j04o1J79j04P6J0m27
$$ -100 0 91 -41 71 128 286 -62 -84 100 -119 -154 22 -137 257 104 0 -61 118 14 90 100 -327
3596c27M68j61j09K28j25J77m82K72O4oR7k81K12K31q9J05j6m24J35K08O3j92
$$ -327 141 -20 -129 99 -26 151 -331 -59 5 -1 96 -185 27 258 169 274 258 -166 -31 177 240 48
3618D8k58J89L1K98j56k00j64K53J10j16j11R2O4k03k7J30JJ21j94J48J96k3k53
$$ 48 -210 -21 10 308 152 -48 -212 41 151 35 -76 16 80 -123 -150 -20 -19 102 -92 56 252 229 -24
3641b4j09l3j01M09j19j60O6O0r7J36k36P1K38l32J76J57j06k34J54j63K31K29
$$ -24 -133 -166 -267 142 23 -137 -71 -11 -108 28 -208 -137 101 -231 -55 102 -4 -238 -84 -247 -16 213
3663B13k27q3J78J54l88J96P7j15r6r7J55K9J91k77M7L17o07L55O2o4l7q3L90
$$ 213 -14 -97 81 235 -153 43 120 5 -91 -188 -33 -4 187 -90 -43 274 -333 22 84 20 -17 -100 290
3686B90k86P7J50j81p3J59N9k80q1M11m26l2J02J74J07q3N8k58j22L80k41N3J06
$$ 290 4 81 231 50 -23 136 195 -85 -166 245 -181 -213 -111 63 170 87 145 -113 -235 145 -96 -43 63
3709F3N1j74k4J18jl5J26l8M0j66o7J14j00K19K5J16j91J82m87L09j17rK38l61
$$ 63 114 -60 -84 34 33 -2 124 86 126 -40 -107 7 -93 126 151 267 76 258 -229 80 -37 -46 192 -169
3733a69j76N25m92K33J2K99k10l26K02J50r9J20j97J64j96K20k00k9J58k5O9j01
$$ -169 -345 180 -312 -79 -67 232 22 -304 -102 48 -51 69 -128 36 -160 60 -140 -169 -11 -36 33 -68
3755f8p1K39N6j3J12k91j88L13j14r6J59J35k57n3J90r9J00N9o9k23K5R3N1j25
$$ -68 -139 100 156 143 255 -36 -224 89 -25 -121 38 173 -84 -137 53 -46 54 113 44 -179 -154 -61 -10 -135
3779a35p3M31j83R5O6j71l47N51l95K90o6k55J1J85r9K52l44K33k91L59oK8j26
$$ -135 -208 223 40 135 201 30 -317 234 -161 129 63 -192 -181 4 -95 157 -187 46 -245 114 108 136 10
3802A0Q9K0j31K0l38L81M3m9j44L74l72RK91O1k31Q6l14J69J83j65J65l04n9K88
$$ 10 99 119 -12 8 -330 51 94 45 -99 275 -97 -88 203 264 33 119 -195 -26 157 -8 157 -147 -206 82
3826H2j9j41L01l61J09j44K35J42k26L9K37n7m86K12J57q3j12l6L53l80J59Q4
$$ 82 63 -78 223 -138 -29 -173 62 204 -22 17 254 197 -289 -77 80 -3 -115 -151 202 -178 -19 65
3848F5k78J98J8j43J13J2J70J15j79j05j10J69L1j26J93j43k17O9O76m92J88k22
$$ 65 -213 -15 3 -140 -27 -15 155 270 91 -14 -124 45 76 -50 143 0 -217 -148 528 36 224 2
3870Br0K51k36J08k4m6J16M9r5L0RQ5kj78L66l57j73K17J9k7J7j01l7q8K02k09
$$ 2 -88 163 -73 35 11 -35 81 130 35 65 74 159 157 -21 345 -12 -185 32 51 24 41 -60 -97 -185 17 -192
3896a92r4K51K79k51M7pk40L93k07J73j78K11k19K22l77K22p2K00j65K30r6j8
$$ -192 -286 -35 244 -7 40 33 -207 186 -21 152 -26 185 -34 188 -189 33 -39 161 -4 226 130 112
3918A12J32n8J9l40P3j88K03Q9k0k18L16J0r2j28J29k89K53j32J19j0j76J68K31
$$ 112 244 186 205 -135 -62 -250 -47 42 22 -196 120 130 38 -90 39 -250 3 -129 -10 -20 -196 -28 203
3941B03j45k34J62J52O6k74K19o6Nj52K08k4M5j00j60Q8M6p6K28K46m39J75j51
$$ 203 58 -176 -14 138 204 -70 149 83 88 -64 144 120 165 65 -95 -7 39 -37 191 437 -2 173 22
3964B2J89Pk24J03j07l28L57j05J36l38J07O9J75R1l11L56l09K42l94K20j41J86
$$ 22 211 218 -6 97 -10 -338 19 -86 50 -288 -181 -112 63 154 -157 199 -110 132 -262 -42 -183 3
3986CJ05O5k87M94l44P9k59J33k1l6K51l08L75k14j93K03K1o7K38l41K0J37j77
$$ 3 108 173 -114 380 36 115 -144 -11 -32 -68 183 -125 250 36 -157 46 67 0 238 -103 -83 54 -123
4009a23J71o9k9J08o1j52J23o7K04k00k20L42k2J68M7l08OJ60l0o6J09j63L4K58
$$ -123 48 -21 -50 58 -3 -155 -32 -99 105 -95 -315 27 5 173 220 -88 -82 78 48 -18 91 -72 -38 220
4033B20l12m3R9o7j2M26k14J37l05J71K27m38L04l62K18n6k86M69l57L69k47j51
$$ 220 -92 -135 -36 -103 -115 311 97 234 -71 100 327 -111 193 -169 49 -7 -293 176 -181 188 -59 -210
4055b10M86k57k8J69j18M1j07J59k20J36j0l6N9k18K91j24K82l59k3Q6K11j95
$$ -210 276 19 -9 160 42 83 -24 135 -85 51 41 5 64 -154 137 13 295 -64 -87 -1 210 15
4077A5p4j45K00M5K78j37k82M4j78K65k58K63j19o2J65J75k82Q6J57J29l19j28
$$ 15 -59 -204 -4 41 319 182 -100 -56 -234 31 -227 36 -83 -145 20 195 -87 -1 156 285 -34 -162
4099a62P2M0r5R3k10O1M7j0J53k6J73M3j50lL78n08K23j06m2r4L02j25K7k90K4
$$ -162 -90 -50 -145 -52 -262 -201 -154 -164 -11 -37 136 179 29 26 404 -104 119 13 -29 -123 179 54 81 -209 -185
4124a85J02J66n7n0L2L48l16m2J67l54J05J2J76K6j74J23rk15L67j42J53l99M5
$$ -185 -83 83 26 -24 8 356 40 -2 165 -189 -84 -72 104 130 -44 79 70 -145 222 80 233 -166 -121
4147a21K07N1k06J99k18K41q9j92J1K47L2j79J55q8K16P0j08j90l5L9K81l13o7
$$ -121 86 137 -69 130 -88 153 64 -128 -117 130 162 -17 138 50 266 336 228 38 3 42 323 10 -57
4170e7R1j27q4K09k51K45q3q0L62k85J89q5j22j04R8N3RP4l58L41j49k22L23o
$$ -57 34 -93 -177 32 -219 26 -57 -137 225 -60 129 44 -78 -182 -84 -31 -22 52 -306 35 -114 -336 -13 -19
4194a9o4K61k31K99j80l4K34l63K10j08J30j39q6J75J9r2k2L9k2J77j67J08j89
$$ -19 -83 178 -53 246 66 32 266 -97 113 5 135 -4 -90 85 104 12 -10 29 7 184 17 125 -64
4217f4Q0K0J69r3j37j63Q0J87K32j86l03J04J15Q8m1oj37j5J67j15j86L61j26
$$ -64 16 36 205 112 -25 -188 -108 79 311 125 -178 -74 41 129 88 82 -55 -70 97 -18 -204 157 31
4240C1J71j73m5K42p1j18m7m5q5J63j46J66j23R1K41j53K7l54K38q5K59k01RK87
$$ 31 202 29 -16 226 155 37 -10 -55 -140 23 -123 43 -80 11 252 99 126 -228 10 -75 184 -17 -8 279
4264B79m47o8L68k48J78k20J17K8q4J73q0N6k4M9M7L6k87J80n5R8M3m05L23L8
$$ 279 -168 -236 132 -116 62 -158 -41 -13 -97 76 -4 52 28 77 124 160 -127 53 -2 96 139 -266 57 95
4288I5J9P3l72L04q9k75J70K65m93p1N00k03J32j53R8k68K48j6J40j7l6K7k70
$$ 95 114 187 -185 119 30 -245 -75 190 -303 -374 126 -77 55 -98 0 -268 -20 -36 104 87 51 78 -192
4311a92J17P3m6p8m0kK30J3M5k23j34N39o07K51o0O8K4O2L07k60p9j53J86K4Q1
$$ -192 -75 -2 -48 -126 -166 -168 62 75 120 -103 -237 302 -305 -54 -114 -46 -22 40 347 87 8 -145 41 65 146
4336A46k55J31p0J64k18j3N8j16K78k70M9K48Q5l46k7R9M9K48m3p6m88L68O0J7
$$ 146 -109 22 -48 116 -102 -115 -57 -173 105 -165 -116 132 217 -129 -156 -57 -8 240 197 121 -367 1 61 78
4360G8j71R6J7J90o3r8j39m2j1K14J32l05L06k22M6k9O7k11n5J62K01k23J36k
$$ 78 -93 3 20 210 147 49 -90 -132 -143 71 203 -102 204 -18 28 -1 66 -145 -200 -38 163 -60 76 74
4384G4l55N14k43p0J64K9k73P9j74K56l9J16KK86m18K82j61l00K74o3l6J41k03
$$ 74 -281 233 -10 -80 84 113 -160 -81 -255 1 -38 78 80 366 -52 230 69 -231 43 -20 -56 85 -118
4407a18L66K8r0K8j63k99K76K4j22j59J50L3K23j49l07M08k39K31k16J14j36j73
$$ -118 248 276 186 214 51 -248 28 52 -70 -229 -79 -46 177 28 -279 129 -110 121 -95 19 -117 -290
4429b90M07j67J33k85L42j78k62M75k88L00J14l65K57k15Pj08L26m38J43K64l89
$$ -290 117 -50 83 -202 140 -38 -300 175 -113 187 301 -64 193 -22 -15 -123 203 -235 -92 172 -217
4450b17M30j97j47M4j46K12j23J09J88J42k63J32p0j66J65l3k5J85l94J41j5J14
$$ -217 213 16 -131 -87 -233 -21 -144 -35 153 295 32 164 94 -72 93 60 35 220 -174 -33 -48 66
4472F6l4J45K8n2j98K6n3j7J25k4r9K83k84M0J74k50K25m74N17r6K16l37M30k83
$$ 66 32 177 205 153 -45 -19 -72 -89 36 12 -87 196 -88 -48 126 -124 101 -373 144 48 264 -73 357 74
4496G4j27j30J82J3l0K14q9j89K7K09k9k35J73k83L04lK6k65rL08k34RP6PJ54
$$ 74 -53 -183 -1 12 -18 196 107 -82 -55 154 125 -110 63 -220 84 81 107 -158 -167 141 -93 -84 -8 -1 153
4521A53l17r7K72M8R6l14L28k23J15o4j01j10K09j56L28J65j99k6k0p6J92l4k24
$$ 153 -164 -261 11 59 155 -159 169 -54 61 -3 -104 -214 -5 -161 167 332 133 107 87 11 203 169 -55
4544e5J35k07K08r3k08K46O5j32J00pn0l6J63L3j87K05l78L38q7j09R7r7o7L84
$$ -55 80 -127 81 -12 -220 26 91 -41 59 52 2 -34 129 162 -25 180 -198 140 53 -56 41 -56 -123 261
4568B61l12N9K32l68J49k43L20n9O7l52J24l5N2J59n2O7N4j32O6K0L3L2L1j44
$$ 261 -51 8 240 -128 21 -222 98 39 106 -246 -122 -157 -105 54 2 69 123 -9 57 77 110 142 173 29
4592B9k78K51J13r3J98j07q8J64n13L45k42L15j61J25k07K96Q2j35l7l6M1j93
$$ 29 -249 2 115 22 220 113 25 189 -324 21 -221 94 -67 58 -149 147 229 94 57 21 62 -131
4614a31J32j00L44l29j28L7J82q0J53J8k35K86K8l36K25j90M66k18Mo7L6m27M76
$$ -131 1 -99 245 -84 -212 -175 7 -73 80 98 -137 149 177 -159 66 -124 342 124 128 61 97 -330 146
4637A46k38mN2J67k02J49j25J03J76k38J06O1k26K99k27p2K4J77j29N8p6J20l1
$$ 146 -92 -96 -44 123 -79 70 -55 48 224 -14 92 153 -73 226 -1 -73 -49 128 -1 57 -19 101 70
4660G0j03J08l78N28k84n7K51j08O8j6q1k11K32rJ16k70K34k0k05l16O05k93M30
$$ 70 -33 75 -303 225 -59 -116 135 27 95 79 -2 -213 19 10 126 -144 90 70 -135 -451 154 -139 291
4683B91k87j28J00J01k0m7J8J26l72P9K04j65j2M33k76O3q6r8K19l26R1J60j36
$$ 291 4 -124 -24 77 57 10 28 154 -218 -139 65 -100 -112 321 45 108 22 -76 143 -183 -92 68 -68
4706f8j8r5r0K12O4K4q6j2N9j0l7J57m6K52m87J91J0k2j18J67j51L7O0N2P5l74
$$ -68 -86 -181 -271 -59 5 29 -57 -69 -10 -20 -57 100 54 306 -181 10 20 -2 -120 47 -104 -67 -7 45 120 -254
4732b54NO2K02K12k53K05k6k19L92l84j91K75j08J25j8k16J10k8J34P3l3l34K76
$$ -254 -249 -187 15 227 -26 179 153 -66 326 -58 -249 26 -82 43 25 -191 -81 -109 25 98 65 -269 7
4755Gr9nJ13j95J30J7M2np6J55L9J44On21L39l07J87M5Oq6J35o8j76J60j87M58
$$ 7 -92 -97 16 -179 -49 -32 10 5 -71 84 123 267 273 -248 91 -216 -29 16 22 -64 71 3 -173 -13 -200 258
4781B58k61j53q7K8J33J14k48J19J32j16L78j86O2k08L29k90o1k07M48k47M8K32
$$ 258 -3 -156 -243 -215 -82 32 -216 -97 35 -81 297 111 173 -35 294 4 -57 -264 184 -63 -15 217
4803B17k76J13l29O0K27QP1m1k00J68K24l29mmJ51j19n7n9J16p2Q6k6L0j21P6
$$ 217 -59 54 -275 -215 12 20 91 50 -150 18 242 -87 -91 -95 56 -63 -120 -179 -63 -135 -49 -75 -45 -166 -90
4828i0k26L18n3m1o7J82k53J71J45k24L9M42l80J8L72k58N3j9k68P6k73O55m24
$$ -90 -316 2 -51 -92 -159 23 -230 -59 86 -138 -99 343 -37 -19 353 95 148 129 -139 -63 -336 319 -105
4851a05P4Nj01K91O4l60J25j60R1K41m44L40J85j88j06J49J1j19j12J46J0M15
$$ -105 -31 -26 -127 164 228 -132 -7 -167 -76 165 -279 61 246 58 -48 101 112 -7 -119 27 37 452
4873D52n81K35j29r0R5K35l23l18J39J50K9J42L7l89M36k08o1J90r0J45o4m1J36
$$ 452 -129 106 -23 -113 -18 217 -106 -424 -285 -135 -106 36 73 -316 120 -88 -149 41 -49 96 32 -9 127
4896A27J80n48R9J58M6l9j64P1j46L77j77j4J03l87L55k80Q3J5J47k61L31j92
$$ 127 307 -241 -142 16 62 23 -141 -70 -216 161 -16 -30 73 -314 41 -239 -156 -141 6 -255 76 -116
4918a16q1J46m4K15q5P4k99K93n4k14R0K5j54N3J13j44L17k46kL08l33J76j34
$$ -116 -197 -51 -95 120 35 109 -190 103 49 -165 -75 -50 -204 -151 -38 -182 135 -111 -113 195 -138 38 -96
4941i6K00L3k00O3j55K1m9j00J13kJ24p6j62L69j45N6r3j78L66j29o6r4J15P0
$$ -96 104 137 -63 0 -155 -134 -183 -283 -170 -172 -48 -124 -286 83 -62 -6 -99 -277 89 -40 -106 -200 -85 -15
4965a5J77j33j71J84N4K1k92J54k27J96J41K50j11q0l65R2J67K80j37j5nk32r4
$$ -15 162 29 -142 42 96 117 -175 -21 -248 -52 89 339 228 148 -217 -125 42 322 185 170 165 -67 -161
4988a61J74J52j66P4r4j43K66k93j93M37k45r4M75m61J8K85k43K65P4k28k5l9
$$ -161 13 165 -1 73 -21 -164 102 -191 -384 53 -192 -286 189 -272 -254 31 -212 53 127 -101 -126 -165
5010a65K97Nj57j87M99j2l14L5k17L28k14j04K89J78l60q0K35r6J59k22K53p5
$$ -165 132 137 -20 -207 292 280 -34 1 -216 112 -102 -206 83 261 -99 -179 56 -40 119 -103 150 75
5032G5LN0j54j5J48j10K11k27n6J34k3K24j73j03j31P3j65L76n7J95j03k59J9
$$ 75 78 128 -26 -41 107 -3 208 -19 -75 59 36 260 87 -16 -147 -74 -239 137 80 275 172 -87 -68
5055f8K1K02r3p3k31P9j11N75l17qQ3j43m4L08l77K65n6J40k20J80k6j43J72j24
$$ -68 -47 155 62 -11 -242 -163 -274 301 -16 -24 59 -84 -128 180 -197 68 12 152 -68 112 86 -57 115 -9
5079ij78K29P9r5N0j49J20N9k36K7O7j92J88J06m3L3J28k70J7n6J5Lj6K34l75
$$ -9 -187 42 121 26 76 -73 47 106 -130 -103 -36 -228 -40 66 23 56 184 -86 -69 -125 -110 -107 -123 111 -264
5104b64p7M34q3J98j41j04J79m91O29l78K09m2j06j5J58j10k01J18m5J16pk35
$$ -264 -341 93 10 208 67 -37 142 -349 280 -98 111 69 -37 -52 106 -4 -205 -87 -132 -16 -23 -258
5126b58K60J18OQj10J59l07q0J72K17QK6j66j36J8N3L81k85j46L3R8P2K6k95k12
$$ -258 2 120 126 134 24 183 -124 -204 -32 185 193 219 53 -83 -65 -12 369 84 -62 -29 69 141 167 -128 -340
5151c40N87j52l2p7O7j63m4P6KM3r9J53k44O1M25j37J21l10k0J11o4r0o7L63j21
$$ -340 247 95 63 -14 53 -110 -154 -78 -76 -33 -132 21 -223 -162 263 126 247 -63 -83 28 -36 -126 -193 170 49
5176D9J06k33nO2j06M29l40R9RJ62j35J25k76M9J68j09Q3j51M8j91L68k16J70
$$ 49 155 -78 -83 -21 -127 302 -38 61 70 232 97 222 -54 -5 163 54 137 -14 34 -157 211 -5 165
5199A65K14n44R9LP8J0j13J90k35J97k13J42J82k69Q7K02J54l19r9M07k07j99
$$ 165 379 -165 -66 -63 15 25 -88 102 -133 64 -149 -7 175 -94 -7 195 349 30 -69 338 131 -68
5221f8J85j08J27n3j52j95L21M5j35J17qLm70N57j99j2N5j84J27J6p8L39l24J28
$$ -68 117 9 136 83 -69 -264 57 102 -33 84 76 79 -391 166 -33 -45 10 -174 -47 -31 -109 230 -94 34
5245C4k28K6J17o0j7M09j01m81L20k5l0K08p0o8j21k8O6J37K1lJ43j63K51k31
$$ 34 -194 -168 -51 -111 -128 281 180 -301 19 -6 -36 172 102 34 -87 -115 -49 88 109 106 249 86 337 106
5269A06J69m22l8J41n5K4m4J37M4m8j48L72j75k8j67m6L30l45P3L56l55p0K76
$$ 106 275 -147 -185 -44 -99 -75 -119 18 62 14 -134 238 63 35 -132 -178 152 -193 -120 236 -119 -189 87
5292H7l67L37k91P7K73j53K18n5J47m93L15j06j55J63K09J1k17QJ17n1N9k18Q6
$$ 87 -280 57 -234 -157 116 -37 181 126 273 -220 95 -11 -166 -3 206 217 0 8 125 74 133 -85 1
5315Ar8J33J28j64J96m11K07K78k59O3k30M0K7m4K12j42M0j81K06q1R4j5j98M3
$$ 1 -97 36 164 0 196 -215 -8 270 11 74 -156 -116 -89 -133 79 -63 -23 -204 2 -79 15 0 -198 -155
5339a55P3K34N4l39N5L2J39j49K0J03j49J91K37m30J2J2j81J26J56k53J95j51
$$ -155 -82 152 206 -133 -78 -46 93 -56 -36 67 -82 109 346 -84 -72 -60 -241 -115 41 -212 -17 -168
5361a68J29O5M3J83l22J06K4j14Q5r5j30L27n1j15RpR8l9O4oo7r4K91j40j34j36
$$ -168 -39 26 69 252 -70 36 60 -54 31 -64 -194 133 82 -33 -24 -31 67 28 92 86 19 -75 216 76 -58 -194
5387a94M3J97J3J46k71N7J32j30R6m1k1k97R0K58n0J0m35M56m2K17q3q7p4k0J7
$$ -194 -151 46 59 205 -66 -9 123 -7 89 48 27 -270 -180 78 28 38 -397 59 17 234 151 64 -10 -30 -13
5412a3K97j60l00M57n7j06l08K40Lq7j01l3K37P2j00j17K61j41r5l0J23k06L51
$$ -13 284 124 -176 281 224 118 -190 50 53 -34 -135 -168 69 141 41 -76 185 44 -51 -81 42 -164 187
5435A87k31K86k81l7q6K03j10J0K63l23N0N3j24K54o4j24J23j88J71J18j18k12
$$ 187 -44 242 -39 -76 -162 41 -69 -59 204 -119 -69 -16 -140 114 50 -74 49 -139 32 150 32 -180
5457a80O20k11n9m2j84L81m58K10RK15l39j47J82o4j1O0q6J05J97j35l73K97q
$$ -180 440 229 170 128 -56 325 -133 77 86 301 -38 -185 -3 -67 -78 -18 -104 1 198 63 -310 -13 -21
5480b1L2l0l63M6M19j06l27N75j08J1l90L75j21J24kk82O4k03N29l33l4M01l15
$$ -21 11 -19 -382 -336 83 -23 -350 225 117 128 -262 113 -8 116 114 -168 -104 -307 222 -111 -145 256 -59
5503e9mJ96k62J31j18k62O2L00j27K81L0j52q0o3k34M16k19L74j63K0R4j85j51
$$ -59 -63 133 -129 2 -116 -378 -316 -16 -143 138 168 16 -64 -127 -361 55 -164 210 47 67 161 -24 -175
5526a75J43R7j04p2L77k95J54r1j72qj0QL65n65O59k22m35L46L1k20J71q2N3J36
$$ -175 -32 65 -39 -111 266 -29 125 34 -138 -146 -156 -148 217 -348 311 89 -346 0 31 -189 -18 -100 -47 89
5550H9j39J76j14j10n0M11l40J45o2j46J0J8L5k35K93J55j00r1qN3r4K7j7J22
$$ 89 -50 126 12 -98 -148 263 -77 68 6 -140 -130 -112 -77 -312 -19 136 36 -55 -63 -10 -104 -77 -94 28
5574B8K77l22j89M72r8j78j10J63K8j08m7jn2L91j02m01K76j67K25k99L16r2K29
$$ 28 305 -17 -206 266 168 -10 -120 43 71 -37 -84 -85 -137 254 152 -249 27 -140 85 -214 102 10 239
5597B39l20M9l9J35j65M58m64P2J45k92L05l59L17N3j37r5J5J44K87l01j85j9
$$ 239 -81 -32 -71 64 -101 357 -107 -35 110 -182 123 -236 81 134 -3 -98 -83 61 348 47 -138 -157
5619a57K07l4o6j09K40k72K42k62J01K12q8N2Q1j9n5l26M15J9l72j4R2JJ44N7
$$ -157 50 16 -50 -159 81 -191 51 -211 -110 102 14 66 147 128 73 -253 162 181 -191 -205 -113 -112 32 89
5643H9O3j57j82P4M5j77K78l6j4L1j27K26j62k10L72l88M67l75K61j38J72J13
$$ 89 152 -5 -187 -113 -68 -245 33 -3 -17 14 -113 113 -49 -259 113 -275 192 -183 78 -60 112 225
5665B25m10K54j34J59J7j34l5r0L3J86r0j64M00k62J11m32L63N3O6J10q5k31K15
$$ 225 -185 69 -65 94 111 -23 -58 -148 -115 71 -19 -183 217 -45 66 -366 -3 50 116 226 141 -90 125
5688A25k57J29m72K31J99L1p4%K57l29M00l27L48k22k13M2J45K3N3l00J73K5k01
$$ 125 -132 -3 -475 -244 -45 -14 -88 -88 169 -160 240 -87 261 39 -174 -132 13 36 89 -211 -38 -13 -214
5711b14J14J49j84J40j09K13o6J55l98J91J54k19m4J88j1K5J47J22k20j3j17J61
$$ -214 -100 49 -135 5 -104 109 43 198 -200 -9 145 -74 -118 70 59 84 231 353 133 120 3 164
5733A64k46N0k28K97Q9o7j06K30j63j0J22k30N98m69J4q8J85l01K51rk41K47k64
$$ 164 -82 -32 -260 37 126 59 -47 183 20 10 132 -98 500 31 45 -43 142 -159 92 83 -158 89 -175
5756a75K69j89Q7j06Q1q5o0K04qk55K29p7PM60k57k66K53j25p7R4kP0k6J8n1j91
$$ -175 94 -95 -8 -114 -33 -118 -178 26 18 -237 -8 -85 -78 382 125 -141 112 -13 -90 4 2 72 46 64 13 -178
5782a78J62j72J99O2q1L07k61j5J25j08k14QK62l91L59J33j25j46J05p1J00J08
$$ -178 -16 -188 11 73 -8 299 38 23 148 40 -174 -166 96 -295 64 197 72 -74 31 -40 60 168
5804A68j17k8J81j24J17k98J72JK14l3q9j23k64K52k07q6M08Kn1J02k34L9k16
$$ 168 51 23 204 80 197 -101 71 72 286 253 164 41 -223 29 -178 -264 144 146 95 197 -37 2 -214
5827b14J83l3M2k91J40M34q5j52j82M4j16L45o4N7m4j2l57M27n3k84J82r0K87
$$ -214 -31 -64 -22 -313 -173 261 176 24 -158 -114 -230 115 51 108 64 52 -305 122 69 -215 -33 -123 164
5850A64k98K7M67m94n9K55J34J04j29l69%R4K7N01n97K65l24J08R9j2K67m09J3
$$ 164 -134 -107 360 -134 -193 62 196 300 171 -198 -198 -104 -77 424 -173 92 -232 -124 -25 -37 230 -179 -166
5873a66K04p7J10J10k71J54k35J47J12j74J96j68J62j37m4j7K02j98k00M74l3
$$ -166 38 -39 71 181 -90 64 -171 -24 88 -86 110 -58 104 -33 -77 -94 108 -90 -290 184 151
5894A51rl6J8k57M0K97l99K29K4L6j19K57m24J12K29K14m45R3K0m0o4J57j67k
$$ 151 142 106 124 -133 -93 204 -195 34 58 94 -25 232 -192 -80 149 363 -82 11 31 -9 -73 84 -83 -85
5918h5k8J25j57j50K26O5J57l94K67J8k18J30J43k65L7J60KJ71k19N2k21J87R9
$$ -85 -113 12 -145 -295 -69 -4 153 -241 26 44 -174 -44 99 -166 -129 31 33 204 -15 37 -184 3 102
5941A02Q5k23K4j51J60j44J82j20M0k0l0k7L14j55N1j62J49k76J69R0p3K77j59
$$ 102 187 -36 -12 -163 -3 -147 35 -85 -45 -65 -95 -122 192 37 88 -74 75 -201 -32 58 -15 262 103
5964A03k43L18j48nl5L1J36J80m08j52K53oK2r7N5o2J84k02k2J88J61l51N1j66
$$ 103 -140 178 30 25 -10 21 157 337 -71 -223 30 24 46 -51 4 -58 126 -76 -98 90 251 -100 -49 -215
5988b15J68K3RJ00M3j86K37l05N3J95j94J56N1m19N51m57P%M82k04j97K16j38
$$ -215 -47 -24 -15 85 128 -58 179 -126 -73 122 -72 84 135 -284 267 -190 -183 -183 299 95 -102 114 -24
6011b4n3N0O5K24l53L3O7j80R1O5O7k59K09J43j26K6J98O8j37m09J16K25q6n5
$$ -24 -77 -27 38 262 -91 -58 9 -171 -80 -15 52 -207 2 145 19 45 243 311 174 -235 -119 106 20 -35
6035c5J44K9k1n7q7K28r7q0K4l7r6N4O1l4J74m40O34l85J09l07J70P5j06J44J13
$$ -35 109 138 117 60 -27 201 104 24 48 11 -85 -31 30 -4 170 -270 364 -21 88 -219 -49 26 -80 64 177
6060A77k24M7mL3J50j94Pj86M01n4l44K56j46q7J43J09M2k0J07k23J43r9j75J3
$$ 177 -47 0 -4 29 179 -15 -8 -194 207 153 -191 65 -81 -168 -25 84 126 106 213 -10 133 34 -141 -128
6084a28J42J10p4j54L48k72J85o1j80K30j98J68j37K98j78j52Q0K03j33N6j79
$$ -128 14 124 50 -104 244 -28 157 96 -84 146 -52 116 -21 277 99 -53 27 230 97 153 -26
6105b6J37N9jk17k68N88l39j06K64r1q8RK12J20k64L1j92J48j1J18L6j33R9N0
$$ -26 111 170 169 -48 -316 272 -67 -173 91 0 -88 -79 133 253 -11 20 -172 -24 -35 83 119 -14 85 135
6129A35k67L19k96J36J30O4k51k61M49j66q9q0P0J77o2M7k09M75k41L6r4K01l82
$$ 135 -132 187 -109 27 157 221 -30 -291 158 -8 -97 -177 -107 70 8 55 -154 321 80 116 22 223 -159
6152a59L35j50j57j83L40j87J61Q5m04L80j96J76l14M27j89P8j41n7M3J38mJ1
$$ -159 176 26 -131 -314 26 -161 0 85 -319 61 -135 41 -273 154 -35 43 -98 -155 -112 26 22 33
6174C3j74K05J76j07j75O9j84M3n3K71p9j96L56k43K39Jjr5q7r6L33l35RL5N8
$$ 33 -141 64 240 133 -42 27 -157 -114 -167 104 25 -171 185 -58 181 182 181 86 -1 -97 236 -99 -90 -55 3
6199Co2j93L16n4K02k88J28j72p2P3R5J10k21M7P0L72l66q2Q4n3M7pK23j84J84
$$ 3 -59 -252 64 10 212 -76 52 -120 -192 -119 -24 86 -135 -88 -18 354 -12 -94 -10 -63 -16 -23 200 16 200
6224B00l47K7J40j8J89k63m6J24N8L6Q3j10j11J32r9o3J93k48L99k13j98o5K73
$$ 200 -147 -120 20 2 191 -72 -118 6 64 100 183 73 -38 94 -5 -68 125 -123 276 63 -135 -200 73
6247G3r8j72M3L77j81k33J66j42K67L1j36r7n7J58j30J21M4J28k49R5O9j14O1
$$ 73 -25 -197 -154 223 42 -191 -25 -167 100 131 -5 -102 -159 -1 -131 -10 34 162 -87 8 77 -37 24
6270B4k6N2j86K37k14p9J10K43J28k03J7K26k20o1lM6o8j99J13N9j86L35j61J39
$$ 24 -2 50 -136 101 -113 -192 -82 161 289 86 103 329 109 48 45 91 23 -176 -63 -4 -190 145 -16 123
6294A23m3K31l59r8L0J33oJ72m21K90j18o7J27J85m35J16J46J8Q7j20K23m46J22
$$ 123 80 311 -48 -146 -116 17 11 183 -238 52 -66 -133 -6 179 -256 -140 6 24 111 -9 214 -232 -110
6317a10J73mj56P9J80l50J39J4K03j94M5Q0j0k08oJ80L9k53K78j27N2j70N00l75
$$ -110 63 59 -97 -18 162 -188 -49 -35 168 -26 19 99 89 -119 -125 55 94 -159 119 -8 44 -126 374 -1
6341aj77K55J0J99j65k1J79l26J45j36l3K85J34n27K89qm87M26k14K5J96m4R1
$$ -1 -178 77 87 286 121 100 279 -47 98 -38 -71 214 348 -179 110 102 -385 41 -173 -148 48 4 95
6364I5k10n5J47j50N89o49L29k59K1K52m10K10Kk2M2q0J04j4J65j08N9K64m87
$$ 95 -115 -170 -23 -173 416 -233 96 -163 -142 110 -300 -90 -88 -110 -68 -148 -44 -58 107 -1 58 322 -165
6387a65L01l55K93O6j70Q3p0Q1k19K07o9k54M03l39L42j25l1j9nJ06l15K10O0
$$ -165 136 -219 74 140 -30 53 -17 64 -155 52 -17 -271 132 -207 135 10 -21 -40 -45 61 -254 -44 16
6410A6j7p1p2Q7N1J12K23l89j25K80n6L8L4R7p7J01j88K5j86L33l74K69K25m97
$$ 16 -1 -72 -144 -57 -6 106 329 -60 -185 95 39 77 111 208 131 232 44 69 -117 216 -158 111 336 -161
6434a61j15K91j43R9j2J18o8Jj27Oj68J76K97J29n5l45K54j58j29L20j68k2J49
$$ -161 -276 15 -128 -29 -41 77 9 10 -117 -111 -279 -103 194 323 268 -77 177 19 -110 210 42 20 169
6457A69l03Q0J93j00j30K58l00K22j2P3j34j89J69L1j98J99k37JK68k8J5j76J37
$$ 169 -134 -54 139 39 -91 167 -133 89 77 150 16 -173 -4 27 -171 28 -209 -208 60 32 47 -129 8
6480Hm3k18P3J81K18k96K01K4k57J02J52lj49k36L42k48N2o6k05M71rj48M3L95
$$ 8 -35 -253 -180 1 219 -77 124 148 -109 -7 145 142 -7 -243 99 -149 -97 -163 -368 103 94 -54 -11 384
6504C84m64q6J95j40J18k9P6l11K75J57K1q2k89K13rr2R2k3N2P1j85J0J09r6m6
$$ 384 -80 -166 29 -111 7 -22 54 -257 18 175 196 114 -175 38 29 -63 29 6 58 129 -56 -46 63 -33 -79
6529g9J36J74l48L15J8o4k10r6J2K30j61J46k83L99l44J7R7N2J66l73J71K7N7
$$ -79 57 231 -117 198 216 152 -58 -154 -142 88 -73 73 -210 189 -155 -138 -41 11 177 -196 -25 2 59
6552E9j42P3J98l37K0o9L27m54L85j31j48M85l81K96N2l83J89j37K73j25k08n6
$$ 59 -83 -10 188 -149 -129 -198 129 -325 60 -71 -219 266 -115 181 233 -150 39 -98 175 50 -158 -214
6574b14J62J06P4k77j3j85L95j33J8P6k75L56k58J85j2o3L5j79K40P3l37N8K1
$$ -214 -52 54 128 -149 -162 -347 48 -85 -67 9 -266 90 -168 17 5 -58 -23 -202 38 111 -226 -168 -147
6597a47J62j10K47o3j62J78j76Ok90K66J33J4QM3k2l6l79L42K42j82J26m90K21
$$ -147 15 -95 152 89 -73 105 -71 -65 -355 -89 44 58 66 109 87 51 -328 14 256 74 200 -290 -69
6620f9PO9L71l07k03j06M23o5l3k00K79l51K46m4K6k94J91J62k57J35j71P6J29
$$ -69 -62 7 378 71 -132 -238 185 120 87 -113 166 -185 61 17 43 -251 -60 102 -155 -20 -191 -115 14
6643A4ql8j65K84j11J51J77k29m3j72J59j9k0J25j09p7M3P1J25k08J83J46k75
$$ 14 6 -32 -197 87 -24 127 304 75 32 -140 19 0 -20 105 -4 -81 -38 33 158 -50 133 279 4
6666DJ25j71r6K61J49k45R8QN0m2j64j96K24J96R0n28J70K2K23J46l94J54J5N3
$$ 4 129 -42 -138 123 272 27 125 133 183 141 -23 -219 5 201 291 -237 -67 -45 178 324 -70 84 99 152
6690A52o3J3j48L5j58M1M24k67j06J65j6n19M80J4k23RJ00o6J99N6j90o4K7J97
$$ 152 89 102 -46 -11 -169 -128 296 29 -77 88 72 -447 33 47 -176 -167 -67 -133 66 122 -68 -132 -105 92
6714I2j74K16m50K73m8K73j34l50K53L5L07j83j24j46P4M2J29j58M1j45J05P7
$$ 92 -82 134 -316 -43 -91 182 48 -302 -49 -14 293 110 -14 -160 -86 -44 85 -73 -32 -177 -72 5
6736Ej27o6O8L68q7k51K64K7j89J53j80L7Q6l22K46j44k3K18j9j61J61L8J00j83
$$ 5 -122 -188 -120 248 161 -90 174 201 12 165 -15 22 108 -214 32 -112 -135 83 64 -97 64 102 202 19
6760A9O6J05j23J02r3N2k49J22n6J17J74k56P9O0J06o7q7P2j45P5M4k37o0K02
$$ 19 85 190 67 169 76 128 -121 1 -55 62 236 -20 59 119 225 158 71 143 -2 73 117 -120 -180 22
6784B2K49j79J56q8l05J94K6j77O3J08j53L17m71K76K2q9jR7R3j33r9l9J30q6
$$ 22 271 92 248 160 -145 49 75 -102 -39 69 -84 233 -238 38 60 -29 -30 67 160 27 -72 -111 19 -67
6808f7MJ05q6oK21m31R2J27R6j71K21j33pJ06k28L01p9j66K78l19J27L05k62l0
$$ -67 -63 42 -44 -50 171 -260 -168 -41 55 -116 105 -28 -35 71 -157 144 65 -101 177 -142 -15 290 28 -2
6832bK7j6j21L85k91k05J64O0j02J01R5j10J93K7O3k78J5J58l06L85k79j20N7
$$ -2 25 9 -112 273 -18 -223 -59 1 -101 0 95 -15 178 205 268 -10 5 163 -143 242 -37 -157 -100
6855a00J6p3L30l10J68J87l03K27J06J17n21M68k38k89L50k28L4Q1l39K96j4j85
$$ -100 -84 -157 173 -137 31 218 -85 142 248 365 -156 312 74 -215 135 -93 -59 22 -317 -21 -35 -220
6877b20J60L4rj85M5K10j39L16m10N37l55q2K71m8J4j55j80R2J45l8j3j88M26
$$ -220 -60 -26 -35 -220 -175 35 -104 212 -198 339 -16 -98 173 125 139 -16 -196 -104 41 3 -10 -198 228
6900B28l51J87j74kJ80J81j62n8J6k75L47k12K71j92j02j34K96j98K15L3n0j90
$$ 228 -123 64 -110 -112 68 249 87 29 45 -230 117 -95 176 -16 -118 -252 44 -154 61 94 44 -146
6922a46K84j52k34L45k92J79K3J13j4j89J22J69r6P4m44J87J27N8j9nn20O17k42
$$ -146 138 -14 -248 97 -195 -16 7 120 106 -83 39 208 112 186 -258 -71 56 114 95 90 -430 187 -55
6945e5j16lL5R2J97rk60m3J13J10j05P2K7j86l7J1L86k56l0O3J06r9p8k1J38p3
$$ -55 -171 -174 -139 -47 150 141 -119 -162 -49 61 -44 28 55 -131 -168 -157 229 -27 -57 6 112 13 -65 -86 52 -21
6971b1n5l8P5j7n0K03J00k57J83q0j33J87k33J38m22O13m3j05m03K59P3K59j30
$$ -21 -76 -114 -39 -56 -106 97 197 -60 123 43 -90 97 -136 2 -420 193 150 45 -358 -99 -26 233 103
6994A03L6k60N7J93O3k09J02k30Q6L4p5NM3K7O2q4N2k0p9j33L74r6J72j38k75
$$ 103 139 -121 -64 129 192 -17 85 -145 -59 -25 -100 -95 -52 -25 37 -47 5 -15 -94 -227 147 51 223 85 -190
7019a90L02l75L07M7n2J02l07J33j44L85l44J35j47J9K74j15J19o6j2j66K87m6
$$ -190 112 -263 44 91 39 141 -166 -33 -177 208 -136 -1 -148 -129 145 30 149 83 71 -95 192 146
7041A46p2O7l81o3J88J50J36j50O0L45l91k0n4K49k40M1r7K53o7k86J55K83k86
$$ 146 74 141 -240 -303 -115 35 171 21 81 426 35 15 -39 210 -30 11 -86 167 100 -186 -31 252 -34
7064c4K19R5j13k15o3p3J03K93j97o7O0O2j89l57O58k42k7j7K24N0r1k20K29k7
$$ -34 185 280 167 -48 -111 -184 -81 212 15 -52 8 70 -119 -476 182 -60 -87 -104 120 170 79 -141 88 61
7088F1K46n9j73j49K70l02Q8K55l64J95J03R1k16mR6q9k13J99j44J8J75J38m12
$$ 61 307 248 75 -74 196 -106 -18 237 -127 68 171 262 46 42 138 49 -164 35 -109 -91 84 222 -190
7111a90K37j28K29j6j53L27l97q9R1R6J27l74J36j0J49k67K45jr9J61k12J26K11
$$ -190 47 -81 148 132 -21 306 -91 -180 -89 7 134 -240 -104 -114 35 -232 13 12 -87 74 -138 -12 199
7134A99k26O3Q5j91j39K18J27Q9j50k24K02M1p9j27K9P0J69r1j34l20L28M63k43
$$ 199 -27 36 121 -70 -209 9 136 225 75 -149 53 94 15 -112 -83 -13 156 65 -69 -389 -61 402 159
7157A59j22k1J06O7j81o7J06Ql19N89r2k14jp6j83o4M15k9l58L3K72n9qJ57J68
$$ 159 37 16 122 189 8 -59 47 55 -264 325 233 19 18 -58 -241 -305 110 81 -277 -244 28 -31 -39 118 286
7182B86j27j00j06K84l11M9p9J26r3K03J7l7j27L9q1L22k6k66j05J10l7J68K74
$$ 286 159 59 -47 237 -74 -25 -104 22 -71 132 149 112 -15 24 -57 265 239 -27 -132 -22 -59 109 383
7205C83n00K3J6L13j13jq3o1r9M10m5j88l04K40QJ67j47j39K45j74j49J93J05
$$ 383 -117 -94 -78 235 122 121 38 -23 -122 288 243 55 -249 -9 -1 166 19 -120 125 -49 -198 -5 100
7228A00l78L33J1j02Q9j3m2J95l85K8K94j67K0J39k16K82k24L07l08J50J9k85
$$ 100 -278 55 66 -36 53 40 -2 193 -192 -164 130 -37 -17 122 -94 188 -36 271 -37 113 132 -153
7250a53L18k33J26k1k7m2O6j97L15j63J16l04L09j81J5P9q8L3j21p6K12K79j01
$$ -153 165 -68 58 37 10 -32 34 -163 152 -11 105 -199 110 -71 -56 23 -65 -32 -153 -229 -17 262 161
7273A61k57l1j8r5R3K59K05j96o2J00p2k04J38J0O2l56N98l36m1j5K17l25j44
$$ 161 -96 -127 -145 -240 -147 112 317 121 59 159 87 -117 21 31 93 -263 335 -1 -42 -57 160 -165 -309
7296c09L96l2M3nJ45l61J87J98j64m14M48K4j98R1J30j54j07k7K15J2Q4n2k52
$$ -309 87 55 98 93 238 -123 64 262 98 -316 132 156 -42 49 179 25 -82 -109 106 118 202 150 -102
7319a02L48l53j22k10P52m17L4n3J77j44QO0p9J79P6j14M8j59n2J49l67L03l7
$$ -102 246 -107 -229 -439 313 -104 -70 -123 54 -90 -82 -22 -101 78 154 40 88 -71 -123 26 -341 -38 -75
7342g5j96R6L71m39K36j16j03L46o4j37J50K8o1m16K92j10L70k03j87K21q2l7
$$ -75 -271 -175 196 -243 -7 -123 -226 120 56 -81 69 97 36 -380 -88 -198 172 -31 -218 3 -79 -116
7364a16K85l23J58K50r2p8K9M8K8k41m0K85m66L02j7k9J78k10Q0j45M3J40k60
$$ -116 169 -154 4 254 162 84 113 161 189 -52 -92 193 -273 29 12 -17 161 -49 31 -114 -71 69 -191
7387a91K9L05p7pL5l57J37J35M9k47K08J97k27L97k62r5j10q8K28J69O2k16J33
$$ -191 -162 143 66 59 94 -263 -126 9 58 -189 19 216 -11 386 124 29 -81 -169 59 228 290 74 207
7410B07j51j34nMm1Kqk1J25J38l39J00K15M2q6Q6k05O4J17j09p8j78J72o6K30
$$ 207 56 -78 -83 -79 -120 -118 -126 -147 -22 116 -223 -123 92 134 48 134 -71 -7 110 1 -77 -255 -83 -149 81
7435H1Ok38J02J09j68l5K39k57J03P8J64j64J22l27n1K57j45J24j16J07k15K54
$$ 81 87 -151 -49 60 -108 -143 96 -161 -58 20 184 20 142 -185 -236 21 -124 0 -116 -9 -224 30
7457C0q3L8K2K06j10j59q4M26k33j89J74J30Rn22O2Q1J89M3J27j67j7L7L0k55
$$ 30 -53 -15 7 213 103 -56 -140 286 53 -136 38 168 177 -345 -283 -202 -13 30 157 -10 -27 10 40 -215
7481b15K29P3l25K83k41M01j62k60J09J04k9J87l71j8P7J34L37m72J85r0O8Q3
$$ -215 14 87 -238 45 -196 205 43 -217 -108 -4 -33 154 -217 -235 -158 -24 313 -159 26 -64 4 87
7503H7j28p8J15r6oJ64j14M4qK3r5j59K14L29l85j4K31k58J84J99k03j40j71J37
$$ 87 -41 -119 -4 -100 -106 58 -56 -12 -20 3 -92 -251 -37 292 -93 -107 124 -134 50 249 46 -94 -265 -128
7527a28M18k93m17L76O0J05J16m01K28k09J88l39J80K11k41J36k44L58J4P7p2
$$ -128 290 -3 -420 -44 16 121 237 -164 64 -145 43 -296 -116 95 -146 -10 -254 104 118 195 123
7548A23j04J41j52j68J02J01n2K6J73l21K23j18k59K86j30j37L34l82K40L97r3
$$ 123 19 160 8 -160 -58 43 -9 17 190 -131 92 -26 -285 1 -129 -266 68 -314 -74 323 230
7569B30k06j58P0J28j48J95k8p2Q3J7kk17J14l2N7j90L04j85Q0k2J68k34Oj79
$$ 230 24 -134 -64 64 -84 111 83 11 94 111 109 -108 6 -26 31 -159 145 -40 40 18 186 -48 -42 -221
7593b21J01mJ89P2k48J60M6j69J39j15n2J43lj33r2J48N5j87K52j21O3k17J78
$$ -221 -120 -124 65 137 -111 49 95 -74 65 -50 -102 41 38 -95 -187 -39 16 -171 81 -40 23 -194 -16
7616a6n0L90n33K52p0k40K93m08M69R4m01J78J91J2j93j68O1K47l6L2j92o7jK56
$$ -16 -66 324 -209 43 -27 -267 26 -382 87 181 -220 -42 149 161 -32 -200 -139 108 72 104 -88 -155 -156 100
7640A00N8r7k52J37M9J07J25o1k72R7K7k8k46M8L20j13N0P1l05J46R3k33J84k53
$$ 100 158 61 -191 -54 -5 102 227 166 -106 -9 18 -10 -256 -208 112 -1 49 120 -185 -39 54 -179 5 -248
7664b48K4J90K37j76Q6o4R6j95J79Kk40J78j31k7j8J33jj47N6k8M10m70O3J57
$$ -248 -224 -34 203 27 113 49 145 -50 129 131 -109 69 -62 -89 -107 26 25 -122 -66 -94 316 -154 -91 66
7688F6j32J5K4J75L2q5j7o4K5N8j2N6j65J05N1k12J18q5K25j65PM7k03K54l4J33
$$ 66 -66 -51 -27 148 180 95 78 14 39 97 85 141 -24 81 132 -80 38 -47 178 13 20 67 -136 118 84 217
7714B17j18n7j70J64j15j97O6L20R6j90L01k00j20R2K5j89K58k57q1J68l0o4L5
$$ 217 99 42 -128 36 -79 -276 -210 110 206 16 317 117 -3 89 114 -75 183 -74 -155 13 -17 -81 -46
7737d6l8K98P1k43j68j5L00k86J57J44k46lJ53J47k40J42N2n36J97L92k97O2J17
$$ -46 -84 214 285 42 -126 -141 159 -127 30 174 -72 -75 78 225 -15 127 179 -357 -160 232 -65 -3 114
7760A14m3N5j80P3J69m05L55O5l54J41J61j35Q3n66M10o4K73l3j88R5j5J11J32
$$ 114 71 126 -54 19 188 -217 138 203 -151 -10 151 16 99 -467 -57 -121 152 119 -69 26 11 122 254
7783B54m86M9r9M24l20K77J02l11k12lN18m7j98l03M54j04O8k59L75k51J98r2
$$ 254 -232 -183 -282 142 -178 99 201 -110 -322 -325 193 146 -52 -355 99 -5 63 -196 179 -72 126 34
7805C4j2O3j81J68k1Q9k19k91L67r2M43m87J61N0j30J53j19O6j36J41O4j34kp1
$$ 34 22 85 -96 72 51 140 -79 -370 -3 -95 348 -139 22 72 -58 95 -24 42 -94 47 111 -23 -25 -96
7829i6J17K8o4N3k6n5J94j08m9j33L39j82j87R5L6L07k69N0k10J35O1n1j89L05
$$ -96 21 49 -15 38 12 -43 151 43 -6 -139 200 18 -169 -74 -38 269 0 50 -160 -25 36 -15 -204 101
7853A01k6l8K30l18L35k01o9K1J1J77r1j58j2K37j34L7k58L43K51l98O8j14J6
$$ 101 75 37 267 -51 284 83 14 35 46 223 132 -26 -38 199 65 102 -156 187 438 40 108 -6 10
7876A0N7k42J25j05K19M1l57M57j69L05l81q4J69j98j00J91k9K07n70K42J84K8
$$ 10 67 -175 -50 -155 64 105 -252 205 36 341 -40 -124 45 -153 -253 -62 -91 116 -454 -212 -28 0
7898@NN8p5l04J79M1j47J57J45J59j83j85K52n1K1J09j60R8r4j25K93j98K9K21
$$ 0 5 63 -12 -316 -137 -96 -243 -86 59 218 35 -150 102 51 72 181 21 119 25 -100 193 -5 24 245
7922B45j58J48m00L95p0j88Nk46m6L46J84j62J31k29o6K45j25k39L35lM7k49J53
$$ 245 87 235 -165 230 160 -28 -23 -269 -315 31 215 53 184 -45 -111 134 9 -230 105 102 149 -100 53
7945E3k74K54K48k78K4J4l45L04R3j49k05K52j15Q1k53J69K1j14K71k8m7n0J6
$$ 53 -221 33 281 3 27 41 -304 0 93 -56 -261 -9 -124 -43 -296 -127 -106 -220 51 23 -24 -74 -58
7968e8j8L21n74J60N3M2K3K2j47K84L4l91M46j18j87R6p1L4J05l7j52O5K13k53
$$ -58 -76 245 -329 -169 -116 -74 -51 -29 -176 108 142 -249 197 79 -108 -12 -83 -49 56 19 -133 -68 145 -108
7992a08n0J99k45K62L5l12M74l04J07P1j66L73k22k20J32j09R7j29M7J96l28K94
$$ -108 -158 41 -204 58 93 -219 255 -49 58 129 -37 336 114 -106 26 -83 14 -115 -68 128 -200 94
8014I4j61j11K84k03k39L23j4L07p8j11j58p7K01k02O3n8K10q5J07j27k2J95m0
$$ 94 -67 -178 106 -97 -336 -13 -27 280 202 91 -67 -144 57 -145 -82 -140 70 -15 92 -35 -57 138 98
8037I8j27k05K88P7j78J40p3K5j49m9K0L2N8R4l2n8K76j18j11k92J88J7k87L94
$$ 98 -29 -234 54 131 -47 93 20 45 -104 -153 -133 -101 -43 51 19 -39 237 119 8 -284 -96 -79 -366 28
8061B8j43j21K27k28L9J48J46J66l56M55n58J09q6L49N8j30o3R8k54J78Mq7k14
$$ 28 -115 -236 -9 -237 -198 -50 96 262 -94 361 -197 -88 -174 175 233 103 40 138 -116 62 66 -21 -235
8084b35R9P9k42M29q2j04j1J77l3j54j03O3J28J11j72N6Mj7J72k19j42K68J15
$$ -235 -136 -57 -299 130 48 -56 -67 110 77 -77 -180 -117 11 122 -50 6 10 -7 165 -54 -196 72 187
8107A87q7J1R3r4J73j35j16K33j30k25nK12k47jO9J73j06o6J71r7Q4q2j23L14
$$ 187 100 111 204 110 283 148 32 265 135 -90 -95 117 -130 -131 -62 111 5 -61 110 13 97 15 -108 206
8131B06l03J79O9J3j80k0j35L13k93K61l8j18P7L27l81J39m7o1P0j09k0M9rj32
$$ 206 -97 82 151 164 -16 -36 -171 142 -151 110 72 -46 31 358 -23 116 69 8 78 -31 -51 -2 -11 -143
8155a43O2m4P4J06L05m8l05k0J56j27M2j35L16j65p9J21k51K36j94Q6J46j19L
$$ -143 -81 -125 -51 55 360 312 7 -13 143 16 58 -77 239 74 -5 116 -135 101 -93 -7 139 20 23
8178B3j29J31j5K11k30j89l7P1J58k22J84n1K43
$$ 23 -106 25 10 221 -9 -198 -235 -164 -6 -228 -44 -95 148
8191A48
$$ Imaginary data points
##PAGE= N=2
##DATA TABLE= (X++(I..I)), XYDATA
0@%%%%%%%%%%%%Qj6J6j6K1k9L2m0M8n6P2q5R5j12J34j52J76k05K34k68L04l44
$$ 0 0 0 0 0 0 0 0 0 0 0 0 0 8 -8 8 -8 13 -16 16 -24 24 -32 40 -45 50 -62 72 -80 96 -109 125 -143 161 -183
34a83L90m40M94n54O22o95P75q64R58j062J179j305J441j590J753j931K127k345
$$ -183 207 -233 261 -293 329 -366 409 -455 503 -559 620 -685 756 -834 919 -1012 1115 -1230
52a230K587k854L149l480L858m289M783n360O044o870P892r195J0927j3354J7025
$$ -1230 1357 -1497 1652 -1828 2030 -2259 2524 -2836 3208 -3662 4230 -4965 5962 -7392 9633
67I633k3325L7123j24711Q4177J67838j59297o1779O1241K6974l1408N8598J9312
$$ 9633 -13692 23431 -101280 -17103 150735 -8562 -70341 -9100 17874 -13534 45064 64376
79F4376p7106l5986O9442P022j8801J4303k0446m9484L0576K3135l3141j0243
$$ 64376 -12730 -48716 20726 27748 8947 23250 2804 -46680 -16104 7031 -26110 -36353
91c6353M1756j56j3153N0477K0072q7810j5304P9977j8161o9058M2159L2049o7861
$$ -36353 5403 5247 -7906 42571 62643 -25167 -40471 39506 21345 -47713 -5554 26495 -41366
104d1366l695J05285N992j08199o710O9773l2011k4383P8127R709q5465n229O9417
$$ -41366 -45061 60224 66216 -41983 -48693 21080 -10931 -35314 42813 52522 -32943 -38172 31245
117C1245R555m3792j2903J263j1835J4206J4460j6324L0279L6947o6235m7972
$$ 31245 40800 -2992 -15895 -14632 -26467 -12261 2199 -14125 16154 53101 -13134 -61106
129f1106P5193M5163o7421l3000N5964J7399l4562J8888J0988o7515j746P5854
$$ -61106 14087 59250 -8171 -41171 14793 32192 -2370 16518 27506 -40009 -41755 34099
141C4099k6106q2625K9063P5339l786k2634K7199l626n0594J7838N3362k7320
$$ 34099 7993 -74632 -45569 29770 25984 3350 30549 26923 -23671 -5833 47529 20209
153B0209m4211O972K694K256K7493k662m0827n664L2292L75j5017L5827J6896
$$ 20209 -24002 -17030 -14336 -12080 15413 12751 -28076 -33740 -1448 -1073 -16090 19737 36633
166C6633m2130R864M6599l8453n1535L3489K6560m7184k0113N1643J3720l9813
$$ 36633 -5497 4367 50966 12513 -39022 -5533 21027 -26157 -46270 5373 19093 -20720
178b0720J8726M2080k8723k7874J7615k247r034K4412Q813l5211j3226L5413P691
$$ -20720 -1994 40086 11363 -16511 1104 -1143 -10177 14235 23048 -12163 -25389 10024 17715
191A7715l4175J4J5376j3517R029K4677j3263o431K8846k667m2026o842L4764
$$ 17715 -16460 -16446 -1070 -14587 -5558 19119 5856 -575 28271 25604 -16422 -23264 11500
204A1500m465l0861J8773J9126k9159K753L6491j3814l4678J0527K0965j1821
$$ 11500 7035 -23826 -5053 14073 -15086 -12333 24158 10344 -24334 -13807 7158 -4663
216d663n834K7678N337k3191R722J5495k5018j5544J1055k631m682P638m05j0191
$$ -4663 -10497 17181 22518 -673 9049 24544 -474 -16018 -4963 -7594 -12276 -4638 -5043 -15234
230a5234J0350K2874j0889k3841J6005J4816j7486O680K2881j3458j7695R900
$$ -15234 -4884 17990 7101 -16740 -735 14081 -3405 3275 26156 12698 -4997 4903
242D903L504k2584q715J8309l520j8660K1407K5970j2715n194J4075l287j3042
$$ 4903 8407 -14177 -22892 -4583 -8103 -26763 -5356 20614 7899 2705 16780 13493 451
255D51k676J257n494n20J0590m053j2817J2362Q157j4131j0R473l378P26J2231
$$ 451 -2225 -968 -6462 -6982 3608 -445 -13262 -900 7257 -6874 -6884 2589 -789 -63 12168
270A2168L116j0089m061P392j0048j7739Q974O337j1700N920J7977J04o712L859
$$ 12168 15284 5195 1134 8526 -1522 -19261 -10287 -3950 -15650 -9730 8247 8351 1639 5498
284E498O652o780q502M562l18p358R392O580r802l354J502k656k482j802J075
$$ 5498 12150 5370 -3132 1430 1112 -6246 3146 9726 -76 -3430 -1928 -4584 -7066 -8868 -7793
299g793K443L678Q525M74l441O382k273j1168L159M007n832k264M498M589l870
$$ -7793 -5350 -1672 6853 7327 3886 10268 7995 -3173 -14 3993 -1839 -4103 395 4984 1114
314A114o809K457j101o860M053M906j87N340O183L366o64o851j766j306p269k551
$$ 1114 -5695 -3238 -4339 -11199 -7146 -2240 -2427 2913 9096 12462 11798 4947 3181 1875 -5394 -7945
330g945M38N69M702R36L74M529j797k117K111r06J560J607j809J371N25l712l284
$$ -7945 -7507 -6938 -2236 -1300 -926 3603 1806 -311 1800 894 2454 4061 2252 3623 4148 436 -2848
347b848m960j754K087p6M297O781P39M549M861n447m258j432l602m289k486K605
$$ -2848 -7808 -9562 -7475 -7551 -3254 3527 4266 8815 13676 8229 3971 2539 -1063 -5352 -7838 -5233
363e233K199l602M753N069o457j032N719j264q14N056L755j785l366L762k61j0150
$$ -5233 -3034 -6636 -1883 3186 -3271 -4303 1416 152 -662 4394 8149 6364 2998 6760 6499 -3651
379c651j995K047o472J861P714K83q85L361J524l483k237M324j549p216Q301P941
$$ -3651 -5646 -3599 -10071 -8210 -496 -213 -1098 2263 3787 304 -1933 2391 842 -6374 1927 9868
395I868q397o21O230m648p031J284P33o615j443J2772L888q212L828O191p650
$$ 9868 1471 850 7080 2432 -4599 -3315 -2582 -9197 -10640 2132 6020 -2192 1636 7827 177
410A77k19N615m966n979M336M100l958j147P518m289j3391O442R258o059J188
$$ 177 -42 5573 607 -5372 -1036 3064 -894 -2041 5477 1188 -12203 -5761 3497 -2562 -1374
425a374R289k235m774N911M050j0887r159N561j308p170Q486O327q343M137J3127
$$ -1374 7915 5680 906 6817 10867 -20 -9179 -3618 -4926 -12096 -3610 2717 -5626 -1489 11638
440A1638m265j0605L336P110m783l051Q374m108j2731O510P386j0730k539M543
$$ 11638 7373 -3232 104 7214 2431 -620 7754 3646 -9085 -2575 4811 -5919 -8458 -3915
454c915l691k063J2848J0306q484m866Q316l669r532R243L031j6028l460J3721
$$ -3915 -7606 -9669 3179 13485 5001 135 8451 4782 -4750 4493 7524 -8504 -11964 1757
468A757K836n806J384J086p788K94J2445m841j2273J2005J0232r028k476O709
$$ 1757 4593 -1213 171 1257 -6531 -6237 6208 1367 -10906 1099 11331 2303 -173 6536
482F536o000q365P634P083j0749o361J1115J525m834R726P19j5993j560J2130
$$ 6536 536 -7829 -195 6888 -3861 -10222 893 2418 -2416 7310 8029 -7964 -9524 2606
496B606q5l832O666K165j3667k153J7774j506j6430P47M701m977O506J1842m644
$$ 2606 2521 -1311 5355 7520 -6147 -8300 9474 7968 -8462 -7715 -3014 -7991 -1485 10357 5713
511E713r631O415P168q418l146P250q161r170J4238N916j5828l103J3251L94q654
$$ 5713 -3918 2497 9665 1247 -1899 5351 -2810 -11980 2258 8174 -7654 -10757 2494 2888 -5766
526e766L872O261p048O16J4842j522j0298L186l067j2574N553J3506p809j4422
$$ -5766 -1894 4367 -2681 -2065 12777 11255 957 4143 1076 -11498 -5945 7561 -248 -14670
540a4670O310J2233l200J066R420r197j3182J0929J0072q054k390M740m870m510
$$ -14670 -8360 3873 673 1739 11159 1962 -11220 -291 9781 1727 -663 4077 -793 -5303
554e303P926K925j3200j214J3596m136r175J1370O502j0517n73R004m421j0595
$$ -5303 2623 5548 -7652 -8866 4730 594 -8581 2789 9291 -1226 -1799 7205 2784 -7811
568g811M806O917o672j40R917o481q398J0144M280r808O96O721o707o562J3367
$$ -7811 -3005 3912 -2760 -2900 7017 536 -7862 2282 6562 -3246 -2550 4171 -2536 -9098 4269
583D269R309j1785p136P868m234n654Q988J605j0866K014J0171l038n696P954
$$ 4269 13578 1793 -5343 2525 -1709 -7363 1625 3230 -7636 -5622 4549 1511 -4185 3769
597C769M986j2012k365J2101k864p594Q349K751j0223j263N502m224o139O826
$$ 3769 8755 -3257 -5622 6479 3615 -3979 4370 7121 -3102 -4365 1137 -3087 -9226 -2400
611b400N475p995J103J0227l119l767R551p50j3907o71J0232j600o897N074K273
$$ -2400 3075 -4920 -3817 6410 3291 -476 9075 8325 -5582 -6253 3979 2379 -4518 556 2829
626B829r893P09J1560l827p696O950K681n719K893P801m492p393N759J985j1686
$$ 2829 -7064 -6355 5205 1378 -6318 632 3313 -2406 487 8288 3796 -3597 2162 4147 -7539
641g539J92J0914k812n520O921K257o328J362N856m198n140N271J772q703K817
$$ -7539 -7347 3567 755 -4765 2156 4413 -1915 -553 5303 1105 -4035 1236 3008 -5695 -2878
656b878J0158n314p356N774K30o120K949P795l480o522O032N132o745K05O445
$$ -2878 7280 1966 -5390 384 614 -5506 -2557 5238 1758 -4764 1268 6400 -345 -140 6305
671F305o638o446N883K370l629J346M217m793m610O189K946p147J850O536m387
$$ 6305 -333 -6779 -896 1474 -2155 -809 3408 -1385 -5995 194 3140 -4007 -2157 4379 -8
686hj929P430Q63o864k36M198l876n889M253K858n998K732P176m941m683O348
$$ -8 -1937 5493 6356 -508 -744 3454 -422 -6311 -2058 800 -5198 -2466 4710 -231 -4914 1434
702A434K598m449K84L668k667l242N334J551o900m54L680m604k019O538J910l939
$$ 1434 4032 -417 -133 3535 868 -2374 2960 4511 -2389 -2843 837 -3767 -5786 752 2662 -1277
718a277Q76M139j136l345L455K17p160Q44M903l152j543N115J61m455Q51M228
$$ -1277 -401 3738 2602 -743 2712 2929 -4231 -3387 1516 -1636 -3179 1936 2097 -2358 -1507 2721
734B721j790l372L962K111m735J158M277m207l366K758M75l694N56L171q6j322
$$ 2721 931 -2441 1521 3632 -1103 55 4332 125 -3241 -483 -8 -3702 -3146 25 -61 -1383
750a383L922J220m717Q60K871k770j359L176k78l477J143L496j875m005J939P64
$$ -1383 2539 3759 -958 -98 2773 3 -1356 1820 1542 -1935 -792 2704 829 -3176 -1237 -473
766d73l471J657M185k126o59L079Q73k440k96J757j682k262K098J139l186J473
$$ -473 -3944 -2287 1898 -228 -887 2192 3065 625 329 2086 404 -1858 240 1379 -1807 -334
782c34J712k626j125J860j50j172P12L073m04j269K021N69l308K47Q68k506o82
$$ -334 1378 -1248 -2373 -513 -663 -1835 -1123 1950 1546 277 2298 2867 -441 -194 674 -1832 -2514
799b514J840L80o31R57K371r97k297J985Q6k299R86J344j340j003J119J4j318
$$ -2514 -674 -294 -925 32 2403 1406 -891 1094 1180 -1119 -133 1211 -129 -1132 -13 1 -1317
816a317n13Q58L09o85K338J151j144Q24P63j526m66n78j018j012J55J020J95j154
$$ -1317 -1830 -972 -663 -1348 990 2141 997 1821 2584 1058 592 14 -1004 -2016 -1861 -841 -646 -1800
834a800J903M30j518O01Q16m23J62O42L65N53q15L52o99j360o3j77j056J018M03
$$ -1800 103 533 -985 -384 432 9 171 813 1178 1731 916 1268 569 -791 -854 -1031 -2087 -1069 -666
853f66j72J063L71n74K29o51L85K35o75J223M85m33M0l15m45l24j305o2J083n22
$$ -666 -838 225 596 22 251 -400 -15 220 -455 768 1253 820 860 545 100 -224 -1529 -1591 -508 -1030
873a030O13J046K2O96l79n27j87q94mN13p87K65J138j026J94R72m94o11R7P57
$$ -1030 -417 629 651 1347 968 441 254 -640 -644 -131 -918 -653 485 -541 -347 625 131 -480 -383 374
893C74O05n46P19J035k314n30N72j237r56O53M03K44Q08J277J27q98R40Q26j903
$$ 374 979 433 1152 2187 -127 -657 -85 -1322 -2278 -1625 -1222 -978 -170 1107 1234 336 1276 2102 199
912A99j11R09j340r5J231l7j699q95J101k11r04J424J217j762J038K417p77q13
$$ 199 88 997 -343 -438 793 756 -943 -1838 -737 -948 -1852 -428 789 -973 65 2482 1705 892
930H92K86q47j334o8J759k33k042J432J138k172P17J623k094q97K006R13j246
$$ 892 1178 331 -1003 -1071 688 455 -1587 -155 983 -1189 -472 1151 -943 -1840 166 1079 -167
947a67L3J733m29k028J278O88l445N16K661m71o54R46r8j402Q02J907j123k615
$$ -167 -134 1599 1170 -858 420 1108 -2337 -1821 840 369 -285 661 563 -839 -37 1870 747 -1868
965a868J560J040k280J589K379k801k530J740J572j476m71K568o31j749L097J632
$$ -1868 -308 732 -1548 41 2420 -381 -2911 -1171 401 -1075 -1546 1022 391 -1358 1739 3371
981C371k876k62J157k323r51J895P5k176K38L330j169k643K095J480k251J031
$$ 3371 495 233 1390 -933 -1884 11 86 -2090 -1852 1478 309 -2334 -239 1241 -1010 21
997B1K592j529j726J459J331j902m45J105k697k322L872J753l142J098K201k094
$$ 21 2613 1084 -642 817 2148 246 -199 906 -1791 -4113 -241 1512 -1630 -532 1669 -425
1013d25q31K572J000l198j001K869k36j888K907Q7l564K75K406j837r25K308O62
$$ -425 -1256 1316 2316 -882 -1883 986 750 -1138 1769 1856 -1708 -1433 973 -864 -1789 519 1181
1030A181k130M36L086k122k446K850O69l787P43K342j224n57K764J79l188l46
$$ 1181 -949 -513 2573 451 -1995 855 1524 -2263 -1520 822 -402 -959 1805 1984 -1204 -1550
1046a550L148j198k231L782M79m157R43L043j776j545R96j30k649O38L760r14
$$ -1550 1598 400 -1831 1951 2430 -1727 -784 2259 483 -1062 -66 -196 -2845 -2207 1553 639
1062F39k160L064K75l141J565K631k643j541K214P13k953j96L606k353k571K692
$$ 639 -1521 1543 1818 -1323 242 2873 230 -1311 903 1616 -1337 -1533 2073 -280 -2851 -159
1078a59J36l123K098L020j395r77J969N93l321P73L211k379l206K902O17k910
$$ -159 -23 -3146 -1048 1972 577 -400 1569 2162 -1159 -386 2825 446 -2760 142 759 -2151
1094b151K187K608k692k339J846J565k093P91K572k451k282M223N5l549R17J938
$$ -2151 36 2644 -48 -2387 -541 1024 -1069 -278 2294 -157 -2439 1784 1839 -1710 -793 1145
1110A145k203j347L219J128l198Q52L350k301k457K572k9k819J346K593k170j814
$$ 1145 -1058 -2405 814 1942 -1256 -404 2946 645 -1812 760 731 -2088 -742 1851 -319 -2133
1126b133K131J115k416N15K599k876j942M374J435k741Q46J284k954j209K877
$$ -2133 -2 1113 -1303 -788 1811 -1065 -3007 1367 2802 61 907 2191 -763 -1972 905
1141I05J032l843k73L079j847j135M091j87l922P59K576j122r36K599N68l314
$$ 905 1937 -1906 -2179 900 -947 -2082 2009 1822 -2100 -1341 1235 113 -823 1776 2344 -970
1157i70Q05K869k807k209K772k44k683J522K308j677j697K855J283l156J69K456
$$ -970 -165 2704 -103 -2312 460 216 -2467 -945 1363 -314 -2011 844 2127 -1029 -860 1596
1173A596k355q92L643m73l058Q26K012j531j222K331M7l522J425L711k024j081
$$ 1596 -759 -1651 1992 1519 -1539 -713 1299 -232 -1454 877 924 -2598 -1173 2538 514 -567
1189e67K006p40l071J324K579j848j608J939Q42j951J617K118k552j703K985m66
$$ -567 1439 699 -2372 -1048 1531 -317 -1925 14 856 -1095 522 2640 88 -1615 1370 904
1205I04k256J520J503j837j222J963N67l430J005K449k259p73K976k79k030J547
$$ 904 -1352 168 1671 -166 -1388 575 1142 -2288 -1283 1166 -1093 -1866 1110 831 -1199 348
1221C48K136j910j426J636J94k301J079K346k464j389K117m07j498Q88J533j968
$$ 348 2484 574 -852 784 978 -1323 -244 2102 -362 -1751 366 -41 -1539 -651 882 -1086
1237a086p12K570J030k359R79J820k547r25K167n13j922J110J524j191j345K144
$$ -1086 -1798 772 1802 -557 422 2242 -305 -1230 937 424 -1498 -388 1136 -55 -1400 744
1253G44R5k116O46J911j856o71K546m92j664P05J500j785q50J442M43j780J201
$$ 744 839 -1277 -631 1280 -576 -1247 1299 807 -857 -152 1348 -437 -1287 155 598 -1182 19
1270A9J383j412l25J666q92j079L85R38j403l40J708r5j562N48J555j792l08J962
$$ 19 1402 -10 -335 1331 439 -640 -255 683 -720 -1060 648 553 -1009 -461 1094 -698 -1006 956
1288I56m59j066R66J320j223o92J125l33j830R84O35j390j75J459j42o36N44M11
$$ 956 497 -569 397 1717 494 -198 927 594 -1236 -252 383 -1007 -1182 277 135 -501 43 454
1306D54o77m37J257J64j131Q58J042j384j05N19l95j028K47O08m61p02J666Lj100
$$ 454 -223 -660 597 761 -370 488 1530 146 41 560 165 -863 -616 -8 -469 -1171 495 498 -602
1325f02Q07N77j105l39R64k97l50L87Q36o02p16P29K19j067J50P98p94J72J103
$$ -602 205 782 -323 -662 302 5 -345 42 878 276 -440 289 508 -559 -409 389 -405 -233 870
1344H70l82k32o0k20on33K24K40p38P43J028q51L9N09l16m02J80J71qm82L95J9
$$ 870 488 256 196 -24 -30 -563 -339 -99 -837 -94 934 83 122 631 315 -87 93 264 256 -226 169 188
1366A88n68M57k58n68L54o6%M00O4N61k5j54J66q7n80K21K11o08L52M2q8O9l64
$$ 188 -380 77 -181 -749 -395 -461 -461 -61 3 564 539 385 551 464 -116 105 316 -292 60 102 14 83 -281
1389b81k04o7j95M14M90m3K59k24k5K69j79m31K45j98r3O38j88m3J78k88K7l33
$$ -281 -485 -552 -747 -333 157 114 373 149 124 393 214 -217 28 -170 -263 375 187 144 322 34 61 -272
1411b72o2M54n92M2R21o00K79K92m96J70n17N07l9k43J88J98K3L2N48q94N9k19
$$ -272 -334 120 -472 -430 491 -109 170 462 -34 136 -381 126 87 -156 32 230 253 285 833 -61 -2 -221
1433b21Q4k6j57L02n35O6R29j27r90M22N58n59n8J159m12k56o8J52J31r52N76
$$ -221 -137 -163 -320 -18 -553 -487 442 315 -675 -253 305 -254 -312 847 435 179 111 263 394 -558 18
1454A8j38o84L22R16j088q6J189m88m78N11M45m85n79J300L19j167M47L91o20
$$ 18 -120 -804 -482 434 -654 -740 449 -39 -517 -6 439 -46 -625 675 994 -173 274 665 45
1473D5m93R80p26m44L31P37m05n08R70P3j266L48J105q15k97J051l87o72M15P91
$$ 45 -448 532 -194 -638 -307 430 25 -483 487 560 -706 -358 747 -68 -365 686 299 -373 42 833
1493H33n51j104J259J13j390Q55N56r19j60J033j63j471O21P75n92m14J344Q7
$$ 833 282 -822 437 550 -840 15 571 -348 -508 525 362 -1109 -488 287 -305 -719 625 712
1511G12j273P00Q26r07n70R49m52o12O37J012j055r45J232l9j312Q97R71j354
$$ 712 -561 139 965 58 -512 437 -15 -627 10 1022 -33 -978 254 215 -1097 -200 771 -583
1529e83l50J467K7n76L39O37j091r19J714J0j669J233Q59j539l25Q65j14q24K38
$$ -583 -933 534 561 -15 324 961 -130 -1049 665 675 -994 239 1098 -441 -766 99 -15 -839 -601
1548f01J154r31j51J040O3j191R38J023k125J78J393l26r92Q60N74r55r01J795
$$ -601 553 -378 -529 511 574 -617 321 1344 -781 -603 790 464 -528 332 906 -49 -950 845
1566H45m16j467Q81P20j174j27J310J29j314L02Q36o46m79J522k61j874J360R98
$$ 845 429 -1038 -157 563 -611 -738 572 701 -613 -311 525 -121 -600 922 661 -1213 147 1145
1584A145j421J33Q26n75j170O27J108j133m70J531n71r12J010L70j179J37J508
$$ 1145 -276 -143 683 108 -1062 -435 673 -460 -930 601 30 -882 128 498 -681 -544 964
1601I64k13j376N35J157j112j35J486p89k011J200O61o85l5J054m31j223P49J069
$$ 964 751 -625 -90 1067 -45 -180 1306 517 -1494 -294 367 -318 -353 701 270 -953 -204 865
1619H65r38q46J720n70r15R47R77j661j77J286p56o93Q99P08j591j13J594o7j655
$$ 865 -73 -919 801 231 -684 263 1240 -421 -598 688 -68 -761 138 846 -745 -858 736 669 -986
1638i86Q90N87j257l1J465k27j242O82J109r01m58J163m11j159J060O88j321j62
$$ -986 -96 491 -766 -797 668 441 -801 -119 990 89 -369 794 383 -776 284 972 -349 -511
1656e11R91m75n20L57Q41j388o29K092n17q83J077M13j160k43J228l1j297O20
$$ -511 480 5 -515 -158 683 -705 -1334 758 241 -642 435 848 -312 -555 673 642 -655 -35
1674c5M85j046j29J606q66r52J023L57q13j93Q45j87o29O19N25r63n7J423o83
$$ -35 450 -596 -725 881 15 -937 86 443 -370 -563 282 95 -534 85 610 -353 -410 1013 330
1693C30r76R85M88j220j37J102k8j238O92L18j440K72J566n26j094R87M45r71
$$ 330 -646 339 827 -393 -530 572 544 -694 -2 316 -1124 -852 714 188 -906 81 526 -445
1711d45K22Q58k71p55L05J119j159j17J195o38q01O34J57p48k45J106m08j005
$$ -445 -223 635 364 -391 -86 1033 -126 -243 952 314 -487 147 304 -444 -689 417 9 -996
1729i96J297O33j275k03J172n82o17O98M94o50j38R20l55r80O88K25r07N0J046
$$ -996 301 934 -341 -544 628 46 -571 127 621 -29 -167 753 398 -582 106 331 -576 -526 520
1748E20k84j102J086L34p71k2M15j38o31N88Q90j145R3R59p13o46O96L30r57K85
$$ 520 236 -866 220 554 -217 -239 176 38 -593 -5 885 -260 -167 792 79 -567 129 459 -498 -213
1768b13N62j69n61K79L08n77r1J073o15m85Q02j16j07o1M47J8r28O68K28p23p1
$$ -213 349 180 -381 -102 206 -371 -462 611 -4 -489 313 197 90 29 476 494 -434 234 462 -261 -332
1789c32N89l84j45M67J38p62m8M13M58p59K28L85p87M48O98l01m16K86P6n33J63
$$ -332 257 -127 -272 195 333 -429 -477 -64 394 -365 -137 248 -539 -91 607 306 -110 176 252 -281 -118
1810a18N27k47m76L32J22k40k9L86o65Q0N10K45m36K4L65l69l98N82j17j15m1
$$ -118 409 162 -314 18 140 -100 -129 257 -408 -328 182 427 -9 15 380 11 -387 195 78 -37 -78
1831g8K15k88l00N42L1l72J46M0O5m79O34q7m12L53K15j09l37J57P5Q9j61K23
$$ -78 137 -151 -451 91 122 -250 -104 -64 1 -478 156 69 -343 10 225 116 -221 -64 11 100 -61 162
1853A62o5j84K44M20q54K25J39m42K76K5R6k35j16K59Q9k43L05J84k21J64Q7j80
$$ 162 97 -87 157 577 -277 -52 87 -355 -79 -54 42 -193 -309 -50 39 -204 101 285 64 228 315 135
1875A35j13JJ30l9n51N56k58l08K71J97l89M01M0j97J67k21J09J38J9J1N7k96
$$ 135 22 23 153 114 -437 119 -139 -447 -176 21 -368 33 73 -124 43 -178 -69 69 88 99 156 -140
1897a40M03l56J80qm40K43L22l83J57J58l89K51k57L31J3K2k3j71Q8l1K83l17
$$ -140 263 -93 87 79 -361 -118 204 -179 -22 136 -253 -2 -259 72 85 107 84 -87 1 -30 253 -64
1919f4o9J79j76K19k86N5l9J96j78J51J4k79M65m66P6L06m2n3J21L14m84L29m8
$$ -64 -133 46 -130 89 -197 -142 -181 15 -163 -12 2 -277 188 -278 -202 104 62 9 130 444 -40 289 241
1942B41q1J59k42N0q7K62l44J72k42K31n24K25R5J45kk46L16K85n44K02k2j09
$$ 241 160 319 77 127 40 302 -42 130 -112 119 -405 -180 -85 60 58 -188 128 413 -131 71 49 -60
1964f0n5J22q2j02j67M05M8j98j43K47j06k41M28Oq5M0J09j94M6q7J38k69L99
$$ -60 -115 7 -75 -177 -344 61 109 -89 -232 15 -91 -332 96 102 17 57 166 -28 18 -69 69 -200 199
1987A99p6n1j98J23k03J05J58J22j81k49K77L69o45J22K28J1p6K87j82k48K44
$$ 199 123 72 -126 -3 -206 -101 57 179 -2 -251 26 395 -250 -128 100 111 35 322 140 -108 136
2008A36R7l19L04L50n50l57K23J75m76M32K73k75j75J45j95J36k55M37j48N9L89
$$ 136 233 -86 218 568 18 -339 -116 59 -417 15 288 13 -162 -17 -212 -76 -331 106 -42 17 406
2029D06k99j79J78M85m27k18n8L43j61m13K26nj72K47K75k95Q8J53p3K7NK16k35
$$ 406 107 -72 106 591 164 -54 -112 231 70 -343 -117 -122 -294 -47 228 -67 21 174 101 128 133 349 114
2052A14k16L72r9m60N92L0p85K88L11j50k5J57k63J36l1L56j53n92M33L5j59J29
$$ 114 -102 270 171 -289 303 333 -452 -164 147 -3 -28 129 -134 2 -29 327 174 -418 15 50 -109 20
2074B0K44k93N3O3Q6l59j02N28r9k02K03K6m92j09N39k19j01K61n4j03JK28m3
$$ 20 264 -29 24 87 173 -186 -288 240 141 -61 142 168 -324 -433 106 -113 -214 47 -7 -110 -109 119 76
2097G6k53M52J5l97n5N67k65l94L00l0k39%M82n23k21O20q9o2R3J74k37j37M18
$$ 76 -177 275 290 -107 -162 405 140 -254 46 16 -223 -223 259 -264 -485 135 46 -16 77 251 14 -123 295
2120B95j9m29p5O58o19k4L76j57l33L06J68l94RN51om82L90K46o68k70N58Pj52
$$ 295 276 -153 -228 430 -189 -213 163 6 -327 -21 147 -247 -238 313 307 -175 215 461 -207 -477 81 88 -64
2143f4M88k4n86l3L43J64n10m4N37j43l85K01K55l82j45M72k42p6L06O9p5j5P6
$$ -64 424 400 -186 -219 124 288 -222 -266 271 128 -257 -56 199 -183 -328 144 -98 -174 132 201 126 111 187
2166A87j66k34O44l32j75Q4k91M8k34M00L10n24J29J04P2j87L46K06n01L36J00
$$ 187 21 -213 431 99 -76 8 -283 -235 -469 -69 241 -283 -154 -50 22 -165 181 387 -114 222 322
2187C22l48j95N48q4m93M3J95j00j76j05O01m20J33L06l89J85K52J54p12L70j47
$$ 322 -26 -221 327 243 -250 -207 -12 -112 -288 -393 208 -212 -79 227 -162 23 275 429 -283 87 -60
2208f0J01l87M54J02l29j30J88j66l8L94J27n48N0K60m02L38M04n11j45L66lm41
$$ -60 41 -346 108 210 -119 -249 -61 -227 -265 129 256 -292 -242 18 -384 -46 358 -153 -298 68 65 -376
2230c76K77J44L42n42O3K54l00j79M84k4o0q5L45o07P5J04J63m93J03M89k46k69
$$ -376 -99 45 387 -155 -92 162 -138 -317 167 143 83 -2 343 -264 -189 -85 78 -415 -312 177 -69 -338
2252c38N42o6k87O8L48k68R7oQ0m56K46K47m61j25N18j68m8j2L56k08k27N74k16
$$ -338 204 138 -149 -81 267 -1 96 90 170 -286 -40 207 -254 -379 139 -29 -77 -89 267 59 -168 406 190
2275A90l22J06K92n42RN76l96j57J17j7o4j2J36K39k10j51M67k38P8k1l7k40J42
$$ 190 -132 -26 266 -276 -267 309 -87 -244 -127 -144 -208 -220 -84 155 -55 -206 261 23 101 80 43 -197 -55
2298e5J69l73j3N66J8o80L98J89n60J94M96m93j36J06n0O0k13M45k23K5J63M4
$$ -55 114 -259 -272 294 312 -368 30 219 -341 -147 349 -144 -280 -174 -224 -164 -377 68 -155 -130 33 77
2320G7R4k03J60kj74J00o3j54k31M01o1k90J09L57k48K9J0J24J33j62l9J80l10
$$ 77 171 -32 128 126 -48 52 -11 -165 -396 5 -56 -346 -237 120 -128 -99 -89 35 168 6 -33 147 -163
2343a63N13l90j15L28M9o41K41J08J2o7l32O31k09r7L47k28N3J37p2k02J33Q4
$$ -163 350 -40 -155 173 222 -419 -178 -70 -58 -125 -457 174 -35 -132 215 -13 40 177 105 -97 36 120
2365A20j04J81k54M91q51K66L99q6k24K1M34n59J93K21k12L4J00Q4k56J7K18j92
$$ 120 16 197 -57 434 -417 -151 248 162 -62 -41 393 -166 27 248 36 70 170 254 -2 15 233 41
2387D1m47N98j29rk31L57k38J7J79j05nL8Mk01K34k7k89J82j77K39j19O8q8K76
$$ 41 -406 192 63 54 -177 180 -58 -41 138 33 28 66 70 -131 103 76 -213 -31 -208 31 -88 -20 -108 168
2411A68or1K52k37j10O0k6k08J80n6n3L57k26J2j19K73j61K2m4o6L73j06O8k88
$$ 168 162 71 323 86 -24 36 10 -198 -18 -74 -127 230 4 16 -103 170 9 31 -13 -79 294 188 256 -32
2435c2j48M80k25m5k63L60j09o4j76J38q4L61l2j14P4l99R6L2J13K31R1m37J70
$$ -32 -180 300 75 30 -233 127 18 -46 -222 -84 -168 193 161 47 121 -278 -182 -150 -37 194 285 -152 18
2458A8j70K05n3J09p6j0j73J63J3K97k93o9qj83K93j74Q4k0M5K69k89q5J30K1
$$ 18 -152 53 0 109 33 23 -150 13 26 323 30 -39 -47 -230 63 -111 -27 -47 -2 267 -22 -107 23 44
2482D4N8nj37J04l5j48J52J69m41J94J87j94j03K18j09j70M46n5j33k7K15l23
$$ 44 102 97 -40 64 29 -119 33 202 -239 -45 142 -52 -155 63 -46 -216 230 175 42 15 230 -93
2504i3n0K22J35l20q8N9J48Mj0J85j99q6j12L64m04K38L88n55K07q4n24N54j46
$$ -93 -143 79 214 -106 -194 -135 13 17 7 192 -7 -93 -205 159 -245 -7 381 -174 33 -51 -575 -21 -167
2527a67L33om32K00J73j83o9J70j85K9J39J0j46J30J15k08J73K0j61m2K77p0N9
$$ -167 166 160 -272 -72 101 -82 -151 19 -166 -137 2 12 -134 -4 111 -97 76 96 -65 -107 170 100 159
2550A59j30N9K16j38j78J71ql97J86J01n11N49jO4l74j61M29j56K16K45l99R3
$$ 159 29 88 304 166 -12 159 151 -246 -60 41 -470 79 78 142 -232 -393 36 -120 96 341 -58 35
2572C5j12J0J80j61L79m44N5K0OJ64r6P8M0j73K47j30Q7J43j99q6K25k4j90j44
$$ 35 -77 -67 113 -48 331 -113 -58 -38 -32 132 36 114 154 -19 228 98 185 328 129 43 268 244 54 -90
2596i0N5J43l72L0M50j18k71K8J77k09K49R1j61q0j76K90j29k5M81m99M78J10
$$ -90 -35 108 -264 -234 216 98 -173 -145 32 -177 72 163 2 -78 -254 36 -93 -118 363 -136 342 452
2618D52m41j58M02j11m3nJ22Q0m14R1K36m46K63j2r3n8M6K60k46l2J73K95j15
$$ 452 11 -147 255 144 101 96 218 298 -116 -25 211 -235 28 16 -77 -135 -89 171 -75 -107 66 361 246
2641B46k89K61l33q1K83j83K25m34M20k2j20K78j20n09N29j0m7l4J53p4k09J98
$$ 246 -43 218 -115 -196 87 -96 129 -305 115 93 -27 251 131 -378 151 141 94 60 213 139 -70 128
2663A28j74j46k28K44j5p0L24j55j61N6J88P2R6m6N3k77j5K15j24j72R1M3l98
$$ 128 -46 -192 -420 -176 -191 -261 63 -92 -253 -197 -9 63 159 113 166 -111 -126 89 -35 -207 -116 -73 -471
2686d71L69P7K54j41p1l22L01q1K47Jl93K99K6k36K89l4k95J88L2Q4L15j89k27
$$ -471 -102 -25 229 88 17 -305 -4 -85 162 163 -230 69 95 -141 148 114 -181 7 39 123 438 249 22
2709B2k01K74k43OJ8k94N82k46k8j22N05r3l29K67j55K45q7L0j95Q8r2p4J94j44
$$ 22 -179 95 -148 -142 -124 -418 164 -82 -110 -232 273 180 -149 118 -37 208 121 151 -44 44 -48 -122 72 -72
2733g2j54lL2J81l4K4K19N0l01J08K49j94m28L50K18l69j52M99o6J7l8j64j62
$$ -72 -226 -229 -197 -16 -50 -26 193 243 -58 50 299 105 -323 27 245 -124 -276 223 157 174 136 -28 -190
2756a90K30J7P3n2n0L18l33K88j94j11k72M05q2j10J14j06K70k68j18K08j09j47
$$ -190 40 57 130 78 28 346 13 301 107 -4 -276 129 47 -63 51 -55 215 -53 -171 37 -72 -219
2778b19J49M24m97L01rj44p3Qk46m4M92k83J1O5M15j71j94N0J18l43L00j85j1
$$ -219 -70 354 -143 158 149 5 -68 -60 -306 -350 142 -141 -130 -65 350 179 -15 35 153 -190 110 -75 -86
2801h6J29k29J52q5l20M84j5k2j7K61m84K73J64k55j71L68r8l15L80k9k60p5J00
$$ -86 43 -186 -34 -119 -439 45 30 8 -9 252 -232 41 205 -50 -221 147 49 -266 114 85 -175 -250 -150
2824a50M05n58M06K2N3j81k8M0k79K17O5O0Qj2M8K4l65J47j24K18m5J34J00k05
$$ -150 255 -303 103 125 178 -3 -31 9 -270 -53 12 72 80 68 116 140 -225 -78 -202 16 -29 105 205 0
2848@K9O4j34K4M5m28O99m88NJ71j56K92Q5j88J90Q3j13k07k34L69k74L84m92
$$ 0 29 93 -41 -17 28 -400 299 -189 -184 -13 -169 123 208 20 210 293 180 -27 -261 108 -166 218 -274
2871b74J09J44qk01J34J07K88k12l8J52%n0J4o8J62l95L33m71K05J23m05L24M7
$$ -274 -165 -21 -29 -230 -96 11 299 87 49 201 201 151 165 97 259 -136 197 -274 -69 54 -351 -27 20
2894B0lK28q3k25K82l81K08L3Q7k56J83N8m43L05k7k5J01j5k94L72k49M60k39
$$ 20 17 245 162 -63 219 -162 46 79 166 -90 93 151 -292 13 -14 -39 62 47 -247 125 -124 336 97
2917I7k40pK88j36N6l80L44r6J52l77K80J00j55K59l53M26p3m40M77j35l67L70
$$ 97 -143 -150 138 2 58 -322 22 -74 78 -299 -19 81 -74 185 -168 258 185 -255 222 87 -280 90
2939I0k74L56k41j65J42O6k35K30K69p9J72m21K61pJ05q7l08QL30k5l25K61l1
$$ 90 -184 172 -69 -234 -92 -26 -261 -31 238 159 331 -90 171 164 269 182 -126 -118 212 187 -138 123 92
2962I2k76K80J82j31n0j52J97o1R1J35l60J65k01k53J90K47k60M2j06L5J10K1
$$ 92 -184 96 278 147 97 -55 142 81 172 307 -53 112 -89 -342 -152 95 -165 -123 -229 -194 -84 -63
2984f3jQ7j28N2j57O5R1L6M9j82N5P0K14k67Q0r7j1R8R0j99K57J31n32J80J40
$$ -63 -64 23 -105 -53 -210 -145 -54 -18 31 -151 -96 -26 188 -79 1 -96 -107 -9 81 -118 139 270 -262 -82 58
3009E8p2P5J15r8j2J27l37M61l38J04k20K09P1M9p8j14Jj25K05j74p3n2K8J79
$$ 58 -14 61 176 78 66 193 -144 317 -21 83 -137 72 143 192 114 0 1 -124 81 -93 -166 -218 -190 -11
3033a1j22j07K11J19ok25K14o2l3k9K46l27K85j71k36K50%m0o0r2J71O0k74M85
$$ -11 -133 -240 -29 90 84 -141 73 11 -22 -51 195 -132 153 -18 -254 -4 -4 -44 -104 -196 -25 35 -239 246
3057B46l14K38l20J96j64N5R2K1j63L8M7J62q9J9k7k78K62J04l3N0n2k10J08p2
$$ 246 -68 170 -150 46 -118 -63 29 50 -113 -75 -28 134 45 64 37 -241 21 125 92 142 90 -120 -12 -84
3081h4M6j43K47K41l27J65j36j76J43j19L34l44pL95p59M00j21Q3p1L93M0k59
$$ -84 -38 -181 66 307 -20 145 9 -167 -24 -143 191 -153 -160 235 -524 -124 -245 -162 -233 160 200 -59
3103e9J73p8mj03J10RJ47L7q2J47j29l96K52K6K18m52K11K10n3J71l51M3J93q9
$$ -59 114 36 32 -71 39 48 195 232 150 297 168 -228 24 50 268 -184 27 237 184 355 4 47 240 151
3127A51K82l74J46r6k38J97J43j95j74P9L2l63L38P6j1l4j01O0J55k16M0K46k07
$$ 151 433 59 205 109 -129 68 211 16 -158 -79 -47 -410 -72 4 -7 -41 -142 -82 73 -143 -103 143 -64
3150f4lR3j80K54n7j61M74k77N9l27J49l2K31J3j90l00J63L7oJ94k09J99k8L00
$$ -64 -67 26 -154 100 43 -118 356 79 138 -189 -40 -72 159 172 -18 -318 -155 -118 -124 70 -139 60 32 332
3174C32j99j68p3p0K78ml05n0J56L8j25K02k07l3J45K25l50M53k28l62L21J96
$$ 332 133 -35 -108 -178 100 96 -209 -259 -103 -65 -190 12 -195 -228 -83 142 -208 245 17 -345 -24 172
3196A72o0j13K3P4M3l61K26J3j60K85K2l03j1J97K85l40J4L22m69k0q6M22q2j44
$$ 172 112 -1 22 96 139 -222 4 17 -143 142 164 -139 -150 47 332 -8 6 328 -141 -161 -247 175 93 -51
3220e1j4j09L05j2n7m49L77k92L79r5J12k54k99K97J86L0k2K41l36M5k71N34k73
$$ -51 -65 -174 131 119 62 -387 -10 -302 77 -18 94 -160 -459 -162 24 54 32 273 -63 -18 -289 245 -28
3243b8k4K68k28p1L3m7p4J05j32M96n83L19j07J59j19j24J64k2j28P3K35j43o
$$ -28 -52 216 -12 -83 -50 -97 -171 -66 -198 298 -285 34 -73 86 -33 -157 7 -15 -143 -70 165 22 16
3266A6r3K28k67M39l46j46J21J88k11k2L07l52K75l39M07m01M76q2J1m8Nj3R5
$$ 16 -77 151 -116 323 -23 -169 -48 140 -71 -93 214 -138 137 -202 205 -196 280 198 209 161 166 153 248
3289B48j73n0J66k74k10L98l58M67o1M5p6j50J62k59O2O0K39k89J11n7pq3J71
$$ 248 75 25 191 -83 -293 105 -253 214 153 198 122 -28 134 -125 -63 -3 236 -53 58 1 -6 -89 82
3312H2K21j86P0m36J86M97l43j50J0j81K53k79J13J61J27j43K49l72J97M3j67
$$ 82 303 117 187 -249 -63 434 91 -59 -49 -230 23 -256 -143 18 145 2 251 -121 76 119 -48
3333d8M86m17j69K36j21K39j13n3J04k72J38j82K60J86j83j42J80j84Q0j18J56
$$ -48 438 21 -148 88 -33 206 93 40 144 -128 10 -172 88 274 91 -51 129 -55 25 -93 63
3354F3M3J85n16L46j23j60M9K69j85j17L8K30j78N13m99K1lj42j40K84J81l03
$$ 63 106 291 -225 121 -2 -162 -113 156 -29 -146 -108 122 -56 457 -42 -21 -24 -166 -306 -22 159 -144
3376a44J14j64J41M3j30q7j4K22j14j81K01J01q3L25ll74j2L7K11k6p4J2M19l96
$$ -144 -30 -194 -53 -10 -140 -227 -241 -19 -133 -314 -113 -12 -95 230 227 -147 -159 -122 89 63 -11 1 420 24
3400B4Q7k51L27J3l61K78M4J80l22q0O6J2j78J08L7N5M5j41L70m43J22o6K27J01
$$ 24 111 -140 187 200 -161 117 161 341 19 -61 5 17 -161 -53 -16 39 84 -57 313 -130 -8 -74 153 254
3424B54m83K16n4O3k29K50k26O3j63L16K56n16K51J76o6l6pN5M4k52L48l20mo0
$$ 254 -229 -13 -67 -4 -233 17 -209 -146 -309 7 263 -253 -2 174 108 72 65 120 164 -88 260 -60 -64 -124
3448a24N7K6n4P0j12o0K88J34n98L84m6j14J14J0J38j77o2KJ06k0p0L43n8k15
$$ -124 -67 -41 -95 -25 -137 -197 91 225 -373 11 -35 -149 -35 -25 113 -64 -126 -124 -18 -38 -108 235 177 -38
3472c8O5k24K28l08O06k80k30M47k82k51K05L25l48K43k03J69l86M10l83O35m36
$$ -38 27 -197 31 -277 329 49 -181 266 -16 -267 -62 263 -85 158 -45 124 -262 148 -235 400 -36
3493c6o5L44k88J46k5k21kJ83l95L73k06P4L83o7k66J80j53j25K47K44m26l1K07
$$ -36 -101 243 -45 101 76 -145 -147 36 -359 14 -192 -118 265 198 -68 112 -41 -166 81 325 -101 -132 75
3516G5o4j8K8p8P1J67j69K04j97q6J68k23J44q0J16p1L51k83Q2k48O9K19o3K6
$$ 75 11 -7 21 -57 14 181 12 216 19 -67 101 -122 22 -58 58 -13 338 55 137 -111 -42 177 114 140
3540A40j4N4m47K15L70l67k9r0K19j14l2J18n5l4k47K39j6J15m8j92L8M00k26
$$ 140 126 180 -267 -52 318 -49 -78 -168 51 -63 -95 23 -32 -66 -313 -74 -90 25 -23 -215 -177 223 -3
3563cp0j38J64J38j00MJ10pj00R3J24l69K28j36J97m1j3Q9j33j60K26L1k12P1
$$ -3 -73 -211 -47 91 -9 -5 105 98 -2 91 215 -154 74 -62 135 94 81 170 37 -123 103 134 -78 -7
3587gR4m9K4L7O8j16M2J79j68o1l18L94m7k2N4K2q0qK04j93k20J52J6j50N97l71
$$ -7 87 38 62 99 167 51 93 272 104 43 -275 119 72 50 104 126 46 38 242 49 -171 -19 -3 -153 444 73
3613G3r1R4k54J91j69N21k79k99K88j43J82j82J10qm8n0L22k91K26j55j20P3j78
$$ 73 -18 76 -178 13 -156 365 86 -213 75 -68 114 -68 42 34 -14 -64 258 -33 193 38 -82 -9 -187
3636a87N04j64J4Jj12j64J21J99l30J8k3J61p5j4R3j70o4L74l03j44M59k36q8
$$ -187 317 153 167 168 56 -108 13 212 -118 -100 -123 38 -37 -51 42 -128 -192 182 -121 -265 194 -42 -130
3659a30O5K08j58K04l5k67L06J7l6j47J2K71j08j55Q8J47n84O18m88K5j0K47j35
$$ -130 -65 143 -15 189 154 -113 193 210 174 27 39 310 202 47 135 282 -302 316 -172 -147 -157 90 -45
3682d5k24L85j00l6K79j43l05M39l28K19J93j99l7l2j51J14j81J3R7R9j28J51
$$ -45 -269 116 16 -20 259 116 -189 250 -78 141 334 135 98 66 -85 29 -152 -139 -42 57 -71 80
3704H0J6m6p6q5K71j58L3M0J90l18nj0M6J19j00j39R9J05o6K10m95J10O1K83j41
$$ 80 96 50 -26 -111 160 2 35 75 265 -53 -58 -68 -22 97 -3 -142 -43 62 -4 206 -289 -179 -118 165 24
3729B4J72k74L2P9Q9Q9j25J3k29K84j48K72m54L54k07j38K07m5j74J36K73k39
$$ 24 196 -78 -46 33 122 211 86 99 -130 154 6 278 -176 178 -29 -167 40 -5 -179 -43 230 -9
3751iM8P6l3Q4k90m8K26p9J89o6k02P1k40K85nj44K1K19N7r5J6J26n13J98K55
$$ -9 39 115 82 166 -124 -172 54 -25 164 98 -104 -33 -273 12 7 -137 -116 103 160 65 81 207 -306 -108 147
3776A47q2MO1k41q9K62J70j9m50M70m15K77j71N2m2m9K84M8k03l09K02k1O6M18
$$ 147 65 69 130 -111 -200 62 232 213 -237 233 -182 95 -76 -24 -66 -115 169 217 14 -295 -93 -114 -48 370
3800C70j00j74k90K37j61J30Qj58J99k76J53Q9j59K29Lo1k53K47k53M94k69p0
$$ 370 270 96 -194 43 -118 12 20 -138 61 -215 -62 27 -132 97 100 39 -214 33 -220 274 5 -65
3822f5K30k33j47P1J07q2N1J08L6N4J15l35M26l63K0k04M41k31K7M7l23K18R4
$$ -65 165 -68 -215 -144 -37 -119 -68 40 76 130 245 -90 336 -27 -7 -211 230 -1 26 73 -250 -32 62
3845F2j94L55j13j27J06Qk39J33m6NK01j84K2r0r1J1J4J35m5p8J13L19l64K0J17
$$ 62 -132 223 110 -17 89 97 -142 -9 -55 -50 151 -33 -11 -101 -192 -181 -167 -32 -77 -155 -42 277 -87 -67 50
3870E0m83L84N5j25L0L0L01k96k16L82k72N2Mq5NJ16J4j7R0J20l8LO5q1m25L10
$$ 50 -433 -49 6 -119 -89 -59 242 -54 -270 112 -160 -108 -104 -189 -184 -68 -54 -71 19 139 101 104 169 88 -337 -27
3896b7j0j03J03j47L01j46J2K67l2l6l41J52J61k65K51m0nKj66R6K45k12R0j51
$$ -27 -37 -140 -37 -184 117 -29 -17 250 218 182 -159 -7 154 -111 140 100 95 97 -69 27 272 60 150 -1
3920aR0j8j14J20k44K7P4J28o7j52J20N1K29k42j10R0R4J88m66L97j74Mk82J90
$$ -1 89 71 -43 77 -167 -140 -66 62 -5 -157 -37 14 243 1 -109 -19 75 263 -203 194 20 24 -258 -68
3944f8J0K38k48K55l43K45o9p8O4N7q2k6J69o9k12n8J60K95k47k45L26j41Q1N3
$$ -68 -58 180 -68 187 -156 89 20 -58 6 63 -19 -45 124 55 -157 -215 -55 240 -7 -252 74 -67 14 67
3968F7q7pj91N54k16j68K09m4K06l99K66j54K4J59L1l03Q3M8j47J05k28n0J20
$$ 67 -20 -27 -218 336 120 -48 161 117 323 -76 190 36 60 219 250 -53 30 78 -69 36 -192 -242 -122
3991a22M7K56o5k54L9K93k2k26O6J74j08K5k24K71k38L53m55J88j51N42m52n9
$$ -122 -75 181 116 -138 -99 194 172 -54 12 186 78 103 -121 150 -88 265 -190 -2 -153 389 -63 -122
4013a22O0k60M92l3K51q4k48O8k55J00L6r3L6P0R5o9J55j36J10k91J26jQ9R2k23
$$ -122 -62 -322 170 137 388 304 56 124 -131 -31 5 -88 -52 18 113 44 199 63 173 -118 8 7 96 188 -35
4038c5J72k19j94K71j7r5QJ9L7q4M3j75K31j19M4m3J28k35K25K44k15P9k5q3J28
$$ -35 137 -82 -276 -5 -22 -117 -109 -90 -53 -137 -94 -269 -38 -157 -113 -156 -28 -263 -38 206 -9 70 45 -38 90
4063I0o6o2Jr9j34m0J27R4J06j88J31m3J57k04K7pJ89j01J69L4j1r2r6k72K65
$$ 90 24 -38 -37 -136 -270 -310 -183 -89 17 -171 -40 -83 74 -130 -103 -110 79 -22 147 181 170 78 -18 -290 -25
4088b5P4j25J28j27J82j09M8J91k41j28L51m15l5L47j58m3p0L67m80K95k52L99
$$ -25 49 -76 52 -75 107 -2 46 237 -4 -132 219 -196 -231 116 -42 -85 -155 212 -268 27 -225 174
4110A74k43kJ65J3j51R7j91k8L88k32j07J51R2q7j43K0J87k32P7LK52k39j4J41
$$ 174 -69 -71 94 107 -44 53 -138 -166 222 -10 -117 34 126 39 -104 -84 103 -129 -52 -49 203 -36 -50 91
4134I1L3l49K20N9K23l35Kr1J01l0L60m09P8N4J60j95J0p4K99k21l5J0j8J09k54
$$ 91 124 -225 -5 54 277 -58 -56 -147 -46 -76 284 -125 -47 7 167 -28 -18 -92 207 -14 -49 -39 -57 52 -202
4159b02K92q9K6q0k4J04n6M8J63l28J71j14J38l3j49L25O4j73j84N86n19J9K71
$$ -202 90 1 27 -53 -77 27 -29 19 182 -146 25 -89 49 16 -133 192 256 83 -101 485 -34 -15 256
4182B56k78J5K92j85J63l15j95K10Q2k2O3k71N5K67k6JO0k37J80j47k77N19j94
$$ 256 -22 -7 285 100 263 -52 -247 -37 45 23 86 -185 -130 137 111 112 172 -65 115 -32 -309 210 16
4205A6m2J08j46OJ62k82J09l5K64m03J77K24l30L49l27L12p8k98L34j46Q4q9j52
$$ 16 -26 82 -64 -58 104 -178 -69 -104 160 -243 -66 158 -172 177 -150 162 84 -214 120 -26 58 -31 -183
4228a83O2L05m90P7O8J72J25l19K46J9m2M4j16n3J59J56m56K86N6j38M1J55k03
$$ -183 -121 184 -306 -229 -161 11 136 -183 63 82 40 84 -32 -85 74 230 -226 60 116 -22 19 174 -29
4251b9K50k37J20j56J33k20J53L25k32k73J70Q4k16J49J2k91K33Q2j29J74p2K1
$$ -29 221 -16 104 -52 81 -139 14 339 107 -166 4 88 -128 21 33 -258 -25 57 -72 102 30 51
4273E1j05L9J06j85N9n3l18N86j94J51m01P0R5n1m0J46r7l8O2kJ57O8n5j20J04
$$ 51 -54 -15 91 -94 -35 -88 -406 180 -14 137 -264 -194 -99 -150 -190 -44 -141 -179 -117 -119 38 106 51 -69 35
4298C5l3J57j66j70O1K72J05l11m2J39k74R7J8k9M12n24J98j93J15K67k39o9J89
$$ 35 2 159 -7 -177 -116 156 261 -50 -92 47 -227 -130 -112 -141 271 -253 -55 -248 -133 134 -105 -174 15
4321A5N8O1k84PK96k78j40J81j58J81j16L21j7j52O5R8k56J2P2J2RJ38Rn9q6J55
$$ 15 73 134 -150 -143 153 -125 -265 -84 -242 -61 -177 144 127 -25 40 138 -118 -106 -34 -22 -13 125 134 75 -11 144
4347A44k49J1j91K16J35k12L02j23k0K2j27K56l21J56m07M56q0J34p5j01K53l32
$$ 144 -105 -94 -285 -69 66 -146 156 33 13 35 -92 164 -157 -1 -408 48 -32 102 27 -74 179 -153
4369a53N7R9J30j19j31L05l66M03k00N9q9J3N5l03L75K1J6j32j4K65j84j29M9
$$ -153 -96 3 133 14 -117 188 -178 225 25 84 -5 8 63 -240 135 156 172 40 26 291 107 -22 27
4392B7k37J60J57k30J80Lj90J66j51p2J62l2k01M06j99j50K18j46M3L45r9k99
$$ 27 -210 -50 107 -123 57 60 -130 36 -115 -187 -25 -57 -258 148 -51 -201 17 -129 -86 259 160 -139
4414a39L93j90j17J32j27q8j0L27n3J8j31J90k22L12l20k28K95j48K9O9K22j48
$$ -139 254 64 -53 79 -48 -136 -146 181 128 146 15 205 -17 295 -25 -253 42 -106 -77 -8 214 66
4436F6k00J28kk03L05n39M82m2J4J09k63Q4N3J03o9O1j12P6P2O6l25J51j12J72
$$ 66 -134 -6 -8 -211 94 -445 37 -5 9 118 -145 -61 -8 95 26 87 -25 51 123 189 -136 15 -97 75
4460G5j65L91m36p7J05J79k36K07m3j94M47m96J90K5J07k34j07J2J70N2K14j29
$$ 75 -90 301 -135 -212 -107 72 -164 43 0 -194 253 -243 -53 -28 79 -155 -262 -250 -80 -28 186 57
4482E7k43L31j65q6K30n8k99J96J6PLk57J01K78k61K71l6j64M9Q9N5k18n5K81
$$ 57 -186 145 -20 -106 124 66 -233 -37 -21 -14 -11 -268 -167 111 -150 121 85 -79 -30 59 114 -104 -159 122
4506A22p1k54L96j99rJ36N6l03J81J40j11k04J53QM5l6j28K70j47%j60K84k11
$$ 122 51 -203 193 -6 -15 121 177 -126 55 195 84 -120 33 41 86 50 -78 192 45 45 -115 169 -42
4529d2Ok9M8K3K22k24K03j69P5q4j43J22q9k9J95j70n5J46j66L31p8j88M8P1R1
$$ -42 -36 -65 -17 6 228 4 207 38 113 29 -114 8 -81 -110 85 -85 -140 6 -160 171 93 -95 -47 24 115
4554A15k63R7j43K14m4J60k6J82l67R2j05J32N8k90N1J66J30PJ26k44l7o8J64
$$ 115 -148 -51 -194 20 -24 136 110 292 -75 17 -88 44 102 -188 -137 29 159 166 292 48 11 -57 107
4577A07j18j16K53k64m2J52n4J56k06J70j96J47J13k21K03l0J68j99k55K26L2
$$ 107 -11 -127 126 -138 -180 -28 -82 74 -132 38 -158 -11 102 -119 84 54 222 23 -232 -6 26
4598B6l44L29J44l89L24K80k46j31K28l99K63O1k39M81n26K05Q8k35Q6ol1J86
$$ 26 -318 11 155 -234 90 370 124 -7 221 -178 85 146 -93 388 -138 67 155 -80 6 0 -31 155
4620A55L1l27K15k38L17k59J86j07q1J59l81M57O9l15J29j45J74q0J91j42l0j32
$$ 155 186 -141 74 -164 153 -106 80 -27 -108 51 -330 127 196 -119 10 -135 39 -41 150 8 -22 -154
4642a54M26m05K30k99K10r8R7j45q4k0K02Q6r1L35n03J11K08j3m58M84j41j10
$$ -154 272 -133 97 -202 8 -90 7 -138 -222 -242 -40 46 -45 290 -213 -102 106 93 -365 119 -22 -132
4664a32J27p2j12M30l57j26J30J82j23J65k03K04j13N9k9n0m5M7j34L16k65J27
$$ -132 -5 -77 -189 241 -116 -242 -112 70 -53 112 -91 113 0 59 30 -20 -65 -18 -152 164 -101 26
4686B6J00l48K98k39J22j96m9R1P2R7J51l54K70k70K15l6K73l10K34m6o4j48K34
$$ 26 126 -222 76 -163 -41 -237 -286 -195 -123 -26 125 -229 41 -229 -14 -50 223 -87 147 101 37 -111 123
4709A23p1r3k9J8J67j71J50l37K7J15J65q9p9L9J02R9l71M94k87j51L71l2l20
$$ 123 52 -41 -70 -52 115 -56 94 -243 -216 -101 64 -25 -104 -65 37 136 -235 259 -28 -179 192 160 -160
4732a60O7L3J49k53M58k51q3K4q5J59j03J33j29R9k20m3K38q9O6j57K43M3k81
$$ -160 -93 -60 89 -164 294 43 -40 -16 -101 58 -45 88 -41 58 -162 -205 33 -56 10 -147 96 139 -142
4755a42K23rR0o4j01j88K43P5j71J62j78o4J43j64K84j50O7k91L36j01J51Nkm17
$$ -142 81 72 162 98 -3 -191 52 127 -44 118 -60 -124 19 -145 139 -11 56 -235 101 0 151 156 154 -263
4779b63J47j49K05K13M5J3l21J40l14M47p5l59J25K71k50QO9J78l2o9Q5k51M0
$$ -263 -116 -265 -60 153 198 211 -110 30 -284 163 88 -271 -146 125 -125 -117 -48 130 98 29 114 -137 -97
4802i7O6J08K2j85K61n5j08j15K24k04L55l40K70k70k3K90k42p6O1O8n1lq3J99
$$ -97 -31 77 99 -86 175 120 12 -103 121 -83 272 -68 202 -68 -91 199 -43 -119 -58 10 -41 -44 -127 72
4826G2j25L31k42m79N35q9o4K03j20L8j10Q1j70J60J07n7q1k3p0Q0o1J51L2o6
$$ 72 -53 278 36 -443 92 3 -61 142 22 60 -50 31 -139 21 128 71 -10 -33 -103 -23 -84 67 99 33
4850C3Pm2K13j35j68K51j16q9J13k28L65l34r5J66J15lj24oq2L4j2K54Q1j73j43
$$ 33 40 -2 211 76 -92 159 43 -46 67 -161 204 -130 -225 -59 56 53 -71 -77 -159 -125 -137 117 198 25 -118
4875a18k43J80M15k79m3J76RK5j69N1j66k3J01R5L2O3j90J0M9J45j74N5m9LJ08
$$ -118 -361 -181 234 -45 -88 88 97 122 -47 4 -162 -185 -84 11 43 106 -84 -74 -25 120 -54 1 -48 -45 63
4900F3p9p4p2J27J82k59l2R4M5J00j85J86j26Q9l57L17JJ04l0J6J34m33R3p4K20
$$ 63 -16 -90 -162 -35 147 -112 -144 -50 -5 95 -90 96 -30 59 -298 19 20 124 94 110 244 -189 -96 -170 50
4925E0n6J28on2k49pL65j97j6J06k62J43OL03j10j94K61j49j27O7p1K49l10n5
$$ 50 -6 122 116 64 -185 -192 173 -24 -40 66 -196 -53 -47 256 146 -48 213 64 -63 4 -67 182 -128 -183
4949a83O2J74Q7J03m39J20K54P0k17L7L6l10L40k05m9N9k6P9k61N16k55J43j70
$$ -183 -121 53 140 243 -196 -76 178 248 31 68 104 -206 134 -71 -120 -61 -87 -8 -269 247 -8 135 -35
4972c5r1L62j35k34k9k64N11m10M00J2l10K3R9O0j08K11j00J50r8j26PQ3O2j47
$$ -35 -126 236 101 -133 -162 -426 85 -325 75 87 -223 -200 -101 -41 -149 62 -38 112 14 -112 -105 -22 40 -107
4996a07L7L10k49p0q2K48q5j79K33j5Oj43R6k1J99j39O0k1j37K4Q6j76L5J94j29
$$ -107 -70 240 -9 -79 -161 87 2 -177 56 41 47 -96 0 -21 178 39 99 78 -59 -35 51 -125 -90 104 -25
5021b5J55L6k29J82j91K29m8j0j26J77k74n4k51L76o2OL53k98L6j04K29k94l1
$$ -25 130 166 -63 119 -72 157 109 99 -27 150 -124 -178 -429 -53 -115 -109 244 -54 -18 -122 107 -187 -218
5044b18J97j47J37k9J54kL7K7j46M0k70J45k2j05n9J13L40k02k02M40k88J31Q1
$$ -218 -21 -168 -31 -60 94 92 129 156 10 50 -220 -75 -97 -202 -261 -148 192 -10 -212 228 -60 71 152
5067A52p4j7P7k08j2j69M03J15l55J25j25k1P7J05p0Q8J62j45o3k06K06j68KJ26
$$ 152 78 61 138 -70 -82 -251 152 267 -88 37 -88 -109 -32 73 3 91 253 108 45 -161 45 -123 -121 5
5091EQ4N3n7n5o8J32n0j74j15L25J11mk55J65k7J16j0j82J21p1N5j39m7l30N12
$$ 5 89 142 85 30 -38 94 44 -130 -245 80 191 187 -68 97 70 186 176 -6 115 44 99 -40 -87 -417 95
5116I5k62R5P4o1J87k85K73p9L3Q6O8Ql04J32l7Q6J3q7j72J32j38J35K0N4O2K9
$$ 95 -167 -72 2 -59 128 -157 116 37 70 156 224 232 -72 60 23 109 122 35 -137 -5 -143 -8 12 66 128 157
5142A57j67K01l5l05R2M1J57k75K68P7j89J41P0l04N3n5J38k39n8L18k8k34J91
$$ 157 -10 191 156 -149 -57 -16 141 -134 134 211 22 163 233 -71 -18 -73 65 -174 -232 86 58 -176 15
5165A5J67l90L18k78P2N8K01j36k65J20L7J25k00Q6L38k90K6M0j04L2k44L10k79
$$ 15 182 -208 110 -168 -96 -38 163 27 -238 -118 -81 44 -156 -70 268 -22 4 44 -60 -28 -272 38 -241
5188b41L33o5rj11K53j76J52q3l5k61M7J81K2j50J18j02R3k3K08j07Q8j32Rk67
$$ -241 92 27 18 -93 160 -16 136 53 18 -243 -196 -15 7 -143 -25 -127 -34 -57 151 44 132 0 9 -258
5212b58K43K33k61P9q5L8k39K15J13n7N0J19k78K52l35N77k77m7j46P6Jl7K52
$$ -258 -15 218 -43 36 -49 -11 -250 -35 78 21 71 190 -88 164 -171 406 129 82 -64 12 13 -24 228
5235B28m32R1M2K67j4l43K47M0J89p6j55j84R3k1j46N5k13L79r5r8J82N8k41K33
$$ 228 -204 -113 -71 196 182 -161 86 126 315 239 84 -100 -7 -28 -174 -119 -332 47 -48 -146 36 94 -147 86
5259H6k76K09k21Q2K09p2j10L16p7p3J06l32j99K07l0L43k19K27m9m4k42M97n88
$$ 86 -190 19 -202 -120 89 17 -93 223 146 73 179 -153 -352 -145 -175 168 -51 176 127 83 -159 338 -250
5282b50J79j13K49Or7P2k45K91j44j26P8J36j51J81k92L59n3J58n46N55j73j09
$$ -250 -71 -184 65 71 -26 46 -199 92 -52 -178 -100 36 -115 66 -226 133 80 238 -308 247 74 -35
5304c5o0m9K16j8R6j82K87j50O6J1l06K13j74l9J59pq8L6j24J87j18qo6J69j81
$$ -35 -95 -144 72 54 150 -32 255 105 171 182 -124 89 -85 -124 35 28 -60 -24 -148 39 -79 -87 -153 16 -165
5329a65J9O50n49J10Q5k8k19K83j11j22P3k20P4K33N6q1J54j40L2j37K1l8K41
$$ -165 -146 504 -45 65 150 122 -97 186 75 -47 26 -194 -120 113 169 88 242 102 134 -3 18 -20 221
5352B21k12M6j3j6j35J73K7k57rJ81j78J60j7o6R1j07K35k33j18L93j28l2J45
$$ 221 9 55 42 26 -109 64 91 -166 -175 6 -172 -12 -29 -95 -4 -111 124 -109 -227 166 38 6 151
5375A51K9j10P3k50J20n1J98j32k39L17J37nj35k11K91o1j51q3m6K79k43Q5K83
$$ 151 180 70 143 -107 13 -38 160 28 -211 106 243 238 103 -108 183 122 -29 -112 -158 121 -122 -37 246
5398B46P2n06O4K46K7k61ko8K85j03o5J67l21K76L13j37m94K32qK49J09k29P8
$$ 246 318 -188 -124 122 149 -112 -114 -182 103 0 -65 102 -219 57 370 233 -261 -29 -37 212 321 92 170
5421A70k56J25K56j48j36K0J19J00k02p6K13j64J28n1J91j89j38m3L25l21j73
$$ 170 -86 39 295 147 11 31 150 250 48 -28 185 21 149 98 289 100 -38 -81 244 -77 -250
5442b50K13k4J3P0j91O7L03l50R7J78l28M29r1m21J59O0KJ60N6j69l7p1L5J08
$$ -250 -37 -61 -48 22 -169 -102 201 -149 -52 126 -202 227 136 -285 -126 -66 -64 96 152 -17 -54 -125 -90 18
5466A8OQ6l3j08l9q3M1J92j5k64J46J60j79J7J86K2o7p5J26l12j05K94j2lK41
$$ 18 24 110 77 -31 -70 -153 -112 80 65 -199 -53 107 -72 -55 131 153 86 11 137 -175 -280 14 2 -1 240
5491B40j98l60N39k83M7Q4j9j10R0j23K2kJ29K90l70r3K45K0l45K55P5kj23J04
$$ 240 42 -318 221 -62 -15 69 50 -60 30 -93 -71 -73 56 346 -24 -117 128 148 -197 58 133 131 8 112
5515A12o0k77J64p5K43k48J97j9R0k30L0kl4K84j26j8k32L03J54j74p6o4Jj01
$$ 112 52 -225 -61 -136 107 -141 56 37 127 -103 -73 -75 -109 175 49 31 -201 102 256 82 6 -58 -57 -158
5539a58M0K01l17K9Nk7J43Q7l41M16M2j60pP3j75M17k27j66j47K09R5O2P6j78
$$ -158 -118 83 -234 -205 -200 -227 -84 3 -338 78 120 -40 -47 26 -149 268 41 -125 -272 -63 32 94 170 -8
5563hJ45o7j36k38K29K5n4K9O6O7l5q1j7J18j16p6M53l01l4k9M5K89k84R6mk2
$$ -8 137 70 -66 -304 -75 -50 -104 -75 -9 58 23 -58 -75 43 -73 -149 304 3 -31 -60 -15 274 -10 86 82 60
5589F0j85J63m8J57R4j68k9R5r3j63L36k51JJ73O7m03L04m5k37L26j63Q3m2j43
$$ 60 -125 38 -10 147 241 73 44 139 46 -117 219 -32 -31 142 209 -194 110 65 -172 154 -9 74 32 -111
5613a11M8J55j97J20r5PL97j68k83j83M83j87O3J62l49r2J81J5J03r3J70k37j25
$$ -111 -63 92 -105 15 -80 -73 324 156 -127 -310 173 -14 49 211 -138 -230 -49 -34 69 -24 146 -91 -216
5636b16r7L98K7J23j4k46K50L65n34l16M25j86j95J25j03M89m01J69J8r8n2%k
$$ -216 -313 85 112 235 221 -25 225 590 56 -260 165 -21 -216 -91 -194 295 -106 63 81 -17 -69 -69 -71
5659g1J75j78Ln9K3J85j26N2J45lj92q0m1l9K01j05J06J5J98k10p6j47J56p1o0
$$ -71 104 -74 -71 -130 -107 78 -48 4 149 146 -46 -126 -167 -206 -5 -110 -4 11 209 -1 -77 -224 -68 -139 -199
5684a99O5Q6n5O3J76j64K10k37J09j85J61k53L46l7p2Q7O4k25j40K43l67K75j14
$$ -199 -134 -48 -103 -40 136 -28 182 -55 54 -131 30 -223 123 86 14 101 165 -60 -200 43 -324 -49 -163
5707a63K44q2K0Q7k78K15n0J08m49L73Q0J10k16j36O3K68j97o5K59k85J82l53
$$ -163 81 -1 19 106 -172 43 -7 101 -348 25 105 215 -1 -137 -74 194 -3 -68 191 -94 88 -265
5729b65K85k25K74l80J91M0L73r6j54r1K90k80O4p6R0Q8j57K44m39K11j33R4n2
$$ -265 20 -205 69 -311 -120 -80 293 197 43 -48 242 -38 26 -50 40 128 -29 215 -224 -13 -146 -52 -104
5752a04K09j37j03L34n1l27q2L10j69J12o9J12k19k11L81KrK00k14R7k24R4J62
$$ -104 105 -32 -135 199 148 -179 -261 49 -120 -8 -77 35 -184 -395 -14 -12 -21 179 -35 62 -162 -68 94
5775I4j97J32j75M4R1j6p0J93j28N1%j31K0L71m42M77k96K68k82J03j77jK32l23
$$ 94 -103 29 -146 -102 -11 -27 -97 96 -32 19 19 -112 -92 279 -163 314 18 286 4 107 -70 -71 161 -162
5799a62K31p6K93j74k83n1j64N61j07J2L82n15J64j19J68k02J58k13j32J62J94
$$ -162 69 -7 286 112 -171 -222 -386 175 68 80 462 -53 111 -8 160 -42 116 -97 -229 -67 127
5820A27O3j1k22m4J80j86l5M9L07j67J28p9l83M31l8nl31n1L89l42J23M0L01j52
$$ 127 190 179 -43 -87 93 -93 -128 -79 228 61 189 110 -273 158 120 115 -216 -267 122 -220 -97 -57 244 92
5844I2j97J72J55m5j68j28K82k8j42K39k07lJ23k04K27k02J36j92K54j94K44k24
$$ 92 -105 67 222 177 9 -119 163 135 -7 232 25 22 145 -59 168 -34 102 -90 164 -30 214 -10
5866a0p4O7k43L51l56L12q8j25J90O5j70j77K82j59L52l44j3l7M23j89k1k47N5
$$ -10 -84 -17 -260 91 -265 47 -41 -166 24 89 -81 -258 24 -135 217 -127 -140 -177 246 57 36 -211 -156
5889a56L45j92r3N8k20M28l01J2J94k19L68r0l30J52j77J69j7M71m95q9M19k26
$$ -156 189 -3 -96 -38 -258 170 -131 -119 75 -144 224 134 -196 -44 -221 -52 -69 402 -93 -182 237 11
5911A1k02K39r4M2L9k5j84K31j63K43l71J72L5K57p5k44J62m3j04J3j35j50M75
$$ 11 -191 48 -46 -4 35 10 -174 57 -106 137 -234 -62 -27 230 155 -89 73 30 -74 -61 -196 -346 129
$$ [...]
8191G1
##END NTUPLES=NMR FID
##END=
