##TITLE=1H_Ser AmS-PrN
 200.13Hz,CDCl3 .
 8 sc
 
25.3.2026
##JCAMPDX= 6.0         $$ Bruker NMR JCAMP-DX V2.0
##DATA TYPE= NMR FID
##DATA CLASS= NTUPLES
##ORIGIN= UXNMR, Bruker Analytische Messtechnik GmbH
##OWNER= pz
$$ XWIN-NMR		Version 3.5
$$ Wed Mar 25 15:18:49 2026 Russian Standard Time (UT+4h)  she@DPX200
##.OBSERVE FREQUENCY= 200.1313
##.OBSERVE NUCLEUS= ^1H
##.DELAY= (6, 6)
##.ACQUISITION MODE= SIMULTANEOUS
##.ACQUISITION SCHEME= undefined
##.AVERAGES= 8
##.DIGITISER RES= 18
##SPECTROMETER/DATA SYSTEM= spect
##.PULSE SEQUENCE= zg30
##.SOLVENT NAME= CDCl3
##.SHIFT REFERENCE= (INTERNAL, CDCl3, 0, 14.3821)
##AUDIT TRAIL= $$ (NUMBER, WHEN, WHO, WHERE, WHAT)
$$ ##TITLE= Audit trail, XWIN-NMR		Version 3.5
$$ ##JCAMPDX= 5.01
$$ ##ORIGIN= Bruker BioSpin GmbH
$$ ##OWNER= she
$$ F:/spectra/data/she/nmr/H-C/1/audita.txt
$$ ##AUDIT TRAIL=  $$ (NUMBER, WHEN, WHO, WHERE, WHAT)
(   1,<2026-03-25 15:17:26.17 +0400>,<she>,<DPX200>,
      <created by zg, POWCHK disabled, PULCHK disabled
       configuration hash MD5:
       00 E9 B6 7A A2 85 ED C7 34 08 36 98 17 FE 4E 26
       data hash MD5: 16K
       57 2D A9 E4 7D CE 38 AD A0 6A 79 A4 79 11 91 BC>)
$$ ##END=
$$ 
$$ hash MD5
$$ BA 88 3A B4 51 52 AD 16 C1 53 21 B9 10 2E 22 41
##$RELAX= 
##$RELAX= 
##$RELAX= 
##$RELAX= 
##$RELAX= 
##$RELAX= 
$$ Bruker specific parameters
$$ --------------------------
##$DU= <F:/spectra>
##$EXPNO= 1
##$NAME= <H-C>
##$PROCNO= 1
##$TYPE= <nmr>
##$USER= <she>
##$AMP= (0..31)
100 100 100 100 100 100 100 100 100 100 100 100 100 100 100 100 100 100 
100 100 100 100 100 100 100 100 100 100 100 100 100 100 
##$AQSEQ= 0
##$AQ_mod= 1
##$AUNM= <au_zg>
##$AUTOPOS= <>
##$BF1= 200.13
##$BF2= 200.13
##$BF3= 200.13
##$BF4= 200.13
##$BF5= 200.13
##$BF6= 200.13
##$BF7= 200.13
##$BF8= 200.13
##$BYTORDA= 1
##$CFDGTYP= 0
##$CFRGTYP= 5
##$CHEMSTR= <none>
##$CNST= (0..31)
1 1 145 1 1 1 1 1 1 1 1 1 1 1 1 1 1 1 1 1 1 1 1 1 1 1 1 1 1 1 1 1 
##$CPDPRG= <>
##$CPDPRG1= <>
##$CPDPRG2= <>
##$CPDPRG3= <>
##$CPDPRG4= <mlev>
##$CPDPRG5= <mlev>
##$CPDPRG6= <mlev>
##$CPDPRG7= <mlev>
##$CPDPRG8= <mlev>
##$CPDPRGB= <>
##$CPDPRGT= <>
##$D= (0..31)
0 0.7 0 0 0 0 0 0 0 0 0 0.03 0 0 0 0 0 0 0 0 0 0 0 0 0 0 0 0 0 0 0 0 
##$DATE= 1774437445
##$DBL= (0..7)
120 120 120 120 120 120 120 120 
##$DBP= (0..7)
150 150 150 150 150 150 150 150 
##$DBP07= 0
##$DBPNAM0= <>
##$DBPNAM1= <>
##$DBPNAM2= <>
##$DBPNAM3= <>
##$DBPNAM4= <>
##$DBPNAM5= <>
##$DBPNAM6= <>
##$DBPNAM7= <>
##$DBPOAL= (0..7)
0.5 0.5 0.5 0.5 0.5 0.5 0.5 0.5 
##$DBPOFFS= (0..7)
0 0 0 0 0 0 0 0 
##$DE= 6
##$DECBNUC= <off>
##$DECIM= 32
##$DECNUC= <off>
##$DECSTAT= 4
##$DIGMOD= 1
##$DIGTYP= 9
##$DL= (0..7)
0 120 120 120 120 120 120 120 
##$DP= (0..7)
150 150 150 150 150 150 150 150 
##$DP07= 0
##$DPNAME0= <>
##$DPNAME1= <>
##$DPNAME2= <>
##$DPNAME3= <>
##$DPNAME4= <>
##$DPNAME5= <>
##$DPNAME6= <>
##$DPNAME7= <>
##$DPOAL= (0..7)
0.5 0.5 0.5 0.5 0.5 0.5 0.5 0.5 
##$DPOFFS= (0..7)
0 0 0 0 0 0 0 0 
##$DQDMODE= 0
##$DR= 18
##$DS= 0
##$DSLIST= <SSSSSSSSSSSSSSS>
$$ [...]
##$SUBNAM0= <"">
##$SUBNAM1= <"">
##$SUBNAM2= <"">
##$SUBNAM3= <"">
##$SUBNAM4= <"">
##$SUBNAM5= <"">
##$SUBNAM6= <"">
##$SUBNAM7= <"">
##$SUBNAM8= <"">
##$SUBNAM9= <"">
##$SW= 18.0517328524113
##$SWIBOX= (0..15)
0 0 2 0 0 0 0 0 0 0 0 0 0 0 0 0 
##$SW_h= 3612.71676300578
##$TD= 16384
##$TD0= 1
##$TE= 0
##$TE2= 300
##$TE3= 300
##$TEG= 300
##$TL= (0..7)
0 120 120 120 120 120 120 120 
##$TP= (0..7)
150 150 150 150 150 150 150 150 
##$TP07= 0
##$TPNAME0= <>
##$TPNAME1= <>
##$TPNAME2= <>
##$TPNAME3= <>
##$TPNAME4= <>
##$TPNAME5= <>
##$TPNAME6= <>
##$TPNAME7= <>
##$TPOAL= (0..7)
0.5 0.5 0.5 0.5 0.5 0.5 0.5 0.5 
##$TPOFFS= (0..7)
0 0 0 0 0 0 0 0 
##$TUNHIN= 0
##$TUNHOUT= 0
##$TUNXOUT= 0
##$USERA1= <user>
##$USERA2= <user>
##$USERA3= <user>
##$USERA4= <user>
##$USERA5= <user>
##$V9= 5
##$VALIST= <valist>
##$VCLIST= <CCCCCCCCCCCCCCC>
##$VD= 0
##$VDLIST= <DDDDDDDDDDDDDDD>
##$VPLIST= <PPPPPPPPPPPPPPP>
##$VTLIST= <TTTTTTTTTTTTTTT>
##$WBST= 1024
##$WBSW= 4
##$XGAIN= (0..3)
0 0 0 0 
##$XL= 0
##$YL= 0
##$YMAX_a= 200947
##$YMIN_a= -222574
##$ZGOPTNS= <>
##$ZL1= 120
##$ZL2= 120
##$ZL3= 120
##$ZL4= 120
##$ABSF1= 10
##$ABSF2= 0
##$ABSG= 5
##$ABSL= 3
##$ALPHA= 0
##$AQORDER= 0
##$ASSFAC= 0
##$ASSFACI= 0
##$ASSFACX= 0
##$ASSWID= 0
##$AUNMP= <proc_1d>
##$AZFE= 0.1
##$AZFW= 0.1
##$BCFW= 1
##$BC_mod= 2
##$BYTORDP= 1
##$COROFFS= 0
##$CY= -3
##$DATMOD= 1
##$DC= 2
##$DFILT= <>
##$DTYPP= 0
##$F1P= 0
##$F2P= 0
##$FCOR= 0.5
##$FTSIZE= 0
##$FT_mod= 4
##$GAMMA= 1
##$GB= 0.15
##$INTBC= 1
##$INTSCL= 1
##$ISEN= 128
##$LB= 0.25
##$LEV0= 0
##$LPBIN= 0
##$MAXI= 10000
##$MC2= 0
##$MEAN= 0
##$ME_mod= 0
##$MI= 1.114404
##$NCOEF= 0
##$NC_proc= 0
##$NLEV= 6
##$NOISF1= 3.799351
##$NOISF2= 2.8
##$NSP= 1
##$NTH_PI= 0
##$NZP= 0
##$OFFSET= 14.38212
##$PC= 1
##$PHC0= -3707.443
##$PHC1= 9.5923
##$PH_mod= 1
##$PKNL= yes
##$PPARMOD= 0
##$PSCAL= 0
##$PSIGN= 0
##$REVERSE= no
##$SF= 200.129724274929
##$SI= 16384
##$SIGF1= 3
##$SIGF2= 2
##$SINO= 400
##$SIOLD= 16384
##$SREGLST= <1H.CDCl3>
##$SSB= 0
##$STSI= 0
##$STSR= 0
##$SW_p= 3205.1282051282
##$SYMM= 0
##$S_DEV= 0
##$TDeff= 0
##$TDoff= 0
##$TI= <>
##$TILT= no
##$TM1= 0
##$TM2= 0
##$TOPLEV= 0
##$USERP1= <user>
##$USERP2= <user>
##$USERP3= <user>
##$USERP4= <user>
##$USERP5= <user>
##$WDW= 1
##$XDIM= 8192
##$YMAX_p= 0
##$YMIN_p= 0
$$ End of Bruker specific parameters
$$ ---------------------------------
##NTUPLES= NMR FID
##VAR_NAME=  TIME,          FID/REAL,        FID/IMAG
##SYMBOL=    X,             R,               I
##VAR_TYPE=  INDEPENDENT,   DEPENDENT,       DEPENDENT
##VAR_FORM=  AFFN,          ASDF,            ASDF
##VAR_DIM=   8192,          8192,            8192
##UNITS=     SECONDS,       ARBITRARY UNITS, ARBITRARY UNITS
##FACTOR=    0.0002768,     1,               1
##FIRST=     0,             0,               0
##LAST=      2.2672688,     0,               0
##MIN=       0,             -222574,         0
##MAX=       2.2672688,     200947,          0
$$ Real data points
##PAGE= N=1
##DATA TABLE= (X++(R..R)), XYDATA
$$ [...]
$$ plain form
1800 422 197 113 -207 -611 -401 -492 -515 -1032 -1127 -342 149 -405 83 383 277 794 771 574 329 446 612 704
1822 704 249 -144 -110 -610 -240 -413 -901 -876 -798 -496 -344 -366 -315 271 298 792 627 202 701 1089 669 41
1844 41 25 38 219 -321 -587 -634 -746 -810 -282 -452 -551 -639 -23 501 643 25 400 382 1035 1048 307 206 301
1867 301 283 -41 21 -127 -566 -1106 -538 -180 -901 -924 -273 -220 138 10 194 696 737 391 519 746 760 407
1889 407 -166 31 169 -883 -601 28 -263 -1387 -1110 -103 218 -646 -433 297 96 369 733 635 554 453
1909 453 374 308 675 381 -440 -726 -211 -173 -985 -883 97 -580 -1250 -170 105 44 -323 97 508 525 758
1930 758 939 523 74 420 6 84 535 -94 -925 -1003 115 -72 -964 -570 289 -442 -303 680 539 19
1950 19 283 988 608 468 737 364 20 126 99 -685 -442 61 -584 -1618 -527 172 -450 -487 79 -180
$$ packed form
1800D22k25q4l20m04K10r1k3n17r5P85M91n54M88L00j06N17k3j97k45J17J66R2
1822G04m55l93L4n00L70j73m88K5P8L02J52k2N1N86K7M94j65m25M99L88m20o28
1844D1j6J3J81n40k66m7j12o4N28j70r9q8O16N24J42o18L75j8O53J3p41j01R5
1867C01j8l24O2j48m39n40N68L58p21k3O51N3L58j28J84N02M1l46J28K27J4l53
1889D07n73J97J38j052K82O29k91j124K77J007L21q64K13P30k01K73L64r8q1j01
1909D53p9o6L67k94q21k86N15L8q12J02R80o77o70J080K75o1l67M20M11J7K33
1930G58J81m16m49L46m14P8M51o29q31p8J118j87q92L94Q59p31J39R83j41n20
1950A9K64P05l80j40K69l73l44J06k7p84K43N03o45j034J091O99o22l7N66k59
$$ plain form
1970 -180 -426 358 1453 905 -160 305 711 270 577 360 -830 -741 165 468 -678 -957 -528 -705 -714 393
1990 393 475 -778 -281 444 565 298 724 651 465 479 709 98 -605 -362 240 -565 -903 -99 -579 -986 -109
2011 -109 30 -428 -284 381 489 202 254 549 77 672 1359 378 -611 54 386 -178 -187 -474 -551 -1312 -572
2032 -572 409 -171 -1077 -203 388 387 801 524 -161 -37 410 1173 389 7 97 -216 -547 292 -181 -1343 -831
2053 -831 123 -7 -585 -650 251 119 -317 857 611 -326 608 1039 369 145 328 0 -168 109 -129 -856
2073 -856 -1025 167 169 -1006 -688 -216 -492 0 827 403 -329 -191 1280 1116 11 205 290 -263 534 691
2093 691 -615 -978 -355 -53 -584 -751 -232 -658 -935 384 704 -397 -157 925 498 95 501 960 97
2112 97 -71 459 182 -711 -231 61 -783 -662 -47 -547 -862 71 87 -616 294 1105 457 -317 556 1003 -9
$$ packed form
1970a80k46P84J095n48j065M65M06m41L07k17j190Q9R06L03j146k79M29j77rJ107
1990C93Q2j253M97P25J21k67M26p3j86J4K30o11p03K43O02q05l38Q04m80m07Q77
2011a09J39m58J44O65J08k87N2K95m72N95O87r81r89O65L32n64rk87p7p61P40
2032e72R81n80r06Q74N91jM14k77o85J24M47P63p84l82R0l13l31Q39m73j162N12
2053h31R54j30n78o5R01j32m36J174k46r37R34M31o70k24J83l28j68K77k38p27
2073h56j69J192Kj175L18M72k76M92Q27m24p32J38J471j64j105J94Q5n53P97J57
2093F91j306l63O23L02n31j67N19m26k77J319L20j101K40J082m27m03M06M59q63
2112I7j68N30k77q93M80K92q44J21O15n00l15R33J6p03R10Q11o48p74Q73M47j012
$$ plain form
2133 -9 88 460 327 -427 -83 -35 -379 -583 -294 -537 -665 -224 -178 -516 -56 888 98 75 627 851 252 61
2155 61 673 435 32 463 358 -508 -788 -603 -210 -277 -439 -333 -424 -346 334 -103 -394 299 552 373 652
2176 652 657 325 -117 386 563 -8 -604 -162 -23 -353 -639 -666 -672 -142 -132 -58 -179 -59 388 605 464 487 332
2199 332 -97 547 618 28 -233 -87 -32 -13 -469 -695 -766 -614 -384 -82 -244 -89 25 226 432 288 195 286
2221 286 600 533 371 47 -138 -86 -29 -456 -403 -628 -377 -441 -353 -430 -375 -2 57 338 36 64 403 373 430 465
2245 465 270 32 240 141 -244 -241 -365 -326 -267 -505 -570 -528 -233 -139 -84 -11 219 550 432 645 274 420 107
2268 107 364 254 -108 -323 -279 -227 -165 -291 -538 -173 -263 -292 -110 -104 104 496 196 401 636 468 238 605
2290 605 219 118 -85 -183 -136 -151 -286 -273 -497 -428 -276 -457 -152 21 -253 249 393 232 502 299 696 501
$$ packed form
2133iR7L72j33p54L44M8l44k04K89k43j28M41M6l38M60R44p90k3N52K24n99j91
2155F1O12k38m03M31j05q66k80J85L93o7j62J06r1P8O80m37k91O93K53j79K79
2176F52Nl32m42N03J77n71n96M42J39l30k86k7oN30J0P4j21J20M47K17j41K3j55
2199C32m29O44P1n90k61J46N5J9m56k26p1J52K30L02j62J55J14K01K06j44r3R1
2221B86L14o7j62l24j85N2N7m27N3k25K51o4Q8p7N5L73N9K81l02K8L39l0N7L5
2245D65j95k38K08r9l85Lj24L9N9k38o5M2K95R4N5P3K30L31j18K13l71J46l13
2268A07K57j10l62k15M4N2O2j26k47L65r0k9J82OK08L92l00K05K35j68k30L67
2290F05l86j01k03r8M7j5j35J3k24O9J52j81L05J73k74N02J44j61K70k03L97j95
$$ plain form
2312 501 239 51 328 -230 -230 -204 -377 -277 -482 -471 -176 -426 -391 -195 63 304 218 182 291 424 273 350 320
2335 320 401 313 -205 -296 -121 -328 -469 -323 -475 -606 -398 -263 -55 -11 -69 274 400 242 317 442 359 664
2357 664 98 -87 0 115 33 -119 -430 -299 -462 -452 -77 -234 -447 -47 189 246 124 185 231 493 380 322
2379 322 31 76 255 -176 -322 140 -419 -438 -253 -48 -336 -593 -356 113 -100 -173 246 158 231 374 532 206
2401 206 369 313 120 210 62 -195 -346 -298 -233 -328 -590 -287 -172 -237 -222 218 69 111 414 562 204 153 373
2424 373 223 6 79 -137 -216 -547 -164 -273 -397 -450 -52 -346 -150 -124 56 11 106 710 364 289 473 378 45
2447 45 64 150 -23 -291 -317 -83 -470 -309 -146 -636 -451 -146 104 145 158 246 126 84 405 522 -7 -119 458
2470 458 478 -65 -65 -61 -560 -440 -118 -411 -610 -435 -289 -43 -65 160 8 -187 337 667 19 32 762 407
$$ packed form
2312E01k62j88K77n58%K6j73J00k05J1K95k50L5J96K58K41q6l6J09J33j51P7l0
2335C20Q1q8n18r1J75k07j41J46j52j31K08J35K08M4n8L43J26j58P5J25q3L05
2357F64n66j85Q7J15q2j52l11J31j63J0L75j57k13M00K36N7j22O1M6K62j13n8
2379C22k91M5J79m31j46M62n59j9J85K05k88k57K37M69k13p3M19q8P3J43J58l26
2401B06J63n6j93R0j48k57j51M8O5r5k62L03J15o5J5M40j49M2L03J48l58n1K20
2424C73j50k17P3k16p9l31L83j09j24n3L98k94J96K6J80m5R5O04l46p5J84r5l33
2447D5J9Q6j73k68k6K34l87J61J63m90J85L05K50M1J3Q8j20m2L21J17n29j12N77
2470D58K0n43%Mm99J20L22k93j99J75J46K46k2K25j52j95N24L30o48J3P30l55
$$ plain form
2492 407 -244 -226 178 -480 -482 398 81 -903 -690 -216 -160 -118 -128 -178 -255 269 608 130 51 494 257 94 307
2515 307 357 -506 -287 255 -54 -175 -599 -141 -510 -323 105 -56 -265 53 650 -86 120 369 323 -33 293
2536 293 504 107 -147 311 161 -531 -421 -356 -406 -367 -42 -227 -401 -432 109 78 -22 515 505 265 518 519 30
2559 30 -54 149 -123 -46 22 -195 -338 -556 76 20 -613 -214 -150 -44 320 -113 438 126 295 323 529 -27
2581 -27 236 208 -58 -57 -207 -185 -265 -389 -178 -225 -384 19 -123 -419 141 200 -55 104 347 228 249 295 197 208
2605 208 -155 -130 36 -387 -307 116 -255 -364 -279 -209 -61 202 48 264 81 175 465 371 240 234 152 32 7
2628 7 145 88 -431 -380 -27 -445 -317 -403 -270 -380 97 240 200 131 42 221 74 123 448 90 60 295 110
2651 110 -215 -67 51 -378 -364 -276 -162 -153 -213 -42 -55 -102 -16 335 134 275 200 293 348 155 135 -109 3 -195
$$ packed form
2492D07o51J8M04o58kQ80l17r84K13M74N6M2j0n0p7N24L39m78p9M43k37j63K13
2515C07N0q63K19N42l09j21m24M58l69J87M28j61k09L18N97p36K06K49m6l56L26
2536B93K11l97k54M58j50o92J10O5n0L9L25j85j74l1N41l1j00N37j0k40K53Jm89
2559C0q4K03k72P7O8k17j43k18O32n6o33L99O4J06L64m33N51l12J69K8K06n56
2581b7K63k8k66Jj50K2q0j24K11m7j59M03j42k96N60N9k55J59K43j19K1M6r8J1
2605B08l63K5J66m23Q0M23l71j09Q5P0J48K63j54K16j83R4K90r4j31oq2j20k5
2628GJ38n7n19N1L53m18J28q6J33j10M77J43m0o9q9J79j47M9L25l58l0K35j85
2651A10l25J48J18m29J4Q8J14Ro0J71j3m7Q6L51k01J41p5R3N5j93k0k44J12j98
$$ plain form
2675 -195 -247 -167 -32 -195 -304 -449 -60 -168 -134 -156 80 145 314 484 435 122 -25 -34 279 48 -86 -191 -343
2698 -343 -134 -150 -391 -191 -385 -142 -233 17 136 -218 191 455 88 19 134 136 175 372 165 40 -168 59
2720 59 53 -221 -176 -70 -187 -188 91 -148 -12 55 185 279 127 223 239 270 387 256 63 120 -35 -83 -17 -405 -391
2745 -391 -306 -300 -369 -89 -194 -80 -89 31 12 307 151 342 252 149 392 -160 68 105 193 -94 -177 -234 92 -200
2769 -200 -249 -253 -192 -53 -160 100 -16 129 269 372 350 103 250 52 68 111 -76 -310 3 -185 -337 -341 -354
2792 -354 -102 -117 -42 -325 -34 93 142 293 477 157 10 36 243 294 37 74 -115 -1 -129 -279 -101 -293
2814 -293 -386 -221 125 -137 -32 147 207 129 47 262 361 320 131 171 68 122 0 -144 -34 -442 -236 -98 -303
2837 -303 -275 -13 -153 259 -16 -75 265 265 182 239 325 80 199 -6 28 167 90 -11 -334 -158 18 -244 -167
$$ packed form
2675a95n2Q0J35j63j09j45L89j08L4k2K36O5J69J70m9l13j47rL13k31j34j05j52
2698c43K09j6k41K00j94K43r1K50J19l54M09K64l67o9J15KL9J97k07j25k08K27
2720E9ok74M5J06j17jK79k39J36O7J30R4j52R6J6L1J17j31j93N7j55m8O6l88J4
2745c91Q5Oo9K80j05J14rJ20j9K95j56J91r0j03K43n52K28L7Q8k87q3n7L26k92
2769b00m9mO1J39j07K60j16J45J40J03k2k47J47j98J6M3j87k34L13j88j52mj3
2792c54K52j5P5k83K91J27M9J51J84l20j47K6K07N1k57L7j89J14j28j50J78j92
2814b93r3J65L46k62J05J79O0p8q2K15R9m1j89M0j03N4j22j44J10m08K06J38k05
2837c03K8K62j40M12k75n9L40%q3N7Q6k45J19k05L4J39p7j01l23J76J76k62P7
$$ plain form
2860 -167 5 -80 -14 129 106 7 113 89 273 269 154 390 34 -136 -19 -139 -120 -91 -227 -253 -322 -70 135 -202
2884 -202 -105 233 47 -170 312 366 -22 177 16 244 27 -255 10 -48 109 -209 -241 -181 -35 -39 -540 -185
2906 -185 12 -88 -9 218 115 111 163 153 333 157 328 94 77 73 45 -126 -230 -278 -168 -292 -317 -95 -51 -167
2930 -167 -57 311 -34 101 293 55 162 31 245 107 -79 113 -65 -186 -14 78 -167 -374 -24 -45 -132
2951 -132 -71 -273 -171 -47 0 319 25 218 272 -38 35 133 239 83 -78 -293 -22 -118 -178 -217 -124 -67 -5 -34
2975 -34 -51 42 76 -131 311 128 266 -67 103 134 113 -152 102 54 -3 -299 -86 -178 -35 -113 -125 -225 -122 -20
2999 -20 -29 44 115 266 -52 268 402 123 -144 149 -251 -135 4 58 -245 -128 -73 142 -231 -85 -18 36 -45
3022 -45 321 200 45 81 169 339 -48 -62 51 -74 55 71 -273 -440 -73 -147 -188 -130 -191 -49 -24 176 294
$$ packed form
2860a67J72q5O6J43k3r9J06k4J84mj15K36l56j70J17j20J9K9j36k6o9K52K05l37
2884b02R7L38j86k17M82N4l88J99j61K28k17k82K65n8J57l18l2O0J46mn01L55
2906a85J97j00P9K27j03mN2j0J80j76J71k34j7mk8j71j04m8J10j24k5K22M4j16
2930a67J10L68l45J35J92k38J07j31K14j38j86J92j78j21J72R2k45k07L50k1q7
2951a32O1k02J02J24M7L19k94J93N4l10P3R8J06j56j61k15K71r6o0l9R3N7O2k9
2975c4j7R3L4k07M42j83J38l33J70L1k1k65K54m8n7k96K13r2J43p8j2j00J03J02
2999b0rP3P1J51l18L20J34k79k67K93m00J16J39N4l03J17N5K15l73J46O7N4q1
3022d5L66j21j55L6Q8J70l87j4J13j25J29J6l44j67L67p4m1N8o1J42K5K00J18
$$ plain form
3045 294 -110 -174 484 64 46 353 86 -20 44 153 -33 -78 -115 -18 -394 -61 -88 -133 -224 93 -37 5 -66 250
3069 250 342 121 -69 91 229 1 59 46 -116 -209 -83 -249 -262 -117 -110 -250 -33 31 -192 83 72 135 407
3092 407 270 279 -172 -18 -115 167 46 63 135 -302 -78 -296 -58 -315 -67 -420 -234 18 50 -10 178 161 295
3115 295 162 198 246 1 -38 -98 149 197 -306 -234 -116 -289 -214 -54 -98 14 -42 -228 140 128 280 223 90 163
3139 163 257 -94 25 109 113 -61 -79 -130 -228 -86 -325 -51 -144 -195 57 -16 -113 79 254 146 155 121 -92 81 216
3164 216 -126 -314 -161 152 -335 -56 -70 -175 -232 -321 -59 -131 -127 -157 43 71 94 118 212 216 16 117 215 -102 115
3189 115 121 -120 -115 -211 -13 -310 43 -179 -228 -70 -118 115 -164 216 266 173 -32 147 321 133 11 200 -158
3212 -158 -7 -16 -102 -164 7 125 -318 -14 141 -43 -91 85 134 69 -269 128 102 -108 -54 16 -229 103 22 -15
$$ packed form
3045B94m04o4O58m20j8L07k67j06O4J09j86m5l7R7l76L33k7m5r1L17j30M2p1L16
3069B50R2k21j90J60J38k28N8j3j62r3J26j66j3J45Pj40K17O4k23K75j1O3K72
3092D07j37Rm51J54r7K82j21J7P2m37K24k18K38k57K48l53J86K52L2o0J88j7J34
3115B95j33L6M8k45l9o0K47M8n03P2J18j73P5J60m4J12n6j86L68j2J52n7j33P3
3139A63R4l51J19Q4Mj74j8n1r8J42k39K74r3n1K52p3r7J92J75j08Rl4k13J73J35
3164B16l42j88J53L13m87K79j4j05n7q9K62p2Ml0K00K8K3K4R4Mk00J01R8l17K17
3189A15Ok41Nr6J98k97L53k22m9J58m8K33k79L80N0r3k05J79J74j88j22J89l58
3212a58J51rq6o2J71J18m43L04J55j84m8J76M9o5l38L97k6k10N4P0k45L32q1l7
$$ plain form
3236 -15 -45 -18 -141 -134 -28 -221 193 -87 96 223 94 -12 74 246 82 199 129 35 92 3 1 184 -79 -127
3260 -127 -55 -41 69 -127 -116 -130 57 -53 -51 95 -2 63 225 132 36 5 7 -235 -143 -72 -158 -120 58 35 -192 123
3286 123 -161 -197 -170 -123 -57 -143 174 59 197 22 105 281 -210 5 158 -96 -213 -77 -57 -132 -180 -98 -78 18
3310 18 111 -101 -61 157 126 279 -110 125 299 140 151 127 149 157 8 31 -135 -336 -48 -37 -120 -90 109 50 -164
3335 -164 74 20 24 97 20 208 125 -86 -48 34 -141 -213 -41 -50 -294 2 -267 -242 30 -13 -200 -155 47 -39 78
3360 78 154 102 28 -161 -86 210 78 33 31 -53 -199 116 -185 -59 -35 -235 -152 -4 -20 -41 -209 -79 254 -72
3384 -72 55 109 -53 -37 -67 12 -113 -281 31 -309 -226 -37 -50 -25 -35 -50 -154 41 -27 39 205 83 260 161
3408 161 -153 267 -39 61 129 -241 -119 -178 51 -98 -238 -160 -239 5 -154 -34 29 -60 346 105 278 -84
$$ packed form
3236a5l0K7j23PJ06j93M14k80J83J27j29j06Q6J72j64J17p0r4N7q9kJ83k63m8
3260a27P2J4J10j96J1j4J87j10KJ46r7O5J62r3r6l1Kk42R2P1q6L8J78k3k27L15
3286A23k84l6K7M7O6q6L17j15J38j75Q3J76m91K15J53k54j17J36K0p5m8Q2K0R6
3310A8R3k12M0K18l1J53l89K35J74j59J1k4K2Qj49K3j66k01K88J1q3L0J99n9k14
3335a64K38n4MP3p7J88q3k11L8Q2j75p2J72rk44K96k69K5K72m3j87M5K02q6J17
3360G8P6n2p4j89P5K96j32m5kq4j46L15l01J26K4k00Q3J48j6k1j68J30L33l26
3384g2J27N4j62J6l0P9j25j68L12l40Q3J89j3K5j0j5j04J95o8O6J66j22J77r9
3408A61l14M20l06J00O8l70J22n9K29j49j40P8p9K44j59J20O3q9M06k41J73l62
$$ plain form
3430 -84 -22 27 -77 -215 -103 71 -233 -201 40 155 -112 -209 104 -264 -24 -168 62 -2 201 240 96 -41
3452 -41 82 166 -10 177 20 -32 -180 65 -88 -73 -205 -131 -203 -328 -142 -125 -159 12 375 -49 317 6 355
3475 355 -43 177 268 90 149 -47 64 -9 102 -46 -37 24 -19 -242 -210 -10 -12 120 308 66 168 -2 72 200
3499 200 89 35 30 -88 150 329 -161 -131 9 96 192 -62 -176 161 153 -90 -36 -24 41 95 309 201 126 -191
3523 -191 -197 -136 -73 -36 48 -176 -194 242 6 -165 158 45 -61 55 83 -7 -44 -37 219 335 68 20 10 -79 -25
3548 -25 -24 13 -33 -62 -112 -130 246 -128 -11 281 121 57 34 76 97 -33 -196 42 -30 280 -265 58 20 -191 57
3573 57 -64 38 -153 -130 -260 114 171 16 -107 150 168 6 61 96 168 120 75 26 88 8 -135 -38 -92 -133 -301
3598 -301 -8 -60 128 -49 92 -202 82 64 -55 164 106 -124 103 180 92 -66 96 151 -226 -60 103 -84
$$ packed form
3430h4O2M9j04j38J12J74l04L2K41J15k67r7L13l68K40j44K30o4K03L9j44j37
3452d1J23Q4j76J87j57n2j48K45j53J5j32P4p2j25J86J7l4J71L63m24L66l11L49
3475C55l98K20R1j78N9j96J11p3J11j48RO1m3k23L2K00kJ32J88k42J02j70P4J28
3499B00j11n4nj18K38J79m90L0J40Q7R6k54j14L37qk43N4J2O5N4K14j08p5l17
3523a91oO1O3L7Q4k24j8M36k36j71L23j13j06J16K8r0l7PK56J16k67m8j0q9N4
3548b5JL7m6k9n0j8L76l74J17K92j60o4k3M2K1j30j63K38p2L10n45L23l8k11K48
3573E7j21J02j91K3j30L74N7j55j23K57J8j62N5L5P2m8m5m9O2q0j43R7n4m1j68
3598c01K93n2J88j77J41k94K84j8j19K19n8k30K27P7q8j58J62N5l77J66J63j87
$$ plain form
3620 -84 44 21 -81 78 135 -98 -163 129 89 26 -68 109 167 122 42 115 116 -52 -119 70 83 -183 85 -50 -232
3645 -232 -8 -173 96 -153 -86 26 83 31 -105 47 99 110 356 -9 -134 -48 -100 -312 79 8 -131 -182 -156
3668 -156 -213 57 16 311 269 142 24 9 77 234 174 47 22 -161 131 -210 -176 -77 -162 -51 8 21 -178 -112
3692 -112 113 -104 -43 41 140 67 8 66 -52 -16 124 -5 -41 -227 -165 -74 -148 136 -208 -203 -294 -90 -60 89 40
3717 40 213 143 -24 278 -7 122 359 276 65 -75 -151 12 -128 1 -218 109 -65 -47 -90 -14 -86 62 17
3740 17 69 147 167 151 56 -12 106 61 -131 77 -23 -10 -179 -13 -260 -45 -143 13 -103 -179 -141 216 -51 -21
3764 -21 49 192 95 136 -10 53 -44 160 -17 -309 -54 -144 -85 -92 -91 -233 -114 -88 51 51 172 32 43 36 47 85 -46
3791 -46 148 -36 68 46 -17 -259 -166 -14 -93 -125 -131 -47 145 -46 -51 -104 -149 153 121 -23 7 -148 -4 58 105 -75
$$ packed form
3620h4J28k3j02J59N7k33o5K92m0o3r4J77N8m5q0P3Jj68o7J89J3k66K68j35j82
3645b32K24j65K69k49O7J12N7n2j36J52N2J1K46l65j25Q6n2k12L91p1j39n1K6
3668a56n7K70m1K95m2j27j18j5O8J57o0j27k5j83K92l41L4R9q5J11N9J3j99O6
3692a12K25k17O1Q4R9p3n9N8j18L6J40j29l6j86O2R1p4K84l44Nr1K04L0J49m9
3717D0J73p0j67L02k85J29K37q3k11j40p6J63j40J29k19L27j74J8m3P6p2J48m5
3740A7N2P8K0j6r5o8J18m5j92K08j00J3j69J66k47K15r8J56j16p6L8L57k67L0
3764b1P0J43r7M1j46O3r7K04j77k92K55r0N9pJj42J19K6J39%J21j40J1pJ1L8j31
3791d6J94j84J04k2o3k42R3J52p9l2oQ4J92j91nn3m5L02l2j44L0j55J44O2M7j80
$$ plain form
3817 -75 19 -107 3 -27 -145 -77 -207 -55 -111 43 0 42 -20 -101 -6 220 47 125 297 157 91 -230 -11 105
3841 105 -95 -85 -152 -231 -250 -90 108 70 -36 -48 5 10 36 115 63 -17 114 -66 79 39 -87 27 101 99 -94 -222
3867 -222 37 42 -134 -99 239 135 -2 -157 16 37 27 -15 -90 8 -15 175 113 5 29 -232 -192 -189 -131 -10 -37
3892 -37 -145 14 -103 136 148 118 209 72 165 -7 -67 -3 -68 -204 -181 -44 -237 -68 89 -91 3 -38 54 -262
3916 -262 -41 -72 -23 125 -77 61 4 20 95 25 -64 -123 -168 76 -141 8 160 -277 -134 -74 -120 -242 57 60
3940 60 -22 30 37 111 208 -69 156 -6 99 28 -129 -86 198 -76 75 -16 -114 -120 -135 -122 -23 131 -13 115 59 170
3966 170 -12 91 68 -26 75 63 -86 -131 178 -240 -227 -125 -214 -31 -152 18 15 84 62 128 179 172 167 13 125
3991 125 27 51 91 136 56 58 -121 42 60 -46 -94 96 -136 -117 32 93 22 -12 95 93 212 4 41 142 -45
$$ packed form
3817g5R4j26J10l0j18O8j30J52n6J54m3M2o2q1R5K26j73P8J72j40o6l21K19J16
3841A05k00J0o7p9j9J60J98l8j06j2N3NK6P9n2q0J31j80J45m0j26J14P4kj93j28
3867b22K59Nj76L5L38j04j37j55J73K1j0m2p5R8k3J90o2j08K4k61M0LN8J21k7
3892c7j08J59j17K39J2l0R1j37R3j72o0O4o5j36K3J37j93J69J57j80R4m1R2l16
3916b62K21l1M9J48k02J38n7J6P5p0q9n9m5K44k17J49J52m37J43O0m6j22K99L
3940F0q2N2PP4R7k77K25j62J05p1j57M3K84k74J51r1r8oj5J3R9J54j44J28n6J11
3966A70j82J03k3r4J01j2j49m5L09m18J3J02q9J83j21J70lO9k2O6N1pnj54J12
3991A25r8K4M0M5q0Kj79J63J8j06m8J90k32J9J49O1p1l4J07kJ19k08L7J01j87
$$ plain form
4016 -45 66 76 -51 -114 159 -54 -27 -47 -174 -219 149 113 -25 85 240 -53 38 291 80 -73 -1 75 -121
4039 -121 -74 66 -13 -62 -200 -9 -130 90 -117 -185 -145 -138 -213 -19 -71 285 99 -123 -9 41 -100 136 154 -78
4063 -78 -215 -161 148 108 -88 -76 -120 -121 57 -131 -37 78 164 83 13 189 23 229 42 80 227 113 -37 -17
4087 -17 -42 -38 -17 -298 -125 -75 94 -4 -5 45 80 114 4 136 43 -33 117 -144 27 5 -156 219 -251 -64 131
4112 131 -190 12 -6 -307 -105 64 -19 142 20 164 -127 262 130 -22 151 34 124 4 -88 30 -212
4133 -212 -229 2 -246 116 56 -143 -200 -84 -161 -17 93 17 -76 13 91 -204 42 81 10 34 -42 17 -61 -95 -268
4158 -268 -72 -216 -117 -104 114 -5 143 77 -196 189 202 -4 -98 205 -26 148 -60 -202 117 -126 -67 -154
4180 -154 -126 -148 -207 -34 -21 -46 272 -146 66 88 116 266 -69 152 95 85 42 -76 202 -238 -163 88 -135 145
$$ packed form
4016d5J11J0j27o3K73k13K7k0j27m5L68l6j38J10J55k93R1K53k11j53P2P6j96
4039a21M7J40p9m9j38J91j21K20k07o8M0Pp5J94n2L56j86k22J14N0j41K36J8k32
4063g8j37N4L09m0j96J2m4jJ78j88R4J15Q6q1p0J76j66K06j87L8J47j14j50K0
4087a7k5MK1k81J73N0J69r8jN0L5L4j10J32r3p6J50k61J71k2j61L75m70J87J95
4112A31l21K02j8l01K02J69q3J61j22J44k91L89j32j52J73j17R0j20r2J18k42
4133b12j7K31k48L62o0j99n7J16p7J44J10p6r3Q9P8k95K46L9p1K4p6N9p8l4j73
4158b68J96j44R9J3K18j19J48o6k73L85J3k06r4L03k31J74k08j42L19k43N9q7
4180a54K8k2n9J73J3k5L18m18K12K2K8J50l35K21n7j0m3j18K78m40P5K51k23K80
$$ plain form
4204 145 -145 14 63 63 142 47 179 68 167 -45 0 118 144 122 -175 135 4 -67 -154 83 -345 -27 -197 -386
4228 -386 -325 -91 133 16 -157 163 -73 111 171 226 158 23 72 -236 -128 96 -21 -18 -66 -146 17 -104 -32
4251 -32 -99 146 -72 -4 -126 -17 50 124 81 447 93 -64 -240 -9 -169 0 42 -192 -80 -170 -54 -7 83
4274 83 280 -30 -17 -10 65 18 41 90 -85 -4 67 17 141 7 -140 -170 70 -36 -94 -65 -109 -13 -235 -95 -61 124
4300 124 155 -13 313 -1 5 -160 -109 -27 155 92 -122 24 5 5 28 10 -154 -36 -188 16 167 207 168 62
4324 62 116 19 249 -130 9 -61 -20 -119 16 -59 -57 -132 -93 -7 -116 161 -266 7 41 -78 196 106 222 2 181
4349 181 92 47 -108 142 -82 -64 -152 -126 -118 -143 -154 -46 -100 69 218 24 52 248 136 18 164 213 110 79
4373 79 -54 45 13 59 2 -90 -98 -55 -56 -110 -20 -194 65 -72 91 49 116 81 130 235 187 54 -177 -105 51 -8 -35
$$ packed form
4204A45k90J59M9%P9r5J32j11R9k12M5J18K6k2k97L10j31p1q7K37m28L18j70j89
4228c86O1K34K24j17j73L20k36J84O0N5o8j35M9l08J08K24j17Lm8q0J63j21P2
4251c2o7K45k18O8j22J09O7P4m3L66l54j57j76K31j60J69M2k34J12r0J16M7R0
4274H3J97l10J3PP5m7K3M9j75Q1P1n0J24j34j47l0K40j06n8K9m4R6k22J40L4J85
4300A24L1j68L26l14Oj65N1Q2J82o3k14J46j9%K3j8j64J18j52K04J51M0l9j06
4324F2N4r7K30l79J39p0M1r9J35p5Kp5L9Q6j09K77m27K73L4j19K74r0J16k20J79
4349A81q9m5j55K50k24J8q8K6Qk5j1J08n4J69J49j94K8J96j12j18J46M9j03l1
4373G9j33R9l2M6n7r2qM3jn4R0j74K59j37J63m2O7l5M9J05m8j33k31P2J56n9k7
$$ plain form
4400 -35 6 85 -5 -111 -282 -113 116 -101 -15 13 127 104 -28 -55 -12 -9 -9 -90 -122 -142 -104 107 15 7 -125 -112 -181
4427 -181 6 -133 -93 -16 -111 -139 64 16 -111 49 -40 16 -21 177 157 51 -67 -78 -25 9 -130 -73 -175 260
4451 260 -93 -102 28 69 49 145 146 16 70 172 -27 4 112 42 73 -17 80 -43 21 165 -90 43 -63 -28 2
4476 2 -149 51 12 30 49 156 49 18 -159 112 -51 -207 25 26 -32 68 -81 -129 36 -22 -178 -70 -32 -298
4500 -298 -189 -67 15 -77 178 36 -28 -14 30 66 12 -145 -102 -29 -161 -141 -93 -141 -84 17 -34 181 38 10 59
4525 59 -1 -118 -26 -36 -77 68 -73 -108 -190 -87 -22 -272 -180 -195 -26 -35 -103 -84 2 139 90 -2 74 56 -148 192
4551 192 -127 -123 124 144 -82 -51 -22 -17 -192 -102 -106 105 38 16 7 -145 157 232 194 109 44 198 4 193 -65 120
4577 120 -267 -22 60 -45 -81 -156 -171 50 133 9 -40 74 31 60 70 -53 56 201 74 201 221 153 -73 -53
$$ packed form
4400c5M1P9r0j06j71J69K29k17Q6K8J14k3j32k7M3L%q1l2k0L8K11r2qj32J3o9
4427a81J87j39M0P7r5k8K03m8j27J60q9N6l7J98k0j06j18j1N3L4j39N7j02M35
4451B60l53rJ30M1k0R6Jj30N4J02j99L1J08p0L1r0R7j23O4J44k55J33j06L5L0
4476Bj51K00l9J8J9J07j07l1j77K71j63j56K32Jn8J00j49m8J65n8j56J08L8k66
4500b98J09J22Q2r2K55j42o4J4M4L6n4j57M3P3j32K0M8m8N7J01n1K15j43k8M9
4525E9o0j17R2j0m1J45j41l5q2J03O5k50R2j5J69ro8J9Q6J37m9r2P6j8k04L40
4551A92l19MK47K0k26L1K9Nj75R0mK11o7k2rj52L02P5l8q5o5J54j94J89k58J85
4577A20l87K45Q2j05l6p5j5K21Q3j24m9J14m3K9J0j23J09J45j27J27K0o8k26K0
$$ plain form
4601 -53 75 229 -77 -86 3 -315 -42 19 127 121 -24 -241 20 4 20 -118 108 46 -238 -185 -217 33 -113 -31
4625 -31 -124 -37 -218 -56 -100 -81 -50 86 -73 55 7 -26 108 79 -149 125 44 -117 -70 -151 -30 -81 96 -161
4649 -161 -159 -19 -273 -127 63 -79 23 38 -106 92 161 20 -170 -97 158 109 -102 -133 -118 -31 -27 -162 13 10
4673 10 -92 -76 -17 -41 83 108 70 52 37 125 -6 158 76 -27 -9 -29 -4 -122 -92 102 61 -6 -216 61 -15 64
4699 64 96 -55 -55 62 -94 -110 -35 -296 62 -43 -159 58 52 -166 -158 -126 -121 98 -127 -60 104 -64 21 208 -114
4724 -114 300 -25 218 171 84 282 -171 -92 160 12 -9 8 -12 -112 64 -303 -82 -125 -300 5 -147 68
4746 68 -148 8 75 -44 97 99 -158 52 -87 -108 102 -46 15 -170 25 -185 70 -99 -30 -1 -55 51 -59
4769 -59 33 213 -151 137 -69 50 118 -31 -74 -155 57 -107 -230 141 -105 15 -63 -122 -222 -218 36 22 -185
$$ packed form
4601e3J28J54l06rQ9l18K73O1J08oj45k17K61j6J6j38K26o2k84N3l2K50j46Q2
4625c1r3Q7j81J62m4J9L1J36j59J28m8l3J34k9k28K74q1j61M7q1J21n1J77k57
4649a61KJ40k54J46J90j42J02J5j44J98O9j41j90P3K55m9k11l1J5Q7Mj35J75l
4673A0j02J6N9k4J24K5l8j8j5Q8j31J64q2j03J8k0K5j18L0J94m1o7k10K77p6P9
4699F4L2j51%J17j56j6P5k61L58j05j16K17ok18QL2NK19k25O7J64j68Q5J87l22
4724a14M14l25K43m7q7J98m53P9K52j48k1J7k0j00J76l67K21m3j75L05j52K15
4746F8k16J56O7j19J41Kk57K10j39k1K10j48O1j85J95k10K55j69O9K9n4J06j10
4769e9R2J80l64K88k06J19O8j49m3q1K12j64j23L71k46J20p8n9j00MK54j4k07
$$ plain form
4792 -185 165 -69 -51 174 -81 77 -151 200 -130 -131 -119 -153 -14 -115 73 -249 112 162 40 -182 -28 -57
4814 -57 -333 -102 -122 79 162 -11 13 134 37 -61 -1 19 -32 -150 -159 52 -288 -94 80 11 36 38 4 82 98 -71
4840 -71 151 74 142 -70 58 100 34 -78 -38 50 5 -144 4 -306 -138 -89 10 272 125 115 112 -2 -32 -151 72
4865 72 35 104 -36 74 45 -106 -110 -85 -280 -62 -89 -110 32 1 -128 53 -127 86 99 -86 136 15 91 -101
4889 -101 117 110 27 -61 -146 -40 38 -233 193 42 -164 -164 -122 -2 -126 140 124 247 5 -56 60 57 -79 -221
4913 -221 -124 64 -84 -146 -96 -180 128 -58 4 95 -44 102 -20 296 38 -39 154 199 135 129 157 18 76 -45
4937 -45 93 -177 -67 -202 -157 150 187 73 -5 9 6 36 33 48 -118 110 14 136 -61 -208 64 -12 60 -51 -45
4962 -45 77 -154 10 -41 -121 105 -350 167 -23 -68 -20 137 -8 109 -78 -4 65 -149 17 -112 -17 -90 9
$$ packed form
4792a85L50k34J8K25k55J58k28L51l30jJ2l4J39j01J88l22L61N0j22k22J54k9
4814e7k76K31k0K01Q3j73K4J21r7r8O0K0n1j18rK11l40J94J74o9K5Kl4P8J6j69
4840g1K22p7O8k12J28M2o6j12M0Q8m5j49J48l10J68M9R9K62j47j0lj14l0j19K23
4865G2l7O9j40J10k9j51mK5j95K18k7k1J42l1j29J81j80K13J3j85K22j21P6j92
4889a01K18pq3q8q5J06P8k71M26j51k06%M2J20j24K66j6J23k42o1J16lj36j42
4913b21R7J88j48o2N0q4L08j86O2R1j39J46j22L16k58p7J93M5o4oK8j39N8j21
4937d5J38k70J10j35M5L07L7j14p8J4lL0lJ5j66K28r6J22j97j47K72p6P2j11O
4962d5J22k31J64n1q0K26m55N17j90m5M8J57j45J17j87P4O9k14J66j29R5p3R9
$$ plain form
4985 9 102 -74 -71 32 15 5 20 16 -66 72 38 -154 80 35 -74 -35 -151 136 33 -141 77 106 -124 -86 -106 101
5011 101 -33 -89 133 43 228 -61 63 -177 112 99 50 68 133 193 163 39 -176 -157 181 -5 -173 55 23
5034 23 17 147 25 -131 -42 10 -9 -111 82 -2 -115 -26 180 -247 -106 -90 30 -96 -222 -20 -186 -27 -119
5057 -119 -306 114 120 54 -37 12 -129 108 93 293 -2 103 17 92 -96 -6 -105 11 -262 -288 14 114 -277 -94
5081 -94 21 -156 207 214 164 255 52 -49 72 -94 -83 153 139 28 20 -1 47 -74 58 69 -65 -20 116 -91
5105 -91 -172 188 262 -4 74 89 75 125 187 2 44 -144 54 -210 -16 -158 -47 88 -85 59 35 120 -148 -42
5129 -42 -54 134 222 174 -12 -10 -33 -92 -120 -61 20 -109 94 -357 -87 -93 98 -1 -27 79 -157 80 -144 -156 -63 98
5155 98 -33 11 -90 125 1 -40 -38 -81 -37 34 -274 38 53 -1 249 -35 44 259 79 117 79 -62 80 20 219
$$ packed form
4985IR3j76LJ03j7j0J5mq2J38l4j92K34m5j09L9j16K87j03j74K18K9k30L8k0K07
5011A01j34n6K22r0J85k89J24k40K89j3m9J8O5O0l0j24k15J9L38j86j68K28l2
5034B3oJ30j22j56Q9N2j9j02J93q4j13Q9K06m27J41J6J20j26j26K02j66J59r2
5057a19j87M20Oo6r1M9j41K37j5K00k95J05q6P5j88R0r9J16k73k6L02J00l91J83
5081i4J15j77L63Pn0R1k03j01J21j66J1K36j4j11qk1M8j21J32J1j34M5J36k07
5105i1q1L60P4k66P8J5j4N0O2j85M2j88J98k64J94j42J11J35j73J44k4Q5k68J06
5129d2j2J88Q8m8j86Kk3n9k8N9Q1j29K03m51K70oJ91r9k6J06k36K37k24j2R3J61
5155I8j31M4j01K15j24m1Km3M4P1l08L12J5n4K50k84P9K15j80L8l8j41J42o0J99
$$ plain form
5180 219 221 220 -104 -82 -9 -67 40 -42 -144 79 -14 49 -9 60 62 11 174 284 -47 72 86 -44 83 22 -242 -140
5206 -140 159 -88 -148 -121 81 16 -67 70 -69 -41 198 36 32 113 46 -204 32 85 -100 -65 -155 -70 -73 97 -150
5231 -150 -182 143 -21 39 45 67 131 156 35 113 118 69 -86 65 128 37 -9 12 81 -210 -11 -89 -69 -100 -38 -100 -140
5258 -140 -64 -100 123 97 85 80 137 -71 124 -249 126 -77 132 -77 -116 -7 27 63 -227 -97 196 -147 -72 244
5282 244 -309 -105 266 -136 17 9 53 39 9 -199 -128 -75 -50 -121 38 11 -64 62 -171 -90 -146 35 -202 76
5306 76 109 192 -127 215 180 -27 35 -172 11 41 20 -116 -157 -92 -74 115 -217 265 20 146 -37 -63 20 54
5330 54 154 114 147 83 -12 -106 75 318 5 -91 53 -80 69 -13 -160 -68 -29 120 -47 111 64 42 184 395
5354 395 -96 -13 -123 -62 -113 -60 173 95 -19 35 169 -2 -27 26 -290 -40 -130 -95 3 114 -59 117 -74 -151
$$ packed form
5180B19Kjl24K2P3n8J07q2j02K23r3O3n8O9Kn1J63J10l31J19J4j30J27o1k64J02
5206a40K99k47o0K7K02o5q3J37j39K8K39j62mQ1o7k50K36N3j85L5r0Q5lJ70k47
5231a50l2L25j64O0OK2O4K5j21P8Nm9j55J51O3r1m6K1O9k91J99p8K0l1O2o2m0
5258a40P6l6K23k6j2nN7k08J95l73L75k03K09k09l9J09L4L6k90J30K93l43P5L16
5282B44n53K04L71m02J53qM4j4l0k08P1N3K5p1J59k7p5J26k33Q1n6J81k37K78
5306G6L3Q3l19L42l5k07O2k07J83L0k1j36m1O5J8J89l32M82k45J26j83k6Q3L4
5330E4J00m0L3o4r5r4J81K43l13r6J44j33J49q2j47R2L9J49j67J58m7k2J42K11
5354C95m91Q3j10O1n1N3K33p8j14N4J34j71k5N3l16K50r0L5R8J11j73J76j91p7
$$ plain form
5378 -151 47 -123 131 -15 41 1 -60 -88 -105 -52 8 -5 -71 -155 -77 32 -163 -37 213 303 -165 205 86 198
5402 198 -113 -20 -27 -309 78 131 -63 242 3 -29 41 9 50 -67 -193 -7 57 -71 139 306 64 -1 99
5425 99 16 51 -119 39 52 -60 54 -91 -24 -156 82 69 110 -27 46 141 -120 303 -9 111 177 -8 -108
5448 -108 -159 91 -178 -56 117 -127 -12 -95 111 -307 18 4 -64 -28 22 74 63 -42 -136 187 39 -104 91
5471 91 16 108 -53 -109 124 -173 12 -21 -33 -170 -183 47 -48 113 162 181 -111 228 49 221 -103 -74 86 -76
5495 -76 -44 -86 -68 -145 -76 -46 168 -125 101 48 -66 -254 180 109 -109 -21 -14 -149 -163 -48 -25 -63 -32 -128 2 30
5521 30 16 -68 96 -39 122 52 -132 102 -23 25 20 -60 -29 -118 -118 -117 -143 -12 -44 14 64 23 33 -149 -188 -51 87
5548 87 -32 -89 187 91 -57 39 76 -20 20 -25 229 -77 -18 -149 -85 -95 81 76 -104 56 62 80 66 28 -146 219
$$ packed form
5378a51J98j70K54j46N6m0o1k8j7N3O0j3o6q4P8J09j95J26K50R0m68L70j19J12
5402A98l11R3pk82L87N3j94L05k39l2P0l2M1j17j26J86O4j28K10J67k42o5J00
5425I9q3L5j70J58J3j12J14j45O7j32K38j3M1j37P3R5k61M23l12J20O6j85j00
5448a08n1K50k69J22J73k44J15q3K06m18L25j4o8L6N0N2j1j05r4L23j48j43J95
5471I1p5R2j61n6K33k97J85l3j2j37j3K30r5J61M9J9k92L39j79J72l24K9J60j62
5495g6L2m2J8p7O9L0K14k93K26n3j14j88M34p1k18Q8Pj35j4J15K3l8L1r6J30K8
5521C0j4q4J64j35J61p0j84K34j25M8nq0L1q9%Jk6J31l2N8N0m1J0j82l9J37J38
5548H7j19n7K76r6j48R6L7r6M0m5K54l06N9j31O4j0J76nj80J60OJ8j4l8j74L65
$$ plain form
5574 219 -54 -182 -197 -19 95 -213 25 -38 125 -31 21 243 24 -153 -61 -40 -121 20 -102 160 2 95
5596 95 91 59 209 89 76 -86 258 98 92 -63 43 -169 9 -37 172 28 -179 61 -23 -57 18 126 -6 96
5620 96 41 7 3 92 207 242 12 59 -167 -25 -156 -4 26 75 21 1 140 13 205 147 233 -34 151 78 43
5645 43 162 -49 -7 -76 -174 56 -6 175 -98 -63 -101 -5 230 -216 -89 -1 1 196 69 17 -133 3 -5 38 -5
5670 -5 -15 192 -34 -32 179 -123 114 -142 -105 265 -96 71 26 83 41 187 -68 135 -269 304 -6 -115 -68
5693 -68 -180 65 -88 -125 -230 20 32 63 -77 27 -158 -139 -199 118 152 32 -4 -83 -160 61 55 -37 55 -187 -192
5718 -192 -225 43 -36 -3 -83 -110 -68 112 65 -190 169 124 -181 68 -141 142 198 50 39 -103 47 68 64 -68
5742 -68 -120 82 -124 111 -39 158 -23 -79 -234 -106 -52 132 140 -73 106 25 28 -129 -166 -83 51 -84 -18 -60
$$ packed form
5574B19k73j28j5J78J14l08K38o3J63j56N2K22k19j77R2K1q1J41j22K62j58R3
5596I5ml2J50j20j3j62L44j60oj55J06k12J78m6K09j44k07K40q4l4P5J08j32J02
5620I6n5l4mQ9J15L5k30M7k26J42j31J52L0M9n4k0J39j27J92n8Q6k67J85p3l5
5645D3J19k11M2o9r8K30o2J81k73L5l8R6K35m46J27Q8KJ95j27n2j50J36qM3m3
5670ej0K07k26KK11l02K37k56L7L70l61J67m5N7m2J46k55K03m04N73l10j09M7
5693f8j12K45j53l7j05K50J2L1j40J04j85J9o0L17L4j20l6p9p7K21or2R2k42n
5718a92l3K68p9L3q0k7M2J80m7k55L59m5l05K49k09K83N6j48j1j42J50K1mj32
5742f8n2K02k06K35j50J97j81n6j55J28N4J84Qk13J79q1Lj57l7Q3J34j35O6m2
$$ plain form
5766 -60 167 -74 150 267 3 147 175 66 231 145 -13 76 -43 -89 26 29 90 -63 68 4 -22 10 -110 -13
5790 -13 -74 -10 -107 -26 71 45 130 66 -53 27 -46 180 43 -41 -136 -91 -156 -231 228 -18 81 67 -289 118 -58 -131
5816 -131 -166 -65 45 119 48 173 -102 99 240 -167 112 -182 -44 -100 -6 116 34 64 -172 -27 40 -21 95
5839 95 -201 38 3 -15 268 -166 98 101 -157 -45 82 -177 -104 168 -152 -256 58 160 28 7 -101 13
5861 13 38 106 -17 106 45 -27 -15 104 97 -14 -10 41 -55 -92 -145 -140 109 -167 -26 -157 -85 199 16 -32 289 -78
5887 -78 -51 -135 41 176 160 147 -38 -125 92 25 193 -97 -122 -152 -52 225 -217 55 -44 110 28 24 -29 -15 19
5912 19 -25 -40 33 -56 -26 22 -112 29 104 1 78 43 -50 -25 95 -8 -89 60 -90 29 -72 144 -12 -11 -23
5937 -23 85 59 -123 3 -145 77 -138 -185 -87 -78 199 -158 51 -116 -72 244 -75 54 11 79 -25 61 104 61
$$ packed form
5766f0K27k41K24J17k64J44K8j09J65q6j58Q9j19m6J15LO1j53J31o4k6L2j20R7
5790a3o1O4r7Q1R7k6Q5o4j19Q0p3K26j37q4r5M5o5p5M59k46R9j4l56M07j76p3
5816a31l5J01J10P4p1J25k75K01J41m07K79k94J38n6R4J22q2L0k36J45O7o1J16
5839I5k96K39l5j8K83m34K64Lk58J12J27k59P3K72l20j04L14J02j32k1j08J14
5861A3K5O8j23J23o1p2J2J19pj11MN1r6l7n3NK49k76J41j31P2K84j83m8L21l67
5887g8K7q4J76J35j6j3j85q7K17o7J68k90k5l0J00K77m42K72r9J54q2mn3J4L4
5912A9m4j5P3q9L0M8j34J41P5j03P7l5r3K5J20j03q1J49j50J19j01K16j56Jj2
5937b3J08k6j82J26j48K22k15m7R8RK77l57K09j67M4L16l19J29m3O8j04Q6M3m3
$$ plain form
5961 61 -32 -155 -77 108 -70 158 -34 6 71 9 106 7 107 85 -17 -26 71 117 85 87 18 260 -55 -320 -63 -29
5987 -29 8 -125 -56 -38 10 181 -192 -141 79 66 -24 -2 -19 -150 -53 -66 -121 -53 -87 -23 -18 32 -11 152 -42 110 48
6014 48 137 93 -11 3 19 154 -34 191 -87 -43 48 133 69 229 -34 42 55 164 -220 236 232 -75 46 -242
6038 -242 -95 -35 21 -58 18 192 -75 -197 51 249 -151 0 -31 140 230 -8 165 -141 -51 134 -37 31 -150
6061 -150 -40 318 128 134 13 130 -35 55 -112 20 -154 65 -53 -75 5 229 -94 122 4 18 -86 -9
6083 -9 -205 -119 57 30 0 -193 100 -26 -44 77 50 -106 -58 28 90 -164 -29 200 122 33 38 -167 81 149 13
6108 13 49 122 85 -91 165 182 203 -96 130 -122 -95 -14 -95 -94 -142 43 -47 -200 -119 216 -161 -119 -32 -55 24 118
6134 118 -14 180 -11 213 55 46 47 216 -41 -67 109 24 48 -206 59 -116 -7 75 -5 208 -35 40 -298
$$ packed form
5961F1r3j23P8J85j78K28j92M0O5o2R7r9J00k2j02rR7M6l2Ko9K42l15k65K57L4
5987b9L7j33O9J8M8J71l73N1K20j3r0K2j7j31R7j3n5O8l4O4NN0m3J63j94J52o2
6014D8Q9m4j04J4J6J35j88K25k78M4R1Q5o4J60k63P6J3J09l84M56ml07J21k88
6038b42J47O0N6p9P6J74k67j22K48J98m00J51l1J71R0k38J73l06R0J85j71O8j81
6061a50J10L58j90Oj21J17j65R0j67J32j74K19j18k2Q0K24l23K16j18J4j04P7
6083ij96Q6J76k7l0j93K93j26j8J21k7j56M8Q6O2k54J35K29p8q9Nk05K48O8j36
6108A3L6P3l7j76K56J7K1k99K26k52K7Q1q1Jm8J85r0j53Q1L35l77M2Q7k3P9R4
6134A18j32J94j91K24j58rJJ69k57k6J76q5K4k54K65j75J09Q2q0K13k43P5l38
$$ plain form
6157 -298 53 153 -42 -228 1 90 -56 69 -147 -90 -92 79 -167 -64 69 59 -292 -45 -41 -158 -45 127
6179 127 135 -26 -22 53 110 -113 -12 -217 142 -78 -102 -109 -128 172 173 34 105 -171 -11 -115 212 86 -57 144
6203 144 39 35 -13 76 -69 55 146 -53 -21 46 -132 68 -13 -6 -104 -69 -34 93 -118 -14 -122 171 218 57 142
6228 142 0 -9 258 30 -90 -170 -114 -46 -24 122 -27 162 20 -57 -29 152 -21 -56 -159 218 230 35 51 -65
6252 -65 -186 -62 -43 17 -85 59 -65 -11 -70 20 -82 -152 -126 82 125 67 -11 48 81 30 121 226 -102 5 -3 -170
6278 -170 122 -22 -84 -92 -137 -136 -141 -164 -133 -111 8 0 144 -85 -77 -88 74 68 20 27 -83 10 -19 150 84 -162 41 -23
6306 -23 138 -235 241 15 -141 -100 62 58 -174 -9 -31 -143 128 -27 122 90 -85 43 110 -50 10 12 1 -70
6330 -70 -242 -40 -72 52 151 -55 152 -159 80 -104 2 37 -2 112 -161 121 -50 12 -192 136 -20 -79
$$ packed form
6157b98L51J00j95j86K29Q9j46J25k16N7kJ71k46J03J33j0l51K47Mj17J13J72
6179A27Qj61MP5N7k23J01k05L59k20k4pj9L00Jj39P1k76J60j04L27j26j43K01
6203A44j05mm8Q9j45J24R1j99L2O7j78K00q1Pr8L5L5J27k11J04j08K93M7j61Q5
6228A42j42rK67k28j20q0N6O8K2J46j49J89j42p7K8J81j73l5j03L77J2j95J6j16
6252f5j21J24J9O0j02J44j24N4n9R0j02p0K6K08M3n8p8N9L3n1R1J05l28J07qj67
6278a70K92j44o2qm5Jnk3L1K2J19qJ44k29Qj1J62om8Pj10R3k9J69o6k46K03o4
6306b3J61l73M76k26j56M1J62mk32J65k2j12K71j55J49l2j75J28O7j60O0Kj1p1
6330g0j72K02l2J24R9k06K07l11K39j84J06L5l9J14k73K82j71O2k04L28j56n9
$$ plain form
6352 -79 -53 149 44 -27 -7 229 228 3 20 35 -172 -111 10 -168 -44 68 74 -50 68 -117 -11 12 -19 -170
6376 -170 -41 161 49 133 -176 237 -13 179 -14 -87 -54 -69 -114 34 -149 169 140 -83 -107 -182 40 -91 -84
6399 -84 -77 -23 -260 219 -38 354 112 -4 -10 -95 -45 -55 53 -124 -2 -213 -96 71 -138 -155 30 15 88 -99
6423 -99 193 245 -127 -23 145 -78 98 -97 -5 165 -143 151 33 -70 -49 -83 -124 5 24 -62 154 89 -215
6446 -215 63 71 -35 4 207 46 104 21 93 -8 116 -134 7 67 84 -25 66 13 79 -322 122 18 46 57
6470 57 -92 -32 -70 196 -124 89 -15 -7 12 -103 -53 3 -180 29 -164 49 -125 -16 -146 -158 -101 54 -30 10
6494 10 105 -133 -35 -109 -94 -25 25 -129 0 77 -166 128 73 31 99 25 -236 -194 -22 164 39 152 159 -138 -48
6519 -48 153 -90 -86 11 -59 23 -36 -211 156 60 51 30 123 2 11 -10 6 145 -89 27 15 16 -14 46 -166 12 -73
$$ packed form
6352g9K6K02j05p1K0K36jk25J7J5k07O1J21j78J24J12Oj24J18j85J06K3l1j51
6376a70J29K02j12Q4l09M13k50J92j93p3L3j5m5J48j83L18k9k23k4p5K22j31P
6399h4PN4k37M79k57L92k42j16oq5N0j0J08j77J22k11J17J67k09j7J85j5P3j87
6423i9K92N2l72J04J68k23J76j95R2J70l08K94j18j03K1l4m1J29J9q6K16o5l04
6446b15K78Qj06L9K03j61N8q3P2j01J24k50J41O0J7j09R1n3O6m01M44j04K8J1
6470E7j49O0l8K66l20K13j04QJ9j15N0N6j83K09j93K13j74J09j30j2N7J55q4M0
6494A0R5k38R8p4J5O9N0j54J29P7k43K94n5m2O8p4k61M2J72J86j25J13Pk97R0
6519d8K01k43MR7p0Q2n9j75L67r6rk1R3j21Rk1J6J39k34J16j2Jl0O0k12J78q5
$$ plain form
6546 -73 -42 -13 12 -28 -137 149 182 -115 -65 -196 -249 -152 -75 123 45 -101 -132 137 -136 -73 161 -6 126 99 -9
6571 -9 -122 114 -29 9 -187 -132 -73 -162 5 -86 143 -20 113 -136 111 -122 -216 -41 -146 131 -178 133 124
6594 124 -169 16 55 -51 66 33 -152 -51 116 -56 17 130 107 35 52 143 -276 -87 23 12 29 -352 -46
6617 -46 78 -140 -76 -80 130 -154 -119 115 82 -131 -120 122 -13 112 73 -40 -44 49 -130 199 -85 -26 7 52 -25
6642 -25 -73 140 98 -76 48 -25 -55 130 -8 59 -43 11 -28 -123 200 32 72 60 -9 -39 -8 -36 1 204 -120
6667 -120 -63 -58 -46 -116 -71 7 172 -185 26 -58 -85 134 -17 249 102 196 18 -156 -36 18 88 241 -174 127
6691 127 -85 252 95 73 247 144 144 1 109 -1 98 -250 -235 -64 -52 -9 86 101 -306 -29 -13 13 21 5 -70
6716 -70 -95 20 -79 77 -157 -89 -56 -1 -131 -124 -218 76 66 -99 133 31 -248 55 -95 -133 -128 -218 -129 188 13
$$ packed form
6546g3L1K9K5m0j09K86L3k97N0j31n3R7P7J98p8j46l1K69k73O3K34j67J32k7j08
6571ij13K36j43L8j96N5N9q9J67r1K29j63J33k49K47k33r4J75j05K77l09L11r
6594A24k93J85L9j06J17l3j85J01J67j72P3J13k3p2J7R1m19J89J10j1J7l81L06
6617d6J24k18O4mK10k84L5K34l3k13J1K42j35J25l9j13mR3j79L29k84N9L3M5p7
6642b5m8K13m2j74J24p3l0J85j38O7j02N4l9r5L23j68M0j2o9l0L1k8L7K03l24
6667a20N7NJ2p0M5P8J65l57K11q4k7K19j51K66j47R4j78j74J20N4P0J53m15L01
6691A27k12L37j57k2J74j03%j43J08j10R9l48J5J71J2M3R5J5m07K77J6K6Qj6p5
6716g0k5J15r9J56k34O8L3N5j30Pr4K94j0j65K32j02k79L03j50l8Nr0Q9L17j75
$$ plain form
6741 13 143 71 64 -37 101 -98 -63 -25 -63 160 118 -30 -50 87 -74 16 -166 -25 19 13 81 94 142 52 -53 -55
6767 -55 52 -143 41 163 3 17 202 -221 -127 -67 -216 -95 82 -369 260 -324 -44 69 86 -69 -242 -2
6789 -2 81 21 -85 75 159 53 -54 -270 -228 129 -179 -93 -31 46 84 7 69 210 68 17 -25 74 62 -9 45 -58
6815 -58 70 -121 251 -40 52 136 -104 -120 69 -119 166 -181 76 131 -127 -76 109 239 -21 146 17 98
6837 98 -104 -41 68 30 -87 27 -76 8 -36 -101 165 -41 7 65 -31 -125 154 -13 89 -76 -143 202 -5 -152
6861 -152 -128 179 204 -1 -133 -122 111 1 -246 20 254 187 42 28 21 -74 -50 -85 110 -84 46 31 -63 198
6885 198 -156 93 31 83 46 138 47 -81 110 107 189 46 -175 101 66 33 -37 -52 168 -14 28 -63 -53 163 -157
6910 -157 -7 162 63 -4 -84 -28 53 61 69 140 45 -67 74 -193 -222 217 -13 -67 117 -103 143 -14 75 -66 -166
$$ packed form
6741A3J30p2pj01J38j99L5L8l8K23m2j48k0J37j61R0j82J41M4oO8J3M8r0j05k
6767e5J07j95J84J22j60J4J85m23R4O0j49J21J77m51O29n84K80J13J7j55j73K40
6789bQ3o0j06J60Q4j06j07k16M2L57l08Q6O2P7L8p7O2J41j42n1m2R9j2p1N4j03
6815e8J28j91L72k91R2Q4k40j6J89j88K85l47K57N5k58N1J85J30k60J67j29Q1
6837I8k02O3J09l8j17J14j03Q4m4o5K66k06M8N8r6r4K79j67J02j65o7L45k07j47
6861a52K4L07K5k05j32J1K33j10k47K66K34o7j45j4pr5K4l5J95j94J30j5r4K61
6885A98l54K49o2N2l7R2r1j28J91lQ2j43k21K76l5l3p0j5K20j82M2r1J0K16l20
6910a57J50J69r9o7q0N6Q1QQP1r5j12J41k67k9M39k30n4J84k20K46j57Q9j41j00
$$ plain form
6935 -166 117 -99 6 -105 83 -157 -147 173 78 26 127 238 -58 -129 13 -97 81 73 -73 58 -47 -99
6957 -99 -110 -123 131 -116 -24 -112 154 143 130 76 -154 -163 88 52 30 65 33 52 74 250 216 -111 94 183 -177 -126
6983 -126 115 119 72 71 204 -127 167 78 119 -54 -74 52 -14 99 106 10 -176 -26 7 45 -107 -211 112 -36 174
7008 174 46 -44 -26 -23 -22 131 -13 82 243 197 124 133 167 -136 40 -87 60 -76 158 28 -128 -7 -48 148
7032 148 -134 -84 -4 -130 61 -19 -48 6 47 25 -290 51 101 -138 -1 81 -46 287 -19 -194 23 78 40 209
7056 209 26 84 147 -73 -13 -4 -28 -4 -27 10 -1 -1 -47 -110 69 -38 18 122 -182 47 19 -112 -38 10 166 143
7082 143 49 51 62 55 73 -121 -74 202 -294 -59 10 111 -111 -170 225 43 -67 -51 -6 -7 -15 -132 162 -225 50
7107 50 368 -42 161 108 -60 -25 -190 -28 -183 170 13 -130 85 103 -37 233 -241 213 151 99 -106 -123
$$ packed form
6935a66K83k16J05j11J88k40J0L20r5n2J01J11k96p1J42j10J78qj46J31j05n2
6957i9j1j3K54k47R2q8K66j1j3n4k30rK51l6k2L5l2J9K2J76l4l27K05Q9l60N1
6983a26K41Mm7jJ33l31K94q9M1j73k0J26o6J13Pr6j86J50L3L8j52j04L23j48K10
7008A74j28r0J8LJJ53j44R5J61m6p3RL4l03J76j27J47j36K34j30j56J21m1J96
7032A48k82N0Q0j26J91q0k9N4M1k2l15L41N0k39J37Q2j27L33l06j75K17N5l8J69
7056B09j83N8O3k20O0Rk4K4k3L7j1%m6o3J79j07N6J04l04K29k8j31P4M8J56k3
7082A43r4KJ1pJ8j94M7K76m96K35O9J01k22n9L95j82j10J6M5jqj17K94l87K75
7107E0L18m10K03n3j68L5j65J62j55L53j57j43K15J8j40K70m74M54o2n2k05j7
$$ plain form
7129 -123 -149 -50 3 -288 3 -71 111 60 155 120 23 -18 -43 -18 126 41 186 -142 86 -16 -39 44 35 47 -48 -51 -187
7156 -187 -71 28 106 -259 33 237 137 -30 43 113 34 -74 -91 48 -91 -27 222 -81 173 41 134 -76 -115
7179 -115 -153 46 40 -199 139 93 -153 -116 -34 109 67 -120 -13 -42 -100 -28 -14 -196 -48 -91 121 222 210 -39
7203 -39 24 -57 257 -146 -108 -29 -93 48 91 -181 12 153 91 -39 -60 -144 30 90 60 89 -128 33 21 66 2
7228 2 -84 3 24 -160 129 173 -22 8 -4 224 11 -99 4 92 17 11 -93 53 -35 -42 -291 -60 60 -92 55
7253 55 119 -20 172 -129 54 -7 131 239 -87 -71 -66 84 62 81 131 84 77 45 126 -83 45 -32 17 -158 -267
7278 -267 -69 160 -243 -103 -129 136 -83 -115 120 71 78 -3 -44 113 -208 -100 -79 68 -139 -94 -207 41 -66
7301 -66 -38 -145 116 159 -38 257 -73 34 4 -49 -28 -82 -28 -52 -51 -51 -51 -96 95 -65 -27 -39 86 1 101 91 99
$$ packed form
7129a23k6R9N3k91K91p4J82n1R5l5r7m1k5K5J44q5J45l28K28j02k3Q3rJ2r5lj36
7156a87J16R9P8l65K92K04j00j67P3P0p9j08j7J39j39O4K49l03K54j32R3k10l9
7179a15l8J99ok39L38m6k46L7Q2J43m2j87J07k9n8P2J4j82J48m3K12J01j2k49
7203c9O3q1L14m03L8P9o4J41M3k72J93J41o2j30k1q4J74O0l0K9k17J61j2M5o4
7228Bq6Q7K1j84K89M4j95L0j2K28k13j10J03Q8p5oj04J46q8pk49K31J20j52J47
7253E5O4j39J92l01J83o1J38J08l26J6NJ50k2J9N0m7pl2Q1k09J28p7M9j75j09
7278b67J98K29m03J40k6K65k19l2K35m9Pq1m1J57l21J08K1J47k07M5j13K48j07
7301f6K8j07K61M3j97K95l30J07l0n3K1n4N4k4J%%m5J91j60L8j2J25q5J00j0Q
$$ plain form
7328 99 -99 189 28 -128 21 -141 23 39 -21 -139 -137 -107 -13 90 195 99 135 -6 11 -25 -135 124 217 -43
7352 -43 11 -146 92 -26 23 9 -5 55 -23 -76 162 -204 41 -17 138 154 -187 10 16 -87 -49 -44 47 -109 -8
7377 -8 -12 13 -175 175 189 45 -62 -55 -119 125 4 122 -46 285 1 1 -83 177 95 -99 79 -277 147 -47
7401 -47 80 100 -48 2 -79 45 76 -55 -28 -29 -69 78 -33 127 8 -302 66 0 -81 101 -250 -113 159 95
7425 95 -61 -125 -56 103 -63 -199 -35 58 182 -30 54 -85 -72 -31 -91 -72 -40 -148 135 96 -52 206 142 -6
7449 -6 26 185 -5 84 166 98 -41 25 142 -96 58 -37 -119 242 -52 35 4 -100 50 -109 118 -205 78 83
7473 83 34 -41 -56 26 294 31 -192 10 310 319 -65 35 67 53 -97 257 -63 86 -36 -156 150 -167 -64
7496 -64 -69 -116 115 71 20 107 4 193 -35 58 -48 10 23 -37 55 102 -51 65 81 -141 84 -225 -69 -107 67
$$ packed form
7328I9j98K88j61j56J49j62J64J6o0j18KL0R4J03J05r6L6j41J7l6j10K59R3k60
7352d3N4j57K38j18M9j4j4O0p8n3K38l66K45n8J55J6l41J97Oj03L8NR1j56J01
7377hmK5j88L50J4j44j07Po4K44j21J18j68L31k84%q4K60q2j94J78l56M24j94
7401d7J27K0j48N0q1J24L1j31K7jm0J47j11J60j19l10L68o6q1J82l51J37K72o4
7425I5j56o4O9J59j66j36J64R3J24k12Q4j39J3M1o0J9L2j08K83l9j48K58o4j48
7449fL2J59j90Q9Q2o8j39O6J17k38J54r5q2L61k94Q7l1j04J50j59K27l23K83N
7473H3m9p5j5Q2K68k63k23K02L00Rl84J00L2j4j50L54l20J49j22j20L06l17J03
7496f4nm7K31m4n1Q7j03J89k28R3j06N8J3o0R2M7j53J16J6k22K25l09J56l8J74
$$ plain form
7521 67 -17 -118 184 184 -155 -74 -329 -3 90 -87 137 -191 -170 -230 -79 -143 -64 -11 -6 39 -92 165 -55 111 -40
7546 -40 -45 179 203 50 130 -88 -4 -94 -25 31 18 163 171 30 -130 69 74 -196 -74 177 81 -175 -143 -79 -110 134
7572 134 -44 -161 19 -24 -13 -42 48 27 -146 -152 126 10 -79 -53 -52 -103 -7 26 72 -78 -111 35 220 -41 95
7597 95 -29 -70 19 -47 120 -106 -158 161 -88 -202 -32 -42 -177 124 -20 -127 15 30 -135 9 -80 6 72
7620 72 -28 -205 57 -73 43 -222 43 182 24 -183 -230 115 -105 16 -52 16 128 129 -83 89 153 70 68
7643 68 -41 206 29 -33 -160 157 101 -295 134 -79 16 -122 56 -29 -64 15 -38 -54 -1 29 85 -61 -41 -341
7667 -341 14 -79 -8 -46 -228 16 106 182 -120 -164 -47 -151 20 115 83 -151 -185 264 -18 84 -73 46 78
7690 78 27 -20 0 -12 94 -36 -90 37 -13 -124 41 67 -286 -205 189 -3 -139 -240 -13 3 -94 92 5 -112
$$ packed form
7521F7q4j01L02%l39Q1k55L26R3j77K24l28K1o0J51o4P9N3NM5j31K57k20J66j51
7546d0nK24K4j53Q0k18Q4r0O9N6j3J45Qj41j60J99Nk70J22K51r6k56L2O4l1K44
7572A34j78j17J80m3J1k9R0k1j73oK78j16q9K6Jn1R6L3M6j50l3J46J85k61J36
7597I5j24m1Q9o6J67k26n2L19k49j14J70j0j35L01j44j07J42J5j65J44q9Q6O6
7620G2j00j77K62j30J16k65K65J39j58k07m7L45k20J21o8O8J12Jk12J72O4q3k
7643F8j09K47j77o2j27L17n6l96M29k13R5j38J78q5l5P9n3j6N3L0N6j46K0l00
7667c41L55r3P1l8j82K44R0P6l02m4J17j04J71R5l2k34l4M49k82J02j57J19L2
7690G8n1m7K0j2J06j30n4J27n0j11J65K6l53Q1L94j92j36j01K27J6r7J86q7j17
$$ plain form
7714 -112 92 131 -66 -188 5 -61 50 90 22 -30 -173 37 -128 21 102 -112 27 35 -13 -98 191 77 29 -34
7738 -34 -138 81 -137 -44 -119 77 7 59 34 177 -200 -67 212 27 -51 -31 -47 -139 333 -92 -53 -153 -210 -95
7762 -95 16 -94 15 -256 20 -16 139 17 123 -18 -47 -94 122 144 -74 -17 124 -92 46 -7 -13 -124 102
7785 102 -55 -239 15 25 76 -131 102 2 -132 36 175 225 -17 -96 78 49 -76 -5 -19 171 216 -108 60
7808 60 40 110 -66 -96 69 34 39 218 141 163 -51 88 0 65 21 39 -90 102 42 15 60 116 18 -41 -21 6 -66
7835 -66 109 81 -10 27 36 96 11 -18 13 -53 -116 -86 -241 -208 244 -49 99 104 -46 -69 -1 -69 47 -50 58 195 74
7862 74 44 -102 131 -90 145 -27 89 -42 -54 7 97 -39 82 -40 -213 279 120 -66 48 156 -59 86
7884 86 111 -112 -162 -80 36 -89 2 -215 -118 -1 -75 42 97 221 -77 -97 -116 78 -14 -56 -7 25 -107 44 -160
$$ packed form
7714a12K04L9j97j22J93o6J11M0o8n2j43K10j65J49Q1k14J39Qm8q5K89j14m8o3
7738c4j04K19k18R3p5J96p0N2k5J43l77J33K79j85p8K0j6r2M72m25L9j00n7J15
7762i5J11j10J09k71K76l6J55j22J06j41k9m7K16K2k18N7J41k16J38n3oj11K26
7785A02j57j84K54J0N1k07K33j00j34J68J39N0k42p9J74k9j25P1j4J90M5l24J68
7808F0k0P0j76l0J65l5NJ79p7K2k14J39q8O5m4J8j29J92o0k7M5N6r8n9K0K7p2
7835f6J75k8r1L7RO0q5k9L1o6o3L0j55L3M52k93J48Nj50k3O8o8J16r7J08J37j21
7862G4l0j46K33k21K35j72J16j31j2O1R0j36J21j22j73M92j59j86J14J08k15J45
7884H6K5k23n0Q2J16j25R1k17R7J17p4J17N5J24k98k0j9J94r2m2M9L2j32J51k04
$$ plain form
7909 -160 153 -7 15 -102 137 3 -73 69 -236 42 -119 -43 47 -50 85 -44 37 167 -150 36 -88 153
7931 153 -115 35 24 -48 -46 211 -96 -38 -43 112 -216 -95 -83 -146 50 49 -54 94 -4 159 -145 -51 -143 -148 100
7956 100 22 11 -183 -6 84 174 -110 171 41 -13 -96 -55 9 86 188 44 -78 234 -206 -164 -18 100 26 -182
7980 -182 -173 -129 177 -34 -58 -8 28 -14 91 215 99 21 -165 21 19 106 210 61 205 206 -85 86 123 -106 107
8005 107 -40 -37 147 -130 28 1 29 -155 84 -146 -40 110 192 -33 -240 160 -86 39 121 -147 52 155
8027 155 52 -4 123 95 -236 -37 79 24 -3 -48 -148 170 74 -25 -67 -31 -66 -71 22 69 43 -17 128 96 114 -32
8053 -32 -101 53 1 93 209 -224 -76 -10 176 214 60 137 -16 -119 -130 32 58 170 80 82 111 -150 -47 -157
8077 -157 75 -116 -23 -98 -77 182 137 -74 -293 72 71 -47 -90 76 10 9 -155 -4 27 -59 145 197 207 273 79
$$ packed form
7909a60L13j60K2j17K39j34p6J42l05K78j61P6R0r7J35j29Q1J30l17J86j24K41
7931A53k68J50j1p2KK57l07N8nJ55l28J21J2o3J96jj03J48r8J63l04R4r2nK48
7956A00p8j1j94J77R0R0k84K81j30n4q3M1O4P7J02j44j22L12m40M2J46J18p4k08
7980a82RM4L06k11k4N0L6m2J05J24j16p8j86J86kQ7J04j49J44Jk91J71L7k29K13
8005A07j47LJ84k77J58k7K8j84K39k30J06J50Q2k25k07M00k46J25Q2k68J99J03
8027A55j03n6J27k8l31J99J16n5k7m5j00L18r6r9m2L6l5nR3M7k6o0J45l2J8j46
8053c2o9J54n2R2J16m33J48O6J86L8j54P7j53j03j1J62K6J12r0KK9k61J03j10
8077a57K32j91R3p5K1K59m5k11k19L65jj18m3J66o6jj64J51L1q6K04N2J0O6j94
$$ plain form
8102 79 -9 2 74 49 24 31 -123 5 244 -12 4 -102 43 90 -110 51 -168 -196 -35 -92 50 -55 -50 -49 -60 14
8128 14 30 49 178 31 -80 13 242 169 101 7 307 -183 -104 -56 138 114 -101 51 -75 -36 -69 181 -57 96
8152 96 -50 25 54 -83 -66 -65 -26 189 -24 19 16 69 -82 23 23 -75 -147 8 121 172 -88 -159 15 115 -71 91
8178 91 -139 95 66 -38 65 180 -67 -14 168 -116 -55 57 55
$$ packed form
8102G9q8J1P2k5k5Pj54J28K39k56J6j06J45M7k00J61k19k8J61n7J42j05NJj1P4
8128A4J6J9J29j47j11R3K29p3o8r4L00m90P9M8J94k4k15J52j26L9l3K50k38J53
8152I6j46P5K9j37J7JL9K15k13M3lN3j51J05%r8p2J55J13N1k60p1J74J00j86J62
8178I1k30K34k9j04J03J15k47N3J82k84O1J12k
8191E5
$$ Imaginary data points
##PAGE= N=2
##DATA TABLE= (X++(I..I)), XYDATA
$$ plain form
0 0 0 0 0 0 0 0 0 0 0 0 0 0 8 -8 8 -8 16 -16 16 -24 31 -32 40 -48 56 -64 73 -88 102 -113 132 -151 169 -192
34 -192 217 -247 277 -310 344 -385 430 -477 530 -586 648 -717 791 -871 960 -1056 1166 -1283
52 -1283 1415 -1561 1725 -1911 2120 -2361 2640 -2973 3371 -3858 4470 -5271 6366 -7953 10484
67 10484 -15153 26658 -118201 -73105 200947 63284 -107193 -90829 39518 42771 18591
78 18591 12122 -7562 -53040 -6478 61089 48489 -32268 -51521 3877 51736 8313 -42354
90 -42354 -24597 21429 18170 -9218 -20679 -11592 -5745 15087 27634 -8384 -40107 -200 37114
103 37114 19233 2629 3025 -25352 -34076 34676 72522 -21384 -91685 -1947 77713 3831 -63373
116 -63373 -5271 39110 -21597 -49582 30211 69301 -14201 -71768 -6748 62976 31149 -31912
$$ packed form
0@%%%%%%%%%%%%Qj6J6j6K4l2L2m0N5o3P2q8J04j20J37j61J90k15K45k83L20l61
34a92M09m64N24n87O54p29Q15r07J007j116J234j365J508j662J831k016K222k449
52a283K698k976L286l636M031m481N001n613O344p229Q328r741J1637j4319J8437
67A0484k5637M1811j44859M5096K74052j37663j70477J6364J30347L253k4180
78A8591o469j9684m5478M6562O7567j2600q0757j9253N5398M7859m3423n0667
90d2354J7757M6026l259k7388j1461R087N847K0832J2547l6018l1723L9907L7314
103C7114j7881j6604L96k8377q724O8752L7846r3906p0301Q9738P9660p3882o7204
116f3373N8102M4381o0707k7985P9793L9090q3502n7567O5020O9724l1827o3061
$$ plain form
128 -31912 -23059 21795 14403 -15447 -1672 18672 -4030 -27656 -8220 12720 -2016 -8559 12585
141 12585 2406 -32545 -13605 37800 31063 -20682 -30570 6673 28934 19561 12 -20591 -20130
154 -20130 16134 30495 -11801 -39017 1690 34728 -3558 -43323 -10654 34435 14399 -25165
166 -25165 -15243 14156 11594 121 10554 13275 -13745 -24612 12600 41945 9094 -39226 -29224
179 -29224 17244 26936 -3027 -20448 -14336 -7615 3062 18816 10482 -17868 -18497 11413 20875
192 20875 2243 -5641 5665 5987 -4616 -884 8062 2726 -4733 -5658 -8107 -6201 5993 7510
206 7510 -10551 -18096 1697 15706 -280 -13197 3288 18419 5100 -13030 -4501 18746 17819
219 17819 -7925 -17855 -406 11836 3436 -5947 -5418 -7658 -10246 1471 11928 -875 -14626
$$ packed form
128c1912Q853M4854p392k9850J3775K0344k2702k3626J9436K0940j4736o543K1144
141A2585j0179l4951J8940N1405o737n1745r888L7243K2261r373j9549k0603M61
154b0130L6264J4361m2296k7216M0707L3038l8286l9765L2669M5089k0036l9564
166b5165R922K9399k562j1473J0433K721k7020j0867L7212K9345l2851m8320J0002
179b9224M6468R692k9963j7421O112O721J0677J5754q334k8350o29K9910R462
192B0875j8632p884J1306L22j0603L732Q946n336p459r25k449J906J2194J517
206G510j8061p545J9793J4009j5986j2917J6485J5131j3319j8130Q529K3247r27
219A7819k5744r930J7449J2242q400r383N29k240k588J1717J0457j2803j3751
$$ plain form
232 -14626 -5039 8000 6664 3006 6297 1924 -7603 -370 14638 10895 -5234 -10073 -2773 3195
246 3195 2256 -2316 -6393 -7876 -3003 1391 -344 -2315 -586 656 862 508 3222 7907 5128 -2340
262 -2340 -746 5897 4918 -3701 -3896 4567 895 -12028 -8166 5387 3928 -7041 -9735 -2278 3763
277 3763 3978 3716 330 -4914 1230 11649 8536 -1886 -4619 2261 6646 -60 -5656 -1090 -34
292 -34 -4745 -5709 -1956 782 -2685 -5675 431 3139 -921 1047 4227 3304 2422 2541 3324 2229 741
309 741 3525 1413 -5388 -3785 1887 -399 -4676 -6597 -3497 1047 -867 -2577 -590 218 1848 3508
325 3508 2542 2572 2540 2564 4422 1659 -1566 1765 1027 -3525 -3356 -1141 -1325 -4777 -6123 104 1214 -3938
343 -3938 -2313 2109 1968 1687 2131 3474 4003 879 1787 4961 1814 -911 -900 -1491 -1136 -2275 -2946 -1104
$$ packed form
232a4626R587J3039j336l658L291m373r527P233J5008l743j6129m839P300N968
246C195r39m572m077j483M873M394j735j971J729J242K06l54K714M685k779p468
262b340J594O643r79q619j95Q463l672j2923L862J3553j459j0969k694P457O041
277C763K15k62l386n244O144J0419l113j0422k733O880M385o706n596M566J056
292c4m711r64L753K738l467k990O106K708m060J968L180r23q82J19P83j095j488
309G41K784k112o801J603N672k286m277j921L100M544j914j710J987Q08J630J660
325C508r66L0l2K4J858k763l225L331p38m552J69K215j84l452j346O227J110n152
343c938J625M422j41k81M44J343N29l124R08L174l147k725J1n91L55j139o71J842
$$ plain form
361 -1104 -4143 -6043 -264 1764 -1259 -1769 96 2992 3078 1737 4358 3732 -22 1680 3127 1540
377 1540 956 -2107 -4377 -1766 -494 -1993 -4138 -4788 -1848 -56 -908 -475 -363 693 4774 3410
393 3410 -919 1805 5679 4408 410 -1355 116 77 175 -124 -4709 -7124 -1053 1506 -3511 -3701 -255
410 -255 -717 -1962 2054 5510 2790 -306 2246 3430 2296 4607 3803 -2867 -4721 170 2766 -134
426 -134 -4204 -7139 -5443 1453 4492 -2923 -8582 -674 6887 3300 817 2596 937 -239 5848
441 5848 7409 -1795 -6043 1968 6643 -774 -7109 -5945 -2828 1026 1518 -5327 -7465 1128 5148
456 5148 -427 -2181 3345 3135 -417 3854 8673 1478 -5098 796 4151 -418 -1193 -278 -4127 -6509
472 -6509 -2125 2281 455 -4293 -6272 -3589 5648 11311 -1038 -12511 936 17573 10166 -6783
$$ packed form
361a104l039j900N779K028l023n10J865K896Q6j341K621o26l754J702J447j587
377A540n84l063k270K611J272j499k145o50K940J792q52M33J12J056M081j364
393C410m329K724L874j271l998j765J471l9R8k99m585k415O071K559n017j90L446
410b55m62j245M016L456k720l096K552J184j134K311q04o670j854M891K596k900
426a34m070k935J696O896L039p415n659P908P561l587k483J779j659j176O087
441E848J561r204m248Q011M675p417o335J164L117L854M92o845k138Q593M020
456E148n575j754N526k10l552M271M819p195o576N894L355m569p75R15l849k382
472f509M384M406j826m748j979K683R237N663j2349j1473J3447J6637p407j6949
$$ plain form
486 -6783 -7819 2231 6893 4040 -85 -6842 -8640 869 5694 -1782 -8419 -7803 -1686 6744 7880
501 7880 -2924 -9986 369 13786 6595 -6244 -542 7651 1558 -2348 3335 2855 -5964 -7182
515 -7182 1322 3039 -3677 -6441 -3473 -827 2592 1127 -2944 -375 3629 1102 874 6917 7086 -4015
531 -4015 -6552 7764 11242 -5448 -12992 -2450 6695 4629 -4803 -11995 -7986 4213 9703 -599
545 -599 -10125 -2621 6575 5961 6119 3767 -6661 -6258 9007 14948 -1148 -13113 -2587 6284 -554
560 -554 -3720 -713 -4735 -8090 -2716 5336 6327 -1535 -8778 -4870 8838 14744 -48 -12281 591
575 591 14281 6180 -4970 -4736 -2408 -902 3701 3106 -7913 -12556 267 8975 927 -6714 -7628
590 -7628 -3032 9286 15021 -821 -16388 -3872 19775 15938 -6437 -12169 -3006 2884 7745 6451
$$ packed form
486f783j036J0050M662k853m125o757j798R509M825p476o637O16O117Q430J136
501G880j0804p062J0355J3417p191j2839N702Q193o093l906N683m80q819j218
515g182Q504J717o716k764K968K646L419j465m071K569M004k527k28O043J69j1101
531d015k537J4316L478j6690p544J0542R145k066r432p192M009J2199N490j0302
545e99r526P504R196o14J58k352j0428M03J5265N941j6096j1965J0526Q871o838
560e54l166L007m022l355N374Q052R91p862p243L908J3708N906j4792j2233J2872
575E91J3690q101j1150K34K328J506M603n95j1019m643J2823Q708q048p641r14
590g628M596J2318N735j5842j5567J2516K3647l837k2375n732R163N890M861j294
$$ plain form
604 6451 -7485 -15918 -4739 9945 7132 -7592 -13059 -2895 9056 10656 -1669 -9099 2600
617 2600 10716 457 -3994 5202 7537 -2208 -5818 1884 1901 -5198 -2555 1484 -3672 -4933 -818
632 -818 -1225 -958 3493 1747 -4480 -2150 8256 8161 -1951 -2442 2993 1826 1748 4361 -151 -7404 -6176
649 -6176 979 3927 -1218 -5384 -4748 -1515 1037 -127 -1324 2944 4169 -2176 -2122 6954 8018 -877
665 -877 -4364 1578 2773 -1963 397 4197 -3723 -11309 -4327 5527 4838 -2941 -8364 -5954 2736 9805
681 9805 5842 -5158 -6042 4333 9455 3920 -1700 -2020 534 1873 870 -1640 -3121 -2676 -1130
696 -1130 -2151 -3967 -2656 161 2643 1255 -3535 -3897 3519 8046 3884 -1714 -1003 1888 1858 2761
712 2761 4669 -1521 -9025 -5150 5321 5533 -3730 -9047 -5636 1083 4201 2897 -1983 -4738 -34
$$ packed form
604F451j3936q433J1179J4684k813j4724n467J0164J1951J600j2325p430J1699
617B600Q116j0259m451R196K335r745l610P702J7p099K643M039n156j261M115
632h18m07K67M451j746o227K330J0406r5j0112m91N435j167p8K613m512p253J228
649f176P155K948n145m166O36L233K552j164j197M268J225o345N4R076J064q895
665h77l487N942J195m736K360L800p920p586O982R854o89p779n423K410Q690P069
681I805l963j1000q84J0375N122n535n620l20K554J339j003k510j481M45J546
696a130j021j816J311K817K482j388m790l62P416M527m162n598P11K891l0R03
712B761J908o190p504L875J0471K12r263n317L411O719L118j304m880k755M704
$$ plain form
727 -34 6022 4834 2004 1288 171 -317 1389 2754 1803 -1938 -4149 -2267 -778 -1446 -2037 -2635 -1248
744 -1248 -533 -2831 -776 4390 3369 -249 -869 989 2954 3969 4238 1819 -4588 -4068 3850 4693
760 4693 -2108 -6712 -5167 -520 1269 -479 -1550 -2386 -2630 345 2984 3566 2775 -629 -954 3046
776 3046 4587 2339 -812 -2530 -531 455 -1260 -1864 -1975 -1945 -2124 -3436 -2049 1753 1616 -786 -819
793 -819 29 2046 4092 3804 1807 -1658 -1307 3722 4213 -485 -3169 -3225 -1379 -141 -1576 -1124 -2048
810 -2048 -3885 -2158 1730 2761 869 -2011 -358 3577 3325 1750 1740 1092 642 171 -454 618 -194
827 -194 -2291 -2370 -2837 -2134 -201 -556 -1539 -1799 -1456 987 3024 1886 952 513 1318 3113 2868 742
845 742 447 -432 -883 -266 -804 -824 -2210 -3765 -2086 -235 -840 -1089 -491 158 837 708 1619 3056 2009
$$ packed form
727c4O056j188k830p16j117m88J706J365r51l741k211J882J489o68n91n98J387
744a248P15k298K055N166j021l618o20J858J965J015K69k419o407N20P918Q43
760D693o801m604J545M647J789j748j071q36k44K975K639N82p91l404l25M000
776C046J541k248l151j718J999R86j715o04j11L0j79j312J387L802j37k402l3
793h19Q48K017K046k88j997l465L51N029M91m698k684n6J846J238j435M52r24
810b048j837J727L888J031j892k880J653L935k52j575j0o48m50m71o25J072q12
827a94k097p9m67P03J933l55r83k60L43K443K037j138r34m39Q05J795k45k126
845G42k95q79m51O17n38k0j386j555J679J851o05k49N98O49O79j29R11J437j047
$$ plain form
864 2009 1114 582 975 2328 1332 -1123 -1127 -1144 -1459 -1179 -1197 -2050 -2979 -1678 457 211 -1074 639 1770
883 1770 788 1182 2324 2599 1736 768 842 651 144 271 -1570 -2489 -946 -953 -2778 -2015 -819 -815 -1212 -71
903 -71 1146 206 270 2908 2467 539 1710 2216 644 445 561 -318 -1401 -1192 -849 -1970 -2445 -336
921 -336 -1642 -3078 57 1443 -341 -259 1783 1858 1237 1972 3053 552 -516 2229 2179 -1451 -1410 -326
939 -326 -1451 -1818 -1002 -2366 -3238 -660 1561 -668 -2789 849 3288 1587 1147 1153 409 1444 4611
956 4611 2418 -2614 -2574 1219 1227 -1447 -1941 -2751 -3803 -289 2128 -1283 -4027 -401 2266 913 1047
973 1047 2120 974 798 3365 3200 -1170 -1183 2230 436 -2353 -683 160 -3531 -2310 823 -1244
989 -1244 -4628 -1570 2758 1514 -380 854 606 -241 3327 4612 418 -1650 802 1361 1187 962
$$ packed form
864B009q95n32L93J353r96k455mj7l15K80j8q53r29J301K135k46j285J713J131
883A770r82L94J142K75q63r68P4j91n07J27j841r19J543pj825P63J196Ml97J141
903g1J217r40O4K638m41j928J171N06j572j99J16q79j083K09L43j121m75K109
921c36j306j436L135J386j784Q2K042P5o21P35J081k501j068K745n0l630M1J084
939c26j125l67Q16j364q72K578K221k229k121L638K439j701m40Op44J035L167
956D611k193n032M0L793Qk674m94q10j052L514K417l411k744L626K667j353J34
973A047J073j146j76K567j65m370j3L413j794k789J670Q43l691J221L133k067
989a244l384L058M328j244j894J234k48q47L568J285m194k068K452N59j74k25
$$ plain form
1005 962 -1745 -5510 -2990 3462 1795 -5264 -4217 229 562 1245 2105 -289 -2389 1167 5456 2732
1021 2732 -1332 851 2370 325 785 -130 -4074 -2100 2456 205 -4155 -3358 705 -1 -2810 -64
1037 -64 1698 -787 1191 4721 1755 -1514 40 1743 2523 2025 515 -1848 -2706 516 723 -2918
1053 -2918 -2319 -275 -3014 -2247 2597 1959 -2484 -2446 2661 4382 593 30 1695 -244 609 3375 1435
1070 1435 -1593 -1609 -1379 -867 -672 -1432 -2037 -2438 -86 1650 -2283 -2400 2026 1654 234 1573 2594
1087 2594 1925 258 1065 1784 -338 -1141 486 -181 -1020 -322 -2124 -2730 -1110 181 -397 -1782 -679
1104 -679 865 357 1528 3730 444 -1945 1769 4368 1824 -1222 -995 666 108 -444 -754 -3045
1120 -3045 -3476 -104 850 -674 -1700 -1127 -129 1321 2005 771 -594 1206 3680 1866 -185 750
$$ packed form
1005I62k707l765K520O452j667p059J047M446L33O83Q60k394k100L556M289k724
1021B732m064K183J519k045M60r15l944J974M556k251m360P97M063p06k809K746
1037f4J762k485J978L530k966l269J554J703P80m98j510k363q58L222K07l641
1053b918N99K044k739P67M844o38m443L8N107J721l789n63J665j939Q53K766j940
1070A435l028j6K30N12J95p60o05m01K352J736l933j17M426l72j420J339J021
1087B594o69j667Q07P19k122q03J627o67q39O98j802o06J620J291n78j385J103
1104f79J544n08J171K202l286k389L714K599k544l046K27J661n58n52l10k291
1120c045m31L372R54j524j026N73R98J450O84j234j365J800K474j814k051R35
$$ plain form
1136 750 629 -632 -10 206 -2020 -3005 -580 736 -1766 -2544 -144 -378 -840 1218 1592 349 955
1153 955 2624 1751 -125 562 1508 86 -426 702 -602 -2360 -1354 -351 -1899 -2416 -663 80 -847
1170 -847 -518 637 83 287 1992 1826 816 1122 1063 785 924 802 -775 -1917 -169 -62 -2700 -2714
1188 -2714 180 70 -1994 -1369 1004 864 -331 1073 1640 115 822 3024 2067 19 -729 -331 601
1205 601 788 -415 -2083 -2448 -813 -2 -1195 -1378 -883 -903 51 1818 1669 -160 56 1483 2251 1536
1223 1536 639 321 117 569 299 -1490 -1685 -124 -487 -2249 -2396 -659 223 -428 254 175 -581 282 2282
1242 2282 2731 745 -981 379 2354 1985 252 -1514 -1985 -878 249 6 -1135 -2610 -2297 -380
1258 -380 861 642 -786 -749 990 2226 1412 1286 743 770 1256 666 203 -70 -46 -284 -1590 -2430 -1284
$$ packed form
1136G50j21j261O22K16k226r85K425J316k502p78K400k34m62K058L74j243O06
1153I55J669q73j876O87R46j422n12J128j304j758J006J003j548n17J753P43r27
1170h47L29J155n54K04J705j66j010L06n9k78J39j22j577j142J748J07k638j4
1188b714K894j10k064O25K373j40j195J404N67j525P07K202r57k048p48L98R32
1205F01J87j203j668l65J635Q11j193j83M95k0R54J767j49j829K16J427P68p15
1223A536q97l18k04M52k70j789j95J561l63j762j47J737Q82o51O82p9p56Q63K000
1242B282M49j986j726J360J975l69j733j766m71J107J127k43j141j475L13J917
1258c80J241k19j428L7J739J236q14j26n43K7M86n90m63k73K4k38j306q40J146
$$ plain form
1277 -1284 -221 -711 -815 -1106 -1298 -206 1203 2054 1159 -965 18 2535 2991 1616 -1070 -1681 333
1294 333 844 199 -516 -2062 -2208 -1268 -281 641 -677 -2098 -520 1234 1016 1067 562 1118 1804 668
1312 668 376 1384 1274 208 -1168 -1678 -241 -83 -1249 -853 -1452 -2529 -1206 658 1488 550 -1998
1329 -1998 -584 2722 2828 1364 -337 -275 1289 1147 398 619 -727 -1948 -1282 -270 271 -899 -2672
1346 -2672 -1330 243 -283 -335 813 1072 1057 77 569 2472 1592 409 65 -393 -131 -18 -468 -142 -1313
1365 -1313 -2737 -1766 278 853 -856 -2518 -650 1828 1412 639 1098 293 420 1177 2050 1768 -204
1382 -204 -1070 -576 -12 -70 -490 -2068 -1827 -652 -957 -637 358 426 -458 -555 1107 2022 1025 674 1401 393
1402 393 260 1260 1106 -417 -1159 -1093 -1001 -696 -256 -1133 -2008 -1318 150 32 -19 893 343 -425 987 2191
$$ packed form
1277a284J063m90j04k91j92J092J409Q51q95k124R83K517M56j375k686o11K014
1294C33N11o45p15j546j46R40R87R22j318j421J578J754k18N1n05N56O86j136
1312F68k92J008j10j066j376n10J437J58j166L96n99j077J323J864Q30r38k548
1329a998J414L306J06j464j701O2J564j42p49K21j346j221O66J012N41j170j773
1346b672J342J573n26n2J148K59j5r80M92J903q80j183l44m58K62J13m50L26j171
1365a313j424R71K044N75j709j662J868K478m16p73M59q05J27P57Q73k82j972
1382b04q66M94N64n8m20j578K41J175l05L20R95O8q84r7J662R15r97l51P27j008
1402C93j33J000j54j523p42O6R2L05M40q77q75O90J468j18n1R12n50p68J412J204
$$ plain form
1422 2191 1373 279 695 666 -325 110 677 -468 -1989 -1040 -327 -1139 -822 -143 -1078 -1233 4 1335
1440 1335 859 635 935 248 240 1844 1738 -42 -574 743 -114 -966 -100 -70 -1839 -1948 -234 -45 -1140
1459 -1140 -742 400 -198 -61 1304 1449 779 921 1003 208 842 1483 226 -1399 -292 504 -1046 -1803
1477 -1803 -345 -438 -2075 -1010 573 94 -903 299 1490 765 214 1277 1339 795 1154 376 -631 331
1495 331 1343 -600 -2018 -1354 -101 -1351 -989 504 -1042 -1998 363 2513 393 -859 443 1540
1511 1540 1052 1459 1193 -222 -684 1385 724 -1281 -1129 -848 -1437 -784 735 -871 -2759 -926 2167
1528 2167 573 -1388 595 1693 559 1544 1772 -197 -1082 961 1950 -122 -1183 -655 -1292 -1202 712
1545 712 -403 -2984 -1346 1673 573 -862 88 885 68 792 2965 612 -1627 780 2366 392
$$ packed form
1422B191q18j094M16k9r91M35N67j145j521R49P13q12L17O79r35j55J237J331
1440A335m76k24L00o87qJ604j06j780n32J317q57q52Q66L0j769j09J714J89j095
1459a140L98J142n98J37J365J45o70J42Q2p95O34O41j257j625J107P96j550p57
1477a803J458r3j637J065J583m79r97J202J191p25n51J063O2n44L59p78j007R62
1495C31J012j943j418O64J253j250L62J493j546r56K361K150k120j252J302J097
1511A540m88M07k66j415m62K069o61k005J52K81n89O53J519j606j888J833L093
1528B167j594j961J983J098j134R85K28j969q85K043R89k072j061N28o37R0J914
1545G12j115k581J638L019j100j435R50P97q17P24K173k353k239K407J586j974
$$ plain form
1561 392 -589 -201 -599 -1199 -11 -129 -2590 -1582 1191 498 -1389 162 353 -999 474 2806 1374
1578 1374 -962 686 2487 390 -829 521 -329 -1600 634 749 -1781 -1943 -309 -282 -1298 -2
1594 -2 840 -874 -506 2100 1123 -544 1112 1966 321 -136 925 711 -643 -516 449 -1253 -1865 336
1612 336 -722 -2098 -563 341 -466 -451 1167 696 -770 192 2098 739 -21 1528 974 -646 -57
1629 -57 311 -1032 -861 -168 -631 -1499 -922 468 -453 -1653 418 511 -43 1126 1712 367 -195 740 1716
1648 1716 925 -175 -171 -1009 -549 533 -8 -1656 -1213 -349 -512 -710 -25 -10 -751 -62 1784 1346 -225
1667 -225 252 1084 690 630 548 305 -204 -178 -422 -1243 -1194 -427 -345 -922 -360 -47 -678 -14 1209 772 -576
1688 -576 -23 1586 1534 253 168 218 23 235 286 -565 -1230 -972 -800 -561 -277 -773 -1417 -408 755 852
$$ packed form
1561C92r81L88l98o00J188j18k461J008K773o93j887J551J91j352J473K332j432
1578A374k336J648J801k097j219J350q50j271K234J15k530j62J634K7j016J296
1594bQ42j714L68K606r77j667J656Q54j645m57J061k14j354J27R65j702o12K201
1612C36j058j376J535R04q07J5J618m71j466R62J906j359p60J549n54j620N89
1629e7L68j343J71O93m63q68N77J390r21j200K071R3n54J169N86j345n62R35R76
1648A716p91j100Mq38M60J082n41j648M43Q64j63j98O85J5p41O89J846m38j571
1667b25M77Q32l94o0q2k43n09K6k44q21M9P67Q2n77N62L13o31O64J223m37j348
1688e76N53J609n2j281q5N0j95K12N1q51o65K58J72K39K84m96o44J009J163R7
$$ plain form
1708 852 -12 217 1190 889 20 836 969 314 -336 -21 248 -287 -744 -586 -554 -1148 -865 -608 -307 43
1728 43 -21 -355 313 1199 818 480 531 954 596 201 860 579 -819 -783 -356 -600 -859 -801 -808 -725 -427 -393 -99
1751 -99 -11 360 312 241 993 1235 582 493 511 307 382 -6 29 -277 -698 -830 -265 -444 -722 -726 -703 81 473 116
1775 116 196 712 473 709 827 700 881 160 249 309 -177 -758 -464 -725 -932 -757 -609 -373 -282 -392 -80
1796 -80 -132 395 800 511 614 764 372 909 709 215 79 -280 47 -215 -657 -938 -722 -767 -341 -313 -549
1817 -549 -272 69 405 817 401 487 877 1051 644 545 246 233 4 -234 -453 -663 -771 -450 -517 -934 -521
1838 -521 -661 18 299 261 110 442 924 845 565 174 694 344 412 423 -119 -653 -625 -612 -439 -294 -1054 -813
1860 -813 -447 86 534 -141 -136 596 681 665 810 785 410 155 385 395 -491 -406 -213 -359 -602 -571 -854 -395 -197
$$ packed form
1708H52q64K29R73l01q69Q16J33o55o50L15K69n35m57J58L2n94K83K57L01L50
1728D3o4l34O68Q86l81l38N1M23l58l95O59k81j398L6M27k44k59N8pQ3K98L4K94
1751i9Q8L71m8p1P52K42o53q9J8k04P5l88L5l06m21j32N65j79k78mK3P84L92l57
1775A16Q0N16k39K36J18j27J81p21Q9O0m86n81K94k61k07J75J48K36R1j10L12
1796h0n2N27M05k89J03J50l92N37k00m94j36l59L27k62m42k81K16m5M26K8k36
1817e49K77L41L36M12m16Q6L90J74m07r9k99j3k29k38k19k10j08L21o7m17M13
1838e21j40O79K81l8j51L32M82p9k80l91N20l50O8J1n42n34K8J3J73J45p60K41
1860h13L66N33M48o75NP32Q5j6J45k5l75k55K30J0q86Q5J93j46k43L1k83M59J98
$$ plain form
1883 -197 -294 -231 69 434 715 319 468 902 340 396 954 534 -518 -500 128 229 -930 -1139 -418 -491 -744
1904 -744 -283 -103 -396 -466 -32 356 1101 787 262 360 985 915 195 -188 456 -280 -972 -260 280 -730 -1020
1925 -1020 -757 -146 -405 -166 208 -72 -110 477 632 422 1139 612 -295 239 1018 556 -566 -487 226 -627
1945 -627 -1121 -417 -57 -1059 -522 290 223 -208 159 521 404 640 760 430 342 1213 412 -809 -248 447
1965 447 -175 -900 -583 -400 -1179 -575 536 -171 -1071 -231 724 271 266 749 82 80 941 1291 132 -473 45
1986 45 135 -407 132 -55 -1327 -1238 -174 24 -535 -164 161 -135 132 898 511 102 703 1180 572 114
2006 114 652 134 -568 -281 -13 -594 -750 -329 -240 -816 -837 -103 2 -143 622 359 -412 279 1155 943 214
2027 214 343 220 -154 0 740 -177 -1524 -468 -30 -279 -479 -434 -1003 -238 451 826 222 17 550 796
$$ packed form
1883a97r7O3L00L65K81l96J49M34n62N6N58m20j052J8O28J01j159k09P21p3k53
1904g44M61J80k93p0M34L88P45l14n25R8O25p0p20l83O44p36o92P12N40j010k90
1925a020K63O11k59K39L74k80l8N87J55k10P17n27r07N34P79m62j122P9P13q53
1945f27m94P04L60j002N37Q12o7m31L67L62j17K36J20l30q8Q71q01j221N61O95
1965D47o22p25L17J83p79O04J111p07r00Q40R55m53nM83o67kQ61L50j159o05N18
1986D5R0n42N39j87j272Q9J064J98n59L71L25k96K67P66l87m09O01M77o08m58
2006A14N38n18p02K87K68n81j56M21Q9n76k1P34J05j45P65k63p71O91Q76k12p29
2027B14J29j23l74J54P40r17j347J056M38k49k00M5n69P65O89L75o04k05N33K46
$$ plain form
2047 796 384 1117 590 -480 -260 776 246 -702 -711 -495 -374 -500 44 -172 -846 -278 604 -54 -221 363
2067 363 630 663 639 520 125 -101 939 874 -976 -942 -77 -682 -352 -50 -426 -1504 -545 455 358 -635
2087 -635 -106 491 259 852 925 -81 -160 607 803 103 -330 -20 -384 -1128 70 186 -1143 -946 -25 -80
2107 -80 -783 190 557 114 -22 589 471 -52 645 879 64 31 527 -305 -593 17 -238 -962 -902 1 -312
2128 -312 -1087 -240 382 -300 -224 1101 788 93 413 989 315 126 414 182 -527 -45 -102 -559 -622 -102 -649
2149 -649 -1099 -282 258 -243 -345 392 672 134 533 803 113 -29 610 786 147 -136 56 -329 -330 -169 -514
2170 -514 -1126 -366 -11 -285 -171 108 30 -35 490 684 485 230 330 824 329 4 -10 -137 15 -228 -550
2191 -550 -388 -399 -340 -162 -168 -387 -302 -200 391 634 371 231 674 893 451 -48 -5 60 -5 -160 -297 -382 -561
$$ packed form
2047G96m12P33n27j070K20J036n30r48rK16J21j26N44k16o74N68Q82o58j67N84
2067C63K67L3k4j19l95k26J040o5j850L4Q65o05L30L02l76j078R59J000r7r93
2087f35N29N97k32N93P3j006p9P67J96p00m33L10l64p44J198J16j329J97R21n5
2107h0p03R73L67m43j36O11j18n23O97K34q15l3M96q32k88O10k55p24O0R03l13
2128c12p75Q47O22o82P6J325l13o95L20N76o74j89K88k32p09M82n7m57o3N20n47
2149f49m50Q17N40n01j02P37K80n38L99K70o90j42O39J76o39k83J92l85jJ61l45
2170e14o12P60L55k74J14K79p8o5N25J94j99k55J00M94m95l25j4j27J52k43l22
2191e50J62j1N9J78ok19Q5J02N91K43k63j40M43K19m42m99M3O5o5j55j37q5j79
$$ plain form
2214 -561 -274 -413 -166 -334 -342 -69 173 281 227 196 186 605 555 286 121 286 -12 140 -60 -346 -543 -305
2236 -305 -149 -455 -588 -522 -50 -18 -99 -101 337 105 489 449 467 528 463 329 320 161 -118 -482 -160 -141 -226 -529
2260 -529 -515 -154 -339 -112 -155 23 -85 180 619 426 256 375 571 242 325 -167 41 -1 -308 -266 -332 -606
2282 -606 -299 -514 -446 -68 -73 -85 212 245 377 409 255 628 387 295 326 206 -12 206 -416 -427 -416 -642 -405
2305 -405 -161 -318 -411 -64 1 219 -45 107 500 463 237 593 558 260 68 57 42 -124 -506 -250 -313 -711
2327 -711 -405 -493 -205 -133 -95 -91 313 457 358 287 339 733 311 105 326 273 -289 71 52 -349 -382 -555 -437 -68
2351 -68 -175 -97 -176 -276 386 -60 52 546 713 329 177 470 203 -57 -48 147 -30 -475 -421 -368 -327 -356 -500
2374 -500 -541 -95 104 259 20 271 403 445 231 296 386 -34 391 227 -24 -281 -177 5 -622 -464 -366 -363
$$ packed form
2214e61K87j39K47j68qK73K42J08n4l1j0M19n0k69j65J65k98J52k00k86j97K38
2236c05J56l06j33O6M72L2q1kM38k32L84m0J8O1o5j34rj59k79l64L22J9q5l03
2260e29J4L61j85K27m3J78j08K65M39j93j70J19J96l29Q3m92K08m2l07M2o6k74
2282f06L07k15O8L78nj2K97L3J32L2j54L73k41r2L1j20k18K18o22j1J1k26K37
2305d05K44j57r3L47O5K18k64J52L93l7k26L56l5k98j92j1j5j66l82K56o3l98
2327g11L06q8K88P2L8MM04J44r9p1N2L94m22k06K21n3n62L60j9m01l3j73J18L69
2351f8j07P8p9j00O62m46J12M94J67l84j52K93k67k60RJ95j77m45N4N3M1k9j44
2374e00m1M46J99J55k39K51J32M2k14O5R0m20M25j64k51k57J04J82o27J58R8L
$$ plain form
2396 -363 -482 -160 56 -261 1 119 442 472 569 168 71 253 468 234 -130 -131 -255 -345 -544 -7 -216 -752
2418 -752 -284 167 -53 -312 210 417 95 171 420 292 198 328 309 -180 1 168 -229 -259 -39 -297 -584
2439 -584 -516 5 -119 -371 23 168 -149 146 487 553 190 72 482 232 393 197 -272 -364 -117 175 -379
2460 -379 -581 0 -379 -378 198 330 -326 25 563 335 135 392 611 43 153 422 248 -388 -163 21 -404
2481 -404 -467 -415 -693 -645 36 24 -356 -271 208 254 -198 182 353 20 16 673 478 -263 98 121 -175 -250 -80
2504 -80 -223 -493 -288 117 -665 -588 -112 164 43 158 486 57 -28 576 438 -55 55 234 47 -144 133
2525 133 -309 -860 -370 92 -335 -635 -142 107 52 355 367 107 -130 623 651 155 33 116 -142 6 145
2546 145 12 -518 -380 -131 -189 -454 -267 -26 -123 2 346 12 40 325 520 246 232 388 186 -28 293
$$ packed form
2396c63j19L22K16l17K62J18L23L0R7m01r7J82K15k34l64jj24r0j99N37k09n36
2418g52M68M51k20k59N22K07l22P6K49j28r4J30j9m89J81J67l97l0K20k58k87
2439e84O8N21j24k52L94J45l17K95L41O6l63j18M10k50J61j96m69r2K47K92n54
2460c79k02N81l79JN76J32o56L51N38k28k00K57K19n68J10K69j74o36K25J84m25
2481d04o3N2k78M8O81j2l80Q5M79M6m52L80J71l33mO57j95p41L61K3k96p5J70
2504h0j43k70K05M05p82P7M76K76j21J15L28m29q5O04j38m93J10J79j87j91K77
2525A33m42n51M90M62m27l00M93K49n5L03J2k60k37P53K8m96j22Q3k58J48J39
2546A45j33n30J38K49n8k65J87K41r7J25L44l34K8K85J95k74j4J56k02k14L21
$$ plain form
2567 293 32 -269 -397 -229 -250 -380 -56 -51 -293 -321 31 343 -95 154 390 147 570 229 139 90 -67 104
2589 104 -72 -266 -8 -249 -511 -351 -163 -83 -198 -79 9 -118 -53 107 315 98 263 463 128 315 177
2610 177 183 -39 -62 -439 -115 -8 -316 -313 -517 -284 -24 49 -85 -173 93 -34 440 335 424 174 174 409 302
2633 302 -174 9 83 -138 -121 -422 -124 -279 -395 -55 -89 88 -155 -68 161 497 395 189 125 316 259 -66
2655 -66 211 359 -269 -261 -42 -149 -489 -226 -236 -197 -153 -69 -23 196 319 219 260 95 384 164 -45 198 154
2678 154 -146 -152 -30 -280 -239 -242 -131 -182 -252 54 59 119 88 82 205 278 458 191 291 450 125 32 -196 94 -148
2703 -148 -106 -79 -284 -679 -565 -182 -149 -379 -11 128 164 123 105 273 397 295 319 241 44 165 -215 -235 -52
2726 -52 -117 -233 -208 -204 -211 -302 -68 -59 117 -127 411 -111 406 282 330 238 397 212 -15 -14 69 -116 -329 -345 -200
$$ packed form
2567B93k61l01j28J68k1j30L24Nk42k8L52L12m38K49K36k43M23l41r0m9j57J71
2589A04j76j94K58k41k62J60J88Q0j15J19Q8j27O5J60K08k17J65K00l35J87j38
2610A77Ok22k3l77L24J07l08Lk04K33K60P3j34q8K66j27M74j05Q9k50%K35j07
2633C02m76J83P4k21J7l01K98j55j16L40l4J77k43Q7K29L36j02k06o4J91n7l25
2655f6K77J48o28QK19j07l40K63j0L9M4Q4M6K19J23j00M1j65K89k20k09K43m4
2678A54l00oJ22k50M1lJ11n1p0L06NO0l1oJ23P3J80k67J00J59l25r3k28K90k42
2703a48M2K7k05l95J14L83L3k30L68J39L6m1j8J68J24j02K4p8j97J21l80k0J83
2726e2o5j16K5Mpr1K34RJ76k44N38n22N17j24M8r2J59j85k27JQ3j85k13j6J45
$$ plain form
2751 -200 -284 -334 -322 -65 -76 -139 109 183 202 64 433 379 246 113 14 129 217 -174 -198 -119 -80 -379 -105 -404
2775 -404 -197 -230 -23 -64 -22 232 131 130 347 204 173 244 331 108 169 142 -89 -78 -199 -199 -181 -207 -379 -123 -145
2800 -145 -164 -173 0 99 164 56 250 327 303 328 281 166 79 -239 -57 -75 -310 -218 34 -183 -132 -212 -7 -198 -156
2825 -156 49 227 241 482 190 185 314 43 59 86 -46 -33 -349 -63 -160 27 -164 76 -65 -378 -66 87
2847 87 47 153 248 374 256 318 304 -59 3 199 31 -191 -71 -200 -321 -127 -169 -233 -58 -219 91 46 309
2870 309 254 257 -4 299 122 49 295 161 49 53 148 -42 -263 -100 39 -122 -206 -54 -128 -123 -328 185 151 51
2894 51 202 165 200 59 285 159 -9 177 250 -111 -304 -103 -141 -99 36 -275 -121 -68 33 114 -114 199 281
2917 281 117 381 162 337 194 128 211 -100 -122 91 -239 -469 -154 47 -211 -157 43 288 -102 33 161
$$ packed form
2751b00q4n0J2K57j1o3K48P4J9j38L69n4j33j33r9J15Q8l91k4P9L9k99K74k99
2775d04K07l3K07m1M2K54j01jK17j43l1P1Q7k23O1k7k31J1j21%J8k6j72K56k2
2800a45j9rJ73R9O5j08J94P7k4K5m7j15q7l18J82j8k35R2K52k17N1q0K05j91M2
2825a56K05J78J4K41k92nJ29k71J6K7j32J3l16K86r7J87j91K40j41l13L12J53
2847H7m0J06R5J26j18O2j4l63O2J96j68k22J20j29j21J94m2o4J75j61L10m5K63
2870C09n5Lk61L03j77p3K46j34j12MR5j90k21J63J39j61q4J52p4Nk05N13l4j00
2894E1J51l7L5j41K26j26j68J86P3l61j93K01l8M2J35l11J54N3J01Q1k28L13Q2
2917B81j64K64k19J75j43o6Q3l11k2K13l30k30L15K01k58N4K00K45l90J35J28
$$ plain form
2938 161 126 133 284 275 22 148 445 -22 -50 -81 -105 -238 -229 -298 -271 -154 35 68 -247 13 -21 97 -131 234 211
2963 211 78 157 256 361 277 268 -11 -89 -146 -98 6 -264 -160 -46 -8 -50 40 243 -8 76 449 220 132 397
2987 397 282 38 98 145 -158 -125 -244 -113 -315 -302 -148 -187 -277 4 -79 -210 69 296 4 152 146 58 252
3010 252 248 253 95 -176 279 238 -122 -336 -30 -92 -194 -94 -195 -133 -239 50 177 15 50 -6 47 239 174 103
3034 103 20 109 76 -28 -27 -119 -155 -505 -68 48 -307 -93 67 -22 -8 240 99 96 226 66 237 162 25 197
3058 197 -71 -4 206 -96 -90 -287 -43 -316 -271 -65 -84 -197 -240 261 25 145 214 269 3 94 8 289 55
3081 55 34 211 -193 -160 229 -339 -434 -67 -41 -239 28 28 -105 72 161 393 31 241 217 129 231 217 1 206
3105 206 -118 -77 -83 -326 -77 -219 -289 -272 200 -91 -198 148 82 58 204 162 71 21 139 306 201 -76 -183
$$ packed form
2938A61l5PJ51rk53J26K97m67k8l1k4j33Ro9K7J17J89L3l15K60l4J18k28L65k3
2963B11j33P9R9J05q4rk79p8n7M8J04k70J04J14L8m2R0K03k51Q4L73k29q8K65
2987C97j15k44O0M7l03L3j19J31k02J3J54l9r0K81q3j31K79K27k92J48oq8J94
3010B52mNj58k71M55m1l60k14L06o2j02J00j01O2j06K89J27j62L5n6N3J92o5p1
3034A03q3Q9l3j04Jr2l6l50M37J16l55K14J60q9J4K48j41lJ30j60J71p5j37J72
3058A97k68O7K10l02Oj97K44k73M5K06j9j13m3N01k36J20O9N5k66R1q6K81k34
3081E5k1J77m04L3L89n68r5L67K6j98K67%j33J77Q9K32l62K10k4q8J02j4k16K05
3105B06l24M1ok43K49j42p0J7M72k91j07L46o6k4J46m2r1n0J18J67j05k77j07
$$ plain form
3128 -183 -67 -147 -156 -124 -124 -120 -170 44 14 -187 -72 117 32 339 79 179 199 158 268 113 -151 -191 -160 -107 -123 -21
3154 -21 -269 -161 -70 -42 111 -102 153 219 -3 -3 59 186 141 110 78 211 387 -12 -213 38 -210 -200 -179 -123
3178 -123 -65 -118 -31 -119 177 260 -69 53 421 53 270 209 167 -106 -3 39 161 170 -208 -224 -50 181 -166 -296
3202 -296 67 -174 14 -36 87 80 355 319 38 308 108 133 276 -75 28 -185 39 -41 -176 -316 -160 -44
3224 -44 -112 -263 106 -146 123 60 171 -83 -61 451 92 301 107 17 -66 -114 -83 -48 -154 -263 -159 81 10
3247 10 -202 71 -93 95 144 15 -79 183 153 175 69 96 74 -21 -31 75 -208 -53 32 -118 -194 82 121 -192
3271 -192 122 21 222 105 70 79 241 22 178 185 13 -178 -129 -114 -47 -208 -339 -79 -217 -185 -218 -88 -114 301
3295 301 10 65 -7 178 228 220 109 26 223 212 73 -83 -56 -6 27 -175 -76 -213 -240 1 -186 -238 146 -59
$$ packed form
3128a83J16q0rL2%Mn0K14l0k01J15J89q5L07k60J00K0m1J10j55k64m0L1N3j6J02
3154b1k48J08R1K8J53k13K55O6k22%O2J27m5l1l2J33J76l99k01K51k48J0K1N6
3178a23N8n3Q7q8K96Q3l29J22L68l68K17o1m2k73J03M2J22Rl78j6J74K31l47j30
3202b96L63k41J88n0J23pK75l6k81K70k00K5J43l51J03k13K24q0j35j40J56J16
3224d4o8j51L69k52K69o3J11k54K2N12l59K09j94r0q3m8L1L5j06j09J04K40p1
3247A0k12K73j64J88M9j29r4K62l0K2j06K7k2r5j0J06k83J55Q5j50p6K76L9l13
3271a92L14j01K01j17l5RJ62k19J56Pj72j91M9J5O7j61j31K60j38L2l3J30k6M15
3295C01k91N5p2J85N0qj11q3J97j1j39j56K7N0L3k02R9j37k7K41j87n2L84k05
$$ plain form
3319 -59 -191 74 286 96 -168 92 20 72 -25 30 -96 -290 142 -201 -147 -146 -215 125 -49 -47 98 85 57 79 26
3344 26 113 200 69 -130 -53 187 106 -238 -246 -104 -176 -336 -16 -219 82 -169 -26 144 -66 104 10 -2 -61 111
3368 111 227 75 191 94 -36 -190 100 25 -305 -141 -157 -88 -228 -143 -117 -1 -84 331 54 334 164 6
3390 6 62 68 160 222 108 -43 -72 -146 -162 -133 -87 -235 42 -59 -28 -49 80 55 99 4 87 65 92 71 128 45 225 -24
3418 -24 -59 -118 -14 -62 -40 0 -252 148 -254 28 -203 -9 102 109 92 110 212 110 183 2 90 -7 106 114 90
3443 90 -39 64 -133 -243 -103 7 9 -219 193 116 -135 123 17 149 -22 53 -47 -39 142 218 -74 -86 -149
3466 -149 -120 -215 -17 -235 -213 -183 -111 53 119 213 71 80 -144 139 137 211 -218 2 251 28 -83 29 116 -60
3490 -60 42 -141 -33 -123 85 -181 116 39 141 140 32 243 10 45 -126 -84 -128 105 -86 -6 -127 3 -138
$$ packed form
3319e9j32K65K12j90k64K60p2N2r7N5j26j94M32l43N4Jo9L40j74KJ45j3k8K2n3
3344B6Q7Q7j31j99P7K40q1l44qJ42p2j60L20k03L01k51J43J70k10J70r4j2n9J72
3368A11J16j52J16r7j30j54K90p5l30J64j6O9j40Q5K6J16q3M15k77K80j70j58
3390FN6OR2O2j14j51k9p4j6K9M6j48K77j01L1k1J29k5M4r5Q3k2K7k1N7q3J80k49
3418b4l5n9J04m8K2M0k52M00m02K82k31J94J11Pj7J8J02j02P3j81Q8r7J13Qk4
3443I0j29J03j97j10J40J10Kk28M12p7k51K58j06J32j71P5j00QJ81P6k92j2o3
3466a49K9r5J98k18K2L0P2J64O6R4j42Rk24K83kP4m29K20K49k23j11J12Q7j76
3490f0J02j83J08r0K08k66K97p7J02jj08K11k33L5j71M2m4K33j91Q0j21J30j41
$$ plain form
3513 -138 -63 62 111 -175 -27 -110 37 171 112 -43 95 123 -12 -15 102 -19 114 69 50 -72 -75 -146 10 -45
3537 -45 -129 -194 -193 154 -351 44 -9 59 356 192 83 -18 -15 227 247 -150 224 47 -225 -77 -76 -111 -57 -81 208
3562 208 -21 -41 309 -12 -56 148 13 95 120 366 147 -183 47 -31 -57 -84 -121 -142 23 -84 -45 -107 -227 -114
3586 -114 115 -35 211 456 279 200 173 462 133 -11 126 -229 18 -160 -8 -194 90 -234 -138 -250 -44
3607 -44 -132 -151 -75 -104 29 4 75 185 45 180 95 89 -132 -40 187 -184 -56 -76 -277 139 -20 25 -153 -71 40
3632 40 -26 -27 84 -110 162 175 276 -5 70 -167 -33 -127 -155 -237 -213 -167 -74 13 99 -80 -261 198 -194 131 93
3657 93 28 147 339 50 32 -24 2 49 99 114 -21 62 -296 -161 -110 -69 115 14 -83 -6 -49 -32 -36 182 284 22
3683 22 89 100 -44 -94 -160 -177 -35 24 187 -123 -98 48 93 20 24 -87 165 16 -65 233 226 358 50 87 170 141
$$ packed form
3513a38P5J25M9k86J48q3J47J34n9j55J38K8j35lJ17j21J33m5j9j22lp1J56n5
3537d5q4o5JL47n05L95n3O8K97j64j09j01LK42K0l97L74j77k72J48Jl5N4k4K89
3562B08k29k0L50l21m4K04j35Q2K5K46k19l30K30p8k6k7l7k1J65j07L9o2j20J13
3586a14K29j50K46K45j77p9k7K89l29j44J37l55K47j78J52j86K84l24R6j12K06
3607d4q8j9P6k9J33k5P1J10j40J35q5ok21R2K27l71J28k0k01M16j59M5j78Q2J11
3632D0o6jJ11j94K72J3J01k81P5k37J34r4k8q2K4M6R3Q7Q6j79j81M59l92L25l8
3657I3o5J19J92k89j8n6K6M7N0J5j35Q3l58J35N1M1J84j01r7P7m3J7mK18J02k62
3683B2O7J1j44n0o6j7J42N9J63l10K5J46M5p3Mj11K52j49q1K98pJ32l08L7Q3k9
$$ plain form
3709 141 58 -89 -172 0 -184 25 -41 -293 -141 -141 4 17 -7 378 243 -27 144 16 126 -1 285 -70
3731 -70 195 27 -132 -72 -242 107 -176 56 110 -34 -151 57 -46 132 207 58 121 -45 26 141 128 -80
3753 -80 -22 -32 -84 -244 161 -177 182 -143 -136 -75 -86 -19 -38 -28 -16 94 259 77 18 94 48 161 73 17 192 -22
3779 -22 -112 78 -26 -70 2 -116 -112 44 -130 23 158 182 -84 109 14 325 -59 -35 2 27 -24 -40 -22 61 -56
3804 -56 -137 -53 -57 142 -124 9 -87 31 -102 49 74 222 39 177 10 93 -112 -103 -171 2 -228 41 1 -133
3828 -133 -100 -82 -172 -146 35 7 56 148 -50 123 82 138 198 48 75 -5 38 58 -124 -78 -186 -25 -202 14 -155
3853 -155 223 31 -20 96 127 -7 2 104 28 221 -125 -104 162 -72 -149 -8 -173 46 -35 91 -55 -322 -40
3876 -40 -19 31 -73 49 -19 82 220 73 239 64 -177 261 -170 -59 -30 -14 52 -246 -3 -43 -266 -50 23
$$ packed form
3709A41q3j47q3J72j84K09o6k52J52%J45J3k4L85j35k70J71j28J10j27K86l55
3731g0K65j68j59O0j70L49k83K32N4j44j17K08j03J78P5j49O3j66P1J15j3k08
3753h0N8j0n2j60M05l38L59l25PO1j1O7j9J0J2J10J65j82n9P6m6J13q8n6J75k14
3779b2r0J90j04m4P2j18MJ56j74J53J35K4k66J93r5L11l84K4L7K5n1j6J8Q3j17
3804e6q1Q4mJ99k66J33r6J18j33J51K5J48j83J38j67Q3k05Ro8J73k30K69m0j34
3828a33L3J8r0K6J81k8M9R2j98J73m1N6O0j50K7q0M3K0j82M6j08J61j77K16j69
3853a55L78j92n1J16L1j34RJ02p6J93l46K1K66k34p7J41j65K19q1J26j46k67K82
3876d0K1N0j04J22o8J01J38j47J66j75k41M38m31J11K9J6O6k98K43m0k23K16P3
$$ plain form
3899 23 36 -82 5 159 -12 132 -40 253 126 46 120 3 -142 14 -34 64 27 -155 -128 -16 32 5 -116 -46
3923 -46 -24 186 34 29 219 98 248 79 -37 -30 51 78 -78 106 -233 -308 -46 -109 31 -203 10 235 270 21
3947 21 -37 10 90 118 82 147 19 22 229 -2 6 69 -10 -169 -120 10 -74 -45 -44 -68 160 111 93 335 239 299 217 140
3975 140 -101 138 51 5 25 -108 -200 -33 110 -296 -246 -191 -102 -110 -88 17 -92 -177 -26 17 62 -78 7 62 -176
4000 -176 150 -13 -110 -83 -137 -140 -150 -165 21 39 169 156 69 -30 72 176 161 185 161 39 64 -63 80 12 95 -293
4026 -293 74 -185 -267 -85 -54 -69 208 -104 121 -131 -7 -139 173 67 -7 173 1 79 -23 -145 -34 50
4048 50 -51 20 49 -123 -124 29 -44 77 -21 40 82 90 -69 71 307 52 -27 81 -100 -26 180 -31 -314 28
4072 28 -185 -138 -250 -102 94 -28 -66 59 179 60 165 119 27 -48 -36 130 -144 -160 1 -65 22 7 -128 -78
$$ packed form
3899B3J3j18Q7J54j71J44j72K93j27q0P4j17j45J56m8R8l7j82K7J12M8k7j21P0
3923d6K2K10j52nJ90j21J50j69j16PQ1K7j56J84l39p5K62o3J40k34K13K25L5k49
3947B1n8M7Q0K8l6O5j28LK07k31QO3p9j59M9J30q4K9Jk4K28m9j8K42r6O0q2p7
3975A40k41K39q7m6K0j33r2J67J43m06N0N5Q9qK2J05j09q5J51M3M5j40Q5N5k38
4000a76L26j63r7K7n4lj0j5J86J8J30j3q7r9J02J04j5K4k4j22K5j27J43o8Q3l88
4026b93L67k59q2J82L1j5K77l12K25k52J24j32L12j06p4J80j72P8j02j22J11Q4
4048E0j01P1K9j72jJ53p3J21r8O1M2Qj59J40K36k55p9J08j81P4K06k11k83L42
4072B8k13M7j12J48J96j22l8J25J20j19J05m6r2p5J2J66k74j6J61o6Q7j5j35N0
$$ plain form
4096 -78 -249 132 -39 -104 8 -49 219 -35 -29 0 49 361 118 13 -65 27 -76 212 -24 -20 -64 -9 -49 101 -27
4121 -27 10 -149 -42 -111 83 217 33 201 -3 -132 193 66 9 328 -120 0 101 -155 -162 -184 -86 -58 -96
4144 -96 -200 -55 6 -11 -33 69 -206 173 131 -87 340 25 94 128 -57 -151 -80 -23 -182 -39 -304 -68 1 48
4168 48 164 74 -62 128 96 194 278 160 152 120 193 276 -138 60 -124 -53 127 230 -183 62 -26 -114 -73 -96 51
4193 51 -100 52 -83 53 -17 35 228 -107 57 -248 -55 48 -211 -245 -103 -73 -131 -57 -78 -74 -37 -41 18 62 -117
4218 -117 187 68 130 264 -20 85 12 4 -154 -387 -13 -25 -58 -288 -65 16 174 -63 10 224 119 250 -66
4241 -66 78 -32 78 126 155 -73 -139 -83 -29 156 -1 9 -162 -206 -153 -69 -178 -171 86 149 185 175 62 282 -78
4266 -78 -4 131 80 -74 212 70 11 55 32 -237 -65 2 -74 -84 147 103 247 65 -65 179 65 151 34 22
$$ packed form
4096g8j71L81j71o5J12n7K68k54OK9M9L12k43j05p8R2j03K88k36Mm4N5m0J50j28
4121b7L7j59J07o9J94J34j84J68k04j29L25j27n7L19m48J20J01k56pk2R8K8l8
4144i6j04J45O1j7k2J02k75L79m2k18M27l15O9L4j85r4P1N7j59J43k65K36O9M7
4168D8J16r0j36J90l2R8Q4j18ql2P3Q3m14J98j84P1J80J03m13K45q8q8M1k3J47
4193E1j51J52j35J36p0N2J93l35J64l05J93J03k59l4J42L0n8P4k1ML7mN9M4j79
4218a17L04j19O2J34k84J05p3qj58k33L74j2l3k30K23Q1J58k37P3K14j05J31l16
4241f6J44j10J10M8K9k28o6N6N4J85j57J0j71m4N3Q4j09PK57O3L6j0j13K20l60
4266g8P4J35n1j54K86j42n9M4k3k69J72O7p6j0K31m4J44j82j30K44j14Q6j17j2
$$ plain form
4290 22 -170 -195 -47 159 51 -34 -68 -156 135 -23 -97 121 26 -40 -220 107 71 3 178 209 -55 -98 -82 -149 -18
4315 -18 90 10 -116 8 -64 -154 -147 -248 -224 -64 11 -23 -1 6 243 338 205 72 94 -29 100 167 21 0 24 -26
4341 -26 -116 -144 48 -51 -65 25 125 99 -29 -205 71 156 125 76 38 29 72 -35 -149 -73 110 -210 -51 -103 5
4366 5 -217 -27 -86 -97 -96 -36 -53 281 -7 63 -40 121 204 -186 51 -9 -185 -47 -224 -38 34 35 -60 0 -122
4391 -122 113 34 78 238 79 84 130 -19 -184 129 -174 226 -9 99 -16 54 -207 35 -177 -76 -101 -337
4413 -337 -18 -53 -128 125 85 129 228 227 97 153 -82 -19 101 7 175 69 -14 -79 -43 -162 -128 -165 -46 -160 132
4438 132 231 -37 -145 71 151 -200 -136 -70 181 -99 69 162 -256 -341 -105 0 -137 21 72 -244 30 61 -16
4461 -16 150 160 40 68 15 181 -30 40 -94 259 -148 91 -54 -138 -101 -13 -2 -68 148 32 194 -135 -103 132
$$ packed form
4290B2j92k5J48K06j08q5l4q8K91j58p4K18r5o6j80L27l6o8J75L1k64m3J6o7J31
4315a8J08q0j26J24p2r0Pj01K4J60P5l4K2PK37R5j33j33K2j23J29O7j46k1K4n0
4341b6r0k8J92r9j4R0J00k6j28j76K76Q5l1m9l8rM3j07j14P6J83l20J59n2J08
4366Ek22J90n9j1JO0j7L34k88P0j03J61Q3l90K37o0j76J38j77J86P2Jr5O0j22
4391a22K35p9M4J60j59NM6j49j65L13l03M00k35J08j15P0k61K42k12J01k5k36
4413c37L19l5p5K53m0M4R9jj30N6k35O3J20r4J68j06q3o5L6j19L4l7J19j14K92
4438A32R9k68j08K16Q0l51O4O6K51k80J68R3m18q5K36J05j37J58N1l16K74L1p7
4461a6J66J0j20K8n3J66k11P0j34L53m07K39j45q4L7Q8J1o6K16j16J62l29L2K35
$$ plain form
4485 132 -28 -172 42 7 19 -75 137 94 -279 66 49 -138 -43 7 -108 -118 -112 -81 71 -2 -31 -95 84 -109 104
4510 104 33 4 135 260 -47 129 -135 -5 -183 120 89 -382 4 -134 -214 -218 -16 9 -10 272 36 -105 187
4533 187 37 -41 148 9 -148 14 15 -159 -33 -110 -169 40 -35 -24 -31 -52 212 80 31 157 164 104 148 -49 -142
4558 -142 -46 -18 -68 -18 -39 -76 31 95 -154 -35 -72 79 -83 -28 -64 -139 171 -84 65 33 -58 -40 163 13 -108
4583 -108 45 62 -266 -79 62 123 169 -52 5 -164 28 44 215 65 -22 141 88 82 -134 89 75 158 83 -147
4607 -147 -132 135 -103 -308 -137 65 -149 16 21 -159 132 -139 -71 -19 132 -44 98 -120 10 -43 20 -233
4629 -233 5 13 66 -163 202 29 57 -85 -131 208 281 -111 -52 7 131 120 -6 10 -21 115 13 12 -97 -9 235
4654 235 23 -120 -73 -17 83 -199 -60 81 142 85 61 55 220 8 -101 -16 100 -87 -76 78 -104 29 -55
$$ packed form
4485A32j60j44K14l5J2r4K12m3l73L45j7j87R5N0j15j0OL1J52p3k9o4J79j93K13
4510A04p1k9J31J25l07J76k64J30j78L03l1m71L86j38q0mK02K5j9K82k36j41K92
4533A87j50p8J89j39j57J62Jj74J26p7n9K09p5J1pk1K64j32m9J26Po0M4j97r3
4558a42R6K8n0N0k1l7J07O4k49J19l7J51j62N5l6p5L10k55J49l2r1J8K03j50j21
4583a08J53J7l28J87J41O1M6k21N7j69J92J6J71j50q7J63n3ok16K23j4Q3p5k30
4607a47J5K67k38k05J71K02k14J65Nj80K91k71O8N2J51j76J42k18J30n3O3k53
4629b33K38QN3k29L65j73K8j42m6L39P3l92N9N9J24j1j26J6l1J36j02jj09Q8K44
4654B35k12j43M7N6J00k82J39J41O1n7k4oJ65k12j09Q5J16j87J1J54j82J33q4
$$ plain form
4677 -55 -290 217 105 -47 29 105 248 16 47 -7 -91 -36 182 206 3 101 -108 -107 -30 -249 71 -71 -60 -121 -179
4702 -179 -129 129 116 71 138 -201 -99 5 -35 40 -16 220 201 76 4 -50 -135 30 -37 -63 72 -112 78 -107
4726 -107 -96 52 34 94 225 194 100 -85 -27 162 -212 146 -194 200 -95 -109 -102 -18 -74 -31 -178 -44 94 -55
4750 -55 94 -174 153 286 70 -72 238 217 46 15 -14 29 -11 -25 15 -136 -5 145 37 -229 -63 -32 -89
4773 -89 -68 -23 15 135 161 -44 117 11 -146 -232 -175 -324 -150 -10 -134 -177 -138 62 -38 -252 -93 24 71
4796 71 -96 117 164 45 33 -49 196 123 -75 25 -218 156 61 -135 -69 -4 -102 -20 99 63 111 -6 -32 -40 26
4821 26 5 279 50 99 62 -35 -10 39 -231 -161 90 41 59 40 -98 100 -1 47 -258 -119 -49 -72 -59 -25 -84 21
4847 21 -99 12 13 -57 27 -240 -31 -144 -11 -39 -66 -142 -180 -5 92 -78 -36 81 190 -10 -220 8 84 -255
$$ packed form
4677e5k35N07j12j52P6P6J43k32L1n4q4N5K18K4k03R8k09JP7k19L20j42J1o1n8
4702a79N0K58j3m5O7l39J02J04m0P5n6K36j9j25p2n4q5J65o7k6J35j84J90j85
4726a07J1J48j8O0J31l1r4j85N8J89l74L58l40L94k95j4PQ4n6M3j47J34J38j49
4750e5J49k68L27J33k16j42L10k1j71l1k9M3m0j4M0j51J31J50j08k66J66L1n7
4773h9K1M5L8J20K6k05J61j06j57q6N7j49J74J40j24m3L9K00j00k14J59J17M7
4796G1j67K13M7j19j2q2K45p3j98J00k43L74r5j96O6O5r8Q2J19l6M8j17k6qO6
4821B6k1K74k29M9l7r7K5M9k70P0K51m9J8j9j38J98j01M8l05J39P0k3J3L4n9J05
4847B1j20J11Jp0Q4k67K09j13J33k8k7p6l8J75R7j70M2J17J09k00k10K28P6l39
$$ plain form
4871 -255 8 -9 45 -39 -181 92 -162 -109 -69 136 -42 -81 -47 34 -103 18 -110 -25 381 133 160 -52 -32 126
4895 126 81 64 0 -125 69 -33 88 -185 22 61 114 84 148 255 -149 92 68 97 -129 -3 70 -174 -52
4918 -52 0 -132 154 -56 123 -273 -75 -65 -65 -19 160 70 156 26 68 -109 -308 -107 46 126 94 123 -21 73
4942 73 -48 -37 170 -62 -187 -226 -124 183 172 -70 -58 92 39 187 -35 269 51 203 133 7 -42 -190 -49
4965 -49 21 -37 -16 -4 -34 -176 -8 -23 109 -14 171 33 30 -58 46 -132 -66 -122 -146 227 32 -111 -157 -94 183
4990 183 -130 -200 35 -268 -64 -6 49 -132 97 7 23 42 164 107 171 185 61 -271 -3 218 50 47 -16 -82
5014 -82 11 -97 57 -74 56 142 -98 178 0 169 -97 -123 -21 -24 -30 -90 -111 66 65 35 111 -20 -19 22 109 86
5040 86 -44 -85 -95 -50 83 -115 173 58 -146 198 -148 -6 144 -195 -102 169 -99 139 -197 -91 -324 234
$$ packed form
4871b55K63j7N4q4j42K73k54N3M0K05j78l9L4Q1j37J21j28Q5M06k48K7k12K0J58
4895A26m5j7o4j25J94j02J21k73K07L9N3l0O4J07m04K41k4K9k26J26P3k44J22
4918e2N2j32K86k10J79l96J98J0%M6J79r0Q6j30M2j77j99K01J53Q0l2K9j44R4
4942G3j21J1K07k32j25l9J02L07j1k42J2J50n3J48k22L04k18J52p0j26m9j48J41
4965d9P0n8K1J2l0j42J68j5J32j23J85j38lq8J04j78O6n6k4L73j95j43m6O3K77
4990A83l13p0K35l03K04N8N5j81K29r0J6J9J22n7O4J4j24l32K68K21j68lo3o6
5014h2R3j08J54j31J30Q6k40K76j78J69k66k6J02loo0k1J77jl0P6j31JM1Q7k3
5040H6j30m1j0M5J33j98K88j15k04L44l46J42J50l39R3K71k68K38l36J06k33N58
$$ plain form
5062 234 266 -23 62 20 79 -20 159 -143 90 396 54 -111 176 103 -100 50 -35 -58 0 -15 -60 -71 -73 -95 -174
5087 -174 24 170 88 -3 -83 -163 -12 -89 150 -234 -101 72 17 67 14 148 -48 -77 -77 -193 73 -112 -27 -46
5111 -46 98 -89 216 9 33 -123 -74 132 -2 -37 -271 51 -199 96 4 -83 -24 -25 -59 238 -41 56 -80 -22
5135 -22 233 60 101 153 82 -7 -125 15 46 -77 102 67 -7 -99 -75 214 93 -77 -46 -109 116 16 21 56 104
5160 104 -26 -62 136 -159 5 18 -93 77 180 -1 -3 -177 -43 -53 -3 -13 -138 4 -31 -1 51 -34 85 9
5184 9 13 32 19 -23 -73 -67 139 49 -301 -123 -80 -28 -5 54 47 -154 211 -116 75 86 -92 20 -94 -73 47 -163
5210 -163 15 -71 153 -93 -128 -58 -59 21 223 -82 -42 123 -6 -22 175 110 -4 2 -26 1 -148 -44 132 126 -8
5235 -8 -89 -177 -98 -55 -112 54 -145 43 56 -93 100 -41 137 99 126 208 32 -48 149 48 -18 -77 -27 111 -153
$$ packed form
5062B34L2k89Q5m2N9r9J79l02K33L06l42j65K87p3k03J50q5k3N8j5m5j1kk2p9
5087a74J98J46q2r1q0q0J51p7K39l84J33J73n5N0n3J34j96k9%j16K66j85Q5j9
5111d6J44j87L05k07K4j56M9K06j34l5k34L22k50K95r2q7N9jl4K97k79R7j36N8
5135b2K55j73M1N2p1q9j18J40L1j23J79l5p4r2K4K89j21j70L1o3K25j00NL5M8
5160A04j30l6J98k95J64J3j11J70J03j81kj74J34j0N0j0j25J42l5L0N2q5J19p6
5184IMJ9j3m2n0OK06r0l50J78M3N2K3N9pk01L65l27J91J1j78J12j14K1J20k10
5210a63J78q6K24k46l5P0jQ0K02l05M0J65j29j6J97o5j14Ok8K7j49J04J76oj34
5235hq1q8P9M3n7J66j99J88J3j49J93j41J78l8K7Q2j76q0J97j01o6n9N0J38k64
$$ plain form
5260 -153 -118 59 -62 208 169 -104 -102 -36 -11 189 -102 77 24 109 -60 -102 -22 -48 -78 -253 -10 -65 -100 -92 116
5285 116 -10 -18 75 144 -149 -103 -31 -251 149 -1 67 -37 111 129 -42 -156 -77 58 -20 -69 -82 97 61 13 -67
5310 -67 85 53 -92 -12 102 66 -15 17 163 63 62 -131 -116 -10 -20 -143 -83 -29 -114 -133 30 -207 19 235 -132
5335 -132 33 -21 99 -56 75 6 -80 -47 -63 27 7 33 81 113 44 60 -5 -6 -111 -82 -145 -45 122 57 82 120 -127
5362 -127 -79 87 89 -5 33 -121 -68 123 -30 -55 -59 -9 -7 44 -125 70 14 2 48 179 149 105 132 101 -40 41 -66
5389 -66 -58 84 -92 71 -174 -34 101 125 36 90 -47 175 84 139 -234 171 -3 82 -7 -20 -35 95 21 -36 -225
5414 -225 -85 -222 -31 53 35 105 36 -125 -93 45 -16 64 -44 247 74 89 -171 -10 97 71 -141 35 150
5437 150 -1 -243 165 155 97 -32 30 -143 -115 -79 -4 83 188 1 -322 114 -53 -142 -6 73 46 1 -131 -18
$$ packed form
5260a53L5J77j21K70l9k73KO6K5K00k91J79n3Q5j69m2Q0k6l0j75K43n5l5QK08
5285A16j26qR3O9k93M6P2k20M00j50O8j04J48J8j71j14P9J35p8m9j3J79l6m8q0
5310f7J52l2j45Q0J14l6q1L2J46j00jj93J5J06j0j23O0N4q5j9J63k37K26K16l67
5335a32J65n4J20j55J31o9q6L3j6R0k0K6M8L2o9J6o5jj05K9o3J00J67o5K5L8k47
5362a27M8J66Kr4L8j54N3J91j53k5mN0KN1j69J95n6j2M6J31l0m4K7l1j41Q1j07
5389f6QJ42j76J63k45J40J35K4q9N4j37K22r1N5l73M05j74Q5q9j3j5J30p4n7j89
5414b25J40j37J91Q4j8P0o9j61L2J38o1Q0j08K91j73J5k60J61J07k6k12J76J15
5437A50j51k42M08j0n8j29O2j73K8L6P5Q7J05j87l23M36j67q9J36P9k7m5j32J13
$$ plain form
5461 -18 -144 -111 145 -55 -9 4 -37 112 169 264 41 -134 98 42 -51 114 -18 137 -153 -66 91 4 134 99
5485 99 -153 -110 -6 -5 -240 -72 272 167 -41 51 62 154 -4 -101 -208 -65 -13 38 -86 -72 -58 -105 203 43
5509 43 -211 124 -32 -57 -73 47 90 -80 84 72 -43 141 68 -49 1 -189 -43 80 -108 60 -144 186
5531 186 -44 51 -13 -132 16 144 -114 -58 168 193 66 36 -115 58 -196 207 11 45 -165 -230 -132 70 89
5554 89 194 69 -57 -24 -92 -19 54 67 -139 10 -21 -5 284 142 122 84 -47 159 -76 -85 -127 57 124 -45 71
5579 71 210 15 48 -14 3 25 92 72 -19 27 -23 -47 10 -65 -39 -185 221 -15 -96 350 160 80 -92 147 -68
5604 -68 118 -27 171 -74 -64 -133 41 -88 43 -45 -140 -15 -130 127 -143 -160 -56 24 -66 -120 13 208 -152
5627 -152 95 -14 206 213 55 -75 -171 -25 156 -69 -115 -119 -171 -130 -45 70 -170 -4 -29 -40 -143 18 9 -130
$$ packed form
5461a8j26L3K56k00M6J3m1J49N7R5k23j75K32n6r3J65j32J55k90Q7J57q7J30l5
5485I9k52M3J04Jk35J68L44j05k08R2J1R2j58r7j07J43N2N1j24J4J4m7L08j60
5509D3k54L35j56k5j6J20M3j70J64j2j15J84p3j17N0j90J46J23j88J68k04L30
5531A86k30R5o4j19J48J28k58N6K26K5j27l0j51J73k54M03j96L4k10o5R8K02J9
5554H9J05j25j26L3o8P3P3J3k06J49l1J6K89j42k0l8j31K06k35rm2J84O7j69J16
5579G1J39j95L3o2J7K2O7k0r1M6n0k4N7p5K6j46M06k36q1M46j90q0j72K39k15
5604f8J86j45J98k45J0o9J74j29J31q8r5J25j15K57k70j7J04Q0r0n4J33J95l60
5627a52K47j09K20Pj58j30r6J46J81k25m6mn2M1Q5J15k40J66k5j1j03J61rj39
$$ plain form
5651 -130 -40 -79 -134 -110 -142 135 -163 48 -27 -40 186 -69 146 -105 51 -48 -215 122 164 -76 228 156 -19
5674 -19 65 75 249 62 160 -99 -95 34 -36 -33 -144 -174 -9 -231 22 -108 -117 17 -5 106 -44 -12 250 -57 40
5699 40 -39 -12 179 -60 -1 214 -74 -135 -15 124 68 3 25 -102 106 50 225 31 32 28 30 131 219 80 -122
5724 -122 -139 57 -69 -131 -84 167 180 -5 71 -30 164 -183 58 117 -80 25 90 -103 -177 128 143 15 149
5747 149 -70 64 11 120 -56 -151 2 -87 149 -57 88 116 -78 131 119 156 183 141 23 94 46 -106 280
5770 280 142 -196 -116 93 -63 -110 -87 -21 -89 40 13 8 47 113 138 -45 47 155 158 -132 -177 78 75 -25 93 75
5796 75 -94 160 91 72 149 -54 146 138 17 -19 2 0 -55 -127 -50 58 -26 -108 -274 72 19 -32 119 195 -57 -182
5822 -182 -250 -73 -131 43 82 95 -19 -10 -79 63 -108 -19 -153 -43 -6 50 -71 37 -8 112 84 -99 121 61
$$ packed form
5651a30R0l9n5K4l2K77k98K11p5j3K26k55K15k51J56r9j67L37M2k40L04p2j75
5674a9Q4J0J74j87R8k59MJ29p0Lj11l0J65k22K53j30rJ34k2J11j50L2K62l07R7
5699D0p9K7J91k39N9K15k88o1J20J39n6o5K2j27K08n6J75j94JmKJ01Q8j39k02
5724a22j7J96j26o2M7K51J3j85P6j01J94l47K41N9j97J05O5j93p4L05J5j28J34
5747A49k19J34n3J09j76r5J53q9K36k06J45K8j94K09j2L7K7m2j18P1m8j52L86
5770B80j38l38Q0K09j56m7K3O6o8J29k7nL9O6K5j83R2J08Lk90m5K55lj00J18j8
5796G5j69K54o9j9P7k03K00qj21l6K1kn5p2P7J08q4q2j66L46n3n1J51P6k52j25
5822a82o8J77n8J74L9J3j14Ro9J42j71Q9j34J10L7N6j21J08m5J20k8j83K20o0
$$ plain form
5846 61 289 -105 -138 -110 -198 -53 121 -42 -77 -80 5 18 31 139 -37 72 -207 -172 -24 -12 37 1 29 -94 -49
5871 -49 81 61 -43 -30 -46 -26 39 -15 -26 -32 49 123 -107 231 -127 -29 -51 16 -9 21 114 140 -101 -33 13 13 23 121
5899 121 90 -180 75 67 -222 104 -226 -88 77 -175 65 -7 -56 -21 141 124 14 38 179 -163 0 189 -2
5922 -2 -75 88 4 -209 117 8 -92 -140 -127 -72 -23 42 345 29 19 108 -104 144 -71 -63 40 15 51 90 -112
5947 -112 22 -85 -116 45 54 -27 306 69 -68 -16 235 -137 162 144 -260 -66 -96 21 119 80 -136 139 51
5970 51 15 -197 142 -9 -54 -15 -142 28 167 21 53 45 -171 -23 47 69 30 -92 -103 101 -35 31 35 -64 107
5995 107 -19 -127 -9 16 119 -32 -47 91 90 123 -92 -68 41 126 59 34 -314 -72 -24 -107 187 -38 -199 16
6019 16 20 56 -95 57 134 -160 -4 138 -36 -186 6 158 40 -37 62 -90 35 -138 -88 -262 -203 83 44
$$ packed form
5846F1K28l94l3K8q8J45J74j63l5lQ5J3J3J08j76J09k79L5J48J2M9l6K8j23M5
5871d9J30k0j04J3j6K0O5n4j1oQ1P4k30L38l58R8k2O7k5L0R3K6k41O8M6%J0R8
5899A21l1k70K55qk89L26l30J38J65k52K40p2m9L5J62j7j10K4J41l42J63J89j91
5922bp3J63q4k13L26j09j00m8J3N5M9O5L03l16j0Q9k12K48k15QJ03k5L6L9k02
5947a12J34j07l1J61Rq1L33k37j37N2K51l72K99j8m04J94l0J17R8l9k16K75q8
5970E1l6k12L39j51m5L9j27J70J39j46L2qk16J48P0K2l9j22j1K04j36O6Mr9J71
5995A07j26j08J18K5J03j51j5J38jL3k15K4J09Q5o7k5l48K42M8q3K94k25j61K15
6019A6ML6j51J52P7k94J56J42j74j50J92J52j18p7R9j52J25j73N0j74N9K86l9
$$ [...]
8191E4
##END NTUPLES=NMR FID
##END=
