##TITLE=1H_Ser AmS-NMeEA
 200.13MHz,CDCl3,
 8 sc
 
 27.6.2025
##JCAMPDX= 6.0         $$ Bruker NMR JCAMP-DX V2.0
##DATA TYPE= NMR FID
##DATA CLASS= NTUPLES
##ORIGIN= UXNMR, Bruker Analytische Messtechnik GmbH
##OWNER= pz
$$ XWIN-NMR		Version 3.5
$$ Fri Jun 27 15:35:57 2025 Russian Standard Time (UT+4h)  she@DPX200
##.OBSERVE FREQUENCY= 200.1313
##.OBSERVE NUCLEUS= ^1H
##.DELAY= (6, 6)
##.ACQUISITION MODE= SIMULTANEOUS
##.ACQUISITION SCHEME= undefined
##.AVERAGES= 8
##.DIGITISER RES= 18
##SPECTROMETER/DATA SYSTEM= spect
##.PULSE SEQUENCE= zg30
##.SOLVENT NAME= CDCl3
##.SHIFT REFERENCE= (INTERNAL, CDCl3, 0, 14.3821)
##AUDIT TRAIL= $$ (NUMBER, WHEN, WHO, WHERE, WHAT)
$$ ##TITLE= Audit trail, XWIN-NMR		Version 3.5
$$ ##JCAMPDX= 5.01
$$ ##ORIGIN= Bruker BioSpin GmbH
$$ ##OWNER= she
$$ F:/spectra/data/she/nmr/H-C/1/audita.txt
$$ ##AUDIT TRAIL=  $$ (NUMBER, WHEN, WHO, WHERE, WHAT)
(   1,<2025-06-27 15:34:41.98 +0400>,<she>,<DPX200>,
      <created by zg, POWCHK disabled, PULCHK disabled
       configuration hash MD5:
       00 E9 B6 7A A2 85 ED C7 34 08 36 98 17 FE 4E 26
       data hash MD5: 16K
       76 32 69 41 64 6E 11 AA 59 CF 0D 77 01 3E 9B AE>)
$$ ##END=
$$ 
$$ hash MD5
$$ 96 4C 4D B9 0C 29 9E 17 BE 0A D7 9B CB 31 7B 01
##$RELAX= 
##$RELAX= 
##$RELAX= 
##$RELAX= 
##$RELAX= 
##$RELAX= 
$$ Bruker specific parameters
$$ --------------------------
##$DU= <F:/spectra>
##$EXPNO= 1
##$NAME= <H-C>
##$PROCNO= 1
##$TYPE= <nmr>
##$USER= <she>
##$AMP= (0..31)
100 100 100 100 100 100 100 100 100 100 100 100 100 100 100 100 100 100 
100 100 100 100 100 100 100 100 100 100 100 100 100 100 
##$AQSEQ= 0
##$AQ_mod= 1
##$AUNM= <au_zg>
##$AUTOPOS= <>
##$BF1= 200.13
##$BF2= 200.13
##$BF3= 200.13
##$BF4= 200.13
##$BF5= 200.13
##$BF6= 200.13
##$BF7= 200.13
##$BF8= 200.13
##$BYTORDA= 1
##$CFDGTYP= 0
##$CFRGTYP= 5
##$CHEMSTR= <none>
##$CNST= (0..31)
1 1 145 1 1 1 1 1 1 1 1 1 1 1 1 1 1 1 1 1 1 1 1 1 1 1 1 1 1 1 1 1 
##$CPDPRG= <>
##$CPDPRG1= <>
##$CPDPRG2= <>
##$CPDPRG3= <>
##$CPDPRG4= <mlev>
##$CPDPRG5= <mlev>
##$CPDPRG6= <mlev>
##$CPDPRG7= <mlev>
##$CPDPRG8= <mlev>
##$CPDPRGB= <>
##$CPDPRGT= <>
##$D= (0..31)
0 0.7 0 0 0 0 0 0 0 0 0 0.03 0 0 0 0 0 0 0 0 0 0 0 0 0 0 0 0 0 0 0 0 
##$DATE= 1751024081
##$DBL= (0..7)
120 120 120 120 120 120 120 120 
##$DBP= (0..7)
150 150 150 150 150 150 150 150 
##$DBP07= 0
##$DBPNAM0= <>
##$DBPNAM1= <>
##$DBPNAM2= <>
##$DBPNAM3= <>
##$DBPNAM4= <>
##$DBPNAM5= <>
##$DBPNAM6= <>
##$DBPNAM7= <>
##$DBPOAL= (0..7)
0.5 0.5 0.5 0.5 0.5 0.5 0.5 0.5 
##$DBPOFFS= (0..7)
0 0 0 0 0 0 0 0 
##$DE= 6
##$DECBNUC= <off>
##$DECIM= 32
##$DECNUC= <off>
##$DECSTAT= 4
##$DIGMOD= 1
##$DIGTYP= 9
##$DL= (0..7)
0 120 120 120 120 120 120 120 
##$DP= (0..7)
150 150 150 150 150 150 150 150 
##$DP07= 0
##$DPNAME0= <>
##$DPNAME1= <>
##$DPNAME2= <>
##$DPNAME3= <>
##$DPNAME4= <>
##$DPNAME5= <>
##$DPNAME6= <>
##$DPNAME7= <>
##$DPOAL= (0..7)
0.5 0.5 0.5 0.5 0.5 0.5 0.5 0.5 
##$DPOFFS= (0..7)
0 0 0 0 0 0 0 0 
##$DQDMODE= 0
##$DR= 18
##$DS= 0
##$DSLIST= <SSSSSSSSSSSSSSS>
$$ [...]
##$SUBNAM0= <"">
##$SUBNAM1= <"">
##$SUBNAM2= <"">
##$SUBNAM3= <"">
##$SUBNAM4= <"">
##$SUBNAM5= <"">
##$SUBNAM6= <"">
##$SUBNAM7= <"">
##$SUBNAM8= <"">
##$SUBNAM9= <"">
##$SW= 18.0517328524113
##$SWIBOX= (0..15)
0 0 2 0 0 0 0 0 0 0 0 0 0 0 0 0 
##$SW_h= 3612.71676300578
##$TD= 16384
##$TD0= 1
##$TE= 0
##$TE2= 300
##$TE3= 300
##$TEG= 300
##$TL= (0..7)
0 120 120 120 120 120 120 120 
##$TP= (0..7)
150 150 150 150 150 150 150 150 
##$TP07= 0
##$TPNAME0= <>
##$TPNAME1= <>
##$TPNAME2= <>
##$TPNAME3= <>
##$TPNAME4= <>
##$TPNAME5= <>
##$TPNAME6= <>
##$TPNAME7= <>
##$TPOAL= (0..7)
0.5 0.5 0.5 0.5 0.5 0.5 0.5 0.5 
##$TPOFFS= (0..7)
0 0 0 0 0 0 0 0 
##$TUNHIN= 0
##$TUNHOUT= 0
##$TUNXOUT= 0
##$USERA1= <user>
##$USERA2= <user>
##$USERA3= <user>
##$USERA4= <user>
##$USERA5= <user>
##$V9= 5
##$VALIST= <valist>
##$VCLIST= <CCCCCCCCCCCCCCC>
##$VD= 0
##$VDLIST= <DDDDDDDDDDDDDDD>
##$VPLIST= <PPPPPPPPPPPPPPP>
##$VTLIST= <TTTTTTTTTTTTTTT>
##$WBST= 1024
##$WBSW= 4
##$XGAIN= (0..3)
0 0 0 0 
##$XL= 0
##$YL= 0
##$YMAX_a= 177430
##$YMIN_a= -225047
##$ZGOPTNS= <>
##$ZL1= 120
##$ZL2= 120
##$ZL3= 120
##$ZL4= 120
##$ABSF1= 10
##$ABSF2= 0
##$ABSG= 5
##$ABSL= 3
##$ALPHA= 0
##$AQORDER= 0
##$ASSFAC= 0
##$ASSFACI= 0
##$ASSFACX= 0
##$ASSWID= 0
##$AUNMP= <proc_1d>
##$AZFE= 0.1
##$AZFW= 0.1
##$BCFW= 1
##$BC_mod= 2
##$BYTORDP= 1
##$COROFFS= 0
##$CY= -3
##$DATMOD= 1
##$DC= 2
##$DFILT= <>
##$DTYPP= 0
##$F1P= 0
##$F2P= 0
##$FCOR= 0.5
##$FTSIZE= 0
##$FT_mod= 4
##$GAMMA= 1
##$GB= 0.15
##$INTBC= 1
##$INTSCL= 1
##$ISEN= 128
##$LB= 0.25
##$LEV0= 0
##$LPBIN= 0
##$MAXI= 10000
##$MC2= 0
##$MEAN= 0
##$ME_mod= 0
##$MI= 1.114404
##$NCOEF= 0
##$NC_proc= 0
##$NLEV= 6
##$NOISF1= 3.799351
##$NOISF2= 2.8
##$NSP= 1
##$NTH_PI= 0
##$NZP= 0
##$OFFSET= 14.38212
##$PC= 1
##$PHC0= -1208.331
##$PHC1= 25.79222
##$PH_mod= 1
##$PKNL= yes
##$PPARMOD= 0
##$PSCAL= 0
##$PSIGN= 0
##$REVERSE= no
##$SF= 200.129724274929
##$SI= 16384
##$SIGF1= 3
##$SIGF2= 2
##$SINO= 400
##$SIOLD= 16384
##$SREGLST= <1H.CDCl3>
##$SSB= 0
##$STSI= 0
##$STSR= 0
##$SW_p= 3205.1282051282
##$SYMM= 0
##$S_DEV= 0
##$TDeff= 0
##$TDoff= 0
##$TI= <>
##$TILT= no
##$TM1= 0
##$TM2= 0
##$TOPLEV= 0
##$USERP1= <user>
##$USERP2= <user>
##$USERP3= <user>
##$USERP4= <user>
##$USERP5= <user>
##$WDW= 1
##$XDIM= 8192
##$YMAX_p= 0
##$YMIN_p= 0
$$ End of Bruker specific parameters
$$ ---------------------------------
##NTUPLES= NMR FID
##VAR_NAME=  TIME,          FID/REAL,        FID/IMAG
##SYMBOL=    X,             R,               I
##VAR_TYPE=  INDEPENDENT,   DEPENDENT,       DEPENDENT
##VAR_FORM=  AFFN,          ASDF,            ASDF
##VAR_DIM=   8192,          8192,            8192
##UNITS=     SECONDS,       ARBITRARY UNITS, ARBITRARY UNITS
##FACTOR=    0.0002768,     1,               1
##FIRST=     0,             0,               0
##LAST=      2.2672688,     0,               0
##MIN=       0,             -225047,         0
##MAX=       2.2672688,     177430,          0
$$ Real data points
##PAGE= N=1
##DATA TABLE= (X++(R..R)), XYDATA
$$ plain form
0 0 0 0 0 0 0 0 0 0 0 0 0 0 0 0 0 -2 8 -8 8 -8 8 -11 16 -16 17 -24 24 -32 33 -40 46 -51 57 -65 74 -83 94 -104
38 -104 116 -129 143 -160 176 -195 215 -238 262 -289 318 -350 386 -425 470 -519 573 -637 709 -792
58 -792 889 -1006 1148 -1325 1556 -1861 2296 -2956 4072 -6320 12589 -68852 -225047 -52213
72 -52213 104698 70941 -8948 -8113 -4967 -15738 6021 36037 -92 -23941 10303 23306 -14920
85 -14920 -40181 -16884 34187 31600 -21055 -33366 -3045 6123 -3350 -1762 15920 15441 -783
98 -783 3834 -730 -27560 -3953 42947 27980 -12602 -17937 -11713 -19475 -6043 35767 21043 -45388
112 -45388 -36302 25998 21629 -14504 -5082 15409 3598 -15905 -1870 21461 10249 -3257 3954
125 3954 4458 -3896 -8744 -1973 8783 -7388 -21257 8724 25583 -8539 -34094 -13856 15117
$$ packed form
0@%%%%%%%%%%%%%%%kJ0j6J6j6J6j9K7l2L3m1M8n6O5p3Q6r7J08j22J39j57J77j98
38a04K20k45K72l03L36l71M10m53N00n51O07o68P36q11Q95r89J092j210J346j501
58g92J681j895K154k473K881l417M157n252P028j0392J8909q1441j56195J72834
72e2213J56911l3757p9889Q35L146j0771K1759L0016l6129k3849L4244J3003l8226
85a4920k5261K3297N1071k587n2655j2311L0321R168r473J588J7682m79j6224
98g83M617m564k6830K3607M6900j4967m0582n335O224p762J3432M1810j4724o6431
112d5388R086O2300m369l6133R422K0491j1811j9503J4035K3331j1212j3506P211
125C954N04q354m848O771J0756j6171j3869K9981J6859l4122k5555K0238K8973
$$ plain form
138 15117 14192 3261 10873 1681 -22845 -5320 25626 17875 -2469 -8086 -5955 -5994 -1050 14371
152 14371 10329 -14755 -17795 -5235 -1751 5626 5994 -8184 -8734 4761 14816 8432 -10062 -11409
166 -11409 3235 15183 18242 5491 -11612 -12079 -7625 706 15635 7612 -15319 -18098 -4718
179 -4718 4454 3345 3388 6284 -7754 -17806 4579 21369 9012 -4257 -6076 1615 8460 5173
193 5173 -1607 -8069 -8021 5377 9652 -1509 -9155 -14036 -9868 6561 11221 2247 -4354 -5989 -870
208 -870 3551 5487 9790 6021 -2175 -3008 -5492 -844 11963 7822 -6292 -10873 -8341 -1603 2804
223 2804 2887 428 -8280 -7340 6026 5798 -1458 275 1920 3303 6387 4748 1076 -4396 -5430 3574
239 3574 6060 1840 -961 -9278 -12646 -2676 5122 8698 3530 -11076 -13925 -1879 12094 16065
$$ packed form
138A5117r25j0931P612r192k4526J7525L0946p751k0344n617K131l9M944J5421
152A4371m042k5084l040J2560L484P377L68j4178n50J3495J0055o384j8494j347
166a1409J4644J1948L059j2751j7103m67M454Q331J4929q023k2931k779J3380
179d718R172j109M3K896j4038j0052K2385J6790j2357j3269j819P691O845l287
193E173o780o462M8J3398M275j1161p646m881M168J6429M660q974o601j635N119
208h70M421J936M303l769q196q33k484M648J2807m141j4114m581K532O738M407
223B804Q3k459q708R40J3366k28p256J733J645J383L084j639l672n472j034R004
239C574K486m220k801q317l368R970P798L576n168j4606k849J2046J3973L971
$$ plain form
253 16065 2010 -9629 -4914 2345 9016 11666 -869 -9752 -5031 1560 5976 873 -8631 -8839
267 -8839 -3547 4132 6943 -2948 -8011 -2973 139 6243 11083 4398 -3724 -7173 -1292 9788 9088
282 9088 1229 -4323 -9391 -5126 3835 3056 941 -3492 -9776 -5090 4071 5469 1336 -4192 -1453
297 -1453 4994 2698 2768 4619 -1183 -1832 2829 3049 2713 -1414 -5788 -4104 -2022 1349 3299 -3688
313 -3688 -5506 -3445 -3617 3080 8164 2754 -2250 -3401 -280 5514 5985 3814 880 -5394 -2946 3020
329 3020 1866 691 -2521 -8380 -4404 1806 3178 1080 -5016 -5574 300 4486 7754 3730 -6680
344 -6680 -4143 4883 7793 6964 -382 -7457 -6271 -873 6514 6818 -3864 -9463 -6515 -1662 5880
359 5880 4512 -3828 -5078 -1752 2521 7180 5174 278 -3529 -3063 5609 7763 -166 -3847 -3700 -2357
$$ packed form
253A6065j4055j1639M715P259O671K650j2535q883M721O591M416n103r504k08
267h839N292P679K811r891n063N038L112O104M840o685q122l449N881J1080p00
282I088p859n552n068M265Q961p79k115m433o284M686R161J398m133n528K739
297a453O447k296P0J851n802o49M661K20l36m127m374J684K082L371J950o987
313c688j818K061j72O697N084n410n004j151L121N794M71k171k934o274K448N966
329C020j154j175l212n859L976O210J372k098o096n58N874M186L268m024j0410
344f680K537R026K910q29p346p075J186N398P387L04j0682n599K948M853P542
359E880j368q340j250L326M273M659k006m896l807M66Q672K154p929l681J47J343
$$ plain form
375 -2357 3330 2583 -3425 -6552 -6685 -1522 5076 5105 1516 -4497 -7276 2074 7933 4437 2725 -461
391 -461 -2653 345 2528 3723 693 -4894 -4330 -1661 -976 1536 326 -3090 -1659 -2088 -2352 1131
407 1131 2917 1999 498 342 4533 4016 -448 -358 -1905 -2012 3316 3602 -682 -3538 -5992 -3525 815
424 815 1827 807 -4072 -5541 1158 4632 4853 3945 -2703 -5923 229 5664 7404 3194 -3283 -4223
440 -4223 -2933 367 4357 -1112 -6747 -4554 -445 3191 3883 -1767 -5244 -3464 1594 5922 4415
455 4415 333 -528 -1422 2227 6554 733 -5645 -4986 -1062 3676 3892 -987 -4886 -7238 -3494 2874
471 2874 3268 1279 -982 -4305 -162 6373 4888 281 -2190 -1978 776 2773 3877 2970 -3288 -5204
487 -5204 -1725 -1142 17 -272 -3165 -1759 1143 338 560 284 280 569 -862 2451 5197 1123 -15
$$ packed form
375b357N687p47o008l127j33N163O598K9l589o013k779R350N859l496j712l186
391d61k192K998K183J195l030n587N64K669O85K512j210l416J431m29k64L483
407A131J786r18j501j56M191n17m464R0j547j07N328K86m284k856k454K467M340
424H15J012j020m879j469O699L474K21r08o648l220O152N435J740m210o477r40
440d223J290L300L990n469n635K193M109L636O92n650l477J780N058M328j507
455D415m082q61q94L649M327n821o378O59L924M738K16m879l899k352L744O368
471B874L94j989k261l323M143O535j485m607k471K12K754J997J104r07o258j916
487e204L479N83J159k89k893J406K902q05K22k76mK89j431L313K746m074j138
$$ plain form
504 -15 527 -536 193 72 -1819 -2010 -1939 -896 1454 -205 -1411 -2831 -4947 -603 4664 3712 2863 -38
522 -38 -2687 -71 3165 5242 3086 -3510 -4788 -1147 1637 4658 1175 -5783 -6261 -2827 882 4242
538 4242 1422 -2663 -2504 -162 3867 4457 -768 -1726 -494 1254 5634 4090 -1851 -4354 -4135 187
554 187 3325 143 -2849 -4396 -3324 2017 3973 -153 -2283 -3733 -1044 5293 5952 1688 -1673 -3008
570 -3008 575 3284 1866 721 -2200 -4267 -434 1563 501 -860 -3660 -2976 -66 1292 1613 846
586 846 -697 781 873 765 3289 1710 -910 -547 -61 1426 1620 -1069 -1772 -2572 -3123 -77 1399 -163
604 -163 -694 -2792 -2216 2075 2427 1737 1373 -582 301 1650 2333 2802 -360 -2744 -904 325 1320 803
622 803 -2980 -3793 -1088 233 1771 590 -2446 -2533 -155 3215 4842 872 -2350 -926 498 3228
$$ packed form
504a5N42j063P29j21j891j91P1J043K350j659j206j420k116M344N267r52q49k901
522c8k649K616L236K077k156o596j278L641K784L021l483o958m78L434L709L360
538D242k820m085J59K342M029N90n225r58J232J748M380j544n941k503K19M322
554A87L138l182k992j547J072N341J956m126k130j450K689O337O59m264l361j335
570c008L583K709j418j145k921k067L833J997j062j361k800O84K910J358L21p67
586H46j543J478R2j08K524j579k620L63M86J487J94k689p03q00n51L046J476j562
604a63n31k098N76M291L52o90l64j955Q83J349O83M69l162k384J840J229R95n17
622H03l783q13K705J321J538j181l036q7K378L370J627l970l222J424J424K730
$$ plain form
638 3228 3466 -855 -3385 -2452 -411 2426 1229 -2402 -3821 -3809 75 3742 1041 -1560 -2095 -1382 2542
655 2542 4681 2802 -467 -2833 -931 3005 2827 643 -1632 -3510 -1163 1415 286 -969 -2607
670 -2607 -3289 -241 1473 1281 570 -1085 -379 1688 1638 2335 1901 -322 26 461 510 1288 -774 -1963
688 -1963 -1481 -1229 -86 331 -1369 -1073 -940 -683 953 1657 680 677 339 702 1688 1333 1195 775 -1905
707 -1905 -1119 444 424 862 -1436 -3208 -1565 -238 1280 907 -1193 -1871 -301 1365 3342 2324 -1313
724 -1313 -946 338 2525 3112 398 -2292 -2350 -1560 1461 2055 -1354 -3272 -2957 -802 2361 1687 -806
741 -806 -2263 -1948 1554 4029 1822 44 -1472 -932 2090 2839 641 -1338 -3097 -959 1436 727
757 727 -801 -1848 -3186 -262 1647 983 799 -1075 -875 1415 1840 1647 1211 -716 103 1195 103
$$ packed form
638C228K38m321k530R33K041K837j197l631j419J2L884L667k701k601n35P13L924
655B542K139j879l269k366J902L936j78k184k275j878K347K578j129j255j638
670b607o82L048J714j92p11j655P06K067n0O97m34k223L48M35M9P78k062j189
688a963M82K52J143M17j700K96J33K57J636P04r77ll38L63R86l55j38m20k680
707a905P86J563k0M38k298j772J643J327J518l73k100o78J570J666J977j018l637
724a313L67J284K187N87k714k690n8P90L021N94l409j918L15K155L163o74k493
741h06j457L15L502K475k207j778j516N40L022P49k198j979j759K138K395p09
757G27j528j047j338K924J909o64j84j874K00K290M25j93m36j927Q19J092j092
$$ plain form
774 103 695 35 -1764 -1212 -759 -411 636 -873 -1411 -790 -717 758 1315 -156 359 471 273 2129 1700
793 1700 602 -25 -1316 -486 447 455 168 -1059 -2909 -972 -254 107 1035 -542 -1610 -163 1147 2090
811 2090 1803 -409 -862 -1 777 2823 1164 -1161 -937 -1086 -336 1217 -778 -2148 -2102 -569 1843
828 1843 1324 -1064 -1512 -1345 397 3584 2331 172 -712 -1123 891 2450 1004 -881 -2881 -2268 1216
845 1216 1750 -150 -1234 -2755 -2189 895 1344 965 -181 -1336 863 1794 1366 991 -564 -955 1398
862 1398 1302 643 15 -1950 -1312 -621 -492 -199 -1236 -1764 -246 916 578 1065 -312 -852 475 266
880 266 1839 1751 729 130 -739 -756 585 56 -496 -161 -1395 -1265 -202 -120 541 -343 -1538 -823 274
899 274 1396 1862 745 34 349 -166 941 1413 -341 -1094 -566 142 904 -337 -2120 -1918 -1180 493
$$ packed form
774A03N92o60j799N52M53L48J047j509n38O21P3J475N57j471N15J12j98J856m29
793A700j098o27j291Q30R33Qk87j227j850J937P18L61R28j577j068J447J310R43
811B090k87k212m53Q61P78K046j659k325K24j49P50J553j995j370M6J533K412
828A843n19k388m48J67J742L187j253k159q84m11K014J559j446j885k000O13L484
845A216N34j900j084j521N66L084M49l79j146j155K199R31m28l75j555l91K353
862A398r6o59o28j965O38O91J29K93j037n28J518J162l38M87j377n40J327k09
880B66J573q8j022n99q69j7J341n29n52L35j234J30J063Q2O61q84j195P15J097
899B74J122M66j117p11L15n15J107M72j754p53N28P08P62j241j783K02P38J673
$$ plain form
917 493 1670 -181 -931 -655 -37 1966 2113 321 -972 -986 908 3169 1199 -976 -1854 -1834 -19 1396
935 1396 136 -826 -1886 -1536 831 1274 672 -261 -1516 -114 2073 1625 920 7 -693 405 630 348
953 348 304 -872 -1113 -189 4 -123 -299 -2263 -1186 449 666 670 74 -389 322 862 1236 1394 -72 -191
973 -191 78 92 976 454 -1189 -1304 -1045 -923 7 -171 -1 104 -1128 -321 813 545 1013 598 -280 507
993 507 522 797 1186 -168 -539 -853 -617 741 208 -1531 -1353 -823 75 813 229 -581 -330 -574 1135
1012 1135 1975 603 129 -463 -279 1850 1357 -276 -825 -1153 -116 580 138 -719 -1397 -2202 380 1505
1030 1505 628 -219 -1130 -633 1610 2013 980 -254 -1248 431 1420 756 658 -970 -2082 -485 897
1047 897 388 -282 -1569 -1530 32 592 1260 218 -956 124 322 841 1604 692 -473 196 167 455 -269
$$ packed form
917D93J177j851p50K76O18K003J47j792j293j4J894K261j970k175q78K0J815J415
935A396j260r62j060L50K367M43o02r33j255J402K187m48p05r13p00J098K25k82
953C48m4j176k41R24J93j27j76j964J077J635K17Mn96m63P11N40L74J58j466j19
973a91K69J4Q84n22j643j15K59J22R30j78J70J05j232Q07J134k68M68m15q78P87
993E07J5K75L89j354l71l14K36J358n33j739J78N30Q98P38n84q10K51k44J709
1012A135Q40j372m74n92J84K129m93j633n49l28J037O96m42q57o78q05K582J125
1030A505q77q47r11M97K243M03j033j234r94J679R89o64r8j628j112J597J382
1047H97n09o70j287L9J562N60O68j042j174J080J98N19P63r12j165O69k9K88p24
$$ plain form
1066 -269 -1040 -478 -155 -797 -185 -625 -942 248 -229 -508 340 593 461 608 60 524 529 -56 1051 381
1086 381 -804 -112 -546 -149 781 -607 -1419 -778 -252 679 160 -481 -196 -50 657 1509 997 -487 -374
1105 -374 -359 1453 1467 181 -983 -1233 -445 566 -471 -973 -663 -1509 -456 1217 826 -274 -987 -953
1123 -953 979 1726 1356 447 -700 -356 981 756 318 204 -1160 -971 586 407 -66 -1352 -1309 -51
1141 -51 57 211 660 -406 -313 719 567 643 456 -341 -150 637 530 526 -879 -1087 -345 -356 64 322 -790
1162 -790 -586 -14 301 663 470 223 120 -72 439 1002 496 508 308 -656 -479 22 -124 -13 -305 -655
1182 -655 -553 -405 423 582 -341 -251 26 100 678 1131 150 -64 -271 131 1093 304 -368 -683 -578 490
1202 490 464 -817 -620 -788 -718 458 856 300 -569 -1054 478 1366 806 524 -186 -678 667 879 470
$$ packed form
1066b69p71N62L23o42O12m40l17J190m77k79Q48K53j32J47n48M64Nn85J107o70
1086C81j185O92m34L97R30j388q12O41N26R31n19o41K85J46P07Q52n12j484J13
1105c74J5J812J4j286j164k50P88J011j037n02L10q46J053J673l91j100p13L4
1123i53J932P47l70r09j147L44J337k25m38j14j364J89J557j79m73j286M3J258
1141e1J08J54M49j066R3J032j52P6j87p97J91P87j07mj405k08P42j1M20K58j112
1162g90K04N72L15L62j93k47j03j92N11N63n06J2k00r64J77N01j46J11k92l50
1182f55J02J48Q28J59r23R0K77P4N78M53r81k14k07M02R62p89o72l15J05J068
1202D90k6j281J97j68P0J176L98n56q69m85J532Q88n60k82p10m92J345K12m09
$$ plain form
1221 470 -85 -973 -992 -250 383 74 -1081 -1690 -288 522 300 83 -245 -439 628 885 754 590 -817
1240 -817 -614 292 687 834 -413 -1217 -275 -321 -221 -83 -244 -921 54 71 377 288 82 152 281 152 667
1261 667 545 300 383 66 -363 56 -476 -352 72 -503 -309 -366 76 378 -231 -508 183 346 592 871 522
1282 522 -90 -64 -170 736 280 -343 -209 -346 191 572 -534 -913 -550 -396 184 506 307 -280 -962 -27
1302 -27 1144 1074 43 -36 -405 519 896 346 180 -370 -792 -158 -65 107 -5 -1285 -673 506 281 -29
1322 -29 -429 -656 484 848 654 606 -193 -474 177 560 841 -60 -1201 -548 388 -65 50 -589 -928 -402
1342 -402 -275 290 318 -56 -105 249 407 465 304 -98 309 201 86 25 77 -114 -152 -528 -398 12 -484 -94
1364 -94 108 -215 491 109 138 390 277 116 346 315 340 236 -597 -101 -526 32 130 -129 -325 -116 -819 -505
$$ packed form
1221D70n55q88j9P42O33l09j155o09J402Q10k22k17l28j94J067K57j31j64j407
1240h17K03R06L95J47j247q04R42m6J00J38j61o77R75J7L06q9k06P0J29j29N15
1261F67j22k45Q3l17m29M19n32J24M24n75J94n7M42L02o09k77O91J63K46K79l49
1282E22o12K6j06R06m56o23J34j37N37L81j106l79L63J54N80L22j99n87o82R35
1302b7J171p0j031p9l69R24L77n50j66n50m22O34R3J72j12j280O12J179k25l10
1322b9m00k27J140L64j94m8p99k81O51L83K81r01j141O53R36m53J15o39l39N26
1342d02J27N65K8l74m9L54J58N8j61m02M07j08j15o1N2j91l8l76J30M10m96L90
1364i4K02l23P06l82K9K52j13j61K30l1K5j04q33M96m25N58R8k59j96K09p03L14
$$ plain form
1386 -505 237 -237 52 -379 118 614 967 486 49 -307 -187 543 738 -9 -253 -497 -193 269 252 -545
1406 -545 -966 -859 269 514 -36 -48 -419 -107 441 344 670 -58 -291 262 70 385 525 -692 -841 187
1426 187 14 123 -456 -746 -216 -79 123 666 -65 -522 63 362 477 358 -330 -121 246 177 151 -51 -285
1447 -285 10 -505 -431 255 -242 -369 -359 -221 56 -8 -16 441 649 253 10 101 246 671 -201 -133 -39 -177 -367
1470 -367 300 -226 -143 -392 -469 128 -6 90 -298 -222 293 720 -176 -62 -133 -163 542 883 199 -229 -187 -313
1492 -313 -11 5 -246 -534 -961 -32 546 167 -196 -634 -167 615 422 1008 190 -487 12 145 519 354
1512 354 -21 -726 -37 381 177 -108 -566 -194 365 139 250 323 -350 -260 216 504 464 -64 -613 72 521
1533 521 115 65 -197 -283 -272 -423 67 152 -424 36 -98 162 140 -107 36 313 487 250 289 112 236 8
$$ packed form
1386e05P42m74K89m31M97M96L53m81m37l56J20P30J95p47k44k44L04M62j7p97
1406e45m21J07J128K45n50j2l71L12N48r7L26p28k33N53j92L15J40j217j49J028
1426A87j73J09n79k90N30J37K02N43p31m57N85K99J15j19o88K09L67o9k6k02k34
1447b85K95n15P4O86m97j27J0J38K77o4qM57K08l96k43R1J45M25q72O8R4j38j90
1470c67O67n26Q3k49p7N97j34R6l88P6N15M27q96J14p1l0P05L41o84m28M2j26
1492c13L02J6k51k88m27R29N78l79l63m38M67P82j93N86q18o77M99J33L74j65
1512C54l75p05O89M18k04k85m58L72N59k26J11P3o73R0M76K88m0n28n49O85M49
1533E21m06n0k62q6J1j51M90Q5n76M60j34K60k2k47J43K77J74k37L9j77J24k28
$$ plain form
1555 8 -314 162 176 -243 -286 -92 119 -85 -359 -88 -25 41 -175 -281 6 642 493 156 311 -21 120 355
1577 355 118 85 -382 -286 337 -68 1 -427 -629 -382 240 250 308 34 -203 -65 293 381 189 64 -70 391
1599 391 208 356 -195 -314 -148 336 94 -115 -551 -501 340 228 277 169 -353 -227 91 396 508 199 -342
1620 -342 -348 350 630 486 -314 -311 122 -399 -174 -46 -154 -335 -565 137 437 -6 36 209 -134 6 120 96
1642 96 54 450 -426 52 -230 -61 -225 -188 192 -171 -326 -266 354 -415 198 71 -16 375 379 57 290 -124
1664 -124 44 189 27 39 64 -392 -55 244 -180 -421 -140 -305 38 -43 -11 121 -38 3 466 328 13 75
1686 75 17 220 423 323 78 -374 -492 -158 127 114 -182 -756 -111 442 92 234 -81 -235 -95 341 499
1707 499 367 -346 -205 172 283 -11 95 -436 -49 -101 22 85 -145 -196 -198 59 439 314 -252 108 299 343
$$ packed form
1555Hl22M76J4m19m3J94K11k04k74K71O3O6k16j06K87O36j49l37J55l32J41K35
1577C55k37l3m67R6O23m05O9m28k02K47O22J0N8k74k37J38L58Q8j92j25j34M61
1599C91j83J48n51j19J66M84k42k09m36N0Q41j12M9j08n22J26L18L05J12l09n41
1620c42oO98K80j44q00LM33n21K25J28j08j81k30P02L00m43M2J73l43J40J14k4
1642I6m2L96q76M78k82J69j64L7L80l63j55O0O20p69O13j27q7L91Ml22K33m14
1664a24J68J45j62J2K5m56L37K99m24k41K81j65L43q1L2J32j59M1M63j38l15O2
1686G5n8K03K03j00k45m52j18L34K85j3k96n74O45N53l50J42l15j54J40M36J58
1707D99j32p13J41L77J11k94J06n31L87n2J23O3k30n1kK57L80j25n66L60J91M4
$$ plain form
1729 343 255 -53 75 86 11 -1 78 -310 28 -266 42 -133 102 -440 -174 -24 -2 -43 318 170 54 71 105
1752 105 175 86 362 187 -163 -134 -398 -121 243 90 -115 -321 -325 45 -48 -198 98 -127 -562 294 166 121
1774 121 49 -388 -115 294 139 253 -77 -201 -137 28 8 -43 -403 -394 -118 0 104 -135 100 178 107 185 412
1797 412 -44 -76 8 372 143 -97 -546 -104 -96 -269 -153 -237 132 -310 -267 -215 272 -394 -34 147 87 327 88
1820 88 -386 214 27 80 242 55 35 142 -286 91 -172 -295 -53 -98 48 264 -174 -96 203 -124 105 210
1842 210 -68 -51 8 -113 227 71 -140 -28 221 -74 -281 -408 -333 148 -115 -24 -203 -76 -139 50 164 42
1864 42 35 193 278 -45 31 8 -294 -60 -235 26 -24 -337 -216 -266 -143 86 9 28 -238 463 219 82 148 116
1888 116 -238 69 0 259 27 -266 -87 70 -3 -372 -130 -404 -107 -99 147 -180 -242 -51 -53 214 276 8 -80
$$ packed form
1729C43q8l08J28J1p5j2P9l88L38k94L08j75K35n42K66J50K2m1L61j48j16J7L4
1752A05P0q9K76j75l50K9k64K77L64j53k05k06mL70r3j50K96k25m35Q56j28m5
1774A21p2m37K73M09j55J14l30j24O4J65k0n1l60RK76J18J04k39K35P8p1P8K27
1797D12m56l2Q4L64k29k40m49M42Qj73J16q4L69m42M3N2M87o66L60J81o0K40k39
1820H8m74O00j87N3J62j87k0J07m28L77k63j23K42m5J46K16m38P8K99l27K29J05
1842B10k78J7N9j21L40j56k11J12K49k95k07j27P5M81k63R1j79J27o3J89J14j22
1864D2pJ58Q5l23P6k3l02K34j75K61n0l13J21n0J23K29p7J9k66P01k44j37O6l2
1888A16l54L07o9K59k32k93J79J57p3l69K42k74K97QK46l27o2J91kK67O2k68q8
$$ plain form
1911 -80 299 -54 124 -71 -17 -80 25 -176 57 -558 -196 -228 -184 223 -67 -115 255 -151 -77 183 80 69 -24
1934 -24 120 80 41 83 266 -42 93 -142 28 -419 60 -119 81 82 -99 -205 65 -146 265 224 -131 -140 81
1957 81 214 274 -278 -202 107 77 -142 -400 -233 276 119 66 -117 -381 -113 119 119 102 168 -247 114 148 292
1980 292 3 -52 -39 -345 -329 61 141 -202 -176 296 -39 79 173 -223 -175 10 279 398 -159 -76 83 178 333
2003 333 296 -464 -139 -190 -44 -26 -168 -328 -178 -21 351 287 -28 55 94 -116 238 229 60 325 220 -10 -87
2026 -87 214 -123 -28 -85 -161 93 -23 52 -205 -336 -24 -122 169 -18 -115 58 177 170 205 182 123 156 63 -251 41
2051 41 -216 -310 223 -172 -89 5 -233 202 159 -17 77 93 71 -149 125 3 116 167 97 -91 9 -144 -136 11
2075 11 -135 -193 -112 -4 -65 5 113 -259 239 225 126 95 -23 -132 -68 261 -137 159 -329 -261 -167 -5 -127 -369
$$ packed form
1911h0L79l53J78j95N4o3J05k01K33o15L62l2M4M07k90m8L70m06P4K60j03j1r3
1934b4J44m0l9M2J83l08J35k35J70m47M79j79K00Jj81j06K70k11M11m1l55rK21
1957H1J33O0n52P6L09l0k19k58J67N09j57n3j83k64K68K32%j7O6m15L61L4J44
1980B92k89n5J3l06J6L90Q0l43K6M72l35J18R4l96M8J85K69J19n57Q3J59R5J55
2003C33l7p60L25n1J46J8j42j60J50J57L72o4l15Q3L9k10L54rj69K65j05k30p7
2026h7L01l37R5n7p6K54j16P5k57j31L12r8K91j87r7J73J19pL5k3n9L3r3l14K92
2051D1k57r4N33l95Q3R4k38M35m3j76R4J6k2k20K74j22J13N1p0j88J00j53QJ47
2075A1j46n8Q1J08o1P0J08l72M98j4r9l1j18j09O4L29l98K96m88O8R4J62j22k42
$$ plain form
2099 -369 76 -183 -153 77 368 27 31 -106 5 210 -86 -176 -99 221 0 327 20 27 22 62 123 67 15 -7 48
2124 48 82 64 200 -303 -399 -4 236 -87 99 -31 42 222 57 -58 -134 105 -140 -90 118 -120 -312 -52
2146 -52 11 38 50 187 199 -57 -57 -57 -145 -54 109 33 226 74 -26 -305 -84 -87 467 -8 -264 -53 -37 83 66
2171 66 134 -226 87 276 107 144 -68 91 -72 -102 313 309 -255 -205 80 70 234 225 -168 -310 42 180 -133
2194 -133 -132 -35 138 -16 -176 34 -159 212 -95 236 -141 -266 -59 -116 -80 172 -14 -204 -62 95 -138 68
2216 68 -31 83 -57 69 -54 467 101 258 -17 116 185 190 -184 -77 104 32 99 87 -78 40 -69 -121 192
2239 192 -46 -27 -113 173 -121 136 149 191 -2 74 158 -341 -85 -120 184 29 90 61 -3 -77 -27 19 -23 -49 68
2264 68 372 149 -242 21 -7 -80 181 -275 -190 -22 -122 -189 -90 -94 -100 -306 -10 -80 331 -135 -320 78 101 200
$$ packed form
2099c69M45k59L0K30K91l41Mj37J11K05k96r0P7L20k21L27l07PnM0O1n6n2k2N5
2124D8L4j8J36n03r6L95K40l23J86j30P3J80j65j15p6K39k45N0K08k38j92K60
2146e2O3K7J2J37J2k56%%q8R1J63p6J93j52j00k79K21lN54m75k56K11J6J20j7
2171F6O8l60L13J89j69L7k12J59j63l0M15mn64N0K85j0J64rl93j42L52J38l13
2194a33JR7J73j54j60K10j93L71l07L31l77j25K07n7L6K52j86j90J42J57k33K06
2216F8r9J14j40J26j23N21l66J57k75J33O9Nl74J07J81p2O7j2j65J18j09n2L13
2239A92k38J9q6K86k94K57J3M2j93P6Q4m99K56l5L04j55O1k9o4p4N0M6m2k6J17
2264F8L04k23l91K63k8p3K61m56Q5J68j00o7R9mok06K96p0M11m66j85L98K3R9
$$ plain form
2288 200 1 109 41 215 -2 -83 42 -84 2 -172 41 25 -113 -164 10 80 -253 -99 -63 14 19 -64 16 -58
2312 -58 -34 -170 246 162 -89 -151 -49 -29 90 74 -179 -136 93 -23 -113 -201 -223 -119 -55 57 371 -236 -77 -114
2336 -114 0 83 148 -269 -33 50 -123 8 -215 -131 -251 175 70 41 -161 -43 -94 62 155 53 13 76 288
2359 288 -8 114 58 -132 128 251 -254 56 142 16 -116 -161 -92 -75 184 67 98 331 -53 -87 466 -137
2381 -137 -94 28 -101 73 -329 24 -184 90 -71 -100 -53 -95 -134 2 -156 -41 -13 -207 7 213 125 -35
2403 -35 -21 -75 24 -61 42 -110 26 -129 -27 39 -60 142 -185 -54 116 31 351 364 202 -99 20 196 -110
2426 -110 -197 123 89 154 -54 32 -120 -137 101 279 251 163 96 145 33 289 24 52 153 -145 -208 73 -119 -256
2450 -256 10 -125 53 23 216 358 -61 -11 336 -105 205 132 -121 -322 -175 -84 164 -15 31 202 89 -84
$$ packed form
2288B00j99J08o8J74k17q1J25j26Q6j74K13j6j38n1J74P0l33J54L6P7Nq3Q0p4
2312e8K4j36M16q4k51o2J02K0J19j6k53M3K29j16r0q8k2J04O4J12L14o07J59l7
2336a14J14Q3O5m17K36Q3j73J31k23Q4j20M26j05k9k02J18n1J56R3j02m0O3K12
2359B88k96J22n6j90K60J23n05L10Q6j26j32m5O9J7K59j17L1K33l84l4N53o03
2381a37M3J22j29J74m02L53k08K74j61k9M7m2l9J36j58J15K8j94K14K06q8j60
2403c5J4n4R9q5J03j52J36j55J02O6r9K02l27J31J70q5L20J3j62l01J19J76l06
2426a10q7L20l4O5k08Q6j52j7K38J78k8q8o7M9j12K56k65K8J01k98o3K81j92j37
2450b56K66j35J78l0J93J42m19N0L47m41L10p3k53k01J47R1K48j79M6J71j13j73
$$ plain form
2472 -84 86 -59 -88 -43 318 -95 -172 -160 56 111 -278 177 -98 -98 -84 -82 -147 -23 129 101 -184 196 309 -55
2496 -55 -92 -95 16 -10 -206 -285 -59 66 185 145 188 -198 52 -26 395 306 -1 -186 31 158 -22 -168 -189 -11
2520 -11 57 327 209 -28 64 11 384 42 9 -49 42 15 -78 -13 199 177 123 47 79 88 -145 -118 -7 -253 -53 -86
2546 -86 106 -243 -223 111 103 -80 -62 -205 26 -31 -83 10 179 128 124 -193 87 21 54 61 64 -92 124 34 72 -155
2572 -155 -117 67 3 -273 91 13 338 65 56 -31 229 128 390 77 -63 -72 244 187 1 -199 -22 -117 66
2595 66 -115 243 282 -114 55 288 -206 179 -98 -28 -43 -59 65 19 -144 59 -77 -51 -82 -137 -64 10 258 -280
2619 -280 22 -81 151 63 181 121 284 96 48 14 -215 34 -113 123 249 -138 -33 -93 0 -110 88 -63
2641 -63 -103 -104 -192 -82 -59 107 -5 203 -86 216 111 -9 168 -117 -295 107 97 -268 124 -173 179 42
$$ packed form
2472h4J70j45k9M5L61m13p7J2K16N5l89M55k75%J4Ko5J24J52k8k85L80J13l64
2496e5l7lJ11k6j96p9K26J25J19m0M3l86K50p8M21q9l07j85K17J27j80j46k1J78
2520a1O8K70j18k37R2n3L73l42l3n8R1k7r3O5K12k2n4p6L2Rk33K7J11k46K00l3
2546h6J92l49K0L34qj83J8j43K31n7n2R3J69n1ml17K80o6L3PLj56K16r0L8k27
2572a55L8J84o4k76L64p8L25k73rq7K60j01K62l13j40rL16n7j86k00J77r5J83
2595F6j81L58L9l96J69K33m94L85k77P0j5j6J24m6j63K03j36K6l1n5P3P4K48n38
2619b80L02j03K32q8J18o0J63j88m8l4k29K49j47K36J26l87J05o0R3j10J98j51
2641f3m0jq8J10K3J66j12K08k89L02j05j20J77k85j78M02j0l65L92k97L52j37
$$ plain form
2663 42 -330 24 -67 -13 56 94 -23 59 -40 123 56 72 70 104 -2 175 -55 176 18 -99 41 -130 -88 231
2687 231 -21 -35 -23 27 54 86 55 -81 -261 133 135 -187 37 -1 268 -102 -16 -62 -129 -81 -82 27 -150 -49 23
2712 23 340 -89 118 -102 -35 -25 -168 -101 77 -130 57 98 -26 -43 -7 -112 47 -53 -75 7 163 1 203
2735 203 66 -10 131 -20 33 -230 -294 -100 67 51 133 -139 200 14 117 -101 -35 -13 -24 -45 234 -68 55
2758 55 235 -217 -103 -181 -71 -194 -324 85 -129 -21 -35 33 -12 -102 72 -11 417 -27 150 34 286 165
2780 165 -61 106 -107 46 176 0 173 -118 -201 -350 -64 -72 -112 -162 -162 -262 -27 -38 49 27 198 -22 -43 82
2804 82 -124 88 140 46 223 -171 -200 141 -81 1 78 -53 165 55 12 15 42 129 -97 -252 -86 81 -44 22
2828 22 -82 -159 -124 123 126 -13 56 51 -220 -81 115 54 98 -209 -153 -143 315 -40 -190 -38 -290 -16 -297 66
$$ packed form
2663D2l72L54r1N4O9L8j17Q2r9J63o7J6kL4j06J77k30K31j58j17J40j71M2L19
2687B31k52j4J2N0K7L2l1j36j80L94Kl22K24l8K69l70Q6m6o7M8jJ09j77J01P2
2712B3L17m29K07k20O7J0j43O7J78k07J87M1j24j7L6j05J59j00k2Q2J56j62K02
2735B03j37p6J41j51N3k63o4J94J67j6Q2k72L39j86J03k18O6K2j1k1K79l02J23
2758E5J80m52J14p8J10j23j30M09k14J08j4O8m5r0J74q3M28m44J77j16K52j21
2780A65k26J67k13J53J30j76J73k91q3j49K86qm0n0%j00K35j1Q7k2J71k20k1J25
2804H2k06K12N2r4J77l94k9L41k22Q2P7j31K18j10m3LK7Q7k26j55J66J67j25O6
2828B2j04p7L5K47Lj39O9nk71J39J96o1M4l07N6J0M58l55j50J52k52K74k81L63
$$ plain form
2852 66 170 -33 -35 -193 121 171 35 83 20 -11 154 70 -150 206 -144 -150 36 -85 87 249 -17 -162 -81 -239
2876 -239 195 29 -122 -55 -57 64 -41 -180 144 136 -22 8 18 -304 -55 -164 -148 -2 -220 -336 -96 104 14
2899 14 103 -136 96 48 183 -103 -51 -11 -15 100 -168 -121 -74 94 -58 -12 213 -29 12 53 -261 -56 -130 -28
2923 -28 -197 62 245 251 263 47 -256 165 -14 -125 285 -30 -178 0 69 -19 -92 -198 -109 214 11 202 238
2946 238 -66 276 -134 4 290 149 -1 -159 -304 -40 -55 133 -1 -176 58 239 102 -91 35 212
2966 212 -75 31 102 -37 41 88 142 -35 175 133 -161 151 -147 54 -16 -70 -48 103 312 -174 -201 5 15
2989 15 287 -20 -138 8 24 -135 -33 -155 79 30 218 -156 -2 85 15 142 214 92 130 36 90 41 145
3012 145 -47 165 -76 47 -127 61 -140 20 168 -11 17 -72 155 -42 287 75 130 -120 89 256 -73
$$ packed form
2852F6J04k03kj58L14N0j36M8o3l1J65q4k20L56l50oJ86j21J72J62k66j45Q1j58
2876b39M34j66j51O7kJ21j05j39L24qj58L0J0l22K49j09J6J46k18j16K40K00r0
2899A4Q9k39K32m8J35k86N2M0mJ15k68M7M7J68j52M6K25k42M1M1l14K05p4J02
2923b8j69K59J83OJ2k16l03M21j79j11M10l15j48J78O9q8p3j06Q9L23k03J91L6
2946B38l04L42m10J38K86j41j50j58j45K64j5J88j34j75K34J81j37j93J26J77
2966B12k87J06P1j39P8M7N4j77K10m2k94L12k98K01p0n4K2J51K09m86k7K06J0
2989A5K72l07j18J46J6j59J02j22K34m9J88l74J54Q7p0J27P2j22L8r4N4m9J04
3012A45j92K12k41J23j74J88k01J60J48j79K8q9K27j97L29k12N5k50K09J67l29
$$ plain form
3033 -73 -136 -130 -34 -21 -33 -175 120 -31 -277 -4 32 19 -8 45 -1 121 -31 36 -121 173 -68 -180 56 319
3057 319 -21 339 142 28 -152 -120 -23 -90 62 -27 -221 -160 -115 171 30 188 111 6 -11 -59 106 -279 67
3080 67 -153 -169 182 29 53 -125 -108 5 -192 -68 -234 -64 -291 99 63 172 55 100 -88 -91 125 -71 23
3103 23 81 218 38 -73 45 65 13 -140 120 -360 167 -44 -127 -49 -73 -128 -354 -5 -278 -89 18 -200 -87
3126 -87 -145 149 -165 158 107 -160 34 -142 -7 47 26 -119 153 -66 72 114 -1 62 -62 33 -195 65 154
3149 154 -173 -312 147 184 -70 -175 -98 -194 -175 123 -24 -84 -167 13 -31 -116 160 87 192 -210 -64 113 -34
3172 -34 56 319 -42 49 105 -79 114 -7 108 102 44 116 256 171 -52 -173 39 -203 -247 -36 -14 125 -77 -165
3196 -165 -54 -40 75 -44 45 45 149 -19 124 83 66 -107 -284 158 256 41 180 -130 -75 -61 -292 118 165
$$ packed form
3033g3o3OR6J3j2j42K95j51k46K73L6j3k7N3m6J22j52O7j57K94k41j12K36K63
3057C19l40L60j97j14j80L2R7o7J52q9j94O1M5K86j41J58p7j05j7m8J65l85L46
3080F7k20j6L51j53K4j78J7J13j97J24j66J70k27L90l6J09j17M5j88lK16j96R4
3103B3N8J37j80j11J18K0n2j53K60m80N27k11q3P8k4n5k26L49k73J89J07k18J13
3126h7n8K94l14L23n1k67J94j76J35N4k1j45K72k19J38M2j15O3j24R5k28K60Q9
3149A54l27j39M59L7k54j05P7r6J9K98j47o0q3J80m4q5K76p3J05m02J46J77j47
3172c4R0K63l61R1N6j84J93j21J15on8P2J40q5k23j21K12k42m4K11K2J39k02q8
3196a65J11J4J15j19Q9%J04j68J43m1j7j73j77M42R8k15J39l10N5J4k31M10M7
$$ plain form
3219 165 -124 25 138 -115 0 -63 48 64 31 147 -23 146 57 195 212 -258 69 -197 -189 -132 -111 1 -161
3242 -161 68 -219 222 -6 -171 -153 -94 19 4 -16 93 -133 -278 188 -288 27 -355 84 6 135 220 -34
3264 -34 23 102 331 2 -214 22 4 213 -15 62 17 -37 -81 155 -78 -300 10 -228 23 -97 279 118 133
3287 133 82 -168 169 -123 53 78 7 -130 -127 116 -293 105 40 -57 199 172 -124 209 -116 77 308 55 122
3310 122 149 -76 19 173 33 46 -47 37 92 102 40 -44 -129 106 -18 -119 -5 3 -251 41 124 -7 87 23 126
3335 126 257 87 109 -155 103 74 -55 105 6 -140 40 -156 43 -142 -33 6 -25 -161 -141 117 -29 -191
3357 -191 -23 -179 -20 83 226 -205 63 -6 -2 -52 23 -59 29 -7 -68 -61 -190 -12 48 46 14 91 -304 209 -293
3382 -293 -420 -19 -193 87 -218 -269 128 -171 199 144 -256 -4 4 203 50 72 42 80 204 126 -18 -189 -95
$$ packed form
3219A65k89J49J13k53J15o3J11J6l3J16j70J69q9J38J7m70L27k66QN7K1J12j62
3242a61K29k87M41k28j65J8N9J13j5k0J09k26j45M66m76L15l82M39p8J29Q5k54
3264c4N7P9K29l29k16K36j8K09k28P7m5n4m4K36k33k22L10k38K51j20L76j61J5
3287A33n1k50L37k92J76K5p1j37LK43m09L98o5r7K56k7k96L33l25J93K31k53O7
3310A22K7k25R5J54j40J3r3Q4N5J0o2q4q5K35j24j01J14Qk54K92Q3j31R4o4J03
3335A26J31j70K2k64K58k9j29J60r9j46J80j96J99j85J09L9l1j36K0K58j46j62
3357a91J68j56J59J03J43m31K68o9Mn0P5q2Q8l6o1Pj29J78O0kl2P7l95N13n02
3382b93j27M01j74K80l05n1L97k99L70n5m00K52QJ99j53K2l0L8J24p8j44j71R4
$$ plain form
3405 -95 14 116 -112 -66 84 128 -179 -186 -32 -113 -59 -16 -174 88 -26 173 -235 -162 -133 -262 -213 -196 -181 -53
3429 -53 7 103 -62 217 52 -122 78 112 -276 136 130 -34 -229 -53 -47 -105 -24 -110 121 119 -207 -229 58 18 208
3454 208 -146 160 -324 -29 -173 127 -94 -208 -112 -59 -28 32 -167 22 46 315 196 -135 84 -28 46 -28
3476 -28 33 5 -97 137 18 -124 -14 279 41 -26 163 -195 -38 -293 236 -54 1 -149 127 180 -46 -10
3498 -10 48 61 -133 42 -58 -10 -48 39 50 261 -16 302 -365 68 85 -12 -333 -131 -273 5 -16 -31 -138 -237
3522 -237 -153 -201 -9 -138 32 -82 -88 -48 -10 -266 -154 -34 390 -2 -171 -69 55 17 -286 -28 -86 -146 -255
3545 -255 -225 5 -90 -39 -82 109 214 -234 -89 367 52 180 386 -51 32 61 -49 205 67 -11 -96 -62 -23
3568 -23 68 88 -25 -97 -41 -2 100 195 -153 -174 154 111 -111 -89 -136 -330 106 5 -30 21 -42 196 65 227 183
$$ packed form
3405i5J09J02k28M6J50M4l07pJ54q1N4M3j58K62j14J99m08P3K9j29M9J7J5J28
3429e3O0R6j65K79j65j74K00L4l88M12oj64j95J76On8Q1q6K31kl26k2K87m0J90
3454B08l54L06m84K95j44L00k21j14R6N3L1O0j99J89K4K69j19l31K19j12P4p4
3476b8O1k8j02K34j19j42J10K93k38o7J89l58J57k55N29k90N5j50K76N3k26L6
3498a0N8J3j94J75j00M8l8Q7J1K11k77L18o67M33J7r7l21K02j42K78k1j5j07r9
3522b37Q4m8J92j29J70j14oM0L8k56J12J20M24l92j69J02J24l8l03K58n8o0j09
3545b55L0K30r5N1m3J91J05m48J45M56l15J28K06m37Q3K9j10K54j38p8q5L4L9
3568b3R1K0j13p2N6L9J02R5l48k1L28m3k22K2m7j94M36j01l5N1o3K38j31J62m4
$$ plain form
3593 183 188 88 84 2 -247 189 -18 -36 13 -83 101 -20 -39 60 119 -62 -48 112 -5 -91 103 -63 -33 31 -153
3618 -153 233 -365 -112 187 88 170 -118 49 -2 -208 -91 -69 172 -95 53 0 -260 -85 109 -126 -146 161
3640 161 -171 106 205 73 72 -42 -141 166 -62 -86 -297 76 -202 147 113 157 -129 120 -119 -202 -87 -111 -46
3663 -46 -69 -172 -6 -155 15 24 53 131 157 5 136 96 -165 59 40 -106 48 -82 -23 186 11 -189 167
3686 167 -12 199 17 163 1 82 42 215 153 -64 -114 78 183 165 -183 23 91 13 312 209 156 155 -341
3709 -341 135 -79 -140 -75 217 -77 90 262 -90 -29 106 8 -76 57 83 -28 245 236 -152 54 31 17 39 156
3733 156 81 65 256 -100 123 -240 -102 -170 -234 8 158 144 378 49 250 -12 -170 88 66 323 341 17
3755 17 148 205 241 -82 -63 -196 -39 -62 122 79 29 -76 -110 19 124 137 40 -88 -74 -110 -208 -73 -56 -73 86
$$ packed form
3593A83Nj00mq2k49M36k07j8M9r6J84j21j9R9N9j81J4J60j17q6J94j66L0O4j84
3618a53L86n98K53K99r9Q2k88J67n1k06J17K2K41k67J48n3k60J75J94k35k0L07
3640A61l32K77R9j32jj14r9L07k28k4k11L73k78L49l4M4k86K49k39q3J15k4O5
3663d6k3j03J66j49J70RK9P8K6j52J31m0k61K24j9j46J54j30N9K09j75k00L56
3686A67j79K11j82J46j62Q1m0J73o2k17n0J92J05j8l48K06O8p8K99j03n3jm96
3709c41M76k14o1O5K92k94J67J72l52O1J35r8q4J33K6j11K73rl88K06k3j4K2J17
3733A56p5j6J91l56K23l63J38o8o4K42J50j4K34l29K01k62j58K58k2K57J8l24
3755A7J31N7L6l23J9j33J57k3J84m3n0j05l4J29J05J3r7j28J4l6r8J35J7j7J59
$$ plain form
3780 86 -179 -138 7 -111 140 -218 -168 0 -304 108 10 103 32 112 280 -261 74 -24 72 -76 -287 -163 -203
3803 -203 93 210 -39 164 -211 95 -91 -109 -48 -65 -242 -122 -228 -158 269 219 -291 16 188 132 77 133 -196
3826 -196 -188 -100 37 -113 85 -258 -157 -29 52 164 139 -22 73 58 -109 -70 22 -15 177 -157 -5 -228 52
3849 52 125 490 85 -72 -18 -69 45 34 -35 5 188 33 232 67 317 -73 -69 52 -108 -70 -211 261 -8
3872 -8 -144 32 -62 -172 -26 387 122 149 -193 -217 372 -93 -248 281 -110 40 23 -167 -125 10 108 167 27
3895 27 145 -10 49 -54 113 -20 153 13 -93 -265 81 288 23 -30 -29 -95 309 195 207 -166 -2 217
3917 217 36 -139 -133 80 -156 -48 -45 -17 -103 -103 60 21 -28 44 -9 60 -50 93 -229 98 264 218 -116 114 77
3942 77 85 -311 5 293 -187 35 42 112 -249 -157 -227 -174 -3 -116 -122 -143 -76 13 24 -293 -218 -237 -260 272 133 -88
$$ packed form
3780H6k65M1J45j18K51l58N0J68l04M12r8R3p1Q0J68n41L35r8R6j48k11J24m0
3803b03K96J17k49K03l75L06j86j8O1j7j77J20j06P0M27n0n10L07J72n6n5N6l29
3826a96QQ8J37j50J98l43J01J28Q1J12k5j61R5j5j67L9R2l7J92l34J52k23K80
3849E2P3L65m05j57N4n1J14j1o9M0J83j55J99j65K50l90MJ21j60L8j41M72k69
3872hj36J76r4j10J46M13k65K7l42k4N89m65j55N29l91J50j7j90M2J35R8N9j40
3895B7J18j55N9j03J67j33J73j40j06j72L46K07k65n3Jo6M04j14J2l73J64K19
3917B17j81j75OK13k36J08LK8q6%J63l9m9P2n3O9j10J43l22L27J66m6l34K30l7
3942G7Ql96L16K88m80K22PP0l61R2p0N3J71j13ok1O7Q9J1l17P5j9k3N32j39k21
$$ plain form
3968 -88 -212 18 84 51 10 56 135 -112 91 -93 252 156 -72 -83 -45 -50 241 58 143 -75 12 147 8 -228
3992 -228 101 130 32 115 -256 86 -117 -305 96 119 280 -6 -47 144 75 235 -135 -5 -105 -47 -145 -33 -12
4015 -12 144 -64 -31 -191 -190 -21 20 -3 -243 181 -133 12 -108 143 132 -198 114 37 61 -118 62 -50 111
4038 111 -12 -136 -22 -126 -139 98 -232 41 -7 -199 136 -14 -264 -76 131 22 -12 1 89 102 109 -118 -124
4061 -124 -407 144 -190 266 -52 -72 337 9 -5 -106 37 41 -77 12 5 177 27 22 -42 -181 -53 125 90 -135
4085 -135 93 -29 -401 68 -195 -16 131 255 -207 205 90 195 -42 65 -98 -103 12 -95 111 -91 1
4106 1 -57 -79 126 195 60 -95 20 75 186 15 -271 -20 -107 2 33 -234 -20 213 -132 140 -48 183 63
4129 63 -7 68 -136 35 -250 283 140 -14 122 -12 71 46 -275 16 104 -71 -120 79 -107 -14 103 153 -265
$$ packed form
3968h8j24K30O6l3m1M6P9k47K03j84L45r6k28j1L8nK91j83Q5k18Q7J35j39k36
3992b28L29K9r8Q3l71L42k03j88M01K3J61k86m1J91o9J60l70J30j00N8r8J12K1
4015a2J56k08L3j60JJ69M1k3k40M24l14J45j20K51j1l30L12p7K4j79J80j12J61
4038A11j23j24J14j04j3K37l30K73m8j92L35j50k50J88K07j09l4J3Q8J3Pk27o
4061a24k83N51l34M56l18k0M09l28j4j01J43Mj18Q9pJ72j50no4j39J28J78l5k25
4085a35K28j22l72M69k63J79J47J24m62M12j15J05k37J07j63nJ15j07K06k02R2
4106An8k2K05O9j35j55J15N5J11j71k86K51q7J09L1k67K14K33l45K72j88K31j20
4129F3p0P5k04J71k85N33j43j54J36j34Q3k5l21K91Q8j75m9J99j86R3J17N0m18
$$ plain form
4152 -265 318 -19 44 146 -99 150 -40 77 -213 -251 -14 107 91 -127 -220 -114 -101 -58 -10 -42 -25 -52 19 79
4176 79 -357 -59 -114 -272 115 122 -68 85 42 14 202 122 -74 -67 -6 -40 -83 -46 50 -233 -161 30 62 -133 -211 -15
4202 -15 -104 -107 45 -21 33 -10 61 -120 31 53 -158 29 -143 -48 -212 144 75 105 117 -120 254 83 -259 311
4226 311 -212 -20 247 59 131 137 44 175 -13 -16 195 180 -158 -92 26 -199 301 137 36 -16 -31 202 -238
4249 -238 123 -75 -15 77 19 37 -39 93 -231 -14 -244 119 -101 -65 106 -226 366 -11 -107 -29 7 51 -9 -44
4273 -44 181 182 297 38 364 -96 234 107 -110 -125 -225 -89 -240 133 -44 -222 88 189 -294 -294 83 -279
4295 -279 63 19 166 192 329 4 71 0 188 137 -150 19 139 -258 72 58 87 38 107 50 23 115 101 22 252
4320 252 157 21 32 77 -13 49 13 90 115 -39 -105 -127 -3 94 18 70 245 10 100 28 18 183 -320 -269 96 -191
$$ packed form
4152b65N83l37O3J02k45K49j90J17k90l8K37J21j6k18r3J06J3M3M8l2J7k7P1O0
4176G9m36K98n5j58L87Pj90J53m3k8J88q0j96PO1l4m3L7R6k83P2J91L2j95p8J96
4202a5q9lJ52o6N4m3P1j81J51K2k11J87j72R5j64L56o9L0J2k37L74j71l42N70
4226C11n23J92K67j88P2Or3J31j88lK11j5l38O6J18k25N00j64j01n2j5K33m40
4249b38L61j98O0R2n8J8p6J32l24K17k30L63k20L6J71l32N92l77r6P8L6M4o0l5
4273d4K25JJ15k59L26m60L30j27k17j5j00J36j51L73j77j78L10J01m83%L77l62
4295b79L42m4J47K6J37l25O7p1J88n1k87J69J20l97L30j4K9m9O9n7k7R2j4p9K30
4320B52r5j36J1M5r0O2l6P7K5j54o6k2J24R7p6N2J75k35R0p2j0J65n03N1L65k87
$$ plain form
4346 -191 -20 192 63 -16 -56 45 -160 92 -44 50 -170 -184 -181 -70 55 95 46 179 -43 0 137 -95 -74
4369 -74 -12 -9 -96 333 23 103 -131 -49 79 -33 93 16 78 91 79 -114 35 -159 31 132 199 208 93 60 -142
4394 -142 -122 58 -12 125 -193 -210 145 43 125 49 100 -144 -198 190 141 35 -255 64 127 -105 29 174 235
4417 235 146 28 168 151 249 -41 -431 115 70 15 -135 129 126 196 8 188 -68 -137 -81 63 -61 -18 -311 -31
4441 -31 85 -204 150 95 58 -29 -56 -30 -17 -130 144 32 151 -315 3 -103 -255 80 -16 180 -13 -196 -150
4464 -150 78 22 40 -261 212 174 -137 -129 -274 208 -6 -7 -171 108 -310 79 -34 -222 155 17 -148 -39
4486 -39 7 -77 87 83 49 -93 66 -60 113 276 91 176 56 -23 0 -352 63 85 22 194 -47 96 -174 16
4510 16 -2 119 34 78 108 58 -129 -250 -3 9 42 41 27 -250 -64 -10 -26 111 -27 -131 128 -106 -108 21 -86
$$ packed form
4346a91J71K12j29p9m0J01k05K52j36R4k20j4LJ11J25M0m9J33k22M3J37k32K1
4369g4O2Lq7M29l10Q0k34Q2J28j12J26p7O2J3j2j93J49j94J90J01O7Rj15l3k02
4394a42K0J80p0J37l18j7L55j02Q2p6N1k44n4L88m9j06k90L19O3k32J34J45O1
4417B35q9j18J40j7R8k90l90N46m5n5j50K64lP0j88J80k56o9N6J44j24M3k93K80
4441c1J16k89L54n5l7q7k7K6J3j13K74j12J19m66L18j06j52L35r6J96j93j83M6
4464a50K28n6J8l01M73l8l11Qj45M82k14jj64K79m18L89j13j88L77j38j65J09
4486c9M6q4J64ml4j42J59j26J73J63j85Q5j20p9K3l52M15K2o3J72k41J43k70J90
4510A6j8J21q5M4L0n0j87j21K47J2L3jj4k77J86N4j6J37j38j04K59k34kJ29j07
$$ plain form
4535 -86 103 -84 6 94 -304 -168 -16 -49 260 -179 -13 -50 -121 -299 382 -26 -193 -217 201 74 45 -72 -24
4558 -24 12 -340 285 90 69 161 16 75 -11 -109 -115 -107 137 -64 -44 12 -346 -132 -83 64 -152 -55 17 190 111 2
4584 2 -28 76 -30 -41 64 15 -77 17 13 -87 173 43 163 -86 3 19 274 146 100 107 58 219 244 58 6 113
4610 113 47 -67 104 -71 -145 448 -11 -78 40 16 -262 -10 -10 -306 -156 -29 59 109 -62 274 -16 -39 107
4633 107 -99 181 -32 36 98 -127 -31 -38 3 -26 -197 176 111 -245 85 201 257 -107 -166 13 -112 -16 -120 62
4657 62 -128 27 280 73 -22 135 42 306 -37 -368 188 113 -1 34 -179 137 2 254 -77 -143 131 286
4679 286 49 -74 -264 -153 94 -52 52 -61 263 -24 121 -68 -15 129 -31 -59 171 97 -138 -52 -165
4700 -165 94 -88 160 -53 121 115 -148 -8 -70 -95 -42 -67 -43 -57 -342 -73 -100 86 -149 -117 -119 -168 268 241 -10
$$ packed form
4535h6J89j87R0Q8l98J36J52l3L09m39J66l7p1j78O81m08j67k4M18j27k9j17M8
4558b4L6l52O25j95k1R2j45N9q6r8oQK44k01K0N6l58K14M9J47k16R7P2J73p9j09
4584Bl0J04j06j1J05m9r2R4mj00K60j30J20k49Q9J6K55j28m6Pm9J61K5j86n2J07
4610A13o6j14J71j75p4N93m59o7J18k4k78K52%k96J50J27Q8N0j71L36k90k3J46
4633A07k06K80k13O8O2k25R6pM1k9j71L73o5l56L30J16N6l64n9J79j25R6j04J82
4657F2j90J55K53k07r5J57r3K64l43l31N56p5j14L5k13L16j35K52l31o6K74J55
4679B86k37j23j90J11K47j46J04j13L24k87J45j89N3J44j60k8K30p4k35Q6j13
4700a65K59j82K48k13J74ok63J40o2k5N3k5K4j4k85K69k7J86k35L2km9M36k7k51
$$ plain form
4725 -10 90 -92 -177 -173 -142 -118 -5 174 57 -66 22 -63 -156 211 27 -96 -73 115 29 76 -152 73 23 -96
4749 -96 -83 76 177 132 -199 -134 310 -201 -60 -123 167 283 247 101 4 151 309 -94 -119 -222 174 79 -148
4772 -148 -108 -238 -244 -243 -141 82 -65 -69 -411 -58 -100 12 52 -222 127 14 9 -75 176 -39 153 -266 -196 -112 -5
4797 -5 5 -179 -305 59 37 -208 37 234 -180 -92 62 238 109 -96 0 -70 -56 1 163 84 172 171 -151 194
4821 194 -184 20 92 167 -324 203 133 73 250 41 -18 -21 -37 -181 -129 -118 -241 135 16 20 -12 154 -35 18 113
4846 113 27 -94 -104 16 130 134 -8 -7 39 38 -167 48 111 189 136 59 382 -194 93 -72 -117 -114 -67 -99 343 -34
4872 -34 -156 -14 -38 308 -193 -244 -189 21 -11 34 -173 -298 53 175 62 340 -137 230 -125 199 183 124 -2
4895 -2 -143 -135 183 18 -134 -24 -47 -73 -136 -35 207 158 -168 68 -202 -45 70 115 -56 83 105 -125 -34 255
$$ packed form
4725a0J00j82q5ML1K4J13J79j17j23Q8q5r3L67j84j23K3J88q6M7k28K25n0j19
4749i6J3J59J01m5l31O5M44n11J41o3K90J16l6j46r7J47J58m03k5j03L96r5k27
4772a48M0j30oJJ02K23j47ml42L53m2J12M0k74L49j13nq4K51k15J92m19P0Q4J07
4797eJ0j84j26L64k2k45K45J97m14Q8J54J76j29k05R6p0J4N7J62p9Q8jl22L45
4821A94l78K04P2P5m91N27p0o0J77k09n9lj6j44N2J1j23L76j19Ml2J66j89N3R5
4846A13q6j21j0J20J14Mj42JM6jk05K15O3P8n3p7L23n76K87j65m5LM7l2M42l77
4872c4j22J42k4L46n01n1N5K10l2M5k07j25L51J22j13K78m77L67l55L24j6n9j26
4895bj41QL18j65j52J10k3k6o3J01K42m9l26K36k70J57J15M5j71J39K2k30R1K89
$$ plain form
4919 255 -276 -31 23 -121 95 120 -166 97 -77 -247 160 -198 104 27 -63 51 -68 108 231 -30 394
4940 394 162 27 -48 -128 -146 -135 -286 -18 -117 -186 -14 -133 45 -277 228 17 -30 -31 107 -168 212 -103 -62
4963 -62 23 146 -107 41 235 478 4 -264 -61 -54 83 19 172 -94 87 -32 42 239 13 -66 -320 132
4985 132 191 -42 62 205 -34 23 101 -20 224 -33 -73 8 159 -53 90 143 178 -40 1 98 -93 19 250
5008 250 35 -6 46 -96 -273 120 152 240 -90 -72 -85 43 -3 9 -94 -135 27 -103 -223 -133 63 -287 69
5031 69 -161 -64 54 -168 127 54 203 -10 45 194 30 -93 -239 -30 -147 -92 -50 -78 167 62 232 217 20
5054 20 187 158 105 168 -34 -109 61 -128 145 -28 -17 -124 196 -69 -94 -4 -272 -81 201 -196 58 -18 -193
5077 -193 123 5 -35 133 -51 -84 -186 -137 -209 -129 -142 98 -26 -244 -68 3 70 -55 73 -49 -73 165 -50
$$ packed form
4919B55n31K45N4j44K16K5k86K63j74j70M07l58L02p7r0J14j19J76J23k61M24
4940C94k32j35p5q0j8J1j51K68r9o9J72j19J78l22N05k11m7jJ38k75L80l15M1
4963f2Q5J23k53J48J94K43m74k68K03PJ37o4J53k66J81j19P4J97k26p9k54M52
4985A32N9k33J04J43k39N7P8j21K44k57m0Q1J51k12J43N3L5k18M1R7j91J12K31
5008B50k15m1N2j42j77L93L2Q8l30J8j3J28m6J2j03m1J62j30j20R0J96l50L56
5031F9k30R7J18k22K95p3J49k13N5J49j64j23j46K09j17N5M2k8K45j05J70j5j97
5054B0J67k9n3O3k02p5J70j89K73j73J1j07L20k65k5R0k68J91K82l97K54p6j75
5077a93L16j18m0J68j84l3j02M9p2Q0j3K40j24k18J76P1O7j25J28j22k4K38k15
$$ plain form
5100 -50 -39 3 -166 97 171 -219 -70 -125 172 32 143 -91 -89 -100 173 -37 59 3 -118 -2 15 -61 -34 118
5124 118 -12 71 -19 88 13 184 -130 -243 -5 70 -43 -51 -131 112 366 31 170 189 -296 17 117 -55 343
5147 343 -225 -76 57 -22 -254 57 -54 70 162 -5 263 -285 97 435 -206 168 -252 -54 -30 -68 304
5168 304 117 154 165 141 132 16 -3 -108 75 199 -46 -218 -37 42 227 -124 -96 99 -269 165 203 60 67 -1
5192 -1 -68 138 -127 -175 -84 199 -42 -53 14 -75 -34 119 115 -83 121 2 -163 53 -78 219 -153 179 65 36
5216 36 1 120 60 11 -43 -147 80 232 32 -60 -130 -202 88 -245 -338 43 90 -84 181 69 -7 53 -75 -33
5240 -33 19 74 12 140 216 -52 212 100 -66 190 62 52 21 287 -11 10 60 106 91 -58 -128 90 -26 247
5264 247 31 -161 -35 -155 -47 -293 -46 27 -166 12 -36 136 -17 33 228 -121 174 -33 -17 -189 -41
$$ packed form
5100e0J1M2j69K63P4l90J49n5K97j40J11k34Kj1K73k10R6n6j21J16J7p6K7J52
5124A18j30Q3r0J07p5J71l14j13K38P5j13qq0K43K54l35J39J9m85L13J00j72L98
5147C43n68J49J33p9k32L11j11J24R2j67K68n48L82L38o41L74m20J98K4l8L72
5168C04j87L7J1k4rj16j9j05J83J24k45j72J81P9J85l51K8J95l68M34L8j43Po8
5192ao7K06k65m8R1K83k41j1O7q9M1J53mj98K04j19j65K16j31K97l72L32j14k9
5216C6l5J19o0m9n4j04K27J52k00r2p0p2K90l33r3L81M7j74K65j12p6O0j28M2
5240c3N2N5o2J28P6k68K64j12j66K56j28j0l1K66k98K1N0M6j5j49p0K18j16K73
5264B47k16j92J26j20J08k46K47P3j93J78m8J72j53N0J95l49K95k07J6j72J48
$$ plain form
5285 -41 94 -1 -211 147 -113 132 149 -34 10 -103 129 120 -52 161 -111 158 63 -32 158 122 -81 -18 142
5308 142 -31 62 -83 -153 -81 -103 -141 119 214 -191 -176 83 19 -102 100 234 186 402 -106 76 -263 103 5
5331 5 -155 48 150 11 -162 232 66 265 20 133 6 -50 -51 -130 63 178 -165 110 63 202 230 77 52
5354 52 90 -203 -106 54 42 237 263 -28 -180 291 190 188 -183 55 -103 26 41 103 10 -78 22 104 61 -89
5378 -89 175 -11 145 -103 -115 20 -7 182 -222 171 175 -77 -37 -62 -12 -52 -47 -106 -84 -50 -135 -26 65 43 -204 72
5404 72 -217 154 7 -88 -106 -122 -12 64 -121 107 -75 9 16 -21 22 45 304 155 102 -124 90 121 -62 4 -16
5429 -16 108 44 113 -269 -174 -80 -86 -70 -109 165 -110 91 212 58 -152 -163 -11 -53 -129 141 387 17 -98 235
5453 235 55 197 61 131 -234 74 139 -250 54 -18 15 -80 -153 -115 -106 -145 176 -16 123 125 147 -13 72 296 104
$$ packed form
5285d1J35r5k10L58k60K45J7j83M4j13K32rj72K13k72K69r5r5J90l6k03O3J60
5308A42j73R3j45p0P2k2l8K60R5m05J5K59o4j21K02J34m8K16n08J82l39L66r8
5331Ej60K03J02j39j73L94j66J99k45J13j27n6jp9J93J15l43K75m7J39K8j53k5
5354E2L8k93R7J60j2J95K6k91j52M71j01kl71K38j58J29J5O2r3q8J00Q2m3j50
5378h9K64j86J56k48j2J35k7J89m04L93Mk52M0k5N0m0Nn9K2L4q5J09R1k2k47K76
5404G2k89L71j47r5j8j6J10P6j85K28j82Q4Pl7M3K3K59j49n3k26K14L1j83O6k0
5429a6J24o4O9l82R5R4oJ6l9K74k75K01J21j54k10j1J52m2p6K70K46l70j15L33
5453B35j80J42j36P0l65L08O5l89L04p2L3r5p3L8Rl9L21j92J39KK2j60Q5K24j92
$$ plain form
5478 104 -16 -198 238 -94 -177 183 96 -147 -256 236 35 -20 -57 19 178 -108 -180 42 -109 110 233 -216
5500 -216 195 170 246 -59 101 161 114 84 -142 62 8 281 -6 -64 -124 -151 -8 -118 226 3 164 273 -7
5523 -7 -138 44 65 38 247 94 100 86 -183 -208 -90 -162 -101 113 50 -235 31 126 116 -33 -100 86 21 236 -20
5548 -20 -93 54 -132 253 65 -1 -323 211 116 188 142 69 274 -180 -7 253 -92 101 -75 25 -3 -54 164
5571 164 35 197 -69 -17 17 91 257 73 -145 -147 -134 2 -106 -270 -30 -95 -64 -62 42 -107 62 -88 -24 161
5595 161 119 -60 -111 -282 -143 -182 -103 37 -36 1 109 -60 27 -29 35 -142 -252 92 -93 216 225 -170 224 58
5619 58 -36 101 86 43 11 206 -72 140 -56 51 -76 -90 138 -83 -40 97 -30 201 -76 77 89 67 -91
5642 -91 52 101 -202 61 -185 5 58 -150 67 -158 -313 73 -199 7 118 -60 89 74 -59 68 -23 -245
$$ packed form
5478A04j20j82M36l32q3L60q7k43j09M92k01n5l7P6J59k86p2K22j51K19J23m49
5500b16M11k5P6l05J60O0m7l0k26K04n4K73k87n8o0k7J43j10L44k23J61J09k80
5523gj31J82K1k7K09j53Oj4k69k5J18p2O1K14o3k85K66R5j0j49o7J86o5K15k56
5548b0p3J47j86L85j88o6l22N34r5P2m6p3K05m54J73K60l45J93j76J00k8n1K18
5571A64j29J62k66N2L4P4J66j84k18kJ3J36j08j64K40o5L1KJ04j49J69j50O4J85
5595A61m2j79n1j71J39l9P9J40p3L7J08j69Q7n6O4j77j10L44j85L09Rl95L94j66
5619E8r4J37j5m3l2J95k78K12j96J07j27j4K28k21M3J37j27K31k77J53J2k2j58
5642i1J43M9l03K63k46J90N3k08K17k25j55L86k72K06J11j78J49j5j33J27r1k22
$$ plain form
5664 -245 -210 105 146 -25 51 26 42 57 373 -56 265 95 232 -77 -4 212 -46 210 -163 114 10 -30 -1
5687 -1 -10 93 -65 27 112 45 -39 -217 19 -38 -89 -142 85 -112 110 32 -332 -33 17 -23 146 -114 -60 -79 17 -55
5713 -55 84 -70 -87 -198 -138 -163 44 -19 -17 30 -208 -146 175 374 173 38 -18 56 -47 -22 -185 -1 77 -109
5737 -109 -236 -145 -47 -5 84 41 -73 67 -186 -228 -24 -100 -157 -267 -160 -167 176 179 50 -41 9 -162 152 -37 -97
5762 -97 -230 82 122 87 105 -28 -25 -60 -63 404 -107 -218 140 -107 -95 30 262 -95 176 -139 234 -59 -147 170
5786 170 -27 -24 -13 -165 -9 79 213 48 8 267 -108 128 58 245 46 -101 56 203 -56 262 -101 200
5808 200 80 -206 116 -160 317 -167 143 -61 96 104 79 -242 43 77 35 -114 21 14 -98 24 -253 32
5830 32 32 105 143 30 -56 23 -178 124 -1 119 -330 7 -6 67 -49 194 109 15 38 -47 75 -42 120 50 102
$$ packed form
5664b45L5L15M1j71P6k5J6J5L16m29L21j70J37l09P3K16k58K56l73K77j04m0K9
5687arJ03j58R2Q5o7q4j78K36n7n1n3K27j97K22p8l64K99N0m0J69k60N4j9R6p2
5713e5J39j54j7j11O0k5K07o3KM7k38O2L21J99k01j35n6P4j03K5j63J84P8j86
5737a09j27R1R8M2Q9m3j14J40k53m2K04p6n7j10J07pL43Lj29r1N0j71L14j89o0
5762i7j33L12M0l5J8j33Ll5lM67n11j11L58k47J2J25K32l57K71l15L73k93q8L17
5786A70j97LJ1j52J56Q8J34j65m0K59l75K36p0J87j99j47J57J47k59L18l63L01
5808B00j20k86L22k76M77m84L10k04J57Qk5l21K85L4m2j49J35pj12J22k77K85
5830C2%P3L8j13q6P9k01L02j25J20m49L37j3P3j16K43q5r4K3q5J22j17J62p0N2
$$ plain form
5855 102 70 76 0 -119 14 -110 -38 65 101 175 -199 -146 -194 -104 148 206 36 -79 -146 -92 59 1 -33 30 189
5880 189 299 -81 -117 152 -29 -158 70 118 25 419 25 137 -84 64 13 54 -68 133 76 -407 -213 -98
5902 -98 250 -52 37 15 199 2 39 111 129 -114 -312 72 -29 -153 66 10 -126 84 175 -48 -181 40 126
5925 126 71 -110 -53 10 36 27 1 -172 78 81 13 -77 -147 11 -269 74 -173 -13 -55 -83 111 -123 173 -134 -180
5950 -180 309 -64 322 308 -73 -80 11 -4 69 147 -10 115 251 -232 446 171 -153 -135 21 -172 -78 -146 150
5973 150 -14 -278 -329 -211 124 131 55 151 -128 25 -174 67 144 -167 -162 200 342 156 17 205 -82 -11 301
5996 301 -22 -67 72 -112 -12 9 -61 -155 78 216 -141 63 119 -176 -25 231 -68 177 32 35 -79 166
6018 166 28 -8 -246 -26 44 -224 47 12 -238 -23 0 -6 65 17 169 -217 150 163 48 -85 119 -11 44
$$ packed form
5855A02l2Op6j19J33j24P2J03L6P4l74N3m8R0K52N8j70j15o7N4J51n8l4O3J59
5880A89J10l80l6K69j81j29K28M8r3L94l94J12k21J48n1M1j22K01n7m83J94J15
5902i8L48l02Q9k2J84j97L7P2J8k43j98L84j01j24K19n6j36K10R1k23j33K21Q6
5925A26n5j81N7O3K6rk6j73K50Lo8r0p0J58k80L43k47J60m2k8J94k34K96l07m6
5950a80M89l73L86j4l81pR1j5P3P8j57J25J36m83O78k75l24J8J56j93R4o8K96
5973A50j64k64n1J18L35Pp6R6k79J53j99K41P7l11NL62J42j86j39J88k87P1L12
5996C01l23m5J39j84J00K1p0r4K33J38l57K04N6k95J51K56k99K45j45Lj14K45
6018A66j38l6k38K20P0k68K71l5k50K15K3oP1m8J52l86L67J3j15j33K04j30N5
$$ plain form
6041 44 -67 168 228 198 -60 29 28 -6 -168 -252 6 -94 -46 368 96 105 57 95 -127 7 -192 185 43 -105
6065 -105 -242 -55 272 135 -122 131 -54 -238 -150 111 33 -216 -1 -20 32 -39 -97 -194 -92 226 191 -123 147
6088 147 1 -43 -96 -82 -84 -186 3 187 -213 15 -140 50 302 58 -63 -296 -107 52 -31 207 -45 -51 -61
6111 -61 -263 71 -160 -57 -38 26 173 68 44 -80 -24 -47 -87 -23 140 -31 61 -77 -111 6 -135 -113 -51 -8
6135 -8 -101 100 299 -40 49 -17 60 79 84 -5 -57 17 -120 -26 153 257 146 -195 164 60 -78 83 137 44 301
6160 301 -101 -226 -233 -118 149 -49 18 -109 -173 212 -163 80 288 -311 114 39 -221 176 -167 -377 44 96
6182 96 -124 63 35 -132 -118 -246 232 -6 5 47 -158 24 -219 88 -46 164 -128 -156 155 -90 413 23
6204 23 57 97 12 -77 -144 -37 103 -10 24 -118 -191 23 163 -16 177 246 119 169 290 52 13 268 74 159
$$ packed form
6041D4j11K35O0l0k58Q9jl4j62q4K58j00M8M14k72Rm8L8k22J34j99L77j42j48
6065a05j37J87L27j37k57K53j85j84Q8K61p8k49K15j9N2p1n8r7J02L18l5l14K70
6088A47j46m4n3J4kj02J89J84m00K28j55J90K52k44j21k33J89J59q3K38k52oj0
6111f1k02L34k31J03J9O4J47j05k4j24N6k3m0O4J63j71R2j38l4J17j41K2O2M3
6135hr3K01J99l39Q9o6P7J9Nq9n2P4j37R4J79J04j11l41L59j04j38J61N4r3K57
6160C01m02j25pJ15K67j98O7j27o4L85l75K43K08n99M25p5k60L97l43k10M21N2
6182I6k20J87k8j67J4j28M78k38J1M2k05J82k43L07j34K10k92k8L11k45N03l90
6204B3L4M0q5q9o7J07J40j13L4j42p3K14J40j79J93O9j27N0J21k38l9K55j94Q5
$$ plain form
6228 159 114 -187 196 -200 -162 -43 -101 160 80 -63 71 54 -37 181 -67 165 173 356 -109 64 -88 -197 -165
6251 -165 -75 37 116 -77 8 173 27 -130 -161 180 75 -85 -157 37 148 -138 -161 20 97 -142 -168 -115 -35
6274 -35 -67 141 181 -66 -103 147 165 -138 30 86 180 61 -37 -38 26 222 -34 -37 -108 -19 -61 21 -247 -23 -124 15
6300 15 239 97 62 128 -6 -59 -38 -53 -117 132 -59 -32 -157 -99 -108 -79 -34 -84 -39 30 -88 96 113 82 -3 103
6326 103 128 72 -99 -54 -146 213 16 -188 29 110 147 -399 251 -29 -4 18 -241 -80 -13 172 -157 -130 -154 -124
6350 -124 -74 163 -159 -362 354 -41 209 -285 -160 136 -42 168 -112 -28 -67 -22 56 -11 98 359 -32 47
6372 47 44 -216 216 24 46 126 190 -142 418 71 128 4 -168 152 147 194 116 302 -191 -44 206 177 -68 111
6396 111 -47 16 180 25 21 -143 139 -37 71 155 -53 -109 -166 42 212 -203 118 127 -109 132 -29 -88 -47
$$ packed form
6228A59m5l01L83l96L8J19n8K61q0j43J34j7r1K18k48K32QJ83m65J73j52j09L2
6251a65R0J12P9j93Q5J65j46j57l1L41j05j60p2J94J11k86k3J81P7k39k6N3Q0
6274c5l2K08M0k47l7K50J8l03J68N6R4j19r8jO4J96k56lp1Q9m2Q2k68K24j01J39
6300A5K24j42l5O6j34n3K1j5o4K49j91K7j25N8rK9M5n0M5O9j18J84J7l1q5J06
6326A03K5n6j71M5r2L59j97k04K17Q1L7n46O50k80K5K2k59J61O7J85l29K7k4L0
6350a24N0K37l22k03P16l95K50m94J25K96j78K10k80Q4l9M5P8o7J09K61l91P9
6372D7lk60M32j92K2Q0O4l32N60l47N7j24j72L20nM7p8J86m93J47K50k9k45J79
6396A11j58O3J64j55mj64K82j76J08Q4k08n6n7K08J70m15L21Rk36K41j61n9M1
$$ plain form
6419 -47 -43 -122 -156 209 -43 40 52 102 -71 144 196 -59 11 -38 20 350 28 48 89 368 -163 -149 400 -27 86
6444 86 311 178 30 -18 -78 -206 45 209 29 46 260 23 -323 -58 -272 45 102 0 26 -166 -134 -15
6466 -15 240 82 -276 -226 6 33 249 35 -69 -24 75 -106 64 70 54 221 32 10 96 11 57 213 -142 -109
6490 -109 -35 -352 241 -278 187 -77 244 109 -14 153 -209 -34 205 61 61 125 -56 198 192 122 -101 -36 66
6513 66 -41 11 -74 -30 -126 28 -80 -55 -237 -181 114 117 -66 -36 16 34 -344 97 -83 285 -84 -145 0 -46 52
6538 52 46 353 134 -71 8 152 -10 -88 82 37 -59 109 -121 430 162 222 169 167 81 0 -59 -24 29 281 -32
6563 -32 -296 -135 -156 139 -53 254 -60 83 -193 101 16 -70 155 50 86 -2 -108 26 165 -68 -136 70
6585 70 50 224 -64 53 -66 -266 146 -115 65 190 303 98 85 -122 -252 -138 -235 139 -196 -159 114 -204
$$ packed form
6419d7Mp9l4L65k52Q3J2N0j73K15N2k55P0m9N8L30l22K0M1K79n31J4N49m27J13
6444H6K25j33j48m8o0j28K51J64j80J7K14k37l46K65k14L17N7j02K6j92L2J19
6466a5K55j58l58N0K32K7K16k14j04M5R9j81J70Oj6J67j89k2Q6q5M6J56l55L3
6490a09P4l17N93n19M65k64L21j35j23J67l62J75K39j44%O4j81K54op0k23O5J02
6513F6j07N2q5M4r6J54j08K5j82N6K95Lj83L0N2J8l78M41j80L68l69o1J45m6R8
6538E2oL07k19k05P9J44j62p8J70m5r6J68k30N51k68O0n3kq6q1n9L5N3K52l13
6563c2k64J61k1K95j92L07l14J43k76K94q5q6K25j05L6q8j06J34J39k33o8K06
6585G0k0J74k88J17j19k00M12k61J80J25J13k05j3k07j30J14r7L74l35L7K73l18
$$ plain form
6607 -204 -26 -46 96 -156 -54 12 -33 102 259 228 -160 26 -196 -112 103 -43 -1 -79 -58 -63 -49 -31 149 -45
6631 -45 -212 -246 89 3 294 -1 -169 -155 19 60 -39 -160 -21 -41 139 24 -224 237 -176 288 -125 62
6653 62 -2 12 -234 154 259 62 55 21 -52 -299 32 -128 66 118 145 -142 237 -121 72 184 -147 82 -148
6676 -148 -123 -144 -234 -90 -54 20 -125 54 16 -11 -56 -147 -122 179 -9 49 20 97 -56 118 -67 146 -4 216
6700 216 110 -183 156 -172 -28 -43 135 37 -21 184 -120 -96 -13 5 -295 -7 -127 -63 42 -199 70 -101
6722 -101 25 62 78 75 -136 -23 -10 -19 -222 -171 166 -148 104 -162 -113 8 -54 83 184 13 11 -136 -56 -246
6746 -246 -101 77 51 287 64 113 -245 24 59 126 -279 -68 -94 36 8 -42 -84 154 -115 34 120 -237 45
6769 45 -145 -108 69 -26 22 -42 90 -121 -2 -256 -35 264 129 -45 -58 -71 -123 -35 -40 -223 -38 175 147 -69
$$ packed form
6607b04J78k0J42k52J02O6m5J35J57l1l88J86k22Q4K15j46M2p8K1nJ4J8J80j94
6631d5j67l4L35q6K91k95j68J4J74M1r9j21J39k0J80j15k48M61m13M64m13J87
6653F2o4J4k46L88J05j97pl4p3k47L31j60J94N2K7k87L79l58J93J12l31K29k30
6676a48K5k1r0J44L6P4j45J79l8k7m5r1K5L01j88N8k9P7j53J74j85K13j50K20
6700B16j06k93L39l28J44j5J78r8n8K05l04K4Q3J8l00K88j20O4J05k41K69j71
6722a01J26L7J6lk11J13J3rk03N1L37l14K52k66M9J21o2J37J01j71kj47Q0j90
6746b46J45J78k6K36k23M9l58K69L5O7m05K11k6J30k8n0m2K38k69J49Q6l57K82
6769D5j90L7J77r5M8o4J32k11J19k54K21K99j35j74j3j3n2Q8nj83J85K13k8k16
$$ plain form
6793 -69 67 26 -19 163 -29 79 -179 -23 -276 -142 -97 120 -178 47 -20 27 174 -171 272 179 260 251 72
6816 72 118 188 -52 23 -126 27 -143 53 204 -45 -88 -11 -13 -65 198 59 300 123 -24 135 -61 -39 171
6839 171 29 -170 135 -69 -32 -52 -248 -9 -68 -24 25 -229 -106 -74 30 -23 218 217 -127 280 163 -34 -361
6862 -361 -348 -40 -28 -19 107 55 251 -86 -8 45 -90 -45 -31 -83 351 89 102 166 185 138 -55 373 112 64 82
6887 82 -116 -37 128 -75 -160 -23 -48 102 -105 32 -105 180 -68 60 41 15 207 45 -1 -93 110 -108 22
6910 22 106 225 157 -94 194 -21 128 0 -10 153 -7 -183 -62 83 25 121 -318 -245 -117 -144 -41 43 -61
6933 -61 54 83 167 -109 -100 128 -163 -64 45 25 -52 -8 80 -341 -151 -82 -49 -16 -58 37 -176 313 -227 -69 176
6958 176 -128 53 -176 55 -104 43 -12 -100 12 -9 -156 -5 203 78 -103 165 58 -413 -187 133 5
$$ packed form
6793f9J36m1m5J82j92J08k58J56k53J34M5K17k98K25o7M7J47l45M43r3Q1rj79
6816G2M6P0k40P5j49J53j70J96J51k49m3P7kn2K63j39K41j77j47J59j96K2K10
6839A71j42j99L05k04L7k0j96K39n9M4M9k54J23L2J04n3K41jl44M07j17j97l27
6862c61J3L08J2RJ26n2J96l37P8N3j35M5J4n2M34k62J3O4J9m7j93M28k61m8J8
6887H2j98P9J65k03q5J37k5J50k07J37j37K85k48J28j9k6J92j62m6r2K03k18J30
6910B2Q4J19o8k51K88k15J49j28j0J63j60j76J21J45n8R6m39P3J28k7J03Q4j04
6933f1J15K9Q4k76RK28k91R9J09k0p7M4Q8m21J90O9L3L3m2R5k13M89n40J58K45
6958A76l04J81k29K31j59J47n5q8J12k1j47J51K08j25j81K68j07m71K26L20j28
$$ plain form
6979 5 -302 163 -20 -191 23 76 -157 -68 34 221 108 24 -84 125 -152 29 -4 149 74 206 -271 -91
7001 -91 61 -63 50 149 109 184 173 -48 -134 -160 160 -158 166 -184 56 -182 -106 -82 -83 -236 14 64 -66 -74 -229
7026 -229 -60 -197 -27 -39 148 132 183 26 -97 56 -4 -314 -51 -95 11 -100 -65 68 163 132 146 145 51 150
7050 150 -16 72 -8 -303 -20 -388 -93 69 37 -5 8 -139 282 69 -4 -42 -16 -20 -17 -52 -28 120 260 -61 -164
7075 -164 53 -80 -25 248 43 5 -375 111 -138 26 71 -46 148 -139 -32 -174 64 95 -242 103 273
7096 273 -234 28 214 -39 -59 69 -287 -24 147 -12 -53 -273 108 100 213 -66 78 51 -49 -150 -12 -414
7118 -414 46 14 232 138 76 28 -283 -104 -78 58 -154 64 -7 -70 140 -53 -60 -17 -33 -57 -274 -135 44 114
7142 114 186 -34 209 -40 62 -44 -216 -30 -327 -33 60 -102 185 -172 -79 150 82 -213 91 58 -1 34
$$ packed form
6979El07M65j83j71K14N3k33Q9J02J87j13q4j08K09k77J81l3J53p5J32m77J80
7001i1J52j24J13R9m0P5j1k21q6k6L20l18L24l50K40k38P6K4jj53K50N0j30qj55
7026b29J69j37J70j2J87j6N1j57j23J53o0l10K63m4J06j11L5J33R5l1J4jr4R9
7050A50j66Q8q0k95K83l68K95J62l2m2J3j47M21k13p3l8K6mLl5K4J48J40l21j03
7075a64K17j33N5K73k05l8l80M86k49J64M5j17J94k87J07j42K38L1l37L45J70
7096B73n07K62J86k53k0J28l56K63J71j59m1k20L81qJ13k79J44k7j00j01J38m02
7118d14M60l2K18r4o2m8l11J79K6J36k12K18p1o3K10j93pM3j6k4k17J39J79P0
7142A14P2k20K43k49J02j06j72J86k97K94R3j62K87l57R3K29o8k95L04l3n9L5
$$ plain form
7164 34 25 58 93 -3 -6 340 -78 202 -171 -31 194 201 8 17 246 -128 272 124 -77 192 108 -11 -105 -3 179
7189 179 -326 -100 -189 -215 200 -53 -179 -37 -6 9 -74 100 -27 69 -136 63 -54 -144 -160 27 -100 -75 -8
7212 -8 368 -96 289 -151 81 179 -133 -151 34 -65 -196 4 -231 245 -230 -87 91 41 61 217 7 22 58
7235 58 74 35 0 -108 -331 -115 -118 -65 -173 211 282 -52 140 -26 100 22 -44 92 -4 158 19 75 -126 -13
7259 -13 170 122 -19 31 -107 -49 -141 268 117 105 117 176 -57 -39 -369 -110 176 266 -182 -63 88 -73 37
7282 37 9 -228 -91 72 -85 -361 39 -15 -411 -100 -30 189 120 141 53 -171 185 118 72 -41 11 -159 -44
7305 -44 -61 141 -164 -106 145 15 206 -185 276 7 275 222 -129 125 -280 13 183 37 56 36 75 -64
7327 -64 159 157 -258 21 12 -42 7 -220 -20 -78 -24 45 -84 -243 48 50 -125 170 67 268 -45 224 160 -221
$$ packed form
7164C4rL3L5r6lL46m18K80l73J40K25Pj93RK29l74M00j48k01K69q4j19r4J02J82
7189A79n05K26q9k6M15k53j26J42L1J5q3J74j27R6k05J99j17r0j6J87j27K5O7
7212hL76m64L85m40K32R8l12j8J85r9j31K00k35M76m75J43J78n0K0J56k10J5L6
7235E8J6l9l5j08k23K16lN3j08L84P1l34J92j66J26p8o6J36r6J62j39N6k01J13
7259a3J83m8j41N0j38N8r2M09j51j2J2N9k33J8l30K59K86R0m48J19J51j61J10
7282C7k8k37J37J63j57k76M00n4l96L11P0K19o9K1q8k24L56o7m6j13N2j70J15
7305d4j7K02l05N8K51j30J91l91M61k69K68n3l51K54m05K93J70j46J9k0L9j39
7327f4K23km15K79rn4M9k27K00n8N4O9j29j59K91Kj75K95j03K01l13K69o4l81
$$ plain form
7351 -221 -56 7 -53 114 -114 159 -17 336 354 179 80 -107 15 -215 -122 -359 150 147 -53 24 63 -111 264
7374 264 15 -319 120 -49 70 -1 22 -185 -128 -101 96 0 51 50 265 176 -272 140 240 -112 330 -85 29
7397 29 77 -51 141 -148 228 315 183 -94 13 232 -126 39 118 -1 25 48 85 -43 -5 207 -152 9 7
7420 7 -82 -57 -135 -165 51 -54 170 79 -226 216 20 33 30 -149 -8 -63 160 65 36 97 -288 -107 21 -106 140
7445 140 24 26 -264 203 -169 -48 -84 -111 113 230 63 105 48 -120 -210 -358 215 -224 -127 231 32 129 183
7468 183 -15 0 -37 -122 -14 -56 28 108 -160 49 -198 -151 -86 -89 -68 142 -25 73 -139 28 -92 -228 230 -62
7492 -62 -28 43 59 107 125 -230 -145 -23 -32 5 -26 -56 156 139 78 112 -59 73 223 207 -118 -122 -55 257 229 206 115
7519 115 -110 -52 9 -8 89 16 236 -151 13 -275 -47 61 -47 121 -301 18 8 83 156 64 221 -261 114
$$ packed form
7351b21J65O3o0J67k28K73j76L53J8j75r9j87J22k30R3k37N09lk00P7L9j74L75
7374B64k49l34M39j69J19p1K3k07N7K7J97r6N1jK15q9m48M12J00l52M42m15J14
7397B9M8j28J92k89L76Q7j32k77J07K19l58J65P9j19K6K3L7j28L8K12l59J61k
7420Gq9K5p8l0K16j05K24r1l05M42j96J3lj79J41n5K23r5k9O1l85J81J28j27K46
7445A40j16Kk90M67l72J21l6k7K24J17j67M2n7j68r0j48N73m39R7L58j99R7N4
7468A83j98J5l7q5J08m2Q4Q0k68K09k47M7O5lK1K10j67R8k12J67j20j36M58k92
7492f2L4P1J6M8J8l55Q5J22rL7l1l0K12j7o1L4j71J32J50j6l25mO7L12k8k3r1
7519A15k25N8O1j7R7p3K20l87J64k88K28J08j08J68m22L19j0P5P3r2J57m82L75
$$ plain form
7542 114 -87 -76 208 -65 -22 -256 -169 -163 116 -77 304 -225 -63 -170 24 -90 -18 -2 -35 63 -24 -37 75 -41
7566 -41 56 40 -137 84 -13 102 5 119 163 90 35 -218 -37 -65 72 -39 73 105 46 75 48 -377 -103 54
7590 54 -34 -114 122 -89 -208 12 -202 -76 -15 5 119 -88 39 6 275 -127 -305 73 -52 112 -182 212
7612 212 137 -138 89 164 -3 14 -82 129 -346 -26 35 121 -88 190 71 -47 -78 -120 -30 -240 -212 -67 176
7635 176 -43 104 99 -22 -137 -21 -71 -92 83 -243 -44 -78 143 -122 -176 347 378 -275 -98 22 -121 11
7657 11 126 38 4 36 -6 117 -35 -20 -193 -32 -348 -124 -2 -90 114 -151 87 -210 377 70 -137 72
7679 72 22 -202 -161 -204 100 -93 4 -152 51 203 23 220 -23 -35 36 177 110 44 -169 80 391 139 -191
7702 -191 44 54 107 75 158 -229 -86 23 46 -283 56 134 95 99 174 -29 -83 -45 -287 -282 34 220 -34 -40 94
$$ packed form
7542A14k01J1K84k73M3k34Q7OK79j93L81n29J62j07J94j14P2J6l3R8q7j3J12j16
7566d1R7j6j77K21r7J15r7J14M4p3n5k53J81k8J37j11J12L2n9K9k7m25K74J57
7590E4q8q0K36k11j19K20k14J26O1K0J14k07J27l3K69m02j78L78j25J64k94L94
7612B12p5k75K27P5j67J7r6K11m75L20O1Q6k09K78j19j18l1m2R0k10K8J45K43
7635A76k19J47nj21j15J16n0k1J75l26J99l4K21k65n4N23L1o53J77J20j43J32
7657A1J15q8l4L2m2J23j52J5j73J61l16K24J22q8K04k65K38k97N87l07k07K09
7679G2n0k24M1m3L04j93R7j56K03J52j80J97k43j2P1J41o7o6k13K49L11k52l30
7702a91K35J0N3l2Q3l87J43J09K3l29L39P8l9MP5k03n4L8k42NL16J86k54oJ34
$$ plain form
7727 94 -158 4 22 93 -35 -96 191 11 115 283 260 103 -144 -5 101 45 -116 -218 60 -52 -59 -34 166
7750 166 93 -206 -56 -36 134 162 14 -34 -130 -107 81 -32 268 -105 -120 173 71 -16 0 -46 -153 -3 -112
7773 -112 25 -23 -183 -223 71 -372 -215 198 -49 65 106 -29 47 92 40 -37 27 -200 -71 -108 -11 -33 -163 -130
7797 -130 -90 -211 28 -153 0 -28 -81 152 44 -74 54 -132 -253 94 -13 221 145 163 139 -204 15 -147
7819 -147 35 -115 95 -48 -47 -17 2 -4 5 170 -272 -19 -5 104 115 -183 -121 257 77 95 -60 60 56 -12 -128
7844 -128 -40 19 56 112 124 -154 155 -130 18 174 14 114 -58 131 -211 248 -64 -177 -36 2 145 7
7866 7 -49 37 138 17 37 42 -49 -103 271 173 -239 -336 135 -13 6 137 -110 -110 -152 145 44 65 -14 167 48 164
7892 164 -110 -1 81 -112 -14 88 -143 -81 16 93 -88 -81 87 -1 131 -44 -19 99 20 137 -3 -174 182
$$ packed form
7727I4k52J62J8P1j28o1K87j80J04J68k3j57k47J39J06n6j61j02K78j12pK5K00
7750A66p3k99J50K0J70K8j48m8r6K3J88j13L00l73j5K93j02q7J6m6j07J50j09
7773a12J37m8j60m0K94m43J57M13k47J14M1j35P6M5n2p7O4k27J29l7R7k2j30L3
7797a30M0j21K39j81J53k8n3K33j08j18J28j86j21L47j07K34p6J8k4l43K19j62
7819a47J82j50K10j43JL0J9oRJ65m42K53J4J09J1k98O2L78j80J8j55J20mo8j16
7844a28Q8N9L7N6J2k78L09k85J48J56j60J00j72J89l42M59l12j13J41L8J43j38
7866Gn6Q6J01j21K0Nr1n4L74r8m12r7M71j48J9J31k47%m2K97j01K1p9J81j19J16
7892A64k74J09Q2j93R8J02k31O2R7P7j81PJ68q8J32j75K5J18p9J17j40j71L56
$$ plain form
7915 182 -3 -45 74 -15 69 98 -229 336 59 30 15 176 160 169 -154 -5 -149 90 147 12 -171 -83 -114 0
7939 0 -120 -93 14 -129 235 179 -99 -51 -211 142 -48 -107 123 -117 -92 -167 190 -80 -125 35 -232 -103 116
7962 116 -152 53 -52 63 -222 -78 -121 31 -223 16 56 242 -22 -32 -5 -93 -340 -25 45 -6 -117 45
7984 45 85 -40 43 108 -243 -132 -142 -199 -46 85 -337 -3 -97 -119 53 215 44 83 439 -102 -28 152 -127
8007 -127 34 23 53 93 -67 -7 -46 63 -71 -94 229 -164 -235 28 42 333 54 -41 -53 -136 -144 -240 -71 -27 7
8032 7 42 -42 -90 217 30 87 148 -109 61 143 -23 -91 -286 -220 -330 64 -77 87 -120 -297 -122 165 1
8055 1 145 -43 75 37 65 -2 64 48 21 -60 110 -84 -22 30 22 483 13 122 -159 -281 12 281 -78 123
8079 123 120 39 35 -13 -65 -18 13 41 20 -68 -32 31 41 -10 -185 44 -26 136 174 16 -83 110 15 -83 63 -183 276
$$ packed form
7915A82j85m2J19q9Q4K9l27N65k77k9j5J61j6Rl23J49j44K39N7j35j83Q8l1J14
7939@j20K7J07j43L64n6k78M8j60L53j90n9K30k40K5p5L57k70m5J60k67J29K19
7962A16k68K05j05J15k85J44m3J52k54K39M0J86k64j0K7q8k47L15P0n1j11J62
7984D5M0j25Q3O5l51J11j0n7J53J31m22L34r4k2J72J62j71L9L56n41P4J80k79
8007a27J61j1L0M0j60O0l9J09j34k3L23l93p1K63J4K91k79r5j2q3qr6J69M4L4
8032GL5q4m8L07j87N7O1k57J70Q2j66o8j95O6j10L94j41J64k07j77J75K87j64
8055AJ44j88J18l8K8o7O6j6k7q1J70j94O2N2qM61m70J09k81j22K93K69l59K01
8079A23lq1mm8n2M7L1K8k1q8L6O3J0n1j75K29p0J62L8j58r9J93r5r8J46k46M59
$$ plain form
8106 276 -282 -197 -4 30 203 -164 34 -152 -170 -78 -57 18 30 -141 222 8 151 -357 134 93 271 -106 107
8129 107 22 -59 -2 37 147 -77 139 89 0 109 154 -55 -183 -106 97 208 36 45 -47 -54 69 148 150 232 -28 240
8155 240 -86 -115 15 -205 200 -158 -15 -39 93 155 73 31 211 189 160 -201 118 364 96 -191 97 0 -211
8178 -211 119 -1 -159 22 -246 -75 113 166 258 148 111 9 -192
$$ packed form
8106B76n58Q5J93L4J73l67J98j86j8R2K1P5J2j71L63k14J43n08M91m1J78l77K13
8129A07q5q1N7L9J10k24K16n0q9J09M5k09j28P7K03J11j72Rr2pJ23P9KQ2k60K68
8155B40l26k9J30k20M05l58J43k4J32O2q2m2J80k2k9l61L19K46k68k87K88r7k11
8178b11L30j20j58J81k68J71J88N3R2j10l7j02k01
8191a92
$$ Imaginary data points
##PAGE= N=2
##DATA TABLE= (X++(I..I)), XYDATA
$$ plain form
0 0 0 0 0 0 0 0 0 0 0 0 0 0 8 -8 8 -8 9 -16 16 -24 24 -32 38 -41 48 -57 70 -80 90 -105 120 -137 155 -177
34 -177 201 -225 251 -282 316 -353 393 -436 484 -537 593 -655 724 -797 879 -968 1067 -1176
52 -1176 1296 -1430 1580 -1750 1941 -2162 2418 -2720 3081 -3524 4082 -4809 5796 -7227 9497
67 9497 -13668 23878 -107765 -45988 177430 66325 -38405 -48990 -4702 -13753 12218 32378
79 32378 8360 -27719 11360 24857 -8056 -27868 5940 40104 28133 -31172 -37301 1923
91 1923 14514 -4339 -5521 5420 4760 -15469 -12704 -2732 -13539 3899 44120 21637 -24918
104 -24918 -21591 2885 4265 9296 31769 15671 -42890 -33395 32459 25459 -24182 -17221 8600
117 8600 -2380 -20167 -5122 19993 8741 -10357 -1143 5432 -581 -279 6136 12687 2064 -11581
$$ packed form
0@%%%%%%%%%%%%Qj6J6j6J7k5L2m0M8n6P0p9Q9j05J27j50J70j95K25k57K92l32
34a77L78m26M76n33N98o69P46q29R20j021J130j248J379j521J676j847K035k243
52a176K472k726L010l330L691m103M580n138N801o605P606q891J0605j3023J6724
67I497k3165L7546j31643O1777K23418j11105j04730j0585M4288r051K5971K0160
79C2378k4018l6079L9079J3497l2913j9812L3808L4164j1971n9305o129L9224
91A923J2591j8853j182J0941o60k0229K765R972j0807J7438M0221k2483m6555
104b4918L327K4476J380N031K2473j6098n8561R495O5854p000m9641O961K5821
117H600j0980j7787J5045K5115j1252j9098R214O575o013L02O415O551j0623j3645
$$ plain form
131 -11581 10499 24000 -12946 -35667 -7568 21661 13381 -9100 -7944 -7177 -21666 -3285 28121
144 28121 14188 -12970 -11574 650 6500 8977 15093 8659 -14087 -14261 5702 7834 3950 1679
158 1679 -11031 -11944 2103 6389 -3680 -16347 -11884 8535 15988 10034 -1875 -13405 -5771 7064
172 7064 11425 16874 6994 -15672 -13711 3644 9539 3455 -2976 -3250 -10942 -17494 3611 19267
186 19267 1383 -13549 -8482 2947 10084 5493 -1405 -2795 11 11205 13052 -2405 -9947 -7741
200 -7741 -2297 10141 9494 -5988 -13149 -10324 -2400 3894 2923 2913 57 -6760 -3054 2225 5178 13436
216 13436 7919 -7382 -7231 797 5866 6748 1829 -2917 -8429 -8208 2929 3093 -7014 -4764 247
231 247 -355 2265 1647 -1050 -2053 -487 7608 10055 2450 -993 -4869 -6201 4220 10110 5168 -3563
$$ packed form
131a1581K2080J3501l6946k2721K8099K9229q280k2481J156P67j4489J8381L1406
144B8121j3933k7158J396J2224N850K477O116o434k2746j74J9963K132l884k271
158A679j2710r13J4047M286j0069j2667M463K0419P453n954j1909j1530P634J2835
172G064M361N449r880k2666J961J7355N895o084o431k74p692o552K1105J5656
186A9267j7884j4932N067J1429P137m591o898j390K806J1194J847j5457p542K206
200g741N444J2438o47j5482p161K825P924O294r71j0k856o817L706N279K953Q258
216A3436n517j5301J51Q028N069Q82m919m746n512K21J1137J64j0107K250N011
231B47o02K620o18k697j003J566Q095K447p605l443l876j332J0421N890m942q731
$$ plain form
247 -3563 -14583 -13120 2216 11519 7861 -7583 -16630 -5116 6928 9364 8265 -2749 -9221 706
261 706 9411 9423 2072 -7355 -4709 2717 5802 4003 -6726 -12289 -3070 2040 2781 3906 -3407 -9805
277 -9805 -5864 2715 11859 8638 -2435 -4766 -2712 2302 9889 6103 -693 -3576 -7104 -2637 5365
292 5365 2516 -4018 -7730 -4799 2052 551 -2220 1194 -1255 -1762 4316 5231 3007 640 -2158 534
308 534 4196 4222 3581 -3541 -6993 -1978 -892 1381 4034 -2967 -8754 -5576 -331 5329 4629 -27
324 -27 -1304 -3104 1008 8040 4918 570 -918 -4032 -210 5198 2737 -2016 -6549 -6344 610 3027
340 3027 1204 -2395 -8880 -4789 6576 7171 2642 -2687 -6186 -825 6587 9838 6432 -4355 -8677
355 -8677 -1639 3519 5543 1949 -7640 -7945 -1251 1427 3235 296 -5173 -5111 -1385 5948 8290 -453
$$ packed form
247c563j1020J463J5336R303l658j5444r047J1514J2044K436j099j1014o472R927
261G06Q705J2p351r427K646P426L085j799j0729n563R219N110P41J125p313o398
277i805L941Q579R144l221j1073k331K054N014P587l786o796k883l528M467Q002
292E365k849o534l712K931O851j501k771L414k449n07O078R15k224k367k798K692
308E34L662K6o41p122l452N015J086K273K653p001n787L178N245N660p00m656
324b7j277j800M112P032l122m348j488l114L822N408k461m753m533K05O954K417
340C027j823l599o485M091J1365N95m529n329l499N361P412L251l406j0787m322
355h677P038N158K024l594r589l05O694K678J808k939n469O2L726P333K342q743
$$ plain form
371 -453 -4139 519 3205 6001 4200 -3146 -5054 -2638 1554 5648 1384 -4595 -7974 -7758 1791 7144
387 7144 884 -3040 -2853 -2118 2556 4815 3952 1569 -2721 -562 3934 2952 2430 462 -4291 -2564
403 -2564 -1630 -2730 -408 613 -1464 -2566 -1947 1600 1996 -1937 -1316 1285 1546 5623 5841 -311 -2441
420 -2441 -2081 567 3969 1978 -1487 -4936 -5283 939 3618 -103 -2496 -5775 -6041 1700 7375 5702
436 5702 473 -4514 -2474 2314 4622 5849 458 -5625 -1486 3322 3153 1274 -5236 -8315 -3288
451 -3288 1727 3636 705 -4217 -2803 -309 2136 5800 563 -4640 -574 4950 7132 4449 -2173
466 -2173 -5151 -3783 -182 4366 2513 -2294 -4375 -4946 -1352 4418 1536 -3906 -4125 -988 3004 5020
482 5020 3815 2298 -1772 -3138 2109 3388 1836 977 -2260 -2104 753 -764 -2224 -2161 -2189 -1231 -1161
$$ packed form
371d53l686M658K686K796j801p346j908K416M192M094m264n979l379K16R549N353
387G144o260l924J87P35M674K259q63k383m290K159M496r82n22j968m753J727
403b564R34j100K322J021k077j102O19L547L96l933O21K601K61M077K18o152k130
420b441L60K648L402j991l465l449l47O222K679l721k393l279k66P741N675j673
436E702n229m987K040M788K308J227n391o083M139M808j69j879o510l079N027
451c288N015J909k931m922J414K494K445L664n237n203M066N524K182k683o622
466b173k978J368L601M548j853m807k081n71L594N770k882n442k19L137L992K016
482E020j205j517m070j366N247J279j552q59l237J56K857j517j460O3k8R58P0
$$ plain form
499 -1161 926 3832 51 -2248 1194 1021 1328 2262 248 691 1216 1547 2388 -338 -3110 -3403 -4073
516 -4073 -231 3868 562 -2481 -3322 -4185 -266 3825 3874 1134 -3262 -2475 3477 5595 4744 722 -5515
533 -5515 -4281 1256 3418 3459 -986 -5918 -3922 -582 1938 1086 -3319 -3822 288 2537 4786 2975
549 2975 -2428 -3055 525 3939 5626 1185 -3022 -2458 -698 2547 2410 -3148 -5302 -3656 -966 4342
565 4342 3078 -2657 -3938 -2592 2240 4701 2180 352 -769 -1259 2594 3999 608 -1185 -2671
580 -2671 -2525 850 1038 -788 -1775 -2944 -1545 -35 -560 1082 934 -1403 -92 1910 2906 2659 211
597 211 -886 -12 -118 1668 2543 -563 -1908 -3307 -2729 909 839 -1469 -1594 -2106 -709 1590 1558 1860
615 1860 185 -1560 1169 3345 2464 1635 -1705 -2428 1240 1582 267 -1249 -4155 -3354 -98 1553
$$ packed form
499a161K087K906l781k299L442j73L07R34k014M43N25L31Q41k726k772k93o70
516d073L842M099l306l043q41q63L919M091M9k740m396P87N952K118q51m022o237
533e515J234N537K162M1m445m932J996L340K520q52m405n03M110K249K249j811
549B975n403o27L580L414J687m441m207N64J760L245j37n558k154J646K690N308
565D342j264n735j281J346M832K461k521j828j121m90L853J405l391j793j486
580b671J46L375J88j826r87j169J399J510n25J642j48k337J311K002R96k47k448
597B11j097Q74j06J786Q75l106j345j399N78L638p0k308j25n12J397K299l2L02
615A860j675j745K729K176q81q29l340p23L668L42j315j516k906Q01L256J651
$$ plain form
631 1553 1608 -1914 -4177 -647 2405 3346 3219 -792 -2400 380 2699 4120 1931 -2356 -2858 -1336
647 -1336 1456 3136 -831 -4519 -3303 -1594 1645 2683 -800 -2487 -2230 597 4091 3161 -201 -698
663 -698 -882 1055 3461 1158 -750 -1890 -2095 367 1598 -500 -1869 -2988 -1966 500 557 290 294
680 294 -1070 163 1841 1782 1902 768 -824 476 1017 998 920 -1152 -1830 -757 -1222 -216 134 -1713
698 -1713 -1322 -847 -554 1185 817 149 444 -587 710 2713 2236 1273 -477 -1920 -226 1495 974
715 974 -440 -2840 -2741 -686 382 966 -44 -3207 -1781 1033 2599 3055 74 -1873 13 1508
731 1508 3092 2843 -1143 -2793 -1001 639 2451 417 -3150 -3285 -1380 1155 2484 -387 -2560 -1180
747 -1180 -168 2690 3344 255 -1528 -927 1383 3509 1294 -1297 -1669 -1846 13 1715 -427 -1906
$$ packed form
631A553N5l522k263L530L052R41j27m011j608K780K319J421k189m287n02J522
647a336K792J680l967l688J216J709L239J038l483j687K57K827L494r30l362m97
663f98j84J937K406k303j908j140k05K462J231k098j369j119J022K466N7k67M
680B94j364J233J678n9J20j134j592J300N41j9p8k072o78J073m65J006L50j847
698a713L91M75K93J739l68o68K95j031J297K003m77r63j750j443J694J721n21
715I74j414k400R9K055J068N84j010l163J426K814J566M56k981j947J886J495
731A508J584k49l986j650J792J640J812k034l567j35J905K535J329k871k173J380
747a180J012K858O54l089j783O01K310K126k215k591l72j77J859J702k142j479
$$ plain form
763 -1906 -2376 -1935 436 1195 73 -70 -710 162 1837 1461 989 968 -687 114 1310 861 691 -624
781 -624 -1697 -953 -718 -183 -37 -1709 -1251 -516 -478 895 768 -260 -280 148 744 2237 1478 623 -164
800 -164 -1369 127 1045 496 29 -1122 -2668 -899 484 572 -382 -2185 -1662 542 1168 2215 1583 -1221
818 -1221 -552 1184 1263 1966 267 -1522 -618 328 1193 315 -3003 -2950 -1166 63 2200 685 -2131 -2055
836 -2055 -639 1651 2855 629 -1058 -832 451 3235 3009 -421 -1743 -1850 -1295 1377 1035 -687
852 -687 -1539 -2109 -212 1281 -162 -882 -813 -666 1892 1936 561 312 -323 14 1288 601 291 -526 -1334
871 -1334 174 383 -463 -803 -1846 -2026 -221 431 730 899 -255 -662 249 252 1921 1172 439 672 94
890 94 -338 757 71 -629 -695 -2167 -1051 394 469 359 -1050 -1735 -20 531 907 1382 172 -565 964
$$ packed form
763a906m70M41K371P59j122j43o40Q72J675l76m72k1j655Q01J196m49j70j315
781f24j073P44K35N35J46j672M58P35L8J373j27j028k0M28N96J493p59q55p87
800a64j205J496R18n49m67j151j546J769J383Q8r54j803N23K204O26J047o32k804
818a221O69J736P9P03j699j789R04R46Q65q78l318N3J784J229K137j515k816P6
836b055J416K290J204k226j687K26J283K784k26l430j322j07N55K672l42j722
852f87q52n70J897J493j443p20O9J47K558M4j375k49o35L37J274o87l10q17q08
871a334J508K09q46l40j043j80J805O52K99J69j154m07R11LJ669p49p33K33n78
890I4m32J095o86p00o6j472J116J445P5j10j409o85J715N51L76M75j210p37J529
$$ plain form
909 964 1488 1481 414 -1638 -578 386 663 1228 -1095 -2362 -1062 -298 564 370 -1531 -1696 -386 1489
927 1489 3134 1140 -1330 -1155 130 1714 2443 720 -941 -1287 -683 713 455 -1218 -1636 -1918 -639
944 -639 1514 337 -419 -592 -593 612 1447 1057 381 59 41 1182 1237 183 -243 -1609 -976 725 341
963 341 -440 -1047 -1684 -581 128 264 564 -280 -379 923 834 1422 985 -556 -466 453 270 516 37 -426
983 -426 -450 -1489 -1338 122 -260 -275 -407 -1277 -102 580 645 707 -6 -258 591 748 1631 1233 -779 -1226
1003 -1226 206 502 487 -221 -1873 -1441 -844 275 879 -648 -1308 -516 302 1705 1625 -593 -822 332
1021 332 1261 2116 383 -775 -785 -1034 484 1235 -883 -1690 -1732 -817 1176 1182 -758 -1415 -1112 665 2145
1040 2145 1264 316 -291 -768 865 1979 534 -681 -1311 -1022 585 489 -147 -609 -1942 -746 406
$$ packed form
909I64N24pj067k052J060R64K77N65k323j267J300P64Q62j94j901j65J310J875
927A489J645j994k470J75J285J584P29j723j661l46O04J396k58j673m18k82J279
944f39K153j177p56j73jJ205Q35l90o76l22j8J141N5j054m26j366O33J701l84
963C41p81o07o37J103P09J36L00q44r9J302q9N88m37j541R0R19j83K46m79m63
983d26k4j039J51J460l82j5j32q70J175O82O5O2p13k52Q49J57Q83l98k012m47
1003a226J432K96j5p08j652M32N97J119O04j527o60P92Q18J403q0k218k29J154
1021C32R29Q55j733j158j0k49J518P51k118q07m2R15J993Oj940o57L03J777J480
1040B145q81r48o07m77J633J114j445j215o30K89J607r6o36m62j333J196J152
$$ plain form
1057 406 -60 555 141 -545 354 818 718 1044 80 429 1001 190 137 76 -810 -232 -225 -957 -565 -5 -484
1078 -484 -437 -781 115 780 76 500 481 -418 501 1114 695 1031 3 -1154 -138 178 758 -303 -1632
1097 -1632 -597 -16 -593 115 -198 -1492 -621 604 1077 1499 92 -756 -109 689 1472 525 -683 -70
1115 -70 -227 -333 735 181 -1706 -1620 -877 527 1416 -101 -741 -1054 -87 1270 1164 163 162 -424 -139
1134 -139 1597 1045 -111 -915 -1031 83 204 -410 -191 -979 -1071 221 9 -160 -130 -346 19 1035 1141
1153 1141 752 -267 -638 699 648 333 321 -1003 -846 -184 -449 -644 -382 -1095 -725 -498 -23 839 -213
1172 -213 -194 458 203 274 894 228 547 400 -525 -234 -167 219 52 -934 -1131 -239 -417 -81 384 -518 -547
1193 -547 -57 324 1413 698 -358 18 425 809 697 -381 -827 200 -108 260 511 -741 -1451 -1386 63
$$ packed form
1057D06m66O15m14o86Q99M64j00L26r64L49N72q11n3o1q86N78Pp32L92N60m79
1078d84M7l44Q96O65p04M24j9q99R19O13m19L36j028j157J016L16N80j061j329
1097a632J035N81n77P08l13j294Q71J225M73M22j407q48O47P98P83r47j208O13
1115g0j57j06J068n54j887Q6P43J404Q89j517o40l13R67J357j06j001jn86K85
1134a39J736n52j156q04j16J114J21o14K19p88r2J292k12j69L0k16L65J016J06
1153A141l89j019l71J337n1l15j2j324J57O62k65j95K62p13L70K27M75Q62j052
1172b13J9O52k55P1O20o66L19j47r25K91O7L86j67r86j97Q92j78L36M65r02k9
1193e47M90L81J089p15j056L76M07L84j12j078m46J027l08L68K51j252p10O5J449
$$ plain form
1212 63 1133 227 -733 -583 27 691 1207 155 -50 46 -11 745 1118 385 -881 -1203 84 864 -166
1231 -166 -626 -747 -763 146 404 156 -437 -619 -344 1029 1133 812 -19 -564 421 878 353 264 -96 -679
1251 -679 -320 -187 -339 -186 -762 -408 -185 -202 626 260 -246 524 296 -73 515 399 443 269 306 118 -17
1272 -17 -400 -57 -495 -823 -147 -5 -314 -142 -427 -365 -122 171 527 351 -105 329 412 813 844 47 -887
1293 -887 -142 122 584 255 -170 -666 -1230 -800 625 270 -335 -486 -247 470 1117 605 175 76 -353 518
1313 518 813 581 20 -874 -532 586 342 -547 -1260 -500 -305 568 92 -102 -430 -728 204 1218 685
1332 685 318 -618 305 867 578 194 -527 -785 -114 166 136 411 -511 -887 -219 43 202 51 -382 416
1352 416 640 352 305 400 374 368 111 -103 203 -386 -393 -95 -216 -250 -441 -662 218 -158 -439 136 -124 314 539
$$ packed form
1212F3J070r06r60J50O10O64N16j052k05R6n7P56L73p33j266l22J287P80j030
1231a66m60j21j6R09K58k48n93j82K75J373J04l21q31n45R85M57n25q9l60n83
1251f79L59J33j52J53n76L54K23j7Q28l66n06P70k28l69N88j16M4j74L7j88j35
1272a7l83L43m38l28O76J42l09J72k85O2K43K93L56j76m56M34Q3M01L1p97r34
1293h87P45K64M62l29m25m96n64M30J425l55o05j51K39P17O47n12m30r9m29Q71
1313E18K95k32n61q94L42J118k44q89p13P60J95Q73m76j94l28k98R32J014n33
1332F85l67r36R23N62k89l84p21k58O71K80l0K75r22l76O68K62J59j51m33P98
1352D16K24k88m7R5k6ok57k14L06n89pK98j21l4j91k21Q80l76k81N75k60M38K25
$$ plain form
1375 539 99 149 550 349 768 270 -428 -179 196 34 196 13 -751 -562 -304 402 507 -470 -394 -364 100
1396 100 1055 458 -99 58 -333 445 636 441 -200 -567 -386 179 344 -499 -834 -768 -345 409 300 -169
1416 -169 33 -223 367 952 368 272 -255 -467 869 647 101 -473 -356 158 316 -225 -161 -352 -921 74
1436 74 162 149 98 -376 16 328 201 402 367 235 509 184 168 345 -7 -551 -239 -82 -251 -190 -328 -142
1458 -142 91 -514 -281 -189 198 383 -412 -278 197 319 242 225 57 -100 -169 -271 -155 -106 -568 -371 -387 -89
1480 -89 -78 -495 -137 -133 -111 568 265 -85 86 82 164 833 227 -177 13 -646 25 422 9 -459 -799 -308 190
1503 190 172 48 -74 -729 -427 459 628 675 211 -320 67 813 364 -105 -630 -153 479 -122 -129 -294 -293 -93
1525 -93 268 248 279 -307 -294 308 578 236 118 -296 -21 231 -103 223 412 -305 -231 -182 -329 -272 -510 -100
$$ packed form
1375E39m40N0M01k01M19m98o98K49L75j62J62j83p64J89K58P06J05r77P6L0M64
1396A00R55n97n57J57l91P78J91j95o41l67J81N65J65q43l35O6M23P54j09m69
1416a69K02k56N90N85n84r6n27k12J336k22n46n74J17N14J58n41O4j91n69R95
1436G4Q8j3n1m74L92L12j27K01l5j32K74l25j6J77l52n44L12J57j69O1j38J86
1458a42K33o05K33R2L87J85p95J34M75J22p7j7j68j57o9j02J16M9m62J97j6K98
1480h9J1m17L58MK2O79l03l50J71mQ2O69o06m04J90o59O71L97m13m68l40M91M98
1503A90j8j24j22o55L02Q86J69M7m64n31L87P46m49m69n25M77O32o01pj65JK00
1525i3L61k0L1n86J3O02K70l42j18m14K75K52l34L26J89p17P4M9j47N7k38M10
$$ plain form
1547 -100 -87 -15 -308 280 -29 20 202 -143 371 256 -37 132 338 333 -162 -205 -28 64 -460 -272 -65 -254
1569 -254 181 -124 -414 -339 -2 395 573 172 -54 75 320 933 491 -176 -282 -201 -110 154 177 -539 -658
1590 -658 -564 -17 271 246 150 -227 -236 486 134 -48 41 -213 4 484 379 103 -381 -224 178 275 -406 -126
1612 -126 -527 -474 -69 170 58 -116 -335 136 358 207 228 285 -41 147 215 348 242 -320 -288 -181 194 135
1634 135 -226 -532 -301 1 -190 163 245 -409 192 41 -22 159 64 212 234 35 320 17 -374 164 -382
1655 -382 -111 -225 101 -60 -11 -28 114 24 -90 202 48 142 290 12 98 612 -140 -215 -162 -170 147 -96 172
1678 172 48 -455 -160 214 -130 -274 -48 -216 460 402 113 117 -280 176 163 352 41 -105 -577 -327 428
1699 428 -111 -326 -564 -387 260 84 261 -32 -481 -271 99 375 127 377 -143 182 107 191 -62 -158 -67
$$ packed form
1547a00J3P2k93N88l09M9J82l45N14j15k93J69K06nm95m3J77R2n24J88K07j89
1569b54M35l05k90P5L37L97J78m01k26J29K45O13m42o67j06Q1R1K64K3p16j19
1590f58R4N47K88k5r6l77rP22l52j82Q9k54K17M80j05k76m84J57M02R7o81K80
1612a26m01N3M05K39j12j74k19M71K22j51K1N7l26J88O8J33j06n62L2J07L75n9
1634A35l61l06K31L02j91L53Q2o54O01j51o3J81r5J48K2j99K85l03l91N38n46
1655c82K71j14L26j61M9j7J42r0j14K92j54R4J48k78Q6N14p52p5N3qL17k43K68
1678A72j24n03K95L74l44j44K26j68O76n8k89Ml97M56j3J89l11j46m72K50P55
1699D28n39k15k38J77O47j76J77k93m49K10L70K76k48K50n20L25p5Q4k53r6R1
$$ plain form
1720 -67 -291 228 88 85 -429 -67 112 -194 -66 -245 -360 33 298 116 264 313 -164 97 149 235 -199 -171
1742 -171 139 45 -179 -172 -103 -425 210 -323 -179 105 -112 182 309 4 -36 92 284 191 57 -150 70 85
1764 85 343 148 -356 -327 -235 -330 93 211 216 -327 -38 -4 259 468 220 -41 12 312 306 -92 -97 -132 -37 62 -61
1789 -61 -104 -608 -438 -77 -185 -15 -156 -216 -158 -58 103 86 229 85 -119 219 299 208 110 -207 191 -145 183
1812 183 7 -294 -533 -416 101 71 70 -157 -78 319 78 398 -23 -336 42 -2 -194 2 -167 -65 -119 -114 -8
1835 -8 -14 -123 -47 -113 -132 -97 -159 -9 108 159 171 102 370 22 99 103 -29 126 237 290 -70 -278 -83 -169 -259 104
1861 104 -220 -9 -67 176 247 175 -32 180 28 108 447 396 35 -268 -241 65 136 24 -615 -534 -305 92 111
1884 111 -24 -348 -364 284 159 275 255 -124 -275 175 380 187 93 -308 -12 315 -1 209 -138 -336 -55
$$ packed form
1720f7k24N19j40ln14L62J79l06J28j79j15L93K65j82J48M9m77K61N2Q6m34K8
1742a71L10r4k24PO9l22O35n33J44K84k17K94J27l05m0J28J92r3j34k07K20J5
1764H5K58j95n04K9R2r5M23J18Nn43K89L4K63K09k48k61N3L00ol98nl5R5R9j23
1789f1m3n04J70L61j08J70j41o0N8J00J61j7J43j44k04L38Q0r1r8l17L98l36L28
1812A83j76l01k39J17N17l0jk27P9L97k41L20m21l13L78m4j92J96j69J02n4NJ06
1835hoj09P6o6j9L5o2J50J17N1J2o9K68l48P7Mj32J55J11N3l60k08J95q6r0L63
1861A04l24K11n8K43P1p2k07K12j52Q0L39n1l61l03K7L06P1j12o39Q1K29L97J9
1884A11j35l24j6O48j25J16k0l79j51M50K05j93r4m01K96L27l16K10l47j98K81
$$ plain form
1905 -55 77 483 -298 -302 -94 -7 202 -146 69 -171 308 39 97 212 3 52 -24 -79 14 -41 -321 -258 -154 -251
1929 -251 306 -110 -94 -116 -123 332 -27 -67 109 366 46 267 139 5 259 173 -174 23 -114 -123 340 -238 -129
1952 -129 -234 -202 -51 406 30 -11 216 -31 218 48 -115 156 -448 -141 -160 113 -141 -174 -283 -56 -193
1973 -193 -402 -118 -23 -74 322 191 380 248 -68 144 266 54 -53 -111 -218 17 -119 -203 -217 -21 -26 165
1995 165 -299 -13 -102 -187 99 93 -92 -7 175 -102 53 136 61 -111 -265 -97 100 18 -174 -301 -335 126 -3
2018 -3 120 50 -109 -62 -131 116 -317 240 -3 -90 -10 30 6 -235 107 30 -57 -3 -119 -163 8 197 66 -17 78
2043 78 64 395 -33 -2 -98 142 190 182 58 15 -79 -27 96 -62 162 -108 -115 -83 65 113 -261 -110 42 138 98
2068 98 83 111 -86 -190 155 187 148 -120 -150 -59 114 -66 127 -64 -281 -126 10 80 217 -444 53 129 265
$$ packed form
1905e5J32M06p81mK08Q7K09l48K15k40M79k69N8J15k09M9p6n5R3n5k80O3J04r7
1929b51N57m16J6k2pM55l59m0J76K57l20K21j28j34K54q6l47J97j37rM63n78J09
1952a29j05L2J51M57l76m1K27k47K49j70j63K71o04L07j9K73k54l3j09K27j37
1973a93k09K84R5n1L96j31J89j32l16K12J22k12j07n8j07K35j36q4j4J96nJ91
1995A65m64K86q9q5K86oj85Q5J82k77J55Q3p5j72j54J68J97q2j92j27l4M61j29
2018cJ23p0j59M7o9K47m33N57k43q7Q0M0k4k41L42p7q7N4j16m4J71J89j31q3R5
2043G8j4L31m28L1r6K40M8qj24m3r4N2J23j58K24k70pL2J48M8l74J51J52R6m0
2068I8j5K8j97j04L45L2l9k68l0R1J73j80J93j91k17J55J36P0J37o61M97P6J36
$$ plain form
2091 265 464 -86 -119 36 139 -24 139 -319 -97 -279 44 320 -80 -42 0 -55 98 27 -27 -35 166 -58 -163
2114 -163 32 -252 224 -128 126 -60 234 -202 81 -82 -32 -226 -407 -148 -34 -35 50 -15 -21 -215 -22 120
2136 120 274 198 4 272 228 -117 11 -427 238 -27 -51 13 -65 -171 -36 22 -9 -138 -104 -67 69 166 -112
2159 -112 -59 46 39 1 -61 -236 -244 -212 299 287 -27 -54 -412 -92 229 -224 50 -145 -343 89 178 -20 2 34
2183 34 118 23 -108 -94 -6 -13 44 45 96 7 75 152 -82 150 -196 55 -207 165 122 87 263 265 57 130 46 -25 -21 -60
2211 -60 -352 25 58 110 -23 -72 -68 -247 -194 63 -120 -197 37 -308 -156 166 -113 473 295 291 -109 -46 43 126
2235 126 50 -267 105 -60 89 -258 -179 -42 -303 347 217 -120 116 -50 -16 156 120 -37 -13 90 53 24
2257 24 -214 -53 71 -362 -217 217 -40 190 131 -118 176 84 78 141 112 -73 -142 -59 172 374 -119 20 -98
$$ packed form
2091B65J99n50l3J55J03j63J63m58K22j82L23K76m00L8M2n5J53p1n4qK01k24j05
2114a63J95k84M76l52K54j86K94m36K83j63N0j94j81K59J14jQ5o5oj94J93J42
2136A20J54p6j94K68m4l45J28m38O65k65k4O4p8j06J35N8l1j29L4L7J36R7k78
2159a12N3J05pl8o2j75qL2N11j2l14k7l58L20L21m53K74j95j98M32Q9j98K2L2
2183C4Q4r5j31J4Q8pN7JN1q9O8P7k34K32l46K51k62L72m3l5J76Kk08P3q4p1Ml9
2211f0k92L77L3N2j33m9Mj79N3K57j83p7K34l45J52L22k79N86j78mm00O3Q9Q3
2235A26p6l17L72j65J49l47P9J37k61O50j30l37K36j66L4J72l6j57K4J03l7k9
2257B4k38J61J24m33J45M34k57K30n9k49K94r2oO3k9j85o9Q3K31K02m93J39j18
$$ plain form
2280 -98 -14 -122 -135 -152 -4 -37 91 -232 -329 -152 13 -60 -67 177 -69 80 126 161 17 -218 -270 -120 111 -25
2304 -25 -21 -236 -189 104 -238 -43 199 -51 -85 109 288 239 31 82 -116 -180 -175 -57 36 -272 -162 185 -63 -144
2328 -144 -383 251 -32 -201 -385 -191 -39 166 94 142 226 85 240 160 152 -150 -59 -266 236 -13 -298 -103
2350 -103 -99 166 38 -55 -83 -64 -151 131 85 -63 146 18 339 -54 64 70 -468 369 124 -54 164 -245 28
2373 28 299 33 305 33 -40 -12 -218 -257 140 -21 79 -35 227 123 21 -46 211 197 135 298 25 -186
2395 -186 -104 125 119 -35 -53 132 -147 -321 108 -118 -151 162 -216 112 272 -103 -43 -207 -220 -38 -125 74 -272
2418 -272 86 -58 88 -67 84 -46 243 -238 62 24 -69 106 -200 -86 -252 73 -331 -250 -161 -213 -111 168
2440 168 -100 117 -152 23 -105 -78 -44 229 187 -256 343 -25 9 -124 493 229 98 -76 -79 155 3 -44
$$ packed form
2280i8Q4j08j3j7J48l3J28l23r7J77J65p3pK44k46J49M6L5j44k35n2J50K31j36
2304b5Mk15M7K93l42J95K42k50l4J94J79m9k08N1j98o4NJ18R3l08J10L47k48q1
2328a44k39O34k83j69j84J94J52K05p2M8Q4j41J55q0ql02R1k07N02k49k85J95
2350a03MK65j28r3k8J9q7K82m6j48K09j28L21l93J18On38Q37k45j78K18m09K73
2373B8K71k66K72k72p3K8k06l9L97j61J00j14K62j04j02o7K57j4o2J63k73k11
2395a86Q2K29oj54j8J85k79j74M29k26l3L13l78L28J60l75O0j64j3J82q7J99l46
2418b72L58j44J46j55J51j30K89m81L00l8r3J75l06J14j66L25m04Q1Q9n2J02K79
2440A68k68K17k69J75j28K7L4K73m2m43N99l68L4j33O17k64j31j74lK34j52m7
$$ plain form
2462 -44 15 -146 -188 -6 -44 -93 -193 114 226 419 -171 252 -151 -73 195 147 68 -15 -38 -228 -37 64 -246
2485 -246 -27 -241 -52 83 -127 280 72 5 220 -30 89 -150 -193 150 106 1 88 -167 131 -21 194
2506 194 160 -270 -88 -296 -308 -172 -240 -282 -49 -112 -155 155 -47 -129 -5 155 41 -156 54 -118 64 198
2528 198 -124 -104 -56 137 114 -40 82 7 -355 144 -10 18 -104 26 -21 233 -9 89 -106 33 58 -179 -133
2551 -133 -108 -18 -183 -159 92 -193 -308 164 141 244 0 -19 -183 127 -136 45 91 44 -294 -59 53 -5 158
2574 158 -257 90 -223 71 -55 115 -127 -270 237 -25 -5 -120 -64 -61 56 87 22 -95 7 -57 -69 -147 22
2597 22 85 -97 157 -107 -198 112 -269 196 -69 62 247 245 150 159 222 -54 -96 164 -39 94 -47 65 147 46
2621 46 -109 58 -129 -103 37 152 -25 -2 -133 126 -145 -23 -87 225 -34 65 73 -187 0 91 167 -40 211
$$ packed form
2462d4N9j61m2J82l8m9j00L07J12J93n90M23m03P8K68m8p9q3k3j90J91J01l10
2485b46K19k14J89J35k10M07k08o7K15k50J19k39m3L43m4j05Q7k55K98j52K15
2506A94l4m30J82k08j2J36o8m2K33o3m3L10k02q2J24J60j14j97K10j72J82J34
2528A98l22K0M8J93k3j54J22p5l62M99j54K8j22J30m7K54k42R8j95J39K5k37M6
2551a33K5R0j65K4K51k85j15M72k3J03k44j9j64L10k63J81M6m7l38K35J12n8J63
2574A58m15L47l13K94j26J70k42j43N07k62K0j15N6LJ17L1o5j17J02o4j2p8J69
2597B2O3j82K54k64r1L10l81M65k65J31J85kr5RO3k76m2K60k03J33j41J12Q2j01
2621D6j55J67j87K6J40J15j77K3j31K59k71J22o4L12k59R9Qk60J87R1P6k07K51
$$ plain form
2644 211 -221 -250 -357 111 -237 154 -115 62 -248 15 24 -271 -14 -243 167 -76 15 174 198 -238 109 -31
2666 -31 140 192 -138 118 201 71 42 -243 44 -41 -4 -33 -4 -153 55 -7 -53 108 -199 270 171 71 73 11 -83
2691 -83 120 78 26 70 293 -123 154 49 -91 36 37 -270 -178 -175 -90 72 -29 150 98 49 49 -183 -10 156 176
2716 176 -20 -203 -59 71 41 7 -158 -2 -263 82 -102 -82 30 78 -99 170 -427 119 42 33 -15 39 32 -54
2740 -54 138 99 -70 80 54 -163 14 290 68 197 180 -67 99 88 233 -14 -26 -55 -63 -92 -72 -50 -194 36
2764 36 -9 -110 278 144 56 63 67 45 236 54 -167 34 12 143 -152 -13 -13 230 88 -37 -151 104 74 -11
2788 -11 -25 128 93 -3 39 140 31 -126 -85 -47 -55 -199 130 -104 -93 -86 6 -104 -207 -28 -72 49 72 123 -71
2813 -71 -88 -98 77 34 -54 -12 90 37 116 51 46 -26 245 -98 -47 50 -166 -11 160 150 -66 -215 -96 -169 130
$$ packed form
2644B11m32k9j07M68l48L91k69J77l10K63Rk95K57k29M10k43R1J59K4m36L47j40
2666c1J71N2l30K56Q3j30k9k85K87q5L7k9K9j49K08o2m6J61l07M69r9j00Ko2r4
2691h3K03m2n2M4K23m16K77j05j40J27Jl07R2LQ5J62j01J79n2m9%k32J73J66K0
2716A76j96j83J44J30l0l4j65J56k61L45j84K0J12M8j77K69n97N46p7rm8N4pq6
2740e4J92l9j69J50k6k17J77K76k22J29j7k47J66j1J45k47j2k9qk9K0K2j44K30
2764C6m5j01L88j34q8PMk2J91j82k21K01k2J31k95J39%K43j42j25j14K55l0q5
2788a1j4J53l5r6M2J01j09j57M1L8qj44L29k34J1PR2j10j03J79m4J21K3N1j94
2813g1j7j0J75m3q8M2J02n3P9o5np2K71l43N1R7k16J55J71j0k16j49J19p3K99
$$ plain form
2838 130 79 243 -53 -34 121 51 -53 70 180 139 109 -214 25 3 58 79 -39 317 67 1 114 -147 -212
2861 -212 143 73 86 51 -241 72 -97 -366 188 -55 -273 -261 242 128 100 -146 55 95 -109 55 -146 -41
2883 -41 90 -278 -100 -22 68 -378 -206 -89 6 -71 -196 -30 -279 -32 -42 -224 232 55 129 -10 -72 -7 35
2906 35 106 210 -131 38 58 180 1 -220 -127 -414 -59 60 329 76 140 -115 84 -16 -51 100 -251 65
2928 65 -165 237 -266 280 250 -119 -122 117 26 -15 -87 103 -44 471 -139 93 -178 -167 -64 -15 -114 93 -153
2951 -153 -181 -147 8 25 -22 193 49 152 234 87 -141 -63 126 243 -190 158 67 343 -117 70 84 173 -53
2974 -53 90 -64 -25 160 31 -101 242 -22 -49 85 -15 -209 125 130 236 -142 4 72 31 126 352 94 3
2997 3 -11 -146 -63 -28 74 173 -1 121 74 -214 -72 -136 -123 -51 -54 -64 -43 -320 109 108 -23 -70 -117 274 48 88
$$ packed form
2838A30n1J64k96J9J55p0j04J23J10m1l0l23K39k2N5K1j18L56k50o6J13k61o5
2861b12L55p0J3l5k92L13j69k69N54k43k18J2N03j14k8k46K01M0k04J64k01J05
2883d1J31l68J78P8R0m46J72J17R5p7j25J66k49K47j0j82M56j77P4j39o2O5M2
2906C5P1J04l41J69K0J22j79k21R3k87L55J19K69k53O4k55J99j00l5J51l51L16
2928F5k30M02n03N46l0l69lK39r1m1p2J90j47N15o10K32k71J1J03M9r9K07k46
2951a53k8L4J55J7m7K15j44J03Q2j47k28P8J89J17m33L48r1K76m60J87J4Q9k26
2974e3J43j54L9J85j29j32L43k64k7J34j00j94L34NJ06l78J46O8m1R5K26k58r1
2997Cj4j35Q3L5J02R9j74J22m7k88J42o4J3P2lj0K1k77M29jj31m7m7L91k26M0
$$ plain form
3023 88 33 -90 252 -40 60 -59 45 157 -59 -225 66 102 31 -117 -146 -87 21 28 41 150 -60 -14 -133
3046 -133 -263 6 -12 35 -39 -205 -9 -11 61 170 151 47 22 -131 16 -16 202 -202 169 76 58 36 20 99 76
3071 76 -216 54 -139 88 104 -213 -37 194 -11 -300 34 -80 -56 21 -79 311 -21 -95 84 -218 -34 -39
3093 -39 155 65 -95 -87 223 -31 36 -132 -278 -21 -212 -90 67 112 -19 -101 -60 -429 21 182 60 -8 121
3116 121 -126 251 137 -32 212 -286 307 98 65 0 -156 -1 81 -164 -26 -43 -25 16 -47 -160 27 -211
3138 -211 -166 -139 -230 33 -43 -52 187 -110 -65 120 -54 77 -40 109 176 -192 128 -41 52 244 20 -14 96
3161 96 -231 127 202 162 -9 -53 -78 97 138 -103 -99 -15 -107 -84 -9 -262 -224 16 -97 -82 115 137 97 -47 -58 174
3187 174 131 19 197 -115 -196 184 -50 -56 37 -208 23 -20 34 182 -82 152 12 -27 -265 157 212 -305 -31
$$ packed form
3023H8n5j23L42k92J00j19J04J12k16j66K91L6p1j48k9N9J08PJ3J09k10M6j19
3046a33j30K69j8M7p4j66J96kP2J09j9j04k5j53J47l2K18m04L71r3j8k2j6P9k3
3071G6k92K70j93K27J6l17J76K31k05k89L34j14K4P7j00L90l32p4J79l02J84n
3093c9J94r0j60QL10k54O7j68j46K57j91J22J57M5j31q2M1l69M50J61j22o8J29
3116A21k47L77j14j69K44m98N93k09l3o5j56J55Q2k45J38j7J8M1o3j13J87k38
3138b11M5K7r1K63p6rK39k97M5J85j74J31j17J49O7l68L20j69R3J92k24l4J10
3161I6l27L58P5m0j71m4k5J75M1k41MQ4r2K3P5k53L8K40j13J5J97K2m0j44j1K32
3187A74m3j12J78l12q1L80k34oR3k45K31m3N4J48k64K34j40l9k38M22N5n17K74
$$ plain form
3210 -31 74 47 -264 -197 -154 -15 178 14 36 -248 50 12 4 -114 -70 50 48 -290 -65 149 64 31 255 7
3234 7 -1 195 234 162 -83 16 -44 96 -98 0 17 76 -65 -202 56 -99 262 203 -168 -2 13 -177 275 48
3258 48 -30 -379 84 182 235 56 188 -155 -63 -48 -73 155 -129 78 33 -24 -84 89 -48 13 -164 126 -215 5
3282 5 14 166 -45 -229 13 194 65 28 108 158 -37 -136 180 -17 -130 -218 37 54 -101 -49 26 -81 -19 246
3306 246 -38 -25 193 74 191 15 20 97 -28 189 -31 -20 20 160 156 -12 -72 -87 -2 -131 173 -83 -8 -265
3330 -265 185 -261 -225 43 -89 94 -111 42 106 -85 -289 -179 -103 206 104 -152 117 123 -70 60 -117 -112
3352 -112 43 -216 6 126 -83 -112 208 92 -25 247 -18 154 -7 63 -146 48 279 203 26 291 112
3373 112 74 -90 -61 -76 256 -170 -32 18 -53 51 98 -116 31 16 4 27 93 34 -236 -180 109 33 47 -50 -67
$$ packed form
3210c1J05k7l11O7M3J39J93j64K2k84K98l8qj18M4J20kl38K25K14q5l3K24k48
3234GqJ96L9p2k45R9o0J40j94R8J7N9j41j37K58j55L61n9l71J66J5j90M52k27
3258D8p8l49M63R8N3j79J32l43R2J5k5K28k84K07m5n7o0J73j37O1j77K90l41K20
3282ERJ52k11j84K42J81j29l7Q0N0j95r9L16j97j13q8K55J7j55N2P5j07O2K65
3306B46k84J3K18j19J17j76NP7j25K17k20J1M0J40mj68o0j5Q5j29L04k56P5k57
3330b65M50m46L6K68j32J83k05J53O4j91k04J10P6L09j02k56K69Oj93J30j77N
3352a12J55k59K22J20k09k9L20j16j17K72k65J72j61P0k09J94K31p6j77K65j79
3373A12l8j64K9j5L32m26J38N0p1J04M7k14J47j5j2K3O6n9k70N6K89p6J4r7j7
$$ plain form
3398 -67 -48 -273 7 44 -84 -30 -14 140 344 117 -30 104 -53 25 -86 -167 94 150 24 162 185 109 43 -170
3422 -170 348 -71 120 65 15 -53 79 -49 200 82 108 -106 -40 93 -2 99 -494 200 55 -61 17 -221
3444 -221 28 -49 -173 -96 -71 47 -35 76 -249 -129 23 62 -80 52 95 -220 95 -111 223 147 83 -153 132
3467 132 -195 171 60 261 -137 8 -41 -45 -247 -47 375 41 -5 142 -32 -6 42 -83 137 -214 306 121
3489 121 161 59 -88 -208 -38 187 139 10 -26 14 -44 -147 240 30 162 -205 48 32 -35 -5 -112 76 27
3512 27 -79 192 16 121 82 -220 51 59 75 -13 -169 3 -8 -43 188 20 -94 -128 -12 44 7 114 112 -152
3536 -152 76 232 -107 64 -103 175 93 126 -134 143 -207 287 229 -110 214 -114 31 -89 -58 -426 289
3557 289 -86 8 32 -70 249 -83 -34 147 -2 277 164 -78 -86 -258 -183 -66 65 -182 199 53 -1 -46 3
$$ packed form
3398f7J9k25K80L7j28N4J6J54K04k27j47J34j57P8j11q1K61N6j26J38K3p6o6k13
3422a70N18m19J91n5n0o8J32j28K49j18K6k14O6J33r5J01n93O94j45j16P8k38
3444b21K49p7j24P7K5J18q2J11l25J20J52L9j42J32M3l15L15k06L34p6o4k36K85
3467A32l27L66j11K01l98J45m9mk02K00M22l34m6J47j74K6M8j25K20l51N20j85
3489A21M0j02j47j20J70K25m8j29l6M0n8j03L87k10J32l67K53j6o7L0j07J88m9
3512B7j06K71j76J05l9l02K71QJ6q8j56J72j1l5K31j68j14l4J16N6l7J07kk64
3536a52K28J56l39J71j67K78q2L3k60K77l50M94n8l39L24l28J45j20L1l68P15
3557B89l75R4K4j02L19l32M9J81j49K79j13k42qj72P5J17J31k47L81j46n4m5M9
$$ plain form
3580 3 -62 -3 -247 -120 -58 -159 -55 -174 -201 -130 176 -127 131 283 15 195 180 -15 -173 -39 -100 124 70
3603 70 76 15 89 4 -89 164 49 192 -149 18 -282 -132 -109 -171 -56 155 373 -80 -79 6 30 -168 -233 140 99
3628 99 96 82 272 26 -133 -82 -4 -98 -205 -21 53 -374 51 -105 -96 -14 112 126 -241 -135 134 32 -62 53
3652 53 -130 185 -61 114 -166 -100 65 210 96 -211 95 -114 -175 201 -116 -263 137 87 -44 49 76 -24
3674 -24 198 -149 -86 -78 -77 -143 37 219 -254 13 43 -23 258 -54 -56 -44 10 131 -126 -130 133 251 -100 15 59
3699 59 261 300 24 284 -52 -236 161 -353 95 199 59 -208 -88 -218 -42 97 71 198 195 -87 -119 148
3721 148 82 87 -157 23 60 -148 3 -33 68 257 -46 184 82 401 11 87 135 350 -158 -158 -384 13 -116
3744 -116 -225 14 -144 0 -88 39 88 -43 -114 -24 -144 -188 -72 52 5 139 196 45 -140 40 97 16 -148
$$ packed form
3580Co5N9k44J27O2j01J04j19k7P1L06l03K58J52k68J80j5j95j58J34o1K24n4
3603G0Oo1P4q5r3K53j15J43l41J67l00J50K3o2J15K11K18m53JQ5K4j98o5L73m1
3628I9lj4J90k46j59N1P8r4j07J84P4m27M25j56RQ2J26J4l67J06K69j02r4J15
3652E3j83L15k46J75k80O6J65J45j14l07L06k09o1L76l17j47M00n0j31R3K7j00
3674b4K22l47O3QJo6J80J82m73K67L0o6K81l12kJ2N4J21k57mK63J18l51J15M4
3699E9K02L9k76K60l36j84L97n14M48J04j40k67J20j30J76J39k6J27lk82l2K67
3721A48o6Nk44J80L7k08J51l6J01J89l03K30j02L19l90P6M8K15n08%k26L97j29
3744a16j09K39j58J44q8J27M9j31p1R0j20m4J16J24m7J34N7j51j85J80N7q1j64
$$ plain form
3767 -148 44 119 -119 -191 -140 116 -60 -49 131 -51 -102 -22 -32 -54 15 29 90 22 -126 -190 120 53 106 -231 74
3792 74 165 2 207 -229 227 -159 -160 59 -14 26 10 125 351 -23 46 107 243 -9 -13 68 123 82 -178 -148 -106
3817 -106 223 136 87 -53 -137 -146 20 98 38 47 44 63 334 -104 113 -246 193 -120 12 59 -295 -173 -85 -355 139
3842 139 333 -44 6 -86 84 124 120 -5 43 23 -92 112 -90 -263 14 -160 -1 118 124 10 -215 -47 7
3865 7 -41 -124 28 4 121 -200 -299 -178 272 -7 -110 -67 249 6 275 -186 92 38 -13 -10 92 175 161 159 20
3890 20 -91 -157 52 159 205 12 -127 -47 241 69 22 150 52 122 -87 126 -20 -92 59 -140 105 -24 88
3913 88 22 -10 -64 -22 -166 215 116 25 -130 -149 -26 192 17 -19 19 -88 28 -47 -115 264 -10 -95 108 183 -206
$$ packed form
3767a48J92P5k38p2N1K56j76J1J80j82n1Q0j0k2O9J4O1o8j48o4L10o7N3l37L05
3792G4R1j63K05m36M56l86jK19p3M0j6J15K26l74O9O1J36k52mQ1N5m1k60L0M2
3817a06L29q7m9j40q4rJ66P8o0RlJ9K71m38K17l59M39l13J32M7l54J22Q8k70M94
3842A39J94l77N0r2J70M0mj25M8k0j15K04k02j73K77j74J59J19Oj14k25J68N4
3865Gm8q3J52k4J17l21r9J21M50k79j03M3L16k43K69m61K78n4n1LJ02Q3j4kj39
3890B0j11o6K09J07M6j93j39Q0K88j72m7J28r8P0k09K13j46p2J51j99K45j29J12
3913H8o6l2n4M2j44L81r9r1j55j9J23K18j75l6L8j07J16p5o8L79k74q5K03P5l89
$$ [...]
8191B07
##END NTUPLES=NMR FID
##END=
