##TITLE=1H_Ser AmS-NM3
 200.13Hz, CDCl3.
 8 sc
 
23.3.2026
##JCAMPDX= 6.0         $$ Bruker NMR JCAMP-DX V2.0
##DATA TYPE= NMR FID
##DATA CLASS= NTUPLES
##ORIGIN= UXNMR, Bruker Analytische Messtechnik GmbH
##OWNER= pz
$$ XWIN-NMR		Version 3.5
$$ Mon Mar 23 16:08:54 2026 Russian Standard Time (UT+4h)  she@DPX200
##.OBSERVE FREQUENCY= 200.1313
##.OBSERVE NUCLEUS= ^1H
##.DELAY= (6, 6)
##.ACQUISITION MODE= SIMULTANEOUS
##.ACQUISITION SCHEME= undefined
##.AVERAGES= 8
##.DIGITISER RES= 18
##SPECTROMETER/DATA SYSTEM= spect
##.PULSE SEQUENCE= zg30
##.SOLVENT NAME= D2O
##.SHIFT REFERENCE= (INTERNAL, D2O, 0, 14.3821)
##AUDIT TRAIL= $$ (NUMBER, WHEN, WHO, WHERE, WHAT)
$$ ##TITLE= Audit trail, XWIN-NMR		Version 3.5
$$ ##JCAMPDX= 5.01
$$ ##ORIGIN= Bruker BioSpin GmbH
$$ ##OWNER= she
$$ F:/spectra/data/she/nmr/H-C/1/audita.txt
$$ ##AUDIT TRAIL=  $$ (NUMBER, WHEN, WHO, WHERE, WHAT)
(   1,<2026-03-23 16:07:25.53 +0400>,<she>,<DPX200>,
      <created by zg, POWCHK disabled, PULCHK disabled
       configuration hash MD5:
       00 E9 B6 7A A2 85 ED C7 34 08 36 98 17 FE 4E 26
       data hash MD5: 16K
       25 29 B6 C2 8A 22 E2 ED EE 57 AA 97 C3 64 2B 13>)
$$ ##END=
$$ 
$$ hash MD5
$$ 29 DE D0 9A DF 86 AD 54 6A 42 A7 C7 BD 2C EA B3
##$RELAX= 
##$RELAX= 
##$RELAX= 
##$RELAX= 
##$RELAX= 
##$RELAX= 
$$ Bruker specific parameters
$$ --------------------------
##$DU= <F:/spectra>
##$EXPNO= 1
##$NAME= <H-C>
##$PROCNO= 1
##$TYPE= <nmr>
##$USER= <she>
##$AMP= (0..31)
100 100 100 100 100 100 100 100 100 100 100 100 100 100 100 100 100 100 
100 100 100 100 100 100 100 100 100 100 100 100 100 100 
##$AQSEQ= 0
##$AQ_mod= 1
##$AUNM= <au_zg>
##$AUTOPOS= <>
##$BF1= 200.13
##$BF2= 200.13
##$BF3= 200.13
##$BF4= 200.13
##$BF5= 200.13
##$BF6= 200.13
##$BF7= 200.13
##$BF8= 200.13
##$BYTORDA= 1
##$CFDGTYP= 0
##$CFRGTYP= 5
##$CHEMSTR= <none>
##$CNST= (0..31)
1 1 145 1 1 1 1 1 1 1 1 1 1 1 1 1 1 1 1 1 1 1 1 1 1 1 1 1 1 1 1 1 
##$CPDPRG= <>
##$CPDPRG1= <>
##$CPDPRG2= <>
##$CPDPRG3= <>
##$CPDPRG4= <mlev>
##$CPDPRG5= <mlev>
##$CPDPRG6= <mlev>
##$CPDPRG7= <mlev>
##$CPDPRG8= <mlev>
##$CPDPRGB= <>
##$CPDPRGT= <>
##$D= (0..31)
0 0.7 0 0 0 0 0 0 0 0 0 0.03 0 0 0 0 0 0 0 0 0 0 0 0 0 0 0 0 0 0 0 0 
##$DATE= 1774267644
##$DBL= (0..7)
120 120 120 120 120 120 120 120 
##$DBP= (0..7)
150 150 150 150 150 150 150 150 
##$DBP07= 0
##$DBPNAM0= <>
##$DBPNAM1= <>
##$DBPNAM2= <>
##$DBPNAM3= <>
##$DBPNAM4= <>
##$DBPNAM5= <>
##$DBPNAM6= <>
##$DBPNAM7= <>
##$DBPOAL= (0..7)
0.5 0.5 0.5 0.5 0.5 0.5 0.5 0.5 
##$DBPOFFS= (0..7)
0 0 0 0 0 0 0 0 
##$DE= 6
##$DECBNUC= <off>
##$DECIM= 32
##$DECNUC= <off>
##$DECSTAT= 4
##$DIGMOD= 1
##$DIGTYP= 9
##$DL= (0..7)
0 120 120 120 120 120 120 120 
##$DP= (0..7)
150 150 150 150 150 150 150 150 
##$DP07= 0
##$DPNAME0= <>
##$DPNAME1= <>
##$DPNAME2= <>
##$DPNAME3= <>
##$DPNAME4= <>
##$DPNAME5= <>
##$DPNAME6= <>
##$DPNAME7= <>
##$DPOAL= (0..7)
0.5 0.5 0.5 0.5 0.5 0.5 0.5 0.5 
##$DPOFFS= (0..7)
0 0 0 0 0 0 0 0 
##$DQDMODE= 0
##$DR= 18
##$DS= 0
##$DSLIST= <SSSSSSSSSSSSSSS>
$$ [...]
##$SUBNAM0= <"">
##$SUBNAM1= <"">
##$SUBNAM2= <"">
##$SUBNAM3= <"">
##$SUBNAM4= <"">
##$SUBNAM5= <"">
##$SUBNAM6= <"">
##$SUBNAM7= <"">
##$SUBNAM8= <"">
##$SUBNAM9= <"">
##$SW= 18.0517328524113
##$SWIBOX= (0..15)
0 0 2 0 0 0 0 0 0 0 0 0 0 0 0 0 
##$SW_h= 3612.71676300578
##$TD= 16384
##$TD0= 1
##$TE= 0
##$TE2= 300
##$TE3= 300
##$TEG= 300
##$TL= (0..7)
0 120 120 120 120 120 120 120 
##$TP= (0..7)
150 150 150 150 150 150 150 150 
##$TP07= 0
##$TPNAME0= <>
##$TPNAME1= <>
##$TPNAME2= <>
##$TPNAME3= <>
##$TPNAME4= <>
##$TPNAME5= <>
##$TPNAME6= <>
##$TPNAME7= <>
##$TPOAL= (0..7)
0.5 0.5 0.5 0.5 0.5 0.5 0.5 0.5 
##$TPOFFS= (0..7)
0 0 0 0 0 0 0 0 
##$TUNHIN= 0
##$TUNHOUT= 0
##$TUNXOUT= 0
##$USERA1= <user>
##$USERA2= <user>
##$USERA3= <user>
##$USERA4= <user>
##$USERA5= <user>
##$V9= 5
##$VALIST= <valist>
##$VCLIST= <CCCCCCCCCCCCCCC>
##$VD= 0
##$VDLIST= <DDDDDDDDDDDDDDD>
##$VPLIST= <PPPPPPPPPPPPPPP>
##$VTLIST= <TTTTTTTTTTTTTTT>
##$WBST= 1024
##$WBSW= 4
##$XGAIN= (0..3)
0 0 0 0 
##$XL= 0
##$YL= 0
##$YMAX_a= 86574
##$YMIN_a= -108236
##$ZGOPTNS= <>
##$ZL1= 120
##$ZL2= 120
##$ZL3= 120
##$ZL4= 120
##$ABSF1= 10
##$ABSF2= 0
##$ABSG= 5
##$ABSL= 3
##$ALPHA= 0
##$AQORDER= 0
##$ASSFAC= 0
##$ASSFACI= 0
##$ASSFACX= 0
##$ASSWID= 0
##$AUNMP= <proc_1d>
##$AZFE= 0.1
##$AZFW= 0.1
##$BCFW= 1
##$BC_mod= 2
##$BYTORDP= 1
##$COROFFS= 0
##$CY= -3
##$DATMOD= 1
##$DC= 2
##$DFILT= <>
##$DTYPP= 0
##$F1P= 0
##$F2P= 0
##$FCOR= 0.5
##$FTSIZE= 0
##$FT_mod= 4
##$GAMMA= 1
##$GB= 0.15
##$INTBC= 1
##$INTSCL= 1
##$ISEN= 128
##$LB= 0.25
##$LEV0= 0
##$LPBIN= 0
##$MAXI= 10000
##$MC2= 0
##$MEAN= 0
##$ME_mod= 0
##$MI= 1.114404
##$NCOEF= 0
##$NC_proc= 0
##$NLEV= 6
##$NOISF1= 3.799351
##$NOISF2= 2.8
##$NSP= 1
##$NTH_PI= 0
##$NZP= 0
##$OFFSET= 14.38212
##$PC= 1
##$PHC0= -3708.354
##$PHC1= 16.9923
##$PH_mod= 1
##$PKNL= yes
##$PPARMOD= 0
##$PSCAL= 0
##$PSIGN= 0
##$REVERSE= no
##$SF= 200.129724274929
##$SI= 16384
##$SIGF1= 3
##$SIGF2= 2
##$SINO= 400
##$SIOLD= 16384
##$SREGLST= <1H.CDCl3>
##$SSB= 0
##$STSI= 0
##$STSR= 0
##$SW_p= 3205.1282051282
##$SYMM= 0
##$S_DEV= 0
##$TDeff= 0
##$TDoff= 0
##$TI= <>
##$TILT= no
##$TM1= 0
##$TM2= 0
##$TOPLEV= 0
##$USERP1= <user>
##$USERP2= <user>
##$USERP3= <user>
##$USERP4= <user>
##$USERP5= <user>
##$WDW= 1
##$XDIM= 8192
##$YMAX_p= 0
##$YMIN_p= 0
$$ End of Bruker specific parameters
$$ ---------------------------------
##NTUPLES= NMR FID
##VAR_NAME=  TIME,          FID/REAL,        FID/IMAG
##SYMBOL=    X,             R,               I
##VAR_TYPE=  INDEPENDENT,   DEPENDENT,       DEPENDENT
##VAR_FORM=  AFFN,          ASDF,            ASDF
##VAR_DIM=   8192,          8192,            8192
##UNITS=     SECONDS,       ARBITRARY UNITS, ARBITRARY UNITS
##FACTOR=    0.0002768,     1,               1
##FIRST=     0,             0,               0
##LAST=      2.2672688,     0,               0
##MIN=       0,             -108236,         0
##MAX=       2.2672688,     86574,           0
$$ Real data points
##PAGE= N=1
##DATA TABLE= (X++(R..R)), XYDATA
$$ [...]
1555A19j37L0j26L15k21J48p5P0l8l6j04K2j7P6l6K90j18j26j44j31J01J31M4
1578C7n7R7j29J25L7j6k66L7K64q9O8r1m5Jj63Q1Q1o6j67L77r2K16k28J83j93
1603BJ63l43J22J81k2k84K60R4n4k0k86J62j60J42L2r4J09L1j15j58J65p6K25
1626G6l8n4j31K34j14M31n77M07k21j27L54k66K1j02J40J09k54J94J26m24L6J1
1648a69L56j74J05j43j21L53r8o9M0l2j47J55l4L7N8k53j16J59R1p7J78k42R2
1671e1k12L50l4j55J48j41J97p8J67j85k2pOL8j1o2O5j85J04J05j41J17J55r3
1695G5R3J7k16lR5R2k84K15k5j63j2N4K32r8j77j32J31J7Q9j34n9j9J58n9K11
1720I8J79j89j56k5o5R3M4N0M0p1q1J71o7k2J08m92M46j22K34j68L9o6K08k39
$$ y = [119, -18, 12, -114, 201, -20, 128, 53, 123, 85, 49, -55, -33, -50, 26, -10, 280, 162, 36, -108, -239, -138, -7, 37, -20, 77, -52, 73, 110, 94, -172, -135, 129, 40, 108, 17, -28, -27, -190, -109, -28, -94, -261, 116, 24, 240, 12, 195, 2, 165, -178, -56, 125, 103, -181, 79, 173, 119, 99, -187, -25, -185, -43, -11, -105, 4, 35, -80, -238, -73, -149, 76, 38, -16, -147, 87, -27, 404, -173, 234, 13, -114, 240, -26, -5, -107, 33, 142, -112, 82, 208, -216, -180, -169, 187, 13, 118, -25, -146, 207, 109, 40, 80, 48, -99, 56, 22, 59, 117, -136, -252, -93, -2, -79, 99, -143, -51, -263, 87, 53, -102, 46, -95, 102, 24, 191, 6, -16, -23, -17, 21, 10, -52, 13, -172, -68, 37, -104, 13, 168, 75, 168, 185, -31, -34, 61, 153, -131, 84, 59, -104, -116, -62, 170, 72, -105, -237, -106, -89, 0, -134, -193, -212, -54, -113, 98, 277, 88, -68, -93, -158, -65, -21, 29, 69, -2, -83, 88, 21, -1, 107, -385, 61, -61, 173, 5, 44, -22, 186, -53]
1744e3K46O6k71j69L7J61Q2l16O8O2j88K77n6K12j61j36K7L5K39j39k1J01Qj01
1768A0m1j62j7J48j54K59j0k05Q6n8J62J44n0j73P6j22P4J63O9j06p4Q3n7L5l8
1793D2j44PK67m03K33n5J8M6j69K64j98R7J88J9j68J01j39K34j66M6j92M6n4L2
1817d8p6J40n2J7K86m15j06L14m0k45M34j30k6p4j75M97k35K1k56K0O9L4J82j49
1841a3j89K7n1O7K06J17j00N2p8j19M3J25l07J76J04RK1k09K49j68P8J26j41k02
1865a77O9p2L24k11k6J34j95L42j98J63L9j4Nm04K60rl9n3Q8r%j08J64j46q8J17
1891d4J29j07J04R3k29L9ml3n6r7M02l44K60L7k72J98o7j44m8j37J77R8K9J2R7
1916I3LQ5n8Pl74L09j59k9L18j16j53J32J1k16K02k45K03j13j05J48k16K46q1
$$ y = [-53, 193, 259, -12, -181, -144, 17, 99, -217, -149, -87, -275, 2, -54, 158, -3, -139, -112, -77, 162, 23, 2, 103, 111, 10, -31, -193, -210, -62, -216, 43, 33, -172, -86, -144, 18, 162, 112, -61, 15, -107, -33, 130, 199, 93, 19, 102, 45, 80, 42, -102, -95, 172, -231, 2, -53, -35, 11, -158, 106, -92, 5, 193, 212, 44, 145, 6, 240, 74, 120, -72, -26, -80, -48, -124, 16, -36, -19, 267, -148, -254, 60, 20, -225, 209, 79, 53, -21, -196, 301, 66, 87, -169, -149, -80, -46, 136, -13, -202, -175, -226, -159, 47, 164, 64, 116, 38, -81, -38, 87, -220, -44, 60, 69, 90, -119, 130, -38, 40, 166, 25, -177, -108, -180, 144, -67, -93, 41, -154, 188, -10, 153, 192, 178, 183, -221, 39, 30, -9, -62, 26, 17, 17, -91, 73, -73, -161, -44, 85, -22, 82, 175, -54, -15, -19, -52, -108, -205, 197, -147, 113, 150, -122, 76, 9, -135, -183, -320, -143, -45, -16, -4, 93, 96, 181, 123, 130, -244, 65, -94, -123, 195, 79, -74, 58, 69, -147, 55, -190, 13, -100, -205, -57, -273, -27, -108]
1939a08J3J84l1l8J15j89K5R5k8K3k33Q9k3Q0Q1L9l43L39l09J82K3J87j70J22
1963A25J37k26P3O4j05P3j4J4P5o1k09o5Q9j91R0N3R3M3M4qK4k22J25Qo2r1N3
1990g1J35m6m5J09j72J81k47J75p4O7L2j61j2R4jk3j9K61O3m14J84P1j13M3j32
2015a15K2j08J33R7K5k01j5J29j24K61Q3k06j25J30o5J73J13k13J8j20K58J8j18
2038E0k21j4J83K08q0j69J91l41J59K75m38K09J02j11k23K72M5j29O9j6K06l22
2060i5J13N2J64k08Pl1O2%l72K38k6L42l24R0j8J48j19N0j55K45l35K58k85K69
2084G0j03j7N9j6j28K2K74jj67J60j74r9M04l17L12l95K99k45J84M4j12j94L46
2107B06r8l66K51mJ5p1o8ML5mJ98j6O0r7O8j93J49o4L31k60j30J20l04M09k91
$$ y = [-108, -95, 89, 58, 20, 135, -54, -29, 66, 38, 61, -172, -83, -106, -26, 55, 94, -249, 90, -219, -37, -14, 173, 3, 125, 262, 36, 109, 173, 68, 141, 127, 141, 216, 155, -54, -119, -30, -221, -131, -78, 15, 58, 102, 94, 118, -104, 21, 29, -33, -124, -71, 64, 18, -27, 82, -90, 91, -156, 19, -55, 12, 44, -117, -129, -35, -36, -59, -78, 183, 246, -168, 16, 87, -26, 17, -115, -93, -201, -68, 29, 54, -147, -162, -33, -157, 104, 187, -19, -144, -14, -79, 94, 207, -6, 12, -108, 150, 168, 50, -171, -185, -2, 206, 126, -43, 148, -193, -34, 241, -197, 12, 114, 3, -220, 52, 97, -32, 37, 21, 227, -95, 18, 70, 234, 26, 33, 2, 64, 64, -308, -70, -96, 246, -78, 12, -6, 142, 23, 73, -82, 163, -172, 86, -199, 70, -33, -50, 9, -7, -135, -113, 161, 160, -7, 153, -21, -120, 284, -33, 279, -116, 183, -62, 122, 166, 54, -140, 206, 108, -258, -7, -11, 4, -67, -135, -131, -96, -100, 98, 82, 142, 45, 113, -80, 69, 5, 336, 76, -54, 66, -238, 171, -120]
2132a20j10Q5Q4K53k74J58j1N1o3q7L20j54k0J39l91K37k55K36j57K53r3k04j06
2155b29M1K19j07J34k63K8J70k7n9P7j41p5J98K45k84J23J5o7N6K00j26k99L65
2178A94Kl79N9K07j86K5K22j45r1J69Q8l17k1P1L2P3o6M4P6j32O5j90P9P6O2p8
2204f1Jk1j08K18j38J00R8j38Q7k1M6j83J10kj24J42j87J3J25n8r0K00J29k61
2228a23K22l07K99j46k9K87j72k9R0j92j83L17o7Lm0OJ7J54j40p5K06n6PMJ6L4
2254A03k62J70N4M3K7ok81K79K3n4n6k23M5OK3j4K07J0j47K4J09j8j87L51k94
2279f8N7K4k14O3j9K99%q4j62m1l0j5J84N9n0j79J35j21K2K41O3J9l7j77n0J36
2305E5m3K95j90j99j13R0J08P4j0O9k16J53j30l8J62J17q3m6j84L21l93p3L46
$$ y = [-120, -230, -145, -61, 192, -82, 76, 65, 116, 53, -34, 286, 132, 112, 251, -140, 97, -158, 78, -79, 174, 81, -123, -229, -188, 31, -76, 58, -205, -177, -7, -34, -93, -16, -157, -232, -34, 211, -73, 50, 65, -2, 54, 254, 128, -171, 194, 196, -183, -124, 83, -103, -78, 144, -1, -92, 77, 165, -152, -173, -102, -70, 3, -63, -19, 57, -75, -10, -200, -121, -45, 17, -61, -60, -81, -189, 29, -109, -9, 89, -49, 38, 17, 63, -120, -10, -12, -136, 6, -181, -168, -43, -101, -191, 9, 138, -123, 99, -208, 91, -55, -84, 203, 31, 2, 92, -100, -283, 34, -33, -30, -70, -64, -47, 107, -33, -108, 98, 42, 49, 53, 69, 103, -159, 11, 65, 108, 135, 129, -152, 127, 150, 96, 40, -183, -138, -132, -109, -123, 84, 94, -53, -29, 80, 62, -125, 226, -68, -11, 13, -201, -138, -157, 142, 142, 58, -104, -145, -175, -190, -6, 53, 3, -176, -41, -162, -140, 101, 164, 183, 146, -31, -81, 55, 12, 307, 117, -82, -195, -105, 3, 77, 67, 136, -80, 73, -57, -95, 67, 184, 101, 55, -129, 192, -201, -274, 72]
2328G2Oj04R3k73K06m8J2k2q3N8L1n5J49O3M7j74J72J3n8o2j62K1K8K00k47J01
2354a6k4M3r3J97j81J14j10J14O3j88K12j94J39k90L20k82J16j43J43j7J34j98
2376a41J78j10n7J1J74k0k62K32j58Q7N9j5p1L9J19J24K3l45J51P8j0l19L90k5
2400A32k59K9K25o2o7K7pk26K60j52J56J2qJ69l14M7m1M8P4M5k13O5j59K94j08
2425c3J32q5qJ61k49RJ26j61q0J55l1q5K13l1k45J04k02L41q5J65n2k78J44lk0
2450i8K49j80K34m02L76j98n8l4RP7Rk61L54Ql16L17q3pp9K07k13J46l8J1K87
2475C17l03K7j69L8N7Q5J26n4m2k1K04l41OR7J6m4n0R3k21P7J08r2k0o7J48j56
2501a81K17r7L41l26k4P3j32P8J4k0J65k04N3K17j78J64j63J73N2k47L0N5R3q6
$$ y = [72, 78, -26, 67, -206, 0, -48, -36, -58, -141, -83, -52, -107, 42, 105, 152, -22, 150, 163, 105, 43, -119, -98, -70, 130, -117, -16, -40, 3, -90, 107, -74, 40, -70, 44, 107, -81, 131, -63, 76, -214, 106, -176, -60, -203, -60, -77, 57, -141, 37, -73, -130, -119, 55, 35, -227, 5, -153, -66, -7, -22, -93, -54, 65, 189, 212, -133, 18, 96, 86, -233, 157, 132, -127, -98, 127, 65, -2, 25, 18, -208, 52, -100, 56, 68, 60, 229, -85, -38, -79, -31, 43, 88, -125, -60, -219, 75, -33, 99, 14, 6, 167, -82, -73, 53, -108, -188, -33, -64, -149, 64, 33, -212, -108, -310, 31, -54, 111, 59, -219, -75, -78, -98, 151, -29, 205, -197, 179, -19, -77, -111, -102, -25, -16, -277, 77, 85, -231, 86, 3, -4, -83, 124, -89, 57, 19, 30, 317, 14, 41, -128, -90, -33, 52, 178, 124, 82, 61, 265, -76, -70, 27, 43, -1, -51, 42, -179, -102, 6, -86, -106, -173, -25, -181, 36, -61, 280, -46, -70, 3, -129, -51, -37, -57, 108, -96, -43, 174, -4, 160, -3, 170, 222, -25, 5, 60, 153, 67]
2525F7k5k48K01J9M5j38J31n9o4j00k3L01m3q8o3K09q5P9o7m8Jj15K11j4j36L53
2551C01m00K5M3q7N9Q6k13J48r3K39nJ01k42L2Q7J55k63n2J4J93j74j31K80Op4
2576C5m9m5J86k05j25L12k49J55j2r1O7m2J7L9k3K11j02l7j72K31Nj59Q5K14l17
2601g1m0J11n4J8n4l5Q9q8J37k0j03l0J64k7O4q8k49L32M0q7j08K01k8k0O1j12
2627Cjn1o0j5K49k2p7j00J55m6n3nJ34k47J61L1k47K17R0j83M2j45J35L08l21
2652d8l4K10n4r9N0k5kJ3Nq1J08j26J80j08j6J33n6j72J70P9m8r3j22K28K4j07
2678Il1n4j44R5j2K07n7j81K07K5J3K4q1P2q6Q2o9Q1k00N2K34j74N1j85J33J20
2704A31k68K91k3n3k01j9J40K48l67L0P1m6n3J89j30l3K5q4J26J59j01M3K3q2
$$ y = [67, 42, -206, -5, 14, 59, -79, 52, -7, -71, -171, -194, 107, 64, -24, -87, 122, 37, 116, 49, 1, 2, -113, 98, 84, -52, 301, -99, -74, -31, -118, -59, 27, -186, -38, -131, 108, 103, 204, -38, -6, 81, 236, -27, -79, -65, 128, -46, -177, 103, 109, 35, -14, -59, 127, -78, -203, 109, -140, 15, 3, -88, -21, -63, -46, -7, -30, 181, 79, 42, -130, 101, 106, -53, 32, 246, -71, -111, 0, -54, -36, -90, -125, -36, -124, 13, -7, -110, -140, 24, -3, 61, -27, -276, 56, 96, 9, -99, 102, 74, 54, 115, 3, 2, -49, -109, -124, 125, 103, 26, -74, 81, 35, -18, -23, 111, -136, 25, 56, -191, 26, 116, -67, -25, -170, -35, 273, -48, -82, 128, 74, -25, 25, 0, -2, 11, 16, -65, 43, -83, 97, -11, -27, 106, 50, -122, 48, 127, 79, -14, -136, 92, 116, 9, -22, -76, -220, -125, -137, 70, 13, -168, 39, 64, 77, 101, 20, 92, 6, 88, 19, 100, -100, -48, 186, 12, 63, -122, 11, 131, -137, 154, 131, 78, -123, -142, -2, 246, -121, -91, -20, -66, -119, 70, -60, -93, -68, -152, -26, 133, 32, 75, 98, 16]
2728A6M1j54J68R9l57M23j92J5o9J26j78O9j78L5n0J15J6M7n2R1o3L8o5n8K76
2753A59l05J86J01j31j28L6J46j6m3p3O9J26j32J34k11R6m8M8M6j4l3N5N8k0k03
2778i7J98l2k57MK48j14j88K02M3m7J4J8O6k3J4J27j33Q0n1k05J45j25R8J03j86
2803i8K54j51J86k16J3O3J1Lo3j0n3L0K00J06j96l27K17K8r1J17q5J57j54M7j50
2828a62J17M1J56m5q9K10k28j2K8r3J67k52J30J46l9k52L45k0l10J57p3j24K79
2851G7R7j20r2J19q3j12Jj02K16j20K77O4l13P7J53k15q0P8l2J29Q8j02k3O9j62
2876a11MJ67O4j25j09Q7o4n3Q8L6K01j05j82J48j49J18j89K26RJ03j93l9K57l10
2900a21Q1L1j58J71j2j59L23l19KJ12j12J52Q8l4j71L43k82K37l31Q7K67j91R9
$$ y = [16, 57, -97, 71, 170, -187, 236, 44, 59, -10, 116, -62, 7, -171, -136, -186, -71, -55, -8, -60, 31, -32, 6, -59, -117, 159, -146, 40, 141, 10, -118, -82, 64, 48, 5, -68, 1, 127, -5, 129, -82, 14, -34, 14, 60, 46, 13, 68, 126, 106, -97, 101, 69, -188, -184, 64, -50, -238, -36, 7, -40, -26, -8, 58, 35, 49, 176, 43, 123, 72, -133, 12, -113, -15, 88, -98, 156, 5, 191, -25, -12, 51, 62, 65, 2, -8, -61, -31, 169, 275, 79, -248, -31, -3, -94, 23, -62, 95, -59, -12, -162, -45, -4, 152, 107, 18, 228, 0, -12, 16, -77, 90, -162, -32, 114, 75, -177, 168, 148, -162, -5, -78, -202, 77, 174, 54, -38, 81, -2, -114, -113, -215, 1, -119, 158, 222, -91, -14, 139, -76, -156, -78, -110, 19, 107, 5, -18, 51, -111, -107, 60, 124, -1, -110, -23, -87, -140, -52, -16, 185, 80, -102, 46, -103, 15, -174, 52, 61, 164, -29, -68, 189, -121, -40, -9, -167, 4, -8, -167, 156, -163, -161, -49, -161, -9, 79, 45, -126, 217, -65, 172, -159, -72, 195, 4, 103]
2923A03j12mo1J58Q4o1j09J21j60P5k8J4j65K20j26k1J31j22M9l7M8j23j15L46
2947A05j55O8k29J39M9K7l1N4r6O9n7J3L05k93r3Q7k29L29q7N6p5P8l2N2k12K15
2973E7Q3k03MJ56k10L14j51Jj82K11k23R9k8j84L50j72J06k11J71p3O1N7j80J77
2997C0k82Q7J37L03k60nj20J25O1k53K09j28P1K22k71P2p7l4K49j65J7j1J56k10
3021g7R8k58M7K68k36O3J27m5P7N8j07K8K9k02J1J48J64m52K47j0K17j25Q9k61
3045a02J32o2p2K51q8j43P1j4j47k9J99J55j59rQ0j4j61K30j17K38j90K6j5J35
3069A95k10J49q8Kj06j3J1J27n0J57l03n0K59k00J52K14Rl22M8N7M2j59M2j51
3093a88Q5N8P6j64O0K33qj61K30l22r3J96k6l4J40K3L1j09j13K4n6k9J87K6k35
$$ y = [103, -9, -13, -74, 84, 168, 107, -2, 119, -41, 34, 6, 20, -145, 75, -51, -72, 59, -63, -14, -51, -3, -126, -241, 105, -50, 18, -211, -72, -23, 4, -27, 27, -69, 0, -57, -44, 261, -32, -125, -38, -267, 62, -25, 31, -44, 34, 2, 54, -158, 57, 140, -63, -59, 97, -113, 201, 50, 51, -131, 80, -143, -44, -72, -256, 94, -78, 28, -183, -12, -85, -24, 33, -147, 30, -252, -165, -28, 275, 15, 10, -110, 15, 76, -177, 32, -96, -25, 197, -74, -2, -79, -113, 136, -29, -12, -23, 133, -77, 21, -237, -190, 78, -158, -95, 32, -13, 64, 122, 15, 43, 72, -130, -119, 29, 193, -259, -12, -22, 195, 70, 159, -102, 30, -32, -104, 147, 59, -84, -13, -27, -174, -203, -4, 151, -8, -17, 63, 49, -112, 118, 1, 239, 49, 75, 60, 195, -15, 134, 46, 48, -58, -71, -60, 67, 17, 174, -129, -179, 80, -120, 32, 246, 255, -67, -19, 38, 80, -79, -37, -188, -103, -45, 31, -133, -73, 160, 152, -9, 221, -101, -194, 2, -24, -58, 82, 105, 136, 27, -86, -62, -118, -147, 40, 66, -169]
3118a69N1J77Rp8j51J18r4MP8J78o6K1M0n3j1j49J46j47J18M1K66k58j28M4O0
3143D7R9j25l7j14J01on7k8K7J79n5K8Q7l4Ml5j09Q9j20J15j33j6k8K22n8q8J26
3170H1n8j57j32M38k04j23L56k24J98j35J22l69K02K6L9j42j04K48j09K40j09
3191H4k84J79K2J23J18k20J21j00n7j31J45Qk5P0j2P0j82j68K15N1k34L3J31J36
3215I3K3k96J74o6m2m4L5J35j63L42j91J18k0j60J27P9J0j00j20m3K01j63J42
3238G1j35J84j60L5n0qK12l04J62J26j95M4O2j32j02J56K6p1J20j31J85K9k28
3261a04K11l5L5k0K2k37O1J12m7oj10R6Q2k9k7J35l0q8o2Q7r8J53k6j47j5K15
3287A28o4k6j17K11n7j7j22K23j51j8n1J17no1o7J68J9j82J51j84J62J64k69L9
$$ y = [-169, -118, 59, 68, -10, -161, -43, -137, -133, -55, 123, 57, 78, 118, 65, 54, -95, 51, -96, 22, 63, 329, 71, -57, -13, 47, 146, 21, -16, -130, -29, -35, -92, -120, -93, 86, 31, 59, 146, 112, 116, 81, -28, 61, -59, 56, -77, -93, -121, 101, 43, -45, 81, 23, -134, -266, 172, -32, -155, 201, -23, 175, 40, 162, -207, -5, 21, 60, -82, -186, 62, -47, 193, 84, -200, -21, 1, 124, 242, 22, 143, 43, -14, -145, 0, 8, -17, 53, 41, 111, -71, -239, -24, 27, -207, -174, -43, 93, 116, -180, -6, -72, -114, -158, -123, 12, -151, 191, 0, 118, 98, -62, 65, 144, 154, 54, -66, -109, 92, -71, 71, -64, 120, -40, -5, -55, -63, 149, -155, 7, 133, -62, -18, 44, -88, -190, -34, -8, -79, 41, -90, 95, 124, -104, 107, 72, 107, 87, 109, -128, -67, 45, -2, -8, -118, -22, 60, 31, 4, 139, 109, 21, -41, 46, -52, 101, 75, -72, -87, 128, 64, 38, -79, 132, 75, 58, -64, 159, 8, -10, -61, 56, 51, -10, -77, 91, 110, -72, 79, -105, 57, 221, -48, -9]
3311iJ34j18K8q5J10l7p9K17l41K29OJ03j34n9P3k73L42j62J02o1J25K6p9k35
3335a77K96o1l8j50K5J05nj01J40nJj01k57K20P3O9k0m6j31J51k37K70j12K14
3359A23j73R3Q4P7k54Q4k4pj03J19j09J08j61K08K0j53r7J65M6p0j9J49j08p7
3383g9j2r2N0P2K83Oj19n1k47j6K79p6J11j19m1J83k63K49j53J61o3k1q1j18j37
3408b94J77K47k40K10k90L40k6k42j32K39o1J4J94k65J58j84J85l5n1l0j00L07
3430A21k32J13K14l20K16k10M6j70J63K08k38j14L35k82J69J74j47j20MK3j0J62
3452A05n8j82J21j59M2rq5J72N7r4o4P3L4R5j44K65p0j92J80m6q7J43p1j29J75
3477G2j13J44k74J59O5Lo8k21L47j17m6j6j52K71j33J17J22r2M1p5N1o4P4l35
$$ y = [-9, 125, 7, 35, -50, 60, 23, -56, 161, -180, 49, 55, 158, 24, -35, 38, -235, 107, -55, 47, -14, 111, 137, 58, -177, 119, 58, 20, -130, -105, 0, -5, -106, 34, 29, 30, -71, -328, -108, -35, 34, 14, -32, -163, -12, -249, 21, -91, 123, -50, 43, 127, 204, -50, 34, 10, 3, -100, 19, -90, 18, -143, 65, 85, -68, -165, 0, 46, -24, -43, 106, -2, -79, -91, -183, -133, -61, 222, 228, 109, 58, -189, -205, 74, -2, 109, -10, -51, 132, -131, 118, -35, 126, 63, 42, -39, -157, -294, -117, 130, -110, 100, -190, 150, 124, -118, -250, -11, -72, -58, 136, -129, 29, -155, 30, -5, -56, -86, -186, 121, -111, 2, 216, -104, 112, -98, -52, -222, -59, 149, -89, -203, 132, -150, 19, 193, 46, -74, -70, -47, -57, 105, 47, -135, -14, -173, -131, -140, -225, -53, 4, -90, -154, -81, -47, 48, -96, 169, 99, -93, 87, 41, -46, 97, 26, -103, 72, -41, 103, -171, -12, 53, 56, -12, -233, 114, -3, -49, -65, -217, 54, -79, 38, 160, 68, 109, 34, 85, 21, 95, -240]
3501b40L78oj10j23J23J3l27L42N1k89K20K1m1M0j6N1j84J2J29N2p3J84l03J27
3525C1Q1l16J95J62k11q2N8l8K11r6j16P4O1J60l90L05j13j8r1J3J41m4n9L00
3549B18j26k43k2J03m2J53r4j81K69P6p3p6K7p3R8J36k19M5K25j92L8m7j76K1
3573a55J64j91J50nO1R0j42J35k13P6K00l24L09j33O0J25l94K67L3j86K33J61
3595C21k85nR1j16O8l23L80n1j12k17J35K87k1k58P6p2M0J97p2K5l8l7O6j50j30
3620b01K54q7J24j57m2J36J23l61J68kJ1O7K2J48m23J70j05J52R2r1J11k9R6q6
3644I0M5j18j03J76r2r8l7J75j86K98q5k0o3J32Kn1k54K79k1q9k4J56j33M5J69
3669A93l01Q1O8n4R2l13J50q6K08j0N0p8J43j17k31K53J2m8o8M9J22k0m2Q8j05
$$ y = [-240, 138, 132, 22, -101, 22, 35, -292, 50, 101, -188, 32, 53, 12, 52, 36, 87, -97, -85, 44, 96, 23, 207, -96, 31, 112, -204, -9, 153, -58, -140, -82, -120, 91, -5, -121, -47, 14, 174, -216, 89, -24, -42, -133, -120, 21, -23, -82, 218, 92, -151, -173, -70, -112, 41, -53, -234, 35, 111, 38, -38, -11, -84, 14, 150, -69, -24, 201, 9, 47, 0, -176, -155, 9, -182, -32, -37, 24, 114, -28, 107, -106, -30, 170, -154, 155, 22, 82, 207, -187, 80, 113, -73, 160, 321, 36, 31, 122, 6, 74, -249, 131, 80, -32, -249, -114, 173, 152, -106, -30, -102, -62, 135, 63, 88, 50, 13, 79, -71, -201, 53, -34, 90, -67, -109, 27, 150, -211, -43, -45, -34, 33, 55, 203, -220, -50, -155, -3, 89, -2, 109, 80, 176, 90, 135, 17, -86, 90, -2, -100, -137, 38, -148, 150, 65, 45, -18, 114, 116, 65, -189, 90, 69, -20, -44, 112, -21, 24, 193, -108, -27, 41, -13, 79, -234, -84, -170, 38, 28, 78, 0, 143, 26, -205, 48, 60, 12, -56, -7, 115, 95, 53, 141, 36]
3694C6J65j62j12p1K00j09J7K04j31j0j07K9j47K01N8q4L5k4m5K22l49J62J0j85
3718a97M05j68K7J0Q4j95O8j83K09j69M0R1j69J35J47p6j31K88l53Q8JK7P6j17
3742f2O7J60k08L9k09Q1L78k56M0j29J19L1k0RJ17j32k08J97j61K22n1p6J02O4
3766A14r3j6J04q9Q1l0N7j03K22l21J03k9j83K09m0k02J90j5L9q2P4j71J43J5
3790b3R4k6j13Q7M4l02L28Q4l37K21j75j82J81J9K13k25J5J25k21K23j8J75k84
3813i7k3K89m3k3j75L9J7j62J11j56J83J08r6J18j81O2Q1jJ11l8k03J64J2j66
3837f9Q2J25j9j88Lj84K10r4P7J05j61j43J03J65n8P9JK3Lj56J06k20J22K66j06
3862G2n1j7j01K49j47n4K23k46j7nj4M7J39j99J18j07L7K62j11l94K85Q6Q7r5
$$ y = [36, 201, 39, -73, -144, 56, -53, -36, 168, 37, 27, -80, -51, -198, 3, 61, -23, 12, -12, -57, 165, -184, -22, -12, -197, 208, 40, 67, 77, 161, -34, 34, -149, 60, -109, -69, 22, -147, -12, 135, 59, -72, 216, -137, -49, -48, -21, 55, -62, 5, 165, -43, -4, -213, -132, 246, -10, 30, -99, 20, 51, 31, 40, 157, 25, -183, 14, -147, 75, 24, -52, 50, 114, 21, 5, 109, 20, 101, 71, 128, 25, 247, -74, 29, 0, -183, 26, -14, -216, -26, -41, -2, -84, -10, -181, -38, -23, 71, 45, -68, 19, 63, -239, 89, 173, -164, 57, -118, -300, -119, -100, 113, -112, -97, 28, -193, 30, 12, 187, -97, -120, 169, 126, 103, -72, -33, -16, -178, -67, -223, -40, 68, -28, 90, -91, -29, 52, 51, 162, 124, -79, 85, 97, -69, 13, 138, 119, -69, -66, -250, -40, -134, -57, 48, -113, -256, -153, 12, -46, 33, 34, 57, 60, -96, 10, -210, -88, 178, 72, 21, 4, -97, 152, 5, -49, 174, -72, -89, -94, -108, -61, 78, -121, -3, -110, -73, 189, 78, -316, -31, 55, 142, 47]
3886D7L5l02J37j22L27J09j49o2jr8M9R5k45J71PK0pQ1j32Q3O1j9L0j97N5J5N2
3913D0j09M9M4q2K32j65J64j53k65K15M9j20R4J5K25j93qq7n1L14k15R0mk23j6
3938a60K09j77O2P4P0K5l42J36Pj1P1J48k29J57J26k08N1P0p3j62J76r9J32r4
3962d1j35L27p8J92l73L00l77J75J01k55K09Lj23j7J79o2P1r5K34r4n2o1mJ64
3986A88l23Q5Q1O8r0j65J65k25K88j81M0QPK54j57o7J92k15K4J5o4K01n11K75
4010a07J37j17M2O1j69J64P8j97M15k07nr9r2K3m0J15L0j63K00k06R3l7M6J21
4034H6j78J93k2o2j3j04KQ4p3J34J19j65N9m4Lk46K20j60K36k20Q2K98m8j39J29
4059A71k62J33k7r5K68l49K42r9O8q9JN9k3J67j02k88K07J80l04O7K49kj68L6
$$ y = [47, 82, -220, -83, -205, 122, 231, 82, 20, 19, -79, -30, 65, -180, -9, -2, 18, 11, 92, -40, 43, 104, 85, 115, -82, -27, -12, 40, -69, -20, 24, -58, 174, 9, 173, 20, -245, -30, 19, -101, -7, 8, 233, 40, 32, -55, -106, 208, -7, 83, 79, -144, -160, 49, -128, -66, 8, 78, 103, -239, -103, -96, -107, -36, 112, -117, 40, 166, -42, 9, 79, 6, -156, 20, -79, 53, -41, -176, 151, 73, 265, -108, 192, -185, -10, 91, -164, 45, 48, -75, -92, 87, 25, 96, 1, 235, 141, 89, 28, 24, 188, -135, -50, 31, 99, 9, -156, 9, -216, 72, -109, -69, -61, -54, 200, 43, -24, 168, -47, -23, -8, -72, 129, -382, -107, 30, -87, -45, 16, -153, 11, 89, -108, 307, 100, 95, -4, -96, -73, -113, 2, 32, -131, 69, -137, -44, -81, -35, 86, -92, 101, 79, 17, 4, -100, -98, -14, -87, 47, 166, 1, 60, 16, 19, -227, -7, -167, 69, -151, -69, 229, 181, 42, 171, -91, 42, 15, -80, 188, -161, 81, -18, 50, -39, -38, 21, -2, 165, 63, -225, -18, 162, -142, -75, 174, 172, 4, 40]
4083D0k10m9L87k52J39k3j47K83j18L9O0j35j87K93l47K85J64%k49k1J5J50k70
4106a53K75n3O1l8p4jj43K1J48n0k3o1O6J43J2j39q8O9o5J25j44oQ3J68o8m8J35
4133A52k21j61J97J11j18p5q0K10J04n1k1o7Jk8m0M8Mj14J53M5j20J21o7j36M20
4158B67l48J21n9K23l18QL52l43p7J31L0j09J15J37l36M11k02J65l1j81N7J26
4180A39k49K06j85J35M8l5j4J98k75J48J89k85Q1k08K46k30J95j75J65j48o0O0
4202e4J35m54L14l9L5K50l87J16rJ98j0p7r5J73j74Q5P0m8j33J63n0kj2O3j96
4227a38J36j91K57O9j56J69n0J42m28J34K07j73J46j67J17J32j96M4KJ20k93m6
4249a63J38J15q2K08l4k53J06r0j14Qq3K61n5n1J62j69n0K86j1j56J5J16q8o1
$$ y = [40, -170, -219, 168, -84, 55, 32, -115, 168, 50, 89, 149, 14, -173, 120, -227, 58, 222, 222, -27, -48, -33, 117, -153, 122, 69, 130, 92, 18, 17, -126, -105, 43, -7, -30, -91, -25, 118, 130, -9, -97, -28, -93, 32, -112, -118, -35, 133, 65, 17, 152, -69, -230, -33, 78, -40, -115, -195, 15, 119, 68, 47, -20, -19, -47, -87, -39, -35, -149, 4, 49, -71, 50, -17, -153, 267, -81, 40, -19, 204, -114, -106, 246, -97, -174, -43, -13, -122, -7, 130, -206, 205, 3, 168, 137, -44, 13, 139, -110, 96, -89, 46, 94, 59, 45, 243, -32, 116, 305, 20, 101, -107, 139, -91, 104, -71, 94, -54, -114, -54, 81, -373, -59, -98, -63, 187, -200, -84, -93, 105, 95, 18, -77, 96, -78, 7, 77, 29, -104, 59, 9, 7, -5, 58, -138, -2, -193, 64, 133, -23, 146, 96, 238, -190, -56, 151, -22, 124, -43, 74, 206, 10, 54, 56, 176, -117, -163, -25, 90, 8, 216, 182, -71, 35, -55, -169, -161, -244, 17, -38, -89, 73, -96, -146, 140, 129, -27, -12, 104, 16, -45]
4273d5j41J73q8L44r2k73J72k88L09l6k10L71l8k7j68j03L67l76P7K1N5m0J01
4296F5j72K83k8j27M8J23k30j7J27J2K6p3m7jJ68M0O4j36j97N5p4K8J59k91K55
4321F0N9n1M1q0Jkq3J12j53J07j66K25N4j73M0kn1K32O2k69j5M5N9j79J13j76
4347a90J70L92n66K97j42N1K8j07l7p5L36o0O4k33l5j3l0L2K08m3J48j75J03j92
4371f9R9P0k04J98q3j1J2l7R3l36L17R2k47J46r8J72kJ1q1J55k06R2l0j25j5O0
4397b7L7rj6n6j05K68J42j57p6K0j25J31m1j15n2J08J18J3J30o1l5j7q8n3N3R
4423dj99J98R8k14J4J58j77J17k8J8r6P2m8K23j56J8J34k41K22j37J82j07j6j92
4447a61K78j81k7K39l52K16k63K06J34j31J9j87R8K32l23J16J75q1j56J80J86
$$ y = [-45, -186, -13, -101, 243, 151, -122, 50, -238, 71, 35, -175, 196, 158, 131, -37, -140, 227, -149, -72, -51, 4, -36, 65, -107, 176, 148, 21, 69, 192, -38, -55, 72, 84, 110, 37, -10, -11, 157, 197, 261, 125, -72, -17, -91, -63, 96, -195, 60, 119, 68, 109, 29, 30, 28, -55, 57, -96, 11, -155, 70, 124, -49, -9, -11, -62, 170, 232, -37, -52, -7, 52, -127, -14, -190, -20, 372, -194, 103, -39, 12, 40, -67, -104, -179, 157, 97, 161, -72, -107, -120, -150, -118, 90, 47, 195, 20, 123, -69, 30, 100, -104, 94, 11, 0, 12, -25, 68, -268, 49, 141, -106, 40, -58, 114, 112, 123, 42, 197, -9, 83, 53, -72, -87, -27, 10, 1, -15, -71, -176, 92, 234, 77, 1, 21, -104, 27, -14, -129, -181, -73, 45, 58, 188, 127, 92, 75, -13, -66, -13, -4, -203, -5, 93, -121, -107, 51, -126, -9, -37, -19, -115, -43, -91, 132, -24, -6, 128, -113, 109, -28, 154, 47, 31, -161, 117, -64, -91, 148, -204, 12, -251, -45, 89, -42, -23, -210, -112, 120, -203, -87, 88, 7, -149, 31, 217]
4468B17m03R7K70j50k2M9j89K74l71J58r3M98j37k16P1j33j07J77rj54K61m2k05
4491a59K74k79J51P3J18k61J67K66k49j12n7%N6R3k12L6J74j21Oj38J14Q3J2j3
4515B2j06J07j21J74j32J48N5J2j80j4M6N7l8J9L3j15k7J49j7J5o6n4K9l6l6K0
4541e6K67k67J16j55mJ19L6J48k02n6J25j76K21m06M13k06J1j50K56R5k76J91
4563D4k2q7j23K92l25L39l92L03m9M5j71P5J8J77j27M0%n2J51j67o1m6L2J6K15
4588A25m2p1J24j08k66K58q3J55Q9m54L66m4L5j78M1j0N7n3m8j2J38j57J33K62
4612B57j00l26L1K46k1k09K04q3N4k4j36N3J84k69J29kJ66k45R8j64j30L49j82
4635a20o6K79Oo1j0Jj72J87J33o7j43N7o8J48k95J48n2n4M1K80j87j1J93k21O4
$$ y = [217, -186, -89, 181, 31, 9, 58, -131, 143, -228, -70, -163, 335, 198, -18, 53, -80, -187, -10, -19, -173, 88, 46, -159, 115, -164, -13, 60, 178, -83, 84, 350, 101, -11, -68, -68, -12, 81, -131, -95, 79, -42, -36, -174, -60, 23, 35, 22, -84, 23, -98, 76, -56, 92, 147, 159, -21, -35, 11, 68, 30, 49, 82, -33, -60, 89, 72, 87, 21, -33, -4, -40, -76, -56, 211, -56, 60, -95, -99, 20, 56, 204, 2, -54, 71, -105, 116, -290, 123, -83, -72, -222, 34, 129, -147, 44, 22, -65, -188, 104, -221, 118, -274, 29, -20, 25, -146, -71, -53, 124, -3, 37, 37, -15, 136, -31, -92, -138, -106, -90, 125, 83, 12, 136, 28, -238, 20, -63, 92, 181, -273, 93, 49, 84, -94, -53, -63, -6, -59, -107, -119, 19, -138, -5, 257, 157, -169, -138, 108, 87, -122, 82, -1, 53, 29, -107, -54, 130, -139, -10, -12, 154, -91, 7, -157, -287, 62, -120, -186, 93, 99, 38, 28, 29, -143, 44, 177, 110, -33, 24, -44, 104, -191, -43, -95, -149, -108, 172, -15, -26, 167, -54, 10]
4660A0j21Q3J25k6Pm4m1p0J41r3O3J12l56K46J68l93J27K43L8j56j24o7K08nm7
4685B8J69k47l0J07rJ4j19J77o2P9j73k0J14j6Q1k8k7n7J39j95o6K72j72j5j6
4710g2P8m8n4J88k06q8J78R8j51J76j76m1L08j27K5j52qN9J6n6J73J38j42N6k11
4735c9L7J67j77j48K30rJ05k20j60pK28J2J68j99m4J55O8p0k71Q8r0K13j96Q2
4759g7J88o1k22J96J9r1n8K29j11j7j39J04K23k07N6J30l46K27j9k0J09m3j6p0
4783a6N3J61j22Q5k34J2O4k21K37j05J45n4k56J98J75j63J53l51J87J08K6p6j29
4806a23J82rPp5m3L4k6J5L0k0O8q9J74K4k57R5L2J05j32J17j12J32r7n9J60k28
4832i5L47k64j52J50J53j1J25j42l6k9k5pK4p4j05L66j96j9Q5j20m8j09M8m8J30
$$ y = [10, -111, -28, 97, 71, 78, 34, -7, -77, 64, -29, 34, 146, -210, 36, 204, -189, -62, 181, 219, 63, -61, -128, 80, 75, 28, 197, -50, -80, 27, 18, 32, -87, 90, 28, 107, -66, -86, 28, 12, 93, 65, 38, -19, 120, -75, -141, 131, -41, -56, -72, 6, -42, -96, 92, -114, -202, -24, 74, -77, 99, -77, -118, 190, 63, 88, -64, -72, -13, 3, -53, 120, 258, 116, 172, -39, -2, 165, -12, -160, 70, 61, 166, -54, -214, -221, 7, 19, 187, -12, -56, 99, 167, 97, -174, -86, -176, 37, -159, -77, 111, 50, -172, 24, 43, -48, -106, 123, 12, -5, -144, -40, 183, -24, 32, 162, -184, 43, 24, 4, 113, 70, 54, -16, 37, 198, 76, 161, -73, -61, 3, -218, 19, -86, 59, 5, -251, -53, 122, -41, 112, -239, -52, 56, 82, 6, -123, 59, 50, 57, -18, -61, -27, -53, -38, -8, -28, 40, -49, 125, 149, -108, -13, 19, 124, -8, 109, -3, 129, 32, -27, 133, -95, 252, -12, -164, -14, 139, 128, 253, 111, 75, 46, 21, 14, 38, -36, -141, 225, 29, 10, 95, -25, -73, -182, -134, -182, -52]
4857e2K12pk52J58L5K5l3q1K3jn2K18k34R0j38J04Q2Rk3K0N6j29j04l7O2jK11
4884A61p0nj71p2J68k58K06P9j45K64o8j03M0j45J23m0n1J13K7K4K9J58j3m63
4908b12K67j3J4k08J54r5J9K47j27Op6k2j84K76kQ5n2J02l69M7K31k19Q4J99j91
4933c9r6J88O7k70M5O5K6j5J35r0j21K06j75J53j77j09M19l13P8o6J98k24R9K5
4957Iq1J41N8j5q8k8J60j73J1o0K38j87lj45K20n1j08J6L3M7q8Q8L5L7k5Lj92
4984a48J29K4Q5j00l4K8L4OK9L6j14pn0J4j27K70Qq9r4K17j11K40k33j17O5J02
5010F3q1j0n9K30j67J02K28n82J55K05j10N3R7j86j8Q4K21j27q1q2k8R8J11M2
5034A58j00J48m26O9K09m1K5p0L6k0L5J06m3Qk82J75N9J7j81k3L1l7L40k8l50
$$ y = [-52, 160, 153, -99, 59, 94, 119, 86, 5, 28, 27, -25, 193, -41, 49, -89, 15, 97, 106, 83, 103, 159, 30, -74, -111, -49, -50, 161, 91, 86, -85, -157, 11, -247, -41, 38, -107, 157, 89, -14, 26, -119, 4, -36, -87, 26, 53, 77, 106, 264, 251, -212, 55, 42, 56, -152, 2, -93, -74, 173, 46, 52, -24, -46, -230, 46, 44, 129, 77, 179, -190, -143, 88, -131, -47, 152, -39, -135, 53, 120, -150, -105, -40, -14, -29, 106, 16, -105, 101, -74, 79, -98, -207, 212, -101, -23, -89, 109, -115, -16, 9, -72, 69, 127, 112, 24, -4, 156, -17, -6, -66, 172, -15, -18, -163, 57, 6, -102, -86, -53, -6, -94, -6, 29, 66, 41, 44, -148, -19, 5, 90, -10, -44, -16, 18, 24, 53, 89, -25, -32, -82, -68, -195, 75, 83, -6, -100, 117, 6, 246, 13, -104, -39, 63, -18, -28, -87, 143, -24, 78, 306, -276, -121, 84, -26, 27, 124, -62, -80, 4, 225, 98, 17, -65, -93, 5, 116, 158, 58, 206, -220, -151, 58, 17, 42, -28, 8, -12, 23, 129, 86, 94, -188, -13, 46, 63, -118, -141, -110, -147, 193, 165, -185]
5059a85K16O0q1K46k88K6l3J60j31K41k13K3J60k65L5j41K51J69k02LPk08O6Q0
5083dk2P0j17n6K10J5p6k4L59k57j58N1kJ17k92L66j48m4j80J74J13j97J42K8
5107F8lo0R4J4j37J78j01k71J35M4M6j26o0J40K29k71J79p2j03P5J06l39J80l7
5131i2j19K08N6k56K62j02P5q1J68q3j51R1j6J75k55K27k42rL06l1J45j75K3j49
5155b5K22k15k5K2k4j0J64j35K21j59j15K08m1l12K14L5K17k48N5Pj7j41R6Q3
5179G7k50K22m1J80k67M8Q5K2k72J24J45R9k92J39o3M0R8P9j07M8j32r5J33j91
5203a71K23l7Q0r4q0Q1J92j41p8m3k17L11k05L31m4j58N9j78J02J97n6j04k3j24
5227a77L56j96l8J29j8j45J62N2J3q9j36J61l0o2N8J14j31O8K49l40L3oO0Kq7
$$ y = [-185, 31, 91, 10, 256, -32, -6, -39, 121, -10, 231, 18, 41, 201, -64, -29, -170, 81, 250, 48, 51, 58, -150, -84, -4, -26, 44, -73, -129, 81, 96, 20, -4, 355, 98, -60, -9, -11, 106, -186, 180, 32, -12, -192, -18, 95, -102, 40, 68, 65, 5, 99, 113, -24, 154, 53, -218, -83, -39, 7, -119, -179, -39, 190, -81, 98, 26, -77, -2, 104, -235, -55, -92, -211, -3, 53, -203, 59, -43, 32, -49, 119, 36, -115, -24, -40, 135, -120, 107, -135, -144, 162, 131, 276, 101, 124, -25, 197, -18, -43, -21, -45, -55, 109, -26, 195, 36, -79, 129, 88, -224, -10, 25, 242, -6, 49, 56, 39, -102, -6, 77, -173, 49, 8, 188, -79, -31, 54, 76, -196, -72, 73, 172, -120, 19, -44, -4, 94, 173, 66, 114, -18, -113, 20, -171, 52, 15, 95, 1, -79, 2, 194, 53, -25, -68, -285, 26, -179, 152, 108, -50, 9, -169, -67, 130, 74, -30, -53, -177, 179, -17, -55, 74, 56, -89, 73, 125, 138, 49, -87, 74, 44, -18, 40, 154, 23, 91, 340, 0, 33, 27, 87, 89, 2]
5252BNj32o3L91l61J16j82J90P7q7N0OQR8k70K14J91k23PO2l1j67J03p%k6l12
5279c41L03j2K1J52k62oJ49n7J33J40j96M1q5k5j76J76m5J41K8k13J44r8q6nK24
5304D5o7p4R4M1j06q0K33L6j58J89l12L82j36J3k15K66j19k38K21j16J12L6l8
5327Ij03j3J49j35O8J12q4O7k88K36N1l27K48p1L1J37k64J90j06J46Q5j12j85
5350a59J70n3J59L5j17k36J78Q5j18J10O2j36j7J7o2J34j99K90k12K3P0p5P3n
5374A7m1K7O6o2j46j4K70j23j79K55j3k00N8K39k1j02R2j10k8l53M91n3lj05m4
5399h2M2K5J11p2Q9k56j26L84j17R3o4j34KQ1R0k16Q8n1J6Q4j34K05j43K04j75
5424e6n7l6pM8P4J90k95J17J27n6kO7r1K40j14j39P4J65l78J51%j26K41k95J61
$$ y = [2, 7, -125, -188, 203, -158, -42, -224, -34, 43, -44, 6, 12, 20, 118, -152, 62, 253, 30, 37, 99, 68, -99, 4, -3, -3, -29, -341, -38, -50, -29, 123, -139, -145, 4, -53, 80, 220, 24, 65, -20, -45, -221, -45, -90, 51, 79, -134, 10, -88, -174, -179, 45, -22, -96, -2, 39, -67, -147, 86, 122, -36, 153, -159, 223, 87, 100, -115, 151, 32, -206, 15, -101, 11, 47, 9, -94, -107, 42, -93, -25, 87, 3, 70, -218, 18, 69, -258, -10, -81, -50, 87, -177, 13, -93, 53, 138, 26, -159, 11, -42, 117, 152, 35, -201, -23, 62, -56, 54, 116, -20, -37, -20, -82, 52, -147, 143, -69, -46, 24, -51, 22, 17, -24, 3, 69, 7, -139, -153, 117, -6, -185, 70, 57, -143, -85, 154, 133, 31, 123, 13, -15, -368, 123, 70, 67, -38, -82, -40, -15, 96, 24, 113, -143, -269, 115, -2, 91, 27, -107, -105, -24, 66, -150, -62, -113, -97, -13, -147, 58, -85, 119, -56, -113, -149, -156, -108, -34, 156, -139, -22, 105, 49, 47, 114, 23, 263, 149, 10, 84, 249, -129, 22, 22, -104, 137, -158, 3]
5449CJ31j09J0N4j09kr6K57j71J12k08J27j81R7M1O3k12J36K15m0o1J8j61O3J7
5474fm1M5r8J24o0J99k27J46O3l59K29r1R5k72L71r0p0O2p3K28j42k39J56J8k1
5499e3p9K71j15j0j87P6L4j05K03O7j48m7K11n5L8k71J91l2O9J0j43M8J62j10
5523B5Kn2N8n4J05j58J46o9l4M5K3L8Q8j17k06J71N2o1J14J3j24K4q6k05M50l67
5549a79J36j33K99j20n3J35k67Q9K13j93K50j73o3J75J86l52P3j19j42J25K35
5570A22Pm80L12M2N6l9k04L37%r7M8k49J58J03k16P0L4l9k24L28n2L5q4q1L20
5595B07l10J25r6P4J02P7J76n20K07O8l18K67j63N9k1P3Q3R8m57J71K34j03L6
5618F9j91P4k9K56Ok57J2P7j15J67k13K61o6J7Ok9O8l80L04O8R6j90J09M0j30
$$ y = [3, 134, 25, 35, 89, -20, -22, -118, 139, -32, 80, -128, -1, -182, -85, -44, 19, -193, -57, 158, 118, 57, 75, -86, -23, -6, -47, -2, -100, 24, -36, 163, -64, 82, 145, -214, 15, -76, 19, -253, 118, 28, -42, 20, -53, 175, 33, -206, -50, -32, -53, -132, 139, 24, 14, -173, -97, -63, -168, 35, 102, -46, -93, 118, 63, 101, -170, 21, -11, 58, 68, -75, -27, 135, 25, 27, -25, 33, -21, 84, -74, 72, 3, -31, 14, 37, 75, 163, 46, -160, 11, 63, 2, 116, 129, 5, 29, -57, -262, 188, -179, -43, -176, 123, 3, -50, 85, -182, -93, 120, -73, 177, 4, -59, 116, 302, -50, 23, -96, -238, -113, 122, 129, -351, -39, 3, 59, 20, -184, 153, 153, 56, 104, -145, 13, 116, -100, -30, 4, -35, -259, 69, 17, 52, -32, -113, 207, -103, 22, -74, 0, 102, 179, 355, -165, 42, 110, -208, 59, -104, -45, -66, 7, 90, 188, -269, -98, 136, 33, 69, -122, -48, -77, 179, 185, -72, -60, 17, -98, 69, -144, 117, 51, 68, 74, 45, 113, -267, 37, 105, 201, 11, 120, 160, 30]
5643C0q7Q4n6J59k04m8K66LQn6j65J71k60J57M1q8J0j7L3J3L2MK0j37J59k28R3
5670f3J52J8r1L8K2k46O5J07j06J42K0j28QmJ17j56J54l9j7j13K47j16j30L3J15
5695B9K03j01j39j26J32K57m47K1J14J29M1k40L09p3rk05K39j15J63j82n9MK08
5718A53j62O9j15J62j31O0K00j33k56K02j25Q9PJ3lqn1J72l84K63j40j46K33M1
5742A0J7J09k18J90k73K49%j09P7j17J23%J23k70r5J50O2j12Q3o2R1j23l4J57
5766B8O2q1n2n5J27o1j2K3j26K20n1J38k86J64Q7j83J45k20K39p3M1n6P2j48K49
5791A91j85p3N3P4R5n8M5J5k49K02j38R4Nl05K98j04J91j05o6L9J8J10l3rj04
5816AJ21j47k9L39k55K4r3J34o1j30J1P6p8O5p5K19K72k68k78J90m5o9J25M7k28
$$ y = [30, -57, 27, -29, 130, -74, -122, 144, 147, 155, 99, -66, 105, -155, 2, 43, -45, -35, -52, -19, -6, 26, 30, 50, -87, 72, -156, -63, 89, 107, 16, 54, 76, -170, -105, 2, -104, 38, 58, -70, -62, -66, 51, -105, 49, 10, -7, -120, 127, 11, -119, -86, 29, 232, 131, -8, -134, -2, 255, -192, -171, -57, 72, 113, -127, 182, 109, 100, -105, 134, 19, 182, 0, -59, -55, 153, -9, 60, -55, 107, -24, 36, 236, 103, -153, 49, -76, 13, 20, 33, 30, 22, -29, 143, -241, 22, -118, -264, -31, 10, 27, 136, -82, 108, -165, 84, 84, -25, 52, -65, 58, 58, 181, -89, -184, -34, 28, -84, -1, -63, 28, -95, -129, 28, 90, 9, -43, -98, 29, -32, -44, -21, -147, 73, 22, 160, -126, 38, 125, -58, 87, -133, 106, 33, 74, 18, 90, -58, 191, 6, -67, -14, 60, 155, 97, 142, 157, -92, 110, -28, 66, 71, -234, 64, -40, 151, 46, -20, 19, 37, 147, 114, 105, 1, 122, -25, -54, 285, 30, 54, -39, 95, 34, -96, -85, -9, -87, -22, -97, 122, 394, 126, -152, 38, -7, -76, 49, 96, -132]
5841a32K15j73J93J44j99o2j7k07K26M4n6J17k13J76j06N9M3m8J75l61L85k60
5863e7K15m8j49M7M2kM3k28q2J46J41j89Q3J17j84J22rk33K78j23J17qj24Q8J65
5888A68k68K48j97J32k22O1k1K5J73l31K48P2l52L05j21K71j02j91m7N8P2k27
5910b46M29k74J04l1K09k53m4J64M6j66L7P9P5j90R4PN0n9j96O7J81m0r4Q8O8
5935A05j87p5J14r2l1J61J57p2r8O8o7N8K1Nq5J2J31l36K00K5n1K17r5j76OK67
5961A82Ok86J06jj49J52k64L98m3r0Lk30Q1L90j21j33j06K58k37J2L4R7p1l5j19
5986a66J42m8K31j37O6j11J64k5r2J35o4q4q2L45k57rJ61l58P5J03m9p8R3kK6
6011b1j42J74K31k31j10L1J98m17M02KQ3j94J48j42n6n0J95r8o1J02j87K69p1
$$ y = [-132, 83, -90, 103, 247, 48, -14, -31, -238, -12, 32, -24, 93, -120, 56, -50, 9, 52, 4, 179, -182, 203, -57, 158, 110, -39, 8, 50, 48, 91, -137, -219, -73, 68, -121, -38, 79, -105, 17, 8, -225, 53, -70, 47, 39, -85, 3, 168, -100, 148, -49, 83, -139, -78, -99, -74, 99, -232, 16, 88, -264, 41, -80, 191, 89, -102, -149, -91, -19, -246, 183, -91, 13, -18, 191, -62, -106, 58, 104, -62, -25, 54, 129, -61, 33, 40, 90, 31, -165, -98, 83, 43, -51, 37, 105, -82, -157, -43, -135, -166, -5, 152, 80, -18, 50, -17, 41, 62, 67, -18, -6, 125, -211, -11, 14, -37, 180, 85, -91, -85, 182, 188, -98, 8, 7, -142, 10, -254, 144, 101, 11, 14, -216, -135, 255, 134, 1, -105, 153, -84, -72, -38, 59, -12, -47, -166, -24, -72, 159, 22, 88, -23, 141, 116, 24, 159, 95, 11, -71, 274, 17, 8, 169, -189, -114, -11, -60, -138, -45, -47, -21, -163, 11, 242, 11, -99, -68, 130, -287, 115, 117, 200, 6, 154, 12, -44, -94, 101, 3, -58, 44, -143, 126, 55]
6034E5n1J85k39r5J66j49Q9kJ3P3J5j08NR7p4R2k22L76k86p9K60k58K97k88J22
6059fq8J96j47N7KJ04j71j08J45oN2q1J43r1l2QK6K67l57M9J20l4k0k26J58J40
6085A00k34L5K85k8j55J05j08L3j14N7l5J37k2j0m4j60J53j60R0L3nJ45J62j59
6109A01jkj4j54o7J84j44O1R5Q1j89J63k01M4J80j2j24j12J19R7o4J52k56p5K91
6134A53k44M8N1j7ON6J04m03J64O4j52M99k75j77o4J72P2j23K17k8J4n8k59J1
6158a69M34l45N3p3Q8J4q4qq6K23j18J31j8p9n1J14r0K28k39k7J47j6R6j56Rr5
6184a17j06J12J03j07R6N0j34J42k5K7j88L14k07m4j12K61k03P0J7nQ1K13l50
6207a12K7R6j5N9K7k51L06k14J3P0j99J83j12J02L6n5k3J17j17N1k01J98j0N6
$$ y = [55, 4, 189, -50, -145, 21, -128, -39, -41, -28, 45, 60, -48, -43, 54, -20, 72, -150, 226, -60, -139, 121, -137, 160, -128, -6, -94, 102, -45, 12, 14, 118, -53, -161, -16, -22, 30, -51, 92, 1, -31, -23, 3, 270, -87, -38, 82, 48, 28, -198, -40, 100, -134, -99, 186, 158, 3, 108, 0, 33, -81, -24, -59, 78, 56, 46, 2, -158, -5, -165, -75, -42, -47, 98, 260, 101, 100, 98, 84, -70, -137, 47, -97, -36, 59, 140, -49, 114, -87, -43, 137, 125, 1, -111, 8, 105, 41, 193, -63, -138, 153, -91, -43, 8, -9, -3, 53, 157, -246, -82, -18, -170, 329, 54, -123, -187, -15, 57, -66, 151, 123, 137, 79, -180, -169, 265, -80, -27, -100, -12, 2, -82, -90, -176, 47, -71, 60, 42, -37, -88, 26, -64, 164, -75, -102, 45, 29, 125, -31, -22, -117, -223, -111, -8, -115, -19, 31, -103, 39, 14, 41, -147, 167, -40, -84, -196, 65, -138, -68, -51, -56, 25, 238, -112, -85, 11, -4, 55, 82, -169, 137, -77, -64, 6, -193, -10, -122, -20, 16, -39, -62, 55, -62, -11, -212, -14, -24, 32]
6231C2j8l9j71J97NN6P8N1k52M1J24q1k9N2K20l50J86r7j24L00r1J6Lj20o0l9
6257a10n4K56j20j9L5M6j3Q1j44j0N0q0N9J58k0O9l32J06k2m1m9kO3j8K15j89
6283h5J2J54nO8j04j96k3K83k19mK02J9o6j71J68j6j11J07m8m2L20k97nj01K27
6308F7n1O4M3Mj96OJ19J0j18R7Q8m6o4Q0j36K04j91J02k27J53J5j90J72J23j64
6333c6L3K04k95K18l72L37o4q4J49n4r3l7J31n5m1K12k3m2J01kn2j80k72L41j1
6358A3k6P6j33N0jk11J90J48k88J68n7N5J57k0k37J25J07k47K48r1n8Ql02L50
6382B4J25r2K0j27Q8k65M34m9j08l53L66j46K29l07J43q1J86k9k4o4j0n6M9O3
6406A6MJ11j63O2m8K70l10K15k44m0On6P8J44j87P9Q9M4m0k56K72j52J91q9J03
$$ y = [32, 14, -25, -196, 1, 6, 62, 140, 191, -61, -20, 104, 23, -6, 46, 266, -84, 102, 5, -119, 181, 90, 106, 109, -11, -71, -110, -164, 92, -28, -47, -12, 34, 21, 102, -42, -52, -2, -82, -23, 135, 115, 184, -148, -42, -64, -105, -154, -156, -93, -111, 104, -85, -73, 81, 76, 144, 40, -156, -179, 104, -115, -119, 83, 102, 36, -135, 33, 17, -94, 13, -35, -77, 243, -54, -59, -160, 67, 16, 80, 123, 127, -69, -63, 56, 66, -52, 45, 133, 87, 23, 103, -33, 171, -20, 82, -145, 8, 23, -167, 5, 128, -36, -3, 201, -94, 124, -248, 89, 25, -59, 90, 36, -57, -94, 37, -18, -59, 153, 130, 88, 189, 187, 135, -45, -317, 24, 13, -13, 63, -70, -20, -21, -232, -42, 106, -182, -14, -71, -16, 141, 121, -116, 9, 116, -131, 117, 26, -32, -24, -326, 24, 149, 57, 77, -50, 38, -227, 207, 158, 50, -303, 63, -83, 146, -161, -18, -99, 87, 58, 34, -30, -40, -96, -47, 16, 20, 131, -32, 30, -18, 252, -58, 157, -87, -127, -121, -177, -99, 45, -142, -63, 26, 70, 30, -226, 46, -106, 85, -4, 99]
6431I9o5l1j11J91j47J26L9ol8m8k6J16k12P0m7l2K44N1j80O6k32J87P0j47j7
6456h0k02L89p4j43J19P6MK8j78R2K5J95k65n3J46j63O1L3j0J03m6l70J11K04
6480BOp8J33j98K44j80N7L0j25M3K17q4ln4Nl5l9r2J58J62k55J23j52k7K59j57
6506d0M3j05K3K08j42M1J63k23r8J13O2oP1L8l4J33k56k5L1J1q5J93j09m7p7J68
6532E1L9j6j89L03j09N4m4j5m8q8P3R6p1p1J06j96L12n6l50L13n0r5J05j78K00
6557G6k14K97j11r3J68Q6l34Q4K75k13K3K7m7nJ1q8J02P7p7R4k49M7K2O2m6n1
6583g7K3O3JL5j91Q5%L06j97j28K09j30oJ34j96K1l7K79j09m8j51k4JJ12l4J81
6609A22o2k17K53Q7k29J11j00N1l30L09j28J72J58k67J53j53J24j22J30k1kj75
$$ y = [99, 34, 3, -108, 83, -64, 62, 101, 95, 57, 9, -17, 99, -113, -43, -90, -122, 122, 173, -7, 59, -173, 14, 84, -63, -80, -282, 107, 33, -110, 9, 85, 89, 117, -61, 31, 56, 251, -14, -67, 79, -84, -23, 10, 0, 103, 57, -313, -202, 2, 8, -70, 63, -135, 109, -71, -14, 16, -109, -66, 151, 67, 64, 10, 15, -20, -59, -151, 7, 169, -86, 37, -115, -142, 117, -40, 3, -102, -79, 129, -13, 28, 191, -32, -130, -17, 45, 39, 110, 148, 114, 247, -9, -34, -3, 8, -77, 116, 7, -40, -117, 51, 90, 74, -115, 188, 79, 133, 89, 74, 26, -62, 11, 107, 36, -35, 71, -125, 187, 131, -219, 94, 44, -51, 54, -124, 76, -138, 159, 48, -45, 123, 209, -125, -41, 234, 21, 44, 71, 24, 19, 30, -58, 44, 121, 44, 138, -111, -64, -42, 20, -26, -77, -54, 9, 10, 45, -146, -61, -61, 245, 48, -80, 129, -1, -7, 127, -69, -48, -85, 194, 85, 37, -114, -138, -137, -25, -59, 122, 60, -157, 96, 183, -46, 65, -35, 16, -314, -5, -133, 39, 197, -70, 83, -70, 54, -68, 62, 41, 39, -136]
6631a36J58Nj78p4K53j08K11k04N3Pk01K80M4k66Q2J34k4k61K06M3J80m21K02
6654a5mP6j11N3j06m3J06J10l4J86k90K40m69K32J62j03j76O1M4R7q3R0K0j24
6678h1L40m00oK34k02J34j25N8K45j43k52K52k36J17N5K21j79K4R1j73O6j26J21
6701C5o6M0M8j10R8M8J61j82j47K43k97K43j42J5j66K35O1k14L8k07L15j27J82
6724A04J9l07M3K02k65J81q4L01l43J76Q0k11R8m5R3k9j7n9J73j94J10P4j97J78
6748H1k85L50k71J90k9l2j1K9p1P4J1p5P0rJ31k21j9J06M1j30m4J51j91j54L06
6773bJ94p0n7p3N8m5j14J58J5j92K49n6q7N9Q6j28K6J17j56K76o6k10l1J31r6
6798a4J13q0KM7p5k45J62K9j9qJ14r0j48J76j7k9O3k27L16Kj07J96j75j0J30k30
$$ y = [-136, 22, 27, -151, -225, 28, -80, 131, -73, -20, -13, -214, 66, 110, -156, -74, 60, 36, -225, -19, 24, 204, -217, -15, -19, 57, -54, -1, -107, -150, -44, 66, 32, 218, -72, 168, -301, -69, 93, -10, -186, -125, -81, 16, -67, 23, 43, -81, 259, -141, -147, 87, -115, 19, -106, -48, 197, 54, -198, 54, -182, -65, -10, 211, 32, 56, 147, -26, 40, -86, 35, -31, 9, 57, -53, 45, 93, 254, 72, -75, 168, -129, 114, -28, -13, -179, 56, 117, -97, -59, -266, 49, -78, 104, 123, -184, -141, 61, -204, -23, -107, 194, -149, 27, 107, -104, -6, -51, 42, 13, -4, -63, 110, -84, 26, 100, -97, 81, -204, 146, -125, 65, 36, 4, -7, 22, -49, 25, 36, -39, 31, 22, 153, -68, -87, 19, 60, -70, -114, 37, -154, -308, -2, 192, 122, 65, -8, 50, 5, -109, 49, 64, -128, 121, 65, -22, 37, 123, -5, 21, 138, -18, 258, 192, -18, -49, 82, -14, 99, 19, 21, 68, -7, -252, -90, -61, -80, -88, 26, -64, -212, -36, -53, -82, -19, -246, 70, 72, -35, 161, -14, -24, 106, -124]
6824a24K5P1O5QM2pl5Q5k4j57M9J81j39L3p5l5P5j36J12p8R3n3J38op8M4n0M4
6852F8j97OK05j26J59l8J00m04J37k6K20r0j39J37r5J19q8J5j5K14j29j09m3J27
6876Hj06l9J46m6k7m7K40k12J12j30K43j50P6j51L9q1N2M2P4O8o7j7O5k1m7r2
6902f8r6M50l69k5r2J44K04j61Q9k7k27J41M2j9J57l25R2K30M5l06R3r%j33J23
6927d7k5J90p6r6J27j35R7O8o3P2l5j51J45J27k14j17r2J40J51K5o5j17o0K90
6951A39j56r0O9J19J18pl15J40j01J45J5j81q7K27J19N3k30P9k6pJ41J3k52RJ81
6976A15J21j48Kj63L1k15L36n8o1J14l89L73l8KM0N3O6k59J3K32m6k00r8K02m3
7001a8j4j30N02l33p6J98j67j55L09j98J81n1j91L1P6l6J9M9J25p2K38l08mJj7
$$ y = [-124, -99, -28, 37, 45, 87, 80, 45, 130, 106, -51, -2, 179, 40, 73, -2, -37, 38, -98, 14, -64, 29, -24, 114, 108, 30, 74, 24, 68, -129, -123, 82, -44, 115, 77, 177, -227, -90, -116, 104, 14, -125, 12, -83, 36, -52, -37, -52, 162, 33, -76, -119, 8, -98, -137, 9, -37, -64, -111, 129, -83, 29, -101, 142, -8, 68, -83, -44, -125, -73, -31, 43, 111, 44, 27, 92, 71, 24, -68, -164, 286, -83, -108, -200, -56, 148, -13, 76, 49, -178, -37, 5, -14, 143, -182, -90, 140, 185, -121, -28, -37, -37, -170, -47, -72, 118, 42, -54, 73, -62, 35, 103, 40, 112, 77, -74, 71, 198, -16, -133, -225, -85, 66, 91, 26, -91, -151, 139, -17, -107, -38, 81, 199, 192, -123, 17, -84, 61, 76, -105, -192, 35, 154, 207, -23, 56, 30, 23, 164, 177, -75, -66, 115, 236, 88, 90, -73, -42, -257, 79, 21, -40, 74, -315, 58, 20, 22, 62, 115, 181, -78, -65, 167, 121, -79, -177, 25, -18, -32, -162, 340, 7, -69, 129, -38, -193, 116, -82, 99, 48, -143, -112, -36, -72, -53, -4, 121, 49, 287, -21, -25, -24, -41]
7026d1q9m0K41l02R5J78Op5M7J92l14K13j72j07K72l3N5j94J22j97J18Q1J6j35
7050f3p1l2J91J33M2k36Qm8kJJ9J07m5J34r2j6O0P9l09J40j22K1j87K74N8j60
7076a16J83k3j44M4Q5j9k5k2%J71k9o0j88R5J22q0K18k77K28k72n7L05k18K56
7100A77P0l64P3P4J26j10L0Q5j62J13q6k9r7K70r0j54K6k2oJ32R4r7p6L1O6k15
7126a41K62k16K31m53M12J5j82P5j7J28j97Q5L9o3O9m0j99M6K00J40j71K7l14
7149b64J54N8M9k1K6m8j46J68J07o2j2K0J19j18m0k0j23j4K37k76J34K74k56J25
7173G1j11Rj72L03M0j71N7j10J86l04P3K2Q2L80l62J89o6p1k08J82p5K25k10J48
7197A07j67J07j52K01k66J30J09M8q4J19R7O5r6j26q3j06j6J33J18p9j20KJ27
$$ y = [-41, -130, -170, 71, -231, -136, 42, 48, -27, 20, 212, -102, 111, -61, -168, 104, 71, 126, -68, 54, -143, -25, 56, 72, -63, -134, -166, 25, 158, 200, -36, -28, -76, -78, -77, -58, 49, 4, 138, 46, 30, 90, 169, -140, 0, -122, -101, -288, -14, 44, -116, 67, 44, -100, -56, 29, 10, -15, -37, -37, 134, 105, 45, -143, -48, 74, -6, 212, -65, 163, -109, -166, 139, -79, 177, 247, -117, -44, 30, 156, 46, 76, 161, -1, 112, 26, -3, -100, 170, 80, -74, -48, -70, -76, 56, 150, 53, -23, 8, 74, -141, 121, -95, 136, -317, 95, 110, -72, 3, -14, 114, -83, 2, 41, -22, 47, 7, -192, -146, 54, 194, 23, 50, -264, -110, -52, -3, -24, 2, -46, -192, -24, 83, 21, 9, 29, 148, 30, -10, -30, -153, -167, 70, -206, -72, 202, -54, 71, -40, -31, -203, 100, 140, -31, 26, -84, 102, -202, -129, -107, -25, 355, -7, 182, 116, 45, -163, 19, -56, 169, -41, 107, -60, 47, -105, 96, -170, -40, 69, 117, 33, 152, 249, 314, 218, 92, 9, -97, -113, 20, 138, 59, -61, -59, 68]
7220F8j8j08K1J27j06P9r8p1O2J5n6K55n3J8n0k10Q0N2j33j44K68R7k5N3k59L3
7246a03N9J49j05J96l69N8J73j60K50l32M30k16Q6r9k8m0J37n2K17m21K10k4o2
7269d6NM5M4M6j85L06j88Qp5J44j86j20l2K22K3l7J24o5r5K6N9k18K16NL9N6l2
7296H9l33K32j47P7J29K01l5j8k42J43K20l02j29j9J97j88l8K34j74m4O4J12j15
7319h6J24k80J41J74m3P4k26p9K41M1k81J56p1J4J36j28K11m7L2k49J53rJ54l07
7343a55J70k7O9K6j2n8j98J57r0K15o6j11n3M5L02l08jJ76p8J79m28Q7J67J19
7367A27j2j15j16K4J98lo5j04N7j23K42j02j33K61L3j81N3m9j4o0m7p4K42J44
7391A83k22R1j28n7R9J93o3l14J08J60n6L8l7J3J2pK8j42L01l16K02j11J67J06
$$ y = [68, 50, -58, -37, 90, -16, 63, -35, -106, -44, -29, -85, 170, 117, 135, 85, -125, -45, 7, -126, -270, -2, 95, 70, 123, -136, -103, -44, 105, 0, 196, -173, -115, 58, -102, 148, -184, 246, 30, 116, 17, -11, -51, 86, 34, 251, -170, 40, 16, -46, -41, 4, 48, 94, -91, 215, 27, 35, -40, 104, -82, -202, -234, -12, 11, -26, 98, 33, -62, -36, 23, -195, 21, 26, 65, 121, 89, -244, -12, -159, -82, 47, 248, 213, 195, -47, 96, 316, 14, -115, -134, 63, -125, -163, 71, -103, -147, -83, 29, -86, 38, -242, -101, 73, 30, 104, -122, -201, 40, 81, -200, -44, -115, -101, 35, -93, 118, 71, 103, -146, 7, -2, 152, -155, 15, -12, 57, 83, 71, 13, -185, -28, -118, 97, 31, -80, -133, -88, 214, -94, -95, 81, 3, 182, -246, -159, 8, 127, 115, 0, -116, -92, 106, 103, 38, -66, -9, -132, 110, 8, -125, 136, 169, -12, 41, -8, -22, -82, -129, -203, 39, 183, -39, 52, -76, -133, -34, 159, 96, -218, -110, 50, -6, 32, -5, 8, 20, 13, 41, -101, 200, -116, 86, -25, 142, 248]
7415B48l56K77j73N2j9N0q6j70O3Q1j28J32J03o7k6j0j62J48K35k17P2nn3NN5
7440D9m8k89L12K6k03K31j50l4J63qO3j49K06k56Qj10J21oj00K06j71j2K96l8
7464A07k15oJ19o2n4Q1J05j32J23J13k15K12m27K65R0n7J24l09oK31m1k03O6J87
7488I6j76L5Jj02J65j89K52P7j63p7j9o2J54M9j24J1K20j72j0k8J36j97O1J33
7512G1K3l73J72J47j47J99k78J8K79j12L9m9p1N2L4n0J35j45R1K03j93k29L11
7535A27j18p8RJ35L5j80O6o5J33k13R0q8J77L8j94Q8M4N2JL5j31o1K2J56N9N1
7561A90l25J62ko7N5k3j39L12k26J3l7J35q5J3M5k7J62m07L09k7j46R7kR1J31
7586B02j78k0J69j44M5lJ1N4j21J25k73J34J37k45Q7n0J40j70r6J65N4P8j41q6
$$ y = [248, -108, 169, -4, 48, 29, 79, -7, -177, -114, -33, -161, -29, 74, 7, -19, -29, -191, -43, 192, -25, 47, 42, -11, -6, 49, 1, -288, 24, 50, -153, 78, -72, -106, 57, 49, 112, -37, 169, -87, -79, -189, -68, -74, -174, 32, -139, -151, 145, 107, -108, -114, 5, -57, -111, -30, 75, -57, 66, 179, -36, 176, -251, 14, 104, 47, 171, -138, -144, 87, 46, -157, -91, 96, -80, -45, -44, -146, 19, -170, 82, 159, -4, -81, -100, -162, -8, 41, -83, -72, 148, -24, -34, -62, 74, -123, -62, 71, 94, -279, -107, 40, -107, 92, -186, -168, 111, -1, 38, -11, -82, -30, 4, -46, 89, -56, 35, 238, 45, -184, 127, 9, -69, -60, 75, 110, -70, -4, -69, 64, -149, -59, -147, 30, 68, -126, -38, 6, 58, 59, 94, -37, -98, -76, 80, 139, 190, -135, 27, 25, -42, 13, -10, -149, 163, -63, -50, -87, 48, -37, -24, 21, -6, 156, -251, 58, 31, -115, -18, -20, 71, 202, 24, 4, 173, 29, 74, 71, 82, 136, 15, 140, -133, 1, 138, -107, -20, -70, 70, -100, -196, -31, 23, 101, -40, -126]
7610a26R7K7k87L07k38J74N5L9J34l10L89k91j28Q2R2Pj45M13k71l8K9n5j73K52
7634C5n6k11J71R3l6Oj12L99l64m1P5k1O1j60K6L9M9j07J09P2j1k23J18n9J84
7659C6K34k56jj55J17k4j1L1J27j07J27m6j74k0M0k6K23j71J4l4J89m5j41L5o3
7684a01J26J4R4j59j04o6j8k5K43k24N8J75l2K14p3k17j35J93o5J88P9q3j56J8
7708e6j09R9J59j11O4l0k06o9M03j75Rj10J90j41J56k36K08l2k9j15L12j44K80
7731C17m82L1J37j46K69m6l3j04M3K6j05q9K39J6k48J84m8k27L6J95O3j91L20
7754A57k00J29j85R7rj00J2L1J85k60K43mO0m5l4k02N8J28nrP8L1j25l5R0m9P5
7781A12l14J20n3J42j54K20q4J53l11L24k38Q9N0j47O9J14m9J10m17J66K29j54
$$ y = [-126, -29, -2, -289, 18, -220, -46, 9, 48, 182, -128, 261, -30, -158, -76, 16, 23, -122, 291, 20, -18, 11, -44, -217, 35, -21, -232, -61, 32, -4, 2, -110, 289, -75, -116, -41, -62, -1, -161, -135, -96, -47, -154, -45, 27, 16, -207, -89, -148, 36, 270, 14, 13, -142, -25, -49, -60, -29, 98, -9, 118, 72, -102, -122, -82, -108, 115, -56, -42, -76, 113, 68, -73, -38, -101, 25, 39, 133, -26, -130, -196, -214, -239, 4, -220, -162, 13, -19, 195, 122, -95, -230, -37, -102, 86, 165, 82, -74, -56, -165, -66, 93, -18, 46, 16, -190, -259, 144, -31, -22, -132, 58, -83, 73, -163, 45, 13, -16, -131, 181, 37, 317, -165, -134, 3, -143, 126, 80, 47, -57, -14, 12, -93, -182, 57, 73, -175, 9, -39, -266, -230, -35, 28, -163, 157, -43, 86, -99, -2, -11, -111, -99, -68, 117, -143, 100, 96, 156, 111, 77, -125, -67, 61, 56, 47, 125, 156, 31, -4, 86, 37, 112, -202, -82, -135, 7, -147, 73, -11, 142, -169, 155, -83, 6, 56, -91, -22, 92, 43, 153, -264, -98, 131, -23]
7803b3l9P0MO4Jm2q5L0L0j20J14K00l60J13k7N8p0K60j00K6j03r6k1K40k95J84
7829A3m3o6j0Lp4J82Oj0M9k27K13N0l13J82pq4O5l8J83j23m0P3J91oj8k57J75
7856F9j30R1Q1j60p9J4Q0j4jK51l13k9P1Q2j37K62j54N8N5m1j85N9J43j99j11
7881b37M25k32q7M09l55J41n0l7k50Q5q9K25J13q2K2oR7k22j0J09n7O3k9J15r5
7906c4m4J19L0j87P4m5p6J23J27j32jM0o4J11J98l93J22m0j56J64k41K55J13K1
7930H4j85N8n6q6J00L3J59j28MJ60k1k21L07j13k99K73o0o8J30j32K05j06p2O3
7954B9Q9j85N2p6N4J09k68K95j28p0J89j40M3L0p1O3j7L4J4j9o3J39k20J77p2
7979a2r7K05j10j0K3k26J55J54j67J65O7j62l1K71j45N3l03J00r3L17j98K14j62
$$ y = [-23, -62, 8, 12, 76, 77, 35, -50, -20, 10, -110, 4, 204, -156, -43, -70, -12, -82, 178, 78, 104, 1, -95, -116, 124, -171, 13, -30, -96, -106, -103, -177, 5, 11, 1, 50, -177, 36, 86, -227, -45, -52, -136, -71, -109, 74, -49, -89, -16, 175, 169, 151, -106, 69, -61, 30, 111, -49, -128, -114, -34, -48, -49, 202, -111, -140, -69, 13, -124, 138, -16, 42, 97, 56, -129, -70, 73, -126, -237, 188, -44, -131, 278, -77, 64, 14, -23, -273, -188, -277, -52, 61, -21, 1, -5, 92, -130, -140, -31, -88, -25, -54, 61, -34, -78, 41, 71, -116, -42, -87, -163, -40, 87, -45, -46, -6, -70, 41, 239, -154, -32, -72, -228, -64, -305, -50, 63, 84, -101, -43, -99, -185, -85, -52, 107, -21, -17, 143, 122, -99, 208, 95, -204, 69, 9, -59, 71, -61, 144, 38, -34, 29, 118, -67, -15, -91, -37, 72, -196, 99, -29, -99, 90, -50, -7, 23, -48, 15, -2, 32, 46, 27, -36, 103, -117, 60, -12, -109, 96, -14, -24, -1, -227, -72, 82, -85, 80, 147, -15, -46, 225, 80, 133, -170, -70, -163, 154, -44, 170, 8]
8002HJ43j75j81K91M2j20N0K84k66q7J3K8K1q8NQ5J18j37Oq2q0J64j69M6Q8J02
8028A09J34k51O4n6N5k00J46m3L3Q5r8Q5N0k19K77j07m4k2K8L4p1K9qk3j40L49
8054A96l0k35J36m1o3J37l3j55K34l2j62O9k65L29q9r3r1K39Rj18j95L55k42N9
8078h1J56m6q7Qo8J64l7j24K21k08R2J8K5k58K96m6L19l34k9j84J64K1J18k09
8102a09J11J55l41J60J88k11J45j23k4J38k39K41k87RM4J20j99L34k37M18k53
8123D0q9K39l36J88k97K88j66K94M0j07m4q0q6j3K17k58K19n1J97j31K10M8m54
8146a32J89j54Q2pQ7j89R6J53K9k9o4nq1J24k02K06k18J46R3k4J1k02M9O5J12
8171A35o5J31k36K18k30J82M1k95J14K1j27K84k6k62K05l0m9J4j61J88
$$ y = [8, 151, -24, -205, 86, 128, 8, 58, 342, 76, -11, 2, 30, 51, -37, -32, 53, 171, 34, 40, -42, -122, 42, -127, -81, 7, 109, 243, -8, 56, 0, 55, -145, 1, -42, -9, 76, -22, 63, 113, -106, 171, 64, 20, -2, 26, 60, -11, 18, 10, -13, -153, 196, 166, -69, 67, 26, -37, 100, 67, -88, 146, 114, -48, 21, -244, 85, -4, -97, -188, 51, 60, -58, -253, 102, -140, -81, 75, 29, -58, -50, -118, 46, 9, -115, 106, -102, -10, 8, 33, -225, 71, 25, 344, 10, -19, -203, -39, -18, 100, -109, 2, 157, -184, -24, 164, -47, 98, -25, -49, 89, -150, 91, -196, -187, -143, -23, -222, 112, -125, 293, 40, -49, 190, -146, 42, -255, 33, -133, 161, 201, 94, 50, -30, -116, -129, 88, -170, 49, -2, 195, 64, 274, 322, -132, 57, -97, -15, -22, 65, -124, -28, 125, 154, 125, 61, 56, -25, 99, -103, 103, -115, 31, 124, 100, 111, -91, -42, 23, 135, 70, 201, -35, 183, -47, 135, 176, -119, -5, 16, -111, 173, 147, -115, 90, 60, 11, 25, -136, 52]
8191E2
$$ Imaginary data points
##PAGE= N=2
##DATA TABLE= (X++(I..I)), XYDATA
0@%%%%%%%%%%%%%%Qj6J6j6J6j7K5l2L7m5N0n8P2q1Q9j04J20j37J60j83K06k31
36a21K58k90L27l67M08m53N03n59O19o84P56q34R17j009J112j225J351j490J646
55H65j821K017k244K506k812L177l620M171m882N835p183R259j2907K1174p6519
70f2984J3043J36515l9800o8710j6808L6136K243L813J1261j124k4078J3299J7743
83B0549j9392k9940K0678L6922l734m3120p150K6661N432j4920K370O977K24m69
97A088L418q088j4722J1122L3426M57k9588j1860P567K769Q619J8930m172l7919
111a8953j3345L4056J7435k3809q855J7070J861j5238R85J6427p83j4142O236
124a055J6164n193j5621N23J0037k033p756J0153J0959j8033k2778Q449K2874
$$ y = [0, 0, 0, 0, 0, 0, 0, 0, 0, 0, 0, 0, 0, 0, 0, 8, -8, 8, -8, 8, -9, 16, -16, 21, -24, 26, -32, 40, -41, 48, -56, 64, -73, 87, -96, 110, -121, 137, -153, 174, -193, 215, -238, 265, -294, 325, -359, 397, -437, 480, -529, 583, -642, 709, -781, 865, -956, 1061, -1183, 1323, -1489, 1688, -1932, 2239, -2643, 3192, -3991, 5268, -7639, 13535, -62984, -49941, 86574, 46774, -21936, -38744, -2608, -365, 3448, 14709, 13585, -10493, 2806, 20549, 1157, -28783, -8105, 28817, 25083, -18037, -25187, 1474, 6906, -8014, -5644, 1333, 1557, 1088, 4506, -3582, -18304, -7182, 26244, 26701, -2887, -14747, -7180, -4411, 4208, 23138, 18966, -18953, -32298, 1758, 19193, -4616, -13471, 3599, 5460, -9778, -8793, 7634, 6851, -7291, -1055, 15109, 9916, -5705, -5182, 4855, 2822, -4934, 5219, 16178, -1855, -24633, -16184, 6690]
137F690O399r035p304o089o450R059K1538L249j6063q664L412K740K635P600J467
152A1184j2576q054P181N233l434k494j244o67K938M912k61q398n766P893J3487
167I934N031q994j2285j935O774P468P661j929j5584j0363N324J0755L268k411
181B714k210o327p497O052J3807J404p671m514J798N465L149N6n011o548M849
196d84J0577j299j0124q531l75R495P856k241o700p567k352P402R230M764l963
211E688q892k675K968M447Q697K246j1131q695J500P139M689k404n895n508q4
226g910Q897N090q387o979L525Q198N680k246p263l903K530P628N858l658o700
241C60m729j721M848N320k9k555n657o202J629R214O580l209p803k244L081N754
$$ y = [6690, 13089, 4054, -3250, -9339, -15789, -6730, 14808, 18057, 1994, -6670, -3258, -518, 2117, 9717, 11184, -1392, -9446, -2265, 2968, -466, -2960, -4204, -4871, -1933, 2979, 2718, -5680, -11446, -3553, 9934, 14965, 5971, -6314, -8249, -1475, 5993, 13654, 11725, -3859, -14222, -8898, 1857, 5125, 2714, 504, -5823, -13320, -7268, 6539, 7943, 272, -4242, -2444, 3021, 6170, 6226, 1215, -5333, -484, 10093, 8794, -1330, -9861, -10236, -741, 7115, 4874, -1826, -9393, -11745, -4343, 4887, 9651, 5688, -3204, -5879, -2911, 1536, 10233, 12479, 1348, -7347, -5847, 1292, 5981, 3577, -2318, -7826, -7910, 987, 6077, -2310, -9289, -5764, 2434, 8114, 5868, -1395, -5298, -2768, 4860, 10718, 7060, 360, -4369, -6090, -1242, 4078, 4049, 1494, -4163, -10365, -8736, 478, 7058, 3849, -3954, -6198, -3117, 2637]
257B637O301k430r042j431O735M283k420o110l017M61L714N127k306q168l834
272i500L183O625N296q08n867m782Q07O579O652Q14m873p777k205P057M877r03
288E175l857o199k569M457N238J89n385l635L398L454K210J453l811m324L289
303i17N899K283k181n730l111R30L969N443k405q008m128N51N900O804j738p348
319c787l029J494O358N192r77l909m973J517P166J223l393k722l640N17N014J239
335C290l331m815k050M142L636J404l15n859k875N986N465J871k013n903k301
350c668L182M244L129l464o200j790Q56L509L899l189n371j43J655L585L009j980
366A263l173j047K617N631K83l707k257k155J914N667mm814m551j485L363M168
$$ y = [2637, 8938, 6508, -2534, -3965, 2770, 7053, 4633, -1477, -4494, -4033, -319, 4808, 2502, -5666, -9500, -6317, 308, 5604, 4796, -1071, -5853, -5046, 1533, 8185, 8999, 4126, -3651, -5856, 1201, 6078, 5175, 1318, -4881, -7450, -2993, 2245, 2434, -2951, -6586, -3188, 266, 2476, 3929, 118, -4206, -917, 4982, 7265, 5084, -646, -3757, -2827, 1142, 6585, 4180, -3828, -7956, -7405, -1505, 5299, 3561, -3787, -6816, -5322, 1036, 6228, 5251, 1342, -3631, -2114, 5052, 6275, 2882, 160, -3480, -2963, 2051, 3290, -41, -4856, -6906, -2764, 872, 2276, 1961, -3898, -6773, -787, 4678, 6549, 4536, -1367, -3668, -486, 3758, 6887, 3423, -2777, -4567, -3711, -202, 3697, 508, -4863, -5006, -3351, 234, 3243, 1263, -1910, -2957, -340, 5291, 5574, 1867, -390, -2545, -631, 5036, 5032, 218, -4333, -5818, -2455, 1713]
382A713J024k535n786j480N773M768L81j624m317j016M207L849K97l479l483J47
398a561J561K148P49l970l411Q79J843K035J102k173k934j98L468M210K36k292
414A692k990j560L387N357k20m744m122p34L169L698O5l917m954M87M733K782
430B129J50l264l234J492M672K933j315l489j478Q36K598K433j110m584k288J277
446b242K199K037r13l500k390R03M168K394j059j751k481K82M272L294j597k980
462F36k139L75K863J345p33l575l055J694L085Q49q98k973k299K328L941J530
478B974j225k977p47J871K919J976j937l997o70J439J620J569k028l548j041J593
494b209K207J436j838r37j744O18M106K002k344j444q92Q77L068O34j714k905
$$ y = [1713, 2737, 202, -5584, -7064, -1291, 3477, 3858, 2234, -2083, -3099, 1108, 4957, 5254, 1775, -1708, -1561, 0, 2148, 2897, -1073, -4484, -3605, -1762, 273, 1375, -798, -3732, -3930, -462, 3748, 3984, 1692, -1298, -2858, 529, 5886, 5666, 922, -3200, -3934, -765, 2933, 2998, -919, -5873, -5386, -653, 2129, 2279, -985, -4219, -2727, 1945, 4878, 3563, 74, -1404, -568, 2030, 4463, 3353, -1231, -3519, -2242, -43, 1994, 1081, -2419, -4809, -3906, 262, 2656, 1597, -154, -2635, -2353, 1919, 5213, 3616, 636, -1503, -1128, 1735, 3080, 2347, -1228, -4283, -2589, 496, 1345, 447, -2526, -4825, -2497, 1444, 2974, 1749, -1228, -1975, -104, 2815, 4791, 2854, -1143, -1813, -374, 1246, 2815, 787, -2761, -3802, -2209, -2, 1434, -404, -1341, -3085, -2467, 1639, 3641, 1297, -147, -1039, -162, 2906, 3540, 1826, -1079]
510a079j592J992K316j47j414k944j654K889K577K07p61k526k38K027K708J336
526C697j776k787j53J645J695J130k310l274o41J724K215M96k551j891q70J835
542a816M079l55k748j163O30K226K566n35k287j763L40K064J102q19j613k150
558b242l67J883J008j89p01j394q15J895K531O11j803j866O30J751K146M51k843
575F86k462O00K247J230j119k537j506N13K007J999j560j977j56N00K149J698
591B312j012j447p27O56K044M38o40j034j922J60J959L8o76j286j490L58K018
608b51J236m10j499q25J022J328J493K25k283r29J247J035O47m15k466q27N64
625a108J224R87j267j464l26J31K184J104j276j275J52O66J727O92r99j236r79
$$ y = [-1079, -2671, -679, 1637, 1490, 76, -2868, -4522, -1633, 944, 1151, 390, -2136, -2374, -347, 2361, 3697, 1921, -866, -1019, 626, 2321, 3451, 1141, -2133, -2774, -1050, 1165, 1661, -890, -2781, -3651, -1816, 2263, 1908, -840, -2003, -1373, 853, 3419, 2884, 597, -1166, -826, 1238, 2340, 1521, -92, -2242, -2609, -726, 282, 93, -608, -2002, -2817, -922, 1609, 2220, 417, -1449, -819, 932, 3078, 3529, 686, -1776, -1176, 1071, 2301, 1182, -1355, -2861, -2348, -341, 1658, 98, -1879, -2035, -1535, 614, 2312, 1300, -147, -874, -218, 1826, 2264, 1624, 590, -1332, -1172, 787, 825, 149, -1137, -2627, -2269, -251, 985, 575, -924, -1749, -727, 601, 2094, 2319, 36, -893, 354, 1389, 2036, 1621, -845, -1672, -1108, 116, 1103, -164, -1628, -1954, -1823, 361, 1465, 189, -1086, -934, -268, 1459, 2151, 1152, -84, -1063]
642a063J066K008m89j600o44j412J169J480J01j181j083k27J153J243P42n36j502
659g75j79J360J059O86p56j859o81J184R89J37j251j540K9N82J250N39j476o67
677a369M5J446J087L50j260o85k78J352J280m37r86j154m87R12J236m48j204q69
695a469j5R36P92K45q34o71L95R46Q79k6o77p09J40N61P64k77j060p63RN63Q23
716E52l71q57q22K17J074Q50q6o97j048Q66J303L77l31m65j015k14J366K25j6
735I08j567n74L67M66O90n5j053o61J018N37N90m6r51j44N42R25J78l45r87k51
755d13J7P85N24q45j040j99N08N58O73o34o70j05J53J088O74m70n90k56MJ238
775A000M7k89o10r99L91Q39J23n36r77j36P89N93k5m2p93l74R06P13O1r5p16k57
$$ y = [-1063, 3, 2011, 1522, -78, -722, -2134, -965, 515, 616, -565, -1648, -1875, -722, 521, 1263, 727, -775, -954, 406, 1465, 2151, 1395, -464, -1145, 39, 1028, 1165, -86, -1626, -1597, -1015, 235, 774, -702, -1369, -1324, 122, 1209, 1559, 299, -386, -664, 688, 1968, 1531, 545, -609, -1096, -184, 1052, 604, -600, -1469, -1484, -548, 244, 489, -345, -1016, -621, 325, 1204, 1178, 501, -208, -68, 493, 1257, 980, -80, -843, -834, -271, 552, 181, -676, -1498, -1281, -207, 643, 557, -140, -1188, -322, 981, 1358, 1027, 562, -453, -667, 699, 924, 908, -659, -1233, -866, -400, 290, 235, -818, -1479, -461, 76, 666, 620, -331, -475, 67, 992, 1170, 825, -162, -413, -396, 389, 913, 68, -972, -1171, -663, -105, 568, -66, -736, -841, -688, 400, 1074, 604, 14, -242, -238, 1000, 1047, 758, 148, -851, -460, 379, 502, -34, -1011, -1147, -358, 235, 210, 168, -625, -999, -93, 620, 681, 586, -130, -387]
797c87P05K94M61r45p00j12L00M16J58l73n92j37N61O46K00m34j15l81L97O09
817E71K70m68o32L4K92N82No48n11k43M70M37j24m68l67j64Q40N95J7m62k97j54
839d25O66L13L05p87j51K4m5M63q4n86k77Q5K78K59j13l67k68M98J41N07N5m22
861F9k07j0M65M81k56l70m47J94K23J28j51m77k54KM21K94L8j57m40J38P47J66
883E97K1p09j86J88N46J63j32p57k16J2O14Q1k08n02k1N0M06M27l63J5j34k05
905c13O54M51m41k90k72J74L50l0j00l20l33R6L11l7J74j47n07L04L16L65N9l45
927A19j49m9M22K13k9n61k09K99rN40l91p94O7P4M59J46j71m37L32J16K55K00
949D43l63n1J64l6K45j98o2k37m8Q6J76M1l09j57r4J3K60K49k18j78j57M05L38
$$ y = [-387, 318, 612, 1073, 128, -572, -684, -384, 32, 190, -183, -775, -912, -351, 295, 495, 61, -54, -435, -38, 571, 841, 373, -259, -225, 67, 649, 654, 6, -505, -748, -278, 159, 35, -433, -800, -964, -124, 471, 488, 26, -271, -425, 241, 554, 859, 72, -79, -55, -100, 363, 279, -307, -584, -499, -221, 38, -75, -442, -710, -212, -71, 436, 491, 69, -138, -148, 317, 798, 542, 172, -275, -81, 142, 270, 119, -358, -612, -610, -189, 105, 143, -14, -454, -316, 431, 597, 618, -91, -277, -89, 457, 620, 488, -269, -485, -473, 141, 222, 14, -488, -509, -459, -53, 374, 11, 26, -108, -313, 341, 792, 351, 61, -211, -37, 313, 283, 183, -137, -470, -374, -63, -100, 74, -73, -580, -276, 40, 405, 464, 119, -30, -79, 343, 556, 527, -34, -243, 56, 47, 587, 196, -598, -531, -457, 2, 148, -23, -460, -128, -12, 243, 443, 80, 29, 193, 157, 402, 204, 142, -95, -143, -57, 119, 160, -149, -306, -400, -387, -127, 122, -96, -274, -431, -26, 312]
972C12nk19k25J73Q0J92o1k14k47O3J03K02q8l94p8M8M68k1O2j64j37l2P1M89
996C78k12j4j93P9K8J3K81l38j87q7R4L7N5k48N5n7J76K93o3N6k41K07J94PP7
1021C90k21j34Pj15L63m05m2l73K68l5N16j68j69j91K27K34K50k05l34j03j06
1042c46M82j21K16j91k80J75K27q1n2L9n07J23M13j13Q3j84k6K32RJ17J36k78
1064G3j33K60M8R6k77l5k54j1K42K7K1m08J91p0J83J56J43l36n2K39Q3L7k54J83
1088A52j28r0K60p5k38j91J16K95m8j54J15j27j16J38J77K07o3l72J32l5J52J5
1110A22P6j28j16J52m7pj95J43j40J35jj8l11m3K66J21N1K2k6j39K83q8j10J61
1134A63j02k72K86q6p0L40l93nLJ59j39J28l5j10K78j7lK25n5k17j44j09K70L
$$ y = [312, 307, 88, -137, 36, 116, 308, 247, 33, -214, -151, -48, 154, 66, -328, -406, -358, 110, 89, 151, -13, -150, -182, -111, 378, 166, 152, -41, 38, 66, 79, 360, 22, -165, -252, -158, -121, -66, -314, -259, -316, -140, 153, 90, 146, -95, 112, 306, 313, 390, 169, 35, 42, -73, 290, -115, -157, -530, -262, -297, 219, 51, -118, -309, -82, 152, 402, 197, -137, -240, -346, 136, 15, 231, 40, -240, -65, 162, 81, 29, 68, -439, -316, 97, -16, 67, -117, -143, 89, 98, 215, 351, 73, -60, 200, 248, 344, 67, 32, -222, -233, 9, 36, 57, -351, -160, -230, -47, 109, 252, -84, -136, 103, 186, 223, -31, 152, 24, -66, 194, 119, -119, -310, -194, 101, 53, -101, 14, -113, -229, -91, 86, 293, 230, -142, -10, -45, 107, 122, 198, 70, -46, 106, 59, 52, -143, 0, -140, -5, -6, -24, -335, -378, -112, 9, 60, 82, 56, -83, 200, 112, 2, 163, 61, -211, 75, -11, -81, 259, -134, -139, -136, 23, -116, 12, -23, -133, 145, 128, 125, 350, 295, 78, -66, -175, 95, 98]
1158I8Qj05p0K61l21J49j63J10j86K27J06r4K17m25K45J16Ro3m4j60J02k05K57
1181F9J53l69nj00L74N7j64k3pk35K68J12j86Q8j82Q4J15O2j82K60k73K28l00
1204a56J20Q1m50K19K54q4k1J55l4j93J4O2N0R2j62j3N4L01k88j39J63lj43J63
1228D2k2j08M3J31j45j8K48j08k32J18L8L62l22K37k78NL9j55L28k13j94J17l4
1251a21L0J28l1m4J11j81R3K0j53K53j93K3Q6J50J7j89j37P3OJ91j95J19j19L5
1275b8r4J85n1L7j94K24O7l9j19Q7Q5j55J17L2Q7j21j92M8k17K82j28P1K04l97
1299b09K76J90k20kP4Jjj08J50k49R3L04k21qQ1j39K0p1K2k8K5k89L84l05L11
1324H1j24J58j94j1J63q7J41k1j38R3q1K33k24j68K69m2k69K60n6j50K98r7o6
$$ y = [98, 106, 1, -69, 192, -129, 20, -143, -33, -219, 8, 114, 20, 237, -188, 57, 173, 182, 119, 75, -85, 17, -188, 69, 222, -147, -152, -252, 122, 179, 15, -8, -15, -250, 18, 130, -56, 32, -150, -66, 49, 111, -71, 189, -84, 144, -156, -36, 45, -405, -186, 68, -16, -37, 118, 84, -109, -95, -33, 17, 109, -53, -66, -12, 289, 1, -138, 25, 22, -121, 42, 20, -88, -45, 86, -59, -77, 171, 63, -169, -51, -13, 349, 27, 264, -14, -9, 30, -125, 203, -10, -204, -87, -121, -91, 37, 6, -38, 73, -108, -15, 5, -148, 105, -88, -65, 21, 171, 188, -1, -138, -65, -59, 132, -63, 56, -63, -28, -122, 63, 12, 49, -145, 79, 146, 107, -12, 75, 160, 5, 122, 154, 241, 120, -72, -24, -241, 41, -87, -16, 188, -209, 67, 257, 37, 35, 109, 110, 109, 1, 151, -98, -5, 299, 78, 70, 151, 12, 32, -39, -17, -45, -20, -309, 75, -230, 81, -43, 115, -79, -90, 73, -14, 127, 106, -32, 61, -20, 213, -11, -179, 90, 48, -221, 39, -17, -167, 131, 34, -32]
1347c2O9k1O0k44K45n2M2r8R2n1k23J12J12m7J09k32NJ74k90P3K11o2q9Q8K75
1372B26k66l0P5Q6J06j33k14n8K18On8O2k3r4o9Q8J98j63J79q8j01M4j16J52l8
1397a1j3qqm6M1J1p8L55k92M4K02j46n8j21J31q7M4J79k74K56l93L58r0j42J52
1422Fj5n8L1J16k45qK05j08j28P7L18j15j17K53k76l8P0K46j77o7L8n2N7j45M1
1447i1R2J16J8j14L8k89J64K12j7p0r8O6M4j41N2J26k39O1J9L7k28K50L1j12k05
1472b78J69O3p4J48k51L03J16k89K74n9j79K03j25j4p6J73j36j50K48p9O7k37
1494a83P7J39k56K07Nj19j66L01j25J14N7K0q9j13R3J27j98k42K76j05J65J4k32
1517b33L31k13n0K32R2j12l8J78k09J28m6nQ9j46O6k27L29k33J48j59O4qM2l4
$$ y = [-32, 37, 16, 76, -168, 77, 25, 67, -31, 61, 10, -213, -101, 11, -36, 73, -159, -154, 20, -270, -197, 14, -48, -137, -49, 226, -40, -70, 5, 91, 197, 64, -150, -208, 10, 16, -42, 20, -3, -97, -166, -78, 120, -43, 136, 48, -53, -9, -125, 27, -11, -24, -32, -40, -86, -45, -34, -112, 243, -49, -5, 197, 51, -7, -128, 3, -84, -40, 139, -135, 121, -272, 86, -4, -146, 6, -9, -67, -36, 80, -165, -173, 32, -76, -204, -127, 191, 76, -41, 212, -64, -102, -32, 214, 37, -30, 8, -44, 13, -132, -91, 1, 117, 135, 21, 59, -230, -66, 146, 129, 59, -39, 27, 71, -70, -18, 108, -131, -70, -51, -14, -242, 8, 39, -73, -278, -109, -46, -120, 28, -223, 80, 196, -93, 181, 122, -57, 146, 21, 7, -69, 104, -32, -182, 66, -13, 54, -183, -106, 33, -223, -16, -11, -130, -296, 5, -120, -6, 51, 71, -18, -131, -38, 89, -109, -351, -75, -180, -15, -1, -233, 98, -115, -165, 67, 159, 47, 9, 187, -22, 106, 60, 55, 144, -2, 64, -163, 166, -67, 81, -78, -14, -22, 20, -14]
1541a4l0K35k40n0K33m3k76L6R8l5O0P7L2k65J33J87k45rj12J64L7O5j21K18M7
1566A82j77j83K57Q6l42J56M1o3MN4J67k64P8j35K74j06m8J07l69M13k23K30j44
1589ej02k7J04N1J58j90mQ7r1o9L5j19K18J0j98J34m8j9J48j85n6J77m0J71q0
1614F0j79M79l08P8k13Q2M1j10p8P6K61j68k64L26jQ3k20J27j36j35L23k31K74
1637A67k72J10o4K17nn5L9l47P2J22J0L5M5k38J02J80j28L04l24K0KR8J77k69
1661bk9r0K65j07n0Q9k87j00N3L27o0n3P7j24K26j63K24q6j10j21J14P5j0o5L1
1686B4j20O8K38L4l74Q9M9o5P6j20J63RJ21n3J18j68k54J49o1L18j60j09Np3o4
1711a60O1K44l02J54k6j92K04RK1j1m1K0Q0J47r9j43n4k5K13p9r9j12r1K29j16
$$ y = [-14, -44, 191, -49, -99, 134, 91, -185, -149, -51, -86, -26, 51, 83, -182, -49, 138, -107, -116, -228, -64, -27, 38, -83, 135, 182, 5, -178, 79, 165, -177, -21, 20, -43, -39, 15, 182, -82, -4, -139, 135, 29, -19, 88, -281, 132, -91, 139, -5, -107, -134, -30, 21, 179, -11, -15, 72, -19, -88, -53, -172, 46, 56, -142, -8, -56, -75, 73, -112, -168, 9, -31, 140, 60, -119, 360, 52, 130, -83, -1, 40, -70, -148, -72, 189, 21, -243, 83, 82, 165, -55, 72, -64, -199, 124, -107, 167, -105, 5, -59, 158, 153, 98, 137, -210, -138, -16, -6, 29, 74, -164, -62, 118, -10, 294, -30, -10, -8, 90, 267, -2, -31, -121, 144, 37, -13, 76, -211, -311, -258, 69, 9, -44, 33, -91, 135, -28, 196, 110, 0, -121, -7, 68, 58, -7, 24, -96, -28, 210, 244, -130, -41, 8, -57, 19, -101, 62, 71, 192, 139, 257, 89, -165, -16, -77, 241, 81, -28, -23, -96, -160, -99, 145, -157, -3, -29, -221, -17, -8, 13, 2, -39, -19, 61, 208, 109, -34, -88, -113, 100, 21, -78, -190, -281, -52, -168]
1736a68L05p8p6j02q8K56J67j14J10m4k05o4J46N6O0k65J15J9j91J68Q8Rk91n
1760a92J72k8l5j40K86M1J88k29k24K42JM9j46J52k17J74K0k37J60p3J90j64l4
1783d4P9q2q8K18q7J22l02L74o1l9K2o7l09K59Q8k22Q5o1r0N4J69K6m29M12j57
1808a30J69j33J27l9O6J81N0k21j69J05N1K18k12j76n2M7j37K37O3K2k83L82j77
1831a1O3Q4j84OO5L1p6L14l22nJm8R9j80J1L5J09l08M09p5l08J47J2L86k05r4
1857d4R5l8J41j85L3Q6j86k8K8j00M2K68q4k24J51k34K83O0j30R1R1Q9l7j5j37
1882A6K1j21j1K52q4k18L58k62J65j3n3j43n3K11P7j46J18k02J04P5o9R6K01j26
1906A93k56R5k58K75M4j81J7O7k62J75J18q4J13q9J05j06J04q7j7j3K01j50j62
$$ y = [-168, 137, 59, -17, -119, -207, 49, 216, 102, 212, 168, -37, -101, 45, 101, 161, -104, 11, 30, -161, 7, 95, 104, -187, -192, -20, -48, -83, -223, 63, 104, 292, 63, -161, 81, 82, 131, -15, 137, -80, 94, 114, -123, 37, -36, 154, -10, -44, 35, -47, -135, 83, -4, 118, -184, 190, 129, 90, 112, 45, -264, -5, 83, -139, -54, -115, -205, -151, 18, 44, -385, 27, -130, 39, -94, 33, -6, 60, 241, 291, 70, -99, 6, 57, 275, 63, -113, -165, -118, -255, -18, 45, 67, -216, 166, -11, 52, 136, -48, -42, 23, 54, -22, 292, -30, -35, -34, -82, 17, -163, -152, -117, -8, -316, 93, 18, -290, -143, -131, 255, 50, -44, 51, 13, 154, -31, 2, 88, -98, -126, -98, -198, -156, 112, 28, -196, -45, -279, 4, 64, -66, 25, 116, 205, 168, 153, 16, 37, -84, -95, 157, 73, -145, 213, -49, 116, 103, 50, -93, -146, 65, 142, -4, 114, -88, 16, 91, 22, 118, 319, 193, -63, 32, -226, 49, 93, -88, -71, -4, -266, -91, 27, -57, 56, -33, 72, -34, 70, -17, -34, -47, 154, 4, -158]
1929a58K77J04k00j17K51j79k03K4L25j68j98K20o9p2K83r2k6K27j66j43j8K94
1951A96p6n8P6j62J30j19p5K9l9J43j19J73j10j47KK5K37l8p2m6Q8J17j88j29
1975a62L48j10L8Kk42K8J19j21L7R0q1m8K05J50k83O9M7q0L2L06l89j76L09j30
1999d2J0L7k04K31P0k54m6J57q5q8K42K3j71J01J16N1j60J64j33r4M6L3j04l1
2023a31l3k9J18Q6nl08M53k87J65pK5J15j57K26j92MM4P2n5j47Q3j99J42K9p2
2048f0J74j95k29M84o3j96K26k34L5Q3J49Qj81J09k2l5J49l17J06o0J67j40Q2
2071D0j86L13l90K88L2j10Q3m5L7M7j27J82Q5k27L1q6N7k21K45j50j51L12J02
2094A61j88j68R4q4J29J14m4p0rK19j04M0J21j29j38r9J75j99J54q8J48n7p9K02
$$ y = [-158, 119, 223, 23, -94, 157, -22, -225, -201, 124, -44, -242, -22, -91, -163, 120, 28, 2, 229, 63, -80, -98, 196, 120, 62, 138, -24, 106, -13, -88, -59, -98, 45, -74, 99, -11, -158, -156, -131, 106, 68, -4, -50, 38, 155, -33, -162, 186, 76, 114, 116, -126, -98, 21, -100, -63, 27, -54, -102, 103, 253, -30, 39, 86, 6, 38, 344, -45, -221, 88, -42, -32, 5, -199, 32, 102, -152, -198, -41, -126, -214, 28, 51, -120, -19, 97, 148, -12, 152, 19, -75, -29, 4, -100, -131, -164, -193, -75, 11, 6, -302, 151, -136, 29, 22, 47, 162, 5, 231, 39, 43, 87, 159, 104, -43, 40, -159, -17, 12, -60, 114, -81, -310, 174, 111, -85, 141, -93, -58, 25, 174, 182, 1, 110, 88, 53, 202, -115, -9, -69, 98, -42, 40, -146, 167, -223, 65, 97, -13, 70, 25, 62, 109, -18, 164, 249, 22, 53, -33, 24, -197, 48, -102, -253, 59, 161, -27, -195, -101, -185, -56, 58, 14, -56, -65, 154, 50, 90, 211, 82, -56, -155, 20, -179, -25, -113, 35, -22, -101, 101]
2118A01k67Q6J04n7nJ46k9J73k00N1l0j37L8J07k89M0J25L8q8k13Q1R6K31l1O9
2143A40J47k94M2J03l7m3K6N5l05N0j4J87J4n6K9j67K89k98K27r7QJ60l35L14
2167A45k8k96K32N6k18J50q9L5L8j19K05j51j19k5J51%m3K52k16n6Q4J81k16K10
2191A63j19j08m6J10R5pN1o9Q9q5j12L8j08N8J03r8J62k12P3nK22j83m2Lp1n9
2217a57J84k00J15O4n5j57L02q1j86p2R4J67N4Ok5J12j91l9J16j68Q9J47j85J13
2241D7j20R3Kkj4n2j19k4J20J22J24k48k16K71j6j09K27j1j91K83j60q7J18j77
2265a39K3K23j27k04L69j72j07l9K45J65k55P5j11K64j09k68Q8J47j25j71M29
2286B01k12l6j4j1j80M29k28J16J60l46P2J01l6K0Q8j00m0J24J10l06J84k29K02
$$ y = [101, -166, -80, 24, -33, -38, 108, 79, 252, 52, 103, 73, -64, -26, 81, -208, -168, -43, -5, -93, -306, -225, -129, 102, 71, 140, 287, -7, 35, 138, 101, 58, 84, 139, -166, -116, -130, 57, 71, 15, 44, -123, 166, -132, 95, -2, 6, 166, -169, 145, 117, -179, 53, 109, -109, 41, -48, -13, 25, -94, 111, -40, -159, -184, -33, -33, -76, 176, -40, -96, -12, 169, -47, 163, 44, -64, -110, 0, 95, 88, 139, 70, 159, 74, -38, 0, -108, -50, 53, -45, 117, -95, -22, -27, 195, 12, -30, -27, -98, -157, 27, -173, -58, 6, -49, -206, 96, 15, -171, -243, -149, 18, 72, 78, 53, 165, -26, -65, 51, -117, -28, 119, -66, 47, -73, 20, 22, 20, 6, -46, -165, -189, -69, 53, 177, -71, -287, -16, -32, -141, 86, 75, -116, 167, 7, -80, 38, -139, -116, 107, -20, -224, 145, -27, -134, -173, 72, 237, -18, 57, -54, 210, 101, -167, -79, 68, -57, -228, 201, -11, -47, -61, -72, -252, 177, -51, 65, 225, -121, -49, 52, 16, 36, 124, 24, -16, 108, 218, -88, 96, -133, 69]
2309F9J3k14J93J7l71L07j15K02j15M1j7k13K42J01p0K0o4Q1j7o4p9o5K69J6j46
2334B1j03J16P2P2k02l2Q9kj20J57j11K87m8l38K50k1n7mp1L1K16k03o7P5l6Q0
2360E1P0l85M42o4m34K74L3j04K2J80J08l86K71n5N2M0o2j35M4N6J55pj01j38
2384g3J27J99j58L6p1Q3k00M3L31l00R9j00%J11j36p0O1R7J13j87j91K86j55K3
2408c2M0j26J58Jp3N4J64l70J11J35l4N5j2j56K6L0mJ24P4j10J34j30o3j09J59
2433D6m0M7NJ4p9J06L0j4k05J66j16j74M73k07m2o5N6j23j1J28O3R4n6O5k91K43
2459A13k68J45j0J53K6m5J6j31K9J28k62L9J26j39k19J13K05l9k4K46p6n8k15
2482a47J36o2J15j42K01k13p0L62l08K93k11LJ39j73N4Q7p1K42m19L05r4J47l65
$$ y = [69, 82, -132, 61, 78, -293, 14, -101, 101, -14, 27, 10, -203, 39, 140, 70, 90, 26, 107, 90, 26, -53, -118, 151, 167, 21, -82, 34, 106, 178, -24, -56, 33, 31, -89, 68, -43, 244, 196, -142, 108, 87, 30, 26, -45, -14, 202, -1, -68, 7, -29, 51, 121, -264, 178, 114, -320, -46, -13, -117, -95, 85, 193, -193, 78, 23, 75, 115, 53, -82, -38, 18, 173, 166, 65, -73, 54, 253, 95, 131, 60, 143, -57, -14, 317, 17, 116, 16, 16, 127, -9, -79, -18, 79, 192, 5, -186, 100, -55, -32, 8, -118, 40, 41, -32, 22, 186, -184, -73, 62, 28, 83, 71, -85, -59, -29, -33, 91, 165, 55, 189, 59, -4, -113, 46, 6, 53, 58, 72, -7, 99, 129, 115, -90, 76, -40, -214, 259, 52, 10, -55, 1, -122, -133, -5, 58, 152, 96, 161, -130, 113, -155, -10, -20, 133, 159, 114, 130, -1, 28, 156, -106, -67, 59, -80, -299, -186, 19, -20, -44, 202, 126, 68, -147, -11, -73, 42, -100, 101, -112, -182, 180, -128, 165, -46, -43, 96, -77, -23, 64, -7, 235, -184, 121, 27, 174, -191]
2505a91K60j77K44pj27M8o5q9O4o2K39k65rlQ5J24j60J54m3j05K69l81K66Q3R
2530A61j79m1o7L4MQ3J49j59Lj91K54k11Q1J34Q1k45J8J29m9K57j73j37j11L02
2554A27K1k07p3J50j13q5MK61l11K42P3q5N3j82k5K6K77p1j39N9j20N6M1j72R9
2579i4p5N9mJ82k4k08J63J79l34K42j2k43J53M8Qj12K7J20N7o3k0O5kq7N0l9k8
2606Hl1K7j77M6J43j11L9K3j71K61q2J03k35K25jK9k65J94J50k61J26K6o3q7K85
2631B01m1K4j91o6qK01k23L7o9J34k22L32l11L68k37P9P0j03jJ41j18K28l58J57
2655B4Oq9J1O8j85J32L5j66K21m8R8o8k3M0O7j81l0R6Q0k26J7k0P9j04K11j88
2681a43J00Q3j36j32K9J41p0Q6J63k07N9R5l3J28j76P2k2q3K22j51R1O1k48J20
$$ y = [-191, 69, -108, 136, 129, 2, 50, -15, -104, -40, -102, 137, -128, -137, -140, -55, 69, -91, 63, 20, -85, 184, -197, 69, 152, 161, -18, -59, -126, -92, -88, -5, 144, -15, -12, -203, 51, -160, -79, 55, 136, -109, -91, 38, -11, 246, 73, -64, -175, 127, 148, -59, -132, 18, -95, -180, -176, 85, -226, 16, 89, 4, 57, -125, -150, -124, 153, 82, -57, 2, -118, -62, -21, -193, -94, -169, -110, -114, 68, 44, -164, -1, 178, -156, 86, 74, -169, -16, 32, 40, -72, -45, 75, 132, 69, 49, 114, 112, 25, 75, 36, 8, -23, 4, -173, -127, 16, -95, -56, -33, -204, 57, -25, 78, -157, 68, 67, 96, -169, 25, 175, -86, 40, 66, 3, -84, 201, 160, 184, -7, -73, -81, 120, -103, -66, -135, -1, -223, 109, -202, 166, -71, 8, 78, -25, -26, 115, -3, 225, -133, 24, 30, -59, -48, 20, -165, -33, 2, -164, 57, 9, 107, 39, 16, 56, 123, -58, -88, 8, 88, -138, -121, -141, -62, -166, 45, -143, -43, 40, -96, -228, -199, -58, -128, -42, 121, -86, -27, 68, 35, 163, -13, 59, 37, -46, 176, 25, 116, 177, -71, 49]
2705D9J08j71J03k22J5K87n6j15L0J65k66M5J5O6j37K9P1L3q5q9L03k75l0J85
2729E8k32R6k8K08k33R5K4K8J13j17j02J79l0j05K8K0j3j0k9n6O6J91k69K49n0
2754H1p2N0P3k18K2K65p6M1k2k46R1j2j46jK03j62l8J00K35l07J68p8M7MPl7j78
2781b06K51n7r5J28m1Q4j20l0K3M9J83R2n22L51j63M54l14j43p9K39j73J19k51
2804b21K18n9K06q8j55J00j78J71OJ8j10J36n0k1L6N7q0R6j59J4j8J08j04R7l0
2829a0k36K44R2J3k87K92j11J54k46q5P2LK41q1p9n5P2J64l7Jj27o7P3r0P8J12
2855A00j9J8j53j34QJ97j32J03j09J25j72KK30j02j9O6pk1M2j41J21m0J30pK0
2880A06O6k47N0R0k28L52j77o0J96k71K29%r4rq1R2k6j69K19j47Q5O4OJ42l22
$$ y = [49, 157, -14, 89, -133, -118, 169, 113, -2, 28, 193, -73, -28, -13, 53, -84, -55, 16, 49, -36, -125, 178, -97, -127, 58, -174, -78, -106, 102, -131, -36, -12, 16, 129, 12, -90, 89, 59, -46, -18, 2, -11, -21, -50, -106, -40, 151, -118, 131, 81, 9, 59, 132, -86, -64, 201, 125, 166, 144, -102, -11, -23, -169, -170, 33, -129, -167, -67, 168, -139, 29, -49, -2, 2, 9, -28, -206, 45, -12, -107, 21, -20, 64, -56, -86, -63, -14, 169, 261, -261, 90, -73, 381, 67, -76, -155, 84, -89, 30, -221, -3, -62, 144, 56, -99, 1, -177, -6, 0, 18, -92, 44, -6, -27, 9, 66, -14, 82, -77, -63, -81, 27, -77, 20, -10, -246, -2, 90, 103, -184, 108, -3, 151, -95, -180, -108, -105, 136, 55, -24, -79, -7, 157, 120, 121, -6, -73, 0, -90, -12, 100, 81, 99, -54, -188, -180, 17, -115, -12, -121, 4, -168, -166, 64, -38, -57, 9, 2, -19, 23, -118, 3, -37, 93, 86, 106, 172, -75, -25, 65, -163, 189, 12, -48, 148, -123, 106, 106, 12, 3, -78, 14, -12, -181, 38, -109, -24, 40, 46, 188, -134]
2905a34M4J31j04N3k7P3J58j54J44R0k60j33j3P8J70oj12q6M9L5j77L49j23q0
2929c5J17K2Q3k66L5R4j79K56k26r8K85k64K39o7j47pJ42r2J97j46N9M2q7N8l0
2954a5o7j06L0J39J41k38J66j74M01l29M4j86J23j54K04l6K5O4J38l08J77j15
2976g6n7J60p4O2j14K51Rl61J11l7J71k26K03j70J92R0j37p4J32o0K0R6k34J88
3000F5m7P4n3J9j52K52j19p0N4q0l7K62j59J5M0m6PJ15o7j26P5p0j53K53p8J04
3026G8N1j17k77M13j89L6R2nQ6k01P5j45N8n0l3J17P1o7R7r8j53QK45q9m1QK90
3053B60j76m0K6o4n1J30k04J68r2K17k69L7P4N0k07J56O0j18P7K0p9J15J13j48
3077E5J09K1l23J79J0O5j68Q5l1j27J82M5j51J26l3r3K42k48K4J82j74j50K80
$$ y = [-134, -90, 41, -63, -10, -37, 36, 194, 40, 184, 274, 14, -119, -132, -54, 116, 110, -2, -88, -39, -4, -181, 168, 45, -35, 82, 104, 187, -79, -44, 50, -129, 127, -99, -197, 88, -176, 63, -4, -151, -158, -16, -108, 89, -57, 2, 44, -43, 15, -15, -82, -188, -158, -19, 122, -116, 50, -124, 277, -52, -8, -194, -71, -225, -21, -57, -32, 32, 170, -138, 39, -76, -133, 27, -47, 15, -99, 152, 161, -200, -89, -126, 45, -181, 22, -148, 44, 134, -3, -77, 55, -5, 15, 111, -123, 65, 18, 92, 39, 58, -94, 158, 39, -31, 23, -57, -94, 168, 9, 24, 64, 18, 25, 140, 73, -53, 22, -48, -201, 52, -26, 78, 129, 12, -265, 148, -41, -5, 87, 82, 168, -33, 42, -103, -45, -95, -128, -11, 60, -7, 90, -8, -161, -153, 92, 3, -38, -30, 260, 84, 44, 70, 6, -45, 85, -119, 49, -43, 174, -95, -58, 16, 66, -141, 15, 75, -43, 34, 54, -25, 90, 203, 55, 164, 185, -138, 41, 51, 116, -52, 33, 2, -125, 57, 102, -49, 77, 44, -49, 193, -55, -31, 151, -23, -173, 107]
3100A07j44N8j39L46k79J50q5k4k9oJ94j14j2n4qJ42r0r1J17jK38l15l1j28J25
3125g3K53k99J38L5j82K49m7j57l4J4J88k24J23j82J77J14Q0j33j32O9L1L0J09
3148A47j78R2k90M32j69Op5K6j18M8R8j06n5J3K12l6M1O4j27R3j44J64l29K29
3172C8L0j15n3p2P4J10N7l24K10R3j23J58r4k36J86Pn8J95J1k59K33k93J81J09
3196F5j00k7K0J6L1J11n2j45K50p0n1n3r6J39M1o9j36L93k44P9k20N9K80L1j58
3221I4k3q4q1n2K79k41J63m3j6q4J75nj73K03p8J47r8J84k05m1j16K71k25K13
3245A64m7k26K59j72P0N7k29J71M6Q9j02O4k7j77J01R3l4j38rQ1RP5j73J11k09
3270a53R3J88J59l26j4o1M0p0r4J43J40l8J40j72K1p0P7L6P5q6k58K84N8J38j86
$$ y = [107, -37, 21, -118, 228, -51, 99, 14, -10, -39, -45, 149, 35, 23, -31, -39, 103, 13, -78, 39, 38, 276, -39, -70, -198, -73, 180, -119, 19, 54, -128, 121, 74, -83, -117, -103, 85, -139, -16, -198, -21, 93, 173, 40, -92, -23, 8, 38, 147, -31, 61, -229, 203, 34, 40, -35, -9, -127, -79, 19, -87, -142, -129, 83, 47, 88, 152, 25, 118, -26, 138, -191, 38, 68, -47, -100, -172, -98, 12, 69, -255, -45, 48, -75, 83, -11, -247, -61, -54, -112, 83, 94, -165, 68, -225, -44, 65, -35, -62, -42, -26, 5, 116, 64, -81, 169, 99, 48, -5, -101, 38, 79, 10, -126, 267, 23, 102, -118, -59, 221, 252, 94, 71, -13, -94, -146, 133, -108, 55, 12, -4, -88, 87, 82, -91, 112, 34, 181, 83, 267, 62, 21, -95, 176, -49, 164, 117, -109, 150, -22, 48, 105, -124, 47, 93, 182, 80, 144, 117, -60, 41, 134, 100, -38, -47, 34, 43, 118, -55, 56, -153, -60, 128, 287, -39, -53, -114, -74, -144, -238, -95, 45, 7, 147, -25, -4, -74, 3, 39, 114, 28, -230, 54, 112, 250, 64]
3295F4k0N8k01j46J98k8J52o0L5q6J04j02J01j9J80k83r8J01J73p3j57%P8J6j83
3320a96J24o6J44o6m8L3L24k65JJ50j28O5N5j10o5J39K4k30J21j50p7J46J43J9
3344H7j41j4q8L2K25l07L93j37K02j88j23J57j7k05J17o3J28j87N5j1J07p8L41
3367B85k71K46j88R6j82j09P7J19oj54N1K83k70K62l15%M6P7J01n2m7O7K5J15
3391B56O0k97l8j01M0J7J5m8J01l75L06P6j19J09Q3r5j08J6l0M6J3J7J44q3Kr
3417bk08M55k76n3K71r7j00J74j32J06j67P1J83r5q4j18J44k06K5j9L55m3j50
3440C4L5j23J52k38K4J41J87k05r5mM9R1k29L10q5n8P3j39j49L44k08K63l25J98
3464D3J55k42J80j87J03j95J17J28j64J3R7o3j7j27M4o5Q2J23K0j11k7j8k7Q8
$$ y = [64, 44, 102, -99, -245, -47, -75, 77, 17, 52, -34, 70, -32, 69, 50, 230, -53, -151, -50, 123, 50, -107, -107, -29, -13, -196, -72, -138, 6, -60, -108, -75, 249, -16, -15, 135, 7, 72, 127, 17, -48, 91, 115, -115, 6, -144, -221, -75, 68, 87, -54, -68, -156, -124, 101, -206, 187, 50, 252, 64, -59, 98, 81, -124, -7, -70, 58, -129, -74, -85, 22, -56, 285, 14, 260, 72, 168, -14, -123, -46, 73, 67, -87, -36, 247, -23, 239, -76, -76, -30, 47, 148, 96, 49, 116, 141, 256, 316, 19, -19, -120, -80, -63, -48, -96, 5, -370, -64, 12, -107, 2, 85, -10, -118, -102, -132, -86, -73, -56, 88, 5, 7, -2, -210, 245, -31, -84, 187, 90, -10, 164, 32, 138, -29, 42, 225, 130, 46, -72, 72, -134, -109, -128, 227, 184, 34, 69, -54, 98, -140, -116, 25, 212, 7, -88, -92, -43, 48, -181, 129, 44, -14, 59, -80, -229, 115, -93, 170, -155, 43, 198, -44, 136, -51, 52, -143, -26, 102, -62, -49, 48, -15, -32, -159, -115, -180, -98, 25, 45, -66, -93, -111, -138, -50]
3488e0j1Kp7K11j34J5J99p0k13J44l1J84l32L13M6l15J33j01P0m2pJ39j17NJ39
3513A00j67M8M5O1j38P7Q0J5k82J32P2j07p3P0Q4j4j60K09J30k11L0j60K21k36
3537a74J88P7j34j7J87J06k22j76N0K58j69J40m5r6K3J71k6p5j01j06K17M1j40
3560b3j28J45Lj14P1J21N5r0n6L2p1kJ16J33k38N2q4o2P9l3J6k9R2O2j74K34j79
3587g2J73r7m5K74l34N8K42l23K50J10k86q4K94Pj80n9J25J58l32K22jj87R6n4
3611d5J33n3N2R0p4j10k33O2J78j10O1J25L4j42l9J57j78K13ql20K69o8n8K42
3635A78n8k4k98J54j17Q8m4k9L31j96k1m4L9Q1j49P3J38r5k9pL0J7m2o0M10o33
3661c07M20j5j35rl2J16n7N1%J67k50q6R5M3l3j22J44k0J1j26J72O0n0K2j08p6
$$ y = [-50, -61, -59, -136, 75, -59, -44, 155, 85, -128, 16, -15, 169, -163, 150, 196, -119, 14, -87, -17, -59, -66, 73, -44, -39, 100, -67, -19, 26, 87, -51, 26, 106, 121, -161, -29, 43, -64, -137, -67, 17, 3, -157, 52, 182, -29, 1, -159, 62, -174, 14, 91, -43, -60, 127, 233, 11, -165, -115, 143, -26, 114, 69, -27, -4, 167, 141, 66, -35, -141, 76, 117, -23, -151, -6, -3, -117, -46, 75, 130, 40, -16, 16, -55, -57, 59, 192, -46, 6, -78, -140, -61, -94, -78, -107, -15, 47, -127, 107, -72, 101, 4, -41, 233, -101, -43, 199, -124, 126, 236, -50, -134, 160, 167, -13, -72, 53, 211, -121, 101, 100, -87, 9, -45, 88, 35, 87, 177, 103, -7, -240, -178, 0, -110, -49, 76, 110, -32, -71, 86, -92, 121, 113, -207, 62, -6, -64, 178, 120, 96, -202, -48, -165, -77, -121, -150, 181, -15, -36, -80, -41, 40, -109, -36, 102, 7, -22, -29, 1, 18, -24, -84, 326, -307, 113, 98, -37, -46, -78, 38, -19, 32, 32, 199, -51, -137, -42, 1, -32, -154, -10, -30, -19, -145, 27, 87, 37, 59, -49, -125]
3687a25J4O9J21Qj55Q9j13L5J54j11J07j37j45J60J21rj80q4J07p8K04j62J74
3710F4q3l1r6J5N3m2P7r7K15n9J26j73k28L73k39j21J86J09q1j26J2J50k06L12
3734A10n8m1m7j05L50r1Pj25o9j3L66l20l9J45j84N1j5J21j03M11k54K3j21PR
3759A5J45P0k72n1p5J92j08l0K8Q7J01k55J28k1j25L16j04j79L43j04p5p0j0J80
3783A26K7R1k35oJ0J74j37j69J28J00O7r6M1k0J86n80K81J3q5j79J93K39k08l6
3807g5NJ98R1r6r0M5m2m8J21q2M1j81K70j33J86j15j9j90o8N9J73N0K4j62N9l1
3833a0K0Pn7J22q3o0J51r1p9j37L38q9n2j9K3j8O0L4J36l43L58l40j27K78k62
3858b40J73J75p9o4J94o7J11k85J57r6J00p3M1j61J4k0L19o4j26R4k3j08k34J59
$$ y = [-125, -111, -42, 79, 87, -68, 21, -92, -57, 97, -14, 93, -44, -189, -29, 92, 83, -97, -181, -74, -152, 52, -110, 64, -19, -50, -146, -131, -78, -120, -43, -140, 75, 16, 142, -31, -259, 114, -125, -246, -60, 49, -32, -158, -146, 4, -202, 110, 52, 11, -36, -141, 209, 118, 125, 0, -69, -82, 284, -36, -75, 70, -114, -63, -78, 43, -60, 351, 97, 120, -1, 6, 15, 160, 230, -42, -93, -168, 24, -84, -114, -86, 1, 102, -153, -25, -46, -171, 145, 41, -138, 205, 101, 26, -44, -54, 126, 153, 244, 9, 3, 13, 187, 50, -119, 9, 109, 176, 80, 121, 101, 287, -293, -12, 1, -84, -263, -70, 169, -39, -75, -70, 128, 219, 123, 33, 78, 36, -12, 109, 27, 68, -113, 157, 24, 210, 95, 76, -114, -182, -123, 50, 100, 124, -38, 21, -10, 10, 17, -40, 82, -1, -61, 90, -1, -80, -217, 121, 32, -20, -39, -16, -34, 26, 60, 196, -147, 211, -129, -256, 22, -240, -67, 108, 29, -35, 159, 92, 203, -82, 75, -21, 79, 6, 47, -114, -100, -120, 199, 135, 9, 103, 80, -28, -262, -103]
3882a03Q5QM5o2J70l12J76M9j45J09O7J44k05j37n5P6O2L3N6m2m4M2n1P0j8J39
3908A57k77J44O6j86J04J6l0K63j84m4k9j21J24j44J76j08j6J02J11p7k33K96
3930A10j00K76j66m8k35K62r9K2p3L7k40J98q4J56j41J95j68J58m5J58k71J45
3952D7j58J15O2j7k34j11K41J25pK7O0k55L2m5O4J38j23n8J20m0q2J12p3K05j80
3977c5J62j80nj7L02l52P2M4K03l42J05l0J89r8j3Q7j38l9P8J42k26J79j1j4O
4002F9r0k38K58Q4J10q6N6j79O7l1O4j24L6m0J93j20j61K28m6k9J93k95M1l5J5
4027f0J6K4N4j38K71j97m5k0P6l9j75L16p5K33l41J32j56R8Q3k53L40j32j42J23
4051gJ09j0m2k48J63K39j84p1o5J34o6r3J87j8N7n4j06jl4RO8P0K10l10J13j95
$$ y = [-103, -18, -10, 35, -27, 143, -169, 7, 56, -89, 20, 87, 231, 26, -111, -166, -90, -28, 5, 61, 19, -25, 17, -34, 36, 18, 157, -120, 24, 90, -96, 8, 24, -6, 257, 73, 29, 0, -121, 3, -141, 35, -73, -89, 13, 124, 47, -186, 110, 10, 286, 120, 72, -163, 99, 0, 22, -51, -14, -254, -56, -140, 16, -125, 70, -98, 60, 15, 173, -98, 47, -111, 4, 66, 49, -185, -296, -55, 70, 63, 90, 150, -105, -73, -118, -54, 84, -39, -97, 23, -17, -99, 13, -60, 145, -35, 127, -53, -58, -75, 227, -125, -53, -9, 194, -148, -43, -73, 116, 18, 5, 92, -46, -85, -7, 135, -91, 88, 77, 63, 69, -21, -259, -1, 83, 193, 107, 163, -16, 51, 20, 84, -40, -4, -44, 149, 29, -132, 96, 50, 21, 214, -81, -40, -75, -60, -44, -20, 34, -104, 167, -30, -75, -95, -19, -58, -233, 83, 8, 241, -100, 32, -124, -26, 57, -196, 144, 12, -130, -7, 102, 92, 50, -198, -35, 204, 20, -51, -116, 18, -48, -141, 46, 28, 85, 31, -75, -76, -110, -101, -33, 37, 247, -63, 50, -145]
4077a45K14j15Ln9J36q0l7p9P9J34j54J64K8n0l41K75R7j79K13j42K38Rl05R4
4101bL5o4j79J56K9q6MR3O2J00j10q1rj95K65k06K10lK6r5J64J3j90J40M1j02
4127A6J82j03j38J32k23K24j12l1j0M9Q7k2l2m6m4KJ51J05k86J30N9o5q8J58l3
4152F2k26K21k40L34k02p7kJ4Q0J47q5l3j74R3RK31l3m3q1L4n0n9R1j02J01J71
4178A81k4k2l30MK59j14L51l60J7L2r7K41k56J45R5q7M9j73J67p2j24jK27j35
4202b7R6O4j51j45J60O7lj67mJ5J07l0q6K46Ok18J19J05M0n6p2K70j92j80O1J21
4228A46j51Q7m7J4R1j02j9j23N2M5J08M4m10K07O1j56J71j49j31K37j8J68q6o4
4252b5J47k48K23k63J14KP0mJ14q1j76J78j68L15j75L2k76J20J49k0j6n4K12j53
$$ y = [-145, 69, -46, -43, -102, 34, -46, -83, -162, -83, 51, -103, 61, 89, 39, -302, -27, 70, -109, 104, -38, 200, 209, -96, -2, 33, -31, -210, -54, -25, -111, -107, -14, 48, 148, 38, -43, -52, -247, 18, -188, 22, 19, 45, -50, 114, 127, -63, 77, 118, 16, 198, 95, -43, 89, -134, 90, -22, -53, -63, -14, 73, 51, 19, -27, -71, -69, 82, 187, -99, 31, 90, 25, -63, 95, 62, -164, 57, -183, 151, -51, -128, -130, -116, -36, 111, 26, -7, -181, -88, -79, 152, 119, 76, -5, 29, -21, -80, 11, -91, 10, 181, 157, 135, -195, -191, 68, -46, 305, -55, -38, -6, -103, 138, -118, 27, 122, 35, 84, -89, 78, 6, -118, -119, 108, -27, 69, 133, -18, -163, -3, 64, 61, -106, -110, -95, 12, -18, -104, 142, 148, -70, 49, 154, 194, 138, 66, 336, 144, -36, 25, 146, -5, 82, 35, 49, 140, 38, 19, -104, -52, -7, 101, 145, -265, -58, 3, -153, 18, -131, -262, -25, -43, 125, 39, -25, 122, -126, 97, -166, -52, -50, 20, 16, 130, 49, -127, 51, -117, 198, 23, 55, -221, -101, 48, 28, 12, -42, 170, 17]
4276A7O3qJ57p0k49rk5j13J84N7J12J17j97k32J83K39l67K49p0J2J01j68J92k22
4300d7P7j57L94j95j2q4Oj46L41p0j71J83j2j68J13k45J90J35k31J68k25K44l7
4323E1j08o5j59M08nk67J43M7Lq5Q2j01l8N1n7J08q9rM2L3N0j53l7K24k12L11
4349A68j89o3J45j05K38o2l38N97l86R0k79J90JKj26J15r0R5J00j48K0o8j53M43
4373A97k90O5k4P5K94m48J38j9k60R9L19j12Kjq5P6L4k29K45l2R8l8j07K79l50
4398g4L53j66J35j06j17J92k96N5j85K19k4j07J37n9M2l0J09k64K74j35Q1r5q1
4421a42L5l9J08ko9K38j68J73k23K69o8K9n1k05K36l13L10k19M0m9J72j2k72K42
4445B0j73J93k58J69K05n0M2k35J27j54N8N7m6k01J72K37k45J05l3N5j49J37j13
$$ y = [17, 80, 72, 229, 159, -90, -99, -124, -237, -53, 4, 116, 233, 36, -196, -13, 226, -141, 108, 38, 50, 151, -17, 175, -47, 30, -127, 267, 72, 60, -24, -18, -164, 177, 107, -64, 119, 107, -61, 52, -193, -3, 132, -99, 69, -156, 88, 51, -57, -122, -281, 127, 122, -145, -2, 45, 48, -37, 45, -56, -94, -43, -100, 8, -81, -90, -48, -15, 35, -118, -155, 69, -143, 168, -21, -84, 61, -44, 194, 132, -206, 391, 5, 95, -184, 6, 7, 9, -117, -2, -92, 3, 103, -45, -25, -93, -246, 197, -93, -28, -52, 23, 317, -131, 7, -12, -272, -173, 146, 34, 36, 35, -50, 26, 60, -169, 76, 44, 142, 104, -3, 276, -74, 279, 113, 248, 142, 25, 217, -79, -24, -209, 10, -14, -121, 16, -43, -1, -31, 78, -186, 88, -47, 34, -61, -142, -107, -146, -38, -40, -109, 129, -39, 134, -89, 180, 112, 141, 90, -115, 121, -192, 118, -101, -61, -110, 62, 50, -222, 20, -153, 40, -218, -49, 156, 106, 148, -87, 40, -114, -56, 1, -45, -246, -74, 163, -82, 23, -10, 45, -104, 33, -80]
4468h0m6K12q5j03J61Q7l12R1j9KNN4LN2mN2p7o0K26p9J38j95O9k31L40j97l7
4495c3L6k16L03l05Q0J76RK03j72k2l2K30k72J15k18J00k27K18P3q1P1O8j71n5
4519a22K15j98M0K28r4j26L2r7p7J24j48O0J60J45Mj83q2K5J38J6k7j3J9J5O1
4544A15Q3j31j29l8J13L0j43L01k30j79J36J80k81J36Q0mq3L12k67jM4k54J98
4567a2p1J76k35P1J98r9r7J78k60K44k40J93j52J66j70N9M4Lq8J87O6j31N2j06
4591b4N5j4J21j06J41j41j25o4J59k02L95l00j76L55j10m5J01J23j27n3J29o0
4613C2N7j6j37J67j4p0RL1j38l2L39rl4j98n1N4j59P6j8J00M7Qqk42K00J2j43
4640a37k0k3p0J06J43K16k38j07J12R6j93J41O6l34K82P0Jl5k84J54M1n9o9J90
$$ y = [-80, -126, 86, 1, -102, 59, 146, -166, -75, -94, -92, -87, -33, -30, 22, 18, 70, -7, -67, 159, 80, 218, 23, 92, -139, 201, 4, -33, 3, -213, 90, -215, -135, 41, 50, 253, 81, 59, 27, 257, -15, 100, -118, -18, -245, -27, 46, -35, 36, 104, -67, -122, 93, -105, -65, 163, 69, -57, -25, -122, -199, -75, -223, -163, -3, 142, 146, -37, -119, -94, 44, 60, 33, 20, 39, 54, 115, 198, 67, -62, -100, 13, 43, -100, 201, -29, -208, -72, 108, -173, -37, 43, 39, -44, 268, 1, 0, 44, -210, -12, -83, 93, -142, -71, 127, 28, -69, 109, -151, 93, -147, 46, -106, 60, -110, -51, -7, -4, -92, 95, 161, 30, 82, -24, 31, 17, 138, 32, 173, 32, -93, -157, 2, -200, 195, -105, -281, 74, -36, -81, 20, 143, 16, -37, 92, 32, 89, 73, -64, 103, 89, 19, 28, 59, -79, -111, 228, 219, 185, -13, -64, -10, -169, -93, -111, -11, 36, 44, 36, -206, -6, 6, -137, -157, -180, -250, -144, -1, 215, -23, -130, -18, 78, -115, 26, 92, -242, 40, 110, 111, 76, -208, -54, -13, -72, -141, 49]
4664D9j0j23n1P3N8J38q9o4j87J16J76j06k9pK7J43k08RJ79n6R0j42O1n3J39k56
4690a23J51m5M6O3k3j45L5J45k75K31k23P1J06k39Q0r0J59o3R7M1j3J65k65J60
4714D6j65K13j91J97k67P3J91j38Q4KK7q8P5j26Q1J33j84r2K08J2nl88K59P0J2
4739C9p0q1J07m9L5j4J63p6l9j28J87J89l84J89n1R5j41Mm7K69l3j36n5K26k26
4764b7J3M5n0p0L8O0M0L4j5j67q8J32K07nn6k62R2q1P1L04j32L4k43J38j14P7
4790b5K6l4J88l22J62k7l4L1o4O6K08j08O6k24K44k19L2J47j6k34N2P1J5j44J99
4815E6j57O8L6J68j52j56J30m0r2J40k32J80O2J04lp7k20J31J74j06jr7J37l5
4839A8j01L7j3Q5oj08j08K81j71j1K2p7J44K48k47O4j12K15k05Q8p3K8mJ14j61
$$ y = [49, 39, -84, -135, -62, -4, 134, 45, -19, -206, -90, 86, -20, -49, -56, -29, 114, -94, -85, 94, 38, 128, -14, 47, -6, 133, -123, 28, -17, 29, 92, 69, -76, -41, 104, -171, 60, -163, -92, 14, -225, -145, -235, -76, -139, -42, -1, -14, 151, -114, 46, -119, 94, -97, 100, -167, -94, 97, -41, 43, 45, 72, -16, 59, -67, 14, 147, -37, -129, 79, 91, 86, -302, -43, 27, 39, -31, -112, -5, -54, -19, -33, 130, 54, 15, -113, 74, 263, -121, 68, 17, 112, -29, -25, -72, 197, 164, 28, -27, 199, -27, -14, 31, -19, -89, -51, 9, 49, 83, 68, -99, -187, -55, 152, 147, 91, -171, -79, -160, -89, 215, 83, 117, -126, 12, -102, -25, 1, -33, 155, -167, -5, -32, -66, -35, -99, -33, 175, 67, 133, -91, 153, -66, -34, 113, 97, -137, -85, -14, 1, -143, 56, -101, -33, 3, 171, 19, -137, -7, -47, -139, 1, -231, -51, 11, 115, 112, 35, -185, -54, 120, 14, 13, -84, 53, 18, -83, -46, -59, 26, 20, -88, -196, 85, -86, -97, -75, -152, -8, 240, -7, 57, -55, 160, -45, 43, -30, -2, -6, 108, -53]
4864e3q5N9m7L7P4J41k00K06j66P2m9nl2p4Q3q9J18k5o9J77L6k43L8J95j13q6
4890a00K86j72p1J30J62k51J73l83j4L48l39K59n3l2J32q8j07J60J12M8l0m8j33
4913a1o3r0l9K00L7L8q0n2J20k99J97J46J90j69j06K2k15J54k4j28J46r1J83j83
4937a17R1lP5J64j25k66L41j70j19K8K16o7j14J27p8j8M5j39J11Q4N3j60P5o5
4961c1k6r5L23j12P6k6q3j9n6R1j07O1r5J59j46J28J26l01Q3p8K34r3j0nK7j05
4987h0P5k9k6J44j12knn8K5Q5K3j00J72k59J53r2J94J1q0lq9j7J37j62JJ12J96
5014B14l62J11j15K02J04k23r4J48j12N2J16m0Q9j64K20r9q2J52k41j11K99J00
5036A64k75m6J72nn7q2R3J3p2J78r8K18k87K31k98M8l3J71j48J27J13n6o6j84
$$ y = [-53, -138, -79, -126, -89, -15, 126, -74, 132, -34, 38, -11, -16, -48, -122, -39, -128, -10, -35, -104, 73, 109, -134, -96, 99, -14, -100, 186, 14, -57, 73, 235, -16, 157, -226, -240, 108, -231, 28, -25, -57, 75, -13, -120, 40, 152, 200, 170, 122, -11, -74, -164, -203, -3, 34, 72, -8, -60, 60, -239, -42, 104, 294, 125, 19, 41, -174, -20, -44, -172, -26, -117, 66, -117, -26, -29, 46, 210, 85, -181, 160, -10, -129, -101, 115, 48, -66, 61, -17, -35, 10, -129, -18, 66, 119, -41, 34, -31, -57, -152, 171, 59, 135, 109, 26, 7, -49, 42, -65, -4, -99, 60, -86, 42, 168, -133, -50, -128, 106, 13, 3, -2, 25, -80, -5, -34, -60, 84, -28, -30, -35, -93, -68, 17, 40, -60, 112, -147, 6, -86, 108, 119, 39, 36, -53, -70, 67, -95, -94, 18, 214, -148, -37, -152, 50, 154, -69, -163, -15, -127, -75, 41, 1, 90, -74, 146, 47, -35, 117, -124, -235, 64, 164, -111, -157, 15, 10, -47, -129, -36, -23, -95, 83, -15, 203, -84, 147, -151, -103, -136, 35, -113, 14, 127, 71, 5, -179]
5060a79K53j69J11p6M5N1k6j54L32j44r1j67%K41m4m5l4J87k00N4Kk05L68o0m42
5085c92M75N5J3j67j23P3%J88j99O4K4m0L7J64j62J9J58k12j04r4L20j59N3k8
5109c7K49l13L49j05j62KJ23k07K69l13K07j16K31k30j53K55j7L9j67p8K36k21
5131a59L14k12J93j64j18L23j9r4R9j28rn1k09K38Q1R7j98M7J37j42LN6o0K4K9
5156G8j68J49Q9n6j84kP6L1k6k02O9J52r4O1j49J78R8k04j02n2K58O6l17J63L54
5181B66k34k49K63m7j51K91j52M5p6j85L88j81j30J47j44q4J39Q1lj8j07J28j04
5204a17J5n3J72K16m06J48p9r1K41J5nM3j43j09n0K52r3J74l4J36m9m2m5k00L21
5229B17l57O4K59m77J84J49J7j36J2K41k37o6K87k10J31J6k06j73J83j4N3J97
$$ y = [-179, 74, -95, 16, -60, -15, 36, 10, -144, 188, 44, -47, -214, -214, 27, -17, -62, -96, 91, -109, -55, -53, -258, 110, 50, -392, 83, 138, 151, -16, -139, -66, -66, 122, -77, -13, 11, -29, 8, 172, 10, 29, 187, -25, -129, -223, 97, -62, -9, -37, 212, -101, 248, 143, -19, -17, 106, -101, 168, -145, 62, -54, 177, -53, -206, 49, 32, 71, -96, -174, 62, -159, 155, -57, 136, -28, -146, 177, 158, 64, 163, 35, 26, -25, -234, 4, 85, 182, -16, 31, 168, 26, 29, 85, 25, 49, 78, -90, 59, 148, 92, -92, -94, -18, 13, -13, -215, -146, 6, -88, -27, -176, 2, 100, -104, -206, -258, 0, 66, -251, -88, 266, 32, -217, 46, -1, -152, 139, -13, 32, -44, -229, 159, -22, -152, -5, -149, -233, -94, -13, -16, -34, -141, -13, -117, -102, -155, 17, 233, -173, -25, -104, -195, 46, 61, 56, 99, -44, -153, -203, 49, -44, 130, 96, 232, 183, 141, 96, -104, 217, -140, -76, 183, -294, -110, 39, 56, -80, -68, 173, -64, -130, 157, -53, 78, 94, -112, -285, -102, -116, -63, 134]
5251A34j20L5k10K47J74k56l3ml1R9K4J46Q7l99P7k9J57Pj49J58j69n3K71k87
5275a24K2M3Q8J6R2n2k13K49j06P0k6Jj08M9j27J7N7j30J64J23p7l2j5P2j37J26
5301D2l8l06N40k77J34j8j08k3J26p0J00J07j92Q0j08K7J08Q0j65k48N0R3J97
5324A31j04J02k41K25j85J05j75J56j7K70k83J2j09K26M2j27p5j30j4L90j18J03
5346A84k60L03p4k79K27l44K36n1l1J11J55k68J05j19J97j30j2J13k5j29J67p2
5368DJ27l33K27J26k68m1J10k4j64L77k66J72q6o2K46k79K53k67L9K24J0J12l19
5391h2J2J16M3O0k47J72K29l75o3J48J56l28L65k75r2J75j6j40J46m8R6k2R8O
5415A34l08L5K85m4j55J28j43J21r9L20j13j24L1k9J23k8k00N3K4n9K0Q1j26K23
$$ y = [134, 14, 49, -161, 86, 260, 4, -29, -33, -64, 35, 59, 205, 292, -107, -30, -59, 98, 105, -44, 114, -55, -108, 163, -124, -102, -59, 29, 45, 137, 85, -128, 121, 15, 85, 59, 60, -48, 1, -126, -109, -52, -182, -18, 105, 28, -4, -19, 53, -84, 42, 4, -302, 238, -39, 95, 77, -31, -54, 72, 2, 102, 209, 17, 97, -11, 16, 124, 204, 39, -209, -159, -66, 131, 27, 129, -112, 113, -72, 33, -142, 14, -3, 267, -16, -4, -113, 113, 155, 28, -47, -177, -191, 199, 81, 184, -76, 227, 153, -126, 101, -243, -7, -58, -89, 22, 177, -91, 14, -105, 92, -38, -50, 63, 38, -91, 76, 4, 131, -202, 25, 151, -117, -158, -48, -72, -236, 141, -125, 47, -39, -101, 145, -134, 119, -148, -109, 115, 125, 237, -82, -70, 46, 89, 149, -98, 74, 303, -72, -135, 13, 169, -159, 206, -69, -161, 14, -2, -142, 4, -44, 52, 30, 128, 134, -174, -139, 146, 102, -53, 75, -68, 53, -46, 274, 161, 37, 68, 39, 162, 134, -66, -13, 11, -48, -28, 53, -73, 150]
5439A50j96l7R7k14J02M1J90j82j5m1P9k94L20M2Pj10J31J30k35q8NJ24J24k73
5463a43J79j49L02j90J34r1R4j07j14Q8j05J34J27M5k96J89j82J69k3q4J0P4j73
5486a12J48Q6r7j12J2K63j55k65K94K33m29J51j36k9O7P5N2q8p2l1R7n7O7J18
5510H0j47RJ6J25R4r7J4p0j90L09k5j30k8MK78k00o8P4N4o6r7O0K2k4n8Q4j20
5537i7kM2j01K83j92J19p1k37J21M7m6K30Mk99K71k5m1l9j54K92l01k7L88j52
5561A3j82K55j6j10m1q1N5pj03J76p3MJ0K07j04N9j78pJ06P0kJ7o2l9R7j90J76
5588E0L2j51J25k81J10K0L7J41j95M9N7J8j20o5K90Q3L4l14Q9j8R9k61Q8O8J28
5613A13n7K8l2j65K56l5j63m0J2J4J88N3k00J34j55p1K82l79N0J06J28j34J87
$$ y = [150, -46, -83, 14, -200, -98, -57, 133, -49, -64, -105, -26, -320, 0, 42, 49, -61, 70, 200, -35, -123, -118, 6, 130, -143, 36, -113, 189, -1, 133, 42, 136, 29, -85, 3, -102, 32, 159, 204, -92, 97, -85, 84, 61, -23, -13, 61, -112, 36, 122, 25, -87, -75, 188, 33, -232, 62, 295, -134, 17, -119, -148, -81, -6, 46, -42, -114, -145, -48, -105, -38, 80, -67, -58, -42, 83, 177, 80, 94, 24, -166, 143, 118, -12, -40, -36, 242, 42, -26, 48, 102, 36, -61, -1, 21, -3, -61, 23, -97, -99, -57, -158, 125, -67, 52, -19, -256, -135, -88, -134, 96, 100, -199, 72, 47, 6, -33, -187, 105, -196, -223, 165, 13, -169, 86, 70, -40, -81, -162, -107, -114, -217, -41, -114, -110, -100, 107, 3, 62, -116, -123, -17, 53, 51, 68, 6, -33, 64, -126, 50, 82, -69, 56, -225, -115, -95, -58, 83, -112, -63, -6, 12, -108, -173, 117, 200, 234, -80, 9, -9, 90, -171, -83, -15, 113, 56, 84, 52, -113, 143, 108, -55, -95, -83, -69, 119, 172, -28, 106, -49, -120, 162, -217, -167, -61, 67, -67, 120]
5636A20l37K15N8o6M1j98K11J41k09Q8j3J34k55J04Q5j37j1O8J02o1o5j16qJ7
5660i2J57j15q3K10j11K1J66j39pj59J02J4mL9J4M3K1k11L58j71O2k42J54J1j89
5685a51o7L15K9m5M8Jj82k2j94K58M0k9j64J02p8R5o4l9K83k72J16J10k54R2J72
5710A00j36K29m71L57j40J78q5rm3r1K69k92J04J3J49j98n3K84k04n0J05n1k5
5733f0Q9p0J72j68p8O9M5m0J50Q7n1k82J86p3J33q2j85J73O9j52K09k60K29j13
5757cj1OJ0J24j11p7j6P9j57J99q7J98n1l25K48L2QN0L5N2j46L7j00q5J23L4k5
5784D1j09Q4J16k92J34Q8k34J63K7J10j67O2j12K32p8l07L46k47J08J92k23K02
5806A36j53J46j58k0m8R2K05j84P5o7q1J61j80K7J39p5R6Jj21j05m1J73j10j9
$$ y = [120, -217, -2, 56, -10, 31, -167, 44, 185, -24, 64, 51, 185, -70, 34, 119, -18, -29, 39, 141, 80, 15, -101, -109, -92, 65, -50, -133, 77, -34, -13, 153, 14, 7, -152, -50, -36, -40, -1, 13, 56, 77, -134, 224, 53, 115, -127, 27, 38, -151, -218, 97, 126, 81, 129, 130, -52, -74, -268, -10, 30, 1, -163, -61, -139, -44, -108, -147, 136, -136, -20, 90, -164, -72, 100, -36, 193, -278, 79, -61, 117, 32, 23, -20, -111, 158, -134, -30, -17, 132, -66, -119, 165, -39, -89, 16, -35, -60, 29, -41, 131, -37, -115, -46, -1, -41, 109, 196, 145, -137, 49, -24, 109, 27, -158, 15, 84, -68, 141, -119, 110, -3, -14, -8, 2, 126, 15, -62, -78, 1, -156, 43, -44, 154, 103, -222, 26, 58, 66, 116, 151, 203, 57, 94, -6, -91, 32, 66, 41, -68, 16, 132, -160, -26, 62, -172, -9, 18, 128, -39, 23, -89, 143, 65, -242, 104, -143, -35, 157, -66, 136, -17, 129, -29, -49, -97, -5, 200, 16, 91, 24, -57, 104, -76, -49, 90, 15, 111, 112, -9, -114, -155, 18, -92, -111]
5830a11Q2n9J01J44k62J4N2j12k0P9J10j00K7j88L69p2j32j68L29k53J44Q2j33
5853g7K33j32O3j23j41n6n7L89J77j91k17J40r0R5m2j0k3l9L2J33k49J39N5k65
5877b56L34k26K6K63J08j87k01L05Jl35K51j48J54K7l64R9J38k40J58J21j65M1
5899i6K56j14m9J13k45l1K11j43L6q5K92k43J52m5l63L70q7J68k91j8K58k13J21
5922d6j91K86J94l48l1J96j83L53l78P9K6NQ1Q8j41q6K46k68M65k50k28Q2l0R1
5946A2j44L02m19J34J39L16l41l37L30J35k05M72n89K66j36Q2j14P6J11p4K8j95
5968a51M3J12K0j4n8J36jO3j78jJ06J5j53J52l9k8k7j82K34r2J01j01Q0M6j44
5993f1N4P2k08L41j88n9J68k64J96O1j14n6J0P0j86K94k6M2l14K18Kj03oj7Q8
$$ y = [-111, -29, -88, 13, 157, -105, -91, -39, -151, -171, -92, 18, -82, -55, -243, 126, 54, -78, -246, 83, -170, -26, 56, -77, 156, 24, 87, -36, -177, -233, -290, 99, 276, 85, -132, 8, -82, 13, -29, -39, -62, -101, -69, 64, -185, -46, 9, -256, 78, -148, -122, 141, 249, 62, -139, 166, 167, -168, 83, -65, 89, 116, -248, -149, -11, -251, -93, 28, -137, -96, 160, 46, -3, 110, -135, -166, 45, -98, -62, -147, 145, -98, 54, 9, -354, 16, -71, 97, -194, -212, 46, -167, -46, -237, 49, 243, -105, -136, 60, -123, 230, -148, -69, -43, -38, 43, 131, -10, -96, 150, -118, 347, 97, -131, -49, -79, 12, -132, 170, -249, -115, 24, 340, -1, -338, -8, 127, -78, 394, -195, 71, -65, 17, -97, -21, 90, 16, 44, -151, -108, 4, 24, 10, -48, 88, 87, 150, -28, -29, 77, 92, -61, 91, 52, 24, -3, -185, 49, -43, 58, -43, 37, 83, -61, -7, 65, -143, 198, 10, -49, 119, -145, 51, 112, -2, -58, -48, 22, -164, 130, 104, 146, -168, 50, 52, -51, -57, -74, 14]
6018A4m7J01j33M9o8K88l0j48J76Ok08k9j0O5J22k56J8J63j95J78k27P4K41k06
6042f2R3K45j77k66J76l18L18o1J10j0J4j01J52m5j56L3q6L6J90J75q0j08J9J32
6066B23k36j0l6j0Q2Q8n4j79J83J37j62k91L93j53Ql6N5N6r3J09p8j46J55J25
6090A30j68J96k13O4k2k25L58j13k99L88p3k05M6J32m8K36k68J52k8k11K05rP2
6113I7o8O3K9j57J17Q4r1l7j26M4J92j89p0K3K33k70K52j14p6j57K89o6rJ15J27
6138B35k74J37l8j49LJ11p7J40o5j53K57k8k93J56q7m7J82J18J4j92K1pK51J4
6162B29j65J54k55J15N4j25p5J6l3J72l31K47Q6j85L1J56p5J61j51p3j55K30k8
6185@k01M03k46Q3J9%j13J3p8K92k4k08J65r2j69J7J07oJ13j08O6J0l64J60K86
$$ y = [14, -33, 68, -65, -16, -84, 204, 174, 26, 202, 208, 0, -29, -39, 26, 148, -108, -90, 73, -122, 56, -171, -97, 144, -62, 31, 276, 99, -167, 9, -309, 9, -52, 58, 48, 62, -39, 113, 68, -88, -55, -141, -105, 85, 260, 180, 72, 91, 223, -13, -23, -59, -69, 13, 101, 47, -132, 51, 188, 26, -265, 128, -25, -17, -53, 2, 58, -35, 74, -4, -150, 5, 130, -38, 158, -55, 9, -13, -238, 120, 7, -292, 96, 23, -182, -136, -4, -52, 184, -84, 68, 40, -171, 34, 25, 97, 29, 92, 121, -36, 81, 165, 74, 37, -89, -45, 147, -42, -112, -89, 144, -126, 126, 12, -64, -221, 68, 2, -7, 108, 235, -39, 98, 60, -89, -86, 25, -52, 88, 23, -130, 127, 99, -194, -38, -125, -172, 10, 128, 142, -50, -29, -36, 215, 229, 64, 218, -37, 78, 132, 7, -68, -52, -85, 87, -244, 3, 89, -96, -65, 91, 16, 177, 26, -47, -202, 28, 0, -201, 202, -44, 39, 58, 58, -55, -42, -120, 172, 148, -60, 105, 13, -156, -139, -32, -38, 75, -33, 33, 43, -321, -161, 125]
6210A25O6j30J4j1p1m9K3J19m8O4p7n1n6P9m4j73L18k57K19Q3p0M2k33K51J85
6235C18j35M8k94q3Q8R8o5j2J10K4j16r7J84k70K59j14M1p4J33p6k53K53j53K24
6259C8j92K05j73M39k48j18lN7n2r8J80j8p2m3K58j15m7j32K59mk44K87l6j73
6283d5J51j05J81l0l02K90j04j27L1J76j37M0o7j7J2p5r1K76p6j13M06k61r1O5
6307a3J33j1j34K18l69O8L22k00J59R6l13o0K97k78N2L3J02q0r3M4N8j20J28j02
6331f3j2L3j2p5m8n0J06K24j44L7J68p0N7k90J57j77J10P0j42N9m4m5J95j28K47
6356A63k02M8j4o2OKK54k14j96L21o3j21J36J12k96R3J0P6j47j7K34j81o7J22
6380co5O7O3pp1O1k22L36k97R7rR7Q1Lj57lN0j09K40k31n3j0K53k37K44j44J7
$$ y = [125, 191, 61, 75, 64, -7, -56, -33, 86, 38, 102, 25, -26, -82, -3, -47, -220, 98, -159, 60, 143, 73, 115, -118, 133, 318, 183, 231, -63, -146, -58, 40, -25, -37, 73, 97, -19, -116, 68, -202, 57, -57, -16, -90, 43, -33, -286, -33, -186, 38, -154, 51, -122, 317, 69, -49, -52, 5, -47, -145, 35, 17, -55, -98, 160, 45, -2, -134, 125, 121, -123, 164, 128, -45, 106, 1, 182, 152, -150, 140, 36, -91, -60, 116, -21, 19, -48, -65, -53, -128, -219, 57, -19, -132, 274, 13, -78, -13, 120, 109, -25, 193, -176, -108, 214, 14, 173, 269, -44, -104, 193, -85, -33, 0, 102, 22, -71, -27, 31, -89, 39, -63, -75, -42, -54, -129, -177, -227, -121, 103, -41, -4, 164, 94, 151, -139, 18, -159, -49, 21, -121, -62, -106, -151, 44, -84, 163, -39, 9, -5, -67, -61, -59, 195, -19, -215, 106, 43, -78, 58, 170, -126, -33, -23, 53, -94, -111, 123, -58, -125, -3, -68, -1, 62, 55, -16, 45, -177, 159, -138, -41, -50, 47, 128, 131, -26, -29, 21, -88, 152, -79, -132, -142, 111, -126, 118, -26, -9]
6407ij14K10j13K35j83p8J40k0r8j0j0j25J98j11Q8Or4O7N0J4k30J51p4K27k15
6432i8R8M9L7o1q9Q9K5n1j11J04p4K10j51j31J24K11j16j13j0J77q4n8l1J06l2
6457B0J24Ql03K14k9lj28K93l72J86kK20k68j77J19K60j75j5K10k79J26q4J29
6480G4k97K39N6J9p9p2J12k79K33j34K10m6j44Q5m0J79o9J8J08k13r0J40l06L62
$$ y = [-9, -123, 87, -26, 209, 26, -52, 88, 68, -30, -40, -50, -175, 23, -88, 0, 6, -88, -21, 29, 43, -187, -36, -110, 117, -98, 0, 49, 86, 25, -64, 25, 50, -1, -112, -8, -82, 128, -23, -154, -30, 181, 65, -48, -58, 119, 35, -23, -54, 52, 20, 144, 152, -151, 63, 34, 31, -97, 196, -176, 10, 8, 228, -40, -217, -98, 162, -13, -28, 182, -97, 29, -55, 74, -223, 16, 72, 91, 12, -60, 52, -227, 6, -128, 82, 36, -108, -23, -63, 116, 47, 65, 173, -40, -130, 10, -296, 66]
$$ [...]
8191D5
##END NTUPLES=NMR FID
##END=
