##TITLE=1H_Ser AmS-NEA
 200.13Hz, CDCl3.
 8 sc
 
18.3.2026
##JCAMPDX= 6.0         $$ Bruker NMR JCAMP-DX V2.0
##DATA TYPE= NMR FID
##DATA CLASS= NTUPLES
##ORIGIN= UXNMR, Bruker Analytische Messtechnik GmbH
##OWNER= pz
$$ XWIN-NMR		Version 3.5
$$ Wed Mar 18 16:16:22 2026 Russian Standard Time (UT+4h)  she@DPX200
##.OBSERVE FREQUENCY= 200.1313
##.OBSERVE NUCLEUS= ^1H
##.DELAY= (6, 6)
##.ACQUISITION MODE= SIMULTANEOUS
##.ACQUISITION SCHEME= undefined
##.AVERAGES= 8
##.DIGITISER RES= 18
##SPECTROMETER/DATA SYSTEM= spect
##.PULSE SEQUENCE= zg30
##.SOLVENT NAME= D2O
##.SHIFT REFERENCE= (INTERNAL, D2O, 0, 14.3821)
##AUDIT TRAIL= $$ (NUMBER, WHEN, WHO, WHERE, WHAT)
$$ ##TITLE= Audit trail, XWIN-NMR		Version 3.5
$$ ##JCAMPDX= 5.01
$$ ##ORIGIN= Bruker BioSpin GmbH
$$ ##OWNER= she
$$ F:/spectra/data/she/nmr/H-C/1/audita.txt
$$ ##AUDIT TRAIL=  $$ (NUMBER, WHEN, WHO, WHERE, WHAT)
(   1,<2026-03-18 16:14:57.60 +0400>,<she>,<DPX200>,
      <created by zg, POWCHK disabled, PULCHK disabled
       configuration hash MD5:
       00 E9 B6 7A A2 85 ED C7 34 08 36 98 17 FE 4E 26
       data hash MD5: 16K
       BD 35 C1 CE 95 23 33 9A AE E3 CE DB A8 91 B4 9D>)
$$ ##END=
$$ 
$$ hash MD5
$$ 37 D3 B4 C1 0F EA 19 8B 09 21 9C 75 5B D3 76 5A
##$RELAX= 
##$RELAX= 
##$RELAX= 
##$RELAX= 
##$RELAX= 
##$RELAX= 
$$ Bruker specific parameters
$$ --------------------------
##$DU= <F:/spectra>
##$EXPNO= 1
##$NAME= <H-C>
##$PROCNO= 1
##$TYPE= <nmr>
##$USER= <she>
##$AMP= (0..31)
100 100 100 100 100 100 100 100 100 100 100 100 100 100 100 100 100 100 
100 100 100 100 100 100 100 100 100 100 100 100 100 100 
##$AQSEQ= 0
##$AQ_mod= 1
##$AUNM= <au_zg>
##$AUTOPOS= <>
##$BF1= 200.13
##$BF2= 200.13
##$BF3= 200.13
##$BF4= 200.13
##$BF5= 200.13
##$BF6= 200.13
##$BF7= 200.13
##$BF8= 200.13
##$BYTORDA= 1
##$CFDGTYP= 0
##$CFRGTYP= 5
##$CHEMSTR= <none>
##$CNST= (0..31)
1 1 145 1 1 1 1 1 1 1 1 1 1 1 1 1 1 1 1 1 1 1 1 1 1 1 1 1 1 1 1 1 
##$CPDPRG= <>
##$CPDPRG1= <>
##$CPDPRG2= <>
##$CPDPRG3= <>
##$CPDPRG4= <mlev>
##$CPDPRG5= <mlev>
##$CPDPRG6= <mlev>
##$CPDPRG7= <mlev>
##$CPDPRG8= <mlev>
##$CPDPRGB= <>
##$CPDPRGT= <>
##$D= (0..31)
0 0.7 0 0 0 0 0 0 0 0 0 0.03 0 0 0 0 0 0 0 0 0 0 0 0 0 0 0 0 0 0 0 0 
##$DATE= 1773836096
##$DBL= (0..7)
120 120 120 120 120 120 120 120 
##$DBP= (0..7)
150 150 150 150 150 150 150 150 
##$DBP07= 0
##$DBPNAM0= <>
##$DBPNAM1= <>
##$DBPNAM2= <>
##$DBPNAM3= <>
##$DBPNAM4= <>
##$DBPNAM5= <>
##$DBPNAM6= <>
##$DBPNAM7= <>
##$DBPOAL= (0..7)
0.5 0.5 0.5 0.5 0.5 0.5 0.5 0.5 
##$DBPOFFS= (0..7)
0 0 0 0 0 0 0 0 
##$DE= 6
##$DECBNUC= <off>
##$DECIM= 32
##$DECNUC= <off>
##$DECSTAT= 4
##$DIGMOD= 1
##$DIGTYP= 9
##$DL= (0..7)
0 120 120 120 120 120 120 120 
##$DP= (0..7)
150 150 150 150 150 150 150 150 
##$DP07= 0
##$DPNAME0= <>
##$DPNAME1= <>
##$DPNAME2= <>
##$DPNAME3= <>
##$DPNAME4= <>
##$DPNAME5= <>
##$DPNAME6= <>
##$DPNAME7= <>
##$DPOAL= (0..7)
0.5 0.5 0.5 0.5 0.5 0.5 0.5 0.5 
##$DPOFFS= (0..7)
0 0 0 0 0 0 0 0 
##$DQDMODE= 0
##$DR= 18
##$DS= 0
##$DSLIST= <SSSSSSSSSSSSSSS>
$$ [...]
##$SUBNAM0= <"">
##$SUBNAM1= <"">
##$SUBNAM2= <"">
##$SUBNAM3= <"">
##$SUBNAM4= <"">
##$SUBNAM5= <"">
##$SUBNAM6= <"">
##$SUBNAM7= <"">
##$SUBNAM8= <"">
##$SUBNAM9= <"">
##$SW= 18.0517328524113
##$SWIBOX= (0..15)
0 0 2 0 0 0 0 0 0 0 0 0 0 0 0 0 
##$SW_h= 3612.71676300578
##$TD= 16384
##$TD0= 1
##$TE= 0
##$TE2= 300
##$TE3= 300
##$TEG= 300
##$TL= (0..7)
0 120 120 120 120 120 120 120 
##$TP= (0..7)
150 150 150 150 150 150 150 150 
##$TP07= 0
##$TPNAME0= <>
##$TPNAME1= <>
##$TPNAME2= <>
##$TPNAME3= <>
##$TPNAME4= <>
##$TPNAME5= <>
##$TPNAME6= <>
##$TPNAME7= <>
##$TPOAL= (0..7)
0.5 0.5 0.5 0.5 0.5 0.5 0.5 0.5 
##$TPOFFS= (0..7)
0 0 0 0 0 0 0 0 
##$TUNHIN= 0
##$TUNHOUT= 0
##$TUNXOUT= 0
##$USERA1= <user>
##$USERA2= <user>
##$USERA3= <user>
##$USERA4= <user>
##$USERA5= <user>
##$V9= 5
##$VALIST= <valist>
##$VCLIST= <CCCCCCCCCCCCCCC>
##$VD= 0
##$VDLIST= <DDDDDDDDDDDDDDD>
##$VPLIST= <PPPPPPPPPPPPPPP>
##$VTLIST= <TTTTTTTTTTTTTTT>
##$WBST= 1024
##$WBSW= 4
##$XGAIN= (0..3)
0 0 0 0 
##$XL= 0
##$YL= 0
##$YMAX_a= 82482
##$YMIN_a= -98042
##$ZGOPTNS= <>
##$ZL1= 120
##$ZL2= 120
##$ZL3= 120
##$ZL4= 120
##$ABSF1= 10
##$ABSF2= 0
##$ABSG= 5
##$ABSL= 3
##$ALPHA= 0
##$AQORDER= 0
##$ASSFAC= 0
##$ASSFACI= 0
##$ASSFACX= 0
##$ASSWID= 0
##$AUNMP= <proc_1d>
##$AZFE= 0.1
##$AZFW= 0.1
##$BCFW= 1
##$BC_mod= 2
##$BYTORDP= 1
##$COROFFS= 0
##$CY= -3
##$DATMOD= 1
##$DC= 2
##$DFILT= <>
##$DTYPP= 0
##$F1P= 0
##$F2P= 0
##$FCOR= 0.5
##$FTSIZE= 0
##$FT_mod= 4
##$GAMMA= 1
##$GB= 0.15
##$INTBC= 1
##$INTSCL= 1
##$ISEN= 128
##$LB= 0.25
##$LEV0= 0
##$LPBIN= 0
##$MAXI= 10000
##$MC2= 0
##$MEAN= 0
##$ME_mod= 0
##$MI= 1.114404
##$NCOEF= 0
##$NC_proc= 0
##$NLEV= 6
##$NOISF1= 3.799351
##$NOISF2= 2.8
##$NSP= 1
##$NTH_PI= 0
##$NZP= 0
##$OFFSET= 14.38212
##$PC= 1
##$PHC0= -3700.671
##$PHC1= 4.192301
##$PH_mod= 1
##$PKNL= yes
##$PPARMOD= 0
##$PSCAL= 0
##$PSIGN= 0
##$REVERSE= no
##$SF= 200.129724274929
##$SI= 16384
##$SIGF1= 3
##$SIGF2= 2
##$SINO= 400
##$SIOLD= 16384
##$SREGLST= <1H.CDCl3>
##$SSB= 0
##$STSI= 0
##$STSR= 0
##$SW_p= 3205.1282051282
##$SYMM= 0
##$S_DEV= 0
##$TDeff= 0
##$TDoff= 0
##$TI= <>
##$TILT= no
##$TM1= 0
##$TM2= 0
##$TOPLEV= 0
##$USERP1= <user>
##$USERP2= <user>
##$USERP3= <user>
##$USERP4= <user>
##$USERP5= <user>
##$WDW= 1
##$XDIM= 8192
##$YMAX_p= 0
##$YMIN_p= 0
$$ End of Bruker specific parameters
$$ ---------------------------------
##NTUPLES= NMR FID
##VAR_NAME=  TIME,          FID/REAL,        FID/IMAG
##SYMBOL=    X,             R,               I
##VAR_TYPE=  INDEPENDENT,   DEPENDENT,       DEPENDENT
##VAR_FORM=  AFFN,          ASDF,            ASDF
##VAR_DIM=   8192,          8192,            8192
##UNITS=     SECONDS,       ARBITRARY UNITS, ARBITRARY UNITS
##FACTOR=    0.0002768,     1,               1
##FIRST=     0,             0,               0
##LAST=      2.2672688,     0,               0
##MIN=       0,             -98042,          0
##MAX=       2.2672688,     82482,           0
$$ Real data points
##PAGE= N=1
##DATA TABLE= (X++(R..R)), XYDATA
0 0 0 0 0 0 0 0 0 0 0 0 0 0 0 0 0 0 0 0 0 0 0 0 0 0 0 0 1 -2 4 -6 7 -8 8 -8 8 -9 10 -11 12 -14 16 -17 18 -20 24 -24 26
47 26 -29 33 -36 38 -42 49 -53 60 -67 75 -86 96 -111 131 -156 191 -239 314 -441 671 -1193 2836
69 2836 -17356 -98042 -33238 58705 43085 -11614 -20396 2027 2762 -403 16420 6419 -23854
82 -23854 -14727 14992 16164 -11689 -29329 -2890 19047 -3080 -14550 2603 5153 -5869 -4698
95 -4698 11056 15128 -4407 -5132 12203 649 -11241 7871 15074 -5580 -16590 -717 8666
108 8666 -9144 -9513 11996 -1449 -25759 -4571 26142 15702 -17220 -19036 13941 20389 -6787
121 -6787 -6968 16583 11885 -15149 -17815 13302 20500 -11815 -20167 2391 3574 -8268 -3661 5584
135 5584 295 -9814 433 12491 -3292 -11315 9163 18218 3335 -8823 -3746 6916 2471
148 2471 -4514 1731 3426 -4260 -7974 -7745 -2420 2067 1819 2465 -4543 -12649 1182 15828 6781
163 6781 -6782 -1961 10508 5247 -8496 171 12744 1597 -9085 -4488 466 -1562 -5364 -1033
177 -1033 2811 -6292 -9696 991 7014 3673 -2556 -3672 4254 5862 3048 4704 499 -4245 1635
192 1635 6346 2667 -6857 -9876 1707 5180 -4751 -6733 -3881 -2703 2290 3083 -44 -1794 -1887 4033
208 4033 6949 1679 3377 4837 -1115 -3153 -638 3924 6464 -4337 -11659 -3328 2060 243 -2282
223 -2282 -3611 -1366 -1923 -1761 5081 3692 -2062 2568 5958 3140 831 -410 2319 2661 -1162 235
239 235 -919 -5351 -3099 -1322 -1383 -939 -4860 -3376 2257 819 -1166 537 2985 5329 1460 -1022
255 -1022 3722 3266 1679 2808 -1653 -3857 -393 142 -827 -3588 -5088 -1491 -1743 -2932 1416 111
271 111 -1384 1758 967 2436 5070 2301 1714 1686 1226 3282 609 -2583 -392 -1756 -1847 -817 -5313
288 -5313 -4037 724 -1645 -2150 -919 -251 2882 666 520 4706 1980 801 3483 1542 935 1753
304 1753 -1294 -243 -738 -3170 -1080 -2576 -3553 -772 -2543 -1734 1215 -2329 248 4052 937 1542
320 1542 2632 1871 3479 1024 246 3000 -838 -1782 433 -2551 -2123 -1099 -4585 -2133 -656 -2327
336 -2327 -334 -1024 -80 2783 5 1402 4768 1014 1580 3335 491 1448 1163 -1237 184 -2124
352 -2124 -3511 -430 -2960 -2678 -317 -3020 -896 1129 -1951 979 3223 1135 2563 2164 2032 3557
368 3557 -124 17 3055 -555 -938 -580 -3864 -2182 -1286 -3256 -848 -982 -2095 -692 -1673 359 3258
385 3258 1400 2653 3384 -516 1259 3151 1515 1539 -430 -1250 -125 -2831 -2869 -1469 -2995 -1206 -786
402 -786 -3329 -542 646 -740 945 2212 2346 2623 985 2012 2537 -230 2145 2347 -1396 -2147 -2063
419 -2063 -2024 -237 -2092 -3590 -2357 -1515 352 129 -1680 839 1399 1127 4229 3810 487 207 755
436 755 2027 1756 -211 449 -1331 -4905 -2602 -941 -589 124 -2680 -3927 -807 771 1732 1284 594
453 594 3195 3029 1297 1646 -423 -345 4274 3584 -1099 -4502 -5376 -1045 1429 -649 -1158 -3156 -3581
470 -3581 -601 -593 840 4117 1391 -243 1518 1685 2560 1988 1205 3148 563 -2462 -618 -2050 -2680
487 -2680 -358 -1441 -1748 -1918 -3472 -981 1134 368 800 -185 1206 4555 1316 361 3344 907 -347
504 -347 973 641 757 -1394 -3835 -1965 -2349 -1406 1192 -1818 -2862 -1014 -2423 358 5109 3741
520 3741 765 -972 268 4140 1716 -307 2010 820 343 101 -4839 -5159 -1260 1121 2479 -1018
536 -1018 -6038 -4120 -286 4073 6146 443 -1661 1126 504 2198 4735 2952 1236 -1912 -3037
551 -3037 76 -504 -1707 -841 -3123 -1581 1065 -2184 -3346 -1783 516 4451 2446 -1256 1046 2304
567 2304 2610 2890 296 249 551 -1571 719 1250 -2461 -3212 -2982 -2453 -276 -943 -297 623 -2505 -1478
585 -1478 1733 2700 4615 2763 -1458 -222 1177 2168 4315 1451 -2305 -3172 -3455 69 630 -3331
601 -3331 -2116 -839 -1429 490 -1331 -2140 2370 3770 2025 136 -642 3093 3819 -400 1695 1716 -2394
618 -2394 -2450 -1891 -543 1184 -1844 -3333 -2152 -3536 -1076 1874 1439 2022 -480 -1789 2783 3244 1396
635 1396 3253 1720 -815 -1542 -1085 2172 1348 -3561 -2324 -1766 -3191 -1005 -670 -1129 590 -565 -879
652 -879 1595 1457 2321 2057 79 2231 2313 114 968 -116 -841 424 -1402 -3060 -1953 -1636 -707 -346
670 -346 -1687 -503 -1355 -1478 2572 3154 1504 1681 83 -401 2249 3492 3460 -880 -4195 -978 785
687 785 -642 -717 -2449 -3362 -1244 -1201 -481 374 -9 1042 919 1015 2443 1354 1305 2827 941 32 1191
706 1191 -251 -1377 -1135 -743 -46 -2392 -3468 -1222 -827 -702 644 113 -28 164 358 2445 3182 2157
724 2157 1596 -3 143 2209 471 -327 -499 -2674 -2029 -1331 -1566 -758 -1127 -1956 -711 -815 535 2411
742 2411 974 966 1519 693 2464 2530 85 162 521 -41 200 -2214 -2212 -135 -1857 -1688 -903 -2116 -847
761 -847 -36 -607 2170 1625 64 1350 1142 1762 2865 901 626 512 -1885 -17 326 -1985 -1334 -1559
779 -1559 -2467 -808 -1724 -971 1095 -519 -5 1224 457 2407 2311 37 1656 1901 545 1209 -431
796 -431 -853 -455 -1968 -1169 -319 -2550 -1764 -1224 -1761 674 528 -526 1449 826 940 2298 1212 1104
814 1104 1355 27 1419 932 -2053 -762 -810 -1627 -695 -1792 -1748 -1150 -2454 -548 1149 345 1154 390
832 390 -25 2389 1893 1006 2542 896 -103 478 -527 177 -549 -2352 -610 -860 -2381 -926 -1382 -1610
850 -1610 531 2 1245 1749 -189 498 1788 1458 2751 1464 -304 878 -945 -1253 689 -733
866 -733 -1750 -1523 -2361 -950 -777 -1817 -239 178 157 2022 710 10 1486 927 1760 2675 724 18
884 18 -964 -1466 634 -205 -1502 -632 -2251 -2734 -835 -635 104 147 -1406 1011 1960 944 1374 684 707
903 707 2666 1421 580 649 -2245 -1738 428 157 95 -2243 -3778 -935 -594 -632 974 73 -241 769
921 769 -25 1738 2734 576 1302 1760 510 872 -901 -1294 533 -1097 -1556 -221 -1801 -2626 -1981 -1048
939 -1048 1941 1387 -614 -429 289 1172 2987 1824 1698 1738 -514 -566 926 73 -662 -1478 -1683 -365
957 -365 -1655 -1979 -415 -1039 -918 231 554 1542 821 -573 838 2006 2498 2331 -68 -709 542 -560
975 -560 -242 35 -1045 -1013 -1689 -1798 -810 -1645 -1027 611 437 832 1110 -179 698 1682 1264 1894 1813 845
995 845 -97 -2144 -1165 1317 406 -1023 -2021 -3447 -1794 -236 238 1121 -450 -1009 462 535 1750 2340
1013 2340 316 855 1642 642 372 -103 -887 88 -1179 -1344 -13 -1577 -1747 -974 -1238 977 919 -1343
1031 -1343 -159 827 1411 2557 852 546 1278 -540 579 1970 -363 -1333 -1646 -1786 533 -486 -2251
1048 -2251 -1263 -1689 -1282 559 592 2029 1224 -1897 231 2772 1515 1968 421 -440 831 -386 -625
1065 -625 734 -1211 -1846 -978 -1545 -305 -802 -2391 383 1400 43 398 -81 724 2298 700 1410
1082 1410 2387 -381 -732 -185 -167 1094 -684 -2481 -1422 -1172 -945 421 -516 -774 -1023 -1772 1433 2924
1100 2924 925 1159 668 308 1312 416 565 1534 -520 -928 -783 -1673 -535 -638 -1963 -539 -593 -1379
1118 -1379 408 -150 248 1127 592 1483 1609 -49 829 1410 708 1242 -431 -1448 -235 -876 -679 -376
1136 -376 -1881 -1649 -810 -843 1042 760 -438 93 55 531 2423 1819 1353 565 -1069 -177 769 104 275
1155 275 -1173 -2106 -990 -1230 -1002 -151 -970 -899 4 140 955 757 647 1750 1390 325 1325 400 -82
1174 -82 492 -101 255 -479 -2331 -1284 -748 -1186 -49 -1095 -1230 35 -268 934 1910 721 326 714
1192 714 691 1736 1393 1 365 -849 -1189 -97 -335 -1047 -786 -2068 -1146 -213 -740 91 263 -461 904
1211 904 654 878 2209 885 763 1265 121 231 185 -831 136 -544 -1401 -1041 -1413 -1402 -581 -569 425 572
1231 572 -641 108 1012 793 1613 992 462 1069 -45 -36 887 203 -416 -803 -1311 -471 -899 -1513 -148 -496
1251 -496 -1040 -86 153 504 998 273 1001 1447 641 940 858 372 520 -508 -764 -24 -980 -1193 -890 -1445
1271 -1445 -730 -886 -614 441 20 -452 626 753 1044 1452 417 832 1134 27 502 234 -498 81
1289 81 -810 -1126 -625 -1787 -1208 -64 -303 -12 2 -500 578 590 486 1873 1168 346 833 -476 360
1308 360 1236 -314 -271 -672 -1739 -764 -820 -1083 -195 -1154 -832 685 -508 -71 921 150 1478 1555 456
1327 456 979 719 -434 693 465 -198 95 -1898 -1462 -391 -1433 -462 -183 -1139 -402 -244 -71 1208
1345 1208 567 431 1785 719 892 1085 -278 399 637 -401 224 -463 -1621 -926 -1284 -735 451 -754
1363 -754 -671 236 -679 671 1438 800 1431 698 145 1184 363 -151 527 -447 -159 -202 -1593 -949 -904 -1599
1383 -1599 -52 -147 -581 -86 -668 -205 1240 817 1132 1271 256 396 676 252 1051 169 -1114 -124 -527
1402 -527 -891 -834 -1108 -597 -226 -763 137 58 -283 607 844 1102 1455 569 108 925 223 295 512 -363 -506
1423 -506 -1399 -1291 -236 -485 -890 -434 -449 -438 -8 -281 587 917 502 1352 1073 723 706 -8 187 1073 125
1444 125 -772 -386 -1110 -864 -948 -812 122 -709 -1247 -167 -4 329 959 509 855 1217 373 509 235 110
1464 110 529 -105 -394 242 -1318 -1683 -518 -603 -473 -470 -927 -235 77 -208 1283 857 553 1129 373 1026
1484 1026 1404 -36 -5 74 -428 -285 -649 -1166 -591 -1231 -1042 151 -561 -525 -39 -134 588 827 241 902
1504 902 986 569 1245 408 180 105 -651 -211 223 -779 -703 -1057 -1024 -300 -218 -218 220 -311 85 854 515 1053
1526 1053 868 221 895 815 128 657 -205 -723 -514 -843 -780 -536 -1335 -387 -407 -933 20 -29 -65 616 598 731
1548 731 1020 345 552 729 389 813 -14 -743 -206 -725 -981 -23 -189 -1217 -752 -806 377 595 217 346
1568 346 599 -21 1032 898 811 966 172 -303 390 -3 -318 -598 -1003 -190 -893 -1191 -395 -692 -618 602
1588 602 149 202 776 121 462 1098 744 1048 103 10 570 -289 -645 312 -809 -1520 -441 -590 -67 -307
1608 -307 -821 -170 -195 28 1199 1077 307 946 -150 220 1400 458 7 42 -729 -503 -696 -580 313 -1125
1628 -1125 -1320 111 -307 -751 56 -333 515 756 497 901 625 243 723 266 192 684 -485 -724 32
1647 32 -471 -677 -634 -860 -424 -701 -355 970 -355 -370 819 175 807 1403 405 223 355 -90 468 26
1667 26 -322 -219 -1422 -1202 -14 -643 -650 -230 -287 -362 253 2 604 637 380 1267 637 595 891 -196 -128 557
1689 557 -471 -664 -570 -903 -320 -578 -281 -207 -1228 -1035 332 568 783 839 198 582 717 372 1005 782
1709 782 -67 -114 -647 -68 -3 -869 -630 -699 -976 -496 -210 -265 5 -343 506 993 438 389 634 184 595 800
1731 800 443 88 -244 -506 -469 -485 -641 -525 -1201 -270 -254 -511 -44 133 -224 732 847 749 792 -57 225 856
1753 856 350 654 166 -995 -673 -781 -677 -33 -546 -837 -711 -931 154 527 46 444 707 275 787
1772 787 677 467 669 126 -57 350 -177 -664 -613 -725 -125 -385 -1040 -322 -624 -666 328 347 454 606 -33
1793 -33 603 964 433 511 334 -153 193 -58 -347 -34 -769 -906 -188 -430 -431 -387 -720 129 167 231 863 411
1815 411 188 496 372 719 842 126 19 154 -699 -186 -340 -964 -277 -776 -553 -229 -578 -356 73 16
1835 16 899 568 -28 581 406 316 918 537 25 -11 -840 -521 -62 -451 -492 -536 -800 -396 -387 -571 410 -145
1857 -145 8 773 420 707 595 289 715 718 41 253 -216 -567 -239 -695 -335 -141 -958 -459 -224 -378 53
1878 53 154 8 671 560 389 1067 376 312 425 103 256 33 -764 -312 -170 -848 -198 -576 -692 -262 -546
1899 -546 -60 525 103 128 594 187 840 418 304 795 120 -102 248 -235 -303 -115 -818 -203 -178 -1114 -516
1920 -516 -277 -299 105 34 335 615 -82 389 848 275 424 353 -82 -7 -58 -426 52 -454 -697 -333 -739 -601
1942 -601 -1 -721 6 571 -52 178 634 507 615 150 522 758 169 118 -1 -502 -465 -291 -844 -123 -295
1963 -295 -616 -148 -246 -186 94 39 488 552 -7 584 538 328 423 228 -22 295 -289 -345 -366 -547 -421 -406 -599
1986 -599 -63 -150 -512 183 244 313 717 427 912 712 423 578 396 -154 202 10 -345 -122 -539 -674 -576
2007 -576 -461 -322 -229 -280 326 37 -75 692 381 168 807 853 327 364 -266 -92 101 -282 25 -482 -827
2028 -827 -148 -649 -587 65 -127 -430 -125 181 411 609 346 1060 502 -68 816 245 -145 52 -378 -418 -219
2049 -219 -730 -190 -476 -524 -114 -424 -311 434 65 -41 749 471 132 496 296 447 375 -41 442 -236 -598
2070 -598 -143 -419 -604 -42 -684 -484 123 -402 240 172 454 491 102 153 1166 435 26 477 277 -91 -135
2091 -135 -387 -194 -194 -770 -322 -604 -662 67 -441 -227 702 -32 193 592 531 656 438 225 487 -42 -263
2112 -263 388 -272 -609 -38 -489 -615 -283 -504 -243 -154 -113 72 205 290 829 17 149 599 224 355 247
2133 247 49 80 -325 -647 59 -461 -459 -156 -398 -571 -136 -264 274 477 -10 333 345 300 732 310 293 739
2155 739 50 -123 328 -307 -263 -340 -633 -126 -436 -629 -85 -359 -22 325 -93 166 433 28 748 705 187
2176 187 264 8 -40 350 -418 -101 -99 -719 -635 -198 -581 41 -166 -257 294 362 -156 455 463 294 416 471 723
2199 723 335 -205 -18 46 -323 -103 -620 -621 -459 -448 -335 48 -168 -48 51 10 377 175 116 639 336 198
2221 198 408 78 -31 -88 -387 -80 -159 -592 -358 -635 -470 96 72 32 142 46 94 586 400 694 358 45
2243 45 653 182 77 208 -93 -146 -213 -574 -351 -146 -645 -145 -51 -192 314 -27 28 528 419 411 538 104
2265 104 173 -10 41 260 -117 -173 -205 -493 -504 -328 -509 -191 -111 -503 207 283 -76 361 140 572 649 492 312
2288 312 322 -272 -15 -39 -83 85 -503 -608 -5 -181 -398 117 -211 59 227 214 335 416 57 512 329 350
2310 350 468 137 -256 16 -453 -319 -19 -628 -377 -351 -506 181 -37 -399 117 35 224 529 208 481 599
2331 599 63 143 611 -107 186 -194 -523 45 -319 -495 -54 -498 -268 109 -213 234 230 -129 429 413 272
2352 272 590 342 260 298 -299 -76 291 -275 -314 -405 -522 1 -307 -605 -72 -25 -67 361 145 263 607 396
2374 396 540 562 -92 191 240 -98 164 -290 -409 -214 -635 -422 73 -326 -287 -61 -209 199 165 82 350 399
2396 399 317 605 96 170 245 -87 157 76 -362 -207 -152 -468 -84 -293 -377 112 -142 -76 239 141 478 403 214
2419 214 657 328 225 221 -14 -91 -131 -477 -174 -230 -714 -394 -353 -366 -92 -172 -146 132 -44 228 580 420 397
2442 397 245 176 435 91 -249 173 -353 -151 -274 -207 -188 -199 -578 -254 1 -7 148 204 145 450 353 175 465
2465 465 138 56 133 17 -32 -373 -501 97 -340 -695 -283 -32 -370 141 -324 155 262 -105 393 290 30
2486 30 355 61 209 428 131 -90 176 -189 -315 -450 -481 -67 -264 -315 47 11 62 123 114 196 554 191 42
2509 42 262 360 122 -198 -191 40 -67 -346 -276 -699 -393 -182 -325 -174 -84 -111 180 145 81 562 544 242 302 119
2533 119 -53 26 -11 -206 144 -56 -124 -329 -510 -325 -287 71 274 107 -120 -57 24 582 238 125 534 206
2555 206 188 213 -111 45 36 -524 -124 -51 -345 -205 -370 56 128 -193 -7 478 72 266 435 382 342 369 -40
2578 -40 177 -154 -254 -166 -524 -139 -123 -549 -272 36 -272 -164 -50 57 71 64 192 348 41 334 402 51
2600 51 192 16 -47 262 -268 -421 -134 -445 -229 -115 -383 -23 102 -270 12 349 -94 345 163 144 409
2621 409 286 28 185 88 -218 33 -375 -243 -254 -584 -371 58 -409 -254 3 -25 199 63 198 475 313
2642 313 319 216 -123 70 27 -58 153 -52 -364 -11 -363 -231 -122 -332 9 56 -210 93 217 226 271 262 312 435
2666 435 138 253 211 -54 -126 -271 -519 -116 -310 -536 -255 -164 -136 -117 -71 -34 81 110 288 168 224 262 216 8
2690 8 198 41 -81 279 -182 -346 -378 -186 70 -132 -426 180 52 -371 185 348 445 187 110 318 3 204
2712 204 176 -77 -98 113 -144 -187 -172 -418 -278 -126 -189 -159 -278 -223 240 49 177 81 282 128 441 154 244
2735 244 295 -55 -77 -178 -318 -197 -225 -287 85 -350 -156 232 32 59 213 85 466 247 242 296 71 -43 152
2758 152 70 105 -47 -283 -420 -217 -438 -157 -47 -295 6 -40 -115 180 42 211 290 335 193 357 -2 199
2780 199 135 -289 69 -153 -205 -163 -349 -482 -51 -308 -134 -38 -54 181 90 82 274 232 176 356 108 267 -123
2803 -123 -308 2 -138 -301 -14 -110 -390 -209 -526 -139 1 -118 81 247 273 292 240 102 349 -18 31 165
2825 165 -26 -247 -65 -184 -117 72 -66 40 -98 68 1 -276 -131 368 109 287 400 94 77 137 -123
2846 -123 22 -114 -395 -136 -344 -323 21 -305 -471 -136 -213 123 142 -101 162 403 154 274 282 198 287 137
2868 137 -166 321 -172 45 -139 -61 -33 -123 -325 -50 -299 -111 29 -121 342 267 -104 282 394 58 278
2889 278 390 -70 349 -183 25 168 -452 -321 -144 -389 -252 -54 -280 -39 49 -205 204 183 104 355 73
2910 73 399 216 -28 147 68 57 101 -84 -369 -117 -115 -371 62 -213 -89 -29 -174 150 175 320 346 258 -28
2933 -28 300 -19 155 75 -204 10 -14 -490 -75 135 -505 -197 -146 -241 307 91 84 218 74 270 272 145 261
2956 261 199 -48 220 -158 23 39 -123 80 -103 -420 66 -119 -151 -137 -178 194 169 286 263 395 119 115 157
2979 157 133 -5 -173 -18 -149 -122 -368 -214 -312 -118 -94 -233 88 -73 -44 134 143 84 321 59 109 -95 101
3002 101 19 2 -19 1 10 -131 -36 -245 -308 -64 -555 -255 115 -204 136 242 14 121 307 69 92 117 25 319
3026 319 -75 -141 -38 -43 -106 -435 -237 -44 -261 -166 -146 -168 -3 197 -1 359 443 36 -9 349 155 66 0 117
3050 117 20 -113 -246 -178 -460 -114 -159 -29 -19 35 -203 158 174 5 165 64 275 243 245 -66 304 -212 2
3073 2 20 -236 -107 -59 -330 -156 -182 -169 175 -46 68 222 -170 221 388 165 224 124 228 -32 -104 -193 -37
3096 -37 -387 -251 -65 1 -33 -32 -285 41 64 -102 211 99 119 174 -40 279 179 53 0 196 -188 70 -33
3119 -33 -92 -94 -266 -15 -200 -129 -36 -150 -129 270 175 -91 91 7 125 220 62 163 -52 -193 -77 -111 -242 -13
3143 -13 -334 -184 -40 -72 -85 15 81 55 339 217 135 231 161 260 248 25 168 29 -27 12 -278 -114 -173 -103 -303
3168 -303 3 -141 184 219 314 252 -6 127 326 -117 118 114 -30 120 -201 -113 -86 -206 -339 -58 -434 -267
3190 -267 71 -256 -250 105 -96 167 -42 -59 372 113 34 296 14 213 120 -86 -41 -83 -272 -271 -199 -342 -25
3213 -25 -209 -229 195 -210 135 333 8 435 338 -24 236 -10 141 37 192 -249 26 -184 -346 -1 -390
3234 -390 -163 21 -241 -109 274 124 113 70 79 -57 -97 -12 295 68 -150 16 114 101 -190 -235 57 -434 -152
3257 -152 -269 -212 -76 28 -95 -55 -91 -81 492 134 3 226 -118 183 -92 -64 -96 -93 -239 -180 -77 -92 -170 -41
3281 -41 38 120 61 115 259 -121 250 213 27 199 -15 116 78 -180 -24 80 -189 -81 -76 -385 -107 100 -136
3304 -136 123 -17 66 195 41 12 221 271 301 206 -218 159 48 -200 343 19 -351 -73 -292 -308 75 -344
3326 -344 -291 57 -248 104 307 124 272 74 236 245 169 -2 149 -178 -47 74 -382 -114 -142 -151 -101 -183 -73
3349 -73 -40 -274 75 309 111 86 177 61 67 192 -127 -92 -137 -268 1 -181 -23 114 -174 -129 -31 -169 146
3372 146 168 -83 421 -22 150 228 -61 126 180 192 -102 46 -45 194 -227 -242 185 -174 -121 -185 -234 141 -68
3395 -68 61 77 108 -66 200 195 231 283 68 12 131 -11 -49 -122 -284 0 -298 -245 -35 -47 1 177 -73 105
3419 105 185 159 83 292 -156 140 106 -38 -107 10 9 65 -405 -218 51 -143 -142 -213 -125 -3 231 -107 252 -155
3443 -155 -34 237 27 118 55 -10 99 -185 -115 -19 -203 -90 -149 -279 44 -73 35 -50 -181 -61 156 185 157
3466 157 104 85 -36 -39 -173 28 15 41 106 -82 -200 -93 42 -203 -93 -76 86 279 -39 45 38 -95 308 276
3490 276 -136 181 291 -99 156 17 0 -86 14 -180 -146 -335 21 30 -209 1 238 177 122 68 168 260 -104
3513 -104 233 117 -73 83 194 -186 -412 -185 -169 -163 -401 113 -28 71 -10 268 31 196 162 3 176 141
3535 141 15 32 54 -80 -123 -81 149 -164 -63 -52 -173 -91 114 -144 -70 -124 26 18 62 174 243 203 -150 3
3559 3 298 44 204 -55 -9 -12 -275 -208 -39 -62 -57 -248 -342 -106 -105 -30 23 124 289 164 -71 41 220 41 110
3584 110 -138 -45 41 -250 -337 -90 -415 -198 -153 6 22 -66 126 105 289 167 183 116 274 238 -147 -127 15 -90
3608 -90 65 -88 -70 -292 -125 -9 169 -71 46 -62 110 73 42 125 297 236 -54 43 -7 69 180 -19 -164
3631 -164 6 -222 -195 -203 -224 -178 64 -92 70 -52 18 210 -58 -245 247 -37 112 271 34 67 139 -81 -14
3654 -14 -61 -253 -177 -145 78 -129 -28 20 137 -161 176 21 214 215 32 0 136 54 44 98 -248 -2 -6 -7 -95
3679 -95 -122 -78 202 -53 -224 -12 -109 -44 148 52 -2 278 0 -125 64 -189 -222 -38 19 188 -421 -249 -183
3702 -183 -224 42 116 54 117 152 183 237 -34 4 -7 -71 133 52 -138 19 45 -302 -135 86 -270 28 -211 -37
3726 -37 -154 -342 -172 10 -90 -29 140 178 221 10 -3 -36 -44 -243 -39 -97 -109 -150 -243 -78 -169 -132 -133 -155 53 140
3752 140 -72 -54 265 31 84 238 10 59 397 7 99 -98 32 82 -96 -269 -71 -274 -115 -163 82 -164
3774 -164 30 108 -79 176 70 130 120 103 -70 -24 -83 43 -19 -183 -2 -302 -84 -47 -249 52 8 -44 138
3797 138 -70 172 84 144 166 288 35 161 82 -67 62 -172 -194 -13 30 -278 -157 17 -31 -55 -126 3 233
3820 233 168 -84 -81 247 188 66 79 214 94 94 -196 131 -88 -150 -213 73 -298 -105 -180 305 34 -166 -14
3843 -14 306 46 83 165 48 179 184 -41 219 36 72 38 -35 -78 -102 19 -217 -72 -97 -46 -32 74 147 166 -116
3868 -116 199 85 128 -179 -121 109 -46 124 -73 -147 -191 44 -100 -54 -46 -72 -90 50 -80 143 81 209 14
3891 14 210 20 195 -106 -192 -103 -155 -102 -63 -171 -66 65 -64 -148 -54 -269 -51 154 122 166 -67 256 175 -63
3915 -63 -74 17 -212 157 185 90 116 49 -84 -22 -4 -125 64 -63 -149 -77 263 24 129 -50 131 -16 -95 221
3939 221 -100 175 -93 -162 -39 -124 -192 -8 -320 -274 -92 -15 8 17 -11 112 -92 -163 101 95 -1 78 197 160 120
3964 120 -27 -161 35 118 -69 -7 -47 -19 19 130 100 106 186 -23 -33 59 78 -15 285 180 -98 -151 132 -101 -108
3989 -108 -62 -170 -94 -42 -218 -79 -285 -162 85 129 206 33 49 136 112 75 96 -130 -124 174 -190 -32 26 -98
4013 -98 83 -11 82 33 -53 56 -100 -179 61 106 -76 84 7 54 104 94 15 98 11 35 25 -153 151 -20 -40 -167
4039 -167 141 -128 100 31 -103 -121 154 109 16 -84 -111 177 112 42 3 30 91 -97 -91 65 -43 -308 -181 -142
4063 -142 -63 1 -95 70 93 15 143 95 121 -51 69 89 -30 -85 -153 -206 -199 1 -147 -216 -97 -240 89 14 -42
4088 -42 68 155 80 -16 -9 51 61 -24 -45 -25 174 -14 -118 -60 -200 -60 -185 -178 4 -154 91 -36 -184 -34 -131
4113 -131 82 156 -36 214 104 -90 -57 56 -129 -72 -69 -202 57 -170 -222 306 210 105 157 -13 226 206 176
4136 176 -102 -100 -33 11 -38 242 55 -58 84 -147 -286 -245 79 -25 -35 -150 4 145 -23 -123 212 49
4158 49 123 -48 -227 248 86 -35 107 209 13 211 -168 -47 238 2 -35 193 114 154 74 -102 123 -130
4180 -130 148 126 27 158 111 -10 244 -20 -176 23 -18 -213 -74 -64 -100 131 -30 -53 117 -54 -96 50 -105
4203 -105 43 -87 124 34 195 35 43 81 69 -84 -271 -58 -28 -189 -119 86 4 -57 -40 -71 102 294 -117 190
4227 190 -186 82 29 -154 119 -106 -87 85 -130 -187 57 -103 93 19 270 116 174 101 -44 -30 -5 -64 45
4250 45 105 124 22 -23 40 -120 79 -27 -238 112 25 -89 -219 -59 -80 171 -143 200 141 -138 154 206 90
4273 90 106 -28 -232 33 -65 -77 -169 -108 10 -99 -141 -94 -8 -203 -155 26 -20 116 222 98 7 52 -54 -15 24
4298 24 198 59 -221 103 -183 8 32 -68 38 41 31 -17 -125 29 98 -11 87 -5 99 6 83 -6 27 103 29
4323 29 -51 -74 -169 42 -176 70 -121 -66 -82 231 -17 213 191 -140 157 126 294 158 162 45 -9 78 49 177
4347 177 -13 -100 28 -118 -53 -203 33 105 -151 176 210 79 222 -116 3 -114 10 -25 -44 -14 -110 16 -164
4370 -164 167 -211 58 -108 136 -43 150 193 27 -3 40 388 -28 62 168 56 -18 132 -102 60 135 -119
4392 -119 -56 -14 41 -255 147 3 -232 -34 -240 -102 71 218 -54 -107 212 -42 57 -51 138 -165 -15 -46
4414 -46 -234 156 -182 -85 -125 -181 23 40 106 92 65 17 149 245 142 45 42 183 -43 20 -314 130 17 -325 88
4439 88 87 163 17 -181 203 51 -149 134 205 38 268 -28 -155 56 -148 136 -28 -70 -150 179 -133 57
4461 57 -28 61 -65 -101 -140 235 -63 -35 142 24 117 66 53 -108 53 -236 -144 -67 63 -184 -182 -50 -8 -87 -19
4486 -19 260 50 215 24 -55 -123 -57 -65 107 50 97 130 -139 -21 80 56 -8 -147 105 -213 -68 4 51 64 70
4511 70 87 -73 175 102 104 156 252 -29 48 45 125 230 84 33 -2 -200 -37 53 72 -54 -180 100 -99 -18 120
4536 120 -202 160 109 -154 28 62 33 -106 192 -197 -55 -64 -118 14 65 -220 153 -139 -59 204 108 122 -150
4559 -150 42 -120 26 -24 -14 109 -44 36 -76 12 -59 -135 -61 -71 -172 -164 -31 -47 -67 -161 -12 -15 119 193 367
4584 367 222 -192 123 -117 -64 -246 -238 209 34 -62 -55 -74 76 177 -154 -36 -15 59 -317 38 93 61 -27 -92
4608 -92 -33 -67 -33 19 -266 -117 -25 -174 80 10 -223 -40 49 64 -157 29 -108 -2 -64 92 78 37 163 147
4632 147 -130 -81 11 -61 61 -68 -73 -51 -148 -97 194 -7 58 2 -249 35 301 -125 53 13 90 -70 -87 -122 -82
4657 -82 -77 104 -102 -64 149 -202 -237 -28 -168 200 -157 -19 -139 -87 -61 164 138 201 243 -4 54 -62 -88 182
4681 182 -90 164 33 -229 -112 -14 -196 -382 93 -56 32 259 -207 239 95 15 98 113 -100 -50 62 -11
4703 -11 75 -107 -49 -32 52 64 -68 -114 53 -8 6 85 123 -254 -21 68 13 -112 146 -58 109 34 -53 -21 -277
4728 -277 -32 124 -170 196 -328 -42 -54 -132 107 133 123 41 5 -119 -102 301 -4 234 72 4 -38 -238 71
4751 71 88 -49 -26 -103 -4 116 201 52 197 235 149 -29 -60 -81 -119 128 63 -178 -176 -12 52 -31 59 -120 -151 157
4777 157 51 -147 -41 -81 -99 131 -138 134 -160 62 76 60 72 74 -27 26 7 -229 127 -21 -193 108 -11
4800 -11 -27 -81 165 -34 -101 75 114 48 -195 -5 110 -244 -226 -102 23 -27 41 -144 -114 220 -85 -248 -78
4823 -78 -190 -75 8 357 -24 41 98 -39 -26 158 48 298 -10 125 -94 -269 -219 -125 -60 -85 21 -79 96
4846 96 259 -41 -85 53 -21 27 168 -115 108 -70 34 92 -156 -111 -166 -66 85 -96 -30 -85 -109 154 -54
4869 -54 -9 -96 142 24 164 64 -131 63 181 85 44 8 190 18 59 126 50 -111 44 -6 -153 -109 -137 121
4893 121 -14 27 320 153 -65 -137 149 67 -9 112 68 11 -65 -245 -91 -14 -64 15 122 176 46 -19 182 -17
4917 -17 143 290 -18 -64 76 -132 30 189 48 4 49 -148 -4 -16 -68 132 83 147 -78 -105 -150 115 -73
4940 -73 85 129 93 -141 53 97 -226 -114 -15 -113 -206 -108 -53 -129 -5 -114 21 51 31 17 -10 33 -26 71 191 57
4966 57 204 10 16 137 -57 -100 -226 48 -2 171 95 -76 30 -93 123 -1 251 179 105 46 96 137 179 -106
4990 -106 44 -47 -27 71 -63 55 -266 -46 -122 -106 -158 156 -194 63 42 22 54 -70 -41 81 257 100 -211
5013 -211 -53 -16 -12 -8 318 -34 -87 34 113 119 26 -2 -31 -85 116 182 -13 142 -92 25 38 -76 -132 -87 66 39
5039 39 -56 -86 100 -123 -138 -117 124 208 -124 61 -11 -21 124 110 101 23 33 71 132 -129 -10 -162 -49 1 92 2
5065 2 71 34 134 -4 163 -55 -38 65 152 8 22 -85 -2 -50 -2 -203 -62 -144 -221 69 -34 123 -62 105
5089 105 -98 -126 83 -149 -31 189 17 108 0 -49 -2 29 -169 63 -250 -166 105 -145 24 -9 -158 121
5111 121 75 -139 129 15 -13 137 203 127 34 -5 20 2 -71 70 -86 29 67 -328 -89 80 61 -34 -100 -19 -155
5136 -155 -64 51 -77 27 -4 60 -164 195 230 -85 -64 172 -89 19 -75 -27 -28 -133 14 111 -59 -105 79 -247
5160 -247 54 -8 100 27 22 2 -10 -62 29 92 17 81 26 38 -25 -24 -98 120 -78 -89 240 187 -84 34 31 -278 367
5187 367 -69 -97 62 -200 106 -187 -111 148 -197 -114 5 -39 -22 37 -40 -30 158 5 28 -128 -129 161 225 17
5211 17 -47 -61 -74 -27 -92 -21 -207 -191 11 185 -13 8 167 135 -19 186 83 58 -49 86 19 -130 132 278
5235 278 42 29 -106 4 -13 -107 -16 -54 -133 162 172 -79 -18 2 -18 113 53 -257 -52 -54 -6 -180 54 -140 137
5260 137 -56 -69 21 -49 -67 -55 -18 95 -91 -1 50 -177 146 223 161 143 78 89 -45 104 -119 59 -11 -152 -30
5285 -30 97 115 -59 129 -69 25 -26 -329 -151 130 120 5 -70 -96 79 -42 54 34 -42 -49 194 -62 -234 -3
5309 -3 76 -103 -28 103 -44 96 49 80 -36 47 142 -96 78 130 112 -79 221 -173 -97 -12 -29 -111 38 -133 100
5334 100 43 -123 55 135 -67 -66 8 -14 -18 117 194 121 -131 -136 75 203 36 5 108 -138 -36 137 46 50 43 200
5360 200 89 75 137 -34 9 -21 76 -28 22 198 60 35 179 -109 -193 -23 -52 -76 -373 -196 30 194 39
5383 39 65 38 162 131 54 -9 23 -13 -56 -19 37 87 54 26 66 -13 -62 -62 -147 4 -57 183 -111 151 -156 33 225
5410 225 -5 -107 126 -231 -145 -188 -174 -120 -120 -11 13 41 -57 -1 71 -43 7 -56 -165 -37 97 -38 -26 160 -121
5435 -121 202 -28 62 -117 1 223 -54 -164 108 -95 -51 35 13 -155 117 27 -17 -146 -74 -134 -9 178 133
5458 133 177 173 5 -229 28 89 186 -93 103 -132 250 -113 -97 122 -178 -17 19 14 184 -26 105 43 -62
5481 -62 137 33 118 -25 94 32 -41 -200 -5 -82 81 -97 12 -66 29 139 170 181 -147 298 3 266 -158
5504 -158 22 96 82 -35 -83 -56 97 -15 -111 157 -96 177 33 -61 -66 -10 37 87 -69 -100 38 -66 -125 231
5528 231 -173 -100 194 -13 22 -125 107 -499 -157 -272 172 166 114 85 110 -43 144 -47 -221 161 -170 -40
5550 -40 -48 182 -101 69 -193 -44 20 11 -12 -163 268 162 -184 123 137 13 230 82 23 141 27 41 27 17
5574 17 -16 -7 -9 -141 -24 120 90 -35 69 82 134 -218 -65 157 96 52 -177 117 62 -6 0 -145 -23 109 -58
5599 -58 60 -112 -93 -7 -53 -40 91 -14 -40 54 41 214 10 198 172 151 30 -97 83 88 -63 -3 13 -33 14
5624 14 8 28 51 -40 -156 -92 167 -228 123 -6 187 49 -4 -5 151 68 197 232 -238 13 117 -49 223 -56
5648 -56 -157 -119 5 65 -7 48 -181 36 -105 -108 -10 10 93 -73 -87 -58 -37 -90 -145 -187 -157 -122 -226 -187 26 -6 28
5675 28 183 229 11 56 82 -224 65 -215 -2 150 -11 110 18 -76 31 -144 260 52 -12 -108 -58 96 -184
5698 -184 -101 65 -145 105 20 -119 14 -22 42 4 -130 257 -65 -180 83 10 -55 104 69 71 -73 122 -48
5721 -48 43 51 -210 -30 -145 -74 -14 -112 -256 55 -59 -37 -273 162 -60 -8 96 -266 124 -103 255 -33 -77
5744 -77 255 37 36 164 159 -239 -125 79 58 -109 -38 -128 2 -19 -118 111 170 42 -52 -62 156 84 -148 -91 185
5769 185 206 -36 -40 158 21 -26 59 -15 -86 -101 -34 -351 -133 -142 -102 -53 82 240 57 -109 235 -26 108 -120
5793 -120 -186 207 230 130 8 -80 -140 -36 -170 -53 -51 -55 -12 95 -104 62 73 103 492 92 39 207 -265 194
5817 194 -11 -63 -41 187 91 126 -58 118 77 21 88 -198 46 34 -111 -81 94 -10 13 178 49 -13 -14 2 -3
5842 -3 44 -20 -23 -5 -1 24 -89 13 -265 145 122 46 -8 127 -31 70 -39 -59 -137 -270 -140 106 128 -75 9 -52
5868 -52 46 -73 68 -83 28 24 85 90 33 -8 144 7 -207 -89 39 -118 -98 -72 13 13 167 -12 -63 94 -59
5893 -59 9 15 127 63 -154 149 147 -115 56 -76 -15 12 41 87 -43 25 -238 15 -263 116 -233 -67 -257 -6
5917 -6 -26 -10 27 -42 27 -61 -90 -159 79 -147 6 16 -47 63 53 37 -56 -199 -19 136 60 -110 -161 96 -39 -32
5943 -32 -13 -99 59 -93 78 19 8 -94 60 -122 60 -61 86 83 -368 -23 76 -197 101 90 -86 -8 84 131
5967 131 -131 108 6 69 137 2 33 135 73 -70 -52 18 -17 45 295 151 35 -57 -84 145 19 54 82 131
5991 131 52 -103 113 -53 -12 110 64 41 -64 -130 -199 -194 -73 -72 -64 -129 -164 173 143 137 38 128 -134 -115 200 -104 93
6018 93 30 -15 6 184 -240 248 77 5 91 -169 -19 -77 49 130 -198 82 123 -123 -40 -78 208 264 197 5
6042 5 -173 61 -224 -272 85 -76 65 -74 -44 21 184 -300 -108 -209 -116 -47 -47 -43 123 260 5 -161 -66 62
6066 62 -298 -69 49 -187 5 -28 -14 210 12 87 140 229 137 -34 -120 -85 207 49 -71 63 65 -70 177 -155
6090 -155 -213 35 -169 -186 -52 -68 -77 -127 12 163 121 105 -73 -182 204 29 -16 127 -273 -51 -5 -91 -72 -192
6114 -192 90 -58 -7 -67 -82 263 -58 100 -188 48 70 62 82 49 -87 -116 -6 50 -109 -172 -17 -1 -55 -47 20
6139 20 -34 -119 -60 101 -120 -10 8 65 -14 -71 4 63 196 -2 -67 86 92 52 -51 173 62 -19 -90 66 -62
6164 -62 -34 53 86 27 -53 -58 176 -107 -70 -6 -148 261 15 -8 -94 186 -89 56 29 32 80 68 70 -64 -7 359 -141
6191 -141 18 -40 -26 -183 132 -2 8 -63 -110 -155 -135 -40 86 26 -108 39 -26 44 -97 22 -91 114 -53 59
6215 59 153 -46 42 92 -72 -18 -188 57 208 -220 17 -181 -70 -79 -83 -52 148 -56 84 -78 113 80 -36 -24
6239 -24 194 60 -178 -212 -47 -63 275 101 -78 -99 3 -98 -12 111 53 -14 154 42 365 -128 43 183
6261 183 -19 -34 51 -28 -19 20 -192 -103 -156 -124 -117 75 -29 160 -74 50 -17 96 -41 -102 40 -14 -111 -45 83
6286 83 -68 -15 -43 35 10 -222 89 24 -70 111 -63 124 -89 -159 56 52 24 -36 -42 -290 -116 17 221 -32 88
6311 88 12 57 -78 18 -122 -83 193 162 38 -32 7 12 41 -53 172 -61 -87 -234 -127 45 -30 -128 -30 -104 2 -23
6337 -23 28 -168 135 -149 190 137 168 -66 50 104 122 141 -166 69 99 58 42 -50 -181 10 -99 23 -92 -42
6361 -42 76 43 142 -93 -142 -112 -74 154 -117 191 -3 -137 -8 70 121 -204 -44 -122 -71 -201 58 -118 101
6384 101 -84 -130 -221 -2 -65 -103 -161 43 92 -193 -111 13 -89 150 146 -76 14 27 -50 -211 115 248 38 81
6408 81 3 -8 159 23 -136 152 50 52 105 -144 8 -169 87 144 -44 21 -115 28 165 242 162 -60 -151 10
6432 10 -53 -160 144 -23 63 -39 131 32 198 121 -5 -36 156 -99 -27 18 3 62 115 50 -169 -56 -251 34
6456 34 -2 241 136 76 201 152 -9 -146 -45 198 -49 28 -105 2 27 -165 -38 -90 -129 -334 -54 -223 55
6479 55 68 146 204 -30 143 267 -81 46 34 35 -46 -177 26 -118 -218 3 202 -120 179 -36 187 -168 3
6502 3 85 126 42 270 -233 3 67 -8 145 -36 -249 -8 -16 -54 -88 -96 -24 -12 -19 -48 -21 159 134 -19 113 48 60
6529 60 -142 -124 10 10 20 -160 71 1 -111 -123 14 -73 48 161 45 210 -45 -6 -125 -62 -129 -67 -153 81
6553 81 -48 -150 0 -151 -169 75 18 -100 -167 36 14 66 6 2 112 101 -80 -46 133 -73 -204 117 -22 -35
6577 -35 147 55 22 3 -29 -138 -17 45 -4 -56 45 113 49 57 27 -7 79 52 -205 -126 -16 96 -15 -219 -210 89
6603 89 184 94 94 -38 169 -84 -23 214 114 -137 -45 89 99 26 -54 269 343 69 40 -80 175 -247 91 125
6627 125 -64 -149 148 153 -62 53 -103 -52 -32 18 -116 -11 -102 -45 67 -18 53 43 265 -66 -57 -120 -12 72 3
6652 3 249 44 99 52 249 25 42 98 -97 30 206 81 -225 90 -31 134 -8 140 -11 -11 31 -17 4 27
6676 27 -161 228 -14 81 74 -108 73 136 120 132 263 52 139 7 -91 -104 -125 -111 -65 96 -19 207 -47 -68 80
6701 80 -242 -169 105 -2 100 105 -325 15 -262 -137 225 -98 16 -34 7 35 -157 -91 24 -127 -295 47 157
6724 157 5 72 -40 114 -173 -11 -46 -84 -3 151 -167 -81 -59 -194 25 -251 -33 15 -187 -100 187 -18 43
6747 43 31 246 11 43 44 36 -79 305 59 -55 -108 49 15 -173 88 24 165 11 -181 193 -38 -5 295 -26
6771 -26 10 -97 -45 -3 -34 78 -36 43 -41 -103 -204 -56 128 -292 -141 27 -35 -20 -127 247 -47 -190 -47
6794 -47 268 -38 -35 -44 196 6 -143 -24 -56 -54 -10 0 -202 13 -63 -96 85 187 64 -147 -71 125 -102 -52 -5
6819 -5 -55 21 197 -16 -72 -127 -13 -171 -79 -71 135 -31 36 40 88 201 123 -12 -123 -28 -9 32 188 102 74 -168
6845 -168 -50 -2 -132 53 -216 -34 -26 111 -31 -25 -121 -86 -153 166 -20 -56 23 49 25 60 -296 -145 54 -26 -138
6870 -138 49 -25 -84 98 -325 -63 173 -112 -10 29 109 14 -222 -54 47 24 95 -10 43 -39 56 -90 46
6893 46 -64 -65 -39 6 121 29 -51 -289 70 185 -98 76 -47 -179 -99 -258 -289 -2 134 85 139 -62 -195 -58
6917 -58 129 -140 168 32 -177 75 -139 14 31 157 35 -97 -1 -59 -136 30 -154 -145 91 -149 26 16 268
6940 268 102 -80 38 -155 -35 28 112 104 -225 -8 128 -170 -90 323 -41 87 32 -58 -167 7 -138 -140 179
6963 179 -132 80 123 -17 120 55 -68 -12 -165 8 -116 160 126 86 -116 -141 -19 53 -142 22 -225 -59
6985 -59 -60 48 24 -48 -9 -99 185 -187 -46 197 -154 19 39 102 -9 -144 -141 -234 48 -62 58 75 -116 -10
7009 -10 -17 -142 -163 131 101 11 -75 -39 79 -128 -64 76 10 -13 -3 54 80 -3 -57 -174 -107 83 -165 -279 -29 -53
7035 -53 150 -27 189 -164 -172 -24 -129 87 91 -39 45 -14 -16 130 -103 110 -140 121 -30 -26 -163 -146 2 97
7059 97 -37 28 78 26 -54 4 34 172 -176 -16 -110 28 -201 -36 65 -105 25 -1 57 93 197 32 101 129
7083 129 169 183 157 42 18 -48 -144 103 -305 -55 -125 -315 -76 -64 20 -159 -112 -133 41 33 -201 36 128 229 -79
7108 -79 175 25 -12 -27 -40 79 -135 76 -173 -210 24 -42 36 25 -18 -83 -6 145 146 -142 68 -23 4 76 -159
7133 -159 -59 40 -37 -34 -29 -31 -34 -63 -96 -80 158 -170 -48 17 -139 -151 -86 59 -59 -97 0 -48 -66 8 -219 72 24
7160 24 170 125 4 -15 -27 75 126 21 -32 108 -89 -140 -10 187 103 -36 -94 73 94 -31 -49 -5 232 24
7184 24 -52 -96 -35 -35 111 -45 18 87 -75 -7 52 8 -135 39 57 53 -109 -255 46 175 70 66 -139 20 40 260
7210 260 -203 -21 193 37 -125 -99 -190 -20 -25 -23 -127 35 56 88 -6 154 -190 -169 -8 120 89 -4 34 -5 -112
7235 -112 133 -225 -142 -48 -19 49 133 54 -157 149 -67 -161 -11 -101 -42 54 -58 8 -26 6 114 131 -140 -83 106
7260 106 90 37 -126 -152 -249 34 -25 -40 129 112 19 -99 -54 -34 -30 -58 -9 -150 -28 18 -47 -92 155 5 62 122
7286 122 119 -16 57 -91 -59 -139 213 29 -2 43 212 -211 -97 137 128 -49 24 -104 -182 172 36 -152 -7 -66
7310 -66 -24 22 -130 280 -146 -35 -137 42 -49 -122 43 25 132 -97 177 63 -57 -102 44 -96 33 10 46
7333 46 -69 -180 94 169 -100 38 -225 -156 111 -48 92 254 -18 25 416 2 25 22 56 -73 -55 114 69
7356 69 -237 73 123 74 -71 125 11 -60 -30 43 74 64 -4 136 -83 -198 137 78 -16 84 -134 -61 -107 -149 357
7381 357 -134 45 16 19 -56 -8 -21 53 12 -90 10 -167 36 50 61 25 -19 -236 104 33 -69 -67 75 -274 -43
7406 -43 -78 10 -98 -117 -283 55 -60 25 -126 -53 -164 -18 61 -154 -45 -91 65 -30 -103 7 160 79 93 -231
7430 -231 40 -30 18 32 -52 -72 222 -187 -138 -64 -75 64 220 228 -63 46 -100 -162 7 -6 103 35 70 134 166
7455 166 -194 -75 75 67 16 231 1 110 29 112 -95 -91 -178 17 177 12 62 -19 -110 100 -129 99 -192 -57
7479 -57 120 34 193 -65 55 219 76 138 78 -194 -82 127 43 -128 100 -277 -100 143 -60 149 -306 66
7501 66 190 -66 23 133 23 69 128 19 16 -85 -190 25 -132 -18 -215 -159 -65 -132 -93 -3 54 -49 57 22
7525 22 114 66 20 78 101 -141 -109 14 -109 -108 -15 -95 64 46 -54 54 -106 -76 -58 44 56 75 -69 53 302
7550 302 -33 142 108 -146 -33 -4 -105 -30 -49 24 -167 -117 -83 -122 142 17 -28 -102 -84 -47 129 73 -199 3
7574 3 37 87 -146 46 -222 130 117 -26 158 109 113 40 156 -77 -172 -80 87 -169 136 39 -95 56 -50 -50 -111
7599 -111 52 -5 111 -101 -101 -166 -83 93 142 -143 -155 29 -115 -44 146 175 0 -193 94 108 110 26 -42 -12 104
7624 104 1 39 6 -66 -149 97 19 -204 -8 149 4 144 -12 63 -32 65 139 -68 -95 -213 -253 -81 182 101
7648 101 -194 -125 -22 -247 -12 -102 -24 50 -74 58 -14 -161 -78 -56 81 77 -8 -79 -60 -48 206 25 0 89 -72
7673 -72 -103 57 -66 100 41 280 -25 62 -218 156 -96 349 61 -156 -24 46 8 168 -21 0 -107 -15 120
7696 120 -69 -92 -14 -22 127 168 42 92 9 346 73 -129 -158 171 -98 63 58 187 -93 108 -111 89 80 -101
7720 -101 -158 171 89 194 -40 119 47 -123 373 -59 181 -44 59 144 78 52 -104 -35 145 -181 27 64 2
7743 2 -85 -120 -149 26 -84 142 245 105 35 152 -14 38 -18 -28 -77 -164 -113 -19 -36 156 -64 -109 151 -76 -151
7768 -151 13 83 90 -22 115 71 168 114 -134 0 190 114 153 181 -87 206 -49 -123 -146 -206 33 210 -87 -11
7792 -11 11 -73 -19 51 -5 -41 12 32 -60 -66 -91 -58 14 142 84 -166 49 -214 -73 -132 44 -279 -16 -28 219 -84
7818 -84 -2 71 -67 25 -141 1 44 38 -24 88 -10 67 -80 -86 223 262 118 10 28 -67 48 -13 -75 49 -81 185
7844 185 -67 -162 135 -6 -6 -58 -175 -11 167 -48 -36 161 -144 -34 51 -17 -53 -62 -226 -23 62 58 -72 -121 145
7869 145 -94 -8 -23 36 -62 -192 -87 15 -15 32 210 -49 -66 -160 -182 -208 -89 72 46 223 50 -104 56 173
7893 173 -16 -188 85 -231 153 -130 -92 87 -90 -160 -109 -29 157 -72 -34 -6 174 57 51 67 100 275 152
7916 152 -65 148 127 -220 -32 212 -26 194 16 134 -65 264 51 106 -22 -96 115 -66 29 -111 -4
7937 -4 182 110 -77 118 -179 260 -1 -153 9 -63 141 -35 -41 -5 -53 75 6 -76 -103 218 7 -3 -116 -85
7961 -85 18 116 -15 212 -6 162 235 37 233 213 -40 46 -45 200 -78 159 -1 -95 45 76 26 -32 -116 61
7985 61 -14 108 -29 -169 -133 -282 -38 13 -66 -81 57 140 77 56 -86 1 -117 112 8 -29 -87 -230 -174 66
8009 66 14 -31 45 -16 -109 334 -74 110 -17 190 12 182 100 9 214 85 -87 149 163 106 -209 -51 -70 -142
8033 -142 80 -21 -169 -10 223 -13 -38 214 248 19 7 86 129 6 141 -29 46 -35 -191 -173 39 58 4
8056 4 70 150 254 -207 53 -7 -25 -19 -94 -52 12 45 39 -5 64 -51 37 130 -78 222 -139 51 -25 70 -236 10 161
8083 161 -49 39 -31 -78 -88 -19 159 -32 59 -62 -99 57 322 -16 -26 -44 13 14 103 -52 -58 -92 -139 -135 -139 -54 225
8110 225 74 35 136 -23 -173 152 -30 -101 -159 58 -132 -186 193 2 295 29 -40 -114 -80 -41 52 42 -216
8133 -216 242 198 -45 111 218 12 152 58 65 26 -28 -52 226 163 -156 -196 -125 -45 -93 22 28 -127 77 4 167
8158 167 41 86 98 -94 47 -60 -67 -237 -120 165 -26 9 -61 -124 -99 -8 26 53 53 -56 -64 82 -6 -81 152 -166
8184 -166 0 -143 -246 79 -35 -23 6
8191F
$$ Imaginary data points
##PAGE= N=2
##DATA TABLE= (X++(I..I)), XYDATA
0 0 0 0 0 0 0 0 0 0 0 0 0 0 0 0 0 -8 8 -8 8 -8 16 -16 16 -24 24 -32 32 -40 48 -50 58 -66 78 -88 98 -113 124
37 124 -138 155 -175 195 -216 240 -266 292 -324 357 -394 434 -479 528 -580 641 -708 781 -864
56 -864 958 -1069 1196 -1345 1526 -1745 2023 -2387 2880 -3603 4752 -6875 12127 -55282 -37273
71 -37273 82482 31803 -33016 -39366 5035 10145 3467 9088 8864 -18058 -4610 23680 19688
84 19688 -11366 -20966 2861 24367 -2507 -19662 -1640 4656 -9469 -7502 5533 7901 -9937
97 -9937 -11806 9061 5608 -8796 8924 18114 -2613 -12215 5227 15546 -1218 -8830 8877
110 8877 1585 -22321 -3698 22954 4786 -26962 -22235 12297 19028 -10536 -12661 13304 10732
123 10732 -13438 -10738 19034 24416 -9290 -18773 8851 12972 -5264 -4613 4289 -1457 -11571 -5075
137 -5075 6717 -5269 -14785 4924 13680 -3504 -12707 -2337 10637 7587 -1057 4141 7314 -1191
151 -1191 -4008 -594 3227 4874 191 -3668 -7481 -11975 -884 11600 231 -13797 -6541 7577
165 7577 4563 -7625 75 14323 4411 -7517 536 7408 4179 -532 678 3327 -4996 -9226
179 -9226 1295 5294 -2807 -8631 -7108 880 3720 -1169 -233 -166 -2798 3716 9110 4120 -2743 -3523
195 -3523 6686 9818 -2550 -6489 -863 -331 906 -94 -5645 -6228 -4190 20 3229 -1734 -1885
210 -1885 2611 -735 -1310 4249 7472 7698 -1188 -7493 2460 8375 2440 -2747 -4291 -2401 -2122 -3730
226 -3730 54 -317 -6541 -2491 2889 -505 -1527 -70 2820 4797 1671 2307 3518 -508 975 3798
242 3798 1422 -127 -3414 -4027 910 -741 -5198 -3324 -994 138 -1995 -4198 1486 4142 1126
257 1126 2452 1061 -180 4411 4972 2047 13 -1684 651 594 -2935 -742 -1557 -4954 -2448 -1944
273 -1944 -2166 455 -1524 -1866 1199 1092 3432 2869 118 3049 3556 1563 2641 -720 -1946 2381
289 2381 -674 -3623 -2401 -2688 -1371 -2418 -3979 496 -156 -2750 1879 2096 910 3465 1846 2190
305 2190 3728 973 1907 1957 -1349 475 -732 -2904 -570 -3608 -3902 297 -2392 -3333 -336 -349 1157
322 1157 1078 77 3565 2513 653 4171 1945 673 2894 -807 -1030 1267 -2357 -2234 -1870 -3576
338 -3576 -929 -2389 -3147 1093 -1010 -1946 2261 1043 1329 3631 1647 2623 2429 204 2595 1139
354 1139 -1174 687 -1827 -2840 -231 -3603 -3308 60 -2232 -2003 -469 -793 1511 644 225 4608
370 4608 2643 1100 3095 777 997 2632 -292 -4 -159 -3129 -2123 -2716 -2834 -43 -1952 -2445 -48
387 -48 -2595 -836 3270 1838 1775 1906 1267 3080 1444 431 2228 563 -134 214 -3393 -2417 -454
404 -454 -3181 -2483 -1154 -1668 -1060 -1330 -875 1773 833 1955 4142 883 348 2339 2252 2751 1209 -1939
422 -1939 -961 -492 -945 -1818 -4127 -2779 -818 -2005 -206 715 -2214 -1262 1775 2856 3185 1790 1966
439 1966 2012 -858 1129 3321 1469 258 -2456 -4302 -1484 -197 -1439 -2201 -2811 -1055 49 -1747
455 -1747 -358 656 1188 5176 4691 -349 -1878 114 3863 5474 1144 -1654 -2485 -3540 -677 -179
471 -179 -2037 -96 -2075 -4462 -1739 117 618 1270 1095 2846 2032 -611 2342 2677 761 2688 1573
488 1573 -1017 -941 -2757 -1898 369 -1779 -2683 -2646 -2089 974 -827 -2581 1557 1492 -121 2546 3111 2361
506 2361 1378 -388 1283 1947 496 1481 -1265 -4545 -1982 -2404 -1895 1803 -521 -4331 -3985 -1366 3110
523 3110 2369 -183 2637 3395 1553 1994 -930 -1223 3537 4117 1837 -2172 -6920 -3950 1041 2395
539 2395 1305 -4437 -6574 -965 424 711 3811 2127 -61 -457 -181 3632 3739 995 1389 67
555 67 -682 1399 -2015 -4388 -1904 -298 844 -1095 -5191 -2429 1170 670 963 6 50 2520 1681
572 1681 2626 4088 13 -780 551 464 1188 357 -1972 -1432 -3511 -3666 282 311 -50 -912 -4126 -1383
590 -1383 2358 2926 4386 1951 -1308 -112 1194 3227 3602 -1284 -1429 355 -1614 -1760 -2006 -3835
606 -3835 -198 1041 -2164 -2852 -2052 1491 3464 -590 594 3323 -56 314 2901 2798 3353 202
622 202 -3021 -884 -1722 -1266 1333 -980 -2535 -3232 -4332 190 2516 -667 728 1137 -668 711
638 711 2207 4148 3688 -1231 -789 1612 -311 211 497 -1965 -1530 -2150 -3313 -893 -719 -1115 -659 -1611
656 -1611 422 2217 165 1467 2317 1101 2542 1636 -554 967 1276 490 -73 -2161 -2156 -1956 -2666 106
674 106 829 -2457 -2158 -1454 -952 1997 3749 2005 -210 -2116 2385 5028 2074 745 -641 -1746
690 -1746 -155 -70 -1174 -1021 -1977 -2154 -1597 -1681 -557 -381 -732 1491 936 33 2040 2022 719 1776 2378
709 2378 1948 -239 -1821 111 592 -1115 -859 -1686 -2836 -1872 -1616 -192 814 -280 -714 -197 640
726 640 3200 2356 899 1523 669 788 1814 862 101 -732 -2368 -1437 -1438 -1682 -418 -1781 -2504 -574 -802
745 -802 480 2122 -154 688 2374 1833 1929 968 164 2347 1180 -847 49 -1458 -1545 -402 -2174 -904
763 -904 -814 -2938 -1298 -164 125 1662 579 255 1777 840 1846 3204 462 421 968 -595 86 -450
781 -450 -1706 -212 -1643 -2734 -884 -1631 -911 -115 -1575 124 2108 287 1495 1665 893 2319 1353
798 1353 1101 1973 -582 -904 -38 -1515 -713 -859 -2798 -1485 -1077 -1635 -52 -535 -408 892 254 1577
816 1577 2224 -176 1291 2493 903 1275 570 -898 -296 -1586 -1363 266 -1460 -2301 -1721 -2539 -159
833 -159 784 -756 914 837 -120 1697 1540 1407 2211 603 1207 1462 -1119 -396 -651 -1963 -417 -690
851 -690 -1540 -1059 -2237 -2275 434 452 1187 988 -648 1177 1905 913 2679 1667 101 684 -281 -23 257
870 257 -1940 -1193 -709 -1635 -844 -1365 -2723 -220 43 240 1981 346 -16 948 1060 2812 2529 208
888 208 632 -81 -1525 420 -197 -996 -1147 -2590 -1687 17 -1504 -1163 -527 -447 1996 1440 164 1224
906 1224 181 443 3231 2413 824 -733 -2046 174 1089 -1052 -913 -1420 -2710 -1432 -1370 -842 899
923 899 -543 -329 1191 773 1152 771 679 2457 1687 259 1073 -360 -1929 -602 -413 837 -64 -3623
941 -3623 -2798 -1009 -627 836 175 -346 676 -355 398 2589 2246 1215 661 502 1426 529 -1119 -111
959 -111 -834 -1531 -496 -1100 -1346 -1590 -2428 -691 1091 916 871 -479 -600 1820 1707 1555 2033 782 381
978 381 269 -473 -96 -784 -1581 -59 -965 -1571 -1376 -2161 -1314 540 169 442 1165 325 345 190 1145 3750
998 3750 2377 -264 -818 -1135 -100 1227 330 -608 -1770 -2805 -1328 -470 -448 429 -916 -1044 1322
1015 1322 727 596 1075 941 1790 1370 418 1288 210 -1253 -146 -442 -345 -374 -3126 -2214 -85 -68 6
1034 6 -711 -1251 823 230 982 3128 1028 -388 718 827 2262 1154 -1672 -1069 -822 -1327 -104 -441
1052 -441 -952 -1344 -3331 -1454 2108 641 56 -85 -382 1656 1607 864 2289 934 -435 1136 66
1069 66 -120 -124 -2029 -679 554 -2238 -1831 -1298 -947 602 -326 -154 1441 -296 -438 1788 1735 2194 1426
1088 1426 -1282 117 976 382 822 -917 -2064 -1674 -2259 -303 1534 -1270 -1672 -701 -760 849 1067
1105 1067 828 2008 588 -37 1524 744 750 873 -901 -256 110 -1572 -764 -891 -1780 -545 -939 -894 97
1124 97 -910 -223 1669 1030 1209 1013 99 1384 1625 349 917 -615 -1415 186 -659 -61 -611 -2345
1142 -2345 -1971 -810 -944 740 521 -559 -22 -428 834 2497 1605 1247 957 -232 926 995 -285
1159 -285 233 -1022 -1637 -636 -1408 -1205 -912 -1175 -2 63 -735 851 724 632 1755 1701 1007 1133 -363
1178 -363 375 1290 75 -69 -732 -1933 -739 -561 -1107 167 -1300 -1712 -354 42 984 1284 -9 936
1196 936 874 94 1777 1594 259 371 -658 -423 283 -1219 -896 -679 -1706 -1065 -826 -1148 -76 -3 -397
1215 -397 674 341 702 1447 764 1506 1373 -70 308 272 -413 117 -475 -877 -763 -1739 -1473 -207 -502
1234 -502 -369 -343 -683 435 536 455 1899 1338 600 837 288 721 654 -308 -110 -301 -1425 -1211 -582 -965
1254 -965 -701 -1227 -793 355 -321 46 975 684 1334 1152 552 1750 693 90 441 152 -227 -368 -816
1273 -816 -602 -813 -1619 -807 -633 -833 -125 -402 -370 693 359 610 1245 925 1028 833 287 462 -176 -880
1293 -880 662 -322 -999 -738 -1788 -1104 -242 -811 236 -165 -789 41 489 818 2008 836 431 1334
1311 1334 -34 537 969 -202 -43 -533 -1482 -52 -996 -1597 -227 -718 -350 330 -862 32 665 26
1329 26 1363 1879 838 980 169 -133 1444 155 -411 349 -1406 -1366 -674 -1434 -159 -399 -1451 252
1347 252 158 -192 804 286 699 1673 992 931 1182 -500 114 563 107 413 -901 -2011 -548 -1246 -944
1366 -944 170 -819 -894 -297 -766 945 941 271 1299 1038 689 1192 112 316 1085 -544 14 58 -1260
1385 -1260 -1189 -1174 -1245 43 -474 -825 47 -492 -368 1153 813 1357 987 -23 837 1202 290 606 159 -406
1405 -406 32 -982 -994 -502 -1564 -1051 -290 -555 51 -606 -471 414 791 489 1277 835 571 432 14 1415
1425 1415 841 -473 -281 -474 -866 -687 -993 -866 -423 -968 -297 3 -239 377 225 507 1625 906 61
1444 61 891 370 447 397 56 146 -578 -1664 -673 -405 -800 -360 -1020 -833 79 -417 56 651 520 1195 827
1465 827 611 1115 206 -314 1026 386 -296 -306 -1097 -959 -448 -1117 -227 -558 -1044 -465 53 157 1100 264
1485 264 58 1158 687 741 919 111 606 -62 -593 323 -485 -1263 -542 -703 -923 -470 -1102 -511 316 -150
1505 -150 421 436 202 996 782 662 1269 453 160 150 -385 108 -47 -791 -524 -1115 -1408 -543 -334 -495 -97
1526 -97 -556 347 866 234 861 941 130 851 695 525 547 -491 -355 -173 -983 -840 -421 -1347 -777 -412 -587
1547 -587 133 -75 -347 945 741 866 776 238 908 865 328 751 285 -834 -602 -512 -335 -107 -804 -1131
1567 -1131 -284 -1099 -275 109 -142 739 163 -302 1176 900 647 879 220 523 373 -686 -152 -74 -989
1586 -989 -135 -623 -1174 -412 -823 -529 115 403 230 474 141 1245 990 59 1429 678 -420 504 274
1605 274 -267 -214 -1275 -1058 -548 -1050 18 -140 -1023 122 -67 -61 1261 825 74 514 594 634 589 429 852
1626 852 -3 -891 113 -196 -1184 -452 -516 -456 -106 -464 -376 -169 -217 648 749 270 1076 528 -76 1328 894
1647 894 27 -13 -523 -142 -199 -538 -170 -551 -1479 -493 -315 -522 197 -167 -382 530 679 922 1134 460 576
1668 576 184 -100 882 324 -751 -225 -547 -953 -591 -673 -329 -402 -848 78 2 -124 593 346 508 1285 491
1689 491 69 640 238 437 248 -268 -241 -686 -1124 64 -285 -852 -586 -1156 -725 64 222 576 861 97
1709 97 416 626 953 875 203 -247 169 -339 -178 -281 -518 -613 -1016 -626 135 -489 -775 -21 124 398 739
1730 739 439 565 624 207 1089 597 214 137 -481 -167 208 -793 -786 -401 -941 -394 -218 -552 -73 -388 -74
1751 -74 704 453 600 761 42 366 834 396 697 209 -675 -405 -547 -335 -166 -840 -929 -641 -569 108 53
1772 53 -235 555 645 104 969 568 168 733 364 554 560 -657 -500 -58 -742 -342 62 -744 -442 -926 -390
1793 -390 409 -12 369 709 220 765 779 226 930 487 -137 705 69 -369 -424 -949 -546 -95 -729 -413 -455
1814 -455 -838 -153 184 390 800 155 142 915 367 338 763 24 151 -160 -498 -18 -509 -755 -222 -598 -456
1835 -456 -219 -898 -348 146 184 577 807 280 286 485 518 1029 452 55 257 -360 -387 -247 -834 -89 -621 -1073
1857 -1073 -289 -663 -420 -72 -64 189 945 308 674 544 81 739 521 154 482 -386 -654 123 -555 -565 -292
1878 -292 -857 -397 -327 -745 276 77 105 626 496 438 647 129 395 615 324 178 306 -505 -170 -250 -523
1899 -523 -86 -851 -997 -311 -598 -381 205 -262 387 638 100 716 615 335 563 446 63 240 -476 -545
1919 -545 112 -550 -383 -379 -666 -70 -597 -675 541 63 -100 550 188 374 569 140 604 488 -181 49 79
1940 79 -225 -28 -470 -401 -169 -755 -641 -127 -400 -77 -42 1 704 508 393 605 413 377 660 -85 293 343
1962 343 -462 -209 -314 -515 -466 -719 -496 -12 -487 -210 501 -71 167 532 115 664 625 407 470 324 315 272
1984 272 -207 -192 -127 -719 -623 -504 -800 -487 -235 -148 45 -253 160 580 260 800 719 336 496 274 -165 424
2006 424 -124 -159 -272 -708 -253 -520 -847 -111 -66 -686 246 269 108 331 80 351 665 200 561 357 -198
2027 -198 460 -111 -415 215 -502 -694 -471 -691 -335 -343 -508 -154 250 -334 610 617 -58 557 505 307 613 241
2049 241 41 154 -355 -412 -150 -656 -50 -527 -835 154 -183 -400 96 183 306 506 156 622 578 169 753
2070 753 654 2 159 -157 -603 10 -504 -666 -227 -643 -452 -458 -500 603 -7 -105 513 318 70 547 520 568
2092 568 505 41 286 238 -394 37 -381 -894 37 -680 -552 -140 -123 -284 114 18 464 377 -140 699 681 235
2114 235 506 392 -221 -16 -377 -278 -313 -590 -215 -381 -651 -229 -344 -579 118 166 67 618 315 403 218 120
2136 120 507 365 -83 242 -266 -508 -228 -380 -431 -224 -547 -476 -100 -480 -3 213 120 641 201 409 835
2157 835 173 234 556 113 135 -90 -758 -277 -102 -562 -139 -502 -557 51 -489 -82 172 -14 10 361 296 874
2179 874 493 238 662 194 -147 226 -117 -550 -327 -790 -395 -227 -726 -324 -328 -157 29 33 331 579 -10
2200 -10 242 785 295 345 239 -270 59 -154 -97 157 -353 -660 -437 -443 -285 -86 -562 -2 318 -51 279 362
2222 362 74 589 160 305 568 -91 -238 49 -198 -30 -176 -653 -404 -597 -703 -210 -40 2 372 -72
2242 -72 207 538 99 482 397 327 334 127 -33 33 -267 -320 -110 -520 -212 -612 -596 -304 24 -190 127 29 203
2265 203 290 295 529 722 212 360 172 58 87 -272 -149 -136 -373 -347 -6 -715 -245 -398 -167 458 246 54
2287 54 523 -42 340 815 260 332 127 -340 34 323 -258 15 -328 -638 -169 -494 -447 -144 -380 3 266
2308 266 113 314 188 298 721 307 168 408 -167 -37 27 -384 -177 -82 -771 -325 -301 -446 -127 -299 -372
2329 -372 -8 -73 91 672 277 197 426 249 715 374 -19 257 -72 -400 -113 -343 -398 -243 -650 -494 -69
2350 -69 -608 -56 233 209 526 253 120 412 285 52 398 32 -14 -34 -403 -231 -111 -593 -404 -378 -581 18
2372 18 2 -84 138 -293 201 559 270 486 296 68 190 92 -202 338 -241 -375 -76 -463 -354 -374 -510 -223
2394 -223 -79 -352 310 110 24 135 130 179 423 197 47 143 -99 -31 -132 -106 46 -370 -520 -286 -436 -49
2416 -49 -164 -384 115 195 183 434 397 258 218 199 376 487 89 -190 48 -299 -265 -145 -435 -36 -407 -475 -30
2439 -30 -58 7 66 -16 342 370 131 548 438 -8 298 110 135 54 -282 -305 -141 -533 -318 -56 -328 75 -92
2462 -92 -332 167 120 179 379 183 531 385 91 476 419 -173 -47 -53 -384 -160 -150 -334 -11 -363 -354 -45 -364
2485 -364 285 245 -6 485 413 51 408 129 98 156 30 -33 -138 -328 -301 -61 -519 -94 -535 -362 148 -139
2507 -139 -143 289 61 330 394 244 656 326 -39 453 78 -150 -38 -171 -382 -81 -597 -188 -284 -459 45
2528 45 -150 -263 235 100 57 352 50 194 354 120 -42 -47 -30 24 -129 -216 -79 -256 -521 -236 -332 -166 -92
2551 -92 -276 -103 180 12 575 242 87 676 265 224 417 109 64 -176 -360 46 -456 -307 -78 -285 -400
2572 -400 63 -285 16 141 -1 280 358 149 440 122 313 223 32 -173 127 -374 -138 -12 -403 -90 -310
2593 -310 -626 -121 -118 -166 300 203 100 557 84 509 490 22 267 92 7 -37 -175 -234 91 -392 -396 -55 -277
2616 -277 -154 30 -114 234 219 -247 302 175 166 417 -80 246 405 -254 68 99 -399 -115 -100 -455 -38 -393
2638 -393 -163 70 -253 19 456 1 282 419 121 308 337 197 48 82 -51 -71 -14 -45 141 -479 -83 -73
2660 -73 -283 -366 -149 -226 -26 141 -51 530 115 260 478 -14 392 350 -35 -31 45 -590 -120 -247 -503 -246
2682 -246 -373 -232 129 -70 -130 176 89 390 110 207 181 50 5 299 37 129 -93 -370 -208 -66 -639 -147
2704 -147 -267 -295 -22 -7 91 25 -50 140 243 172 431 371 99 268 29 -131 -84 -76 -268 -292 -469 -148 -211 -345
2728 -345 -226 4 -81 89 146 186 271 215 58 394 137 289 226 -58 366 27 -261 -201 -138 -451 -166 -104 -170
2751 -170 31 -327 51 258 -132 20 119 160 108 194 194 258 -174 -123 -47 -113 -160 -364 -242 -144 -137 -331 -80 -170 -186
2776 -186 195 -2 165 203 130 303 256 109 125 -6 -98 63 -263 -202 -155 -325 -402 -72 -241 -78 -20 -236 149
2799 149 194 -18 174 436 365 219 -50 150 111 -145 -218 -130 -95 -64 -360 -404 -172 -166 -232 205 -53 -14 269 -35
2823 -35 479 453 62 296 285 168 153 -65 47 39 -327 -99 -179 -146 -146 -304 -21 100 -137 -183 436 96 237 162
2847 162 48 325 218 -14 419 114 -65 -4 -195 -93 93 -504 -192 135 -354 -93 -129 -33 276 -104 11
2868 11 301 217 31 159 243 131 271 -114 173 11 -378 -116 -186 -304 -148 -265 -96 96 -89 -82 116 172
2890 172 436 362 358 127 287 51 187 -94 -245 127 -120 -118 -77 -478 -129 -277 -219 289 -59 16 177 18 74
2913 74 294 117 2 112 -43 237 -76 -215 66 -159 -384 62 -168 -38 -247 -335 23 51 -192 88 144
2934 144 190 136 -73 6 436 -12 80 183 -184 -10 -11 -164 -101 -73 -262 35 35 -384 -173 23 112 183 7 343
2958 343 367 -113 266 52 108 133 178 -77 -135 -184 -48 -269 -300 -237 -194 -68 243 -92 -150 154 149 219 120 -24 256
2983 256 442 -149 134 41 -31 -40 -118 -273 52 -94 -314 -160 -5 9 -44 -142 86 68 1 175 120 192 41 151
3007 151 76 174 -95 -40 -198 -176 -184 -396 -155 -127 -267 -206 62 -78 54 -2 -2 427 72 131 372 195 21 -40
3031 -40 -97 -87 114 -186 -89 -257 -230 -288 -139 -95 -80 -228 -110 316 156 -154 203 9 112 38 -161 290 104
3054 104 16 342 -32 -83 96 -384 -313 10 -49 -139 22 134 45 67 11 477 37 133 254 -38 96 153 -8
3077 -8 -268 -9 -156 -214 -90 -435 61 -71 -109 184 -132 -40 146 106 312 239 70 234 -7 198 439 -79
3099 -79 75 254 -266 -125 -457 -163 -221 -83 -146 -47 -231 235 125 147 96 544 10 186 181 81 254 -90 -69
3122 -69 -85 -116 -416 -126 -314 -165 -24 -119 -14 -105 -34 168 74 140 302 66 216 407 143 -32 365 -154 46
3145 46 -339 -107 51 -241 -94 -19 -162 -141 72 3 214 14 16 262 173 11 218 231 154 207 -159 -92 33 -66
3169 -66 -136 -170 -318 -5 -146 -126 -23 139 -133 28 101 40 139 -168 134 237 145 196 104 49 -8 -134 -207 21
3193 21 -214 -74 -56 -211 -71 186 20 156 93 60 306 254 86 242 268 -181 356 -175 -1 -87 -424 -85
3215 -85 -136 -173 39 -361 -341 42 -177 -53 -84 21 348 -70 -211 152 137 42 49 60 -204 -261 -126 -211 -3 -388
3239 -388 -176 -26 -118 36 -27 112 25 356 140 299 156 219 219 102 86 -48 -82 -61 -86 -278 -89 -466 -270
3262 -270 45 -381 -13 42 -61 48 30 227 175 97 106 291 -34 -180 -3 -77 21 -103 -34 -193 -67 -66 121 -248
3286 -248 107 66 -309 -51 80 18 325 149 120 120 -105 89 148 -63 50 132 91 36 -121 -287 115 -102 -140
3309 -140 -17 -114 -24 50 175 147 396 38 356 92 17 62 153 -232 94 -261 -308 -47 -216 6 -198 -202 118
3332 118 30 51 361 202 -2 81 28 311 307 -49 -41 179 -112 160 164 -47 -102 -431 -390 126 -173 -188 156 -30
3356 -30 286 166 76 242 342 -40 210 127 -14 109 -6 -9 -71 101 174 -81 -201 -31 -73 -46 84 -115 -48
3379 -48 268 71 193 -116 105 165 102 -19 51 10 -130 113 -106 -171 72 -118 -218 -84 -332 -126 322 -263
3401 -263 63 -135 90 104 210 -53 74 -42 46 -68 -220 -46 86 -281 -275 -215 -140 -101 -183 -163 84 -382 -52
3424 -52 226 -15 230 30 9 254 38 84 204 150 -163 -9 -192 -114 -331 -261 -60 -101 -222 134 34 -28 82
3447 82 18 42 232 96 275 72 40 123 -24 -195 -2 -90 -316 -109 -165 -37 -221 -108 261 -23 -249 164
3469 164 2 -39 69 200 23 259 71 28 -4 -135 178 -21 -89 -158 -45 -127 190 -168 13 386 97 -78
3491 -78 -60 14 80 271 211 112 66 98 -113 191 -115 74 -51 -171 -279 -269 -146 -33 -67 40 9 -66 135 70
3515 70 -48 252 -117 111 239 20 62 -31 -100 -11 41 -82 -10 -211 -112 66 -39 -43 179 -114 95 243 68
3538 68 101 166 -21 310 -30 74 24 -118 15 119 62 -110 -186 -409 55 -279 -52 -68 -200 136 54 -30 99
3561 99 -56 166 101 176 159 -109 59 38 62 -77 -91 -276 -319 -144 -131 -19 56 34 -40 400 -169 186 231 2
3585 2 229 51 70 147 -14 -240 58 -2 -96 -83 -193 -131 -178 4 93 202 -116 118 115 -73 11 320 -126 169
3609 169 241 39 122 -195 360 -297 -178 -75 -219 -327 117 -23 0 184 74 190 245 103 256 220 95 292
3631 292 67 30 -36 15 -68 126 -142 4 -249 -152 33 -45 -59 185 -22 -15 105 133 207 134 53 188 189 -73 112
3656 112 -53 -110 9 -78 -172 -174 -43 -217 -105 -217 188 -50 -12 68 -52 155 216 228 153 242 253 144 94 -168
3680 -168 93 138 -80 90 -161 -210 -56 -101 -108 58 56 95 210 80 144 226 -48 177 195 91 -61 217 116 -152
3704 -152 -307 51 -4 -108 -114 -68 -246 180 22 76 118 149 159 126 104 279 44 -83 74 332 -65 -27 -93 -141
3728 -141 149 -274 -109 -98 -175 34 -45 54 63 -28 299 166 260 231 63 156 -44 78 -68 101 210 -66 57
3751 57 -22 -439 116 -284 -54 -165 143 155 -125 78 141 -91 4 58 -54 97 74 35 -18 -38 -278 -181 -5 -186
3775 -186 -110 -87 127 66 -111 -79 213 -60 -199 238 -12 70 60 23 -88 11 -142 67 -9 -308 -57 -34 -72 -74
3799 -74 -18 -39 69 51 -22 121 28 253 122 -1 165 -84 1 191 -40 25 115 -99 63 -188 -97 -233 -95
3822 -95 91 3 151 -84 52 -122 274 481 391 197 62 82 101 -161 -66 -48 -211 234 -163 -255 -207 -47 -13
3845 -13 -68 -70 -80 -47 -205 7 118 -170 -3 81 14 146 103 -47 -106 -12 -92 88 -36 -32 57 -338 66 -29 -140
3870 -140 255 33 31 189 79 212 345 -60 76 -89 -6 51 171 81 -88 -270 -141 0 77 49 256 73
3892 73 264 146 -38 205 -75 -14 168 104 -37 279 85 47 7 -104 -96 55 8 53 50 -46 46 97 144 81 100 131
3918 131 185 40 138 13 103 -59 14 -81 -262 7 -99 -94 -137 -124 51 -99 -21 124 116 -15 74 61 83 -71 38
3943 38 8 -132 83 93 7 82 -136 -19 -143 153 -131 -28 -132 -142 98 67 102 28 -86 120 259 368 30
3966 30 345 109 114 93 40 122 70 127 8 -264 -222 136 26 -106 36 -133 76 -19 201 200 151 94 -5 -24 116
3991 116 68 -114 26 -109 -55 -92 -222 -75 -122 -163 113 266 24 175 426 -32 36 163 11 43 114 240 -58
4014 -58 -3 39 63 -204 6 -115 -61 165 152 -257 -111 38 78 31 121 203 117 53 22 83 98 -8 -118 -292 -39
4039 -39 31 -70 -75 -229 31 127 -20 92 15 -207 77 41 178 331 -75 111 4 -85 253 52 -78 155 -134
4062 -134 -239 -204 35 -151 -186 31 -24 -38 35 -17 130 359 47 -12 88 -94 194 60 -38 43 -44 20 -51 58
4086 58 86 -184 -51 27 -41 58 53 212 71 -34 -116 129 68 50 -177 50 279 -81 -423 -61 -130 -134 -272 -165
4110 -165 -232 72 -5 106 -126 56 161 -21 -79 235 -13 179 76 33 274 77 -47 112 -149 -123 -17 -15
4132 -15 -21 -141 -22 111 176 -54 -272 -25 -41 83 5 84 82 -116 17 -68 -140 130 1 -184 -301 -117 -77 -145
4156 -145 -178 70 107 112 -121 51 -227 120 67 -83 54 -100 103 -17 -97 87 182 -212 98 -71 120 -86
4178 -86 1 -10 65 -173 -28 96 -30 134 34 -50 46 100 -120 31 -54 -91 98 -130 -133 -8 -313 -253 -210 -100
4202 -100 56 99 13 4 72 100 220 162 2 202 55 142 102 -65 -91 -32 15 49 -34 -11 -83 -103 48 118 110 -21 -29
4229 -29 11 117 73 44 96 240 -49 111 -41 16 -23 -224 32 -61 -135 -220 7 40 -55 -121 -82 148 -135 -48 186
4254 186 283 116 75 -17 3 -156 -126 163 -62 -215 25 -194 -415 -28 -151 35 32 -339 -7 -71 76 143 279
4277 279 -32 97 120 39 -42 -229 245 -110 -261 -51 86 -168 -219 120 72 274 115 187 -25 47 86 -107 -3
4300 -3 232 159 67 328 -152 -162 -161 21 -33 -115 -95 49 105 134 75 22 -115 -123 -241 45 161 -21 109 -207 32
4325 32 -125 158 89 258 89 -142 -213 3 -66 52 -160 112 313 34 74 -13 25 42 89 -66 25 45 -80 15
4349 15 16 -105 -66 -158 -34 -144 41 -168 43 37 75 -146 -154 204 -26 -37 58 92 -161 -121 130 -61 58 -59 1
4374 1 -86 -110 41 -161 84 -77 22 121 -91 -78 48 96 162 -12 -25 49 25 -107 22 155 -204 -51 -5 -120
4398 -120 141 -49 -44 232 -4 55 -177 84 -1 6 -66 -3 37 82 -58 297 -21 -84 -49 96 -40 -53 -66 -72 50
4423 50 6 83 -51 -29 72 70 62 161 69 42 -18 75 -47 -119 -6 -27 24 -14 112 98 -140 -123 58 -56 -157 -86 94
4450 94 179 141 56 75 151 4 90 96 71 65 164 24 51 65 103 -142 119 -97 171 -49 -3 -61 -9 -12 6 0 122 -113
4478 -113 141 67 75 68 137 -90 -195 -129 -125 -46 -69 -27 -125 17 -156 120 91 16 120 -142 -149 -111 120 88 243 72
4504 72 14 123 36 -247 -350 -26 -17 -35 -274 -59 43 -229 -250 9 37 -88 184 396 130 -94 46 129 123 0
4528 0 -152 -65 39 -8 30 37 -267 20 238 -101 71 20 -47 8 107 54 43 97 65 -46 -7 -45 8 8 -93 11 -117
4555 -117 -151 -49 103 -120 -67 -78 -44 -162 63 101 314 38 -99 140 2 -81 60 -53 107 46 -204 -84
4577 -84 -29 203 -75 -114 7 -18 175 -29 36 -89 23 68 27 141 2 189 1 20 -113 -262 -24 -213 -135
4600 -135 -182 -83 -84 42 -38 -147 -32 225 139 27 41 -30 -126 147 -114 45 134 33 26 -295 -149 22 -185 -196
4624 -196 -10 -163 -81 117 0 215 -85 31 -34 -38 -20 -130 127 20 100 91 -6 7 151 -158 -94 -91 -195 -96 -34
4649 -34 107 21 -42 -80 -108 -9 -31 151 11 -49 -282 77 -4 -138 -2 71 -189 -29 -156 98 -22 138 -106
4672 -106 -62 87 -163 -43 88 96 -52 21 -11 173 195 -67 22 -27 -44 -42 -4 -59 -142 -48 -33 -145 -204 -119 -76 -115 -93
4699 -93 -73 166 -24 -45 194 40 142 -164 -13 5 66 -223 3 27 174 83 37 146 24 20 72 -152 -29 -45
4723 -45 -34 11 -34 39 -229 128 -34 108 -240 46 -187 -267 -89 -129 -85 40 -128 55 -2 74 124 -17 35 -26
4747 -26 146 10 118 -28 -13 -81 52 -179 -50 -271 -194 -19 -152 -111 194 -141 31 -29 10 -85 -61 136 -43
4770 -43 -71 -49 -51 42 85 109 -23 145 -6 -44 0 -41 -77 -92 15 -79 -42 -184 59 6 -128 -29 16 -173 -22 212
4796 212 86 -95 102 -205 -112 -189 -153 74 -9 95 -123 109 -60 -84 -21 72 88 51 42 -100 -177 49 211 155
4820 155 -340 -49 -4 -19 65 -113 -217 245 5 -23 30 -56 -153 80 27 56 89 139 -133 5 68 -48 16 -78 1
4845 1 81 -139 -173 -100 194 340 -122 118 -51 -60 165 -100 126 -83 28 99 41 -134 -78 25 -216 -6 165
4868 165 -4 -66 207 64 143 -29 -26 132 131 -89 -72 11 112 160 -73 -56 -84 -49 124 -27 -158 82 -223 -127
4892 -127 -121 -216 8 81 81 114 -18 -226 197 15 56 -28 237 29 -36 -16 -49 -37 -19 -235 -83 13 13 120 -8 227
4918 227 77 -131 137 138 76 303 -23 228 -144 4 -152 6 -329 90 -81 -46 -19 -176 5 -81 -10 -185
4940 -185 -188 -93 131 327 -22 -33 120 -66 19 184 -150 -40 -2 -38 235 -130 55 -25 19 -17 -156 18 53 -303
4964 -303 -5 84 19 168 35 48 56 171 -147 111 2 -15 -90 -22 106 -57 -35 -313 -50 -63 35 -35 -76 147
4988 147 74 -107 -63 142 5 -101 28 78 93 153 99 -129 117 -120 -145 -27 40 -32 46 74 76 -79 134 17
5012 17 121 -91 309 123 103 69 112 163 38 -70 3 34 53 -47 13 -121 80 92 -33 83 191 18 37 96
5036 96 222 265 132 3 -79 -10 -187 81 -23 -23 133 -169 -134 -119 -147 -5 174 -37 51 325 -7 130 -14
5059 -14 228 193 -80 -35 25 -164 -304 -57 25 -165 171 32 -251 40 -98 -132 221 -208 6 28 1 73 145
5082 145 -72 124 -160 41 119 49 -50 -128 -267 103 -181 166 31 -85 -229 -70 -54 -39 -26 13 143 -213 50
5105 50 171 -102 -172 60 116 22 -28 -27 -11 -64 -4 -79 -277 -96 -95 -9 40 143 132 31 362 20 -60 -65 10 32 16
5132 16 -102 56 60 -43 18 -134 -185 -73 50 2 -112 -2 -55 110 -126 66 70 38 69 -121 62 179 -128 -73
5156 -73 -9 -31 130 13 -61 -41 -157 7 24 139 -135 58 173 77 32 -164 -56 -113 -62 -58 -61 137 -84 138 -4
5181 -4 -119 -9 60 -252 27 -5 -72 -168 -25 -134 -97 158 148 12 -124 38 275 204 -67 49 -32 128 19
5204 19 -50 -104 -44 -40 57 22 76 -38 80 71 -35 -75 28 307 -44 83 -42 -134 138 -68 -104 72 -175 -124 -5
5229 -5 -8 -117 -74 -16 -70 -37 29 90 -1 -84 31 72 -216 -181 -146 -150 -182 19 -28 33 156 10 -194 130 -8 27 173
5256 173 76 31 152 271 56 54 -35 51 -217 -66 70 -152 51 -149 -89 -47 91 -62 3 78 39 173 -59 -58
5280 -58 -59 -66 136 194 -244 49 42 -135 -1 56 -74 10 -85 -234 -74 -262 158 96 39 52 150 -106 7 180 9
5305 9 109 36 -59 137 149 -125 37 142 102 -35 -37 -2 -255 -94 96 238 -46 35 -104 -33 -9 -42 44 24 51
5330 51 183 -52 -263 -186 -267 -35 27 242 -4 -175 -116 134 -64 16 9 -113 146 -121 -37 -89 123 278 29
5353 29 124 -311 -228 -4 -208 -56 -20 109 48 -56 -31 55 6 -35 -10 30 159 -90 -40 135 -16 97 87 94 140
5378 140 -30 74 -224 97 -67 -167 7 34 35 -130 108 145 31 35 -51 -223 122 -122 -184 -23 -109 -157 226
5401 226 2 -28 -110 77 -184 -20 39 118 233 -183 18 223 -61 81 -104 36 134 -37 6 72 104 -196 -102
5424 -102 -64 -119 19 -53 -37 -144 -113 -40 103 206 -238 23 -5 -104 32 -33 -70 -10 56 -37 -200 139 -41 -154
5448 -154 26 -127 3 -98 -353 147 132 -31 112 -1 77 -61 -195 123 10 7 106 -3 -109 -2 2 34 -66
5471 -66 -11 -205 21 -51 -77 62 59 -176 190 27 81 -198 -131 -187 -57 48 99 31 36 70 -181 35 -2 -57 -35 -107
5497 -107 -132 7 -148 31 27 71 208 86 206 -63 244 -28 191 8 -65 104 -273 120 -89 84 132 -145
5519 -145 180 152 -70 152 120 -82 176 30 103 8 108 185 -132 -30 113 -58 10 221 -20 33 -59 26 82
5542 82 -158 116 110 -1 -123 -116 7 -84 -14 20 236 -15 110 64 97 82 -157 62 9 -161 -59 -75 -14 141 -81
5567 -81 3 -82 -57 -23 46 -24 25 180 -41 46 6 126 31 -75 96 22 -94 -58 -235 -92 131 244 -14 180
5591 180 -18 -33 119 65 42 -32 -6 104 -236 235 26 100 29 38 30 5 36 -6 135 22 -78 1 -58 69 123 8
5617 8 -78 46 -8 -41 145 -230 -121 -115 59 10 9 -96 39 -99 -72 -84 -44 -96 43 66 72 146 110 75 -124 22 133
5644 133 -45 -70 30 -8 -192 -154 3 -177 93 146 80 -48 -57 88 246 92 51 -4 -121 70 223 198 22
5667 22 46 8 64 -14 149 -120 -26 104 41 81 145 -271 92 -152 104 59 -104 109 -142 63 -17 195 -70 71
5691 71 24 100 -146 44 64 -41 80 128 169 167 -87 30 7 116 -177 -55 259 151 -104 -77 -147 -16 -116 11
5715 11 95 -179 139 -183 307 -109 -77 0 -378 -4 -135 52 44 60 -24 83 -116 110 -11 10 96 -1 -148 125
5739 125 5 22 43 -56 -186 43 161 106 11 -6 74 -52 114 116 -41 24 204 51 -77 -146 44 181 -73 -97
5763 -97 -49 -27 97 55 148 54 -57 70 -183 146 3 168 -51 152 33 11 -110 -125 -11 -120 136 -65 53
5786 53 -172 96 -157 161 -222 32 191 257 5 16 248 -77 -13 78 26 -76 176 -221 -148 -107 -256 74 -125
5809 -125 21 17 27 170 227 -280 91 277 -240 1 58 -95 -112 74 -80 100 -11 -27 1 46 -85 -67 -51 16
5833 16 -180 162 7 -108 -14 -106 82 72 2 123 105 13 -156 -138 72 62 -91 -192 -70 200 -75 166 -16
5856 -16 206 -10 -7 98 193 -116 22 -81 -147 96 -5 -72 -168 105 58 117 -32 -203 -35 84 -133 -55 -209
5879 -209 97 105 -48 110 37 -21 -54 108 88 -355 -22 198 -13 149 -110 -146 38 -108 -14 -160 -55 -70 138
5902 138 -168 17 242 -48 -11 36 -56 -152 10 -50 -133 -184 -152 -209 -66 -162 -149 5 -50 105 -134 111 225 63
5926 63 -13 58 -63 -115 57 38 140 -141 -221 19 12 -113 92 -83 181 39 31 41 112 -42 21 93 81 15 -162
5951 -162 -31 -163 273 -90 181 -48 90 253 -132 81 10 129 -53 -7 -117 52 -60 -227 18 79 -42
5972 -42 -111 174 -58 -62 -26 -39 -72 27 -54 126 259 70 118 -92 57 -176 15 7 -1 34 24 -34 -17 -6 -43 19 -150
5999 -150 -348 -37 -43 -100 -388 -57 -64 -98 141 54 25 138 -129 144 -45 -82 144 54 -4 -114 108 -7 -62 136
6023 136 -38 -71 -25 -97 39 -30 -74 129 -318 90 -172 126 -53 25 111 -124 93 -109 16 130 31 80 66
6046 66 -178 68 -17 66 -57 -74 -141 95 68 55 -112 25 58 111 -58 -145 235 -59 -216 45 -110 -48 71 -27
6070 -27 -45 -45 -172 -2 28 109 100 252 -14 -63 -161 -271 -11 -151 179 8 -20 192 -20 -13 82 30 28 69 -125 174
6096 174 -81 -62 35 -16 -15 -18 131 234 164 43 -79 17 196 -39 -82 29 -39 -17 -51 92 138 -47 -130 -92 -225
6121 -225 10 -161 -96 3 -284 8 -236 107 85 13 167 63 8 -103 -21 -74 -110 189 52 -28 0 85 282 216
6145 216 110 69 -189 80 -10 -63 171 -22 198 84 -51 -114 -36 -123 -83 23 64 7 -58 -47 -59 -22 -56 -69 -63 38
6171 38 13 -73 118 -192 -9 -53 -144 4 -134 -89 56 55 82 35 172 -38 -130 -21 208 -153 -9 89 47 7 -7
6196 -7 6 3 10 5 -39 -108 44 -25 72 -4 53 -118 -153 -173 180 70 -160 -192 110 -78 4 26 -113 83 90 -59 205
6223 205 -5 23 121 28 45 16 -94 -81 83 -86 70 -121 114 -126 41 -82 188 -20 49 -67 -251 39
6245 39 146 221 113 31 37 -5 -17 73 -43 128 186 -63 246 -188 161 13 -13 186 134 202 224 -163 -78 -126 70
6270 70 15 -61 -191 -95 -20 -9 105 -4 -22 -203 -251 66 165 -20 317 -115 -19 86 154 146 -42 36 247 -213 -71
6295 -71 -81 9 -145 154 -194 -5 -121 -6 -47 -68 -14 2 142 175 232 52 174 -133 101 -23 -389 145 -147
6318 -147 -13 74 -35 11 -139 -130 22 -10 -4 122 242 83 -12 70 76 -79 122 -61 51 122 -2 108 -72 -164
6342 -164 150 228 7 -81 14 24 -64 32 141 -7 -180 87 17 128 76 -6 1 46 -149 -25 -105 -4 -136 220
6366 220 134 22 -158 -90 161 12 66 166 12 95 91 82 -39 -126 194 -50 55 -31 -63 -190 17 -273 -256 -100
6390 -100 -96 196 -83 89 82 -30 -47 122 90 -134 53 -181 142 217 110 -174 103 67 86 -93 16 -106 -200
6413 -200 -8 5 -67 -71 159 91 116 -167 -92 16 11 70 77 -78 84 113 -135 350 96 -19 -14 -40 65 108 -95 -36
6439 -36 48 -26 -67 176 -48 -42 -102 -110 167 145 63 95 23 18 -259 -38 52 -8 -140 102 173 -32 196 -105 179 122
6465 122 8 97 30 133 6 -46 -38 47 235 56 -70 53 -125 -56 75 -5 110 49 70 121 57 57 -66 -57 26 -10
6491 -10 -83 45 10 -126 7 -25 -109 -36 -143 76 -113 28 -18 -156 -58 -12 103 62 79 9 172 -97 -228 9
6515 9 -89 -190 -292 -69 114 -292 -62 124 -15 69 -149 78 23 -129 -146 -85 -103 31 171 216 -101 -126 -101 36
6539 36 49 148 -81 -281 -2 -226 30 8 -93 -120 -100 -136 190 -70 -6 -173 110 -102 -125 171 -43 -10 87 -17
6563 -17 -28 29 114 -186 -23 -152 78 28 -58 39 -36 -248 31 19 161 -9 -127 128 -94 24 14 179 48
6586 48 -174 46 -92 -39 -16 -78 72 54 19 75 129 156 166 7 -53 -21 -46 224 -128 36 -35 5 139 132 227 48
6612 48 -33 -129 -15 -111 -57 220 94 100 12 -58 -175 173 -20 -156 -131 77 -30 -179 93 6 -164 -135 30 -148
6636 -148 185 133 -90 126 -102 101 57 60 71 164 -131 15 181 -110 118 85 -77 86 122 117 -2 21 85 -218
6660 -218 -205 -47 211 -71 64 170 -37 -191 -170 -138 -62 -134 -348 95 -114 68 -115 6 -71 26 13 194 -132
6683 -132 -52 -171 7 97 -112 142 58 -45 138 181 40 -6 -143 63 -20 -25 -15 -86 158 52 -177 84 40 131
6707 131 -106 9 34 -53 86 133 40 -120 -142 50 40 -17 -55 38 20 -9 -36 -36 -26 67 -25 -33 63 98 80 62 -25 -79
6735 -79 -51 226 12 -11 74 64 118 -222 -99 -90 118 -216 -50 33 165 80 36 141 -19 132 13 70 92 -233
6759 -233 -121 -18 -7 -25 96 -45 -21 29 -30 -61 193 -83 7 179 -205 79 5 118 59 60 -51 -4 100 204
6783 204 -163 -66 -114 198 -47 -103 -183 -5 62 158 162 200 -114 -5 -330 159 -143 -143 -130 69 156 229 165 -196 -3
6808 -3 -84 76 3 44 30 -107 -31 48 -27 -5 -12 44 -40 36 64 261 -52 40 -48 -165 50 -12 26 -167 -172 -114 -160 26
6836 26 137 -27 -29 24 140 223 38 105 126 -14 11 49 74 -23 97 -165 12 -78 112 18 5 137 -111 123 77
6861 77 38 -24 190 33 -36 -96 127 49 9 77 81 -159 217 24 -120 -180 47 49 69 5 -13 -229 194 58 79 -118
6887 -118 229 -43 -162 -41 15 -80 -126 12 -79 87 -49 -20 119 -23 202 77 -51 34 -110 -26 93 52 348
6910 348 -29 65 42 76 -94 96 85 -94 41 -37 107 -96 -113 -69 16 -92 -107 -271 -75 28 125 -17 51 20
6934 20 69 91 146 106 -49 -15 -94 -306 -31 120 -82 92 173 -89 -168 -66 -124 81 224 -59 -14 145 242 -61
6958 -61 -12 -19 -83 152 -120 -80 60 -180 -254 -59 -123 -115 -140 -204 -3 -118 91 95 -1 -33 106 132 195 4 -20 23 43
6985 43 22 -53 -58 237 136 -182 -72 8 -67 -174 -70 -100 250 -20 62 -95 -216 61 -206 -49 -39 37 -80 146
7009 146 -235 184 -6 18 157 19 -13 98 280 -133 28 67 11 42 46 -1 29 43 37 -55 -7 -85 -85 52 -70 83
7035 83 -108 -9 -76 -75 41 -11 -35 -52 139 73 87 13 80 -110 -258 -54 -118 -4 -70 -251 -102 62 -82 -60 6
7060 6 166 -89 -51 77 170 -190 74 187 41 39 95 288 72 -5 -174 68 -18 -128 90 161 105 -126 32 -180
7084 -180 -13 121 -1 102 121 388 10 102 68 -132 -45 -168 115 -273 -11 60 -103 -150 -93 79 65 -112 -60
7107 -60 57 -125 98 -109 202 55 33 60 -143 -38 27 50 -66 182 -7 51 41 67 -44 -164 52 19 94
7130 94 45 -65 -29 164 -9 288 187 169 -65 49 -70 -61 67 -92 114 -62 -24 -89 -147 -200 -106 -35 139 -313
7154 -313 209 167 -177 127 -37 57 -228 -74 8 -36 -33 -165 -219 29 32 -56 134 -94 68 -33 -132 78 43 -202
7178 -202 26 35 32 66 -54 -262 228 -13 94 -85 -36 36 118 142 79 -16 -89 -138 6 78 83 -37 12 29 -87 255
7204 255 13 -134 23 -318 -223 -61 25 32 -29 -4 -18 -118 77 -24 -91 -63 -115 63 -95 94 25 62 343 -56
7228 -56 76 278 259 -216 155 -59 206 30 -93 131 10 -95 65 48 124 88 -25 -221 -86 127 -226 -45
7250 -45 -6 -4 211 -136 -7 143 -54 405 108 -220 70 -34 -19 -181 87 45 -7 272 90 6 8 46 -222 111
7274 111 229 -66 29 -125 229 -99 -317 39 108 5 31 -27 -96 55 3 -1 25 -88 54 147 45 62 2 114
7298 114 3 -53 50 -222 26 -4 55 41 47 -106 -99 89 -155 -54 128 58 -67 -31 -18 134 52 -11 -9 79 44 -41
7324 -41 111 -38 -191 -87 78 94 64 -319 85 291 -143 -83 183 -179 184 1 -4 120 -33 -102 13 192
7346 192 -12 30 -99 39 79 -342 -60 189 51 -43 -121 -23 -122 164 20 -31 -96 238 -74 -261 -55 27 32 16
7370 16 -4 132 -11 -232 108 205 335 -21 -38 72 1 -168 11 25 52 115 -62 52 70 -25 -27 96 49 -202
7394 -202 205 -82 -109 40 -92 54 100 -17 50 -12 5 -10 -30 -114 -22 -78 35 117 -22 32 -10 -160 -232 136 107
7419 107 125 -19 -249 -250 -113 167 0 -122 -37 50 24 87 -125 170 10 85 -93 160 169 -44 -154 -68 19 -90
7443 -90 1 -58 257 -26 218 -126 50 24 154 -44 28 -48 96 145 -226 206 6 78 94 -42 73 -93 -41
7466 -41 -15 42 63 159 -174 121 187 -10 30 213 173 -88 -19 -47 142 -37 36 195 -240 17 74 237 -88 101
7490 101 200 112 85 123 -170 -98 -95 158 10 -55 -8 -160 -76 -114 -108 -86 -103 70 131 -142 63 -51 11 -146 -21 -156
7516 -156 -93 -118 -150 -8 39 -89 99 -125 15 131 -27 126 242 131 10 -80 -28 3 48 21 119 -7 73 47
7540 47 63 -117 22 165 185 -28 -91 -145 -87 -175 7 -13 171 -55 -87 -43 -94 -86 135 95 44 84 5 -89 -77 57
7566 57 -50 -84 -21 -31 -99 -39 31 4 -139 39 -30 -268 36 56 171 152 7 -60 101 85 1 -70 -71 27 -8 -76 -39
7593 -39 81 -109 157 -124 -71 126 -4 53 -99 -132 54 141 6 121 -94 148 -100 24 -205 -107 152 -121
7615 -121 -139 172 170 11 -92 83 -74 -29 18 190 103 24 -84 97 111 -7 -17 -4 5 74 -31 -49 31 2 -137
7640 -137 -132 199 -52 -67 78 195 29 -120 37 -8 -64 -19 -40 -170 191 123 2 189 96 77 74 96 -49 274
7664 274 -154 12 147 -47 -41 -74 -63 45 45 65 30 88 102 223 -83 -131 36 8 -23 -148 -31 -94 -152 76 -208
7689 -208 40 128 37 239 300 -88 -65 -11 38 -5 -123 198 53 47 -147 114 -127 -97 186 -158 -141 64 79 -18
7713 -18 -125 178 -46 66 -86 4 -127 6 -46 -97 -40 22 -50 57 -46 21 22 31 153 -101 116 156 4 -173
7737 -173 -161 -21 9 65 140 -61 -102 187 -22 -111 -133 31 -30 -58 69 29 133 -206 -63 80 44 -73 -89 -120
7761 -120 -46 46 16 -6 -343 -84 -150 84 -146 50 -49 45 -112 97 134 -11 -10 -182 -2 107 80 56 -203 195
7785 195 48 -44 -91 95 50 -130 9 -63 -72 -35 -117 70 -91 -101 -73 -149 23 225 219 -24 97 117 114 128 38 70
7811 70 -182 -141 24 90 63 -59 18 46 -31 98 194 1 -40 -3 -63 -162 -200 -59 325 -245 -123 -171 54 -121 157
7836 157 44 104 -95 -54 89 44 70 58 70 -259 -71 47 -162 75 24 -120 -237 -76 -171 -15 6 -128 195
7859 195 94 99 -80 -75 -29 -55 46 -155 73 170 51 -86 -23 31 24 163 103 153 66 -34 -30 56 -132 -93 -5 -99 -39
7886 -39 154 137 -93 121 163 -88 60 21 92 28 -31 -48 56 69 -40 -76 86 -80 -68 30 38 -244 -125 -37 -92
7911 -92 107 -24 -21 85 -79 -10 36 291 101 -124 -30 -187 -12 -34 -45 -22 130 -142 -137 -38 13 -34 97 -11 -75
7936 -75 -182 -114 82 224 137 55 -190 166 119 -95 -124 303 -118 -162 -50 -142 95 158 88 -76 180 -12 87 130
7960 130 69 -84 243 116 38 197 57 -87 -111 58 49 46 -22 194 -64 69 67 47 60 -37 94 -59 -15 -52 73
7985 73 -18 104 -218 12 -172 -33 109 9 -211 -195 91 85 -33 118 -206 -47 36 30 99 -69 -98 -179 -1 -1
8009 -1 -179 -151 0 -76 136 -9 -142 141 24 -185 26 -46 -48 -189 198 6 15 9 -102 -8 178 -135 8 15 -183
8034 -183 -84 -30 28 4 -35 -29 -118 64 -127 -22 221 -13 218 153 25 -73 -71 188 124 -229 66 1 75 -266 36
8059 36 -19 69 -62 -116 -92 167 215 154 130 -55 122 -11 189 68 -55 -53 50 15 33 -105 65 135 190 -91 51
8084 51 -22 -20 228 15 -194 115 -35 8 75 130 -115 50 26 -22 -164 -73 -79 61 -209 -214 -84 37 181 -98 -157
8109 -157 38 -85 -204 -16 11 81 188 -67 136 26 -95 -128 39 -164 -126 -131 148 -92 138 74 22 7 -4
8132 -4 -42 -89 111 -54 -108 -89 -9 22 -8 126 9 -40 -77 38 -227 -168 -7 -414 -182 94 -63 -102 339 -88
8156 -88 187 -110 160 68 45 198 -55 -11 165 78 -147 34 134 24 -63 111 -41 -14 -39 -86 145 -47 11
8179 11 -88 -82 -112 139 -76 47 -106 -55 -122 274 -146 3
8191C
##END NTUPLES=NMR FID
##END=
