##TITLE=1H_Ser AmS-MeNEA
 200.13MHz, CDCl3,
 8 sc
 
 32.8.2025
##JCAMPDX= 6.0         $$ Bruker NMR JCAMP-DX V2.0
##DATA TYPE= NMR FID
##DATA CLASS= NTUPLES
##ORIGIN= UXNMR, Bruker Analytische Messtechnik GmbH
##OWNER= pz
$$ XWIN-NMR		Version 3.5
$$ Wed Aug 13 13:43:24 2025 Russian Standard Time (UT+4h)  she@DPX200
##.OBSERVE FREQUENCY= 200.1313
##.OBSERVE NUCLEUS= ^1H
##.DELAY= (6, 6)
##.ACQUISITION MODE= SIMULTANEOUS
##.ACQUISITION SCHEME= undefined
##.AVERAGES= 8
##.DIGITISER RES= 18
##SPECTROMETER/DATA SYSTEM= spect
##.PULSE SEQUENCE= zg30
##.SOLVENT NAME= CDCl3
##.SHIFT REFERENCE= (INTERNAL, CDCl3, 0, 14.3821)
##AUDIT TRAIL= $$ (NUMBER, WHEN, WHO, WHERE, WHAT)
$$ ##TITLE= Audit trail, XWIN-NMR		Version 3.5
$$ ##JCAMPDX= 5.01
$$ ##ORIGIN= Bruker BioSpin GmbH
$$ ##OWNER= she
$$ F:/spectra/data/she/nmr/H-C/1/audita.txt
$$ ##AUDIT TRAIL=  $$ (NUMBER, WHEN, WHO, WHERE, WHAT)
(   1,<2025-08-13 13:42:11.75 +0400>,<she>,<DPX200>,
      <created by zg, POWCHK disabled, PULCHK disabled
       configuration hash MD5:
       00 E9 B6 7A A2 85 ED C7 34 08 36 98 17 FE 4E 26
       data hash MD5: 16K
       D9 9E D5 DE B5 11 19 4A 8F 19 E4 D7 2E 3C 8C D4>)
$$ ##END=
$$ 
$$ hash MD5
$$ E5 F8 2D 9C 1A 06 F4 58 1A 33 25 D7 B3 15 3C 8A
##$RELAX= 
##$RELAX= 
##$RELAX= 
##$RELAX= 
##$RELAX= 
##$RELAX= 
$$ Bruker specific parameters
$$ --------------------------
##$DU= <F:/spectra>
##$EXPNO= 1
##$NAME= <H-C>
##$PROCNO= 1
##$TYPE= <nmr>
##$USER= <she>
##$AMP= (0..31)
100 100 100 100 100 100 100 100 100 100 100 100 100 100 100 100 100 100 
100 100 100 100 100 100 100 100 100 100 100 100 100 100 
##$AQSEQ= 0
##$AQ_mod= 1
##$AUNM= <au_zg>
##$AUTOPOS= <>
##$BF1= 200.13
##$BF2= 200.13
##$BF3= 200.13
##$BF4= 200.13
##$BF5= 200.13
##$BF6= 200.13
##$BF7= 200.13
##$BF8= 200.13
##$BYTORDA= 1
##$CFDGTYP= 0
##$CFRGTYP= 5
##$CHEMSTR= <none>
##$CNST= (0..31)
1 1 145 1 1 1 1 1 1 1 1 1 1 1 1 1 1 1 1 1 1 1 1 1 1 1 1 1 1 1 1 1 
##$CPDPRG= <>
##$CPDPRG1= <>
##$CPDPRG2= <>
##$CPDPRG3= <>
##$CPDPRG4= <mlev>
##$CPDPRG5= <mlev>
##$CPDPRG6= <mlev>
##$CPDPRG7= <mlev>
##$CPDPRG8= <mlev>
##$CPDPRGB= <>
##$CPDPRGT= <>
##$D= (0..31)
0 0.7 0 0 0 0 0 0 0 0 0 0.03 0 0 0 0 0 0 0 0 0 0 0 0 0 0 0 0 0 0 0 0 
##$DATE= 1755078131
##$DBL= (0..7)
120 120 120 120 120 120 120 120 
##$DBP= (0..7)
150 150 150 150 150 150 150 150 
##$DBP07= 0
##$DBPNAM0= <>
##$DBPNAM1= <>
##$DBPNAM2= <>
##$DBPNAM3= <>
##$DBPNAM4= <>
##$DBPNAM5= <>
##$DBPNAM6= <>
##$DBPNAM7= <>
##$DBPOAL= (0..7)
0.5 0.5 0.5 0.5 0.5 0.5 0.5 0.5 
##$DBPOFFS= (0..7)
0 0 0 0 0 0 0 0 
##$DE= 6
##$DECBNUC= <off>
##$DECIM= 32
##$DECNUC= <off>
##$DECSTAT= 4
##$DIGMOD= 1
##$DIGTYP= 9
##$DL= (0..7)
0 120 120 120 120 120 120 120 
##$DP= (0..7)
150 150 150 150 150 150 150 150 
##$DP07= 0
##$DPNAME0= <>
##$DPNAME1= <>
##$DPNAME2= <>
##$DPNAME3= <>
##$DPNAME4= <>
##$DPNAME5= <>
##$DPNAME6= <>
##$DPNAME7= <>
##$DPOAL= (0..7)
0.5 0.5 0.5 0.5 0.5 0.5 0.5 0.5 
##$DPOFFS= (0..7)
0 0 0 0 0 0 0 0 
##$DQDMODE= 0
##$DR= 18
##$DS= 0
##$DSLIST= <SSSSSSSSSSSSSSS>
$$ [...]
##$SUBNAM0= <"">
##$SUBNAM1= <"">
##$SUBNAM2= <"">
##$SUBNAM3= <"">
##$SUBNAM4= <"">
##$SUBNAM5= <"">
##$SUBNAM6= <"">
##$SUBNAM7= <"">
##$SUBNAM8= <"">
##$SUBNAM9= <"">
##$SW= 18.0517328524113
##$SWIBOX= (0..15)
0 0 2 0 0 0 0 0 0 0 0 0 0 0 0 0 
##$SW_h= 3612.71676300578
##$TD= 16384
##$TD0= 1
##$TE= 0
##$TE2= 300
##$TE3= 300
##$TEG= 300
##$TL= (0..7)
0 120 120 120 120 120 120 120 
##$TP= (0..7)
150 150 150 150 150 150 150 150 
##$TP07= 0
##$TPNAME0= <>
##$TPNAME1= <>
##$TPNAME2= <>
##$TPNAME3= <>
##$TPNAME4= <>
##$TPNAME5= <>
##$TPNAME6= <>
##$TPNAME7= <>
##$TPOAL= (0..7)
0.5 0.5 0.5 0.5 0.5 0.5 0.5 0.5 
##$TPOFFS= (0..7)
0 0 0 0 0 0 0 0 
##$TUNHIN= 0
##$TUNHOUT= 0
##$TUNXOUT= 0
##$USERA1= <user>
##$USERA2= <user>
##$USERA3= <user>
##$USERA4= <user>
##$USERA5= <user>
##$V9= 5
##$VALIST= <valist>
##$VCLIST= <CCCCCCCCCCCCCCC>
##$VD= 0
##$VDLIST= <DDDDDDDDDDDDDDD>
##$VPLIST= <PPPPPPPPPPPPPPP>
##$VTLIST= <TTTTTTTTTTTTTTT>
##$WBST= 1024
##$WBSW= 4
##$XGAIN= (0..3)
0 0 0 0 
##$XL= 0
##$YL= 0
##$YMAX_a= 515507
##$YMIN_a= -620058
##$ZGOPTNS= <>
##$ZL1= 120
##$ZL2= 120
##$ZL3= 120
##$ZL4= 120
##$ABSF1= 10
##$ABSF2= 0
##$ABSG= 5
##$ABSL= 3
##$ALPHA= 0
##$AQORDER= 0
##$ASSFAC= 0
##$ASSFACI= 0
##$ASSFACX= 0
##$ASSWID= 0
##$AUNMP= <proc_1d>
##$AZFE= 0.1
##$AZFW= 0.1
##$BCFW= 1
##$BC_mod= 2
##$BYTORDP= 1
##$COROFFS= 0
##$CY= -3
##$DATMOD= 1
##$DC= 2
##$DFILT= <>
##$DTYPP= 0
##$F1P= 0
##$F2P= 0
##$FCOR= 0.5
##$FTSIZE= 0
##$FT_mod= 4
##$GAMMA= 1
##$GB= 0.15
##$INTBC= 1
##$INTSCL= 1
##$ISEN= 128
##$LB= 0.25
##$LEV0= 0
##$LPBIN= 0
##$MAXI= 10000
##$MC2= 0
##$MEAN= 0
##$ME_mod= 0
##$MI= 1.114404
##$NCOEF= 0
##$NC_proc= 0
##$NLEV= 6
##$NOISF1= 3.799351
##$NOISF2= 2.8
##$NSP= 1
##$NTH_PI= 0
##$NZP= 0
##$OFFSET= 14.38212
##$PC= 1
##$PHC0= -1558.476
##$PHC1= 9.592279
##$PH_mod= 1
##$PKNL= yes
##$PPARMOD= 0
##$PSCAL= 0
##$PSIGN= 0
##$REVERSE= no
##$SF= 200.129724274929
##$SI= 16384
##$SIGF1= 3
##$SIGF2= 2
##$SINO= 400
##$SIOLD= 16384
##$SREGLST= <1H.CDCl3>
##$SSB= 0
##$STSI= 0
##$STSR= 0
##$SW_p= 3205.1282051282
##$SYMM= 0
##$S_DEV= 0
##$TDeff= 0
##$TDoff= 0
##$TI= <>
##$TILT= no
##$TM1= 0
##$TM2= 0
##$TOPLEV= 0
##$USERP1= <user>
##$USERP2= <user>
##$USERP3= <user>
##$USERP4= <user>
##$USERP5= <user>
##$WDW= 1
##$XDIM= 8192
##$YMAX_p= 0
##$YMIN_p= 0
$$ End of Bruker specific parameters
$$ ---------------------------------
##NTUPLES= NMR FID
##VAR_NAME=  TIME,          FID/REAL,        FID/IMAG
##SYMBOL=    X,             R,               I
##VAR_TYPE=  INDEPENDENT,   DEPENDENT,       DEPENDENT
##VAR_FORM=  AFFN,          ASDF,            ASDF
##VAR_DIM=   8192,          8192,            8192
##UNITS=     SECONDS,       ARBITRARY UNITS, ARBITRARY UNITS
##FACTOR=    0.0002768,     1,               1
##FIRST=     0,             0,               0
##LAST=      2.2672688,     0,               0
##MIN=       0,             -620058,         0
##MAX=       2.2672688,     515507,          0
$$ Real data points
##PAGE= N=1
##DATA TABLE= (X++(R..R)), XYDATA
$$ plain form
0 0 0 0 0 0 0 0 0 0 0 0 0 -8 8 -8 8 -16 16 -16 24 -24 32 -39 44 -51 61 -71 80 -93 107 -123 141 -157 179 -200
34 -200 229 -256 287 -319 357 -398 440 -489 541 -599 663 -730 805 -885 977 -1077 1186 -1307
52 -1307 1440 -1594 1763 -1955 2176 -2434 2738 -3098 3542 -4097 4813 -5775 7143 -9226 12765
67 12765 -19881 39593 -208815 -620058 85822 374776 -32362 -77176 107704 -170021 -216810
78 -216810 232334 272690 -109740 -38256 128360 -136014 -205242 79151 21743 -110400 154953
89 154953 211465 -169850 -185294 145006 76709 -116919 83252 100366 -234951 -139495 230706
100 230706 96146 -148498 28663 117384 -69342 2336 158913 -88030 -256052 49815
110 49815 162708 -106089 -75196 154061 18181 -134285 70563 165693 -53721 -125077 23744
$$ packed form
0@%%%%%%%%%%%qJ6j6J6k4L2l2M0m8N6p1Q3r5J12j32J51j73K00k30K64k98L36l79
34b00M29m85N43o06O76p55Q38r29J030j140J262j393J535j690J862k054K263k493
52a307K747l034L357l718M131m610N172n836O640p639Q910j0588J2918j6369K1991
67A2765l2646N9474k48408m11243P05880K88954m07138m4814J84880k77725m6789
78b16810M49144M0356l82430P1484J66616k64374o9228K84393n7408j32143K65353
89A54953N6512l81315j5444L30300o8297j93628K00171J7114l35317R5456L70201
100B30706j34560k44644J77161Q8721j86726P1678J56577k46943j68022L05867
110D9815J12893k68797L0893K29257j35880j52466K04848R5130k19414p1356J48821
$$ plain form
121 23744 23487 -67523 -11555 43005 13477 32710 11468 -67232 5799 123336 30066 -116852
133 -116852 -82966 3545 -851 19813 74456 5794 -72058 17368 85690 -11979 -76516 5909
145 5909 72166 -5488 -105578 -57721 57652 80405 42885 11524 -31889 -62975 -14677 60653
157 60653 27313 -63893 -51540 -4853 -12412 38974 94174 -3827 -82275 23319 89079 -25650
169 -25650 -82709 6301 18404 -31448 31824 45024 -72971 -41453 104896 58460 -67653
180 -67653 -40996 175 -36019 11495 75873 -30129 -95322 52398 99357 -31768 -18958
191 -18958 52341 -48562 -72822 82416 58524 -129274 -72143 123048 58460 -77337 2534
202 2534 45386 -44756 129 70132 -47487 -97192 45367 72880 -46678 -25586 61041 -5008
$$ packed form
121B3744k57r1010N5968N4560k9528J9233k1242p8700P3031J17537r3270j46918
133a16852L3886Q6511m396K0664N4643o8662p7852Q9426O8322r7669o4537Q2425
145E909O6257p7654j00090M7857J15373K2753l7520l1361m3413l1086M8298P5330
157F0653l3340r1206J2353M6687p559N1386N5200r8001p8448J05594O5760j14729
169b5650n7059Q9010J2103m9852O3272J3200j17995L1518J46349m6436j26113
180f7653K6657M1171l6194M7514O4378j06002o5193J47720M6959j31125J2810
191a8958P1299j00903k4260J55238k3892j87798N7131J95191o4588j35797P9871
202B534M2852r0142M4885P0003j17619m9705J42559K7513j19558K1092Q6627o6049
$$ plain form
214 -5008 -35786 68119 28095 -100815 -21190 80479 -20294 -67951 39156 36682 -55625
225 -55625 3432 81003 -21249 -74691 37031 44179 -50165 -16780 31197 -24742 -8326 74252
237 74252 14686 -83402 -3698 85075 -7126 -67981 11946 13803 -45943 11782 58570 -23158
249 -23158 -53739 30943 50779 -18190 -23847 11542 -12252 -10502 37850 2759 -50739 4174
261 4174 51582 3405 -24745 4546 -2743 -27142 17448 40556 -38242 -61199 31764 54689
273 54689 -15745 -25652 11762 5673 -6097 18336 12569 -32468 -18726 31939 13710 -18678 851
286 851 1693 -14451 13752 28049 -21090 -43745 11625 39683 -11290 -27805 10198 6326 -6464
299 -6464 21600 15756 -26744 -18138 25675 21330 -16522 -17001 1568 -178 10819 17024 -21400 -29119
$$ packed form
214e008l0778J03905m0024j28910P9625J01669j00773m7657J07107k474r2307
225e5625N9057P7571j02252n3442J11722P148r4344L3385M7977n5939J6416Q2578
237G4252n9566r8088P9704Q8773r2201o0855P9927J857n9746N7725M6788q1728
249b3158l0581Q4682J9836o8969n657L5389k3794J750M8352l5091n3498N4913
261D174M7408m8177k8150K9291p289k4399M4590K3108p8798k2957R2963K2925
273E4689p0434r907L7414o089j1770K4433n767m5037J3742N0665j8229l2388J9529
286H51Q42j6144K8203J4297m9139k2655N5370K8058n0973j6515L8003l872j2790
299f464K8064n844m2500Q606M3813m345l7852m79J8569j746J0997O205l8424p719
$$ plain form
313 -29119 20316 26298 -15761 -18969 7889 2899 -9684 15041 20660 -23739 -23237 28493 26304
326 26304 -15403 -19176 119 7959 7758 3951 -11338 -19035 4435 20483 -2266 -12611 -1305
339 -1305 -4148 718 18884 5114 -23871 -12342 25307 22263 -16056 -17827 9040 8520 1192 4422
353 4422 -6452 -14522 -328 13215 5875 -10575 -11797 -1130 6392 13503 2943 -21447 -8604
366 -8604 23965 14743 -13170 -11934 5514 8189 -23 3530 316 -15691 -5102 17432 7244
379 7244 -12917 -14325 -2859 12444 12606 -7225 -17691 -2166 18374 11108 -9687 -5762 1556
392 1556 -2062 9187 13744 -10010 -18654 3320 17140 3195 -14352 -10470 2847 10029 6729
405 6729 -11815 -16191 9471 15740 -3366 -3277 1558 -8216 -2269 18937 11561 -17119 -14973 11332
$$ packed form
313b9119M9435N982m2059l208K6858m990j2583K4725N619m4399N02N1730k189
326B6304m1707l773J9295P840k01l807j5289p697K3470J6048k2749j0345J1306
339a305k843M866J8166j3770k8985J1529L7649l044l8319j771K6867n20p328L230
353D422j0874q070J4194J3543p340j6450j222J0667P522P111j0560k4390J2843
366h604L2569r222k7913J236J7448K675q212L553l214j6007J0589K2534j0188
379G244k0161j408J1466J5303J62j9831j0466J5525K0540p266k0795L925P318
392A556l618J1249M557k3754q644K1974J3820j3945j7547L882J3317P182l300
405F729j8544m376K5662O269j9106Q9M835r774N947K1206p376k8680K146K6305
$$ plain form
419 11332 8538 -4414 1226 -4813 -10809 9522 10167 -14813 -10132 12514 5830 -6873 5294 3387
433 3387 -20445 -496 35909 4368 -32849 -3074 18908 -680 -1637 7210 -11057 -14656 16755
446 16755 14359 -23467 -13480 17935 2578 -4551 14222 -10735 -32040 17446 44656 -9107 -36746
459 -36746 4593 16710 -8286 7256 18356 -21762 -20756 24371 10646 -23263 -2354 13680
471 13680 -7253 -2704 13752 -14487 -25211 26412 34120 -23403 -22546 18228 2073 -13329 19242
484 19242 15918 -26249 -17924 20193 10925 -12105 570 662 -13199 8376 17035 -18702 -19867 15624
498 15624 13096 -7231 3812 7314 -16204 -9026 24549 12814 -19101 -6665 9557 -5057 -8214
511 -8214 2780 4274 7946 7497 -12860 -21457 3364 21126 5102 -7114 -3602 -11800 -9699 17264
$$ packed form
419A1332k794j2952N640o039n996K0331O45k4980M681K2646o684j2703J2167j907
433C387k3832J9949L6405l1541l7217K9775K1982j9588r57Q847j8267l599L1411
446A6755k396l7826R987L1415j5357p129J8773k4957k1305M9486K7210n3763k7639
459c6746M1339J2117k4996J5542J1100m0118J006M5127j3725l3909K0909J6034
471A3680k0933M549J6456k8239j0724N1623P708n7523Q57M0774j6155j5402L2571
484A9242l324m2167Q325L8117r268k3030J2675R2j3861K1575Q659l5737j165L5491
498A5624k528k0327J1043L502k3518P178L3575j1735l1915J2436J6222j4614l157
511h214J0994J494L672m49k0357q597K4821J7762j6024j2216L512q198K101K6963
$$ plain form
525 17264 20243 -2232 -6400 -3790 -5122 1834 3818 -4514 2290 12823 -9073 -30606 2028 33401
539 33401 7090 -10723 1350 -14334 -21879 18230 31292 -8469 -22446 1457 2504 337 22881
552 22881 9978 -29528 -8251 24128 -8372 -22269 15484 6904 -26028 7285 33925 -15629
564 -15629 -32285 25262 26991 -23874 -11134 13193 -16258 -5296 37033 -842 -43513 9861
576 9861 44487 -9640 -25111 13994 -9142 -33155 27870 39240 -38908 -35511 35062 18900
588 18900 -19896 14697 19613 -33667 -17319 34318 -48 -33094 17540 23856 -28597 -5637
600 -5637 35693 -8425 -27267 27465 16681 -46295 -18288 37630 693 -25839 22737 17561
612 17561 -32130 -168 40795 -4769 -28595 10955 4924 -29800 2086 32642 -9281 -20624
$$ packed form
525A7264K979k2475m168K610j332O956J984q332O804J0533k1896k1533L2634L1373
539C3401k6311j7813J2073j5684p545M0109J3062l9761j3977K3903J047k167K2544
552B2881j2903l9506K1277L2379l2500j3897L7753q580l2932L3313K6640m9554
564a5629j6656N7547J729n0865J2740K4327k9451J0962M2329l7875m2671N3374
576I861L4626n4127j5471L9105k3136k4013O1025J1370p8148L397P0573j6162
588A8900l8796L4593M916n3280J6348N1637l4366l3046N0634O316n2453K2960
600e637M1330m4118j8842N4732j0784o2976K8007N5918l6937k6532M8576n176
612A7561m9691L1962M0963m5564k3826L9550o031l4724L1886L0556m1923j1343
$$ plain form
624 -20624 23994 10294 -29080 4318 29134 -14695 -26401 9749 2647 -18903 13962 31906
636 31906 -11749 -22498 17651 14880 -12385 -897 2320 -19925 -7839 19272 1943 -17495
648 -17495 7925 23139 -4165 -13252 5341 -652 -11589 5675 8370 -15029 -15242 12664 22818
661 22818 6377 -4531 -3652 -6663 -2285 8519 1306 -14055 -12701 1078 9559 6701 2137 1585
675 1585 -1068 429 6432 -3212 -15929 -5529 11004 3953 -7779 1256 11416 2412 995 11684
689 11684 -3229 -21770 -3513 12819 -4070 -12063 2181 3756 -843 14048 15114 -13654 -15583
702 -15583 12918 6187 -16946 -2124 9223 -9765 -4929 20384 8142 -15094 4546 18368
714 18368 -12770 -21561 7869 5191 -13299 3169 10788 -10724 -3975 23519 10235 -16364 -1765
$$ packed form
624b0624M4618j3700l9374L3398K4816m3829j1706L6150p102k1550L2865J7944
636C1906m3655j0749M0149k771k7265J1488L217k2245J2086K7111j7329j9438
648a7495K5420J5214k7304r087J8593n993j0937J7264K695k3399k13K7906J0154
661B2818j6441j0908Q79l011M378J0804p213j5361J354J3779Q481k858m564n52
675A585k653J497O003r644j2717J0400J6533p051j1732R035J0160r004j417J0689
689A1684j4913j8541J8257J6332j6889p993J4244J575m599J4891J066k8768j929
702a5583K8501o731k3133J4822J1347j8988M836K5313j2242k3236J9640J3822
714A8368l1138q791K9430k678j8490J6468P619k1512O749K7494j3284k6599J4599
$$ plain form
727 -1765 8041 -14982 -8655 18495 -703 -22096 8742 23091 -7441 -10981 13836 3415 -17628
740 -17628 -486 7923 -17127 -10011 22258 9058 -14845 3658 14157 -4679 -1858 12142 -8259
753 -8259 -24009 4742 18277 -9545 -10897 14536 5283 -9499 8216 10861 -15376 -14208 11513
766 11513 5367 -14727 -2300 11041 -1022 1477 14996 -1300 -15018 5070 11738 -10623 -13810
779 -13810 5053 2632 -8128 7508 14015 -9257 -9769 14454 7767 -14154 -7382 5563 -3242
792 -3242 -4832 8801 4796 -8998 3949 15880 -2305 -10098 2599 -255 -9714 965 6220
805 6220 -9182 -8846 14584 12720 -10550 -5224 10115 -892 -8050 3607 789 -11354 -775
818 -775 13623 2757 -7217 3806 6737 -4849 -21 4768 -10524 -11422 7917 7501 -9363 -4069
$$ packed form
727a765R806k3023O327K7150j9198k1393L0838J4349l0532l540K4817j0421k1043
740a7628J7142Q409k5050P116L2269j3200k3903J8503J0499j8836K821J4000k0401
753h259j5750K8751J3535k7822j352K5433r253j4782J7715K645k6237J168K5721
766A1513o146k0094J2427J3341j2063K499J3519j6296j3718K0088O668k2361l187
779a3810J8863k421j0760J5636O507k3272n12K4223o687k1921O772J2945q805
792c242j590J3633m005j3794J2947J1931j8185p793J2697k854r459J0679N255
805F220j5402L36K3430j864k3270N326J5339j1007p158J1657k818j2143J0579
818g75J4398j0866r974J1023K931j1586M828M789j5292q98J9339m16j6864N294
$$ plain form
832 -4069 10788 3775 -4483 6468 4758 -11833 -4943 11260 651 -11210 151 7019 823
845 823 1684 5891 -3970 -8280 5618 5735 -11024 -7630 6183 589 -3744 6649 5779 -7153 -2005
860 -2005 12716 2891 -12993 -2771 6310 -2424 -2673 5016 -1374 -5632 5395 8708 -4530 -7042
874 -7042 3092 550 -6049 2911 3261 -8318 -1629 12939 3996 -9162 -820 8160 -873 -5348
888 -5348 3235 -1481 -9137 2842 10213 -3501 -6707 3475 3325 -2089 1544 1280 -7935 -3393 10111
903 10111 2284 -10017 1210 8767 -1207 -1974 5649 -1463 -9017 2279 8582 -4613 -9040 3767
917 3767 4190 -3055 1776 2211 -5457 -434 7684 -349 -7519 430 4951 -1816 -249 6089 -2525 -7569
933 -7569 5132 7574 -5074 -6494 1874 1939 -1946 198 539 -3086 508 5534 -13 -4631 356
$$ packed form
832d069J4857p013q258J0951j710j6591O890J6203j0609j1861J1361O868o196
845H23Q61M207r861m310J3898J17j6759L394J3813n594m333J0393q70j2932N148
860b005J4721r825j5884J0222R081q734k49P689o390m258J1027L313j3238k512
874g042J0134k542o599Q960L50j1579O689J4568q943j3158Q342Q980r033m475
888e348Q583m716p656J1979P371j3714l206J0182j50n414L633k64r215M542J3504
903A0111p827j2301J1227P557r974p67P623p112p554J1296O303j3195m427J2807
917C767M23p245M831M35p668N023Q118q033p170P949M521o767J567O338q614n044
933g569J2701K442j2648j420Q368O5l885K144L41l625L594N026n547m618M987
$$ plain form
948 356 1008 292 3761 1004 -5991 -3207 6263 5766 -3234 -4794 310 1487 254 178 -2217 -2589 840
965 840 1436 965 -318 -3074 -600 5117 4487 -3287 -5896 1096 5430 1843 -843 -2593 -3686 1932
981 1932 4198 -1272 -2465 53 -1785 -1328 3413 2331 -5573 -2557 7300 2071 -6517 -361 4464
996 4464 -1020 127 3142 -2670 -4872 3142 4461 -2975 -2073 1469 -3752 -1994 8022 863 -9958
1011 -9958 166 8337 -1791 -4403 4587 2500 -5154 904 5937 -4523 -4306 6913 2628 -6375
1025 -6375 -1 1825 -4116 1412 6839 -4163 -8741 5408 7561 -6593 -3679 6532 -508 -3984
1039 -3984 6204 2331 -9113 -787 8978 550 -5153 696 -381 -4464 4808 5840 -7971 -5699
1053 -5699 7378 1175 -6510 2742 4017 -4911 -371 8020 -1628 -9066 2700 7718 -1343 -1268 409
$$ packed form
948C56O52p16L469k757o995K784R470m97r000j560N104J177j233p6k395l72L429
965H40N96m71j283k756K474N717o30p774k609O992M334l587k686j750j093N618
981A932K266n470j193K518j838M57M741j082p904L016R857n229q588O156M825
996D464n484J147L015n812k202Q014J319p436R02L542n221J758J0016p159j0821
1011i958J0124Q171j0128k612Q990k087p654O058N033j0460K17J1219m285r003
1025f375O374J826n941N528N427j1002m578J4149K153j4154K914J0211p040l476
1039c984J0188l873j1444Q326R765q428n703N849j077m083R272J032j3811K272
1053e699J3077o203p685R252J275q928M540Q391r648p438J1766N018r061P5J677
$$ plain form
1068 409 -6752 -1811 10006 2720 -8474 -2337 3071 -2710 208 7496 -2092 -9502 4387 8253
1082 8253 -5637 -4551 5722 1961 -1713 3825 -1066 -8668 862 9580 -890 -5507 2979 -1971
1096 -1971 -7626 5292 8351 -6804 -4894 7698 445 -8615 2078 7515 -1685 -986 5341 -4883
1110 -4883 -8905 7101 8219 -4498 -1327 2647 -7670 -5141 10295 5952 -8899 -1981 6505 -5616
1124 -5616 -6575 9618 6170 -6253 -332 3381 -6193 -2448 10489 4287 -6999 -1522 1898 -5839
1138 -5839 1292 10778 -3185 -11638 3317 7030 -4800 -2197 6296 -1306 -5659 5107 4756 -7958
1152 -7958 -2837 7754 850 -3414 2231 -701 -4884 3405 6087 -4477 -5874 4496 3023 -5431
1166 -5431 -1414 3044 -2584 424 7498 692 -8383 -2532 5686 4702 1080 -1329 -5313 -4979 3424
$$ packed form
1068D09p161M941J1817p286j1194O137N408n781K918P288r588p410J3889L866
1082H253j3890J086J0273l761l674N538m891p602R530Q718j0470m617Q486m950
1096a971n655J2918L059j5155J910J2592p253r060J0693N437r200O99O327j0224
1110d883m022J6006J118j2717L171L974j0317K529J5436m343j4851O918Q486j2121
1124e616r59J6193l448j2423N921L713r574L745J2937o202j1286N477L420p737
1138e839P131R486j3963q453J4955L713j1830K603Q493p602m353J0766l51j2714
1152g958N121J0591o904m264N645k932m183Q289K682j0564j397J0370j473q454
1166e431M017M458n628L008P074o806r075N851Q218r84l622k409l984L34Q403
$$ plain form
1181 3424 5826 -416 -1634 -425 -3088 -1461 2949 1805 -1529 -415 1542 -1216 -3405 824 4707
1196 4707 3506 -92 -3917 -3950 1283 2846 1598 655 -2466 -4574 481 4857 2123 -2468 -1314 766
1212 766 -958 -308 645 -1890 493 3740 -378 -3389 2271 4051 -1304 -1406 1965 -1971 -5285 2274
1228 2274 5199 -4283 -4606 3970 3133 -1654 1355 468 -4495 -137 5403 -114 -5251 1246 3066 -1999
1244 -1999 1786 5958 -3696 -6013 4405 3658 -6712 -4109 4599 963 -3625 2875 2707 -4621 1150
1259 1150 7178 -1108 -6182 287 859 -2581 2298 4215 -4188 -4522 7200 5140 -5912 -2547 3935
1274 3935 -2492 -4323 2909 1147 -5443 -414 7332 1035 -4222 1852 2525 -2634 733 2178 -5134
1289 -5134 -3631 5896 3781 -4146 -478 4621 -1205 -3180 3596 503 -8257 -1750 6076 -255 -4726
$$ packed form
1181C424K402o242j218J209k663J627M410j144l334J114J957k758k189M229L883
1196D707j201l598l825l3N233J563j248r43l121k108N055M376k734m591J154K080
1212G66j724O50R53k535K383L247m118l011N660J780n355j02L371l936l314P559
1228B274K925r482l23Q576q37m787L009q87m963M358N540n517n137O497J820n065
1244a999L785M172r654k317J0418p47j0370K603Q708l636m588O500j68p328N771
1259A150O028q286n074O469N72l440M879J917q403l34J1722k060j1052L365O482
1274C935o427j831P232j762o590N029P746o297n257O074O73n159L367J445p312
1289e134J503R527k115p927L668N099n826j975O776l093q760O507P826o331m471
$$ plain form
1304 -4726 2088 4513 -30 1034 3070 -2406 -4507 2803 2236 -5388 -2260 3579 -78 -925 4252
1319 4252 1518 -5522 -984 5936 -1105 -7382 -14 3676 -1533 416 4317 -234 -2880 3640 3731
1334 3731 -3822 -4265 1366 -382 -2476 2369 1347 -4216 1276 6887 88 -5652 -299 2492 -3237
1349 -3237 -2344 3287 -1075 -3998 4108 6301 -1678 -2409 2689 940 -2332 -310 -364 -4704 -1321 5655
1365 5655 783 -3999 2034 3927 -1825 -961 2500 -2508 -5310 1701 5207 -2090 -3582 4208 3390
1380 3390 -1562 1233 1000 -3733 -2763 2425 -331 -4338 -678 3552 103 394 4109 -775 -4551 1993
1396 1993 3960 -4204 -5251 1774 2765 -1847 454 3769 -1466 -1965 4241 1386 -5200 -2568 1744
1411 1744 -1117 -1213 2184 286 -2670 3304 5978 -2672 -4332 2949 1224 -4244 -342 2491 -2630
$$ packed form
1304d726O814K425m543J064K036n476k101P310n67p624L128N839l657q47N177
1319D252k734p040M538O920p041o277P368L690n209J949L901m551k646O520R1
1334C731p553m43N631j748k094M845j022n563N492N611o799n740N353K791n729
1349c237Q93N631m362k923Q106K193p979p31N098j749l272K022n4m340L383O976
1365E655m872m782O033J893n752Q64L461n008k802P011L506p297j492P790q18
1380C390m952K795k33m733R70N188k756m007L660M230l449K91L715m884l776O544
1396A993J967q164j047P025R91m612K301L315n235m99O206k855o586K632M312
1411A744k861r6L397j898k956N974K674q650j660P281j725n468L902K833n121
$$ plain form
1426 -2630 -1987 5357 3484 -4295 -1778 3745 -1102 -2818 718 -1929 -4025 2464 4722 -1831 -1801 4320
1442 4320 2309 -2909 579 2432 -4402 -3155 4203 749 -5157 -345 4595 903 -1074 991 -1560
1457 -1560 -3599 1744 3158 -2562 -3055 2080 839 -389 3294 1878 -2892 -1315 3540 -232 -4927
1472 -4927 -524 2702 -916 -391 1617 -627 -1013 2636 2333 -1776 -2711 -195 -107 207 1446 -194 -1888
1489 -1888 1605 3732 348 -2143 -863 349 -53 -170 -490 -1321 -1530 821 2573 1246 -845 -1312
1505 -1312 264 1148 -698 -876 856 324 -268 298 -315 13 1832 2320 -316 -2920 -1869 -499 50
1522 50 2382 1741 -3422 -3068 2702 2633 -673 551 1781 -1820 -2456 1471 1279 -1768 1382 3046 -1908
1539 -1908 -2933 1522 818 -348 1941 465 -4999 -2175 4669 1397 -3175 1011 2401 -2526 -451
$$ packed form
1426b630O43P344j873p779K517N523m847j716L536k647k096O489K258o553L0O121
1442D320k011n218L488J853o834J247P358l454n906M812M940l692j977K065k551
1457a560k039N343J414n720m93N135j241j228L683j416m770J577M855l772m695
1472d927M403L226l618N25K008k244l86L649l03m109r35K516Q8L14J239j640j694
1489a888L493K127l384k491J280J212m02j17l20q31k09K351J752j327k091m67
1505a312J576Q84j846j78J732n32n92N66o13L28J819M88k636k604J051J370N49
1522E0K332o41n163L54N770o9l306J224J230l601o36L927j92l047L150J664m954
1539a908j025M455p04j166K289j476n464K824O844l272m572M186J390m927K075
$$ plain form
1554 -451 3831 -1308 -4065 2162 3443 -2395 -2316 1808 -641 -1355 4168 1199 -5688 -1461 3638 -997
1570 -997 -2275 3014 1098 -3730 811 3999 -1722 -2435 4699 2649 -4283 -1852 949 -1858 928
1585 928 4813 -569 -5488 -692 3090 -215 346 3319 -2268 -5014 2109 3976 -1867 -440 3057
1600 3057 -380 -2942 764 1463 -1530 758 2886 -2343 -3950 1540 1569 -956 1073 1116 -2770 -1622
1616 -1622 3067 606 -2976 286 2294 -798 -968 1574 -774 -1227 2314 1796 -1968 -1575 524 -408
1632 -408 8 1733 -307 -2585 310 1957 -1723 -921 2116 1037 -1408 -129 -170 -1668 419 3485
1648 3485 479 -2356 -947 -462 -37 2397 1488 -2780 -2211 1336 934 -627 834 979 -1371 -483 1685
1665 1685 -124 -1890 1405 1891 -1276 -828 170 -842 673 2513 -508 -3087 -376 2294 -240 -604
$$ packed form
1554d51M282n139k757O227J281n838P9M124k449p14N523k969o887M227N099m635
1570i97j278N289j916m828M541L188n721p13P134k050o932K431K801k807K786
1585I28L885n382m919M796L782l305N61K973n587k746P123J867n843J427L497
1600C057l437k562L706O99k993K288K128n229j607N490K9k525K029M3l886J148
1616a622M689k461l582L262K008l092j70K542k348m53L541n18l764L93K099r32
1632d08M16J725k040k278K895J647l680Q02L037j079k445J279m1j498K087L066
1648C485l006k835J409M85M25K434r09m268N69L547m02j561J461J45k350Q88K168
1665A685j809j766L295M86l167M48R98j012J515J840l021k579K711K670k534l64
$$ plain form
1681 -604 897 -720 -1682 1430 2060 -1603 -1537 1145 835 -263 513 -167 -1787 435 2445 -232 -1761
1698 -1761 714 542 -1407 280 1228 -1034 -1058 1346 847 -2028 -451 1875 246 -222 450 -428 -1192
1715 -1192 1296 1240 -806 -869 427 -337 -560 950 451 -1745 -235 1800 -348 -1292 524 671 120
1732 120 420 -24 -982 -135 1335 493 -889 -329 -209 -408 994 1034 -1000 -1594 579 878 -40 -242 -201
1751 -201 -37 164 987 23 -1055 183 793 -119 21 29 -819 100 1390 303 -1839 -458 780 139
1769 139 -622 149 -563 -813 870 1189 -619 -794 381 478 227 513 114 -1151 -14 1586 26 -1541
1787 -1541 310 682 -199 -83 456 -519 -534 754 1071 -1136 -898 766 323 4 516 -143 -888 470
1805 470 1406 -577 -1374 385 600 -803 -65 656 -795 -975 1078 738 -955 -683 452 435 -274 236
$$ packed form
1681f04J501j617r62L112O30l663O6K682l10j098P76o80j620K222K010k677j529
1698a761K475j72j949J687R48k262k4K404m99k875J577K326j629m68O72q78p64
1715a192K488n6k046o3J296p64k23J510m99k196J510K035k148r44J816J47n51
1732A20L00m44r58Q47J470q42j382N60J20j99J402M0k034n94K173K99r18k02M1
1751b01J64K01Q23r64j078J238O10r12J40Qq48R19J290j087k142J381J238o41
1769A39p61P71p12k50J683L19j808j75J175R7k51K86l99j265J137J600j560j567
1787a541J851L72q81J16N39r75j5J288L17k207K38J664m43l19N12o59p45J358
1805D70R36j983p97J759K15j403P38P21j451j80K053l40j693K72J135j7p09N10
$$ plain form
1823 236 -184 -866 354 1305 -392 -904 275 601 -244 70 302 -941 -880 1014 1183 -1245 -842 1270
1841 1270 466 -371 61 -31 -616 -126 1336 217 -883 306 1084 -30 -363 519 -876 -982 1105 904
1859 904 -1090 -1004 1022 600 -549 635 659 -1038 -263 1158 193 -1303 -236 670 61 64 262 -172 -456
1878 -456 857 782 -1297 -993 759 215 -811 422 415 -339 -184 1308 593 -1235 -452 1373 -244 -517
1896 -517 432 -246 -662 523 1107 -579 -911 525 705 -1093 -204 368 -959 -589 1397 676 -1156 -178
1914 -178 1419 -31 -926 325 176 -1211 105 1402 -715 -796 1031 941 -202 -410 449 -469 -859 1269
1932 1269 240 -1794 -174 1716 292 -767 1019 698 -1200 22 975 -946 -1666 946 1058 -924
1948 -924 -107 1109 -561 -810 1611 441 -1780 -179 1240 -260 -1495 904 906 -1028 359 1447
$$ packed form
1823B36m20o82J220R51j697n12J179L26q45L14K32j243O1J894J69k428M03K112
1841A270q04q37M32r2n85M90J462j119j100J189P78j114l33Q82j395j06K087k01
1859I04j994Q6K026m22j149J184K4j697P75J421r65j496J067R06o09LJ98m34k84
1878d56J313p5k079L04J752n44j026J233pp54J55J492p15j828P83J825j617k73
1896e17R49o78m16J185N84j686l32J436J80j798Q89N72j327L70J986p21j832R78
1914a78J597j450q95J251j49j387J316J297k117q1J827r0j143k08Q59r18l90K128
1932A269j029k034J620J890j424j059J786l21j898J222R53j921p20K612J12j982
1948i24Q17J216j670k49K421j170k221J601J419j500j235K399Kj934J387J088
$$ plain form
1964 1447 -768 -1332 798 672 -1370 -364 504 -1058 -176 1826 535 -1633 -5 1235 -419 -646
1980 -646 1108 -219 -1535 623 1422 -738 -545 1556 873 -1516 -399 219 -644 -283 690 -103 -1493
1997 -1493 312 1410 186 38 597 -788 -1355 222 796 -814 -433 722 289 -349 75 635 48
2014 48 -229 323 -497 -1205 -498 303 573 14 213 184 441 99 139 -509 -525 203 400 -361 -729 -256 643
2035 643 288 329 572 -723 -1429 353 841 -684 -787 960 669 -362 635 899 -246 19 1077 -463
2053 -463 -1683 -124 700 -450 -77 508 -751 -1240 1330 1916 -1342 -1896 1021 -362 -1105 1233 1230 -1087
2071 -1087 -259 1827 278 -1468 643 1080 -1296 -649 1383 -1033 -1394 2115 1457 -1646 -586 1725
2087 1725 -384 -1489 1414 639 -2368 -418 2125 -436 -1271 1697 1069 -1336 96 1535 -1607 -1647
$$ packed form
1964A447k215n64K130j26k042J006Q68j562Q82K002j291k168J628J240j654k27
1980f46J754j327j316K158P99k160J93K101o83k389J117O18q63L61R73p93j390
1997a493J805J098j224j48N59j385n67J577N74j610L81J155m33o38M24N60n87
2014D8k77N52q20p08P07Q01K70n59J99k9K57l42M0o48j6P28J97p61l68M73Q99
2035F43l55M1K43j295p06J782M88j525j03J747k91j031R97K64j145K65J058j540
2053d63j220J559Q24j150L73N85j259m89K570N86l258n54K917j383p43K338lk317
2071a087Q28K086j549j746K111M37k376O47K032k416l61L509o58l103J060K311
2087A725k109j105K903p75l007J950K543k561q35K968o28k405J432J439l142m0
$$ plain form
2103 -1647 1593 717 -2156 198 1786 -822 -556 2326 112 -2149 76 1894 -1106 -1315 1462 518
2119 518 -1218 695 1223 -1154 -526 1579 -43 -2097 177 937 -957 -169 1405 -450 -1122 1242
2135 1242 1352 -1039 -917 975 -224 -724 672 366 -779 112 1109 11 -702 301 36 -879 151
2152 151 275 -933 -840 1065 545 -387 -79 463 -287 -269 525 -111 -861 -46 627 348 -271 -288 -6 573
2172 573 556 -249 -810 -422 55 515 645 54 -166 167 600 148 174 -88 -546 -361 449 150 -584 477
2192 477 1012 -271 -425 -106 440 -804 381 573 -1034 -1173 548 685 -416 398 465 -656 -147 1022
2210 1022 -261 -1228 592 657 -863 -643 696 -310 -349 860 718 -1214 -877 959 204 -815 572
2227 572 298 -920 169 1113 -551 -878 1181 964 -1105 -786 556 -393 -530 1419 555 -1585 -140
$$ packed form
2103a647L240q76k873K354J588k608K66K882k214k261K225J818l000k09K777r44
2119E18j736J913N28k377O28K105j622k054K274P60j894P88J574j855o72K364
2135A242J10k391J22J892j199n00J396l06j145Q91R97j098p13J003k65r15J030
2152A51J24j208R3J905n20r32L08N42p50J8P94o36p50Q15O73k79o19j7K82N79
2172E73j7q05n61L88M77M60J30n91k20L33M33m52K6k62m58J85Q10k99p34J061
2192D77N35j283j54L19N46j244J185J92j607j39J721J37j101Q14O7j121N09J169
2210A022j283r67J820O5j520K20J339j006l9J209j42j932L37J836p55j019J387
2227E72k74j218J089R44j664l27K059k17k069L19J342r49j37J949q64k140J445
$$ plain form
2244 -140 1367 240 -432 514 -236 -577 163 1128 -320 -748 830 359 -618 142 512 -829 -285 1120
2262 1120 -23 -1005 -124 1015 -123 -389 415 -197 -646 508 533 -409 -531 529 267 -190 133 -268
2280 -268 -960 46 952 -148 -916 115 404 -227 -38 258 -216 -514 403 591 -85 -259 376 286 44
2299 44 12 -203 -109 180 257 -416 -462 -38 356 169 266 144 -367 54 549 343 -345 -764 169 596 293 -523
2321 -523 -80 149 199 170 -297 -364 21 126 518 -109 -333 -147 -219 597 435 -452 -626 218 916 4 -295
2342 -295 -181 0 42 148 140 -155 -350 -139 125 173 -606 -460 163 468 68 -352 -448 111 270 447 -158 -170
2364 -170 -113 133 213 381 -94 -420 303 649 61 -485 -484 -82 338 80 -410 -112 -127 49 321 -50 -340 -183
2386 -183 201 273 76 -303 -172 8 494 184 -538 -251 399 142 -129 -231 25 -151 278 282 87 -284 -135
$$ packed form
2244a40J507j127o72R46p50l41P40R65j448m28J578m71r77P60L70j341N44J405
2262A120j143r82Q81J139j138k66Q04o12m49J154K5r42j22J060k62m57L23m01
2280b68o92J006R06j100p68J031K89o31J89K96m74k98R17J88o76j74O35r0k42
2299D4l2k15R4K89P7o73m6M24L94j87R7j22n11M21M95k06o88m19R33M27l03q16
2321e23M43K29N0k9m67o7L85J05L92o27k24J86p2Q16j62q87j74Q44O98r12k99
2342b95J14J81M2J06qk95j95K11K64M8p79J46O23L05m00m20r6N59J59J77o05j2
2364a70N7K46Q0J68m75l26P23L46n88n46JM02M20k58m90K98j5J76K72l71k90J57
2386a83L84P2j97l79J31J80M86l10p22K87O50k57k71j02K56j76M29Mj95l71J49
$$ plain form
2407 -135 378 336 -27 -565 -24 472 285 1 -482 -662 153 296 -152 -276 -160 67 39 345 -82 -702 -159
2428 -159 688 782 -336 -416 0 249 -210 -107 11 -460 -80 679 -66 -650 -384 142 134 159 422 -684 -499
2449 -499 1000 561 -515 -524 496 255 -274 393 224 -866 284 944 -213 -834 -224 6 -290 157 126
2468 126 -641 -537 1159 616 -773 -34 401 -619 1 927 -194 -1026 200 991 212 -950 211 168
2486 168 -494 126 413 -729 -452 719 -57 -593 44 380 -299 -54 916 -581 -1132 247 1019 -542
2504 -542 -393 10 -248 -287 438 170 -760 -278 903 -189 -468 -165 97 -349 578 515 -317 -712 432 358
2524 358 -590 -429 65 -164 -169 643 200 -723 29 266 150 -41 -526 -459 287 740 124 -212 101 467 374
2545 374 16 -235 -351 -145 -318 -211 -54 -235 -331 374 786 -106 -802 -481 1055 236 -800 -278 -150 -118
$$ packed form
2407a35N13m2l63n38N41M96j87k84m83j80Q15J43m48j24J16K27k8L06m27o20N43
2428a59Q47R4j118q0M16K49m59J03J18m71L80P59p45n84K66N26qK5K63j106J85
2449d99J499m39j076rJ020k41n29O67j69j090J150O60j157o21O10K30k96M47l1
2468A26p67J04J696n43j389P39M35j020O20R26j121q32J226P91p79j162J161m3
2486A68o62O20K87j142K77J171p76n36O37L36o79K45R70j497n51J379P72j561
2504e42J49M03k58l9P25k68r30M82J181j092k79L03K62m46R27o3q32l95J144p4
2524C58r48J61M94k29nQ12m43r23P52K37j16j91m85O7P46M53o16l36L13L66r3
2545C74l58k51j16K06j73J07J57j81r6P05M12q92o96L21J536q19j036N22J28L2
$$ plain form
2565 -118 797 887 -130 -692 -74 352 -404 330 149 -659 -495 880 -205 -774 597 1105 -273 -688 412
2584 412 -344 -831 493 990 -1262 -1161 943 637 -616 574 80 -1535 -30 1252 -373 -1079 793
2601 793 858 -840 154 1297 -457 -773 1283 722 -1543 -618 1053 -210 -669 1128 672 -1024 564
2618 564 1197 -1240 -1351 941 300 -1226 -123 687 -1330 -142 2315 753 -1352 -432 757 -724
2634 -724 -289 1596 28 -1462 239 796 -907 -32 1404 87 -1120 -181 197 -1487 413 1929
2650 1929 -113 -1568 155 1178 -54 339 1031 -958 -1554 508 731 -637 -439 687 -79 255 474
2667 474 134 -696 293 541 -651 -1455 -61 577 -331 492 667 -199 -339 291 202 -515 -490 -113 142 -107
2687 -107 -322 -429 -42 589 821 77 -343 -322 -227 258 214 149 65 -424 141 749 304 -333 177 702 -278 -1325
$$ packed form
2565a18R15R0j017n62O18M26p56P34j81q08J64J375j085n69J371N08j378m15J100
2584D12p56m87J324M97k252J01K104l06j253J190m94j615J505J282j625p06J872
2601G93O5j698R94J143j754l16K056n61k265R25J671j263m59J797m56j696J588
2618E64O33k437j11K292o41j526J103Q10k017J188K457j562k105R20J189j481
2634g24M35J885j568j490J701N57j703Q75J436j317j207R39L78j684J900J516
2650A929k042j455J723J023j232L93O92j989n96K062K23j368J98J126p66L34K19
2667D74l40q30R89K48j192q04J394O38r08Q23J75q66j40O30q9p17K5L77K55k49
2687a07k15j07L87O31K32p44m20K1R5M85m4o5q4m89N65O08m45o37N10N25r80j047
$$ plain form
2709 -1325 -467 696 29 232 451 -37 -356 247 741 96 -428 -78 -480 -422 439 728 -531 -232 1299
2728 1299 -31 -598 408 179 -827 -260 487 -489 -1081 716 1049 -244 -238 734 -192 -293 565 -15 -1457
2747 -1457 -137 974 291 -533 548 650 -581 140 620 -738 -1606 382 791 -472 -187 695 -337
2764 -337 -168 1031 340 -1179 -53 830 -293 -781 228 226 -531 684 1025 -670 -829 740 712 -877
2782 -877 -455 350 -556 -100 986 402 -517 108 735 142 -548 9 -193 -772 267 430 -992 -607 670
2801 670 525 -372 -371 242 -519 -432 502 247 -922 -90 747 79 -148 200 142 -223 179 276 -536 -540 541 246
2823 246 -300 -67 576 -56 52 210 478 -484 -328 924 455 -503 -17 315 53 -14 99 -202 -598 154
2843 154 463 -465 -335 -13 123 -268 522 246 -456 -181 743 375 -573 -427 286 77 -184 654 90 -285
$$ packed form
2709a325Q58J163o67K03K19m88l19O03M94o45n24L50m02N8Q61K89j259K99J531
2728A299j330n67J006k29j006N67P47r76n92J797L33j293OR72r26j01Q58n80j442
2747a457J320J111o83q24J081J02j231P21M80j358q68J988M09j263K85Q82j032
2764c37J69J199o91j519J126Q83j123m88J009kp57J215L41j695j59J569k8j589
2782h77M22Q05r06M56J086n84r19O25O27n93o90N57k02n79J039J63j422L85J277
2801F70j45q97JO13p61Q7R34k55j169Q32Q37o68k27L48n8l65M02R7q12mJ081k95
2823B46n46K33O43o32J08J58K68r62J56J252m69r58M86L32k62o7J13l01l96P52
2843A54L09r28J30L22J36l91P90k76p02K75R24l68r48J46P13k09k61Q38n64l75
$$ plain form
2863 -285 108 707 -24 -340 -445 127 -155 184 534 -302 -295 712 692 -540 -108 -20 126 -147 323 3 -572
2884 -572 -19 636 5 -552 157 273 41 17 113 -313 -369 345 463 -481 -446 586 45 -13 432 -77 -521
2905 -521 46 505 99 -565 -392 414 -52 118 302 -275 -725 488 127 -284 -87 434 406 -165 260 66
2925 66 -621 56 950 -313 -614 12 367 -52 -139 -56 -245 -510 567 211 -235 -330 337 102 167 372 -1
2946 -1 -580 15 724 -74 -524 25 153 22 103 78 -401 -480 452 58 -345 -406 112 -114 373 -29 -207 -348
2968 -348 290 669 -160 -35 -335 -200 19 329 133 -628 -135 365 46 -532 -121 -37 -118 213 -44 15 10 275
2990 275 -118 -145 -327 -185 114 317 746 -170 -512 395 118 -10 31 23 -373 290 343 -162 -311 80 436 -159
3012 -159 121 267 -800 -147 634 279 -633 -144 319 -460 -3 313 -203 -389 164 506 -360 -120 595 47
$$ packed form
2863b85L93N99p31l16j05N72k82L39L50q36PJ007k0j232M32Q8J46k73M70l20n75
2884e72N53O55o31n57P09J16k32k4R6m26n6P14J18r44L5J032n41n8M45n09m44
2905e21N67M59m06o64J73Q06m66J70J84n77m50J213l61m11J97N21k8n71M25j94
2925F6o87O77Q94j263l01O26L55m19q7Q3j89k65J077l56m46r5O67k35O5K05l73
2946an79N95P09p98m50N49J28j31Q1k5m79p9R32l94m03o1N18k26M87m02j78j41
2968c48O38L79q29J25l00J35K19L10j96p61M93N00l19n78M11Q4q1L31k57N9nK65
2990B75l93k7j82J42K99K03M29r16l42R07k77j28M1ql96O63N3n05j49L91L56n95
3012a59K80J46j067O53P81l55r12M89M63p79M57L16n16j86N53L42q66K40P15n48
$$ plain form
3032 47 -497 248 -53 -528 142 853 155 -747 -176 -95 -395 387 663 -474 -690 244 36 -92 484 389 -403
3053 -403 -154 458 -437 -670 936 808 -345 -407 172 70 -16 465 333 -676 -248 229 88 -48 481 -72
3073 -72 -281 448 449 -998 -374 756 215 -177 90 73 -447 391 509 -235 -251 407 -69 -429 187 448 -336
3094 -336 212 551 -408 -832 -21 559 131 237 369 -804 -448 958 603 -365 -186 -56 -1119 -110 765
3113 765 389 -337 40 597 -1082 -708 1189 378 -529 360 7 -1320 -36 1190 175 -942 76
3130 76 80 -903 132 1332 -538 -1030 845 73 -931 -160 1023 -604 -501 997 235 -1653 365 1286
3148 1286 -599 -538 871 -156 -488 544 816 -1146 -507 1174 -340 -1177 338 529 -990 -223 1427
3165 1427 -642 -1417 850 1096 -760 -451 706 -436 -781 929 771 -756 -54 860 -498 -735 469
$$ packed form
3032D7n44P45l01m75O70P11o98r02N71Q1l00P82K76j137k16R34k08j28N76r5p92
3053d03K49O12q95k33J606j28j153o2N79j02q6M81j32j009M28M77j41j36N29n53
3073g2k09P29Jj447O24J130n41l92K67j7n20Q38J18p44j6O58m76l60O16K61p84
3094c36N48L39r59m24Q11N80m28J06J32j173L56J406l55r68J79J30j063J009Q75
3113G65l76p26L77N57j679L74J897q11r07Q89l53j327J284J226j015j117J018
3130G6Mr83J035J200j870m92J875p72j004P71J183j627J03J498p62j888K018R21
3148A286j885O1J409j027l32J032K72j962O39J681j514q37J515J91j519P67J650
3165A427k069p75K267K46j856L09J157j142l45J710j58j527P02R14j358k37J204
$$ plain form
3182 469 467 -697 25 1065 -759 -905 1329 804 -896 154 454 -617 -404 926 148 -918 -155 580
3200 580 -410 -183 363 -125 -654 171 243 -665 -231 494 41 -393 128 236 -147 -84 416 -215 -556 1 162
3221 162 281 -124 -272 -74 -39 491 170 -280 -182 -23 -171 94 -127 -114 353 158 -72 369 22 -401 15
3242 15 467 -284 -539 246 284 -308 76 401 107 -348 307 345 -563 -259 553 -277 6 433 -6 -424 326
3263 326 1247 -175 -954 394 298 -1006 -131 693 -673 -165 1022 602 -858 49 562 -290 -544 841
3281 841 -16 -896 205 909 -110 -706 949 373 -968 82 644 -810 -737 903 244 -1068 120
3298 120 1088 -145 -46 870 89 -838 206 801 -850 -800 752 222 -513 646 792 -711 -539 931
3316 931 14 -1272 -239 745 -538 -411 943 123 -818 672 870 -487 -578 515 -245 -765 186 702
$$ packed form
3182D69kj164P22J040j824j46K234n25j700J050L00j071K13J330p78j066P63P35
3200E80r90K27N46m88n29Q25P2r08M34P25m53m34N21J08l83O3N00o31l41N57J61
3221A62J19m05j48J98L5N30l21m50R8J59j48K65k21J3M67j95k30M41l47m23M16
3242A5M52p51k55P85L8n92L84L25k94m55O55L8r08L04Q12q30K83M27m39m18P50
3263C26R21j422p79J348r6j304Q75Q24j366N08J187m20j460R07N13q52k54J385
3281H41q57q80J101P04j019n96J655n76j341J050N62j454P3J640o59j312J188
3298A20R68j233R9R16p81r27J044N95j651N0J552n30p35J159J46j503J72J470
3316I31r17j286J033R84j283J27J354q20r41J490J98j357r1J093p60n20R51N16
$$ plain form
3334 702 -635 -396 1266 432 -1052 -86 621 -395 -622 355 -28 -1047 140 1022 -82 -468 648
3351 648 301 -760 47 215 -647 -658 862 565 -923 -139 924 -153 -367 509 216 -936 -436 711
3369 711 -207 -643 10 811 -419 71 414 -190 -758 456 287 -789 -305 728 407 -246 341 422 -950
3388 -950 -57 1028 -173 -831 96 634 -412 82 961 -86 -981 531 673 -572 -605 578 -320 -763
3406 -763 293 101 -796 -378 784 328 -899 -158 751 -614 -663 310 164 -729 182 1085 -410 -399 514
3425 514 604 -799 -130 427 -544 -621 672 558 -831 190 878 -225 -358 553 111 -1062 75 945
3443 945 -424 -685 642 809 -812 -46 417 -339 -563 584 428 -672 -93 753 -62 -478 819 319
3461 319 -610 493 971 -420 -919 659 340 -824 171 858 -467 -498 824 276 -924 -214 575 -352
$$ packed form
3334G02j337K39J662q34j484R66P07j016k27R77l83j019J187Q82j104l86J116
3351F48l47j061Q07J68q62j1J520k97j488P84J063j077k14Q76k93j152N00J147
3369G11r18m36O53Q01j230M90L43o04n68J214j69j076M84J033l21o53N87Q1j372
3388i50Q93J085j201o58R27N38j046M94Q79j047q95J512J42j245l3J183q98m43
3406g63J056j92q97M18J162m56j227P41R09j365m9R73j46q93R11R03j495J1R13
3425E14R0j403O69N57r71p7J293j14j389J021O88j103j33R11m42j173J137Q70
3443I45j369k61J327J67j621P66M63p56k24J147j56j100N79Q46q15m16J297n00
3461C19r29J103M78j391m99J578l19j164R95O87j325l1J322n48j200P10P89r27
$$ plain form
3479 -352 -591 673 29 -942 502 989 -589 -496 740 178 -562 -59 302 -377 -299 1094 133 -849 -37
3498 -37 415 -271 -173 422 -277 -535 255 151 -724 -360 758 243 -244 45 123 -237 -252 373 256 -248 -241 106
3520 106 173 -276 324 60 -92 228 149 9 143 47 49 142 43 -98 38 -53 293 60 -179 -147 -408 353 85
3543 85 -306 13 106 -17 119 168 -351 -596 400 257 -484 -220 457 34 -137 503 -97 -553 -222 576 -140
3564 -140 -530 312 44 -754 151 765 -358 -497 853 105 -771 -14 452 -130 -514 1020 -350 -1080 40
3583 40 709 -522 -376 706 -67 -967 430 452 -641 -358 949 22 -881 530 454 -673 11 699 -451
3602 -451 -1087 842 389 -611 -279 578 -472 -514 613 387 -1024 31 930 -462 -779 795 81 -389
3620 -389 286 623 -676 -396 871 140 -684 169 258 -894 -361 1010 -296 -712 421 289 -834 -201
$$ packed form
3479c52k39J264o44r71J444M87j578R3J236n62p40N03L61o79P8J393r61r82Q12
3498c7M52o86R8N95o99k58P90j04q75L64J118n15m87K89P8l60j5O25j17n04PL47
3520A06O7m49O00k64j52L20p9j40J34r6KR3r9j41J36r1L46k33k39L2k61P61k68
3543H5l91L19R3j23J36M9n19k45R96j43p41K64O77m23j71O40o00m56L31P98p16
3564a40l90Q42k68p98R05O14j123j39J350p48q76P57M66n82l84J534j370p30J120
3583D0O69j231J46J082p73r00J397K2j093K83J307r27r03J411p6j127O84O88j150
3602d51o36J929m53j000L32Q57j050m2J127k26j411J055Q99j392l17J574p14m70
3620c89O75L37j299K80J267p31q24Q53Q9j152N33J371j306m16J133j32j123O33
$$ plain form
3638 -201 641 -562 -558 294 360 -1060 160 554 -451 -473 498 -340 -517 525 582 -769 -291 535 -16 -251
3658 -251 539 122 -613 -38 750 -204 -633 383 186 -252 30 325 -571 -191 620 258 -886 189 304
3677 304 -318 8 641 -351 -668 268 331 -379 -195 713 157 -425 337 191 -589 307 508 -489 -310 437
3697 437 -85 -395 388 652 -616 -493 425 -21 -545 783 406 -723 117 579 -392 -597 370 347 -417
3716 -417 -86 272 -448 -204 428 209 -645 -92 513 -140 -239 319 13 -504 139 361 -71 -137 255 -40 -49
3737 -49 3 11 -355 37 755 -75 -473 122 315 -106 -40 216 -512 -269 309 149 -129 -21 -240 -65 197 205
3759 205 -332 -162 185 204 -115 -136 -28 -86 107 166 71 -103 250 77 -225 42 335 -51 403 240 -212 -472
3781 -472 348 413 -185 -150 -36 -157 -253 309 474 -464 -50 307 39 -233 380 73 -105 364 406 -251 -246 367
$$ packed form
3638b01Q42j203MQ52O6j420J220L94j005k2R71q38j77J042N7j351M78Q26n51k35
3658b51P90m17p35N75P88r54m29J016j97m38K82K95q96L80Q11l62j144J075J15
3677C04o22L26O33r92l17R36O3p10J84R08n56n82P62j46p80Q96K01r97J79P47
3697D37n22l10P83K64j268J23R18m46n24J328l77j129Q40M62r71k05R67k3p64
3716d17L31L58p20K44O32k19q54N53O05o53r9N58l06n17O43K22m32o6L92k95r
3737d9N2Ql66L92P18q30l98N95J93m21O6K56p28K43N78j60k78J08k19J75K62Q
3759B05n37J70L47J9l19k1J08n8J93N9r5j74L53j73l02K67K93l86M54j63m52k60
3781d72Q20O5n98L5J14j21r6N62J65r38M14L57k68k72O13l07j78M69M2o57NO13
$$ plain form
3803 367 8 -816 210 245 -386 -104 557 -138 -742 -169 233 -275 -206 366 -12 -373 240 549 -250 -124
3823 -124 508 -465 -404 197 250 -782 116 569 -333 -551 67 775 -656 -129 374 -246 -459 239 233 -744 -314
3844 -314 588 -1 -519 640 284 -566 -107 710 -275 -644 198 375 -4 -51 476 -171 -677 427 526 -823
3864 -823 135 401 -25 -442 165 296 -478 -99 777 12 -865 297 487 -320 -169 373 -177 -717 254 803
3884 803 -136 -249 402 43 -913 271 113 -459 -339 885 166 -295 251 236 -145 -404 437 -570 -575 325
3904 325 677 -343 -257 409 267 -378 -150 165 -203 -115 273 -57 -686 135 259 -74 -153 324 3 -453 222
3925 222 360 -340 -457 441 684 -285 -8 441 -388 -370 554 307 -561 -258 436 -167 -323 455 249 -716
3945 -716 343 595 -252 -667 547 269 -704 -36 350 -84 -394 594 472 -634 -313 413 -404 -839 38
$$ packed form
3803C67l59q24J026L5o31K82O61o95o04N73M02n08O9N72l78l61O13L09p99J26
3823a24O32r73O1O01N3j032Q98M53r02k18O18P08j431N27N03o20k13O98or77M30
3844c14R02n89n18J159l56q50M59Q17r85l69Q42J77l79m7N27o47n06J104R9j349
3864h23R58K66m26m17O07J31p74L79Q76p65q77J162J90q07J51N42n50n40R71N49
3884H03r39j13O51l59r56J184j58n72J20J224p19m61N46j5l81k59Q41j007nR00
3904C25L52j020Q6O66j42o45K28L15l68Q8L88l30o29Q21J24l33p9M77l21m56O75
3925B22J38p00j17Q98K43r69K77M49q29J8R24k47q68L03O94o03j56P78k06r65
3945g16J059K52q47m15J214k78r73O68L86m34l10R88j22j106L21P26q17m35Q77
$$ plain form
3964 38 176 -459 91 607 282 -917 434 480 -679 -19 795 -599 -749 551 603 -443 -47 839 165
3983 165 -393 398 436 -699 -71 436 -216 -741 322 509 -841 275 531 -454 -780 382 334 -1055 -21
4002 -21 800 5 -661 569 417 -618 92 663 -444 -611 364 237 -916 -148 512 -227 -425 733 522
4021 522 -546 -39 550 -300 -690 629 -128 -523 333 487 -91 -480 576 95 -26 -57 168 -176 -130 336
4041 336 203 -354 120 291 21 16 90 -194 -317 2 281 107 -70 237 382 -43 -99 80 106 -211 -190 -13
4063 -13 73 -300 -14 504 -199 -205 -37 -242 -279 -105 146 -177 -391 235 219 -271 232 587 21 -463 205 35
4085 35 -425 -417 339 -31 -421 432 458 -324 -124 609 -101 -303 557 228 -1003 102 819 -367 -187 882
4105 882 -86 -743 214 541 -315 -672 448 100 -923 414 1103 -277 -122 730 -2 -1253 712 564
$$ packed form
3964C8J38o35N50N16l25j199J351M6j159O60Q14j394j50J300N2j046L96Q86o74
3983A65n58P91L8j135O28N07o52n25J063J87j350J116K56r85l26J162m8j389J034
4002b1Q21p95o66J230j52j035P10N71j107j67R75j27j153P68O60p39j98J158k11
4021E22j068N07N89q50l90J319p57l95Q56J54n78l89J056m81j21l1K25l44M6M66
4041C36j33n57M74J71k70nP4k84j23L19K79j74j77L07J45m25n6J79K6l17K1J77
4063a3Q6l73K86N18p03oJ68k05l7J74K51l23k14O26j6m90N03L55n66m84O68j70
4085C5m60QP56l70l90Q53K6p82K00P33p10k02Q60l29j231J105P17j186J80J069
4105H82r68o57R57L27q56l57J120l48j023J337O89j380J55Q52p32j251J965j48
$$ plain form
4123 564 -792 19 784 -439 -912 411 819 -642 -556 588 -335 -722 431 775 -676 299 981 -58
4141 -58 -737 588 267 -997 215 558 -432 -711 727 165 -866 103 612 -411 -642 524 -46 -827
4159 -827 192 844 -415 -479 711 -18 -478 195 468 -586 -290 510 -85 -449 536 225 -473 -77 628
4178 628 179 -276 500 27 -664 64 672 -189 -214 214 -247 -571 170 296 51 -188 125 -293 -627 245
4198 245 334 190 -163 72 98 -32 78 164 -98 28 -16 -708 -43 50 -260 -351 30 -305 -209 -21 -66 -355 -234
4221 -234 106 -176 -99 242 -189 -206 76 193 -231 -478 385 -81 -131 -177 381 -110 -324 562 35 -364 257
4242 257 59 131 -368 340 -211 -337 350 145 -585 141 424 -373 -239 409 -38 -643 -129 433 -118 -238
4262 -238 286 204 -402 -36 47 -267 -194 216 -163 -330 368 323 -111 -237 459 -30 -355 400 202 -254 2
$$ packed form
4123E64j356Q11P65j223m73J323M08j461Q6J144r23l87J153L44j451R75O82j039
4141e8o79J325l21j264J212L43r90k79J438n62j031R69N09j023k31J166n70p81
4159h27J019O52j259o4J190p29m60O73K73j054K96Q00n95l64R85l11o98L96P05
4178F28m49m55P76m73o91P28O08q61k5M28m61l24P41J26k45k39L13m18l34Q72
4198B45Q9j44l53K35K6j30J10Q6k62J26m4o92O65R3l10r1L81l35R6J88m5k89J21
4221b34L40k82P7L41m31j7K82J17m24k47Q63m66n0m6N58m91k14Q86n27l99O21
4242B57j98P2m99P08n51j26O87k05p30P26K83p97J34O48m47o05N14N62n51j20
4262b38N24q2o06L66Q3l14P3M10l79j67O98m5m34j26O96m89l25P55j98m56K56
$$ plain form
4283 2 314 -36 -266 271 85 -16 264 280 44 -103 269 177 -546 325 366 -271 -500 364 -1 -252 106 223
4305 223 -339 -79 3 46 -77 34 41 -233 -169 173 -86 -136 38 350 -164 75 -41 -4 -29 353 106 -557 -185
4328 -185 42 -211 139 -150 160 -78 160 59 -143 -38 161 -63 63 101 -52 -170 -347 222 -92 -115 -175
4349 -175 -142 -165 -45 -58 -358 -242 276 280 56 223 -26 -37 62 88 67 -168 46 29 -186 -145 -147 49 91 -79 -115
4374 -115 -110 -40 203 -206 -47 235 -101 229 254 256 -60 -31 -34 130 89 -169 71 -79 133 203 -150 -191 -330 84
4398 84 66 0 174 -177 117 5 -110 -259 -71 219 -55 55 6 167 -270 62 162 296 -132 61 394
4419 394 -199 -123 -88 -103 -277 -48 -89 -119 36 168 244 359 27 243 -116 -50 21 -53 -218 143 174 56 -185
4442 -185 121 166 -46 -302 -162 -80 0 23 107 39 -252 171 160 -92 250 85 -24 -445 -52 167 -312 -9
$$ packed form
4283BL12l50k30N37j86j01K80J6k36j47L72r2p23Q71M1o37k29Q64l65k51L58J17
4305B23n62K60Q2M3j23J11Pk74O4L42k59n0J74L12n14K39j16L7k5L82k47o63L72
4328a85K27k53L50k89L10k38K38j01k02J05J99k24J26L8j53j18j77N69l14k3o0
4349a75L3k3J20j3l00J16N18Mk24J67k49j1R9K6k1k35K14j7k15M1kJ96M2j70l6
4374a15NP0K43m09J59K82l36L30K5Kl16K9lJ64m1k58K40j50K12P0l53m1j39M14
4398H4j8o6J74l51K94j12j15j49J88K90k74J10m9J61m37L32J00J34m28J93L33
4419C94n93P6L5j5j74K29m1l0J55J32P6J15l32K16l59O6P1p4j65L61L1j18k41
4442a85L06M5k12k56J40Q2Q0K3Q4o8k91M23j1k52L42j65j09m21L93K19m79L03
$$ plain form
4464 -9 370 -209 -123 -26 -23 -304 2 460 -101 -446 -95 35 -340 -218 150 19 41 211 224 -409 -372 191 -203
4487 -203 -152 104 275 -2 -154 364 19 -475 -190 121 -321 -146 262 -148 -368 406 76 -240 168 211 -166
4508 -166 -260 20 112 -629 194 346 -127 99 366 340 -177 -92 19 -90 -124 399 192 -326 20 357 -427 -232
4530 -232 355 -285 -413 168 284 -56 -42 525 36 -20 43 611 -431 -310 478 186 -271 184 280 -55 140
4551 140 516 -156 -285 262 197 -512 -174 270 -149 -80 110 453 -379 -59 403 -133 -243 16 261 -70 -186
4572 -186 -48 -129 199 257 107 -54 -66 83 90 36 137 -32 -433 247 232 334 48 -39 -42 88 -120 -225 179
4595 179 -48 -4 -342 -151 -78 -79 355 27 -174 -175 159 -109 -5 176 -146 -157 223 422 -166 -356 78 11 -227
4618 -227 114 122 -346 -470 367 437 -104 349 400 -366 -357 388 -133 -498 64 327 -618 -41 797 -51 -298 264
$$ packed form
4464iL79n79Q6R7Lk81L06M58n61l45L51J30l75J22L68j31K2J70J3o33L7N63l94
4487b03N1K56J71k77j52N18l45m94K85L11m42J75M08m10k20P74l30l16M08M3l77
4508a66r4K80R2p41Q23J52m73K26K67k6n17Q5J11j09l4N23k07n18L46L37p84J95
4530b32N87o40j28N81J16l40J4N67m89n6O3N68j042J21P88k92m57M55R6l35J95
4551A40L76o72j29N47o5p09L38M44m19O9J90L43q32L20M62n36j10K59K45l31j16
4572a86J38q1L28N8j50j61j2J49Pn4J01j69m01O80j5J02k86q7lJ30k08j05M04
4595A79k27M4l38J91P3jM34l28k01jL34k68J04J81l22j1L80J99n88j90M34o7k38
4618b27L41Qm68j24Q37P0n41M53N1p66RP45n21l65N62K63r45N77Q38q48k47N62
$$ plain form
4640 264 264 -542 -113 667 -157 -295 335 191 -367 180 914 110 -390 257 221 -431 -118 490 -438 -469 431
4661 431 37 -97 100 362 -307 -180 436 -80 -396 -70 456 -260 -226 442 47 -505 286 105 -758 11
4681 11 297 134 -231 392 255 -427 59 243 -49 -665 34 32 -435 -19 323 -123 -181 452 319 -403 -109
4702 -109 233 -243 -35 289 220 -310 69 234 -55 -147 221 4 -380 -126 379 -100 68 -2 93 -133 328
4723 328 125 158 -169 344 -54 -49 -100 -411 -190 71 318 186 -59 -274 206 29 223 -15 -64 11 -118 199
4745 199 249 -68 -121 46 -36 176 -188 236 -177 0 -246 -15 -24 48 139 123 54 -169 154 184 95 126 -174 -250
4769 -250 -1 33 26 -234 308 -212 -206 -20 4 -57 -137 140 19 50 95 230 -140 208 315 -295 -125 372 22
4792 22 -55 -53 231 -54 -15 192 -120 -259 -196 280 157 -299 213 35 -69 -110 112 -46 -274 360 157 -190
$$ packed form
4640B64%q06M29P80q24j38O30j44n58N47P34q04n00O47l6o52L13O08r28l1R00
4661D31l94j34J97K62o69J27O16n16l16L26N26p16L4O68l95n52P91j81q63P69
4681A1K86j63l65O23j37o82M86J84k92o16O99km67M16L42m46n8O33j33p22K94
4702a09L42m76K08L24o9n30L79J65k89r2L68k17l84K54N05m79J68p0R5k26M61
4723C28k03L3l27N13l98Nn1l11K21K61K47j32k45k15M80j77J94k38m9P5j29L17
4745A99N0l17n3J67q2K12l64M24m13J77k46K31rP2R1j6o9k23L23L0q9L1l00p6
4769b50K49L4pk60N42n20OJ86K4o1q0K77j21L1M5J35l70L48J07o10J70M97l50
4792B2p7KK84k85L9K07l12j39O3M76j23m56N12j78j04m1K22j58k28O34k03l47
$$ plain form
4814 -190 -189 358 -89 -289 302 284 -271 91 217 -435 -38 163 -130 -195 -120 42 -230 52 108 -218 166 117
4836 117 173 -269 247 97 6 -12 115 322 -88 -73 251 -82 -151 167 -151 13 159 187 -410 -191 145 93
4858 93 17 138 414 71 -270 -4 130 57 -139 100 -102 -185 -123 380 64 -174 193 -13 8 -116 0 115
4880 115 169 227 -163 0 132 230 -172 -206 71 -134 -223 -48 -73 -154 -69 -57 -60 84 -5 -135 -130 76 -83 111 -188
4905 -188 -207 84 37 -105 -57 133 -20 31 81 87 -230 -56 -31 168 158 3 200 -57 236 -87 110 -305 -2
4928 -2 -44 -160 75 -87 -256 -363 -23 -194 96 -163 22 -196 -248 86 -36 -30 -106 -134 -19 -421 41 119 -99
4951 -99 -113 212 -179 -237 34 -140 -178 -224 -121 -212 87 179 -25 168 -31 18 -133 -374 103 -35 89 47 13
4974 13 241 -105 54 -115 24 10 0 -94 -238 -70 -125 72 248 -259 -297 236 16 139 -264 -19 52 -37 -14
$$ packed form
4814a90JN47m47k00N91j8n55L62J26o52L97K01k93o5P5J62k72K82N6l26L84m9
4836A17N6m42N16j50r1j8J27K07m10J5L24l33o9L18l18J64J46K8n97K19L36n2
4858I3p6J21K76l43l41K66J34p3j96K39k02q3O2N03l16k38L67k06K1j24J16J15
4880A15N4N8l90J63J32R8m02l4K77k05q9J75k5q1Q5J2lJ44q9j30NK06j59J94k99
4905a88j9K91m7j42M8J90j53N1N0Ol17J74K5J99j0j55J97k57K93l23J97m15L03
4928bm2j16K35j62j69j07L40j71K90k59J85k18n2L34j22Op6k8J15m02M62P8k18
4951i9j4L25l91n8K71j74l8m6J03r1K99R2k04J93j99M9j51k41M77j38J24m2l4
4974A3K28l46J59j69J39j4j0r4j44J68n5J97J76n07l8N33k20J23m03K45P1q9K3
$$ plain form
4997 -14 -93 -279 -230 88 3 -170 -106 89 41 189 -202 -227 -148 97 17 50 23 39 -15 -237 314 -12 -92 369 264
5022 264 -14 -338 173 -165 51 368 -44 -342 361 43 -121 -366 277 136 -197 -42 275 56 -242 105
5042 105 -41 -11 321 101 61 28 258 -188 -169 32 310 -27 -179 193 122 80 23 -30 -214 -212 27 -74 145
5065 145 -42 -64 -403 92 69 -189 -112 412 128 112 -157 -109 -23 38 227 83 123 54 222 31 76 152 16 101
5089 101 78 152 -288 8 229 -188 64 200 62 -129 -13 23 -156 14 46 86 63 435 33 -62 279 -307
5111 -307 62 -80 296 181 -282 -55 86 -389 -82 208 134 -306 8 166 5 111 403 23 196 65
5131 65 -174 81 -131 102 130 -42 118 -113 -240 114 107 -256 86 383 -471 -47 275 -47 -154 81 274
5152 274 -358 298 93 -65 -357 244 156 -232 -282 293 -230 -119 152 22 -343 -171 407 -55 -414 24 65
$$ packed form
4997a4p9j86M9L18q5j73O4J95m8J48l91k5P9K45q0L3k7J6n4k22N51l26q0M61j05
5022B64k78l24N11l38K16L17m12k98P03l18j64k45O43j41l33J55L17k19k98L47
5042A05j46L0L32k20m0l3K30m46J9K01K78l37j52L72p1m2n7n3j84KK39j01K19
5065A45j87k2l39M95k3k58P7N24k84j6k69M8Q6O1J89j44M0o9J68j91M5P6j36Q5
5089A01k3P4m40K96K21m17K52J36j38j91J16L6j79J70L2M0k3L72m02r5L41n86
5111c07L69j42L76j15m63K27J41m75L07K90p4m40L14J58j61J06K92l80J73j31
5131F5k39K55k12K33K8j72J60k31j27L54pl63L42K97q54M24L22l22j07K35J93
5152B74o32O56k05j58k92O01q8l88n0N75n23J11K71j30l65J72N78m62l59M38M1
$$ plain form
5173 65 -121 -2 178 -377 44 375 94 -200 -148 437 -265 -300 93 42 -112 -62 526 -215 62 103 38 77 319
5196 319 102 -137 -117 287 -58 -231 225 282 -315 27 271 -60 -10 460 245 -361 147 272 -126 -401 461
5217 461 112 -251 -103 89 -65 262 502 -13 -285 -37 35 -309 -243 189 266 -132 140 33 237 70 65 -118
5239 -118 -378 119 170 -53 -68 219 55 -50 213 -96 -482 70 -103 -10 54 92 103 -232 25 -7 167 84 -40
5262 -40 -4 -184 112 -91 182 266 -165 -36 -48 114 -370 180 -154 85 4 261 82 11 340 176 -284 -111
5284 -111 33 -7 -361 250 77 -269 48 128 24 0 258 84 -26 133 298 -37 -82 161 -35 -273 175
5305 175 510 -277 -128 443 181 -290 -131 216 -268 -61 44 209 -378 -47 233 -207 -154 -97 -211 -267 404
5326 404 276 -183 -140 519 -7 -295 229 -10 -309 -222 424 43 -267 151 87 57 103 125 27 -69 155 128 -150
$$ packed form
5173F5j86J19J80n55M21L31k81k94N2N85p02l5L93n1j54N0N88p41K77M1o5L9K42
5196C19k17k39K0M04l45j73M56N7n97L42K44l31N0M70k15o06N08J25l98k75Q62
5217D61l49l63J48J92j54L27K40n15k72K48P2l44O6M32P7l98K72j07K04j67nj83
5239a18k60M97N1k23j5K87j64j05K63l09l86N52j73R3O4L8J1l35K57l2J74q3j24
5262d0L6j80K96k03K73Q4m31J29j2J62m84N50l34K39q1K57j79p1L29j64m60J73
5284a11J44m0l54O11j73l46L17Q0j04k4K58j74j10J59J65l35m5K43j96k38M48
5305A75L35p87J49N71k62m71J59L47m84K07J05J65n87L31K80m40N3N7j14n6O71
5326D04j28m59M3O59n26k88N24k39k99Q7O46l81l10M18o4l0M6K2r8r6K24k7k78
$$ plain form
5349 -150 24 197 -115 -27 -10 87 -88 57 178 -276 -269 37 -120 -38 121 44 -212 61 58 -25 -218 -114 -197 137
5373 137 -45 108 -110 -224 -71 239 50 -264 22 36 -19 -83 211 104 -28 168 89 -19 -58 -56 -4 -72 31
5396 31 60 -253 50 134 -81 -16 -142 59 386 58 23 30 -383 34 361 169 -227 114 286 20 198 111 -177
5419 -177 219 54 116 -190 -288 -55 -177 -175 155 8 -204 -205 437 54 -313 37 -13 69 103 261 -292 -2 -79
5442 -79 37 0 89 3 52 -430 249 265 -208 -327 55 20 -124 53 200 -47 -85 281 411 -358 118 127 -122
5465 -122 -97 32 72 18 -170 16 -198 56 -1 125 -241 -68 -30 15 -96 269 24 -43 -13 64 83 -1 132 -74
5489 -74 378 -59 106 -323 49 -191 -107 -293 -86 -12 -29 17 -96 -134 14 -133 54 -323 -131 251 -256 -90
5511 -90 3 -164 -137 -6 -192 -25 101 207 327 36 160 -35 -270 -260 366 -48 -147 132 303 -257 236 82
$$ packed form
5349a50J74J73l12Q8J7R7j75J45J21m54PL06j57Q2J59p7k56K73lq3j93J04q3L34
5373A37j82J53k18j14J53L10j89l14K86J4n5o4K94j07j32J96p9j08l9KN2o8J03
5396C1K9l13L03Q4k15O5j26K01L27l28l5Pm13M17L27j92l96L41J72k66J78q7k88
5419a77L96j65O2l06r8K33j22KL30j47k12jO42l83l67L50n0Q2L4J58n53K90p7
5442g9J16l7Q9q6M9m82O79J6m73j19L82l5j44J77J47k47l8L66J30p69M76Rk49
5465a22K5J29M0n4j88J86k14K54n7J26l66J73L8M5j11L65k45o7L0P7J9q4J33k06
5489g4M52m37J65m29L72k40Q4j86K07P4j7M6j13l8J48j47J87l77J92L82n07J66
5511i0R3j67K7J31j86J67J26J06J20k91J24j95k35J0O26m14r9K79J71n60M93j54
$$ plain form
5533 82 82 -196 -33 61 -243 -177 13 187 2 -120 -38 -23 99 20 82 91 312 64 54 167 262 180 -135 -71 61
5558 61 -128 150 46 213 -113 182 -165 -180 -166 -184 98 259 4 153 160 114 -13 -218 39 -149 -253 -192 -61
5581 -61 -116 311 278 216 -41 396 116 198 103 -30 -154 -127 119 58 -271 -147 368 13 -66 -166 95 118 356
5604 356 182 -26 116 91 48 -281 79 78 95 55 108 -271 -222 53 150 -114 12 233 -208 -146 181 157 -371 101
5628 101 -56 -117 -73 16 119 18 89 74 15 -229 585 -199 -131 164 -11 167 -136 267 -46 -55 109 -177 -290
5651 -290 156 314 -70 -303 45 195 -218 -209 -138 -96 -283 56 113 -234 -127 119 124 33 -51 -187 -308 158 -29
5674 -29 -221 316 359 -126 -502 141 124 -123 281 345 -537 -145 260 111 -8 126 165 -397 -107 226 -166 -252
5696 -252 271 -95 -265 -2 226 -123 -41 -53 -196 -323 145 402 -111 -124 159 -45 -197 48 89 -226 15
$$ packed form
5533H2%k78J63R4l04O6J90J74j85j22Q2J5J22p9O2RK21k48j0J13R5q2l15O4J32
5558F1j89K78j04J67l26K95l47j5J4j8K82J61k55J49Pm6j27k05K57j88j04O1J31
5581f1n5M27l3o2k57M37k80Q2r5j33j24K7K46o1l29J24N15l55p9j00K61K3K38
5604C56j74k08J42k5m3l29L60jJ7m0N3l79M9K75R7k64J26K21m41O2L27k4n28M72
5628A01j57o1M4Q9J03j01P1j5n9k44Q14p84O8K95j75J78l03M03l13rJ64k86j13
5651b90M46J58l84k33L48J50m13RP1M2j87L39N7l47J07K46Nr1q4j36j21M66j87
5674b9j92N37M3m85l76O43j7k47M04O4q82L92M05j49j19J34L9n62K90L33l92q6
5696b52N23l66j70K63K28l49Q2j2j43j27M68K57n13j3K83k04j52K45M1l15K41
$$ plain form
5717 15 -12 -10 -25 59 3 -65 -113 298 76 -118 117 232 -60 224 403 44 123 88 103 -507 -34 124 -125 -73
5741 -73 -80 123 -278 -32 19 16 -318 -63 234 115 227 34 24 150 61 136 -23 319 -197 -265 73 154 149 -257
5765 -257 -50 -89 -201 66 324 141 -124 99 47 -10 44 312 78 339 -111 -115 -131 -66 131 -117 -145 71 -17
5788 -17 -191 197 120 9 13 89 129 63 -40 -57 126 161 7 -155 23 91 -236 14 -51 -82 195 173 247 -296 -50
5813 -50 -19 -372 18 297 71 -62 -66 76 80 -30 192 51 -150 -135 210 65 87 -18 253 -247 104 128 -322
5836 -322 -165 -31 -185 139 -102 -28 -84 24 349 -135 -172 269 3 119 221 -182 72 -150 116 156 -274
5857 -274 356 141 -74 -189 36 73 90 170 135 311 0 -10 -119 -84 -87 273 -273 188 -23 39 63 61 -73 -8
5881 -8 51 29 -234 -154 90 136 -2 -73 114 -103 160 8 41 -277 76 17 -61 -257 121 87 76 -103 289 115
$$ packed form
5717A5k7Kj5Q4n6o8m8M11k22j94K35J15k92K84J79l59P9l5J5o10M73J58k49N2
5741g3pK03m01K46N1ll34K55K97j19J12j93j0J26q9P5j59L42n16o8L38Q1nm06
5765b57K07l9j12K67K58j83k65K23n2n7N4K68k34K61m50mj6O5J97k48k8K16q8
5788a7j74L88p7j11MP6M0o6j03j7J83L5j54j62J78O8l27K50o5l1K77k2P4n43K46
5813e0L1l53L90K79k26j33mJ42Mj10K22j41k01J5L45j45K2j05K71n00L51K4m50
5836c22J57J34j54L24k41P4n6J08L25m84l7M41k66J16J02m03K54k22K66M0m30
5857b74O30k15k15j15K25L7J7Q0l5J76l11j0j09L5lL60n46M61k11O2K4kj34O5
5881hN9k2k63Q0K44M6j38p1J87k17K63j52L3l18L53n9p8j96L78l4j1j79L92j74
$$ plain form
5905 115 -4 -316 16 311 121 480 38 -6 120 -207 -28 -49 -39 -152 98 -182 41 274 -112 -218 -9
5926 -9 -139 -172 12 -157 -208 -112 -143 181 133 -46 -233 142 153 59 -143 -65 41 -102 71 213 101 -182 10
5949 10 90 -23 -247 13 -30 -111 100 107 -27 -297 -76 -131 44 69 55 -39 -167 -161 61 -169 -171 -47 163 47 -90
5974 -90 -65 -78 9 101 -69 -204 88 -35 -66 37 79 -47 35 168 210 -90 -270 149 108 -92 160 82 72 29
5998 29 -50 178 -288 39 144 67 -44 289 -69 -77 110 75 -82 -86 173 77 -331 -26 -68 -324 195 -3 59 -142
6022 -142 -34 -61 -123 202 159 49 -144 -92 138 -202 323 4 34 61 -74 65 -63 88 -175 -24 -125 -3
6044 -3 50 -179 -90 389 39 -28 211 -5 -206 -42 209 -150 -116 241 97 -71 -16 70 30 22 167 -60 94 1
6068 1 -301 -121 50 -118 -54 -214 -22 -91 179 75 -88 65 31 -29 -317 -62 -129 -214 24 12 -13 33 -189 33
$$ packed form
5905A15j19l12L32K95j90L59m42m4J26l27J79k1J0j13K50k80K23K33l86j06K09
5926ij30l3J84j69n1R6l1L24m8j79j87L75J1r4k02P8J06j43J73J42j12k83J92
5949A0Q0j13k24K60m3q1K11Pj34k70K21n5J75K5j4r4j28OK22k30kJ24K10j16j37
5974i0K5j3Q7R2j70j35K92j23l1J03M2j26Q2J33M2l00j80M19m1k00K52p8j0m3
5998B9p9K28m66L27J05p7j11L33l58qJ87l5j57mK59r6m08L05m2k56N19j98O2k01
6022a42J08k7o2L25m3j10j93N2K30l40N25l19L0K7j35J39j28J51k63J51j01J22
6044cN3k29Q9M79l50o7K39k16k01J64K51l59L4L57j44j68N5Q6m0qJ45k27J54r3
6068Al02J80J71j68O4j60J92o9K70j04j63J53l4o0k88K55o7q5K38j2k5M6k22K22
$$ plain form
6092 33 77 118 107 193 50 214 -46 64 -214 -69 -34 -114 -139 74 21 -68 302 379 172 346 192 8 242 13
6116 13 -323 263 72 39 122 95 51 33 -30 262 -28 6 -36 302 -183 -70 86 -21 31 -125 27 1 57 41
6140 41 -118 -248 383 230 52 166 137 -162 -621 -78 18 -199 -12 560 -244 -181 -17 -370 240 -155 218
6161 218 -46 -330 23 320 -46 164 32 -135 37 123 -70 92 68 335 -182 -194 -34 -30 -66 -116 124 131 84
6184 84 1 -211 -124 428 280 -253 92 137 -131 -98 51 -213 -236 -155 17 -402 162 211 35 243 152 79 225
6207 225 -45 -182 170 -11 -145 -331 -104 -135 280 -228 -120 134 -147 -85 -39 -113 -189 -35 123 202 164 141 97
6230 97 -70 -42 -26 -58 -58 264 -169 -104 100 34 144 -4 -248 346 -194 6 -68 -183 88 328 23 -11 253
6253 253 199 -28 13 144 -208 -102 289 42 128 -142 473 4 -66 124 -188 37 192 -270 -68 133 109 279
$$ packed form
6092C3M4M1j1Q6j43J64k60J10k78J45L5q0k5K13n3q9L70P7k07J74j54j84K34k29
6116A3l36N86j91l3Q3k7m4j8o3K92k90L4m2L38m85J13J56j07N2j56J52k6N6j6
6140D1j59j30O31j53j78J14k9k99m59N43R6k17J87N72q04O3J64l53O10l95L73
6161B18k64k84L53K97l66K10j32j67J72Q6j93J62k4K67n17j2J60Ml6n0K40Pm7
6184H4q3k12Q7N52j48n33L45M5k68L3J49k64k3Q1J72m19N64M9j76K08r1p3J46
6207B25k70j37L52j81j34j86K27l1M15n08J08K54k81O2M6p4p6J54J58P9l8k3m4
6230I7j67K8J6l2%L22m33O5K04o6J10j48k44N94n40K00p4j15K71K40l05l4K64
6253B53n4k27M1J31l52J06L91k47Q6k70O15m69p0J90l12K25J55m62K02K01k4J70
$$ plain form
6275 279 -44 -24 267 -284 -219 122 -134 -158 -27 -181 244 -325 223 -36 -69 -88 -156 12 -2 -135 -328 149
6297 149 99 240 -433 348 105 -32 0 -143 14 -72 124 34 -154 21 72 -12 103 213 -94 35 92 -29
6319 -29 -91 153 15 -107 -158 0 174 -315 45 -63 52 -112 182 -45 -90 -155 -319 6 124 39 18 -273
6341 -273 25 306 -128 -345 101 -143 -53 59 60 78 85 -77 164 -40 233 135 33 -204 198 67 184 61
6363 61 149 77 10 -165 -149 -193 50 111 -118 -186 -68 33 64 -119 -191 -151 -77 24 -82 86 308 109 110 95 26
6388 26 31 58 92 -98 -72 -15 -163 -225 -123 -105 -142 33 -141 26 -82 -228 -80 -52 100 66 177 -88 323 51
6412 51 135 -297 81 138 -132 -75 46 -270 74 44 59 348 -75 140 173 -138 201 77 -291 87 24 124 51
6435 51 -208 171 -32 -225 208 -169 -182 -140 87 193 89 -120 -98 114 -214 174 132 11 137 118 -328 24
$$ packed form
6275B79l23K0K91n51O5L41k56k4J31j54M25n69N48k59l3j9o8J68j4j33j93M77
6297A49n0J41o73P81k43j37L2j43J57q6J96r0j88J75N1q4J15J10l07J29N7j21
6319b9o2K44j38j22n1J58J74m89L60j08J15j64K94k27m5o5j64L25J18q5k1k91
6341b73K98K81m34k17M46k44R0J12JJ8Pj62K41k04K73r8j02k37M02j31J17j23
6363F1Q8p2o7j75J6m4K43O1k29o8J18J01L1j83p2M0P4J01j06J68K22j99Jj5o9
6388B6NK7L4j90K6N7j48o2J02J8l7J75j74J67j08j46J48K8J52l4J11k65M11k72
6412E1Q4m32L78N7k70N7J21l16L44l0J5K89m23K15L3l11L39j24l68L78o3J00p3
6435E1k59L79k03j93M33l77j3M2K27J06j04k09K2K12l28L88m2j21J26j9m46L52
$$ plain form
6457 24 38 -111 34 23 -331 -177 -142 -28 -429 27 298 -6 44 23 217 -14 58 56 -161 116 -113 -140 -156 -133
6481 -133 37 57 -2 145 381 -82 -90 -198 207 -92 -150 8 40 -203 -88 201 -86 -18 65 -17 72 -89 201
6504 201 186 46 88 -45 -38 129 28 41 -240 164 59 -311 120 367 303 87 -73 -10 -183 -114 -34 -188 -156
6527 -156 241 -16 149 -83 161 -125 -58 161 -288 -336 -250 365 5 18 231 25 -74 28 -90 -42 157 259
6549 259 -224 -132 145 -134 -83 333 292 -82 -86 267 -45 -39 55 29 8 -141 77 -70 49 237 -97 125 -212
6572 -212 -185 358 106 102 6 -310 263 15 271 177 -9 28 58 -64 -221 116 -266 -151 139 264 -110 57
6594 57 -140 147 -194 -13 -20 -81 -60 258 34 255 178 182 177 84 -18 -193 -78 -19 140 -228 54 224 153 61 149
6619 149 -10 28 163 -134 150 119 -385 4 -25 -173 228 85 -132 -217 281 -365 -135 221 -39 -226 182
$$ packed form
6457B4J4j49J45j1l54J54L5J14m01M56K71l04N0k1J94k31P2kk17K77k29k7j6K3
6481a33J70K0n9J47K36m63qj08M05k99n8J58L2k43J15K89k87O8Q3q2Q9j61K90
6504B01j5j40M2j33PJ67j01J3k81M04j05l70M31K47o4k16j60O3j73O9Q0j54L2
6527a56L97k57J65k32K44k86O7K19m49m8Q6O15l60J3K13k06r9J02j18M8J99J02
6549B59m83R2K77k79N1M16m1l74mL53l12OR4k6k1j49K18j47J19J88l34K22l37
6572b12K7N43k52mr6l16N73k48K56r4j86L7L0j22j57L37l82J15K90J25l74J67
6594E7j97K87l41J81po1K1L18k24K21p7Mnr3j02j75J15N9J59l68K82J70p1r2Q8
6619A49j59L8J35k97K84l1n04L89k9j48M01j43k17q5M98o46K30L56k60j87M08
$$ plain form
6640 182 156 87 442 32 233 -343 -294 -15 -84 -255 354 -95 -236 226 446 -17 -59 394 50 -298 12 -59
6662 -59 -79 68 -134 22 -312 28 285 -44 -51 311 -199 -232 -36 27 61 72 237 118 -252 -181 -44 -250 221
6685 221 166 -109 -108 162 146 223 280 168 -72 -253 388 -152 -363 -27 200 9 -65 60 106 64 -150 -111 -94 108
6709 108 -189 10 -54 198 -53 -27 -84 233 -93 -1 109 -49 32 46 -19 60 -108 3 134 -9 95 224 -113
6732 -113 -58 -98 132 20 -137 111 396 -72 163 32 64 144 -217 91 40 -23 60 23 -178 -86 55 93 60 0
6756 0 -10 53 100 -84 -92 104 116 208 -302 -29 -4 32 -279 82 43 -227 12 117 -10 -282 108 -130 -109 -110 138
6781 138 -54 139 98 96 -70 17 -162 0 36 115 106 -108 -154 -78 -65 -53 -305 70 -17 19 -64 56 84 -27 -21 -134
6807 -134 -5 262 27 -330 -35 243 -75 -175 -18 36 -111 23 51 -1 -31 137 71 -205 -215 191 -24 159
$$ packed form
6640A82k6o9L55m10K01n76M9K79o9j71O09m49j41M62K20m63m2M53l44l48L10p1
6662e9k0J47k02J56l34L40K57l29pL62n10l3J96O3L4J1J65j19l70P1J37k06M71
6685B21n5k75JK70j6P7N7j12k40j81O41n40k11L36K27j91p4J25M6m2k14L9J7K02
6709A08k97J99o4K52k51K6n7L17l26R2J10j58Q1J4o5P9j68J11J31j43J04J29l37
6732a13N5m0K30j12j57K48K85m68K35j31L2Q0l61L08n1o3Q3l7k01R2J41L8l3o0
6756@j0O3M7j84qJ96J2R2n10K73K5L6l11L61l9k70K39J05j27k72L90k38K1jK48
6781A38j92J93m1kj66Q7j79J62L6P9rk14m6P6J3J2k52L75q7L6q3J20K8j11Oj13
6807a34J29K67k35l57K95K78l18j00J57N4j47J34K8n2l0J68o6k76j0M06k15J83
$$ plain form
6829 159 195 -32 -172 -2 76 9 -62 302 8 -252 -90 -79 -338 -287 251 264 -129 136 -109 -65 247 120 17
6852 17 -53 211 -216 -209 -34 166 232 52 35 -88 312 384 -46 -37 -209 -137 -96 -22 4 -38 31 -361 28 -109 -181
6877 -181 -33 130 65 -160 135 162 -170 49 -193 -116 -56 25 127 -61 -234 -36 -73 -15 241 -143 -104 -62 -184
6900 -184 -178 2 -11 -49 -62 -115 131 226 -85 206 -16 -108 27 123 132 -57 -72 -161 87 -151 -256 49 112 27 116
6925 116 -86 190 -261 -202 279 151 181 8 14 93 -29 -98 -90 -9 249 -132 36 114 66 -272 -53 129 -81 -97
6949 -97 256 184 -107 -71 115 132 235 -50 115 388 207 -40 -99 -53 171 -5 41 129 128 -32 163 195 -155 -166
6973 -166 160 -111 -149 -246 -59 -9 128 -112 -65 158 -129 -81 169 36 204 92 13 96 5 162 248 31 191
6996 191 24 12 30 -29 -58 43 148 77 -110 30 -76 -256 -56 -59 -17 -17 -33 -124 52 -54 -255 -27 -166 -166 199
$$ packed form
6829A59L6k27j40J70P8o7p1L64k94k60J62J1k59N1N38J3l93K65k45M4L12j27j03
6852A7p0K64m27PJ75K00O6j80j7j23M00P2m30Rj72P2M1P4K6m2O9l92L89j37p2
6877a81J48J63o5k25K95K7l32K19k42P7O0Q1J02j88j73J98l7N8K56l84L9M2j22
6900a84OJ80j3l8j3n3K46R5l11K91k22r2J35R6Rj89j5q9K48k38j05L05O3q5Q9
6925A16k02K76m51N9M81j28L0j73OP9j22o9QQ1K58l81J68P8m8l38K19J82k10j6
6949i7L53p2k91L6J86J7J03k85J65K73j81k47n9M6K24j76M6Q8jj60J95L2l50j1
6973a66L26k71l8r7J87N0J37k40M7K23k87M8K50j33J68j12p9Q3r1J57Q6k17J60
6996A91j67j2J8n9k9J01J05p1j87J40j06j80K00lM2%j6r1J76j06k01K28j39%L65
$$ plain form
7021 199 204 289 92 24 249 -18 109 25 13 105 276 72 -187 -28 -103 225 154 188 133 10 -132 -97 -79 117
7045 117 -75 -21 -55 4 -188 -151 -2 20 -25 -32 -74 -212 -22 -204 -99 -166 35 161 -9 -120 35 -38 -196 -111
7069 -111 73 -160 -455 400 0 -94 178 -54 -199 -39 178 8 -33 184 60 -98 -48 -106 -52 -82 -133 -22
7091 -22 -22 2 -143 -12 90 269 -118 -7 149 -113 104 -150 61 -105 119 -34 131 156 47 -102 258 -83
7113 -83 63 -80 102 -69 5 251 51 -99 -175 60 -203 -28 -67 132 -112 -256 37 -124 -13 -152 2
7134 2 -132 -33 -10 -135 -28 91 -252 20 132 -348 -199 98 -6 16 64 11 -122 140 64 -173 141 92 -83
7157 -83 89 3 124 -198 137 8 59 -84 323 -186 -37 155 16 -267 53 15 89 85 -52 -18 -188 -69 89
7180 89 -255 -136 7 239 18 -136 105 -362 -93 -176 392 71 86 254 -104 -56 -212 100 19 138 -15 -82
$$ packed form
7021A99NQ5j97o8K25k67J27q4j2R2J71k04k59J59p5L28p1L4n5j23j42L5J8J96
7045A17j92N4l4N9j92L7J49K2m5pm2j38J90j82J05o7K01J26j70j11J55p3j58Q5
7069a11J84k33k95Q55m00r4K72k32j45J60K17j70m1K17j24j58N0n8N4l0n1J11
7091b2%K4j45J31J02J79l87J11J56k62K17k54K11j66K24j53J65K5j09j49L60l41
7113h3J46j43J82j71P4K46k00j50p6K35k63J75l9J99k44j44K93j61J11j39J54
7134Bj34R9K3j25J07J19l43K72J12m80J49K97j04K2M8n3j33K62p6k37L14m9j75
7157h3J72q6J21l22L35j29N1j43M07n09J49J92j39k83L20l8P4mj37L4j70J19J58
7180H9l44J19J43K32k21j54K41m67K69q3N68l21J5J68l58M8j56L12q1J19j53o7
$$ plain form
7202 -82 -318 104 206 48 -160 -93 -83 -526 98 -126 -159 26 -112 25 0 -27 -128 175 218 150 -98 -25 255
7225 255 22 -282 -73 -12 -291 -67 254 -220 -126 29 345 -175 -31 103 -177 16 73 -35 -137 122 134
7246 134 33 46 -196 448 131 -294 -51 -137 -57 96 -7 35 74 -42 -1 110 179 -273 -288 -236 -101 -169 96
7269 96 -265 -56 -236 -114 -43 110 236 -223 77 -35 -250 285 65 -82 -97 -40 78 -137 -197 115 -140 -166
7291 -166 119 -222 232 88 8 -117 -165 411 47 -302 -184 94 -107 13 -21 161 17 -226 158 -99 -27
7312 -27 308 -1 -282 26 -48 103 -88 -13 -8 -184 -4 147 -45 -192 174 82 -63 213 124 -124 -366 153
7334 153 -140 51 -150 191 229 -91 317 334 130 -5 150 9 -152 236 160 -194 81 -59 -138 78 164 202
7356 202 -87 -183 327 -89 -286 143 26 -60 234 -62 310 -171 102 -165 -84 72 -6 -153 -396 164 100 116
$$ packed form
7202h2k36M22J02j58k08O7J0m43O24k24l3J85j38J37k5k7j01L03M3o8k48P3K80
7225B55k33l04K09O1k79K24L21m74R4J55L16n20J44J34k80J93N7j08j02K59J2
7246A34j01J3k42O44l17m25K43q6Q0J53j03M2L9j16M1J11O9m52j5N2J35o8K65
7269I6l61K09j80J22P1J53J26m59L00j12k15N35k20j47j5N7J18k15o0L12k55k6
7291a66K85l41M54j44q0j25m8N76l64l49J18K78k01J20l4J82j44k43L84k57P2
7312b7L35l09k81L08p4J51j91P5Nj76J80J51j92j47L66r2j45K76q9k48k42N19
7334A53k93J91k01L41L8l20M08J7k04j35J55j41j61L88p6l54K75j40p9K16Q6L8
7356B02k89r6N10m16j97M29j17q6K94k96L72m81K73k67Q1J56p8j47k43N60o4J6
$$ plain form
7378 116 -167 62 -146 -94 283 -147 -249 8 86 -256 -264 297 -73 -330 -88 33 -87 117 87 16 -124 -144
7400 -144 81 -337 187 -64 -201 -91 -126 -12 5 -6 218 159 -95 -105 55 -151 181 130 189 264 163 87 89 203
7424 203 235 -165 -353 -60 -213 107 28 -262 145 -24 -175 24 116 -16 69 -94 -170 -132 253 -157 -132 251
7446 251 -41 -158 55 -58 -55 157 -7 -227 239 -147 116 102 -34 0 8 -11 221 349 -66 48 37 -79 -310
7469 -310 -260 -131 7 -75 27 121 -94 -124 -32 120 -53 -94 -61 58 -121 -72 38 -69 393 -4 -19 337 -173
7492 -173 11 69 93 -227 106 41 -5 323 23 -5 4 90 25 -44 -35 177 -122 35 -88 -77 94 -250 51 -109
7516 -109 84 84 -215 -166 110 -8 39 205 -190 257 187 167 159 -198 178 -429 -89 17 -384 12 -33 84 -178
7539 -178 -166 33 103 30 117 201 -122 -99 4 122 322 -187 36 5 42 108 115 -110 -151 -10 -216 -180 -10 107
$$ packed form
7378A16k83K29k08N2L77m30j02K57P8l42qN61l70k57K42J21j20K04l0p1j40k0
7400a44K25m18N24k51j37J10l5J14J7j1K24n9k54j0J60k06L32n1N9P5j01p6KJ14
7424B03L2m00j88K93j53L20p9k90M07j69j51J99R2j32Q5j63p6L8L85m10K5L83
7446B51k92j17K13j13LK12j64k20M66l86K63j4j36L4Qj9K32J28m15J14j1j16k31
7469c10N0J29J38q2J02R4k15l0R2J52j73m1L3J19j79M9J10j07M62l97j5L56n10
7492a73J84N8K4l20L33o5m6L28l00k8RQ6o5o9RK12k99J57j23J1J71l44L01j60
7516a09J93%k99M9K76j18M7J66l95M47p0k0ql57L76o07L40J06m01L96m5J17k62
7539a78J2J99P0p3Q7Q4l23K3J03J18K00n09K23l1L7O6Pk25m1J41k06L6J70J17
$$ plain form
7563 107 7 -108 297 204 -133 -105 -33 -212 -102 -81 -64 -2 -2 -115 -104 97 196 63 -80 -18 -192 -225 -133 25
7587 25 286 -220 -283 14 -16 79 44 97 51 243 19 242 59 -263 49 -158 75 6 -139 112 190 82 -220
7610 -220 25 68 53 164 128 116 227 -2 71 -102 -163 -100 44 154 -30 -165 -280 -248 -30 -54 -6 -190 314
7633 314 -286 -154 87 -60 64 25 173 4 -230 -202 -24 182 -4 -49 -196 -8 78 22 46 -103 181 208
7655 208 -21 -169 -143 59 323 247 107 -148 -227 -180 215 30 -67 90 -323 64 -145 52 32 168 -119 -99
7677 -99 83 79 -183 -180 87 -102 -105 -83 279 -139 247 -33 70 -8 6 -148 9 -32 -78 75 -93 85 -74 45
7701 45 -116 -97 45 178 -3 -44 -146 -87 -24 -249 -143 67 6 35 215 -84 -161 -117 -58 -26 79 -129 -178 27
7725 27 214 239 141 0 -11 -421 182 -229 -178 205 49 -61 -288 258 47 52 192 131 171 152 108 154 -26 -102
$$ packed form
7563A07j00j15M05r3l37K8P2j79J10K1J7O2%j13J1K01R9j33j43O2j74l3R2J58
7587B5K61n06o3K97l0R5l5N3m6J92k24K23j83l22L12k07K33o9j45K51P8j08l02
7610b20K45M3j5J11l6j2J11k29P3j73o1O3J44J10j84j35j15L2K18k4M8j84N04
7633C14o00J32K41j47J24l9J48j69k34K8J78K06j86m5j47J88Q6n6K4j49K84K7
7655B08k29j48K6K02K64p6j40k55p9M7L95j85r7J57m13L87k09J97k0J36k87K0
7677i9J82mk62LK67j89lK2L62m18L86k80J03p8J4j54J57m1m6J53j68J78j59J19
7701D5j61J9J42J33j81m1j02N9O3k25J06K10o1K9J80k99p7M4N9L2J05k08m9K05
7725B7J87K5r8j41j1m10O03m11N1L83j56j10k27N46k11NJ40o1M0j9m4M6j80p6
$$ plain form
7749 -102 -16 -100 -345 -423 343 9 -113 -31 -301 -345 -45 89 -13 -79 -118 176 -75 75 116 123 -138 -41 -1 73
7773 73 326 45 66 -161 219 -2 231 -106 228 14 -61 189 35 -363 139 -31 -274 -369 172 185 -128 2
7795 2 -37 -5 273 -89 183 144 -136 44 -67 -248 -136 -223 -28 211 195 65 -86 -63 84 -23 -36 -52 -14 33
7819 33 104 -37 -61 -92 157 -224 -386 42 105 -149 31 -38 -128 138 -84 -25 324 145 40 -236 -5 30 -11
7842 -11 -229 -489 -96 186 47 -40 -22 176 93 -78 -37 104 -229 -155 162 -51 -68 -126 -118 -77 56 43 103 176 -45
7867 -45 46 -95 -46 -67 -19 72 -242 -103 -23 82 -9 277 29 76 -298 184 79 1 -7 12 67 -183 -7 267 -161
7892 -161 -155 103 -221 -148 21 432 -207 -137 -128 70 -82 24 -263 4 -263 -24 -67 -66 52 42 161 57 52 -20
7916 -20 -54 -105 -195 20 -57 117 139 -317 -173 194 246 10 91 47 -212 61 29 86 -14 59 25 -172 -322 182
$$ packed form
7749a02Q6q4k45p8P66l34j22Q2k70m4L00J34j02o6l9K94k51J50M1Pk61R7M0P4
7773G3K53k81K1k27L80k21K33l37L34k14p5K50j54l98N02j70k43r5N41J3l13J30
7795Bl9L2K78l62K72l9k80J80j11j81J12q7J95K39j6j30j51K3J47j07j3j6L8M7
7819C3P1j41k4l1K49l81j62M28O3k54J80o9r0K66k22N9L49j79j05k76K31L5m1
7842a1k18k60L93K82j39q7J8J98q3j71M1J41l33P4L17k13j7n8QM1J33j3O0P3k21
7867d5R1j41M9k1M8R1l14J39Q0J05r1K86k48M7l74M82j05p8qJ9N5k50J76K74m28
7892a61OK58l24P3J69M11o39P0RJ98j52J06k87K67k67K39m3JJ18j0J19j04np2
7916b0l4n1r0K15p7J74K2m56J44L67N2k36Q1m4k59K73l2N7j00P3l4j97j50N04
$$ plain form
7940 182 -46 208 6 45 -199 10 -126 -23 -295 -20 86 259 45 -143 -66 -41 115 127 -13 -56 64 -369
7962 -369 7 -57 187 35 -261 157 86 -269 80 50 -85 31 -124 54 107 54 234 -108 -64 -195 75 -71
7984 -71 -144 -89 -293 53 -109 116 145 -331 -182 -120 219 80 61 -72 62 173 218 113 -30 119 -169 114
8006 114 115 46 -208 -196 -371 -26 94 -126 -206 5 -51 -101 -142 266 224 -204 94 214 166 -29 143 18 -28 191
8030 191 -199 -78 -305 -141 149 -88 -179 34 -151 180 -37 215 5 -45 126 -63 -127 75 409 46 -85
8051 -85 174 121 -96 67 -232 152 116 241 75 146 -319 110 -380 -50 -5 272 -189 -156 178 -63 -134 -111 -144
8074 -144 33 254 135 -109 -59 84 59 56 17 -7 -140 114 -118 162 -31 83 -109 -110 83 112 26 -27 -143 195
8098 195 -19 -112 182 99 -71 -193 -139 -202 17 -267 -8 -215 96 -111 -258 211 155 85 105 202 -40 129 -77
$$ packed form
7940A82k28K54k02L9k44K09j36J03k72K75J06J73k14j88P7K5J56J2j40m3J20m33
7962c69L76o4K44j52k96M18p1l55L49l0j35J16j55J78N3n3J80l42M4j31K70j46
7984g1p3N5k04L46j62K25K9m76J49O2L39j39j9j33J34J11M5j05j43J49k88K83
8006A14Jo9k54J2j75L45J20k20q0K11n6n0m1M08m2m28K98J20m8j95J72j25m6K19
8030A91l90J21k27J64K90k37r1K13j85L31k17K52k10n0J71j89o4K02L34l63j31
8051h5K59n3k17J63k99L84l6J25j66P1m65M29m90L30M5K77m61L3L34k41p1K3l3
8074a44J77K21j19k44N0J43k5ll9k4j33K54k32K80j93J14j92jJ93K9q6n3j16L38
8098A95k14r3K94q3j70j22N4o3K19k84K59k07L11k07j47M69n6p0K0R7k42J69k06
$$ plain form
8121 -77 -60 238 -171 -197 -23 -139 -78 147 -20 -125 -48 122 171 146 -39 60 116 49 71 33 -245 -153 244 224 71
8146 71 -17 165 132 8 91 -102 -129 60 193 -36 -161 -122 -231 -33 1 -87 -211 193 15 -159 -131 -239 48
8169 48 -36 -245 -117 -66 -125 59 374 74 -151 224 126 -53 -132 98 -214 -34 118 -37 56 75 -112 -23
$$ packed form
8121g7J7K98m09k6J74j16O1K25j67j05P7J70M9k5j85R9N6o7K2l8k78R2L97k0j53
8146G1q8J82l3j24Q3j93k7J89J33k29j25L9j09J98L4q8j24M04j78j74K8j08K87
8169D8q4k09J28N1n9J84L15l00k25L75r8j79p9K30l12J80J52j55R3J9j87Q9
8191b3
$$ Imaginary data points
##PAGE= N=2
##DATA TABLE= (X++(I..I)), XYDATA
$$ plain form
0 0 0 0 0 0 0 0 0 -8 1 -8 8 -8 16 -16 24 -32 38 -47 56 -64 80 -96 113 -131 153 -181 211 -243 280 -322 368
31 368 -422 478 -541 611 -690 774 -866 969 -1081 1203 -1338 1485 -1643 1818 -2010 2217
47 2217 -2445 2697 -2970 3272 -3603 3972 -4383 4842 -5360 5948 -6623 7406 -8327 9434
61 9434 -10786 12485 -14695 17696 -22029 28864 -41291 71168 -300700 -56504 515507 -21507
73 -21507 -87462 151099 -4237 -212086 151173 180005 -193247 -144679 181149 -13415 -157084
84 -157084 81210 78137 -132235 76959 198140 -117172 -173231 164822 99730 -186234 -50276
95 -50276 88989 -151937 -79147 286427 147382 -201151 -57240 111935 -56439 -50081 129473
106 129473 -42912 -219693 58007 207888 -78098 -108982 153154 66207 -135290 26546
$$ packed form
0@%%%%%%%qRrJ6j6K4l2M0n6P0q5J03j20J44j76K09k44K84l34L92m54N23o02O90
31C68p90R00j019J152j301J464j640J835k050K284k541K823l128L461l828M227
47B217m662N142n667O242o875P575q355R225j0202J1308j2571J4029j5733J7761
61I434k0220K3271k7180L2391l9725N0893p0155J12459l71868K44196N72011n37014
73b1507o5955K38561j55336k07849L63259K8832l73252M8568L25828j94564j43669
84a57084K38294l073k10372K09194J21181l15312n6059L38053o5092k85964J35958
95e0276J39265k40926P2790L65574j39045l48533J43911J69175j68374O358J79554
106A29473j72385j76781K77700J49881k85986l0884K62136q6947k01497J61836
$$ plain form
116 26546 131707 -96078 -176665 24274 76119 -31486 4281 73193 17168 -5166 927
127 927 -47797 3225 102009 6241 -136812 -71766 55997 49104 21905 50111 -2348 -77447
139 -77447 -1566 69614 -27176 -90368 4608 71178 -5415 -84014 -14574 101293 88000 1241
151 1241 -38834 -49708 -47425 4937 60556 18179 -70838 -47110 32760 29466 31944 60300 -23247
164 -23247 -96884 5901 79902 -30718 -91335 16842 58774 -10015 14669 45648 -49445
175 -49445 -40223 94743 48918 -97068 -61407 26790 634 6954 58855 -19814 -86873 44853
187 44853 104629 -42824 -65750 37184 -19523 -64674 68943 69392 -103909 -59589 137354
198 137354 74438 -100144 -30821 58405 -30638 -29057 52842 -32310 -90723 47879 90163 -42689
$$ packed form
116B6546J05161k27785q0587K00939N1845j07605L5767O8912n6025k2334O093
127I27m8724N1022R8784r5768j43053O5046J27763o893k7199K8206n2459p5099
139g7447P5881P1180r6790o3192R4976O6570p6593p8599O9440J15867j3293q6759
151A241m0075j0874K283N2362N5619m2377q9017K3728P9870l294K478K8356q3547
164b3247p3637J02785P4001j10620o0617J08177M1932o8789K4684L0979r5093
175d9445R222J34966m5825j45986L5661Q8197k6156O320N1901p8669o7059J31726
187D4853N9776j47453k2926J02934n6707m5151J33617M49j73301M4320J96943
198A37354o2916j74582O9323Q9226q9043J581Q1899q5152n8413J38602M2284j32852
$$ plain form
210 -42689 -46908 57732 13217 -48705 37220 30914 -90059 -26137 95543 4316 -71540 33351
222 33351 55203 -46892 -16732 67649 -17531 -85656 24805 56763 -48697 -32417 43478
233 43478 -1022 -15201 55073 13888 -79314 -8650 87160 -778 -80140 8255 42166 -28028
245 -28028 2562 55483 -18920 -58398 26472 51092 -28398 -43064 10518 3234 -12651 26980
257 26980 9153 -42472 5637 57618 2492 -37562 -214 10442 -15719 9787 33338 -30311
269 -30311 -53438 36552 59877 -25326 -42412 11374 13181 -10173 4910 7725 -26487 -14851
281 -14851 36589 20884 -23072 -3799 12893 -5920 7566 20323 -20163 -38397 15152 41799
293 41799 -12754 -36906 9507 17049 -8794 7852 9798 -26706 -16698 27629 20839 -20411 -18404
$$ packed form
210d2689m219J04640m4515o1922Q5925o306j20973O3922J21680r1227p5856J04891
222C3351K1852j02095L0160Q4381q5180o8125J10461L1958j05460J6280P5895
233D3478m4500j4179P0274m1185r3202P0664R5810q7938p9362Q8395L3911p0194
245b8028L0590N2921p4403l9478Q4870K4620p9490j4666N3582p284j5885L9631
257B6980j7827n1625M8109N1981n5126m0054L7348J0656k6161K5506K3551o3649
269c0311k3127Q9990K3325q5203j7086N3786J807k3354J5083K815l4212J1636
281a4851N1440j5705m3956J9273J6692j8813J3486J2757m0486j8234N3549K6647
293D1799n4553k4152M6413P542k5843J6646J946l6504J0008M4327o790m1250K007
$$ plain form
306 -18404 11939 12290 7178 10065 -16122 -24262 21257 27480 -20542 -25644 8968 9668 -9236 4885
320 4885 14097 -20875 -22495 28016 26138 -22458 -22290 9034 15898 6685 -652 -9007 -10517 8398
334 8398 21028 -3755 -19632 -1977 2418 -623 10436 -61 -23511 -9199 24999 18167 -20154
347 -20154 -20284 14077 15412 -1986 -442 -3393 -8965 5042 15736 3652 -12988 -11145 4007
360 4007 8083 5050 -3317 -19607 -7386 23080 11630 -19304 -13477 9674 11847 -375 -1165 973
374 973 -8321 -1029 18755 6821 -16240 -11273 4252 13067 7090 -12311 -17760 730 17433 6314
388 6314 -15312 -9656 6057 3033 5491 9661 -9150 -15093 8595 19751 1247 -15484 -7108
401 -7108 8858 9984 1266 -12242 -13917 9214 15879 -8370 -11700 990 -2687 -700 15217 7574
$$ packed form
306a8404L0343L51n112K887k6187q140M5519O223m8022n102L4612P00j8904J4121
320D885R212l4972j620N0511j878m8596J68L1324O864r213p337q355j510J8915
334H398J2630k4783j5877J7655M395l041J1059j0497k3450J4312L4198o832l8321
347b0154j30L4361J335j7398J544k951n572J4007J0694j2084j6640J843J5152
360D007M076l033q367j6290J2221L0466j1450l0934N827K3151K173j2222p90K138
374I73r294P292J9784j1934k3061M967J5525Q815n977j9401n449J8490J6703j1119
388F314k1626N656J5713l024K458M170j8811n943K3688J1156j8504j6731Q376
401g108J5966J126q718j3508j675K3131O665k4249l330J2690l677J987J5917p643
$$ plain form
415 7574 -17888 -13264 16070 14471 -6787 -2625 898 -6541 7566 10829 -13256 -11015 13350 7210
429 7210 -11395 -2858 3468 -13383 -2031 29514 2597 -35424 -2981 27890 3056 -8619 5032
442 5032 -4213 -10534 14919 15061 -20738 -14969 21109 7985 -13538 3492 -5049 -24731 14459
455 14459 39206 -14403 -42728 6170 28923 -3745 -2782 14943 -14711 -19922 24965 17171 -23890
468 -23890 -6300 18827 -3535 -9780 8892 -7133 -20104 20938 30031 -27243 -31262 20186 13174
481 13174 -14154 10414 15572 -22948 -15916 25897 16650 -15601 -5043 6442 -8086 3329 15038
494 15038 -15393 -20545 17413 17036 -12231 -5863 5567 -10532 -7957 21859 12548 -21940 -9822
507 -9822 15526 1451 -6848 7211 7766 2753 766 -12590 -16158 8161 22065 331 -17383
$$ packed form
415G574k5462M624K9334j599k1258M162L523p439J4107L263k4085K241K4365o140
429G210j8605Q537O326j6851J1352L1545k6917l8021L2443L0871k4834j1675J3651
442E032r245o321K5453J42l5799N769L6078j3124k1523J7030q541j9682L9190
455A4459K4747n3609k8325M8898K2753l2668R63J7725k9654n211M4887p794m1061
468b3890J7590K5127k2362o245J8672j6025j2971M1042R093n7274m019N1448p012
481A3174k7328K4568N158l8520P032M1813r247l2251J0558J1485j4528J1415J1709
494A5038l0431n152L7958l77k9267O368J1430j6099K575K9816r311l4488J2118
507i822K5348j4075q299J4059N55n013j987j3356l568K4319J3904k1734j7714
$$ plain form
520 -17383 -7267 -3763 -2760 17501 17269 -9827 -14279 -1839 192 3774 7376 -1130 120 8157
534 8157 -6300 -21916 7122 34670 2761 -25511 -6665 -4865 -12559 18000 28325 -14824 -28937
547 -28937 5186 14178 2098 12032 5885 -27818 -10656 27751 773 -23454 13467 15893 -20575
560 -20575 599 30197 -12848 -35469 19170 29040 -27641 -22344 18607 -1806 -7959 29670 4285
573 4285 -39955 7452 46756 -9872 -37148 10591 7567 -23420 20116 38006 -35169 -38851 38561
586 38561 28395 -28216 -3641 17102 -27803 -20726 35101 10812 -32990 10867 32003 -21739
598 -21739 -13293 34589 -1238 -33315 16334 19805 -39723 -18815 43737 11427 -31586 11365
610 11365 21575 -28840 -9395 37019 -3905 -37448 6164 16954 -19217 1639 35786 -3121
$$ packed form
520a7383J0116L504J003K0261k32k7096m452J2440K031L582L602q506J250Q037
534H157j4457j5616K9038K7548l1909k8272J8846J800p694L0559J0325m3149j4113
547b8937L4123Q992j2080R934o147l3703J7162L8407k6978k4227L6921K426l6468
560b0575K1174K9598m3045k2621N4639R870n6681N297M0951k0413o153L7629k5385
573D285m4240M7407L9304n6628k7276M7739l024l0987M3536J7890p3175l682P7412
586C8561j0166n6611K4575K0743m4905P077N5827k4289m3802M3857K1136n3742
598b1739Q446M7882l5827l2077M9649L471n9528K0908O2552l2310m3013M2951
610A1365J0210n0415J9445M6414m0924l3543M3612J0790l6171K0856L4147l8907
$$ plain form
622 -3121 -26177 17548 15560 -28341 -4400 27618 -12877 -30965 11752 15186 -12779 8011 27282
635 27282 -13157 -28684 14416 18528 -16522 -9212 6799 -9758 -3237 23035 7848 -16306 4365
648 4365 20628 -7763 -21396 1788 3707 -10232 2374 9628 -10696 -10041 17383 21777 -1755
661 -1755 -14439 -7431 -2656 -35 7306 1323 -11507 -5827 9791 13887 5253 -3563 -3770 -3709 -3621 704
677 704 -4429 -13132 -1156 14780 6838 -6855 687 11987 2089 -5388 3955 -3948 -18929 -641
691 -641 17964 570 -11726 4541 9819 73 5314 6612 -17020 -18871 11480 9925 -16043 -4007
705 -4007 14786 -1921 -4230 18075 8628 -17334 -2782 15570 -10975 -22439 10008 14141 -10487
718 -10487 -250 13489 -6397 -6530 17736 5773 -22830 -9045 10331 -7139 -7494 18995 5904
$$ packed form
622c121k3056M3725j988m3901K3941L2018m0495j8088M2717L434k7965K0790J9271
635B7282m0439j5527M3100M112l5050P310J6011j6557O521K6272j5187k4154K0671
648D365J6263k8391j3633K3184J919j3939J2606P254k0324O55K7424M394k3532
661a755j2684P008M775K621P341n983j2830N680J5618M096q634q816k07O1Q8M325
677G04n133q703J1976J5936p942j3693P542J1300r898p477R343p903j4981J8288
691f41J8605j7394j2296J6267N278r746N241J298k3632j851L0351j555k5968J2036
705d007J8793j6707k309K2305r447k5962J4552J8352k6545j1464L2447M133k4628
718a0487J0237J3739j9886j33K4266j1963k8603J3785J9376j7470l55K6489j3091
$$ plain form
731 5904 -18585 7342 25074 -7444 -17536 9293 5427 -18691 -3995 12009 -8397 -8038 21989
744 21989 10615 -18670 -2605 13853 -4865 -9281 7077 -4635 -18755 7535 23500 -4586
756 -4586 -12951 14016 9296 -12197 544 8253 -14938 -14885 12396 9278 -13168 -2997 15060 2141
770 2141 -4021 8527 -2481 -16475 2260 13026 -7919 -12858 9131 10659 -3937 3999 12083
783 12083 -9125 -13034 10658 6605 -17201 -9540 8915 2144 -4125 7523 6613 -7823 473 13254
797 13254 -3381 -14092 1650 4291 -6248 1293 8860 -3892 -6050 13007 11124 -13650 -10920
810 -10920 8579 -47 -11005 1514 4005 -6900 497 14650 3750 -9334 1266 7464 -4906
823 -4906 -4223 4251 -6156 -8650 9965 10964 -8436 -5308 10367 3672 -8375 -18 3300 -11179
$$ packed form
731E904k4489K5927J7732l2518j0092K6829l866k4118J4696J6004k0406L59L0027
744B1989j1374k9285J6065J6458j8718m416J6358j1712j4120K6290J5965k8086
756d586q365K6967m720k1493J2741P709k3191N3K7281l118k2446J0171J8057j2919
770B141o162J2548j1008j3994J8735J0766k0945m939K1989J528j4596P936Q084
783A2083k1208l909K3692m053k3806P661J8455o771o269J1648r10j4436Q296J2781
797A3254j6635j0711J5742K641j0539P541P567j2752k158J9057j883k4774K730
810a0920J9499q626j0958J2519K491j0905P397J4153j0900j3084J0600O198j2370
823d906O83Q474j0407k494J8615R99j9400L128J5675o695j2047Q357L318j4479
$$ plain form
837 -11179 -5838 12165 3316 -10582 1142 10999 2111 -2033 2452 -3123 -8102 4080 6674 -9541
851 -9541 -7189 8945 4423 -4464 3316 4727 -7573 -4737 9202 1515 -13819 -3095 10490 919
865 919 -3118 5327 1635 -4549 4421 7254 -5440 -9193 2989 3478 -5329 450 4781 -5646 -2351
880 -2351 11302 2761 -11250 -2689 8689 -228 -7037 2113 2363 -5817 3359 10896 -2963 -8433
894 -8433 3426 5006 -3408 -2148 557 -5767 -2785 8945 2893 -10325 -298 9960 -606 -5188
908 -5188 3727 143 -7249 2274 9082 -3101 -8740 4800 7196 -2934 -1474 1951 -4659 -2023
922 -2023 5945 -621 -8216 95 6471 -345 -2059 4323 -1229 -6651 4811 8481 -4970 -6688 3538
937 3538 4114 -1688 -889 959 -1911 -302 3972 -1213 -5885 -156 2370 -605 1433 503 -4654 -1372
$$ packed form
837a1179N341J8003q849j3898J1724R857q888m144M485n575m979J2182K594j6215
851i541K352J6134m522q887P780J411j2300K836J3939p687j5334J0724J3585r571
865I19m037Q445l692o184Q970K833j2694l753J2182M89q807N779M331j0427L295
880b351J3653q541j4011Q561J1378q917o809R150K50q180R176P537j3859n470
894h433J1859J580q414J260K705o324K982J1730o052j3218J0027J0258j0566m582
908e188Q915l584p392R523O808j2183n639J3540K396j0130J460L425o610K636
922b023P968o566p595Q311O376o816j714O382n552n422J1462L670j3451j718J0226
937C538N76n802P99J848k870J609M274n185m672N729K526k975K038r30n157L282
$$ plain form
953 -1372 7102 5314 -4388 -5169 2301 3492 -131 -571 -1559 -1951 1556 1811 -564 -1429 -2318 -273 3954
970 3954 1942 -4738 -5166 2691 6438 1069 -2796 -2213 -1264 2921 4715 -1530 -3544 530 32 -1054
986 -1054 2309 1215 -5214 -2868 6532 2162 -7769 -1546 5682 -306 -1788 2419 -1297 -3714 3769
1001 3769 5277 -2527 -3163 2218 -729 -1919 6144 1226 -9860 -1008 9087 -1460 -6781 2876
1015 2876 3547 -4939 -837 5917 -2388 -4921 5905 4111 -6493 -864 4783 -2012 -129 5796 -3390
1030 -3390 -8379 4543 8065 -6458 -6204 6351 1501 -5491 3441 3259 -7677 -756 9581 1155
1044 1155 -6589 536 2571 -2150 3568 5660 -6755 -6397 7817 3052 -7640 233 4794 -4343
1058 -4343 -2616 6269 -721 -8873 2393 9485 -2128 -4323 1064 -2555 -292 9579 2588 -9909
$$ packed form
953a372Q474j788r702p81P470J191l623m40r88l92L507K55k375q65q89K045M227
970C954k012o680m28P857L747n369l865N83R49M185J794o245k014M074m98j086
986a054L363j094o429K346R400m370r931O223P228n988j482M207l716k417P483
1001C769J508p804o36N381k947j190Q063m918j1086Q852J0095j0547n321R657
1015B876O71q486M102O754q305k533J0826j794j0604N629N647o795J883N925r186
1030c390m989J2922L522j4523K54J2555m850o992Q932j82j0936O921J0337q426
1044A155p744P125K035m721N718K092j2415L58J4214m765j0692P873M561r137
1058d343J727Q885o990q152J1266P092j1613k195N387l619K263R871o991j2497
$$ plain form
1072 -9909 -2700 5922 -166 -1645 4970 -1671 -9510 2792 9399 -5440 -6973 6466 3534 -3617
1086 -3617 1511 608 -6147 1702 10255 -414 -7896 1886 2031 -5380 4080 8575 -7045 -7457 6604
1101 6604 2240 -8614 778 8615 -1831 -4646 3572 -2109 -6989 7413 9643 -5644 -4955 3104
1115 3104 -3031 -3202 9952 5980 -10065 -5116 7289 -2224 -7053 7922 6394 -8810 -3977 5091
1129 5091 -2835 -2159 9540 4129 -9000 -2748 4699 -1695 402 8963 -2616 -12164 2903 9354
1143 9354 -4333 -4620 5213 28 -6399 2900 4931 -6953 -4257 8279 2286 -5451 1127 2005 -3450
1158 -3450 2468 5983 -3837 -6111 4549 4427 -5707 -2476 4385 -772 -1392 5031 -495 -9102 -1533
1173 -1533 7822 3794 -2029 -3231 -3545 -1617 5841 6801 -1771 -4000 -268 -1128 -970 3327 1737 -2637
$$ packed form
1072i909P209Q622o088j479O615o641p839J2302O607j4839j533J3439k932p151
1086c617N128r03o755P849Q553j0669p482R782J45p411R460M495j5620m12J4061
1101F604m364j0854R392P837j0446k815Q218n681m880J4402K230j5287O89Q059
1115C104o135j71J3154l972j6045M949J2405r513m829J4975j528j5204M833R068
1129E091p926O76J1699n411j3129O252P447o394K097Q561j1579r548J5067O451
1143I354j3687k87R833n185o427R299K031j1884K696J2536n993p737O578Q78n455
1158c450N918L515r820k274J0660j22j0134L231O861n157o20O423n526q607P569
1173a533R355m028n823j202l14J928P458R60q572k229L732q60J58M297j590m374
$$ plain form
1189 -2637 -1985 1048 -496 -2150 1401 4714 1548 -2740 -4302 -2152 3085 4238 628 -282 -1793
1204 -1793 -2527 2003 5447 1072 -4020 -2520 567 -403 -852 733 -842 -360 2994 -191 -3694 1543
1220 1543 3992 -1472 -2729 1179 -353 -3663 2586 5675 -2923 -4894 4231 4046 -3520 -1341 92
1235 92 -3647 -742 4793 284 -5519 614 4977 -1109 -154 4423 -3161 -6042 4369 4754 -5620
1250 -5620 -3773 5821 2988 -3694 941 2969 -4090 -1211 5481 -2301 -7802 401 3958 -691 1274
1265 1274 3957 -2751 -3885 6134 5349 -7111 -4244 4670 -344 -4621 2947 2900 -4244 -529 6618
1280 6618 269 -6274 -246 2952 -2805 -1443 2369 -2588 -2397 6204 4768 -4477 -1830 4369 -54
1295 -54 -4335 1568 1325 -6206 -1198 7624 886 -5022 1269 4707 -951 -2046 839 -2149 -4261 2941
$$ packed form
1189b637O52L033j544j654L551L313l166m288j562K150N237J153l610r10j511
1204a793p34M530L444m375n092J500L087r70m49J585j575M82L354l185l503N237
1220A543K449n464j257L908j532l310O249L089q598j971R125j85p566K179J433
1235I2l739K905N535m509n803O133M363o086R55M577p584k881J0411L85j0374
1250e620J847R594k833o682M635K028p059K879O692p782n501Q203L557m649J965
1265A274K683o708j134J0019p85j2460K867Q914n014m277P568m7p144L715P147
1280F618o349o543O028L198n757J362L812m957J91Q601j436r245K647O199m423
1295e4m281N903k43p531N008Q822o738n908O291L438n658j095K885k988k112P202
$$ plain form
1311 2941 3760 -3736 -1333 5473 1818 -1840 2532 809 -5358 -2158 5037 -888 -7184 787 5853
1326 5853 -667 -1579 2877 -169 -3611 1824 3016 -3921 -4371 2883 2435 -1213 2450 2942 -3107 279
1342 279 5921 -1334 -7492 -1205 3364 -1919 -2727 3144 1333 -2934 3507 5753 -2960 -4513 1749
1357 1749 1430 -2684 -695 1065 -1885 -91 5657 1573 -4532 433 3770 -2413 -3191 1422 -1623
1372 -1623 -4281 2380 5680 -1593 -3843 3710 4174 -2655 -1449 838 -2885 -2247 2996 1325 -3008
1387 -3008 219 4655 749 -1736 1873 -1087 -5335 529 3659 -3642 -4792 3537 5252 -1129 -532
1402 -532 3735 -722 -3205 2552 1299 -5654 -2409 3314 956 -1398 1970 1163 -2368 1414 3789
1417 3789 -3570 -5907 2661 2751 -3983 -514 4271 -382 -1245 4770 3141 -5264 -2887 3622 -327 -3979
$$ packed form
1311B941Q19p496K403O806l655l658M372j723o167L200P195n925o296P971N066
1326E853o520r12M456l046l442N435J192o937m50P254m48l648L663M92o049L386
1342B79N642p255o158O287M569n283q08N871j811m267O441K246q713j553O262
1357A749l19m114J989J760k950J794N748m084o105M965L337o183p78M613l045
1372a623k658O661L300p273k250P553M64o829J206K287l723O38N243j671m333
1387c008L227M436l906k485L609k960m248N864L130p301j150Q329J715o381N97
1402e32M267m457k483N757j253o953L245N723k358k354L368q07l531L782K375
1417C789p359k337Q568R0o734L469M785m653q63O015j629q405K377O509l949l652
$$ plain form
1433 -3979 349 360 -2394 2368 4993 -1593 -3118 2999 1893 -4220 -1266 2581 -2586 -2730 4759 2474
1449 2474 -4274 254 5666 716 -3391 -468 -632 -2967 1017 3308 -2479 -3016 2811 2023 -469 1525
1465 1525 937 -3578 -1878 3266 376 -4305 241 4195 403 -1053 1537 107 -1618 1632 981
1480 981 -3253 -3133 234 1195 79 1085 1 -1599 1322 3115 -537 -3258 -318 1028 526 -401
1496 -401 -706 -634 -198 1368 2461 50 -2002 -1808 -276 853 -413 -1217 908 798 -482 -46 589
1513 589 611 1269 1585 -1318 -2820 -1212 1295 1384 1538 963 -2927 -2647 3114 2873 -1996 -1563 513 -1565
1531 -1565 -2435 1776 2363 -1307 1016 2658 -1724 -2972 1844 2049 -1154 529 279 -4098 -1222 5066
1547 5066 1901 -3927 -507 2697 -2183 -1554 3338 -504 -3925 1969 4156 -2164 -2763 2487 1241
$$ packed form
1433c979M328J1k754M762K625o586j525O117j106o113K954L847n167j44P489k285
1449B474o748M528N412m950m107K923j64k335L984K291n787n37N827p88k492J994
1465A525n88m515J700N144k890m681M546L954l792j456K590j430j725L250o51
1480I81m234J20L367R61j116J006j084j600K921J793l652k721K940J346n02r27
1496d01l05P2M36J566J093k411k052J94J532J129j266q04K125j10j280M36O35
1513E89K2O58L16k903j502J608K507Q9J54n75l890K80N761k41m869M33K076k078
1531a565q70M211N87l670K323J642m382j248M816K05l203J683k50m377K876O288
1547E066l165n828L420L204m880O29M892l842l421N894K187o320n99N250j246
$$ plain form
1562 1241 -1015 2881 1297 -5603 -1652 4484 212 -2861 2379 1378 -3714 -395 4101 -818 -3338
1577 -3338 3011 2613 -4477 -2013 2675 508 364 3448 -692 -5597 -191 4445 505 -1435 1569
1592 1569 -2001 -4685 2048 4455 -2001 -1956 2375 71 -3333 819 2535 -893 -472 2350 -1521 -3619
1608 -3619 2041 2911 -1359 3 996 -2561 -1674 2729 1017 -2815 -444 2703 -670 -1817 1289 291
1624 291 -884 2043 1839 -2259 -1544 1238 792 -426 1107 4 -2436 -158 2257 -1032 -1500 2145
1640 2145 1026 -2162 -876 501 -501 1025 2466 114 -2714 -773 1387 788 1595 1061 -3097 -2371
1656 -2371 2042 1442 -1196 -25 500 -1486 -848 1661 170 -1911 872 1889 -1393 -1353 654 -101
1672 -101 233 1981 -455 -3094 -129 2418 388 -1588 353 -74 -1876 890 2227 -1780 -2277 1258
$$ packed form
1562A241k256L896j584o900L951O136m272l073N240j001n092L319M496m919k520
1577c338O349l98p090K464M688k167j44L084m140m905N406M636l940j940L004
1592A569l570k684O733K407o456M5M331k304l404M152J716l428M21K822l871k098
1608c619N660Q70m270J362R93l557Q87M403j712l832K371L147l373j147L106r98
1624B91j175K927k04m098P15K782m46j218J533j103k440K278K415l289m68L645
1640B145j119l188J286J377j002J526J441k352k828J941K160n99Q07n34m158P26
1656b371M413o00k638J171N25j986O38K509j491k081K783J017l282M0K007p55
1672a01L34J748k436k639K965K547k030j976J941m27j802K766J337m007m97L535
$$ plain form
1688 1258 1031 -657 -70 137 -1093 226 2150 -215 -1811 818 1232 -914 -117 1503 -1015 -1330
1704 -1330 1263 782 -1839 -789 1693 457 -965 173 -383 -1061 1587 1227 -1120 -1157 736 207 -355
1721 -355 664 479 -1620 -720 1380 -172 -1461 -18 1023 -390 -380 -211 -743 -83 1294 241 -917
1738 -917 -200 704 155 509 703 -1037 -1344 1030 1444 -625 -680 -303 85 457 409 -411 -1205 345 1073
1757 1073 -219 -285 250 -328 406 1172 269 -1279 -350 1381 523 -825 -441 -278 -755 709 926 -917
1775 -917 -1051 446 507 103 38 138 -535 15 1657 -25 -1483 47 1267 -314 -203 417 -310 -485
1793 -485 686 648 -1185 -1396 911 667 -602 200 -355 -834 476 1477 -291 -1425 285 879 -190
1810 -190 -399 786 -441 -811 1177 564 -1447 -888 727 577 -564 -262 116 -662 416 1204 -519
$$ packed form
1688A258k27j688N87K07j230J319J924k365j596K629M14k146P97J620k518l15
1704a330K593m81k621J050K482j236j422J138n56o78K648l60k347l7J893n29n62
1721c55J019j85k099R00K100j552j289J443J041j413J0J69n32O60J377j053j158
1738i17P17R04n49L54J94j740l07K374M14k069n5L77L88L72m8q20p94J550P28
1757A073j292o6N35n78P34P66r03j548R29J731q58j348L84J63m77J464K17j843
1775i17j34J497O1m04o5J00o73N50J642j682j458J530J220j581J11O20p27j75
1793d85J171l8j833k11K307k44j269Q02n55m79J310J001j768j134J710N94j069
1810a90k09J185j227l70J988o13k011N59J615j50j141L02L78p78J078P88j723
$$ plain form
1827 -519 -1268 468 1039 -427 -299 499 -624 -637 1093 1192 -1254 -1287 926 800 -690 -237 82 -818 101
1846 101 848 129 -950 419 1171 -27 -249 357 -633 -779 1032 758 -1122 -887 1149 961 -621 -245
1864 -245 456 -748 -274 1254 -141 -1516 55 1276 323 -228 205 131 -736 885 737 -1218 -1095 1030
1882 1030 467 -961 -33 447 -375 -410 1126 110 -1678 -708 1200 -145 -882 379 106 -114 280 748
1900 748 -398 -934 761 721 -829 -692 325 -168 -241 1036 422 -1122 -18 1406 72 -1158 223
1917 223 706 -552 271 1439 -172 -1098 845 1143 -885 -742 153 -511 -779 824 553 -1522 -102
1934 -102 2298 353 -921 285 581 -821 -425 1200 -626 -1511 880 1410 -862 -687 908 -9 -722
1951 -722 767 280 -2072 -545 1804 61 -1377 1185 1253 -1119 145 1420 -817 -2109 1182 1055
$$ packed form
1827e19p49J736N71j466J28P98j123j3J730R9k446l3K213j26j490M53L19r00R19
1846A01P47p19j079J369P52j198k22O06r90j46J811k74j880K35K036j88j582L76
1864b45P01j204M74J528j395j375J571J221r53n51M33p4q67J621j48j955J23K125
1882A030n63j428R28M80q22l5J536j016j788R70J908j345p37J261k73k20L94M68
1900G48j146n36J695m0j550J37J017m93p3J277o14j544J104J424j334j230J381
1917B23M83j258Q23J168j611r26J943K98k028J43Q95o64k68J603k71k075J420
1934a02K400j945j274J206K96j402L96J625j826q85K391N30k272J75J595r17p13
1951g22J489m87k352J527K349j743j438K562O8k372J264J275k237j292L291j27
$$ plain form
1967 1055 -1165 -889 946 351 -127 1276 174 -2273 -487 1242 -233 -1213 783 76 -1090 272
1983 272 1707 -347 -1051 1493 768 -1759 -767 804 -241 -294 959 246 -917 91 1592 89 -1122
2000 -1122 -214 -672 -985 629 1273 -308 -564 927 738 -580 -250 589 -172 -878 -107 -247 -795 -144
2018 -144 816 534 -18 -191 135 78 -207 -68 -863 -690 405 718 -193 -266 328 834 182 -225 40 -745
2038 -745 -794 429 956 -349 -1107 551 423 -632 70 662 -110 -590 399 -211 -1193 497 1626 45
2056 45 -468 840 -246 -1090 755 1682 -1446 -2052 786 327 -1152 792 1389 -741 -637 1559 304
2073 304 -1824 378 1577 -1046 -1088 1212 -7 -1149 1589 1899 -1977 -1224 1387 -184 -1889 868
2089 868 1063 -2009 -659 2640 157 -1434 1165 1325 -1505 -787 1360 -1006 -1446 1483 1123 -1880
$$ packed form
1967A055k220K76J835n95m78J403j102k447J786J729j475r80J996p07j166J362
1983B72J435k054p04K544p25k527R92J571j045n3J253p13j163J008J501j503j211
2000a122R08m58l13J614O44j581k56J491j89j318L30Q39p61p06P71j40n48O51
2018a44R60k82n52j73L26n7k85J39p95J73J095L13r11p3N94N06o52m07K65p85
2038g45m9J223N27j305p58J658j28j055P02N92p72m80R89o10r82J690J129j581
2056D5n13J308j086q44J845R27l128o06K838m59j479J944N97k130J04K196j255
2073C04k128K202J199k623m2K300j219j142K738L10l876P53K611j571j705K757
2089H68J95l072J350L299k483j591K599J60k830P18K147k366m40K929l60l003
$$ plain form
2105 -1880 -273 1846 -440 -1377 1353 326 -2394 93 1940 -617 -1755 1321 1366 -1183 729 1412
2121 1412 -999 -1037 1451 231 -1862 516 1352 -445 -397 1305 -6 -1649 930 1284 -1378 -1302 799
2138 799 123 -872 733 792 -809 7 1367 48 -959 286 632 -687 128 578 -868 -828 1030 844
2156 844 -821 -639 439 -305 -281 234 -5 -538 159 961 75 -335 -379 178 115 21 -686 -662 -182 440 566
2177 566 283 -411 -544 285 763 95 -319 -129 -384 -173 633 97 -707 286 942 -136 -726 19 264 -357
2197 -357 -32 482 -675 -881 737 622 -348 -114 223 -416 -80 624 -111 -1020 430 1530 -474 -302
2215 -302 644 263 -601 716 607 -1239 -860 898 620 -1160 85 674 -843 72 1016 -710 -1127 872
2233 872 858 -1154 -654 965 -89 -516 932 358 -1568 -285 1133 223 -1010 -114 276 -635 197 982
$$ packed form
2105a880J607K119k286r37K730j027k720K487J847k557j138L076M5k549J912O83
2121A412k411l8K488j220k093K378Q36j797M8J702j311j643K579L54k662P6K101
2138G99o76r95J605N9j601Q16J360j319j007J245L46j319Q15M50j446M0J858j86
2156H44j665J82J078p44K4N15k39n33O97Q02q86m10m4N57o3r4p07K4M80O22J26
2177E66k83o94j33Q29M78o68m14J90k55K11Q06n36q04R93O56j078n90P45K45o21
2197c57L25N14j157k06J618j15r70K34L37o39L36P04p35r09J450J100k004J72
2215c02R46l81q64J317j09j846L79J758k78j780J245N89j517R15R44j726m17J999
2233H72j4k012N00J619j054m27J448n74j926J283J418r10j233Q96L90r11Q32P85
$$ [...]
8191e5
##END NTUPLES=NMR FID
##END=
