##TITLE=1H_Ser AmS-EA
 200.13MHz,CDCl3+DMSO.
 8 sc
 
11.3.2026
##JCAMPDX= 6.0         $$ Bruker NMR JCAMP-DX V2.0
##DATA TYPE= NMR FID
##DATA CLASS= NTUPLES
##ORIGIN= UXNMR, Bruker Analytische Messtechnik GmbH
##OWNER= pz
$$ XWIN-NMR		Version 3.5
$$ Wed Mar 11 15:22:24 2026 Russian Standard Time (UT+4h)  she@DPX200
##.OBSERVE FREQUENCY= 200.1313
##.OBSERVE NUCLEUS= ^1H
##.DELAY= (6, 6)
##.ACQUISITION MODE= SIMULTANEOUS
##.ACQUISITION SCHEME= undefined
##.AVERAGES= 8
##.DIGITISER RES= 18
##SPECTROMETER/DATA SYSTEM= spect
##.PULSE SEQUENCE= zg30
##.SOLVENT NAME= CDCl3
##.SHIFT REFERENCE= (INTERNAL, CDCl3, 0, 14.3821)
##AUDIT TRAIL= $$ (NUMBER, WHEN, WHO, WHERE, WHAT)
$$ ##TITLE= Audit trail, XWIN-NMR		Version 3.5
$$ ##JCAMPDX= 5.01
$$ ##ORIGIN= Bruker BioSpin GmbH
$$ ##OWNER= she
$$ F:/spectra/data/she/nmr/H-C/1/audita.txt
$$ ##AUDIT TRAIL=  $$ (NUMBER, WHEN, WHO, WHERE, WHAT)
(   1,<2026-03-11 15:21:03.65 +0400>,<she>,<DPX200>,
      <created by zg, POWCHK disabled, PULCHK disabled
       configuration hash MD5:
       00 E9 B6 7A A2 85 ED C7 34 08 36 98 17 FE 4E 26
       data hash MD5: 16K
       47 A4 A0 BF BE 9D 23 3F 02 1E 71 EB 29 74 A4 8C>)
$$ ##END=
$$ 
$$ hash MD5
$$ 6F 54 19 91 21 0E EE FD 39 86 BA F6 A5 B0 AE E1
##$RELAX= 
##$RELAX= 
##$RELAX= 
##$RELAX= 
##$RELAX= 
##$RELAX= 
$$ Bruker specific parameters
$$ --------------------------
##$DU= <F:/spectra>
##$EXPNO= 1
##$NAME= <H-C>
##$PROCNO= 1
##$TYPE= <nmr>
##$USER= <she>
##$AMP= (0..31)
100 100 100 100 100 100 100 100 100 100 100 100 100 100 100 100 100 100 
100 100 100 100 100 100 100 100 100 100 100 100 100 100 
##$AQSEQ= 0
##$AQ_mod= 1
##$AUNM= <au_zg>
##$AUTOPOS= <>
##$BF1= 200.13
##$BF2= 200.13
##$BF3= 200.13
##$BF4= 200.13
##$BF5= 200.13
##$BF6= 200.13
##$BF7= 200.13
##$BF8= 200.13
##$BYTORDA= 1
##$CFDGTYP= 0
##$CFRGTYP= 5
##$CHEMSTR= <none>
##$CNST= (0..31)
1 1 145 1 1 1 1 1 1 1 1 1 1 1 1 1 1 1 1 1 1 1 1 1 1 1 1 1 1 1 1 1 
##$CPDPRG= <>
##$CPDPRG1= <>
##$CPDPRG2= <>
##$CPDPRG3= <>
##$CPDPRG4= <mlev>
##$CPDPRG5= <mlev>
##$CPDPRG6= <mlev>
##$CPDPRG7= <mlev>
##$CPDPRG8= <mlev>
##$CPDPRGB= <>
##$CPDPRGT= <>
##$D= (0..31)
0 0.7 0 0 0 0 0 0 0 0 0 0.03 0 0 0 0 0 0 0 0 0 0 0 0 0 0 0 0 0 0 0 0 
##$DATE= 1773228063
##$DBL= (0..7)
120 120 120 120 120 120 120 120 
##$DBP= (0..7)
150 150 150 150 150 150 150 150 
##$DBP07= 0
##$DBPNAM0= <>
##$DBPNAM1= <>
##$DBPNAM2= <>
##$DBPNAM3= <>
##$DBPNAM4= <>
##$DBPNAM5= <>
##$DBPNAM6= <>
##$DBPNAM7= <>
##$DBPOAL= (0..7)
0.5 0.5 0.5 0.5 0.5 0.5 0.5 0.5 
##$DBPOFFS= (0..7)
0 0 0 0 0 0 0 0 
##$DE= 6
##$DECBNUC= <off>
##$DECIM= 32
##$DECNUC= <off>
##$DECSTAT= 4
##$DIGMOD= 1
##$DIGTYP= 9
##$DL= (0..7)
0 120 120 120 120 120 120 120 
##$DP= (0..7)
150 150 150 150 150 150 150 150 
##$DP07= 0
##$DPNAME0= <>
##$DPNAME1= <>
##$DPNAME2= <>
##$DPNAME3= <>
##$DPNAME4= <>
##$DPNAME5= <>
##$DPNAME6= <>
##$DPNAME7= <>
##$DPOAL= (0..7)
0.5 0.5 0.5 0.5 0.5 0.5 0.5 0.5 
##$DPOFFS= (0..7)
0 0 0 0 0 0 0 0 
##$DQDMODE= 0
##$DR= 18
##$DS= 0
##$DSLIST= <SSSSSSSSSSSSSSS>
$$ [...]
##$SUBNAM0= <"">
##$SUBNAM1= <"">
##$SUBNAM2= <"">
##$SUBNAM3= <"">
##$SUBNAM4= <"">
##$SUBNAM5= <"">
##$SUBNAM6= <"">
##$SUBNAM7= <"">
##$SUBNAM8= <"">
##$SUBNAM9= <"">
##$SW= 18.0517328524113
##$SWIBOX= (0..15)
0 0 2 0 0 0 0 0 0 0 0 0 0 0 0 0 
##$SW_h= 3612.71676300578
##$TD= 16384
##$TD0= 1
##$TE= 0
##$TE2= 300
##$TE3= 300
##$TEG= 300
##$TL= (0..7)
0 120 120 120 120 120 120 120 
##$TP= (0..7)
150 150 150 150 150 150 150 150 
##$TP07= 0
##$TPNAME0= <>
##$TPNAME1= <>
##$TPNAME2= <>
##$TPNAME3= <>
##$TPNAME4= <>
##$TPNAME5= <>
##$TPNAME6= <>
##$TPNAME7= <>
##$TPOAL= (0..7)
0.5 0.5 0.5 0.5 0.5 0.5 0.5 0.5 
##$TPOFFS= (0..7)
0 0 0 0 0 0 0 0 
##$TUNHIN= 0
##$TUNHOUT= 0
##$TUNXOUT= 0
##$USERA1= <user>
##$USERA2= <user>
##$USERA3= <user>
##$USERA4= <user>
##$USERA5= <user>
##$V9= 5
##$VALIST= <valist>
##$VCLIST= <CCCCCCCCCCCCCCC>
##$VD= 0
##$VDLIST= <DDDDDDDDDDDDDDD>
##$VPLIST= <PPPPPPPPPPPPPPP>
##$VTLIST= <TTTTTTTTTTTTTTT>
##$WBST= 1024
##$WBSW= 4
##$XGAIN= (0..3)
0 0 0 0 
##$XL= 0
##$YL= 0
##$YMAX_a= 176924
##$YMIN_a= -222308
##$ZGOPTNS= <>
##$ZL1= 120
##$ZL2= 120
##$ZL3= 120
##$ZL4= 120
##$ABSF1= 10
##$ABSF2= 0
##$ABSG= 5
##$ABSL= 3
##$ALPHA= 0
##$AQORDER= 0
##$ASSFAC= 0
##$ASSFACI= 0
##$ASSFACX= 0
##$ASSWID= 0
##$AUNMP= <proc_1d>
##$AZFE= 0.1
##$AZFW= 0.1
##$BCFW= 1
##$BC_mod= 2
##$BYTORDP= 1
##$COROFFS= 0
##$CY= -3
##$DATMOD= 1
##$DC= 2
##$DFILT= <>
##$DTYPP= 0
##$F1P= 0
##$F2P= 0
##$FCOR= 0.5
##$FTSIZE= 0
##$FT_mod= 4
##$GAMMA= 1
##$GB= 0.15
##$INTBC= 1
##$INTSCL= 1
##$ISEN= 128
##$LB= 0.25
##$LEV0= 0
##$LPBIN= 0
##$MAXI= 10000
##$MC2= 0
##$MEAN= 0
##$ME_mod= 0
##$MI= 1.114404
##$NCOEF= 0
##$NC_proc= 0
##$NLEV= 6
##$NOISF1= 3.799351
##$NOISF2= 2.8
##$NSP= 1
##$NTH_PI= 0
##$NZP= 0
##$OFFSET= 14.38212
##$PC= 1
##$PHC0= -3699.217
##$PHC1= 5.592319
##$PH_mod= 1
##$PKNL= yes
##$PPARMOD= 0
##$PSCAL= 0
##$PSIGN= 0
##$REVERSE= no
##$SF= 200.129724274929
##$SI= 16384
##$SIGF1= 3
##$SIGF2= 2
##$SINO= 400
##$SIOLD= 16384
##$SREGLST= <1H.CDCl3>
##$SSB= 0
##$STSI= 0
##$STSR= 0
##$SW_p= 3205.1282051282
##$SYMM= 0
##$S_DEV= 0
##$TDeff= 0
##$TDoff= 0
##$TI= <>
##$TILT= no
##$TM1= 0
##$TM2= 0
##$TOPLEV= 0
##$USERP1= <user>
##$USERP2= <user>
##$USERP3= <user>
##$USERP4= <user>
##$USERP5= <user>
##$WDW= 1
##$XDIM= 8192
##$YMAX_p= 0
##$YMIN_p= 0
$$ End of Bruker specific parameters
$$ ---------------------------------
##NTUPLES= NMR FID
##VAR_NAME=  TIME,          FID/REAL,        FID/IMAG
##SYMBOL=    X,             R,               I
##VAR_TYPE=  INDEPENDENT,   DEPENDENT,       DEPENDENT
##VAR_FORM=  AFFN,          ASDF,            ASDF
##VAR_DIM=   8192,          8192,            8192
##UNITS=     SECONDS,       ARBITRARY UNITS, ARBITRARY UNITS
##FACTOR=    0.0002768,     1,               1
##FIRST=     0,             0,               0
##LAST=      2.2672688,     0,               0
##MIN=       0,             -222308,         0
##MAX=       2.2672688,     176924,          0
$$ Real data points
##PAGE= N=1
##DATA TABLE= (X++(R..R)), XYDATA
$$ [...]
1844f2L19j46j191J220J02j166P88m09O23O80j244L09J006r76L37k2l61P16r78
$$ -62 257 111 -1080 140 242 -924 -136 -545 78 758 -486 -177 829 -147 190 168 -193 523 -455
1863d55m20J288q59M01N44q72P38j95l81Q44q08l5R41q87j93K00l98R24m38q23
$$ -455 -875 413 -446 -45 499 -373 365 170 -211 633 -175 -210 731 -156 -349 -149 -547 377 -61 -884
1883h84J374j00n53O32o21O76K00j466O24M98q12K79l52j4J034j082M27R20j209
$$ -884 490 390 -163 469 -152 524 724 -742 -118 380 -432 -153 -505 -519 515 -567 -140 780 -429
1902d29O40O42j155O14l02k33O61j273L04J038p25o7K36j45J039o42r96J565k78
$$ -429 211 853 -302 312 10 -223 438 -835 -531 507 -218 -285 -49 -194 845 203 -793 772 494
1921D94o66K56n56N55J46j170Q56n3l75R90l77j22P08p67K04L51j230O60N19j207
$$ 494 -172 84 -472 83 229 -941 -85 -138 -513 477 100 -22 686 -81 123 474 -756 -96 423 -784
1941g84R82n51L5J028j476N40Q99o17N7N0l68R79r53p99J393n96ON89j196R87
$$ -784 198 -353 -318 710 -766 -226 673 56 113 163 -205 774 -179 -978 415 -181 -175 414 -782 205
1961B05N18j048P66j06m22O53m45r7l0m68O07k0j014Q43L11l88K30j62L51P36
$$ 205 723 -325 441 335 -87 566 121 24 -6 -474 133 113 -901 -58 253 -135 95 -67 284 1020
1981A020j549N01M23o47M55m86k79Q90n34k46P37k74K70J86q20P07j67n43R17
$$ 1020 -529 -28 395 -252 203 -283 -562 328 -206 -452 285 11 281 467 -353 354 187 -356 561
2000E61p73k77Q06m54r5J85o20J070j34o08P49k12m7K03j004P41N09j227K73L52
$$ 561 -212 -489 317 -137 -232 -47 -667 403 269 -339 410 198 151 354 -650 91 600 -627 -354 -2
2020bo04Q53l46PQ72r81J98K22o76O08L24q16L87n57l6R87p41%P50n94L05m47
$$ -2 -606 247 -99 -92 780 -201 -3 219 -457 151 475 -341 46 -511 -547 440 -301 -301 449 -145 160 -287
2042b87j45J412o01q24P83l97j90J82o16O52K67m86O88o33rJ036p29j91P12j047
$$ -287 -432 980 379 -445 338 -59 -249 -67 -683 -31 236 -250 438 -195 -204 832 103 -88 624 -423
2062d23M10J34q11O88n6oM61j032O69Q68j145K39P16o58M20m89m52O78l33k29
$$ -423 -13 121 -690 -2 -58 -64 397 -635 34 902 -243 -4 712 54 474 -15 -467 211 -122 -351
2082c51N42q88Q79M64j294P80M83r14P03l62m41P12n19L70m4p16P52j25p07J124
$$ -351 191 -697 182 646 -648 132 615 -299 404 42 -399 313 -206 164 120 -596 156 31 -676 448
2102D48k12l18P99r87J82N55o22J23n4j66Q13r36m27J511p29k23P88o01L17J08
$$ 448 236 -82 717 -270 -88 467 -155 -32 -86 -252 561 -375 -802 709 -20 -243 545 -56 261 369
2122C69p46M43l34K06L29j061M94N81q70P49P1n40O09k3l51L44l26J28J85q87
$$ 369 -377 66 -268 -62 267 -794 -300 281 -589 160 231 -309 300 277 -74 270 -56 72 257 -630
2142f30K20P76r05O98m0m71J054o81k91N53k63P3P7n47O23l21o28J047n86j76
$$ -630 -410 366 -539 159 119 -352 702 21 -270 283 20 93 170 -377 246 -75 -703 344 -242 -418
2162d18Q96n62L13j12l58O31k67m18O12n03k61N96j009O89O05p56J81N24k94M04
$$ -418 478 -84 229 117 -241 390 123 -295 317 -186 -447 149 -860 -171 434 -322 -141 383 89 493
2182D93q11K64P30r39Q7O90j159O53k6o52J127m81k52P85o83K65M75n25K78l92
$$ 493 -318 -54 676 -263 -176 514 -645 8 -18 -670 457 -24 -276 509 -174 91 566 41 319 -73
2202g3n42J144n22o26Q16k57n6M19n64O41J09p89P45j79m95M46o64L44M28q11
$$ -73 -615 529 7 -619 197 -60 -116 303 -261 380 489 -300 445 266 -229 217 -447 -103 325 -486
2222d86L3N79l91N72p9k28P39j001j3R78j097J41O84q99L14r8l51J091p33N8O14
$$ -486 -453 126 -265 307 228 0 739 -262 -275 703 -394 -253 431 -468 -154 -252 -603 488 -245 -187 427
2243D27l03K76j62o31N55J01r69Q07l96O4M87o18L72M74p18O73q4n76L18j13l38
$$ 427 124 400 238 -393 162 263 -706 101 -295 -231 256 -362 10 484 -234 439 355 -221 97 -16 -354
2264c54O86p17L05K76q63N09L46k87N20n15k45J013q63p0K40k81K52q5m45P09
$$ -354 332 -385 -80 196 -667 -158 188 -99 421 -94 -339 674 -189 -259 -19 -300 -48 -133 -578 131
2284A31p9n18P96k52k37M81k54J84k0p07Q20k70l77M52l82K23M30p82P72J95o98
$$ 131 52 -466 330 78 -159 322 68 252 232 -475 345 75 -302 150 -232 -9 421 -361 411 606 -92
2305i2L42k08j5K33m85o6N07m87M3M27k53K18j10n42J134o52j61N83m57K0K01
$$ -92 250 42 27 260 -225 -291 216 -271 -228 199 -54 164 54 -488 646 -6 -167 416 -41 -21 180
2326A80n94O05j48o30R61k89l25N02k08J74J36m58M35J08j036R07m00j03L66o49
$$ 180 -414 191 43 -587 374 85 -240 262 54 228 364 -94 341 449 -587 320 -80 -183 183 -466
2346d66N46N3m15N12j1n91N72j40j59L54n60O7M79n22R3K29j82O33m06m75J102
$$ -466 80 133 -282 230 219 -372 200 60 -99 255 -305 -238 241 -281 -188 41 -141 492 86 -389 713
2367G13m89l88M98m00L34p1p55P03k38l00P40l97J08L83m43L45K06q74N24Q4m88
$$ 713 224 -164 334 -66 268 197 -558 145 -93 -393 347 -50 58 441 -2 343 549 -325 199 283 -205
2388b05M82k80m0M62q22P1N75l05N7J56j68M47m70k92N95n42Q8L85m17L36k45
$$ -205 277 -3 -43 419 -403 -332 243 -62 -5 151 -17 430 -40 -332 263 -279 -191 194 -223 113 -132
2409a32m17O07rj92N30k45KK10o37N31j42k93L77k04j0K66m31O6N55n59N08j20
$$ -132 -549 58 49 -143 387 142 144 354 -283 248 106 -187 190 -14 -24 242 -189 -123 432 -127 381 261
2431B61m38M64n03r1N96n28k43O16l94L89j00j06N22n25k29R87o96j19K47l70
$$ 261 -177 287 -216 -307 289 -239 -482 134 -260 129 29 -77 445 -80 -309 678 -18 -137 110 -260
2451b60P7Q1l59Q02l80k21M80N7j14R7l57J19K17n97L62K96n86L78m07K24K91
$$ -260 -183 -102 -461 341 -39 -260 220 277 163 260 -97 22 239 -358 4 300 -286 92 -315 -91 200
2472B00m86M87P5m94M27p6l57N92l69n04P18n62M09m7n11Q03k00l43O66n74K5
$$ 200 -286 201 276 -218 209 133 -224 368 -1 -505 213 -349 60 13 -498 305 105 -238 428 -146 -121
2493a21N79p51L65J27m13O9O3l21M57l65N3Q41q78L94N63q57K77K07n21K14k83
$$ -121 458 -293 72 199 -214 -145 -82 -403 54 -311 -258 583 -295 99 662 -195 82 289 -232 -18 -301
2514c01J7N75l99O0M01o36M92p2k28M48j71o0J22l27r1L48q02P02j30l16O83k66
$$ -301 -284 291 -108 -48 353 -283 209 137 -91 357 186 126 248 -79 -170 178 -624 78 -52 -368 315 49
2536D9l80P40j97r7K65o92M05j00l25L97j56k12P00l47k71O35n09J84K24l32q0
$$ 49 -331 409 212 115 380 -312 93 -7 -332 65 -91 -303 397 50 -221 414 -95 89 313 -19 -99
2557i9n9r7N04n48o1L85k09L55ok57K24J13l80M83m30j49L08k82L68L4q76O44
$$ -99 -158 -255 249 -299 -360 25 -184 171 165 -92 132 245 -135 348 -82 -231 77 -205 163 197 -679 -35
2579c5J52m85N17M7j10K57l68J44K52q98N24J27l46L38k90m12Q14k86L7M02m88
$$ -35 117 -368 149 196 86 343 -25 119 371 -527 -3 124 -222 116 -174 -586 228 -58 -21 381 -107
2600a07L32j86l27O06k73n04P03m83q8L10j75M60j49r6L17m22n7M72m51J51J83
$$ -107 225 39 -288 318 45 -459 244 -239 -327 -17 -192 268 119 23 340 -82 -139 333 -118 33 216
2621B16m07p4M37o13M35M7j88M48l40J13M23q34M79K35o04J94o9k98N39l32jL38
$$ 216 -191 -265 172 -441 -6 41 -147 301 -39 74 497 -337 142 377 -227 -33 -102 -400 139 -193 -194 144
2643A44m37K63K98l80K07P3n19P33k20q01Q55m15N9j72J02N90k67l62O12k01l20
$$ 144 -293 -30 268 -112 95 168 -351 382 162 -639 216 -199 -140 -312 -210 380 113 -249 363 162 -158
2664a58O12n36R6J60n63K79K64l96M30k10M8J43j57L0N94r49L29l1j82K59j75
$$ -158 454 -82 14 174 -389 -110 154 -242 188 -22 26 169 12 42 636 -313 16 -15 -197 62 -113
2685a13j26M95l96J21J42r4L37l07k04M88k15k67K25j80PK97n91K96K28n44P02
$$ -113 -239 256 -140 -19 123 29 366 59 -145 343 128 -139 86 -94 -87 210 -381 -85 143 -401 301
2706C01k15k92O69n44o4K10m25K24L27o45K01K64k66N47l41m5N33l04j80K59m27
$$ 301 86 -206 463 -81 -145 65 -360 -136 191 -454 -253 11 -255 292 -49 -94 439 135 -45 214 -213
2727b13M80l92j19M26j76m47P70n81K13N03p03O57j69n99N93j82r4J46m43M76
$$ -213 267 -125 -244 182 6 -441 329 -252 -39 464 -239 418 249 -350 243 61 -33 113 -330 146
2747A46r2m50N04J19m86N19j78j81L42k94J66N2l91K26K8j96L54k08k89P77n07
$$ 146 54 -396 108 227 -259 260 82 -99 243 -51 115 167 -224 2 30 -166 188 -20 -309 468 -39
2768c9J01L21l92n6J72o1K12k16l40K90j74l4K46k62K49Q3j84L73j69l29L24k07
$$ -39 62 383 -9 -65 107 46 258 42 -298 -8 -182 -216 30 -232 17 100 -84 289 120 -209 115 -92
2790i2n2L92o04L29K64n11L11j30L4L83m70L36K67n33J27K04l75J65j97j70O56
$$ -92 -144 248 -356 -27 237 -274 37 -93 -59 324 -146 190 457 -76 51 255 -120 45 -152 -322 334
2811C34n21N6L30k85K93J2l30L21l38l51O44j81k00K06j86M7O2n0M17o5l56K68
$$ 334 -187 -131 199 -86 207 219 -111 210 -128 -479 165 -16 -216 -10 -196 -149 -87 -137 280 215 -141 127
2833A27J88l02L47o33L42O3n02K02L54l43L83n27J00O32l48P3J30l20R4J05n11
$$ 127 315 13 360 -273 69 132 -370 -168 186 -157 226 -301 -201 431 83 156 286 -34 60 165 -346
2854c46N34q9l27O22m62R3O7l69L62J46m23K34n0m31N72k57l9L87m52J03L29m30
$$ -346 188 99 -228 394 -68 25 92 -277 85 231 -192 42 -8 -439 133 -124 -163 224 -228 -125 204 -226
2876b26N66l61j85N60m41J28M48o06Q2N9m38L88L6k75M29rk94M62k86M4J24l59
$$ -226 340 -21 -206 354 -87 41 489 -117 -35 24 -414 -26 10 -265 164 155 -139 323 37 81 205 -154
2898a54L34J4l45m4J85o4L13m21L74n6l39K76J07l86N13l86p1K96m83L68J27k78
$$ -154 180 194 -151 -195 -10 -74 239 -182 192 136 -203 73 180 -206 307 -79 -150 146 -337 31 158 -120
2920a20j7N35n37K06k44ON03l85O6L60m97K37j03P8J95k61k22L88r7k52L96l66
$$ -120 -137 398 -139 67 -177 -171 332 -53 13 373 -124 113 10 88 283 22 -200 188 91 -161 235 -131
2942a31L95j59m89M17J73m64M13m50K4K25j95M55J07l35J31r0j30L35k71K33m1
$$ -131 264 105 -384 33 206 -258 155 -295 -271 -46 -241 214 321 -14 117 27 -103 232 -39 194 153
2963A53m12L24J35l23J05O8K8J24q2j06O5n4J9q8j58M43k50l05M65j06k31K89
$$ 153 -259 65 200 -123 -18 50 78 202 120 14 79 25 44 -44 -202 241 -9 -314 151 45 -186 103
2985A03p6J27o9k03J66Q2m07L97P0l44L13m65R0L16k86K67K98l68m1J38j06L56
$$ 103 27 154 85 -118 48 130 -277 120 190 -154 159 -306 -216 100 -186 81 379 11 -30 108 2 358
3007C58o46N2M13n51M11P6l17M31k14j2K47l13J69r7M7j86J67m34M37j01k61L39
$$ 358 -288 -236 177 -374 37 113 -204 227 13 1 248 -65 104 7 54 -132 35 -399 38 -63 -324 15
3029A5K84l74K4k31O64o7n09L08k35J15j82K35j16L10k79j30K10J02j38j90o3
$$ 15 299 -75 -51 -282 382 315 -194 114 -121 -6 -188 47 -69 241 -38 -168 42 144 6 -184 -247
3050b47O31k95m32L41j33M2K48k67N3K4j50L80j61o4K45j92J41M3m71J80L84n59
$$ -247 384 89 -343 -2 -135 -93 155 -112 -59 -35 -185 195 34 -30 215 23 164 207 -264 -84 300 -259
3072b59K15n5L3J39j04oK66m48M65l9k45J84j14k17K47j53M7P2j44J64k7M0L13
$$ -259 -44 -99 -66 73 -31 -37 229 -219 246 207 -38 146 32 -185 62 -91 -44 28 -116 48 21 61 374
3095C74m30j28L75l05M7K94k59n1J23j15K63j47l19M16j9j56N4R3j33L9j4o1P9
$$ 374 -56 -184 191 -114 -67 227 -32 -83 40 -75 188 41 -278 138 119 -37 17 110 -23 16 2 -59 20
3118B0o1k85J89J0M07l13l4L30l35L2J94r9o8j18k5K00k63J69L15m36L95m38j89
$$ 20 -41 -326 -137 -127 280 -33 -67 263 -72 -40 154 55 -13 -131 -156 44 -219 -50 265 -171 224 -214 -403
3141d03N75j80k53M63j92o3J4k15L76J29k86RL2r1K22j69q4L71m32pQ4r8K27p6
$$ -403 172 -8 -261 202 10 -53 -39 -254 122 251 -35 -26 6 -85 137 -32 -116 255 -177 -184 -100 -198 29 -47
3165d7K3RO1j63K39l66J85P5l0J27j23k9J73q6j81K58l18L15Q4m82J85L67k33
$$ -47 -24 -15 46 -117 122 -244 -59 16 -14 113 -10 -39 134 48 -133 125 -193 122 206 -276 -91 276 43
3188D3J0n7J07lp4k93N23l93K81N2n12M23Qj33K91j73Q1J32m92J62O0j44K93l26
$$ 43 53 -4 103 100 26 -267 256 -137 144 196 -316 107 115 -18 273 100 181 313 -179 -17 43 -101 192 -134
3212a34j95M06l08L2M03j65J95o4j11M7R9l98L21m11P2N4J99l5p7jK38l8j83M25
$$ -134 -329 77 -231 -199 204 39 234 170 59 106 205 -193 128 -283 -211 -157 42 7 -70 -71 167 129 -54 371
3236C71n15L26K2l84m0K38k66Q2Q5O4P6Pj18J59j92J76k3k02J14n8p8K44k34o1
$$ 371 -144 182 204 -180 -220 18 -248 -166 -81 -17 59 66 -52 107 -85 91 68 -134 -20 -78 -156 88 -146 -207
3260b07J41L6J33J39m57K73k9R8Rk12J51R8m33R7L31m19K97j09j19K85k85j98
$$ -207 -66 -30 103 242 -215 58 29 127 136 -76 75 173 -260 -163 168 -251 46 -63 -182 103 -182 -380
3282c80M78N4j31J92m75J45R0k94K98K1j31J19J16k05R6J17pj95O4p0P8r4J40
$$ -380 98 152 21 213 -262 -117 -27 -321 -23 -2 -133 -14 102 -103 -7 110 103 -92 -28 -98 -20 -114 26
3305B6q7P4l9m4R0K08k65L5J33m5J06k99Q5L01n48K08J80l48L77l7j90L24k50
$$ 26 -61 13 -26 -70 20 228 -37 -2 131 86 192 -107 -22 279 -269 -61 119 -229 148 111 -79 245 -5
3328eJ26J09k63n7P2k8K90l47J14J05j15k46J69R9l1M8k00M53k98p9K21j33l20
$$ -5 121 230 -33 -90 -18 -46 244 -103 11 116 1 -245 -76 23 -8 40 -160 293 -5 -84 137 4 -316
3351c16O31m44J46L1n9P8q2J14om2j26L5P7k00K95m71K74Q6o3O3l0j23L55l92
$$ -316 315 -129 17 48 -11 67 -15 99 93 51 -75 -40 37 -163 132 -339 -65 21 -42 21 -9 -132 223 -169
3375a69K82J88n32J82J10j78K42k57j36M18R0n6j12j2O2J00l53L09j55k73K92
$$ -169 113 301 -231 -49 61 -117 125 -132 -268 150 240 184 72 60 122 222 -131 178 23 -250 42
3396D2j87J61J19k67K13j84P6R5r0j55L90l82K47l1Kk29L74k89L0J47j04K18l36
$$ 42 -145 16 135 -132 81 -103 -27 68 -22 -177 213 -169 78 47 49 -180 194 -95 -65 82 -22 196 -140
3419a40NK17k45J98J01k26K11p7j78K34m3l56J28J45k0J87l6l7k74o7M44R9l80
$$ -140 -135 82 -163 35 136 -90 121 44 -134 100 57 -299 -171 -26 -46 141 105 68 -206 -273 171 270 -110
3442a10J4R4J03j21n3J40J5j35J13k29J08K40l54J85P7j51J44j06K9J16j8k87
$$ -110 -96 -2 101 -20 -73 67 82 -53 60 -169 -61 179 -175 10 87 -64 80 -26 3 119 101 -186
3464a86L97k5l71K38k21K00n7J1J1j37O7J31j74L0J26r4P6K7k64L75q7p1J99o1
$$ -186 211 186 -185 53 -168 32 -25 -14 -3 -140 -73 58 -116 -86 40 -54 22 49 -215 160 73 2 201 140
3488A40j26p2J6n0K06k73Q8P6j74L85k94j96M13m48J88K6P5J10j88j1O1p2O1L00
$$ 140 14 -58 -42 -92 114 -159 -71 5 -169 216 -78 -274 139 -309 -121 -95 -20 90 -98 -109 -48 -120 -59 241
3512B41j98j08Q5r5PL7knl3m6J29l1K19k54j10K01O3j30J11j85j29K21j65L28
$$ 241 43 -65 20 -75 -68 -31 -33 -38 -71 -117 12 -19 200 -54 -164 37 100 -30 81 -104 -233 -12 -177 151
3536A51l58J35J35K0k07J48R8n41O18k59J00N3rn3J52l63J52j46J18l2P2M8J23
$$ 151 -207 -72 63 83 -124 24 122 -419 199 -60 40 93 84 31 183 -180 -28 -174 -56 -88 -16 32 155
3559A55l37P5K07j94J06k78K05K8PR8j33j92K24J19j90L9m9J04K34j34l11J5K12
$$ 155 -182 -107 100 -94 12 -266 -61 -33 -26 72 -61 -253 -29 90 -100 -61 -110 -6 228 94 -217 -202 10
3582A0P8k83Q4LL26l38O0O1j18K15j31J11M5k51L96l05k05J88P4j07K30k06J1
$$ 10 88 -195 -111 -108 218 -120 -60 1 -117 98 -33 78 123 -128 268 -37 -242 -54 20 -87 143 -63 -52
3605e2k0J29r1J58n6O1k56J36J8k18K39J97j17j49R0m1J28k4k91K84r8p3K02j97
$$ -52 -72 57 -34 124 68 129 -127 9 27 -191 48 245 128 -21 69 28 156 132 -159 125 27 -46 156 -41
3629d1M2j16J09O7l2j0K5j58K49j18k74K91J45k33k0K1m9K54j6k46K0J77j04K79
$$ -41 1 -115 -6 61 29 19 44 -114 135 17 -257 34 179 -54 -74 -53 -102 152 136 -110 -90 87 -17 262
3653B62l34L06k96j23M03j12j95J74k29J7R0R2j25J6J3O7N0l92L00k29J39J96
$$ 262 -72 234 -62 -185 218 106 -89 85 -144 -127 -37 55 -70 -54 -41 26 76 -316 -16 -245 -106 90
3675I0j75K63j5o2K2j29P8N7j25j69P5p2J19M4rQ7k49P0L96m01k6K57j19j46J92
$$ 90 -85 178 163 101 123 -6 72 129 4 -165 -90 -162 -43 1 -8 79 -170 -100 296 -105 -131 126 7 -139 53
3700E3j79P9O2j43Q8Kk9K16l68Q6K69j88KJ55k49M53l34j13R4Qk1J35j51O1m4
$$ 53 -126 -47 15 -128 -40 -38 -67 149 -219 -133 136 -52 -50 105 -144 309 -25 -138 -44 -36 -57 78 -73 -12 -56
3725e6l3J86j00j03J66j61M6R9n5K3J8j76J63k23M19m9j22k18Q8M2Q5J09j83K79
$$ -56 -89 97 -3 -106 60 -101 -55 44 -11 12 30 -146 17 -206 213 164 42 -176 -88 -46 39 148 -35 244
3749B44l22J07J4p4j59K74l47K45N8k62N0K94k9J47j35r0K3j28P6m3p1K48o0k10
$$ 244 -78 29 43 -31 -190 84 -263 -18 40 -222 -172 122 93 240 105 15 38 -90 -14 -57 -128 120 60 -150
3773a50K12J8p3l6N8J19j23L2o8j04r3J38P7Q3Kl42L48j83K02k85M05k40Lj04
$$ -150 62 80 7 -29 29 148 25 57 -11 -115 -208 -70 7 90 92 -250 98 -85 117 -168 237 -3 0 -104
3797a04%M5q7J82J28k73K29k15L1p3J04n7j4N4j5J36j01o3J41mj11J06j23j8R
$$ -104 -104 -59 -146 36 164 -109 120 -95 -64 -137 -33 -90 -104 -50 -65 71 -30 -93 48 44 -67 39 -84 -102 -93
3822i3J37J88l71K49j02p1J89j14p7L8Q6m00L30J21k1m8k62J85J8j07M9m9j31
$$ -93 44 232 -139 110 8 -63 126 12 -65 -27 59 -341 -11 110 89 41 -221 -36 -18 -125 -76 -125 -256
3845b56N25n17L11n5l09L18o8J77j02Q0K9R6k70L1Q9n7n0r7q6M52j19j95K15j19
$$ -256 269 -248 63 8 -301 17 -51 126 24 104 133 229 -41 -10 79 22 -28 -125 -211 241 122 -73 142 23
3869B3j16K9J74j21J09l03R1J40j16j7m5K25n4p1n1J52l26L6J89M25k40m22J26
$$ 23 -93 -64 110 -11 98 -205 -114 26 -90 -107 -152 73 19 -52 -103 49 -277 -241 -52 373 133 -289 -163
3892a63L05j99J17L74n53L05k68j97L82K1l2q4P0j0J26k87J30L0o2Qj10J94j28
$$ -163 142 -57 60 434 -119 186 -82 -279 103 124 92 8 78 68 194 -93 37 67 5 13 -97 97 -31
3915c1Q9n0j0n4J02r3N0J38M8q2j05j54K57n7k24J70m6J19j0j42J90j47J17j66
$$ -31 58 8 -2 -56 46 -47 3 141 189 107 2 -152 105 48 -176 -6 -52 67 57 -85 105 -42 75 -91
3939i1p8K03J29k45J04P8Lj4n8j09J04j14j40L62j61q9P5J84M3K5k67j03K73K1
$$ -91 -169 34 163 -82 22 100 103 89 31 -78 26 -88 -228 134 -27 -116 -41 143 186 211 -56 -159 114 135
3963A35j27k36L63J33k48Pm7O8j58J97J36j41n8o5R4J54j32N1j78J38k7jj04O4
$$ 135 8 -228 135 268 20 27 -20 48 -110 87 223 82 24 -41 53 207 75 126 -52 86 59 58 -46 18
3987A8N0r0L8j44R5Q1j81J52l3M9J09l16J06M7j61K43j41N0J52j12N3k33M61m28
$$ 18 68 -22 16 -128 -33 48 -133 19 -14 35 144 -172 -66 -19 -180 63 -78 -28 124 12 65 -168 293 -135
4011a35J65j71J10O3l79L84p2j74J29K11o2L2J04L6k51JR8P1j86J23o8J6K56k95
$$ -135 30 -141 -31 32 -347 37 -35 -209 -80 131 69 101 205 241 -10 -9 89 160 -26 97 29 45 301 6
4035Fj25L1J16n7L7R8N3j66J22j49P1oJ40k02J58j93j70K89j39j7L5k2K56j85
$$ 6 -119 -88 28 -29 8 106 159 -7 115 -34 37 31 171 -31 127 -66 -236 53 -86 -103 -68 -90 166 -19
4059a9J04m4p8N9J13j03k28J20K1N3Lk59J93j25J3J97N6L8j07m1O7KRJ26j64j00
$$ -19 85 41 -37 22 135 32 -196 -76 -55 -2 1 -258 -65 -190 -177 20 76 114 7 -34 33 35 44 170 6 -94
4085i4j26J82J50j04p8kj27K40k1J28j02q6p9n7J03P4J4j90K12J31k10j94K46
$$ -94 -220 -38 112 8 -70 -72 -199 41 20 148 46 -40 -119 -176 -73 1 15 -175 37 168 -42 -236 10
4108A0j09N7J14k50K05k8qJ73k21r6QJ07R3J8j18j33J43lr7K39l1j70K21k82K65
$$ 10 -99 -42 72 -178 27 -1 -9 164 -57 -153 -145 -38 55 73 -45 -178 -35 -38 -135 104 73 -97 124 -158 107
4133A07j98K25j53j24K83O4m0j52q4k17L25j5j04n7K85n0j92L6M1n1N4J96q3k21
$$ 107 -91 134 -19 -143 140 204 164 12 -72 -289 36 21 -83 -140 145 95 -97 -61 -20 -71 -17 179 96 -125
4157a25L28j81p0N7R5j13j08J85M6k49J83LM5j25J50rl23K67Q0Pl35M5R8k8j07
$$ -125 203 22 -48 9 104 -9 -117 68 114 -135 48 51 96 -29 121 112 -211 56 136 143 -192 -147 -49 -77 -184
4182a84J30l4M0K18r7j56l3J74M4m34M84j9k03J36j25K9j1J05l8m0K6P8j48K3
$$ -184 -54 -88 -48 170 73 -83 -116 58 102 -332 152 133 -70 66 -59 -30 -41 64 26 -14 12 90 -58 -35
4206c5n8LJ36p8N2k1P5k01K45qp4q3L3J28R6j62l4o1R2JJ10j99M9p6k2J85o0o0
$$ -35 -93 -90 46 -32 20 -1 74 -127 118 110 36 -47 -14 114 210 48 14 -47 45 46 156 -43 6 -70 -92 93 33 -27
4234b7K44k90N7J03j6j40j78M37r1j61J59q6R1m9p1K06j92J06J7j32J7K31k41
$$ -27 217 -73 -16 87 71 -69 -247 190 99 -62 97 11 102 53 -18 188 -4 102 119 -13 4 235 -6
4257fN9j38k2K83l62L23l69K73m1j67K99l62M43k01p8K10k27m8L90l18l3o1J84
$$ -6 53 -85 -107 176 -186 137 -232 41 0 -167 132 -230 213 12 -66 144 -83 -131 259 -59 -92 -153 31
4280C1j43M69j84j33k07J48J84J05l37l4L79l05J8l8K10p1j13K17k15o7Q7j8J10
$$ 31 -112 357 173 40 -167 -19 165 270 -67 -101 278 -27 -9 -47 163 92 -21 196 -19 -86 1 -17 93
4303I3j75j2q0M10m07K09j39J77R3k17L2L1j74P4R2k37K48J09L1k68K0J49j24
$$ 93 -82 -94 -174 236 -171 38 -101 76 169 -48 -16 15 -159 -85 7 -230 18 127 158 -110 -90 59 -65
4326f5R3P9m8k70J67L40q6j58l2J15j77J8J1j25n1L30p2Ro3L3km5R5j51n4J68
$$ -65 28 107 59 -211 -44 296 210 52 20 135 -42 -24 -13 -138 -189 141 69 78 15 48 46 1 96 -55 -109 59
4352E9K9j54P0k3J60j17J06k50R7J47j03q9J40n3J63j40j31P0Q4j87P4J09k31
$$ 59 88 -66 4 -19 141 24 130 -120 -23 124 21 -68 72 19 182 42 -89 -19 65 -122 -48 61 -170
4375a70k4K60o2j0j62K22q0K5q8q3N8J62J7j03M1J6P3j11l4j10K04j73K25j57
$$ -170 -194 66 4 -6 -168 54 -26 -1 -89 -172 -114 48 65 -38 3 19 92 -19 -53 -163 41 -132 93 -64
4399f4l6J25J5K59k50oN4j00j23L29l29K7Q3r2K20j99K99j65pj61J05rl5P8j65
$$ -64 -100 25 40 299 49 43 97 -3 -126 203 -126 -99 -16 -108 112 -87 212 47 40 -121 -16 -25 -60 18 -147
4424a47K47M6p5K43l93o2J63r9J61j78m8K73j25J11j27K06j96J99r4j77l8J23
$$ -147 100 146 71 314 -79 -141 22 -77 84 -94 -142 131 6 117 -10 196 0 199 105 -72 -110 13
4446A3j43L0N3P8k82R6n8K71j12KJ54k82L61l63J81j10Jj0K83j62J91m7j00j17
$$ 13 -130 -100 -47 31 -251 -155 -213 58 -54 -52 102 -180 181 -182 -1 -111 -110 -120 163 1 192 145 45 -72
4470g2J74P9j89L1j4J68nk88J41l29L57j24j8J49j36K04oM0j66J21k70K16k73
$$ -72 102 181 -8 23 9 177 172 -116 25 -304 53 -71 -89 60 -76 128 122 162 -4 117 -153 63 -210
4493b10M50r6k14J33l8k05J47k01L12j98L13q7o0O0o5j9Ln4R1j97K61q2J00q1
$$ -210 240 144 -70 63 25 -180 -33 -234 78 -120 193 106 46 106 41 22 25 -29 62 -135 126 44 144 63
4517F3Nolj00J42P8p8j65j9Q3J50j75LJ64j04j6k9n6K41j70j52R4N8L3Rj39K39
$$ 63 68 62 59 -41 101 179 101 -64 -83 0 150 -25 -22 142 38 22 -7 -63 178 8 -144 -50 8 41 50 -89 150
4544A50p3j83J78j35J18m0Q3k25J47J2m1j06J56N7k81L08j06j17J0J43kL2j25
$$ 150 77 -106 72 -63 55 15 98 -127 20 32 -9 -115 41 98 -183 125 19 -98 -88 55 53 85 -40
4567d0M6k3k12L81j34q1L7l7k42ML57j3j22j5r2K66j75J94j08J12k17L18k94L31
$$ -40 6 -17 -229 152 18 -63 -26 -63 -305 -301 56 43 -79 -94 -186 80 -95 99 -9 103 -114 204 -90 241
4591B41n9l2q3p9J85L6m13K8K47k07L07j11K6j44K2L19l43K00N2k75O7j3J53J6
$$ 241 182 150 67 -12 173 209 -204 -176 71 -136 171 60 86 -58 -36 283 -60 140 192 -83 -16 -29 124 140
4615A40j3q8K6j1j0MP1j91O0K5N5O9j28q7K20j83j18K62k41L92l13O1l5K54j65
$$ 140 127 39 65 54 44 48 119 -72 -12 13 68 137 9 -78 142 -41 -159 103 -138 254 -59 2 -33 221 56
4640E6r2j00L91k67j23K51k2k8mk37L31j38j88kL34j86k1J45n6lr3m1m8l0J64
$$ 56 -36 -136 255 -12 -135 116 94 66 62 -175 156 18 -170 -172 162 -24 -45 100 44 41 -52 -93 -141 -171 -7
4665gL1j09J36k7j28K31j32J00r5o9R4j02K50l29K60r0J2q1Q9J11O4j33k44K15
$$ -7 24 -85 51 24 -104 127 -5 95 0 -69 25 -77 173 -156 104 14 26 -55 34 145 209 76 -168 47
4689D7l2j09Q8l4n2M8J00j92K27j05J22l1j56R4Nk08k4L08k50J67k6j2p7Q0J2
$$ 47 15 -94 -6 -40 -92 -44 56 -136 91 -14 108 77 -79 15 20 -188 -212 96 -154 13 -13 -25 -102 -22 -10
4714a0K3J22J12j56j14J32j32qJ51n6j64l0J47l1P5Q9j63N3r6J99L3k20P6M6j06
$$ -10 13 135 247 91 -23 109 -23 -31 120 64 -100 -130 17 -14 61 150 -13 40 -56 143 176 -44 32 78 -28
4739b8J91q9n1K69k73k17J93l5L3J11j95J7L3N1k61L22k30n5N5L09j18j40j36
$$ -28 163 74 23 292 19 -198 -5 -40 -7 104 -91 -74 -41 10 -251 71 -159 -214 -159 150 32 -108 -244
4762b44L62j21Pk6K5J76k18PQ6j38O9J53j98J85k65K40j48j22J29j51J51R5%q9
$$ -244 118 -3 4 -22 3 179 -39 -32 54 -84 -15 138 -60 125 -140 100 -48 -170 -41 -192 -41 54 54 -35
4786c5j15K50p1J4k80J30j2m9K46jQ5p3j43N9j07J06J03r2m5J2j78P7J39J07M1
$$ -35 -150 100 29 43 -237 -107 -119 -168 78 77 162 89 -54 5 -102 4 107 15 -30 -18 -196 -119 20 127 168
4811A68k75J26p1J96j30j36m2P7J33p6l2O2J69kk14L5o6M2N6R6j04r7rK94o9k12
$$ 168 -107 19 -52 144 14 -122 -164 -87 46 -30 -62 0 169 167 -47 -12 -78 -36 20 116 12 -85 -94 200 131 -81
4837h1J06o9LJ53m7k24K66L3l41K23j7j11J10j07J37K8j3j26J26j67J55J34oj47
$$ -81 25 -44 -41 112 65 -159 107 140 -201 22 5 -106 4 -103 34 62 49 -77 49 -118 37 171 165 18
4861A8J2r7K23l49J20K6K05j40L9kq9J3l9M8l4k0J15j53R9J76j72J90j86J18j88
$$ 18 30 -67 156 -193 -73 -47 158 18 57 55 -34 -21 -60 -12 -46 -66 49 -104 -5 171 -1 189 3 121 -67
4886f7P1j81K54l9J58j74k42L04J45m13Q2K18J23Rl37J1J55k3o8J97k64J93l26
$$ -67 4 -177 77 38 196 22 -220 84 229 -184 -102 116 239 248 -89 -78 77 54 -14 183 -81 112 -214
4909b14Q1R9R3j48j9R8j24J22P7J76l71K68r0j07J61j46J67q1j8j96J89k8L8r
$$ -214 -133 -34 59 -89 -108 -10 -134 -12 65 241 -130 138 48 -59 102 -44 123 42 24 -172 17 -11 27 18
4933A8m3J3J78k22j4J99l5j76L7K13l61N8Q5J00j13QP1k30K34j5r3N7j5N8j84
$$ 18 -25 -12 166 -56 -70 129 94 -82 -45 168 -193 -135 -50 50 -63 -55 16 -214 20 5 -88 -31 -46 12 -172
4958a72K65j22J70k42K08k60K63J8k96R0O0n6N6K45k72j31K01j92K42j01J0j14
$$ -172 93 -29 141 -101 107 -153 110 128 -168 -78 -18 -74 -18 227 -45 -176 25 -167 75 -26 -16 -130
4980a30K3J68Mq1J61j18J27l49K14j49J52J95j79M2n9l8q6K6o2K72j68j41J03
$$ -130 -107 61 65 -16 145 27 154 -195 19 -130 22 217 38 80 21 -17 -103 -77 -139 133 -35 -176 -73
5003g3j47L90j83r5J4l7L53j83o1J79j55o1q7L9J34k3L2p9j21K72j27J15o2Mr2
$$ -73 -220 170 -13 -108 -94 -131 222 39 -22 157 2 -59 -146 -107 27 4 36 -43 -164 108 -19 96 34 38 -54
5028e4j80K62m5j29O5J18q5K58l21N8J98k69o9l6L39k91L14k02K81k38J1L2J5
$$ -54 -234 28 -17 -146 -81 37 -48 210 -111 -53 145 -124 -193 -229 110 -181 133 -69 212 -26 -15 17 32
5051C2nj78L15j77P5K04j01m69K19K1o4J31K02M0j47k86J59K12j65j05J49j60
$$ 32 27 -151 164 -13 62 266 165 -304 -85 -64 -128 3 205 245 98 -188 -29 183 18 -87 62 -98
5073i8J55K3r5j64R5J64k61J43k02NN1L14q6K1k0J34p0r5J12o6p4L0M1j11j64
$$ -98 57 80 -15 -179 -84 80 -181 -38 -240 -235 -184 130 44 65 45 179 109 14 126 60 -14 16 57 -54 -218
5098b18L77j23M5k8n8K5n4N5n1O1O2J22k30J30j29j47J36l0L52k39q9j25K23p6
$$ -218 159 36 81 53 -5 20 -34 21 -30 31 93 215 -15 115 -14 -161 -25 -55 297 58 -31 -156 67 -9
5122irj23J6J14r9J69kO3k23K88P9l34J9J68m48M52j78P4Kj09J24j05J59j4P3
$$ -9 -18 -141 -125 -11 -110 59 57 120 -103 185 264 -70 -51 117 -331 121 -57 17 19 -90 34 -71 88 74 147
5147A47l51jK43o8Q0J21k07J82q7J6k19J97J52m07O4J77k20M07l93J27l9j17j
$$ 147 -204 -205 38 -30 50 171 -36 146 59 75 -144 53 205 -202 -138 39 -181 226 -167 -40 -79 -196 -197
5170a97L3jK49p5R5k12O1j63M89o9k41p7o8K22j19J30J43k52J75J5l1m3m1R2j15
$$ -197 -164 -165 84 9 104 -108 -47 -210 279 210 -31 -108 -176 46 -73 57 200 -52 123 138 107 64 23 115 0
5195@q5R6M0L2j72J67j21q6J38j92O3J4L1K19k66L25k80J38O1j50J0j58J86K3
$$ 0 -85 11 51 83 -89 78 -43 -129 9 -183 -120 -106 -75 144 -122 203 -77 61 122 -28 -18 -176 10 33
5219C3J24j92N8j09J00j13K37j57k50K18pN0N9j11J0n1J19K31l28Q4N5J09o9P3
$$ 33 157 -35 23 -86 14 -99 138 -19 -269 -51 -58 -8 51 -60 -50 -101 18 249 -79 5 60 169 100 173
5243A73k09J76o0j04J1M8K0k64Q0J70l09M68n5k60J25j85L45j59L3J6L3q7Q6j9
$$ 173 -36 140 80 -24 -13 35 55 -209 -129 41 -268 200 145 -115 10 -175 170 11 44 60 93 6 92 73
5267G3j02n3j82K18P2l7l0Q3J96k27j9m8K87j62j19K0J18L6j02N6j41m5O3K93
$$ 73 -29 -82 -264 -46 26 -11 -41 42 238 11 -8 -56 231 69 -50 -30 88 124 22 78 -63 -108 -45 248
5291B48k94K02k20J48p0l17L10m2L6k33j37J99K17p9O3q8m5J27p1J32j39r1J73
$$ 248 -46 156 -64 84 14 -303 7 -35 1 -232 -369 -170 47 -32 31 -57 -102 25 -46 86 -53 -144 29
5314B9Q8k05K2J36J1o4L3J1o3j4q7J42P1j79Rp7J7k0L36j68j20N6pK27j65l6K8
$$ 29 117 -88 -66 70 81 17 50 61 -2 -16 -103 39 110 -69 -60 -137 -120 -140 196 28 -92 -36 -43 184 19 -17 11
5341A1j69J50O4or8J63j58l1K14r6l62K62l57L29J16J56j50j17k7M4J86j79K50
$$ 11 -158 -8 56 50 -48 115 -43 -74 140 44 -318 -56 -413 -84 32 188 38 -79 -106 -62 124 -55 195
5364A95k37K61j62J40q1n7NK5l0N0j86K14k10J12J63oj33j84q0M43p5r6J6k50
$$ 195 -42 219 57 197 116 59 64 89 59 109 -77 137 -73 39 202 196 63 -121 -201 242 167 71 87 -163
5388a63Kk6L28k54J05J25k19K9J49k06J56j14J22J57k77J47J9n7j36M7J62j96
$$ -163 -161 -187 141 -113 -8 117 -102 -73 76 -130 26 -88 34 191 -86 61 80 23 -113 -66 96 -100
5410a00KJ24K1j30O0j04L1PK29k27L39l21K0P1M2M8k0l02K14J92k79j33M5J37
$$ -100 -98 26 47 -83 -23 -127 -96 -89 140 -87 252 -69 -49 22 64 112 92 -210 4 196 -83 -216 -171 -34
5434c4q5M3o5J71q8j14J37J2k04L23j66J80j17J3r5K4j36K27MmJ56j46j75K43
$$ -34 -119 -76 -141 30 -58 -172 -35 -23 -227 96 -70 110 -7 6 -89 -65 -201 26 30 26 182 36 -139 104
5458A04j90L15m15J02j4k1J59o4j66K80l72L10L5j35K50J29l36N4j1j38K48j78
$$ 104 -86 229 -186 -84 -98 -119 40 -24 -190 90 -282 28 63 -72 178 307 -29 25 14 -124 124 -54
5480e4K58k42M5j09J26q1j2K06p7k9m5m6q6K26j35L12j89n5j31K59k04J87l0n1
$$ -54 204 -38 7 -102 24 -57 -69 137 60 31 -14 -60 -146 80 -55 257 68 13 -118 141 -63 124 94 43
5504D3K6r5J48r1N6j19l4j36L40j67j13J14J5J3j76L03k46K5O9nM2R2j87M4m2
$$ 43 69 -26 122 31 87 -32 -66 -202 138 -29 -142 -28 -13 0 -176 127 -119 -94 -25 -30 12 104 -83 -39 -81
5529h1K4L3J33k62N1R3l7J47o9l0j08K36k15K24j21j05K15J2J4j58L6M7j52J2
$$ -81 -57 -24 109 -153 -102 -9 -46 101 32 2 -106 130 -85 139 18 -87 128 140 154 -4 32 79 -73 -61
5553f1J56o3M4r4QL3P8k81K59j16J5j80K28p4M6j92L56n1l7Q4j4k08J23o9R5n1
$$ -61 95 32 76 -18 -10 23 101 -180 79 -37 -22 -202 26 -48 -2 -194 162 111 74 158 144 -64 59 -10 85 34
5579C4R6j33J52k91M6K18k1k51N0R6o6J51k21J03o8J24j84J32K10m46L24K8j14
$$ 34 130 -3 149 -142 -96 122 101 -150 -100 -4 -70 81 -140 -37 -105 19 -165 -33 177 -269 55 83 -31
5602c1J02j68J8k6p6J09K18j16K6l0j08Q9n1M0P3j21M1J24%J8k23K4Q3j25M2n
$$ -31 71 -97 -79 -105 -181 -72 146 30 56 26 -82 7 -44 -4 69 -52 -11 113 113 131 -92 -68 15 -110 -68 -73
5628g3oM0J24l00L29j89J9R5o9nOj70K88j36l9MK59m01J42J16j30K29%j16Q7j10
$$ -73 -79 -39 85 -215 114 -75 -56 39 -30 -35 -29 -199 89 -47 -86 -82 177 -224 -82 34 -96 133 133 17 104 -6
5654fj42l7J0J22j41L11j34N0m6K02k63J67q7j17J93j11r6J29n7M5n6qJ40p4l0
$$ -6 -148 -185 -175 -53 -194 117 -17 33 -13 189 -74 93 6 -111 82 -29 -125 4 -53 -8 -64 -72 68 -6 -36
5679c6n1J11j62K93j01J94j86k71J94K08k59L48l08m8M8o6JJ15nr5n0J23L9J08
$$ -36 -87 24 -138 155 54 248 62 -209 -15 193 -66 282 -26 -74 -26 -92 -91 24 19 -76 -126 -3 36 144
5703A44m0j70J83k12K59q9j2k8j15J98k45J64j69Q1J45l0k40J22J59n3K8j20K0
$$ 144 104 -66 117 -95 164 75 63 35 -80 118 -127 37 -132 -51 94 64 -176 -54 105 52 80 -40 -20
5726b0J3J50j52j43R2m5j97L57n6R4j95Q5J22q2K03j82j65j13J99K16l21J35j68
$$ -20 -7 143 -9 -152 -60 -105 -302 55 -1 93 -102 -17 105 23 226 44 -121 -234 -35 181 -140 -5 -173
5749a73K18j95R1r7J95j40o4M3K09k34J44K79k69R4k35J8J63l1o1O5r1J96k4r
$$ -173 45 -150 -59 -156 39 -101 -165 -122 87 -147 -3 276 7 101 -134 -116 47 16 -45 20 -71 125 101 92
5773I2K17k63l6m2J69m8j39M6j1k60L03J41q1K3k32j07J62K28j83j4J41j41J31
$$ 92 309 46 10 -32 137 89 -50 -4 -15 -275 28 169 88 111 -121 -228 -66 162 -21 -35 106 -35 96
5796I6O0j4j78j79N1J98j59J15K0R5K6l41K74p1p4K5J66Ok05K62l56L45k41K41
$$ 96 156 142 -36 -215 -164 34 -125 -10 10 105 131 -210 64 -7 -81 -56 110 116 -89 173 -183 162 -79 162
5820A62m9Q3r1j52Kq1K3m2J93N6J0l41K21L8n8N8M2k05K32k21K09n8n6q9K69j95
$$ 162 113 196 105 -47 -45 -126 -103 -145 48 104 114 -227 -6 32 -26 32 74 -131 101 -120 89 31 -25 -114 155 -40
5846d0J20j05J11j0j56J76j54L0J00k78K82j28m9K31j47k3K18k06K25kq6j52J92
$$ -40 80 -25 86 76 -80 96 -58 -28 72 -206 76 -52 -101 130 -17 -40 178 -28 197 195 109 -43 149
5869A49J6k16J60J7k7m20K84P0o1K3Q6O4k39Q5o2M1J37J25l16k09J81K07j18Q8
$$ 149 165 -51 109 126 99 -321 -37 33 -28 -5 81 145 -94 -9 -71 -30 107 232 -84 -293 -112 95 -23 65
5893F5N2j89K15o0j62k1j20J16j01J73J83j74P1L4j15J74q6n2j65qM7R2J58P0
$$ 65 117 -72 143 83 -79 -100 -220 -104 -205 -32 151 -23 48 82 -33 141 55 3 -162 -170 -123 -31 127 197
5917A97j49J6P8j1k0J05j88j64L42k42o4J69O4l8j52L27j87k12N8K09P4l69J35
$$ 197 48 64 142 131 111 216 28 -136 206 -36 -100 69 133 95 -57 270 83 -129 -71 138 212 -157 -22
5940b2p9PK99k60j66K09K83j67O5k73J24J1l9JJ53m43M50l01K27l27J97k6m8J17
$$ -22 -101 -94 205 -55 -221 -12 271 104 169 -104 20 31 -8 -7 146 -297 153 -148 79 -248 -51 -77 -125 -8
5964hj49K4K1R3J19Q5k52K21j30j34J22J07k3k5j07j62K58j37K3L8J88j30j32
$$ -8 -157 -133 -112 -19 100 185 -67 154 24 -110 12 119 96 71 -36 -198 60 -77 -54 -16 172 42 -90
5987i0L4o6K45l7k2K9r3OK33k33k1j43K40J36j07j75M8J90k34p3M9N8J36j85q0
$$ -90 -56 -122 123 86 64 93 0 6 239 6 -15 -158 82 218 111 -64 -16 174 -60 -133 -84 -26 110 -75 -155
6012a55O7m0J87l06J42Q1L3J99n31K61O3R1n9r6j35K14j25J58Q6j29l3K01k25
$$ -155 -88 -128 59 -247 -105 -24 9 208 -323 -62 1 92 33 -63 -198 16 -109 49 135 6 -27 174 -51
6035e1k7L81l15j20M8K33m7j82q6L32j73J25j12j85K06Q3j91J08p1J65O7l40J53
$$ -51 -78 303 -12 -132 -84 149 102 -80 -166 166 -7 118 6 -179 27 110 -81 27 -44 121 188 -152 1
6058Aj65J04M7j7R3j31J14j0m4m8q1J82j55L69k41q8n3J0M9J10p5n6P2L7K94j05
$$ 1 -164 -60 -13 -30 63 -68 46 36 -8 -56 -137 45 -110 259 18 -70 -123 -113 -64 46 -29 -85 -13 24 318 213
6084B13k04j27J03O7o0P4r8J52j73L6j7K7J4j0j41J02J62K4j04q0j1j60L2L86
$$ 213 9 -118 -15 52 -8 66 -32 120 -53 -17 -34 -7 7 -3 -144 -42 120 144 40 -40 -51 -211 -179 207
6108B07k28J05K11m50M9J89l0o8J03O6m1O1l71K80k38K55j88q2O9L50m0n8j88
$$ 207 -21 84 295 -155 -106 83 53 -15 88 154 113 174 -197 83 -155 100 -88 -170 -101 249 209 151 -37
6131c7k7K01j07R7n8k32R6J10L7Q6j56L5Nj71K84kj79Q2K51o70L21k0P1P3p1Q8
$$ -37 -64 137 30 127 69 -163 -67 43 80 166 10 45 50 -121 163 161 -18 64 315 -355 -34 -54 17 90 19 107
6157A07kk18K44j77q8J39j37O8n6j3K70q1k24K97J45m10k1M2K9J8J01k42K77j
$$ 107 105 -113 131 -46 -134 5 -132 -64 -120 -133 137 56 -168 129 274 -136 -157 -115 -86 -68 33 -209 68 67
6181F7k7O7j27K13j68j29j2J86r7K09k15K7k8J08k14J4J70j49K35k31J93k1L7
$$ 67 40 107 -20 193 25 -104 -116 70 -27 182 -33 -6 -34 74 -140 -126 44 -105 130 -101 92 71 108
6204A08m2j01R1r6N1M3p9O8n3k40J31L35j89k31K34o8l4M7n2J9N3l04K53m9MJ08
$$ 108 66 -35 56 -40 11 54 -25 43 -10 -250 -119 216 27 -204 30 -38 -72 -25 -77 -58 -5 -309 -56 -105 -101 7
6230GJ8j29j3r2K72n5k19L67j35j2q8N9R9o1M3j02R4j29J57m5r5L46m13K42m4
$$ 7 25 -104 -117 -209 63 8 -211 156 21 9 -79 -20 79 18 61 -41 53 -76 81 36 -59 287 -126 116 72
6255G2m1L4j6q7K4O1j1j49R3L1o2J48l5j02j14J58J8j08%o5J19J14r0N1L3j00
$$ 72 31 65 49 -38 -14 47 36 -113 -20 11 -51 97 62 -40 -154 4 22 -86 -86 -151 -32 82 -8 43 76 -24
6281b4j5n9K48r8j34K96k39j22K44p1j58R4K48k57K20m6k11K3o9J05J55m7j1O1
$$ -24 -39 -98 150 52 -82 214 -25 -147 97 26 -132 -38 210 -47 173 127 -84 -61 -130 -25 130 83 72 133
6305A33j48PMK90k78j3o2k6O1l0K03k17J31P2j44o4L7R2j94J49q8j23J56N4j16
$$ 133 -15 -8 -4 286 8 -5 -67 -93 -32 -62 141 -76 55 127 -17 -81 -44 48 -146 3 -85 -208 -52 2 -114
6330a14K49P7m01K85n2j15J06Kkp7P3m1J95j30j00K19j33J43N4j67mj12k98M83
$$ -114 135 212 -189 96 44 -71 35 37 35 -42 31 -10 185 55 -45 174 41 184 238 71 67 -45 -343 140
6354A40M3p0p6j75J90p8n3Q5j27Q0j15K16j32n9l9J57n3K34r3Q1j78j04K17R6
$$ 140 183 113 37 -138 52 -26 -79 6 -121 -41 -156 60 -72 -131 -170 -13 -66 168 75 156 -22 -126 91 187
6378A87k98J80n0r5J43J6n6j61K15j22J7j42J66Q9k53QJ12J2k7J16p7J79j36m1
$$ 187 -111 69 19 -76 67 83 27 -134 81 -41 -24 -166 0 89 -164 -156 -44 -32 -59 57 -20 159 23 -18
6402a8j60J12j45J73J94k06m5K8j21L70k58q3K90j88J99l6k1O6k08J36j55J18
$$ -18 -178 -66 -211 -38 156 -50 -95 -67 -188 182 -76 -159 131 -57 142 106 85 151 -57 79 -76 42
6424D2K27n5l74N7R9N5J4j25L00k65j7J35J8M6mj60j87K20j30J89k62r6L24Jk92
$$ 42 269 214 -160 -103 -4 51 65 -60 240 -25 -42 93 111 157 153 -7 -194 26 -104 85 -177 -273 51 52 -240
6449b40M9K42O1k58J00Q3Ol0j13K5k0J22l1r6K35M5k27N8L8J81j73R2j23j22K67
$$ -240 -191 51 112 -146 -46 37 43 13 -100 -75 -95 27 -4 -100 135 180 -47 11 49 230 57 149 26 -96 171
6474A71j53k6j20J63r4J51l4k0JO1k23k3J19o5K72k43M4j03K48r3L2j82K16J39
$$ 171 18 -8 -128 35 -59 92 58 38 39 100 -123 -146 -27 -92 180 -63 -19 -122 126 33 65 -117 99 238
6498B38k59J84q7k07J77Q0j59L6j5J46k85J74n5L04l01O2j1n2J75j55P5k58K66
$$ 238 -21 163 76 -131 46 126 -33 3 -12 134 -151 23 -32 272 -29 33 22 -30 145 -10 65 -193 73
6521G3Ql7j27J51Q3j91m7L7L7R4n2LK0J87k25j53J64J01l9l03L24j04r2QJ1L12
$$ 73 81 44 -83 68 151 -40 -87 -50 -13 81 29 32 52 239 14 -139 25 126 87 -216 108 4 -88 -80 -69 243
6547B43l70L10l27J12J81k47K45j21N8j70M6k43K47J22p7R1J13l01M87m02J13
$$ 243 -127 183 -144 -32 149 -98 147 26 84 -86 -40 -283 -36 86 9 100 213 -88 399 -3 110
6568A10j26K06k72P0l6R1P3l94M54j30j84K4J04M2J55l41J16j20J04l6L6K0m1
$$ 110 -16 190 -82 -12 -48 43 116 -278 176 46 -138 -114 -10 32 187 -154 -38 -158 -54 -90 -54 -34 -75
6591g5r4J72K1m6J12p9M9j78K50p4k47N2M10m34Q9o9K95l12L0J93j42n6K3J56
$$ -75 -169 3 24 -22 90 11 60 -118 132 58 -189 -137 273 -161 -72 -141 154 -158 -128 65 -77 -133 -110 46
6615D6r1j70K67K17j38p6k89R1K86k26P6J27o0J37k51k2K37k39m9K89j6k29k8
$$ 46 -45 -215 52 269 131 55 -234 -143 143 -83 -7 120 60 197 -54 -76 161 -78 -127 162 146 -83 -111
6638a11J6K2K79j95Q2j20K83l20J62pq2J37j54Q6q1nn6M6J33j44K0J20k48K05
$$ -111 -95 -73 206 11 93 -27 256 -64 98 91 9 146 -8 78 -3 -8 -64 -18 115 -29 -9 111 -137 68
6662F8K1j81kJK37j60q1J56J32j89J58l19m4L25l33J91K0k64K65J02n3n7J88p7
$$ 68 89 -92 -94 -93 144 -16 -97 59 191 2 160 -159 -203 122 -211 -20 0 -264 1 103 50 -7 181 104
6686A04j84M5R2n1p8K48Q3n08K56P5k15j20M14j03k80J88j09O6R0M4J2J73j11
$$ 104 -80 -35 57 6 -72 176 259 -249 7 82 -133 -253 161 58 -222 -34 -143 -77 13 57 69 242 131
6709A31N3j68J02k11L9O0J25k38J40j38N25m28p4M10n14K53N4M3l01K50j33j0
$$ 131 184 16 118 -93 -54 6 131 -107 33 -105 420 -8 -82 328 -186 67 121 164 -137 113 -20 -30
6731c0QJ88k46r6K32m3q1r6J96j11J74j02q5P0j18K80J27r8j3j2p1j02o5k43K67
$$ -30 -22 166 -80 -176 56 13 -68 -164 32 -79 95 -7 -92 -22 -140 140 267 169 156 144 73 -29 -94 -337 -70
6756g0J63l12J33J11k77L80j07j51O2J76l18J63J49m9r0j18L38k78qK11l5l4j83
$$ -70 93 -219 -86 25 -252 128 21 -130 -68 108 -210 -47 102 53 -37 -155 183 -95 -103 108 73 39 -144
6779a44L30j18m7N6l06K14J26o0j80J35J75l82J69P4k54M47m10J66L2j24R9K0
$$ -144 186 68 21 77 -229 -15 111 51 -129 6 181 -201 -32 42 -212 235 -175 -9 23 -101 -2 18
6801A8O0kj24r8P6L13j35J0L4j69Q5j2k39L72j34J3k60M7J50j77K6J82j44J70
$$ 18 78 76 -48 -146 -70 243 108 118 152 -17 68 56 -183 189 55 68 -192 -145 5 -172 -146 36 -108 62
6825F2k7k41M34k10L6l3J3k61K27m0%L4L7n3J55j95J81n4J04q2m02K16J97k02
$$ 62 35 -206 228 18 54 21 34 -227 0 -40 -40 -6 31 -22 133 -62 119 65 169 87 -315 -99 98 -104
6849a04K13o0r4j6Q6l2j57L44k50J08J02k66K49J04k22o4n3R4j13J79p8k05M19
$$ -104 109 49 -45 -61 25 -7 -164 180 -70 38 140 -126 123 227 5 -59 -112 -18 -131 48 -30 -235 184
6872A84Qj70L6l8J68k20N9%L9j60M6J54j53LP0l7J39j3J6k5j23rj1lJ58k06J70
$$ 184 192 22 58 20 188 -32 27 27 66 -94 -48 106 -47 -44 26 -11 128 115 131 106 -17 -26 -37 -40 118 -88 82
6899H2k70J01O4K7k32J67J02J10%k08J23j58O1o3J47P2l80J88K8j39L44m8n2K1
$$ 82 -188 -87 -23 4 -228 -61 41 151 151 -57 66 -92 -31 -94 53 125 -255 -67 -39 -178 166 118 66 87
6923H7P5l2k19L22l07j47K45j32K21r7k06L01j6qj39K34j4k59j23J40j3J19j08
$$ 87 162 130 -89 233 -74 -221 24 -108 113 16 -190 111 95 87 -52 182 168 -91 -214 -74 -87 32 -76
6946g6J14j56J77K23k57K38j75r2k7J45q3N3P1k9j19k82L30k29rK87j12R7l4r6
$$ -76 38 -118 59 282 25 263 88 -4 -31 114 31 84 155 126 7 -275 55 -174 -183 104 -8 89 55 -41
6970d1L0K22k32J03j05j16K56m4j8RJ0RN1k85P5K56k82J67m5Q2j90K8J27K84k59
$$ -41 -11 211 -21 82 -23 -139 117 73 55 64 74 83 134 -151 -76 180 -102 65 20 102 -88 -60 67 351 92
6995I2k38K58j12R6j22m9J48k18K56mk55L50l04l4J19r0j14K84r9n1O6K44k53
$$ 92 -146 112 0 96 -26 -75 73 -145 111 107 -148 202 -102 -136 -17 -107 -221 63 -36 -87 -21 223 -30
7018c0J78p7j29J08p4P6n4R8Q7j4j03N0j41j6K02k46J62j39N5j97K69L6q7J37
$$ -30 148 71 -58 50 -24 52 -2 96 183 169 66 116 -25 -41 161 -85 77 -62 -7 -204 65 101 14 151
7042A51r8j93J85N3j61o4L82l66J21O0K2j92K90k09J31l91M02Ok72J63J44j47
$$ 151 53 -140 45 98 -63 -127 255 -111 10 70 92 -100 190 -19 112 -279 123 129 -143 20 164 17
7064A7j21L1P2j73P4LK69j56j23P8M1NQ6l0L9j13q4J09j24M7K55l01o3J36M5R8
$$ 17 -104 -73 -1 -174 -100 -97 172 16 -107 -29 12 17 103 73 112 -1 -85 24 -100 -53 202 -99 -162 -26 19 117
7090A17j29j0J70l66K68n4K5l2q4o0K41j19m8J20Q6mN9M6m7j44j48m9J29j58K96
$$ 117 -12 -22 148 -218 50 -4 21 -11 -95 -155 86 -33 -81 39 125 121 180 226 179 35 -113 -162 -33 -191 105
7115A05k22r8L18N2j74j67Q3o9K51j01j42L4O9J18M4lj65k46L34Kk4J54l33PL17
$$ 105 -117 -215 103 155 -19 -186 -103 -172 79 -22 -164 -130 -61 57 101 98 -67 -313 21 23 -1 153 -180 -173 144
7140A44j64Q4J9kj73K96m6j8K6k31j18J77Q5P8n2k2j20o0P4N4j31J60o0J02rk15
$$ 144 -20 64 83 81 -92 204 158 140 166 -65 -183 -6 79 157 105 83 -37 -97 -23 31 -100 60 0 102 93 -122
7166a22K78k01K26j88m2o3N4R1J12j76p6JJ37j66J20k0J49r7LJ53j35l1M3J15
$$ -122 156 -45 181 -7 -49 -112 -58 33 145 -31 -107 -106 31 -135 -15 -35 114 17 20 173 38 7 50 165
7190A65k90J24l7q1K04j33M7J42k19L0m1P6p5j65L70l56K52l9J64l51P0J67j07
$$ 165 -125 -1 -38 -119 85 -48 -1 141 -78 -48 -89 -13 -88 -253 117 -239 13 -26 138 -213 -143 24 -83
7213h3J00l3J50P4l35J20Nj31J31n3J35j73J78j21n0m3J91km9L55m43J12m5K5
$$ -83 17 -16 134 208 -127 -7 -2 -133 -2 -55 80 -93 85 -36 -86 -129 62 60 11 366 -77 35 -10 15
7237A5j64K31J23j72Q1l82L48r2j64R2K09j52r9N4n9J87j30l7N5j43J65l9M0J32
$$ 15 -149 82 205 33 114 -268 80 -12 -176 -84 125 -27 -126 -72 -131 56 -74 -111 -56 -199 -34 -73 -33 99
7261I9Q6k21N6j15P8J04j1K7N2l18K73j94n9K16j67M0K17k11J76j79k13K86q5
$$ 99 185 -36 20 -95 -17 87 76 103 155 -163 110 -84 -143 73 -94 -54 163 -48 128 -51 -264 22 -63
7284f3J01J8j70J45N5L6j27M0M9O5j06p7M0J0j69O4m1K00M0k62K95p7j02Q4n5
$$ -63 38 56 -114 31 86 122 -5 35 84 149 43 -34 6 16 -153 -89 -130 70 110 -152 143 66 -36 48 -7
7309gJ10q8k35J62J63k03J82j28j65J53L02l65J81P8jj40p7m0J75j82L04j89O1
$$ -7 103 15 -220 -58 105 -98 84 -44 -209 -56 246 -119 62 140 139 -1 -78 -118 57 -125 179 -10 51
7332E1k48K93j33j5l2m6L68l57K94p5k95J50j12%J78j16J61J5J34k39k3L3J37
$$ 51 -197 96 -37 -52 -84 -130 238 -119 175 100 -195 -45 -157 -157 21 -95 66 81 215 -24 -47 -14 123
7355A23j06m8J78j01j77J77j77K70p0j40O8P7q8R7l49L29k04k8J81K74k74K41
$$ 123 17 -31 147 46 -131 46 -131 139 69 -71 -3 74 -14 83 -266 63 -141 -169 12 286 12 253
7377B53n01M85j84j36J48k13J84j70M5K82q4m5J14j30r3k00J51L37k32Lj38M20
$$ 253 -248 237 53 -83 65 -148 36 -134 -89 193 109 64 178 48 -45 -245 -94 243 11 14 -124 296
7399B96m42N4n1K08N4o5M8j57m4P0j31RM5J42k00P0L26k10j17J01n9j2K4j9K58
$$ 296 -146 -92 -143 65 119 54 102 -55 -99 -29 -160 -151 -106 36 -164 -94 232 22 -95 6 -53 -65 -41 -60 198
7424A98Q5j38%M4k89J62j12k02J38J27K24k08J6J9q3K85k06J25K0n9j16l3J27
$$ 198 283 145 145 189 -100 62 -50 -252 -114 13 237 29 45 64 -19 266 60 185 205 146 30 -3 124
7447A24j58J96k90J05Q3n9l8lr0K12j05j41J62J37k83K52k50j2K96j17J50k29
$$ 124 -34 162 -128 -23 60 1 -37 -40 -130 82 -23 -164 -2 135 -148 104 -146 -158 138 21 171 -58
7469e8nj12J60j19K18k04K76j38j66Q4J96q0rj53J08k9o0k8J66k18K23P5j74J7
$$ -58 -63 -175 -15 -134 84 -120 156 18 -148 -64 132 52 43 -110 -2 -31 -91 -119 47 -171 52 127 -47 -30
7493c0q9K4L8J00n0p0K15J8j15j69J6J12J2N0r9J40l6l8N5M7m4j82J55J83j57
$$ -30 -119 -95 -57 43 -7 -77 138 156 41 -128 -112 0 12 62 -37 103 67 29 84 131 87 -95 60 243 86
7518H6o5K3J25Nm29L14m5l1m5J86J75n02K03j2M5J7k91K18l0J59L2k35k9J29j50
$$ 86 21 44 169 174 -255 59 14 -17 -62 124 299 -203 0 -12 33 50 -241 -23 -53 106 138 -97 -126 3 -147
7543a47O1J03J49l67N05k94J9j24Q4p4L49l33K8J58j53jP2L2o4M0k52L67j41j02
$$ -147 -86 17 166 -201 304 10 29 -95 -11 -85 264 -69 -41 117 -36 -37 35 67 3 43 -209 158 17 -85
7567h5L1N4L3r4m1J8J3N4J47lq7k3rO0J01j81j43N4k8J64rOK02k36N4k45K71n3
$$ -85 -54 0 33 -61 -102 -84 -71 -17 130 127 40 17 8 68 169 -12 -155 -101 -129 35 26 32 234 -2 52 -193 78 25
7595B5j76O5J37j65Q3K4M4j49K9K4mo2J41j90J37k2M5m71M88K5q6j01N9J5K46
$$ 25 -151 -86 51 -114 -31 -7 37 -112 -83 -59 -63 -125 16 -174 -37 -59 -14 -485 3 28 -58 -159 -100 -85 161
7620A61j88j80J73M9kj27MJ16no8J31J3j60M4R1P4j67j77J16L6n8K7L8K3L7k36
$$ 161 -27 -207 -34 15 13 -114 -110 6 1 -67 64 77 -83 -39 52 126 -41 -218 -102 -66 -124 -97 -59 -36 1 -235
7646b35L91j50n9K75l82K75q2Q2m9p8j2j64L17l90M25k47J38K1k00N8K01j30m
$$ -235 156 6 -53 222 -160 115 33 115 66 -12 -24 -188 129 -261 164 -83 55 76 -124 -66 135 5 1
7669AK3j69M9j68L55l09L8L62J44m15K39j05lJ13j92K1J30l35J20O1Q2j47J01
$$ 1 24 -145 -96 -264 91 -218 -180 182 326 -89 150 45 42 155 -37 -16 114 -221 -101 -40 42 -105 -4
7692dP2j05o8O2j07K14o0nn0J63L2k20J6K0j95L79l05j1K12k97M69p7o5q0J25
$$ -4 68 -37 -105 -43 -150 64 4 -1 -51 112 144 -76 -60 -40 -235 144 -161 -172 40 -257 212 135 70 -10 115
7717A15j02P9l2o6J90l51K42J5k21K28l9p9q0K22k58J19j18K61n7q7n2rR6K16
$$ 115 13 92 60 -6 184 -167 75 90 -131 97 58 -21 -101 121 -137 -18 -136 125 68 -19 -71 -80 16 232
7741B32l23J30m4O8k27L45k35J3m2K87k61J12N8k02L0Q3k9J60qK9m7j92J96n1
$$ 232 -91 39 -5 63 -164 181 -54 -41 -83 204 -57 55 113 -89 -59 24 -5 155 147 176 129 -63 133 82
7765H2j33K1j00K81k51j5K70p8l75M96k87N0R7MOj28J22QJ73Nm96J59K54j11r0
$$ 82 -51 -30 -130 151 -100 -115 155 77 -298 198 -89 -39 58 62 68 -60 62 70 243 248 -248 -89 165 54 -36
7790c6%N5n9J2k43J65j0n2J87j47J48m8KN6n4l2J91j69P2J59l80O9r9P7j6K20
$$ -36 -36 19 -40 -28 -271 -106 -116 -168 19 -128 20 -28 -26 30 -24 -56 135 -34 38 197 -183 -114 -213 -136 -152 68
7816F8k85J99q6J4K88j63o7J2K9M2n8j75J72m5m8O4M8J9j03N3J75n7o5J2k2J8
$$ 68 -217 -18 -104 -90 198 35 -32 -20 9 51 -7 -182 -10 -55 -103 -39 9 28 -75 -22 153 96 31 43 21 39
7842C9m0L4j7N3K9j4n8R1k43OJ82k58j54L16n6K26k08LJ9m7J6P0J4J03mj61J87
$$ 39 -1 33 16 69 98 84 26 117 -126 -120 62 -196 -350 -34 -90 136 -72 -69 -50 -97 -81 -11 3 106 102 -59 128
7869A28l07K49j43O1M6N0l2m9k6P1q9J85k48J3K18p6k8oPm9j75J19K59o1j98K58
$$ 128 -179 70 -73 -12 34 84 52 3 -23 48 -41 144 -104 -91 127 51 23 17 24 -25 -200 -81 178 117 -81 177
7895A77j48K7J65N9k10j94J22R8q6j9Q0l49J96mk1J16K55j99J78m02J49J2j41
$$ 177 29 56 221 280 70 -124 -2 96 10 -9 71 -278 -82 -86 -107 9 264 65 243 -159 -10 2 -139
7918a39K04k8P0k58J31j1n8J63J46j54Kj22K9R2M9j57K06k96P2j39K67L7j02J87
$$ -139 65 37 107 -151 -20 -31 -89 74 220 66 68 -54 -25 67 116 -41 165 -131 -59 -198 69 106 4 191
7942A91k37Q5j11O2J29o0j82J10J47k79L49j45k01K1L32jm3k10Q7L4n3Q6j31o7
$$ 191 -46 39 -72 -10 119 59 -123 -13 134 -145 204 59 -142 -121 211 210 167 -43 44 78 25 111 -20 -87
7966h7o2P4PQ0r8R5J97j70K01k17n2j01rj9M11l30j61L3j4K43j6P5j31N4j12J85
$$ -87 -149 -75 -68 12 -86 9 206 36 237 20 -32 -133 -142 -161 250 -80 -241 -208 -222 21 5 80 -51 3 -109 76
7992G6J01p8j9l15L06P0q8k09J73K1J26l22P6K98l04L92j84k36K12q1j88lK21
$$ 76 177 99 80 -235 71 141 53 -156 17 38 164 -158 -82 216 -88 304 120 -116 96 15 -173 -176 45
8015D5%J23l37K96k35J94P4l1k56L79j92j32J43k04J79O0k00j63L54k79K16J59
$$ 45 45 168 -169 127 -108 86 160 129 -127 252 60 -72 71 -133 46 106 -94 -257 97 -182 34 193
8037A93j30k48J72j1J8j26L66m16M5Qj6J80o3J27J03p2m55L18QN5O3J3j54p3L6
$$ 193 63 -185 -13 -24 -6 -132 234 -182 -137 -129 -145 35 -28 99 202 130 -325 -7 1 56 119 132 -22 -95 -59
8062e9J62j08k1j47L36j91l6K90k04L7M36m17j5k64J27j9M7mK74k26J16l2O3k27
$$ -59 103 -5 -26 -173 163 -28 -64 226 22 59 495 78 63 -201 -74 -93 -46 -50 224 -2 114 82 145 -82
8086h2J50j23N2o1m3O7M6N5j04K7M5J37j01j94J40p9j99L37n7O3m1R7l4m9n6j21
$$ -82 68 -55 -3 -64 -107 -40 6 61 -43 -16 29 166 65 -129 11 -68 -267 70 13 76 35 132 98 49 -7 -128
8112a28J48J31o5j30O9j3r8J28J24j59j88R5J87J45j94j51RJ66j48L5J32j93L34
$$ -128 20 151 86 -44 25 12 -86 42 166 7 -181 -86 101 246 52 -99 -90 76 -72 -37 95 -98 236
8135B36k77Q0j46k5K10k64J27K67l13j2MJ86k0j59M5Q0j04MLJ16q1Q0j67%J13
$$ 236 -41 39 -107 -132 78 -186 -59 208 -105 -117 -113 73 53 -106 -61 19 -85 -81 -78 38 -43 37 -130 -130 -17
8160a7J00M6k02q4p6j13K92j37p7N51k52q3K08P3k80kL52m18K58P4k32qQ5r7q1
$$ -17 83 129 -73 -157 -233 -346 -54 -191 -268 283 31 -52 156 229 -51 -53 299 -119 139 213 -19 -27 58 -39 -120
8185a20K19k75K33r1Qr5
$$ -120 99 -176 57 -34 -26 -121
8191a21
$$ Imaginary data points
##PAGE= N=2
##DATA TABLE= (X++(I..I)), XYDATA
0@%%%%%%%%%%%mJ2j6J6j6K4l2L7m5N6o4P2q8J04j21J44j68J93k24K56k91L30l74
$$ 0 0 0 0 0 0 0 0 0 0 0 0 -4 8 -8 8 -8 16 -16 21 -24 32 -32 40 -48 56 -65 79 -89 104 -120 136 -155 175 -199
34a99M24m78N38o05O75p53Q41r34J038j151J272j407J554j714J889k080K292k525
$$ -199 225 -253 285 -320 355 -398 443 -491 547 -604 668 -739 815 -899 990 -1090 1202 -1323
52a323K783l072L393l751M158m625N164n796O548p464Q607j0074J2040j4833J9141
$$ -1323 1460 -1612 1781 -1970 2188 -2437 2727 -3069 3479 -3985 4622 -5452 6588 -8245 10896
67A0896k6710M3889j55216J1072K92993o2663j42059m6626P5651J564o578K7086
$$ 10896 -15814 28075 -127141 -116069 176924 114261 -27798 -74424 1227 2791 -3787 23299
79B3299J3539m3616J8510J2674n2673m1261P9531Q4678o7291j42945K9541J42243
$$ 23299 36838 -6778 11732 24406 -28267 -69528 10003 94681 27390 -115555 -86014 56229
91E6229L5692q4848n9508J2814M1277K7330K2411k6913o5331K102N8224L334k9247
$$ 56229 91921 7073 -52435 -39621 1656 28986 51397 24484 -40847 -38745 19479 22813 -6434
104f434J206J5567j8485k8600K2586L3924r502M134Q797m6668l7535N4845Q6063
$$ -6434 -5228 10339 -8146 -36746 -14160 19764 10262 14396 23193 -23475 -61010 -6165 79898
117G9898j4763j06517l2230P1512M0109j7930j5651j2362k0890j238M3916K5052
$$ 79898 65135 -41382 -73612 -2100 38009 20079 4428 -7934 -28824 -30062 13854 38906
129C8906n0156k1163N5476O123o5428o708Q2628L8267q2064o8173M8429N8342
$$ 38906 -11250 -32413 23063 29186 -36242 -42950 39678 77945 -4119 -72292 -23863 34479
141C4479n036k2268j9446j7863J864L5564L2217k9761m1858K1990K8622j6999
$$ 34479 29443 7175 -12271 -30134 -28270 7294 39511 9750 -32108 -10118 18504 1505
153A505j3202K3616K4942k8797m7981J3797M2676P862j3494k2079j7467P763K6549
$$ 1505 -11697 11919 36861 8064 -39917 -26120 16556 24418 10924 -11155 -28622 -20859 5690
166E690K1925j3611l0331O313J5286p559N568J7010l308k5453k1555J6381K8610
$$ 5690 27615 14004 -16327 -10014 5272 -2287 3281 20291 16983 -8470 -30025 -13644 14966
179A4966J522q329j6510j9541J2368L0151J1317j7134k6467O674K0116p700k962
$$ 14966 16488 8159 -8351 -27892 -15524 14627 25944 8810 -17657 -10983 9133 1433 -1529
192a529J4845q49k1051j7961J4457L1062j395j5874q695j2646M976K5921J3517
$$ -1529 13316 12467 -8584 -26545 -12088 18974 17579 1705 -6990 -19636 -14660 11261 24778
205B4778j1903k7041p142K0899Q636M8L076j1590j3475M94J1998J7533l818j7360
$$ 24778 12875 -14166 -21308 -409 8227 8275 11351 -239 -13714 -13220 -1222 16311 12493 -4867
219d867k021j962j425J3625J0878J33j7058j9958R347K1799J0850m00k4139k1574
$$ -4867 -6888 -8850 -10275 3350 14228 14361 -2697 -22655 -13308 8491 19341 18941 -5198 -26772
233b6772J4778K5383P855j7636k0499Q345J0246o296L437Q977K880p200j8729
$$ -26772 -11994 13389 21244 3608 -16891 -8546 1700 -4596 -1159 7818 10698 3498 -15231
246a5231p05K1535J4600p71k2685k4648J2168K8133R127j4772k4161J860J7554
$$ -15231 -15936 5599 20199 19428 -3257 -27905 -15737 12396 21523 6751 -17410 -15550 2004
259B004O26L43O123l259p274r361K092J6903N402m992j1377j6469N764K0602P175
$$ 2004 2630 2973 9096 5837 -1437 -10798 -8706 8197 13599 8607 -2770 -19239 -13475 7127 14302
274A4302n581j4876q257R114P010P860N433j3474j3076K59Q781J4094j254j2247
$$ 14302 8721 -6155 -14412 -5298 1712 9572 15005 1531 -11545 -11286 -2505 11589 10335 -1912
288a912l407m450K293J3231M123k536o987j0968K650P825Q767P496j5245j8313
$$ -1912 -5319 -9769 -7476 5755 9878 7342 355 -10613 -7963 -138 8629 16125 880 -17433
302a7433N431J3744J0132k610j2827j908L5M78J1361L922o129n981q472K552R923
$$ -17433 -12002 1742 11874 9264 -3563 -5471 -5436 -4958 6403 10325 4196 -1785 -10257 -7705 2218
317B218M262L619q999j5551M887J3041P217p38j1933m390J811q40J0243O947r776
$$ 2218 6480 10099 1100 -14451 -9564 3477 10694 9956 -1977 -6367 -4556 -5396 4847 11794 2018
332B018q430m605N394J2046O38k764l244r830K604R637L253K355q580r627K256
$$ 2018 -6412 -11017 -5623 6423 7061 4297 1053 -8777 -6173 3464 6717 9072 492 -9135 -6879
347f879L003P902P169j0162r173q67N283J2371R47q263k198n304P15R304J362
$$ -6879 -3876 4026 11195 1033 -8140 -9007 -3724 8647 9594 1331 -867 -6171 -5456 3848 5210
362E210n22m243j0039K461O667N216M907q774q232K721K269P581N269q291o175
$$ 5210 4688 445 -9594 -7133 -466 4750 9657 883 -7349 -4628 -2359 5222 10491 2200 -3975
377c975m023J475J1287K149n136l054o579K502Q904J798J569o043q871M571L675
$$ -3975 -7998 -6523 4764 6913 1777 -1277 -7856 -5354 3550 5348 6917 874 -7997 -3426 249
392B49J609M806m197o687l686N30J2880M939r793l859j561R25P683J460m69l949
$$ 249 1858 6664 2467 -4220 -7906 -7376 5504 10443 650 -3209 -4770 -3845 3838 5298 4829 880
408H80r956K396Q892K260P84o186m942L200J76N163O460o675o031m24P29N216
$$ 880 -9076 -6680 2212 4472 5256 -930 -5872 -2672 -2496 2667 9127 2452 -3579 -4003 -3274 1942
424A942R16r93N92q984k705J0690O248N63q809j0130P014R043P2j534n781k024
$$ 1942 2858 1865 2457 -6527 -9232 1458 7706 8269 -540 -10670 -3656 5387 5459 3925 -1856 -3880
440c880J635j805N043L355n107P56p52l761M300L783K759j781j1599j218Q936
$$ -3880 -2245 -4050 993 4348 -759 -3 -755 -4516 -216 3567 6326 4545 -7054 -8272 664
455F64N250J518q944q060N634M293K543L727o291m635K736K484L431l890m083
$$ 664 5914 7432 -1512 -9572 -3938 355 2898 6625 334 -4301 -1565 919 4350 460 -3623
470c623N618q92m279N75J63P216K975j2519n004P796R744L833j1409r193M306
$$ -3623 1995 1103 -3176 -2601 -2438 4778 7753 -4766 -9770 -1974 7770 11603 194 -8999 -4693
485d693M489N524O07j0349j808N875K350J192o040n58R705j231r457l138O773
$$ -4693 -204 5320 5927 -4422 -6230 -355 1995 3187 -2853 -3411 6294 5063 -4394 -7532 -759
500g59J3025m828j7552L35Q867N340L268p023o960J518N211Q496l988j1902L114
$$ -759 12266 7438 -10114 -9779 -912 4428 7696 673 -6287 -4769 442 8938 4950 -6952 -3838
515c838P231k4l813n712M834R072o785q427J863P207Q172m400j0544m64K122P797
$$ -3838 3393 3369 -444 -6156 -1322 7750 965 -7462 -5599 1608 9780 5380 -5164 -5628 -3506 4291
531D291N219r484p614K283M253P297j998q352Q36L758K446j703n573O688O383
$$ 4291 9510 26 -7588 -5305 -1052 6245 4247 -4105 -3269 489 2935 1232 -4341 2347 8730
546H730j0057n325L294L588L518k074k407j104m745O458J0216n708r544k523P939
$$ 8730 -1327 -6652 -3358 230 3748 1674 -733 -1837 -6582 -124 10092 4384 -5160 -7683 256
561B56R854p895r088O059K269l821r71L052N315l893m865N413k096l437Q316K065
$$ 256 10110 2215 -6873 -814 1455 -2366 -3337 -285 5030 1137 -3728 1685 -411 -3848 4468 6533
577F533p059o675J063J1566J892j0001k190K681K612J944l091K591L374o946j966
$$ 6533 -526 -7201 -6138 5428 7320 -2681 -4871 -2190 422 2366 -725 1866 5240 -1706 -3672
592c672L360Q55K079k153k809J454j666K330K977l001P73n19l002N164K454m350
$$ -3672 -312 543 2622 469 -2340 -886 -2552 -222 2755 -246 527 8 -2994 2170 4624 274
608B74o48j189p27O19O61O390k510j0856L917Q671k73l208m170K908M388o257
$$ 274 -374 -1563 -2290 -1671 -1010 5380 2870 -7986 -4069 4602 4329 1121 -3049 -141 4247 -2010
624b010j132N394m08j843l384J38M640k222J520N987p325n799N880N185L67o356
$$ -2010 -3142 2252 1844 1 -3383 -3245 1395 -827 693 6680 -645 -6444 -564 4621 4988 -1368
640a368l615O033o93j928L258k397j274J908q55L432n68l704L633K24l420p5l53
$$ -1368 -4983 1050 357 -1571 1687 -710 -1984 -76 -931 2501 1933 -1771 1862 2086 -1334 -1409 -1762
657a762M180J537p334r27K669K190N005l217p335K709L340K762o80n353Q46J408
$$ -1762 2418 3955 -3379 -4306 -1637 553 5558 2341 -4994 -2285 1055 3817 3137 -2216 -1370 38
673C8j506K438k203j795N800M8n099j272K165P328k24r467p03L794L062J758n901
$$ 38 -1468 970 -1233 -3028 2772 2820 -2279 -3551 -1386 5942 5718 -3749 -4452 -658 2404 4162 -1739
690a739k448L345J66K652P23n164J606L103q36j264k958L762M525p286l414L726
$$ -1739 -4187 -842 -676 1976 2699 -2465 -859 2244 1408 144 -2814 948 5473 -1813 -5227 -1501
706a501K055K743j877m191J121N95K544L557m692k442J541l68K222j209k230L511
$$ -1501 554 3297 1420 -2771 -1650 -1055 1489 5046 354 -2088 -547 -915 1307 98 -2132 1379
722A379j325l040K507N98J952M73l399O99l73p98M861j054m588j05o58K988K894
$$ 1379 54 -2986 -479 119 2071 2544 -855 -156 -529 -1327 3534 2480 -2108 -2213 -2871 117 3011
739C011l775J3N85j066L474j370j203K625k791j096J450j865K733J292l355Q7
$$ 3011 -764 -751 -166 -1232 2242 872 -331 2294 -497 -1593 -143 -2008 725 2017 -1338 -1251
755a251j300J380N445k527k921O04o61K985J65l779K329l24k394J612p02J673
$$ -1251 -2551 -1171 4274 1747 -1174 -570 -1231 1754 1919 -1860 469 145 -2249 -637 -1339 334
771C34K275l481L48Q48j782M067M81m310J21o72J742K453m236L90K638k454Q23
$$ 334 2609 -872 -524 324 -1458 2609 3090 -1220 -1099 -1771 -29 2424 -1812 -1422 1216 -1238 -415
788d15N57J43L231l498j912L339j916M99J485k818M36o41l01M304j960j967K765
$$ -415 142 285 3516 18 -1894 1445 -471 28 1513 -1305 -869 -1510 -1811 2493 533 -1434 1331
805A331j429K6J128j208J962q97m006K679O57o57J381k077L53J471k068K799J398
$$ 1331 -98 -72 1056 -152 1810 913 -3093 -414 243 -414 967 -1110 -757 714 -1354 1445 2843
822B843l448O18n6m97K384k871J67J883k959O62J581r16K247j310j826L080j621
$$ 2843 -605 13 -43 -540 1844 -1027 -860 1023 -1936 -1274 307 -609 1638 328 -1498 1582 -39
839c9K19K017k401p29k37m74L516j453k992K691j33j23J545j594J397O44l439
$$ -39 180 2197 -204 -933 -1170 -1644 1872 419 -2573 118 -15 -138 1407 -187 1210 1854 -1585
856a585J641L82j693K101j367j132J200j527L041K133m442K21J349M71J642k927
$$ -1585 56 438 -1255 846 -521 -1653 -453 -1980 1061 3194 -1248 -1027 322 793 2435 -492
872d92o51K148k587M81K025k048J217J95j402K310j597J12L238k437j584L91j67
$$ -492 -1143 1005 -1582 -1101 924 -1124 93 288 -1114 1196 -401 -289 2949 512 -1072 -681 -848
889h48L004j184l531K054j05m01K952j570m49O16j650K684o2l192K381l14r67
$$ -848 2156 972 -2559 -505 -610 -1011 1941 371 -78 538 -1112 1572 1510 -1682 699 385 -582
906e82O30k419J898K884l053l82J013p60K928p02j614J268l101R72L699l226p93
$$ -582 48 -2371 -473 2411 -642 -1024 -11 -771 2157 1455 -159 1109 -1992 -1020 2679 -547 -1340
923a340L06k06K796j180j893L167n79r60O26k235K481J107l568J873q02k588L366
$$ -1340 -1034 -1240 1556 376 -1517 1650 1071 111 737 -1498 983 2090 -1478 395 -407 -2995 371
940C71Q86r36o72j763L579K053m303N19M89o47J718k000p91K560j907m02J255
$$ 371 1257 321 -351 -2114 1465 3518 -785 -266 223 -424 1294 -706 -1497 1063 -844 -1246 9
957Ij490J968P91m41J560l278j614M437o80j352o02j421K710K22k210J694m57
$$ 9 -1481 487 1278 837 2397 -881 -2495 1942 1262 -90 -692 -2113 597 819 -1391 303 -154
974a54r8J927k236R61J474k959J547J059l483L59J168J520N66m257J018L930j830
$$ -154 -252 1675 -561 400 1874 -1085 462 1521 -1962 -1603 -435 1085 1651 -2606 -1588 2342 512
991E12jj81j557K430m45j378J790k145j014J886l81R27n04j440M359j925l731
$$ 512 511 330 -1227 1203 758 -620 1170 -975 -1989 -103 -484 443 -61 -1501 2858 933 -2798
1008b798K986J169j83l4k809R60O85j296K082m76j768J747r44R79K327l542K75
$$ -2798 188 1357 1174 1140 -1669 -709 -24 -1320 762 286 -1482 265 -679 300 2627 -915 -640
1025f40K458j542j76j015K0K264k315n64K267j734J188Q80k361J717O07j235K096
$$ -640 1818 276 100 -915 -895 1369 -946 -1510 757 -977 211 1091 -1270 447 1054 -181 1915
1042A915j332k319J073q21K558k7l424K422R35k415K175J21p02J405k140J75J231
$$ 1915 583 -1736 -663 -1484 1074 1047 -2377 45 980 -1435 740 861 159 1564 -576 -401 830
1059H30k264K043N5j953J170j169J88L460k055j062J875j039N01j04j311J551
$$ 830 -1434 609 664 -1289 -119 -1288 -1100 2360 305 -757 1118 79 580 476 -835 716
1075G16j787j47K983k602r73K564j384J242L55j643K263o32j465J120j687P09
$$ 716 -1071 -1218 1765 -837 -1810 754 -630 612 967 -676 1587 955 -510 610 -1077 -368
1091c68K109k858O56K01j901L037P82k237J071n10K84J097k144J327N95k915J958
$$ -368 1741 -1117 -461 -260 -2161 876 1658 -579 492 -18 266 1363 -781 546 1141 -1774 184
1108A84l7k596K631L63n17O89j974J434J334j565Q37p76j378K544j283j065J533
$$ 184 147 -2449 182 545 28 717 -1257 177 1511 -54 783 7 -1371 1173 -110 -1175 358
1125C58j586L87J538r75P77l96m36K088k149n38K796j884m24L94k033J505J491
$$ 358 -1228 -841 697 -278 499 103 -333 1755 -394 -932 1864 -20 -444 -50 -2083 -578 913
1142I13j277O55p63K44J701k065J409J304l096N40Q71j846J129J12j31J306k300
$$ 913 -364 291 -472 -228 1473 -592 817 2121 -975 -435 436 -1410 -281 -169 -300 1006 -1294
1159a294O27K169j713J128l22j355J975p71j790K300j232j134J426l62R01q66
$$ -1294 -667 1502 -211 917 595 -760 1215 444 -1346 954 -278 -1412 14 -348 553 -313
1175c13j052L012q49k021K375l35q22M45j804J144Q74j775J549m41j051J743q65
$$ -313 -1365 1647 798 -1223 1152 817 -5 440 -1364 -220 654 -1121 428 -13 -1064 679 -186
1192a86O66J322k745Q18J755k439L48L81k18J033j923J46K424j777Q9J134j457
$$ -186 480 1802 -943 -125 1630 -809 -461 -80 -298 735 -1188 -1042 1382 -395 -306 828 -629
1209f29J642l03j386K061j487j026J763j142J12J8j184K584k38k093K548k69j287
$$ -629 1013 710 -676 1385 -102 -1128 635 -507 -395 -377 -1561 1023 785 -1308 1240 971 -316
1226c16R24j132N73J049k501J346L59j808J488j87l08J749j956N11K237k554M87
$$ -316 608 -524 49 1098 -1403 -57 302 -1506 -18 -205 -513 1236 -720 -209 2028 -526 -39
1243c9Q89j416J075r77n98J870j373m57K046j544M14P83o82J214p86j625K061
$$ -39 850 -566 509 -468 -1066 804 -569 -1026 1020 -524 -110 673 -9 1205 419 -1206 855
1260H55r10n34P82j350J069L85j693K009k6j182J465q12k00J256j729P11N98k168
$$ 855 -55 -589 193 -1157 -88 297 -1396 613 587 -595 870 58 -142 1114 -615 96 694 -1474
1278a474J250K12p89J562j269k20J876j417L52J139j530Q38l75j453K043j158
$$ -1474 -224 -12 -801 761 -508 -728 1148 -269 83 1222 -308 530 155 -1298 745 -413
1294d13p34J667j260L25R88r21J274l69j491J798m23p31O59j026M77L24k010J946
$$ -413 -1147 520 -740 -415 573 -348 926 557 -934 864 441 -290 369 -657 -180 144 -1866 80
1312H0L77j097J122n17j01J284j365P56Q26k705J028O97j052Q81q03m88J829j409
$$ 80 457 -640 482 -35 -136 1148 -217 539 1365 -1340 -312 385 -667 214 -589 -1077 752 -657
1330f57M55J575j428M78K89j338J493p17j018J500j269k94J218j064J051N01j978
$$ -657 -202 1373 -55 423 712 -626 867 150 -868 632 -637 -931 287 -777 274 775 -1203
1347a203J807J64j015J463j404j81R65j623Q48N57j662J145L20q24J397r14RJ340
$$ -1203 604 768 -247 1216 -188 -369 596 -1027 -179 378 -1284 -139 181 -643 754 -160 -151 1189
1365A189j428Q0R67j172Q85m78j655J942m13p50J553j100M40P41j246J206j02
$$ 1189 -239 -159 808 -364 521 43 -1612 330 -83 -833 720 -380 60 801 -445 761 659
1382F59j664J680m27r10J099j262N09O52j450J114N57r83J401m75o81J053j368
$$ 659 -1005 675 248 -662 437 -825 -316 336 -1114 0 557 -426 975 500 -181 872 -496
1399d96L59J042j841L14M46n98J140p59m76J807j043K1J190j166L69K49j235O77
$$ -496 -137 905 -936 -622 -176 -774 366 -393 -869 938 -105 -84 1106 -60 309 558 -677 0
1417@p0j184J699q38p3N88p31J182M68j586J078Q8j236R64n25k03O17j558J011
$$ 0 -70 -1254 445 -393 -466 122 -609 573 1041 -545 533 621 -615 349 -176 -379 238 -1320 -309
1436c09P91j623J582K01q29R24r01j4J525j566r6M27q27R03l58o72J596j103l78
$$ -309 482 -1141 441 642 -187 737 -164 -178 1347 -219 -315 112 -715 188 -170 -842 754 -349 -727
1455g27J965j172j25P87q89P71p26j160J783r11m08J172j086N39J133j603J282
$$ -727 1238 66 -59 728 -161 610 -116 -1276 507 -404 -812 360 -726 -187 946 -657 625
1472F25K68j378J149r3l71M98j758M06J331j750P19J071j156Q37m72l0J434j507
$$ 625 893 -485 664 571 200 698 -1060 -654 677 -1073 -354 717 -439 398 -74 -104 1330 -177
1490a77P3J220j738M59k6o02J621j120j227K105o9m70L29n99J034k63j267J545
$$ -177 -104 1116 -622 -163 -189 -791 830 -290 -1517 588 519 49 378 -221 813 550 -717 828
1508H28m80j695J579m05k93P52j039O94R27j566J039L50l30O66j716M03J403k051
$$ 828 348 -1347 232 -173 -466 286 -753 -59 868 -698 341 691 361 1027 -689 -286 1117 -934
1526i34K13J418j188n3L20L07J153j465j96J752j357j53M53j271J382k53j555
$$ -934 -721 697 -491 -544 -224 83 1236 -229 -425 1327 -30 -183 270 -1001 381 128 -1427
1543a427J675r8p98R86l53O51o3j389J840j72k148J383J23n73L96q32J34J078
$$ -1427 248 150 -648 338 -15 636 573 -816 1024 852 -1296 87 210 -363 33 -799 -665 413
1561D13q47M08O05n00P32p79o04K117j871l59J294j012l85N01l87J127n94k38
$$ 413 -434 -26 579 79 811 32 -572 1545 -326 -685 609 -403 -788 -287 -674 453 -141 -379
1579c79J545j204j93J026r74M06K00j229R49k9j173P04K68M86k81r32J453N69
$$ -379 1166 -38 -231 795 -179 227 427 -802 147 118 -1055 -351 -83 403 122 -810 643 1212
1597A212k136J014P28j178P52o49j48M49q23Q29M51q88Q63j10n58R77p69m03J283
$$ 1212 -924 90 818 -360 392 -257 -405 44 -779 50 501 -387 476 366 -192 785 16 -387 896
1616H96j131p46Q95j86M59n14m55J721j212o66J817o12k9O61j331M44K0r70J210
$$ 896 -235 -981 -86 -272 187 -327 -782 939 -273 -939 878 266 237 898 -433 11 31 -939 271
1635B71p17k79J334j278M05J117j428R03O18j188P02j9p62M64q79M52R20j191
$$ 271 -446 -725 609 -669 -264 853 -575 328 946 -242 460 441 -321 143 -736 -284 636 -555
1653e55L03M59r98J274k96n28J350p00q46P71p48P01Qj294J426l31p97J233k12
$$ -555 -252 207 -791 483 187 -341 1009 309 -537 234 -514 187 195 -1099 327 -4 -801 432 220
1672B20m87J179j106L34K60r23R27k70r14R34n20P6N56j118N06J429j364N57M0
$$ 220 -267 912 -194 140 400 -523 404 134 -780 154 -366 -290 266 -852 -346 1083 -281 276 316
1691C16l25N18r11p8J136j041l64Q24r05R45N35j030J070l88m26Q49j077M20L39
$$ 316 -9 509 -402 -480 656 -385 -749 75 -830 115 650 -380 690 302 -124 725 -352 68 407
1710D07p83N00j26j079J519j41r40J043j67J14K62j302J002M07j069P56n86n61
$$ 407 -376 124 -2 -1081 438 297 -643 400 233 347 609 -693 309 716 -353 403 -183 -744
1728g44J251j008k73J286p80O71O5q19R75k73p40R82q87o2Q20j243N39L76o23
$$ -744 507 -501 -774 512 -268 403 468 -351 624 351 -389 593 -294 -356 464 -779 -240 136 -487
1747d87P73j14p53J208l62l41O85r40O40L70j565P69L08p15P32p17K99J076j195
$$ -487 286 172 -581 627 265 -76 609 -331 309 679 -886 -117 191 -524 208 -509 -210 866 -329
1766c29K69O91q12O65m90n50R07p18n86J284j019M55N62m22K66j70k05J297q40
$$ -329 -60 631 -181 484 -6 -556 351 -367 -953 331 -688 -233 329 -93 173 3 -202 1095 255
1785B55q68J177l91j79K0r69J216R3j202R46K81l90P78q75J27P29j191O24Q8j018
$$ 255 -613 564 173 -6 14 -955 261 354 -848 98 379 -11 767 -108 19 748 -443 181 269 -749
1805g49O34N7p11J141p58L62Q75j425N88Q12q63M02p17m43J435q60m93P76l62
$$ -749 -115 -58 -769 372 -386 -24 851 -574 14 826 -37 365 -352 -795 640 -220 -713 63 -299
1824b99M68j38q08J563k22j069J069n02j27L82r64N57M04j165R67k3l23Q10m94
$$ -299 169 31 -777 786 564 -505 564 62 -65 317 -647 -90 314 -851 116 93 -230 580 86
1843H6j78P25r59M75R68j675P1M82k47M26p12L1J125p60j93O24m30N43k75o85
$$ 86 -92 633 -326 149 1117 -558 -487 -5 -252 174 -538 -507 618 -142 -335 289 -141 402 127 -558
1863e58R40j56p55P39o62Q8N19p02Q36m6p14J268k17q55N63k93Q6M8j019P20P49
$$ -558 382 226 -529 210 -452 -364 155 -547 289 243 -471 797 580 -275 288 -5 81 129 -890 -170 579
1884E79j480P82m5R8P44j103J55J347j081j15J13k07O30m73m43R05o84k05J119
$$ 579 -901 -119 -164 -66 678 -425 -270 1077 -4 -119 -6 -213 417 -56 -499 406 -278 -483 636
1903F36q82L76K27o99J070o15o89J244o11q05O55l41M85J73j310J388R0o77P53
$$ 636 -246 130 357 -342 728 113 -576 668 57 -748 -93 -434 51 224 -1086 302 392 -285 468
1922D68m75L62L64j287L44P67j093M33J02m13O70k38j41Q24r55K89Q05r09J95
$$ 468 -7 355 719 -568 -224 543 -550 -117 -15 -428 242 4 -137 687 -268 21 826 -83 112
1941A12Q3m00O64o89o95J409l16n79N12m66Q96n2j041J269l85p51O71p49M8J050
$$ 112 195 -205 459 -230 -925 484 168 -411 101 -365 531 479 -562 707 322 -429 242 -507 -459 591
1961E91j434M95N07o18Q73N2n15O54n06J76K97j243O53P47j214J34J89Q3O57r50
$$ 591 -843 -348 159 -459 414 466 -49 605 99 275 572 -671 -18 729 -485 -351 -162 -79 578 -372
1981c72q8J104m95K70J67q12Q43l75j282J236k94l31O06o18M94J15o72R55k8q26
$$ -372 -460 644 149 419 586 -226 617 242 -1040 196 -98 -429 177 -441 53 168 -504 451 423 -403
2001d03J238o27o50M93l64M20J11r75M07O86n30M20k35m6J385j465j80Q22n79
$$ -403 835 208 -442 51 -313 107 218 -757 -350 336 -194 226 -9 -55 1330 -135 -315 507 -72
2020g2J49j28m04O32m77j55Q60o33L41O49j012L14K35m97O02n09m50Q89n61r6
$$ -72 77 -51 -455 177 -300 -455 405 -228 113 762 -250 64 299 -198 404 -105 -555 334 -227 -323
2040c23J86m15R93J50j234R47J94p04N05n29N1O91r78J70L53o80Q27K11q29J089
$$ -323 -137 -552 441 591 -643 304 498 -206 299 -230 -179 512 -466 -296 57 -623 204 415 -414 675
2060F75n38m27O91o45L40L22o49K56l48l14J018r86K63R14l02j73K17n67N47J46
$$ 675 137 -290 401 -244 96 418 -231 25 -323 -637 381 -605 -342 572 270 97 314 -253 294 440
2080D40p85O26o08k7N84j105O29Q47j082N98K43n75O24j17k02K29p64N55O4q40
$$ 440 -345 281 -327 -354 230 -875 -246 601 -481 117 360 -215 409 292 90 319 -445 110 174 -666
2100f66N92K95r36P77l21j64J047m65k26N20m68N03n33r50J309j37q65R40k23
$$ -666 -74 221 -715 62 -259 -423 624 159 -67 453 -15 488 -45 -995 314 177 -688 252 29
2119B9j9J60n10M90N28o79L39n01m87R34n57k6N95q61L39M75m82L40j29J57L20
$$ 29 10 170 -340 150 678 -1 338 -163 -650 284 -273 -299 296 -565 -226 249 -233 107 -22 135 455
2140D55q13P4J075r65j61N36p12P31j45p32P95L11n06M61n82O58J37j327P79J88
$$ 455 -358 -284 791 -174 -335 201 -511 220 75 -657 138 449 -57 404 -178 480 617 -710 69 257
2160B57o77P62l43n35M89oL23k0o73P46J10r57J047p13L1Q08j021l1O29m48J42
$$ 257 -420 342 -1 -536 -47 -53 270 250 -423 323 433 -524 523 -190 -159 649 -372 -403 226 -222 -80
2181h0k6q3P90o44j78P94p34l6M56o58L81J07p33R17l31l70R66o74K28L99q59
$$ -80 -106 -189 601 -43 -221 573 -161 -197 259 -399 -18 89 -644 273 -58 -428 538 -136 92 491 -368
2202c68P16n8q44N68L31p46M17m40L87O54j182P27N85r34N86m51j79R52p91k76
$$ -368 348 290 -554 14 345 -401 16 -424 -37 617 -565 162 747 -187 399 -52 -231 721 -70 -346
2222c46O12o25J10L06n68P82k97k88R58n97k72R32q20N1J56n81P31k22p99J051
$$ -346 266 -359 -249 57 -511 271 -26 -314 644 47 -225 707 -113 -62 94 -487 244 22 -777 274
2242B74k96k2N15q41M35N61q81J56O16p06J88l28O7P01o96j33Q05r45N64L40l16
$$ 274 -22 -44 471 -370 65 626 -255 -99 517 -189 -1 -329 -262 439 -257 -390 415 -530 34 374 58
2263E8M13n96j66J056j027j85N88o05M09Rl01J059m46p79R12k36k1L06p35N30
$$ 58 471 -125 -291 765 -262 -447 141 -464 -55 -46 -347 712 266 -513 399 163 142 448 -287 243
2283B43J10r90M41L45o49Q15o91K70O44p56L27N80j168O84Q2n48L57n63K74N13
$$ 243 353 -637 -196 149 -500 315 -376 -106 538 -218 109 689 -479 205 287 -261 96 -467 -193 320
2303C20q13K15P43o05M47k08j67N68m24k18M50m89j21N28p42P34ln28O52k41j79
$$ 320 -493 -278 465 -140 307 99 -68 500 76 -142 308 -181 -302 226 -516 218 215 -313 339 98 -81
2324h1M62l34k5M93q78M73J70j037Q18k57P2N64p41L39M53q48L73K91k35K59m95
$$ -81 381 47 22 515 -363 110 280 -757 61 -196 -124 440 -301 38 491 -357 16 307 72 331 -164
2345a64j13O58o62j5M80m72K92J56l70P95l53n04P83m41k19M65q06O36j13o18
$$ -164 -277 381 -281 -296 184 -288 4 160 -210 585 232 -272 511 70 -149 316 -490 146 33 -585
2365e85P72M2o37P89k11j54N07n99L05K41q23K68o5j2M22l42l62P00n92K45P86
$$ -585 187 229 -408 381 170 16 523 -76 229 470 -353 -85 -150 -162 260 -82 -444 256 -336 -91 695
2386F95p28M37j93k49L38n26j35N86m12p0K97k01L79m5n14O61k87k11O58o82K15
$$ 695 -33 404 211 -38 300 -226 -361 225 -187 -257 40 -161 218 173 -341 320 33 -178 480 -202 13
2407A3K04r11P19J09l36K65j79J9N79n97J52L94n62M54ro41L52k49p1M47k78j88
$$ 13 217 -694 25 134 -202 63 -116 -97 482 -115 37 431 -131 323 314 -327 25 -224 -295 152 -126 -314
2429c14O91l59pL29n05N66l03n25P13m68J32K23n33N60j35n00R76j77o14P59k84
$$ -314 377 18 11 340 -165 401 98 -427 286 -182 -50 173 -360 200 65 -435 541 364 -250 509 225
2450B25r6K42n64K82p5n94M74J21k89O22l96l74Q61n13J30K47l42K29m41j3N04
$$ 225 129 371 -193 89 14 -580 -106 15 -274 348 -48 -422 439 -74 56 303 -39 190 -251 -264 240
2471B40m30l58J000o54J41M02n37M60R0n86P27l43l77L47n35K35N03o97O00k92
$$ 240 -190 -548 452 -202 -61 341 -196 264 354 -232 495 152 -225 122 -413 -178 325 -372 228 -64
2491f4o73R92n1k07M93n27k37P06o48L07m6n46Q95p16j20Q74n77n3O30l73q3K18
$$ -64 -737 255 204 -3 490 -37 -274 432 -216 91 45 -501 394 -322 -442 432 -145 -198 432 59 -24 194
2513A94k71K53j80m22O44l99l35P19n19M47L51p65N31n1n24M77l16K00L97q68
$$ 194 -77 176 -4 -426 218 -181 -516 203 -316 131 482 -283 248 197 -327 150 -166 34 431 -437
2533d37M26N6l41J73K30k14M79l41K0J42m35J89L05o09L59q8m15P27l58O3K33
$$ -437 -11 45 -296 -123 107 -107 372 31 51 193 -242 -53 252 -357 2 -86 -501 226 -132 -69 164
2554A64k31O5J46j66M47m45m10Q00l38m92P97p53K47M14j43j02L26n12K44J31
$$ 164 -67 -2 144 -22 425 -20 -430 370 32 -460 337 -416 -169 245 102 0 326 -186 58 189
2574A89j90L60p03J18O67q09J13M06k61J30m1J53K49o30N46J54o51K81O2j95P5
$$ 189 -1 359 -344 -226 441 -368 -255 151 -110 20 -21 132 381 -249 297 451 -200 81 143 -52 23
2595B3j6k28L12l03Q3J83k72N40j54n36O66N8p22M32k3k72J37j31K99j27l17N02
$$ 23 7 -221 91 -212 -129 54 -218 322 168 -368 298 356 -366 66 43 -229 -92 -223 76 -51 -368 134
2617A34K93m44L14l39j28L87m52j36M88m09K45l3j28L61l71NQ26o21k63N01l96
$$ 134 427 -17 297 -42 -170 217 -235 -371 117 -292 -47 -80 -208 153 -218 -213 613 -8 -271 230 -166
2638a66K74r2l44M84k58k43N83l96M28o9l85K81M14q53N89J0l50P3k42K20L17
$$ -166 108 16 -328 156 -102 -345 238 -158 270 201 -184 97 511 -342 247 257 -93 -20 -262 -42 275
2659B75o95L45J69j33K24k03r1L93k29l07O44n12O1N0l56L58k06j52Q40m92n6
$$ 275 -420 -75 94 -39 185 -18 -109 284 55 -252 392 -120 -59 -9 -365 -7 -213 -365 475 -17 -73
2680g3L09j64J63k02k58L69k38j49L96j73j14K95m44J45N18n24J58J60m61N48
$$ -73 236 72 235 33 -225 144 -94 -243 153 -20 -134 161 -283 -138 380 -144 14 174 -287 261
2700B61l95K41J58n17K03J69l27K43r2k28N82k65n8M19n18J61K4l63K73p0k13
$$ 261 -134 107 265 -252 -49 120 -207 36 -56 -284 298 33 -25 394 -124 37 61 -302 -29 -99 -312
2721c12O70l33k24M68j15j07K31l15J82k05k66M98m14qL09j12j55M48l70K99K36
$$ -312 358 25 -199 269 154 47 278 -37 145 -60 -326 172 -242 -250 59 -53 -208 240 -130 169 405
2742D05m63M23k69kJ28n76L52L46p36K59Q1r3L95k81k1M32l33M0J22k13r6K84
$$ 405 -58 365 96 94 222 -354 -2 344 -392 -133 -52 -145 250 -31 -52 380 47 87 209 -4 -100 184
2764A84n88M62p9l21M25k17L6J28k8K83q7m98O58j37l60K78j30q0j3j45K43K00
$$ 184 -404 58 -21 -342 83 -134 -98 30 2 285 198 -300 358 221 -139 139 9 -71 -84 -229 14 214
2786B14m41L25j9l3J84l04K9J25k98J75M45n67R4j41p3O36l62k64P85m13k11K86
$$ 214 -227 98 79 46 230 -74 -45 80 -218 -43 402 -165 -71 -212 -285 351 -11 -275 510 97 -114 172
2808A72k09K67l05j40J72r1k69N59l21R2K07l41M23J43n62K83k9k63M16m94K46
$$ 172 -37 230 -75 -215 -43 -134 -403 156 -165 -73 134 -207 216 359 -203 80 51 -212 204 -290 -44
2829d4J88o56M28J17k43M46m1n4o1l4k74O33m40K0J4l30M97k23j48K98N0j34K34
$$ -44 144 -512 -84 33 -210 236 195 141 80 46 -228 405 -35 -15 -1 -331 166 -57 -205 93 143 9 243
2852B43k55J00K2k26J77J42o20M11j57r7M71k26l8L21m51M70j56MJ74k97k12L94
$$ 243 -12 88 110 -116 61 203 -417 -6 -163 -260 211 -15 -53 268 -183 287 131 135 309 12 -200 194
2874A94l73n9K12k63L08P7p7M04k63j49J34m3j87L66n21K51R7j74M25l94l30O03
$$ 194 -179 -238 -26 -289 19 96 19 423 160 11 145 102 -85 281 -240 11 108 -66 359 -35 -365 238
2896B38m11J0L92l11J4K02k78K00r8k42L95m42J89K92m45L16R9j2RJ19l00K44
$$ 238 -173 -163 229 -82 -68 134 -144 56 -42 -284 111 -331 -142 150 -295 21 120 108 117 236 -64 180
2918A80j68k01L74l81RJ0L5L93j38k02L55p5m26J93q8L69k27n00N32m3k98J32
$$ 180 12 -189 185 -196 -187 -177 -142 251 113 -89 266 191 -235 -42 -130 239 12 -488 44 1 -297 -165
2940a65J88j60M92m42O5L84m03RP0j94K51j94k21O37l32r4L74l46J94m1n3J78
$$ -165 23 -137 355 -87 -22 362 -41 -32 38 -156 95 -99 -320 317 -15 -109 265 -81 113 72 19 197
2962A97k89k07M52j15l3M4q3l7K01m48M64J47l09J28n4P8l1m33L84P6l80L61J5
$$ 197 -92 -299 153 38 5 49 -34 -71 130 -318 146 293 -16 112 58 136 105 -328 56 132 -248 113 128
2985A28l60R2N1Q0L36m31J28K21m35L22n5l03J65k5k34N01k4j64L2j63L15o5m81
$$ 128 -232 -140 -89 -9 327 -104 24 245 -190 132 77 -226 -61 -86 -320 181 157 -7 25 -138 177 112 -369
3008c69M20J51k63J34m14K09J71k23K87j90o2Q8P9o1M13n74K86J77m82kL16n10
$$ -369 51 202 -61 73 -341 -132 39 -184 103 -87 -149 -61 18 -43 370 -204 82 259 -223 -225 91 -419
3030d19L89n7Q6J0j84Q9M05l28k14M55j00p7r9j96K16j48J00J93k99K15J44n70
$$ -419 -30 -87 -1 9 -175 -86 319 -9 -223 232 132 55 -44 -240 -24 -172 -72 121 -178 37 181 -389
3052c89P64k06l44J05J4M5k0j76Q6K40l51L13l04j01M32N7l30M19l42J53M9j52
$$ -389 375 169 -175 -70 -56 -11 -31 -207 -121 119 -232 81 -223 -324 108 165 -165 254 -88 65 114 -38
3074c8p8J61k55N16n79J10N51l05q3L50l96K41r6l16L68l38K3J20p8k7qo6K46
$$ -38 -116 45 -210 306 -273 -163 388 83 0 350 -46 195 99 -217 151 -187 -164 -44 -122 -149 -157 -223 23
3097B3R7q9J29K6r9J8l97M04J26p82N79L4l46N58k60k1K54l26k04K94k1q0j2k7
$$ 23 120 31 160 186 87 105 -292 112 238 -544 35 69 -277 281 21 0 254 -72 -276 18 -3 -83 -95 -122
3121a22M56n02l9L96j29j29N06l80N2O2k57J84J2m39K68q7L7R8l94M29J25m97
$$ -122 334 -168 -207 189 60 -69 437 57 109 171 -86 98 110 -329 -61 -148 -111 -13 -407 22 147 -350
3143c50M18q8j34K44j1r8J60l32J21P2j29L3P8K5J57q5j78K97j98R0o3j49J53
$$ -350 68 -20 -154 90 79 -19 141 -191 -70 2 -127 -94 -16 9 166 81 -97 200 2 92 29 -120 33
3166C3j03K0J70j19j78K71j57j1M65m78M2Mm3L29l05j65M19l60J83K4o1q2K17
$$ 33 -70 -50 120 1 -177 94 -63 -74 391 -87 -45 -41 -84 245 -60 -225 194 -166 17 41 -20 -102 115
3189A15j97L33l24J01K66l13J43J21m52J91K6k62J59p2o7L66k17K36m7l55M69
$$ 115 -82 251 -73 28 294 -19 124 245 -207 -16 10 -252 -93 -165 -232 134 -83 153 106 -249 220
3210B20k38l27L02j47R3J23j86J71L1k96N55m1l84N48n78KL61j46k52J58M7j83
$$ 220 -18 -345 -43 -190 -97 26 -160 11 42 -254 301 260 -124 424 -154 -152 209 63 -189 -31 16 -167
3232a67K26o5K27k26Q3K70l10j55L32j55m7K68l96J19p7k28L21l0rK37l74N6J53
$$ -167 59 -6 221 -5 78 348 38 -117 215 60 13 281 -115 4 -73 -301 20 -10 -19 218 -156 -100 53
3255E3l70L72p5j67J74L3k39L20l88L22m2j78L92l13J19Q8J06k39K74k45Q8J68
$$ 53 -317 55 -20 -187 -13 20 -219 101 -287 35 -7 -185 207 -106 13 101 207 -32 242 -3 85 253
3277B53n26L12m8m6Q6J2k02M77n17J62Q4r2Nj34K39J05j26QJ22j64K20j17k30
$$ 253 -273 39 -9 -55 31 43 -159 318 -199 -37 47 -45 -40 -174 65 170 44 52 174 10 230 113 -117
3300a17K02K23m61K48Nk77J40j36K23k7q9q7L90k51K28j22o4J74k03p6L53m13
$$ -117 85 308 -153 95 100 -177 -37 -173 50 23 -66 -153 237 -14 214 92 28 202 -1 -77 276 -137
3322a37J06q2r1L06o7j80L29k90oJ75J5j19J93k28K76k09k88M79l27O3N2J16j50
$$ -137 -31 -113 -204 102 35 -145 184 -106 -112 63 78 -41 152 -76 200 -9 -297 182 -145 -82 -30 86 -64
3345f4K3o6R2O2j87L15j61m0J2k00O4K21k93K46n1o0m8J60K1J4J0k60L69l23K36
$$ -64 -41 -107 -15 47 -140 175 14 -26 -14 -214 -150 71 -222 24 -27 -87 -135 25 46 60 70 -190 179 -144 92
3370I2o5k79J47rj87M45j80mJ10k95J99K03j85O4n3l46O18l25k1K00l36J45K36
$$ 92 27 -252 -105 -114 -301 144 -36 -40 70 -225 -26 177 -8 56 3 -343 275 -50 -71 129 -207 -62 174
3393A74l30K67r3k47J86j99M13k09j15O0P4J27j5k05J42J93J62l94J13j30k9M1
$$ 174 -156 111 18 -229 -43 -242 171 -38 -153 -93 -19 108 93 -112 30 223 385 -9 104 -26 -55 -14
3415a4o1q5J23q9K27K5k20N9R3j33J68KN0j86q7K00l3j66j0J38l06L25j57J13
$$ -14 -75 -160 -37 -126 101 126 -94 -35 58 -75 93 95 145 -41 -128 72 39 -127 -137 1 -305 20 -137 -24
3439b4O3j20J0K7P5K01q5m38K73j97N6k1J12L02k77j62N59k38j67n0J29M2k22
$$ -24 39 -81 -71 -44 31 232 147 -291 -18 -215 -159 -180 -68 234 -43 -205 354 116 -51 -101 28 70 -152
3462a52M4k8J42o9J15j21K17J32l89L7J32j98L60k47j36J51j69l8J43l5p7L66
$$ -152 -108 -136 6 -63 52 -69 148 280 -109 -72 60 -138 222 -25 -161 -10 -179 -217 -74 -109 -186 180
3484A80q8J07o0l3J07j72R8k8j43J48o9j98N7K19j85J45p3q7N9J20j33K0k31J05
$$ 180 92 199 139 106 213 41 139 111 -32 116 47 -151 -94 125 -60 85 12 -75 -16 104 -29 -9 -240 -135
3508a35j80J89L08k81m3J49j34J8R9O3ll3L9l8j14J08m6j09R1J30l1j76L49mj01
$$ -135 -315 -126 182 -99 -142 7 -127 -109 -10 53 50 17 56 18 -96 12 -34 -143 -52 78 47 -129 220 216 115
3533A15q3j25K90j31j00K55m14M30rk49M4J1j03J92Kk99K64p8J59j95k14K17O0
$$ 115 32 -93 197 66 -34 221 -193 237 228 -21 23 34 -69 123 125 -174 90 12 171 -24 -238 -21 39
3556C9q8K00l96J64J68k18L64R3l37J55r9N7J68m04J08Q0k07J37q6QP7M0q0n6
$$ 39 -49 151 -245 -81 87 -131 233 326 -11 144 45 102 270 -134 -26 54 -153 -16 -102 -94 -17 23 -57 -113
3580a13K27j35J05j29j00K99Mk07K22m23K95p1o0L9k0lN3K7J36K2k80N6K63m37
$$ -113 114 -21 84 -45 -145 154 158 -49 173 -250 45 -26 -86 -47 -67 -70 -17 10 146 168 -112 -56 207 -230
3604b30O6Q9K2K05k1k9m5o3K8l23L3K68p7j38K48k8O3m9n3K90k26k21K45M3q2
$$ -230 -164 -75 -53 152 131 102 57 -6 22 -301 -268 0 -77 -215 33 5 68 19 -34 256 30 -191 54 97 15
3629A5O2k11J97J30l75J97J14n1j39p6J57o4j6j61L06k54J52O9L2q9q0J18J56
$$ 15 77 -134 63 193 -182 15 129 78 -61 -137 20 -44 -60 -221 85 -169 -17 52 84 -5 -85 33 189
3652A89l35K53j92J53j49L66l82J46J05k47K94k19J5o3k08M27N4k23J30nj62J37
$$ 189 -146 107 -85 68 -81 285 -97 49 154 -93 201 -18 -3 -66 -274 153 207 -16 114 109 -53 84
3674H4R0l09J63j53J82K7l8jj46j7J99m1n3J83n9j97J20k8Q3k90J2J62k26J3K43
$$ 84 174 -135 28 -125 57 84 46 45 -101 -118 81 40 -13 170 111 -86 34 6 89 -201 -189 -27 -253 -240 3
3699CQ7k43J32R5r1K93l59K04k02j48J05j30L12l4j61L15l44Q8Q7J91j27o9r0
$$ 3 90 -153 -21 74 -17 276 -83 121 -81 -229 -124 -254 58 24 -137 178 -166 -78 9 200 73 4 -86
3722h6j49L60Nj29l5m9K07o8J7J2n1l37M25k11J54j47J46p3J01Q6Q1k18j61J02
$$ -86 -235 125 130 1 -34 -83 124 56 73 85 34 -303 122 -89 65 -82 64 -9 92 178 259 41 -120 -18
3746a8m2N7O4l21L83K35m40J22j66O4J96j85q6L16j87J64j41n4m7J13j22Q4l6
$$ -18 -60 -3 61 -260 123 358 -82 40 -126 -62 134 -51 -137 179 -8 156 15 -39 -86 27 -95 -11 -47
3769d7O0n2k2M9j09J32q9J58jk64J06l4R6J08O5j94P8j60Q4K1J4J74j75o3j6m6
$$ -47 13 -39 -61 -12 -121 11 -78 80 79 -185 -79 -113 -17 91 156 -38 40 -120 -36 -15 -1 173 -2 -65 -81 -127
3795a27J43lJ02k85L82j28j5k45pJ2J86j13j9K54j49l5oJ08r2J58l76K24J08l16
$$ -127 16 13 115 -170 212 84 69 -176 -183 -171 15 -98 -117 137 -12 -47 -53 55 -37 121 -255 -31 77 -239
3819b39K79j08J1k1j54J95L8l6MO2M9J02k88j6J65k30J22J92j35n4K18j76J72
$$ -239 40 -68 -57 -78 -232 -37 1 -35 -31 31 80 182 -106 -122 43 -187 -65 127 -8 -62 156 -20 152
3842A52k23J2L00k37R1k06J72m9K11k43o8J29l4K19k13j06K46k87o7L20k60K07
$$ 152 -71 -59 241 4 95 -111 61 12 223 -20 -88 41 7 226 13 -93 153 -134 -201 119 -141 66
3864F6PJ66j87J6o2o9J67k56K51k04J1J07MJ75j73L6l3j9j4m3j16J07R1k3K43
$$ 66 73 239 52 68 6 -63 104 -152 99 -105 -94 13 17 192 19 55 22 3 -11 -54 -170 -63 28 5 248
3889B48j22K3j47o2n4K67k85J0J31m0M3r6p3K75j58O0K31j53j61K06j62L2J23
$$ 248 126 149 2 -60 -114 153 -132 -122 9 -31 12 -84 -157 118 -40 20 251 98 -63 143 -19 13 136
3912A36k65J77j27m8J13R1k3Rk05K68k17J73k2o6j48K61k4k38J41k7n5O9j16O8
$$ 136 -129 48 -79 -127 -14 77 54 63 -142 126 -91 82 60 -6 -154 107 83 -155 -14 -41 -96 -27 -143 -75
3936g5J49l9J09l88J15K27p0L2j94K29J43k21J01R5q8j57K78k94K29j94k1k6n0
$$ -75 74 35 144 -244 -129 98 28 60 -134 95 238 17 118 213 125 -32 246 -48 181 -13 -34 -60 -110
3959a10k4L61n83M16N0j36K24l84J42o8J46j83K62j49l0J38Pk03J00J19R3k41
$$ -110 -134 227 -356 60 110 -26 198 -186 -44 -112 34 -149 113 -36 -66 72 79 -124 -24 95 188 -53
3981e3Q7j62o5J91J51k59J83P4j76J73o6k93P2K93r0j66J05j3K16j63L8k93J19
$$ -53 34 -128 -193 -2 149 -110 73 147 -29 144 78 -215 -143 150 60 -106 -1 -14 202 39 77 -216 -97
4004i7J78l5J10j65j98O5K40j86j32M25ok91j28M6O6J57l2q4kP0l1J42k75j36
$$ -97 81 46 156 -9 -207 -142 98 -88 -220 205 199 -92 -220 -174 -108 49 17 -67 -69 1 -30 112 -163 -299
4028b99M26o2o5J73j30k71J34K55k66O6JNQ3L1l6j38J17j70K51l39J85K02j7k10
$$ -299 127 65 0 173 43 -228 -94 161 -105 -39 -38 -33 50 81 45 -93 24 -146 105 -234 -49 153 136 -74
4052g4L8j83L75j61O0J13j19j30J09pJ07J14m94L44j49Q0L7j60K43K5j99K74k44
$$ -74 -36 -219 156 -5 55 168 49 -81 28 21 128 242 -252 92 -57 23 60 -100 143 168 -31 243 -1
4075ao0k3O9j78K38k23J81M6J40K9j81R4j07k37J98J76j20j86J67m7Kk87L81M9
$$ -1 -61 -84 -15 -193 45 -178 3 49 189 218 37 131 24 -213 -15 161 41 -145 22 -25 -23 -310 71 120
4099A20k24r0K68O2j75J50o5J17j92k04K53j07N5j1j15J32n2J68n4K0j33Q0P7
$$ 120 -104 -194 74 136 -39 111 46 163 -29 -233 20 -87 -32 -43 -158 -26 -78 90 36 56 -77 3 80
4122H0l2K1N5l4j57j34J02P6P5O2j83k5L4p3J13J81p7j29QL7O6J8K2j89L19k59
$$ 80 48 69 124 90 -67 -201 -99 -23 52 114 -69 -94 -60 -133 -20 161 84 -45 -37 0 66 84 106 -83 236 -23
4148b3n1j63K15J86l28Q1O4l2j27J22N6J50j28j33J66J0K0k01j24J34J20k12J7
$$ -23 -74 -237 -22 164 -164 -83 -19 -51 -178 -56 0 150 22 -111 55 65 85 -116 -240 -106 14 -198 -181
4171a81L14km8j32nj42R7J81j56L1J49p1J86j90n0N1n8n9L05k50l1J04o4j19K83
$$ -181 133 131 83 -49 -54 -196 -99 82 -74 -43 106 35 221 31 -19 32 -26 -85 220 -30 -61 43 -21 -140 143
4196A43j59k7K79k48R2l80M26j04j83J31N6p3l8J20j11O5j79K25mo2n7R4q0Qj27
$$ 143 -16 -43 236 -12 80 -300 126 22 -161 -30 26 -47 -85 35 -76 -11 -190 35 31 -31 -88 6 -74 -66 -193
4221a93N0P4L32k64j04J06N3P4j80M1Q1j00l7J91K6n0pj52J31k29K43o8o3J99
$$ -193 -143 -69 263 -1 -105 1 54 128 -52 -11 70 -30 -67 124 150 100 93 -59 72 -157 86 18 -45 154
4245A54k32J4J30n9q4K99o04M81j30N0k23J97j07J85Pk10K15j77L9k5q4K67j89
$$ 154 -78 -64 66 7 -77 222 -382 99 -31 19 -204 -7 -114 71 78 -132 83 -94 -55 -80 -164 103 -86
4268h6M9P5r2J67k11J44q8J66k33O7J7j23J41K9J78l03o8K78k13p7J99P3j41J39
$$ -86 -37 38 -54 113 -98 46 -42 124 -109 -42 -25 -148 -7 22 200 -103 -171 107 -106 -183 16 89 -52 87
4292H7J05j17N8r5M3j52J02l3J69j71PK22j15K8p8Pj46m2J80L9k27L1R2l6j93
$$ 87 192 75 133 38 81 -71 31 -2 167 -4 3 225 110 138 60 67 -79 -121 59 98 -129 -98 -6 -42 -235
4317b35K68l1M2k24K17J23k84m5K01l2j01J50j04l0k67L55j18j83M00P5k09JR4
$$ -235 33 2 44 -180 37 160 -124 -169 32 0 -101 49 -55 -85 -352 3 -115 -298 102 177 -32 -31 63
4340F3k31L30k86N3K96l65J68N0j37j3J94k47M26j70j42O3r6J25%j66J74l78J88
$$ 63 -168 162 -124 -71 225 -140 28 78 -59 -72 122 -125 301 131 -11 52 -44 81 81 -85 89 -289 -101
4363a01J44j23l0J96oj64K25k33K67n44L34J01Q4k19N0J79k27K38k69j14K46p
$$ -101 43 -80 -110 86 80 -84 141 -92 175 -369 -35 66 150 -69 -19 160 -67 171 -98 -212 34 27
4385B7l37K90p6P7q4j14L17l0J68l97J93k29K20k76K88k05P6J12k0K29l25J99
$$ 27 -310 -20 -96 -19 -103 -217 100 70 238 -159 34 -195 25 -251 37 -168 -92 20 0 229 -96 103
4407A03j46j2M4J66j33L51m18O1J04j57p0J23L6j48K01k21J5J52J4M6j82N3K7
$$ 103 -43 -55 -11 155 22 373 -45 16 120 -37 -107 16 52 -96 105 -116 -101 51 65 111 -71 -18 9
4430IN3r0L7j45L09j42j53Or4q7K31J05N6r1m7N4n0J9l00K30JJ51o6l17L77k04
$$ 9 62 -28 9 -136 173 31 -122 -116 -210 -297 -66 39 95 4 -43 11 -39 -20 -320 -90 -89 62 -4 -321 56 -148
4456a48J79J9L7j49J25j72J51j37K26j23K38j48j44mM5J79l31L15k39j81M03j31
$$ -148 31 50 87 -62 63 -109 42 -95 131 8 246 98 -46 -50 -5 174 -157 158 -81 -262 141 10
4478A0k02O2J35n1J4j97L61J13l33J09J90j59j43L09m13K72j32J30r6P7l6J14
$$ 10 -192 -130 5 -46 -32 -229 132 245 -88 21 211 52 -91 218 -195 77 -55 75 -21 56 20 134
4500A34k80L70j82o8M9j89J60k68L89Q1j68k4j09r5O4R2j10P3M7k32L06K69m18
$$ 134 -146 224 42 -26 23 -166 -6 -274 115 196 28 4 -105 -200 -136 -44 -154 -81 -34 -266 40 309 -109
4523a09K50o6o6kJ60j72J03r4K48k82j81J97J52k31j22K81m8j10J17p1qp4J46
$$ -109 141 75 9 7 167 -5 98 4 252 -30 -211 -14 138 -93 -215 66 18 -92 25 -46 -54 -128 18
4546A8J0M0O2m1j26MK14k06J41q2j39j5m5K58j38R3j33m9m0K25J4j05L7J12j97
$$ 18 28 68 130 89 -37 -33 181 -25 116 34 -105 -120 -165 93 -45 48 -85 -134 -174 51 65 -40 -3 109 -88
4571h8J33lk4l00L43N4k91J65p7J69j26M1j41L08j09l0o3n3J14p1l6O0j16L2J83
$$ -88 45 42 18 -282 61 115 -176 -11 -88 81 -45 -4 -145 163 54 24 -39 -92 22 -49 -85 -25 -141 -109 74
4596G4q1M0L6j70K25k67K03j98j8O2P6n1k2M1j41K74k13J53m4n3O6O7J63j79l2
$$ 74 -7 33 69 -101 124 -143 60 -138 -156 -94 -18 -69 -91 -50 -191 83 -130 23 -21 -74 -8 59 222 43 11
4621A1k8J51j10j03j0L1J80j75R3M7l7J49k30J10l23J29L09n4j09J05l82M25k93
$$ 11 -17 134 24 -79 -89 -58 122 -53 40 87 50 199 -31 79 -244 -115 194 140 31 136 -246 179 -114
4644a14K87nj83Q3J0pN3l11J18J12k15J42P4J2j54J48M8O5lJ48m56J40q9N7J92
$$ -114 173 168 -15 68 78 71 124 -187 -69 43 -172 -30 44 56 -98 50 98 163 160 308 -148 -8 -97 -40 152
4669A52j53P7k39K14J62k17L0Q8j21K06j93R7k51K2Q6J37j14KJ19j97R5K60l67
$$ 152 -1 76 -163 51 213 -4 26 114 -7 199 6 103 -148 -126 -40 97 -17 -15 104 -93 2 262 -105
4692a05P1R4j41L5K14m22L25n5J58j19J2O5j32J40k34J24m6K25j25j9j5j98J62
$$ -105 -34 60 -81 -46 168 -254 71 16 174 55 67 132 0 140 -94 30 -16 209 84 65 50 -148 14
4715A4k00K42j20j80K88j32mR8J41j63p4J45o4Q3k62J19P8j78K07j79J55Q7k35
$$ 14 -186 56 -64 -244 44 -88 -92 6 147 -16 -90 55 -9 74 -188 -69 9 -169 38 -141 14 101 -134
4738a34jP7J07p4l0J03p0j12l2J31J60l07L52k73J25L8k5k33J13R9J00J45k33
$$ -134 -135 -58 49 -25 -55 48 -22 -134 -166 -35 125 -182 170 -103 22 60 35 -198 -85 14 114 259 26
4761B6j50J64M9o3Q6l19K69l6l5j45P2Jk0J83J01l26J07J23j35pn0POmK25L3k81
$$ 26 -124 40 89 26 112 -207 62 26 -9 -154 -82 -81 -101 82 183 -143 -36 87 -48 -55 -105 -98 -92 -96 129 162 -119
4788a19J79k13K06J11k42o1J83j48J91k13J8o6J60M4j10O9O3j39j29L47o1j90
$$ -119 60 -153 53 164 -78 -139 44 -104 87 -126 -108 -174 -14 30 -80 -11 52 -87 -216 131 70 -120
4810a20J43J15l32K22p8J31K8k25pK41k00Q3R0j64Qr3J62Q3j3j77J35j10R2J05
$$ -120 23 138 -194 28 -50 81 109 -116 -123 118 -82 1 91 -73 -65 -158 4 87 74 -103 32 -78 14 119
4834A19l32J23J72j6q0J65l00K06k49K36K7m2nn4o2M3K6j73O6J7N3P1n6O5q0R3
$$ 119 -213 -90 82 66 -14 151 -149 57 -192 44 71 29 24 -30 -92 -49 -23 -196 -130 -113 -60 11 -45 20 -60 33
4860C3L8o7Q5m9j79Q9r1Q4n8K21l9K7j80L93k68o0l5l7n1K89j0k95R2K1K12j49
$$ 33 71 4 89 40 -139 -50 -141 -57 -115 106 67 94 -86 307 39 -21 -56 -93 -144 145 135 -160 -68 -47 165 16
4886A6k28J76J48n7j76N1K23k43J17o6M9k21L53o9j89m5R8J10j93K47k67K53k03
$$ 16 -212 -36 112 55 -121 -70 153 -90 27 -39 10 -211 142 73 -116 -161 -63 47 -146 101 -166 87 -116
4909a16K96k65J09j67K14j66L62j47l1j98j9RR4r3P0J20r6p8r7J21J32q0J05k33
$$ -116 180 -85 24 -143 71 -95 267 120 89 -109 -128 -119 -25 -118 -48 72 -24 -102 -199 -78 54 -26 79 -154
4933a54M44m17J10M5j85K66k72J09o4M8J50J11k69k01L38P7m6j72Q0J85q1j42
$$ -154 290 -127 -17 28 -157 109 -163 -54 -118 -70 80 191 -78 -279 59 136 90 -82 -2 183 102 -40
4955d0J00j3J8j52jl2L21k43o9K54j35j64K29o7j20R1J06j05nL5J88k86j18K98
$$ -40 60 47 65 -87 -88 -120 201 -42 -111 143 8 -156 73 6 -114 -23 83 -22 -27 8 196 -90 -208 90
4979I0l8j6J38k13N7k6j1o5K92j81m1j9j06K84k64K44j65m2J6J7k4J52J0j30k
$$ 90 52 36 174 -39 18 -8 -19 -84 208 27 -14 -33 -139 145 -119 125 -40 -82 -66 -49 -73 79 89 -41 -43
5004d3L3J01j48J91j77r8J17m1J30m7M8K54k99l3J16l89K38Q6k9J0J25q0j33j30
$$ -43 -10 91 -57 134 -43 -141 -24 -65 65 18 66 320 21 -12 104 -285 -47 39 10 20 145 65 -68 -198
5028a98K38n7o4l2L4R3ql4Q7k21mJ57Rj29M77m09P9J34j12K07m35J19k5J99r4
$$ -198 40 -17 -81 -113 -79 14 6 -28 59 -162 -166 -9 0 -129 348 -61 18 152 40 247 -188 -69 -94 105 11
5053A1r7j13L5K11j72M8L5K66j73k5q6M1O1p2j07k8M7Q0Q8k15K91p2J03j67K57
$$ 11 -86 -199 -164 47 -125 -77 -42 224 51 26 -60 -19 42 -30 -137 -165 -118 -38 50 -165 126 54 157 -10 247
5078B47k54k18L47q4k22K08PkK51l10J40j54M3J83j93J02l6j24J73J6l23O7Q1
$$ 247 -7 -225 122 38 -184 24 31 29 280 -30 110 -44 -1 182 -11 91 55 -69 104 120 -203 -136 -55
5101e5J25k73N2J41J05J15l38K05j34J15j77oJ24O9J93l03J38j6J30j24L2k05
$$ -55 70 -203 -151 -10 95 210 -128 77 -57 58 -119 -125 -1 68 261 -42 96 80 210 86 118 -87
5123h7J4J4P7r5J42r7J44j79J00N7m5o2q8K27j02k5J39j21Pj04L0r9PJ82j09l
$$ -87 -73 -59 18 -77 65 -32 112 -67 33 90 45 -17 -105 122 20 -5 134 13 20 -84 -54 -153 -146 36 -73 -76
5149g6L2P2P2j26K1o4J72N2k44m9n7L51l03M6J97j61J24l9J9Q8j72j50L13j22
$$ -76 -44 28 100 -26 -5 -69 103 155 -89 -138 -195 156 -147 -101 96 -65 59 20 39 127 -45 -195 118 -4
5173dj66R4J80k35K10l57K36j0m7K39l29K93k31K41k31J64J7k10J82j50K36k10
$$ -4 -170 -76 104 -131 79 -278 -42 -52 -99 140 -189 104 -127 114 -117 47 64 -146 36 -114 122 -88
5195h8O2J13j71J59j83K05p7j25K03l4K1k66K52lJ23k53p1K46j46q6J71pj16R9
$$ -88 -26 87 -84 75 -108 97 20 -105 98 64 85 -181 71 68 191 -62 -133 113 -33 -119 52 45 -71 28
5219B8k51K56j5K30k49j21Q2QR6k01J39j06q3L24p2M5j20l8K39k78O2J70q0j57
$$ 28 -223 33 18 248 -1 -122 -40 -32 64 -137 2 -104 -187 137 65 110 -10 -48 191 -87 -25 145 65 -92
5243i2j24R8K79J8k85K22Q0m4Ql50M5J70j42r9M68q6l05L85k52J72k34q8J79J90
$$ -92 -216 -118 161 179 -106 116 196 152 160 -190 -145 25 -117 -216 252 166 -139 246 -6 166 -68 -156 23 213
5267B13k03j71J55K03k71O1R0r2J2qO4m3k37M4K51j34J55l4k02J58J27o8j23R3
$$ 213 10 -161 -6 197 -74 -13 77 -15 -3 -11 53 10 -227 -183 68 -66 89 55 -147 11 138 70 -53 40
5291D0j19J32j91l8J52J5q8J8L23q6j69J27l44K50L1k02J72l4P7qk04L34j68K01
$$ 40 -79 53 -138 -176 -24 -9 -97 -79 244 158 -11 116 -228 22 53 -149 23 -11 66 58 -146 188 20 221
5315B21k63J34j55K14j31P0j79J53j01J14j69K53j42J89o9k10Q9j65K40l56L15
$$ 221 -42 92 -63 151 20 90 -89 64 -37 77 -92 161 19 208 139 -71 18 -147 93 -263 52
5336E2P3r5j13L7J80k88K82k13p0J47n3J66l4q3q4r2J94P4J57r9q0j59K5K58k31
$$ 52 125 30 -83 -46 134 -154 128 -85 -155 -8 -61 105 71 -12 -96 -188 6 80 237 138 58 -101 -76 182 -49
5361d9Q5j3j20QJ39j73J52p6p1J45k30L13k90K58k41J73J08lo6k0j02J77j14j26
$$ -49 36 23 -97 -89 50 -123 29 -47 -118 27 -203 110 -180 78 -163 10 118 115 49 29 -73 104 -10 -136
5385a36m3J53O1j59K98j24O8L1J39L3k29n0j26Q7j47q8M07j55J33k05JK76k89
$$ -136 -179 -26 35 -124 174 50 118 149 288 321 92 42 -84 3 -144 -232 175 20 153 -52 -51 225 -64
5408f4k08L23j9p0j8K2O5L9R6N6j37j67J94L1j48J2p2L99l15Pp4J17r4K7N3n3
$$ -64 -272 51 32 -38 -56 -34 31 70 166 222 85 -82 112 143 -5 7 -65 334 19 26 -48 69 -25 2 55 2
5434BK02k00L5N6l2j34R6J35k31J2P5M7j17j09m3PJ62K98k31J14j91l8J41O5j16
$$ 2 204 4 39 95 63 -71 25 160 -71 -59 16 63 -54 -163 -206 -199 -37 261 30 144 -47 -85 56 121 5
5459EN6m5J37pk50K73r5k3Q8j74P7n0p7J52k31J74j89J49J04j33j54J53J42j23
$$ 5 61 16 153 146 -104 169 74 51 139 -35 42 -8 -85 67 -164 10 -179 -30 74 -59 -213 -60 82 -41
5483d1O3q1Q4K8o7o0Q1m7O8j59K32o5j00N7J41k38J43J10l20K78q8j14K2j56L41
$$ -41 22 -59 25 53 -14 -74 7 -40 28 -131 101 36 -64 -7 134 -104 39 149 -171 107 19 -95 -73 -229 112
5508A12q6r3M2J14q3Q0k3p0q5o4L0L40k69p5L99k43j5N1k28K04j1m0J23j99j84
$$ 112 26 -67 -25 89 6 86 63 -7 -92 -156 -126 214 -55 -130 269 26 11 62 -166 38 27 -13 110 -89 -273
5533b73K87p2j37J91N0n9J47k79J29Oj4J12l5L7J8o1N1l44K97r3N9k3k5Q1K56
$$ -273 14 -58 -195 -4 46 -13 134 -145 -16 -10 -24 88 53 90 108 47 98 -246 51 -42 17 -6 -31 50 306
5558C06l89J1M0N9r1K7O5R1l53L14J6r0k3j20P9n2J85q2J4j64j15K01K06j39P3
$$ 306 -83 -72 -32 27 -64 -37 28 119 -234 80 96 6 -17 -137 -58 -110 75 -7 7 -157 -272 -71 135 -4 69
5583F9r8M7k9o0J13Q0j60r4K27l7o1J59k49P6Oj68J27L1j20L13j84q7J75r4j41
$$ 69 -29 18 -11 -71 42 122 -38 -132 95 58 -3 156 -93 -17 -11 -179 -52 -21 -141 172 -12 -99 76 -18 -159
5608a59K07N8j88K2o1J97r6q6r2J59R6j10j6J98k89J10J29j81L33l15K0J09LJ65
$$ -159 48 106 -82 -60 -121 76 -20 -106 -198 -39 57 -53 -69 129 -160 -50 79 -102 231 -84 -64 45 48 213
5632B13j27J27j05mj53q6K21j29o1P9P8j22O6Jk5K06k01p9K55j71r6qL07l27J34
$$ 213 86 213 108 104 -49 -135 86 -43 -104 -25 53 -69 -3 -2 -27 179 -22 -101 154 -17 -113 -121 186 -141 -7
5657gj66J29j2J87r0PO7j67O8p1l4J21lj37K62j92J18q8j36M7R3KJ8J4m7j15M5
$$ -7 -173 -44 -56 131 41 48 115 -52 16 -55 -89 32 29 -108 154 -38 80 -8 -144 -97 -4 -2 16 30 -17 -132 -87
5684h7R7p2m1K03J15k29J97k32m3K66j77n0lj21K69p7J4J3R0k84M5M8q5K62P0
$$ -87 10 -62 -103 100 215 -14 183 -49 -92 174 -3 -53 -56 -177 92 15 29 42 132 -152 -107 -59 -144 118 188
5709A88k47Qq4J03K01j92P2q8K7j31pJ61l8o4K47j15o9Q4k02K88r4Jk5R0k11j1
$$ 188 -59 -51 -135 -32 169 -23 49 -39 -12 -143 -150 11 -27 -91 156 41 -28 56 -146 142 48 49 24 114 -97 -108
5735a08J96r8l6R0j07R5k1Q5m0o2J87P8j35j56J22j01K8L1m2J12l5o5q5L5K06
$$ -108 88 -10 -46 44 -63 32 11 96 56 -6 181 259 124 -32 90 -11 17 48 6 118 83 18 -67 -32 174
5760A74q0k09K1N4R8p0J2j57Q0l2L3J7k36M96m13J43K61l15K65j60J15Rk0k36
$$ 174 94 -115 -94 -40 58 -12 0 -157 -77 -109 -76 -59 -295 201 -212 -69 192 -123 142 -18 97 106 86 -150
5784a50K29j70P3n9K36j24n2m4K23j15j5j80K82L9k18on5K30j03J45J6m52K69
$$ -150 79 -91 -18 -77 159 35 -17 -61 162 47 32 -148 134 173 -45 -51 -106 124 21 166 182 -270 -1
5807amn9O5j00J92q6j62J56Nk01J95QO9o3j3m8J12j17J31m0j29J17K5k24L40k22
$$ -1 -5 -64 1 -99 93 7 -155 1 6 -195 0 8 77 14 1 -47 65 -52 79 39 -90 27 52 -172 168 -54
5833e4P8l1p2J27Oq3p3K6jN9J84l95K88k27J02N7M9j79J86j92j8m2P2L94l85N5
$$ -54 24 -7 -79 48 54 -29 -102 -76 -77 -18 166 -229 59 -168 -66 -9 40 -139 47 -145 -163 -205 -133 261 -124 -69
5859f9P3j27J38o2p6J13j23J33J8J31k89K84j65M0J48Rj13l20J70O9o0q6K06Q
$$ -69 4 -123 15 -47 -123 -10 -133 0 18 149 -140 144 -21 19 167 176 63 -257 -87 -18 -78 -164 42 50
5883E0o6p5L3K67l55K00j68N8R9J31k85j93L04n4J95r3N5j17O0k94K09M6J33j12
$$ 50 -16 -91 -58 209 -146 54 -114 -56 43 174 -111 -304 0 -54 141 48 103 -14 46 -248 -39 7 140 28
5907B8j85K09mJ15k1j22O3j68J87k62J7K42M6j22l17K13J3J38J19k86KN2J8Q2
$$ 28 -157 52 48 163 142 20 83 -85 102 -160 -143 99 145 23 -294 -81 -68 70 189 -97 -95 -43 -25 57
5931E7o0J2k2j19J40K1k14J34J17M1j61l0J39j35K2K9J36j15j25K14j59J64j22
$$ 57 -3 9 -13 -132 8 29 -185 -51 66 107 -54 -84 55 -80 -58 -29 107 -8 -133 81 -78 86 -36
$$ [...]
8191a46
##END NTUPLES=NMR FID
##END=
