##TITLE=1H_Ser AmS-BuN
 200.13Hz, CDCl3.
 8 sc
 
26.3.2026
##JCAMPDX= 6.0         $$ Bruker NMR JCAMP-DX V2.0
##DATA TYPE= NMR FID
##DATA CLASS= NTUPLES
##ORIGIN= UXNMR, Bruker Analytische Messtechnik GmbH
##OWNER= pz
$$ XWIN-NMR		Version 3.5
$$ Thu Mar 26 16:13:02 2026 Russian Standard Time (UT+4h)  she@DPX200
##.OBSERVE FREQUENCY= 200.1313
##.OBSERVE NUCLEUS= ^1H
##.DELAY= (6, 6)
##.ACQUISITION MODE= SIMULTANEOUS
##.ACQUISITION SCHEME= undefined
##.AVERAGES= 8
##.DIGITISER RES= 18
##SPECTROMETER/DATA SYSTEM= spect
##.PULSE SEQUENCE= zg30
##.SOLVENT NAME= CDCl3
##.SHIFT REFERENCE= (INTERNAL, CDCl3, 0, 14.3821)
##AUDIT TRAIL= $$ (NUMBER, WHEN, WHO, WHERE, WHAT)
$$ ##TITLE= Audit trail, XWIN-NMR		Version 3.5
$$ ##JCAMPDX= 5.01
$$ ##ORIGIN= Bruker BioSpin GmbH
$$ ##OWNER= she
$$ F:/spectra/data/she/nmr/H-C/1/audita.txt
$$ ##AUDIT TRAIL=  $$ (NUMBER, WHEN, WHO, WHERE, WHAT)
(   1,<2026-03-26 16:11:17.29 +0400>,<she>,<DPX200>,
      <created by zg, POWCHK disabled, PULCHK disabled
       configuration hash MD5:
       00 E9 B6 7A A2 85 ED C7 34 08 36 98 17 FE 4E 26
       data hash MD5: 16K
       86 34 8F 49 51 61 03 87 7E 19 7E CC 27 A9 2D EE>)
$$ ##END=
$$ 
$$ hash MD5
$$ 52 BA 3E 8D D7 02 D4 04 4A 83 66 29 67 0C BB 88
##$RELAX= 
##$RELAX= 
##$RELAX= 
##$RELAX= 
##$RELAX= 
##$RELAX= 
$$ Bruker specific parameters
$$ --------------------------
##$DU= <F:/spectra>
##$EXPNO= 1
##$NAME= <H-C>
##$PROCNO= 1
##$TYPE= <nmr>
##$USER= <she>
##$AMP= (0..31)
100 100 100 100 100 100 100 100 100 100 100 100 100 100 100 100 100 100 
100 100 100 100 100 100 100 100 100 100 100 100 100 100 
##$AQSEQ= 0
##$AQ_mod= 1
##$AUNM= <au_zg>
##$AUTOPOS= <>
##$BF1= 200.13
##$BF2= 200.13
##$BF3= 200.13
##$BF4= 200.13
##$BF5= 200.13
##$BF6= 200.13
##$BF7= 200.13
##$BF8= 200.13
##$BYTORDA= 1
##$CFDGTYP= 0
##$CFRGTYP= 5
##$CHEMSTR= <none>
##$CNST= (0..31)
1 1 145 1 1 1 1 1 1 1 1 1 1 1 1 1 1 1 1 1 1 1 1 1 1 1 1 1 1 1 1 1 
##$CPDPRG= <>
##$CPDPRG1= <>
##$CPDPRG2= <>
##$CPDPRG3= <>
##$CPDPRG4= <mlev>
##$CPDPRG5= <mlev>
##$CPDPRG6= <mlev>
##$CPDPRG7= <mlev>
##$CPDPRG8= <mlev>
##$CPDPRGB= <>
##$CPDPRGT= <>
##$D= (0..31)
0 0.7 0 0 0 0 0 0 0 0 0 0.03 0 0 0 0 0 0 0 0 0 0 0 0 0 0 0 0 0 0 0 0 
##$DATE= 1774527076
##$DBL= (0..7)
120 120 120 120 120 120 120 120 
##$DBP= (0..7)
150 150 150 150 150 150 150 150 
##$DBP07= 0
##$DBPNAM0= <>
##$DBPNAM1= <>
##$DBPNAM2= <>
##$DBPNAM3= <>
##$DBPNAM4= <>
##$DBPNAM5= <>
##$DBPNAM6= <>
##$DBPNAM7= <>
##$DBPOAL= (0..7)
0.5 0.5 0.5 0.5 0.5 0.5 0.5 0.5 
##$DBPOFFS= (0..7)
0 0 0 0 0 0 0 0 
##$DE= 6
##$DECBNUC= <off>
##$DECIM= 32
##$DECNUC= <off>
##$DECSTAT= 4
##$DIGMOD= 1
##$DIGTYP= 9
##$DL= (0..7)
0 120 120 120 120 120 120 120 
##$DP= (0..7)
150 150 150 150 150 150 150 150 
##$DP07= 0
##$DPNAME0= <>
##$DPNAME1= <>
##$DPNAME2= <>
##$DPNAME3= <>
##$DPNAME4= <>
##$DPNAME5= <>
##$DPNAME6= <>
##$DPNAME7= <>
##$DPOAL= (0..7)
0.5 0.5 0.5 0.5 0.5 0.5 0.5 0.5 
##$DPOFFS= (0..7)
0 0 0 0 0 0 0 0 
##$DQDMODE= 0
##$DR= 18
##$DS= 0
##$DSLIST= <SSSSSSSSSSSSSSS>
$$ [...]
##$SUBNAM0= <"">
##$SUBNAM1= <"">
##$SUBNAM2= <"">
##$SUBNAM3= <"">
##$SUBNAM4= <"">
##$SUBNAM5= <"">
##$SUBNAM6= <"">
##$SUBNAM7= <"">
##$SUBNAM8= <"">
##$SUBNAM9= <"">
##$SW= 18.0517328524113
##$SWIBOX= (0..15)
0 0 2 0 0 0 0 0 0 0 0 0 0 0 0 0 
##$SW_h= 3612.71676300578
##$TD= 16384
##$TD0= 1
##$TE= 0
##$TE2= 300
##$TE3= 300
##$TEG= 300
##$TL= (0..7)
0 120 120 120 120 120 120 120 
##$TP= (0..7)
150 150 150 150 150 150 150 150 
##$TP07= 0
##$TPNAME0= <>
##$TPNAME1= <>
##$TPNAME2= <>
##$TPNAME3= <>
##$TPNAME4= <>
##$TPNAME5= <>
##$TPNAME6= <>
##$TPNAME7= <>
##$TPOAL= (0..7)
0.5 0.5 0.5 0.5 0.5 0.5 0.5 0.5 
##$TPOFFS= (0..7)
0 0 0 0 0 0 0 0 
##$TUNHIN= 0
##$TUNHOUT= 0
##$TUNXOUT= 0
##$USERA1= <user>
##$USERA2= <user>
##$USERA3= <user>
##$USERA4= <user>
##$USERA5= <user>
##$V9= 5
##$VALIST= <valist>
##$VCLIST= <CCCCCCCCCCCCCCC>
##$VD= 0
##$VDLIST= <DDDDDDDDDDDDDDD>
##$VPLIST= <PPPPPPPPPPPPPPP>
##$VTLIST= <TTTTTTTTTTTTTTT>
##$WBST= 1024
##$WBSW= 4
##$XGAIN= (0..3)
0 0 0 0 
##$XL= 0
##$YL= 0
##$YMAX_a= 201368
##$YMIN_a= -220299
##$ZGOPTNS= <>
##$ZL1= 120
##$ZL2= 120
##$ZL3= 120
##$ZL4= 120
##$ABSF1= 10
##$ABSF2= 0
##$ABSG= 5
##$ABSL= 3
##$ALPHA= 0
##$AQORDER= 0
##$ASSFAC= 0
##$ASSFACI= 0
##$ASSFACX= 0
##$ASSWID= 0
##$AUNMP= <proc_1d>
##$AZFE= 0.1
##$AZFW= 0.1
##$BCFW= 1
##$BC_mod= 2
##$BYTORDP= 1
##$COROFFS= 0
##$CY= -3
##$DATMOD= 1
##$DC= 2
##$DFILT= <>
##$DTYPP= 0
##$F1P= 0
##$F2P= 0
##$FCOR= 0.5
##$FTSIZE= 0
##$FT_mod= 4
##$GAMMA= 1
##$GB= 0.15
##$INTBC= 1
##$INTSCL= 1
##$ISEN= 128
##$LB= 0.25
##$LEV0= 0
##$LPBIN= 0
##$MAXI= 10000
##$MC2= 0
##$MEAN= 0
##$ME_mod= 0
##$MI= 1.114404
##$NCOEF= 0
##$NC_proc= 0
##$NLEV= 6
##$NOISF1= 3.799351
##$NOISF2= 2.8
##$NSP= 1
##$NTH_PI= 0
##$NZP= 0
##$OFFSET= 14.38212
##$PC= 1
##$PHC0= -3712.102
##$PHC1= 17.9923
##$PH_mod= 1
##$PKNL= yes
##$PPARMOD= 0
##$PSCAL= 0
##$PSIGN= 0
##$REVERSE= no
##$SF= 200.129724274929
##$SI= 16384
##$SIGF1= 3
##$SIGF2= 2
##$SINO= 400
##$SIOLD= 16384
##$SREGLST= <1H.CDCl3>
##$SSB= 0
##$STSI= 0
##$STSR= 0
##$SW_p= 3205.1282051282
##$SYMM= 0
##$S_DEV= 0
##$TDeff= 0
##$TDoff= 0
##$TI= <>
##$TILT= no
##$TM1= 0
##$TM2= 0
##$TOPLEV= 0
##$USERP1= <user>
##$USERP2= <user>
##$USERP3= <user>
##$USERP4= <user>
##$USERP5= <user>
##$WDW= 1
##$XDIM= 8192
##$YMAX_p= 0
##$YMIN_p= 0
$$ End of Bruker specific parameters
$$ ---------------------------------
##NTUPLES= NMR FID
##VAR_NAME=  TIME,          FID/REAL,        FID/IMAG
##SYMBOL=    X,             R,               I
##VAR_TYPE=  INDEPENDENT,   DEPENDENT,       DEPENDENT
##VAR_FORM=  AFFN,          ASDF,            ASDF
##VAR_DIM=   8192,          8192,            8192
##UNITS=     SECONDS,       ARBITRARY UNITS, ARBITRARY UNITS
##FACTOR=    0.0002768,     1,               1
##FIRST=     0,             0,               0
##LAST=      2.2672688,     0,               0
##MIN=       0,             -220299,         0
##MAX=       2.2672688,     201368,          0
$$ Real data points
##PAGE= N=1
##DATA TABLE= (X++(R..R)), XYDATA
0 0 0 0 0 0 0 0 0 0 0 0 0 0 0 0 0 0 0 0 1 -7 8 -8 8 -8 8 -9 15 -16 16 -19 23 -24 27 -31 35 -39 44 -48 54 -60 66
41 66 -74 81 -90 100 -108 120 -132 144 -160 175 -195 214 -237 262 -293 328 -368 416 -476 549 -642
62 -642 766 -937 1192 -1597 2321 -3870 8499 -49398 -220299 -22548 163920 31517 -97791
75 -97791 -6300 67792 10284 -8277 35599 -3937 -74186 -36259 50147 50399 -24305 -60746 -1598
88 -1598 47024 -10664 -65440 -6917 57778 24007 -17451 12064 25507 -12887 -5252 34160 1146
101 1146 -38381 4443 37123 1603 -14001 2282 -20380 -43027 113 27188 -23171 -37527
113 -37527 29690 45804 -18694 -37268 10903 28406 -253 -4562 25821 27106 -8317 -14365 17499
126 17499 16956 -30379 -41580 15642 44063 -8415 -40649 1218 19692 -25847 -40074 10403
138 10403 36300 1591 -14699 16901 23780 -9873 -15905 13863 18947 -6096 -7451 20138 16885
151 16885 -21932 -29728 4607 14109 -17505 -28071 7642 28591 1155 -20808 -1521 13664
163 13664 -1615 -6894 14662 22767 1748 -7915 10682 15290 -13718 -28909 -2369 18643 -877
176 -877 -23428 -9843 11840 2982 -15038 -9464 4414 4404 3236 13070 17895 7551 -3604 50
190 50 8486 4030 -6675 -5308 7294 8974 -7787 -20256 -10162 972 -7866 -14636 -948 12153
204 12153 5881 -3515 1522 9075 3864 -2647 4897 14797 11266 195 -88 8234 1203 -18790 -15109
219 -15109 7282 5530 -16595 -13604 9401 5454 -17616 -11223 14074 10600 -8320 -1141 19409
232 19409 16108 -3867 -5158 8973 8984 -5791 -8497 4489 7242 -8701 -15081 -465 4541 -12523
246 -12523 -16510 3218 11874 -2575 -7568 9032 13992 -1016 -4620 9591 13711 1216 -6235
259 -6235 3095 10058 -1419 -14805 -8701 2990 -1365 -13533 -8325 6845 2697 -12370 -5108 12370
273 12370 7585 -7006 -395 18880 15296 -5594 -4523 12759 9091 -9411 -10732 4590 5493 -11508
287 -11508 -14723 1463 3469 -12113 -13366 3070 9365 -2568 -5827 9853 14972 -14 -4305
300 -4305 9019 13173 1423 -6131 2404 8773 -2663 -12397 -5524 421 -4547 -11333 -7368 3169
314 3169 1203 -7352 -2336 7493 6386 -542 955 10611 11177 -94 -1577 7498 6420 -4336 -8923
329 -8923 -824 4223 -7424 -14404 -1661 4566 -6789 -11660 192 9424 80 -7716 6187 16123
343 16123 3840 -3954 5633 12520 2933 -8305 -661 9325 -2213 -14141 -4696 4391 -4562 -15251
357 -15251 -6410 8506 997 -11713 -81 13821 4945 -5597 2542 14607 8356 -5238 387
370 387 11957 3777 -9951 -6794 3430 725 -11923 -11516 2331 1695 -10502 -8232 4747 6178
384 6178 -3211 -3105 9663 11722 -215 -932 9086 9088 -824 -4919 1344 5218 -3710 -10106 -4347 -241
400 -241 -4954 -9472 -4868 2446 78 -6041 13 9369 5868 -1254 1481 10199 9219 -861 -1956
415 -1956 5933 5214 -3963 -7351 -1724 361 -7068 -10781 -1602 2600 -6268 -8884 2503 8344 -705
430 -705 -5486 7021 15104 3565 -4565 4949 11012 998 -6791 -220 5663 -3444 -11213 -3600 1959
445 1959 -6982 -12784 -2168 7607 -178 -9068 884 12639 5097 -5326 3391 14034 6525 -4636
459 -4636 763 9421 649 -10798 -4134 5338 -3125 -12957 -6970 3018 -918 -9467 -4076 6125 4285
474 4285 -2969 -189 8333 9612 2076 85 7476 7701 -3640 -5935 3526 4802 -6471 -10709 -1522
489 -1522 1383 -8126 -9421 -994 1396 -1863 -1403 3384 6890 4969 -458 740 7598 8454 522 -1912
505 -1912 6290 5016 -9280 -9998 1608 20 -9418 -6900 1899 41 -7942 -5176 4085 5356 733
520 733 -130 5543 11001 4827 -3922 3269 11191 -2 -10091 -330 7588 -3857 -12755 -2419 2429
535 2429 -9290 -10358 2705 5235 -3187 -4905 3748 10114 4771 -1723 1798 9667 7086 -2593 -2382
550 -2382 7224 2553 -10269 -5425 4059 -3984 -13028 -4568 4607 -1784 -8139 -105 6267 670 -3416
565 -3416 1698 7997 9423 3888 173 4757 6020 -2972 -7088 468 3531 -5413 -8309 1175 549
580 549 -11730 -10281 2726 4961 -985 -1235 4398 6021 2717 654 2859 5782 5560 306 -550 5060
596 5060 2271 -8125 -8383 88 -464 -7861 -6484 2158 187 -7958 -3487 6535 5694 220 589 6195
612 6195 7837 2416 -762 3571 5430 33 -5238 -1464 3190 -4529 -11424 -1618 5220 -5556 -12315
627 -12315 -2232 6070 80 -5114 4373 11693 3505 -2754 3710 8385 3229 -3552 -528 6140 1219
642 1219 -8238 -5614 181 -4285 -10427 -4031 6334 1989 -8879 -3900 6701 3883 -2534 1951
656 1951 9596 7408 121 1238 6777 2523 -5301 -3964 2071 890 -6195 -7503 -1292 -1045 -6693
671 -6693 -5764 1446 3484 -504 -1571 3885 7545 3309 -391 2939 6351 3436 -895 -259 2228 -872
687 -872 -5290 -4056 -1150 -3718 -7618 -5864 673 2985 -2669 -4143 3308 6312 675 -970 6459
702 6459 9669 1166 -2342 4960 6286 -3228 -6721 -855 1072 -4565 -6989 -2083 810 -4455 -7718
717 -7718 -975 5463 1414 -3520 2089 10372 5070 -3292 2566 9213 1953 -4859 1172 5728 -2056
732 -2056 -8628 -3366 1301 -4411 -7836 -2753 515 -550 -3006 -553 5304 4577 -1071 924 8438
747 8438 6748 -613 -1011 5279 3671 -4911 -4232 2309 -1065 -7156 -5408 -681 -1128 -5228 -5123 826
763 826 2364 -230 797 4122 6085 3948 610 3579 6024 1034 -2953 342 2265 -1577 -6080
778 -6080 -4521 -249 -3058 -6948 -3153 1211 161 -2427 -1327 4091 5278 240 1003 6059 6275 1931
794 1931 -417 2606 3719 -2550 -5620 -1014 656 -4816 -7362 -2842 1811 -2454 -6282 107 5234
809 5234 569 -1801 3719 8055 3623 -1420 2862 7187 1610 -3765 -804 2151 -1150 -6607 -4784
824 -4784 591 -2198 -7466 -3830 2198 966 -3487 -1108 6265 4941 -951 1894 7319 4252 -941
839 -941 375 4469 1587 -4779 -3550 803 -2048 -6142 -4602 -923 -1026 -3951 -3468 1998 3015 8
855 8 452 4686 6161 2310 529 3987 4962 -549 -2005 658 732 -3263 -5027 -2560 -1230 -3633 -4823
872 -4823 -2144 332 126 -1045 495 3985 4294 1344 2054 5220 4887 376 -936 2400 2122 -3275
888 -3275 -4461 -1030 -569 -4564 -6215 -1884 899 -2622 -4329 769 4256 1686 -556 3065 7035
903 7035 3203 -788 2698 5354 952 -3507 -1550 1910 -1471 -7402 -4616 977 -1790 -6594 -3159
918 -3159 2652 1649 -3122 -108 6593 4090 -832 2440 6674 4011 -1085 -211 3229 1125 -4101
933 -4101 -3594 -237 -1517 -5293 -5110 -1109 -16 -3108 -2730 2802 3626 -230 508 4994 5276 1093 985
950 985 4358 2887 -1117 -1144 34 -1371 -3128 -3245 -2831 -2297 -2969 -3746 -1922 521 854 -524 997
967 997 4839 3744 603 2133 5096 2932 374 1244 1201 -1028 -2639 -2786 -2061 -2153 -3074 -3941 -2630 25
985 25 -1270 -3669 751 5312 2395 -791 3615 6088 1969 -791 2725 3812 -429 -2235 24 -567
1001 -567 -3609 -4724 -3490 -840 -796 -3944 -2875 1845 1771 -1893 -560 5803 5661 -13 633 5935 2560
1018 2560 -2386 685 3332 -365 -4534 -3075 -291 -2634 -5455 -3353 -441 -461 -1316 -1766 1192 3381
1034 3381 441 831 5034 4924 1439 819 2876 2170 -2459 -2681 1547 -298 -4280 -3337 -2010 -3237
1050 -3237 -3750 -2429 986 1271 -704 617 2625 2414 2331 2488 3149 3921 1891 -98 688 -153 -1825
1067 -1825 -2076 -2790 -1979 -2148 -3667 -2357 -1398 -2146 -1584 33 2198 3397 1676 1397 3178 3393 1893
1084 1893 818 1204 2993 417 -3248 -1850 -497 -3381 -4695 -2121 368 -1940 -4858 -1262 3136
1099 3136 549 -864 2201 5062 3469 332 1219 5011 2551 -2058 -787 2525 121 -5124 -4357
1114 -4357 257 -1474 -6031 -2940 2253 71 -3389 -849 3565 2664 -151 2279 5278 3581 493
1129 493 654 1929 1445 -1522 -2685 -118 426 -3682 -5268 -2344 -438 -3035 -2971 1811 2348 -1188 135
1146 135 3671 2656 857 2533 3758 2346 1212 639 -1165 -1777 -677 -1516 -3146 -1943 -1667 -4062
1162 -4062 -3505 312 1032 -1305 -185 2799 2067 933 2772 3628 1932 1844 1915 647 229 -68 -2254
1179 -2254 -3424 -855 -722 -4328 -3656 577 -1111 -4474 -930 3856 1601 -821 2716 4838 1499
1194 1499 -361 2702 3732 1341 -773 -566 -37 -1194 -3936 -3765 -805 -294 -3853 -3691 1460 1580
1210 1580 -2660 -1195 4509 3596 -910 1498 5995 3575 -1399 -73 2956 828 -2400 -1848 -603
1225 -603 -1908 -3962 -3335 -1139 -709 -2487 -2371 789 2578 820 401 2640 3582 1427 886 2799 2686
1242 2686 -146 -884 608 180 -2348 -3012 -2185 -2322 -2615 -2132 -1274 -706 48 255 435 1431 2764 2387
1260 2387 1471 2564 3511 1097 -514 328 597 -1312 -2816 -1582 -1170 -2406 -3233 -2081 -1105 -1263 -1481
1277 -1481 -420 1869 2244 1279 1596 3292 3061 594 253 2895 2251 -2361 -1905 1060 -969 -4401 -3548
1294 -3548 -340 -1217 -3960 -1514 2373 358 -1779 573 2940 2314 1064 1573 3387 2894 323 -104
1310 -104 1221 613 -2316 -3773 -820 -39 -4042 -3999 158 -209 -2663 -1594 2232 2562 -196 913 4332
1327 4332 2987 504 1147 2116 1107 85 -904 -249 -371 -1909 -2893 -2486 -1956 -1818 -2869 -1550 1464
1344 1464 378 -654 1787 2862 1994 1734 2192 2695 1725 582 749 -156 -873 -874 -2289 -2429 -1191 -1710
1362 -1710 -2641 -1665 -23 -532 -1488 -266 2926 2100 360 2260 3770 1947 602 917 1514 149 -1934
1379 -1934 -1268 -369 -1589 -3180 -2926 -1452 -882 -2273 -2211 765 1737 -159 234 2794 3071 834 651
1396 651 3406 2757 -1104 -587 1485 -214 -3003 -2690 -735 -1437 -3368 -2466 20 -348 -1097 -676 1306
1413 1306 2131 1140 726 2692 3542 1472 144 1532 1699 -722 -2138 -478 -188 -2787 -3265 -1446 -1133
1430 -1133 -2485 -1994 89 1028 483 735 1991 2313 1854 1442 1467 1559 1730 513 -78 -1 -450 -1968 -2465
1449 -2465 -1608 -1324 -2218 -2493 -1192 10 -652 -331 1012 1845 1935 1773 1890 2409 1822 297 238 848 351
1468 351 -1620 -2180 -897 -1161 -3085 -2593 -226 -602 -2207 -1203 1291 1285 139 1107 3536 2779 628
1485 628 1291 2396 1274 -311 -771 -74 -274 -2296 -2806 -1268 -933 -2245 -2581 -162 1114 -683 -810
1502 -810 1901 2227 341 1073 3144 2738 854 696 1502 361 -1276 -1227 -1112 -1158 -1873 -2342 -1887 -1184 -1581
1521 -1581 -1338 -188 1274 1499 318 1226 2427 1186 1175 2265 1946 628 -555 -385 -600 -1496 -1323
1538 -1323 -1392 -2035 -2114 -1619 -1888 -1357 362 527 128 1137 2226 1770 748 1644 2451 1193 467 1110 963
1557 963 -928 -1719 -1623 -1237 -1616 -1726 -1344 -964 -755 -1203 -1146 766 2050 1045 879 2841 2815 460 162
1576 162 1940 1514 -1066 -1128 1045 -621 -3064 -2525 -1329 -1335 -2013 -973 424 189 -750 53 1110 2324
1594 2324 2219 1306 1673 2190 587 -574 893 1176 -1072 -2742 -1331 -853 -2801 -2604 -106 -627 -1608
1611 -1608 -627 494 706 1097 1360 1534 1886 1826 2096 988 846 756 -964 -1358 4 -703 -1629 -1780 -1463
1630 -1463 -1867 -1803 -1290 120 234 191 1293 954 1175 2129 1328 977 1734 1402 348 72 -112 -1013 -2488
1649 -2488 -1923 -776 -1470 -2045 -961 -668 -1060 -449 368 1035 1286 1188 1482 1781 2029 1370 569 931 854 -960
1669 -960 -1592 -521 -969 -2188 -1902 -791 -998 -1707 -1240 243 570 95 994 1992 2042 1499 752 1396 1661
1688 1661 283 -464 493 619 -1176 -2147 -1619 -1048 -2182 -2070 -395 41 -682 -380 546 1099 865 914 1583
1707 1583 2444 1797 763 881 778 -326 -1062 -803 -615 -1206 -1756 -1591 -1190 -1501 -1167 -631 -295 322 1114
1726 1114 1174 1423 1835 1159 1387 1208 990 589 -248 -395 -455 -700 -1371 -1446 -1988 -1254 -1334 -1407 -285 468 350
1747 350 541 888 1437 1275 876 1552 1936 977 593 846 -95 -1025 -1498 -846 -681 -1705 -1715 -645 -814 -1259
1767 -1259 -741 139 881 589 781 2082 2174 902 482 1318 927 -49 -408 384 -82 -1763 -1707 -695 -1204
1786 -1204 -2175 -1706 -714 248 -224 -132 1349 1584 643 642 1792 1930 899 483 1212 603 -766 -1132 -844
1805 -844 -1201 -1802 -1556 -1069 -711 -1030 -876 -168 94 773 865 841 1618 1868 1402 1177 1031 390 -60 -178 -254
1826 -254 -727 -1157 -930 -1535 -1701 -1215 -1205 -1171 -168 588 389 609 1358 1782 812 636 1693 1310 496 342
1846 342 602 -236 -1072 -1318 -1029 -1217 -1590 -1188 -733 -588 -493 -370 246 1138 700 746 1731 1595 1288 684 1188
1867 1188 1123 -549 -1030 -213 -458 -1589 -1546 -778 -1016 -1667 -1202 -41 192 -684 538 1385 1305 1186 1128 1200
1887 1200 1356 517 481 596 285 -587 -1461 -1116 -728 -1617 -2289 -788 -436 -1172 -677 598 605 520 721 1411
1907 1411 1537 931 1381 1210 650 304 96 -821 -538 -645 -992 -1370 -1277 -1046 -995 -1343 -489 368 141 585
1927 585 1102 1161 1461 1350 909 1021 956 499 -283 21 -46 -1254 -1812 -861 -908 -1559 -1332 -302 -45 -753 -78
1948 -78 857 937 518 939 1709 1685 776 633 873 539 -364 -868 -648 -658 -1552 -1565 -910 -530 -946 -982 7 328
1970 328 167 352 1500 1558 751 985 1316 1466 107 -195 173 -68 -1198 -1283 -852 -1032 -1827 -1373 -862 -459
1990 -459 -456 -143 761 969 875 779 1183 1594 951 665 889 1134 182 -635 -666 -628 -1353 -1427 -1259 -1033 -945 -851 -395
2013 -395 -399 279 770 433 959 1582 1268 781 982 1032 632 -141 -294 6 -455 -1461 -1185 -1020 -911 -1018 -1149
2034 -1149 -406 191 -123 -118 990 1222 943 763 1189 1615 128 -142 813 384 -445 -811 -617 -773 -1317 -1754
2054 -1754 -755 -546 -796 -721 204 612 439 -91 1177 1976 1230 943 1238 997 -120 -527 -118 175 -991
2073 -991 -1049 -680 -1125 -1459 -1060 -814 -325 115 -8 587 1093 881 658 896 1547 1293 315 613 600 -648
2093 -648 -1127 -280 -674 -1290 -1010 -902 -1045 -1216 -454 212 -148 317 941 558 550 1223 1264 569 773 1044 334
2114 334 -558 -186 -697 -1039 -1135 -644 -1151 -1103 -394 -732 -835 -11 536 234 697 1804 1363 238 473 1418
2134 1418 778 -238 665 354 -518 -1467 -701 -787 -1554 -1254 -544 -490 -638 -158 68 370 695 956 958 1385 1220
2155 1220 475 302 696 349 -749 -417 36 -1019 -1641 -1021 -401 -1092 -1289 -73 259 -408 -200 927
2173 927 1077 680 1128 1182 1011 557 491 137 -139 -240 -564 -1064 -797 -817 -1221 -979 -532 -500 -524 309 543 489
2195 489 493 941 920 565 695 1199 606 475 318 -170 -667 -620 -647 -887 -1230 -728 -602 -496 -725 33 307 485
2217 485 551 759 1163 944 576 539 748 509 20 -291 -26 -369 -1347 -1180 -423 -877 -1200 -751 71 71 -262
2238 -262 295 1020 554 590 1087 1174 724 519 645 645 56 -390 -607 -494 -907 -1072 -957 -550 -599 -725 -369 348
2260 348 117 352 469 1220 829 715 1001 983 126 -21 70 190 -540 -798 -593 -602 -1010 -982 -705 -486 -275 -269
2282 -269 355 385 412 602 1006 966 1030 950 628 522 -63 -192 -96 -538 -953 -830 -970 -966 -897 -509 -183 -185 -136 447
2306 447 680 330 714 961 887 601 563 653 538 -550 -534 -199 -797 -1148 -873 -580 -549 -1160 -786 125 135 -99
2328 -99 260 875 1095 855 744 1214 795 253 163 335 -16 -587 -640 -505 -435 -922 -1197 -273 -566 -430 -46
2349 -46 -127 210 309 745 1085 737 681 772 500 245 -404 -165 -17 -728 -930 -488 -599 -988 -711 -380 -122 -447
2371 -447 391 424 875 338 615 1101 864 414 524 545 447 -303 -540 -235 -374 -990 -858 -928 -582 -532 -656 3
2393 3 98 -22 427 951 545 696 872 1026 639 415 307 173 -237 -364 -331 -694 -916 -705 -605 -550 -575 -250
2415 -250 110 -46 390 621 880 797 715 588 897 618 210 -38 155 -190 -848 -855 -391 -702 -947 -639 -386
2436 -386 -202 -400 -55 618 562 428 825 888 723 530 808 738 108 -158 -346 -271 -591 -553 -598 -624 -689 -741 -375
2459 -375 -11 -193 211 601 601 455 691 785 911 276 439 529 5 -424 -517 -581 -491 -935 -960 -347 -461 -571 -441
2482 -441 -103 173 261 120 743 924 572 508 654 648 122 100 25 -98 -384 -729 -529 -833 -620 -433 -276 -349
2504 -349 16 158 100 364 704 736 638 433 623 320 311 82 78 -164 -385 -763 -628 -563 -647 -896 -493 -90 71
2527 71 -219 31 755 368 226 776 963 711 448 620 327 -25 -327 -128 -158 -395 -503 -1110 -565 -509 -353
2548 -353 -460 12 357 147 354 808 584 278 629 795 152 197 292 -243 -445 -405 -358 -709 -747 -414 -351 -514
2570 -514 -182 -42 257 354 496 289 871 728 653 364 647 693 146 -204 -69 -167 -766 -718 -446 -614 -597 -411
2592 -411 -128 -298 -190 127 200 401 865 697 349 588 472 233 198 75 -162 -247 -602 -709 -840 -743 -496
2613 -496 -551 -482 21 82 -161 433 937 578 346 929 800 450 -155 581 269 -316 -343 -110 -640 -508 -723
2634 -723 -741 -502 -376 -613 -313 -30 678 290 55 701 1085 373 422 597 342 17 -124 -97 -345 -637 -392
2655 -392 -398 -648 -532 -307 -682 -267 120 99 209 508 653 690 774 572 507 331 363 85 -306 -282 -186 -848 -448
2678 -448 -180 -464 -749 -305 -84 -118 -119 372 615 267 307 561 583 476 244 491 -48 -61 -107 -391 -533 -846
2700 -846 -481 -634 -496 -208 -134 -11 -123 496 220 623 639 607 413 541 453 -60 24 332 4 -651 -321 -217
2722 -217 -463 -796 -513 -295 -69 -339 106 281 336 419 527 608 444 640 257 379 275 -25 -360 -168 -161 -582
2744 -582 -608 -499 -318 -661 -184 -11 173 21 352 389 649 466 474 424 438 291 446 -500 -56 126 -443 -332
2766 -332 -463 -427 -698 -637 -388 -74 -70 -112 299 402 525 543 384 380 679 402 242 123 20 -295 -505 -466 -224
2789 -224 -537 -703 -326 -270 -319 -168 96 128 278 349 462 497 501 486 -5 367 60 -49 -34 -337 -212 -374 -719
2812 -719 -378 -368 -447 -227 226 -345 124 397 446 115 376 569 542 356 252 386 58 -285 20 -156 -465
2833 -465 -495 -756 -520 -229 -269 -238 74 295 197 330 327 674 516 404 515 258 137 -14 13 -71 -255 -396 -519
2856 -519 -458 -441 -316 -594 -443 -153 106 98 164 420 547 215 349 531 372 14 -30 84 -95 -313 -344 -549
2878 -549 -308 -729 -436 -304 -99 -50 -265 151 492 404 253 590 524 451 126 219 505 80 -60 -212 -314 -530
2900 -530 -417 -517 -428 -366 -155 -307 35 -116 255 536 500 477 607 557 148 332 -23 66 -20 -385 -242 -357
2922 -357 -494 -266 -251 -318 -308 -268 -42 160 64 316 225 468 471 356 378 545 248 -103 -48 -173 -184 -374 -380 -414 -306
2947 -306 -213 -437 -267 -63 -124 -138 159 274 340 517 401 377 595 429 -124 -70 -161 155 -329 -365 -166 -531 -286
2970 -286 -394 -195 75 23 -149 53 468 323 203 450 568 302 241 286 116 -152 -227 -235 -220 -394 -595 -592 -398
2993 -398 -286 -180 -15 292 503 89 266 443 414 520 283 189 347 159 -251 -141 -450 -258 -313 -517 -452
3014 -452 -356 -246 -201 -190 158 262 100 206 216 546 226 158 286 410 136 -248 10 -319 -346 170 -436 -363
3036 -363 -531 -227 -44 -203 -33 -18 236 387 421 313 254 424 234 193 137 54 -93 -210 -259 -335 -389 -113 -146
3059 -146 -417 -276 -117 -36 -61 137 499 274 468 612 170 321 236 114 35 71 -72 -176 -346 -76 -426 -607
3081 -607 -135 -103 -339 -192 71 322 128 132 467 315 207 390 538 150 250 87 -132 -189 -6 -376 -219
3102 -219 -324 -414 -521 -257 227 71 49 110 34 283 332 479 335 353 432 160 -117 -14 97 -1 -265 -291 -311
3125 -311 -245 -212 -173 -48 -123 172 49 254 379 351 193 340 152 216 -82 170 57 -48 -425 -316 -373 -442 -211
3148 -211 -121 -154 -396 25 69 -18 414 270 286 413 103 322 317 64 -20 31 -49 -199 -152 -225 -258 -433 -347 -75 -188
3173 -188 -56 112 196 82 252 345 309 316 112 242 439 -44 51 76 57 117 -164 -252 -232 -297 -458 -372 -132 42
3197 42 29 77 187 203 206 238 360 271 414 -51 -125 -3 -140 -246 -292 -308 -146 -512 -34 -239 -162 -100 2 -60 149
3222 149 287 382 389 95 284 195 -92 -40 -168 -42 109 -204 -300 -343 -358 -314 -201 -177 -122 -202 13 -17 121 76 388
3247 388 180 165 276 185 53 -171 267 -30 -88 -168 -70 -288 -248 -181 -84 -180 -232 51 114 105 9 45 277 372 181
3272 181 196 231 255 11 -221 -316 299 -243 -413 -139 -142 -251 -320 -79 71 -106 364 433 343 20 86 316 295 97
3296 97 65 -98 211 20 -257 -31 -160 -390 -476 -169 -233 -74 -102 -47 214 -16 405 21 107 140 225 109 104 97
3320 97 29 -45 -241 -101 -364 -105 -231 -138 -349 -224 -110 150 191 310 206 198 124 268 181 151 53 0 -108 -142
3344 -142 -156 -182 -394 -298 -317 -181 -81 -186 -6 -138 -63 97 -2 188 156 189 138 96 0 198 -49 -163 -157 -439
3368 -439 -174 -151 -365 -112 -133 -104 -483 -75 72 168 -4 94 288 245 320 336 264 67 114 13 -128 -126 -146 -190 -102
3393 -102 -210 -235 -232 -68 -152 390 106 229 110 402 204 244 429 91 -10 209 -203 -45 -160 -127 -358 -449
3415 -449 -281 -134 -247 -203 86 46 86 3 147 248 410 143 430 46 5 75 194 48 -78 -257 -223 -264 -382
3438 -382 -352 -157 -9 -196 28 208 96 192 228 349 125 320 307 173 130 144 36 -118 -291 -95 -159 -261
3460 -261 -217 -341 -336 -15 -211 -35 67 138 31 -203 348 172 135 50 108 -11 -4 97 -17 -288 -325 -276 -218 -112
3484 -112 -32 -126 -61 154 37 93 -50 302 -19 8 440 187 108 58 -140 12 -166 -218 -274 -134 -178 -181 -121 -181 -194
3509 -194 67 174 -95 104 107 323 49 185 59 177 120 68 50 -118 -80 -148 -338 -27 -326 -66 35 -46 -86
3532 -86 16 38 81 -163 77 106 38 44 208 72 -49 -46 208 -35 36 -85 -228 -118 -132 -127 31 35 -46 322 227 100
3558 100 140 165 426 164 63 78 191 170 -76 15 -91 -98 -166 -239 90 -335 -239 -121 -24 206 161 89 127 187 185 326
3584 326 282 79 204 -38 91 137 -326 45 -37 -273 -186 -190 -214 89 -119 60 99 -72 200 187 158 279 193 -39
3608 -39 11 141 116 78 -219 -215 75 -98 100 -93 -191 140 -19 160 -86 146 167 63 360 132 -130 48 79
3631 79 193 -129 -242 -108 -15 -164 -133 -78 -107 51 3 196 -218 -126 -121 61 77 136 46 212 98 -40 -100 44
3655 44 13 -112 111 -140 -299 -248 -320 -197 -241 11 65 -30 125 22 161 106 113 68 396 267 166 -7 76 -177
3679 -177 -26 -194 -28 -114 -258 -163 -125 -12 -278 -230 25 286 173 -191 -39 41 356 151 217 100 136 -245
3701 -245 -229 -213 -58 -25 -179 -232 -154 -108 -75 -10 -198 200 283 52 -40 263 194 180 -43 296 52 -191 127 41
3725 41 -368 -334 -131 -166 -131 -205 -61 -10 57 108 -179 97 300 360 261 -12 57 165 -57 -46 13 -74 -129 -52 -132 -106
3751 -106 -28 -30 15 -88 -106 -26 -19 222 58 79 145 76 158 141 92 67 -174 -112 12 -4 -172 -111 -154 8 -172 -128 -4
3778 -4 -49 -3 -50 2 196 223 62 74 0 -63 68 116 -87 24 -172 -184 -186 -64 -203 4 159 10 -128 -103 80
3803 80 278 121 35 148 43 56 -89 267 -17 -203 -102 -293 -132 -8 -133 -91 139 -23 -248 -155 4 66
3825 66 56 143 218 -4 75 398 97 -37 -110 -65 -98 -135 122 9 -67 -111 -106 -108 1 -36 293 277 100 91 170 67 244
3852 244 260 91 196 146 -200 -172 -167 -39 -320 -74 -100 -15 -177 189 43 -149 148 36 25 148 81 -80 197
3875 197 142 -96 -170 219 -79 -21 -15 -86 -46 -227 -5 -283 -187 133 82 15 216 240 140 126 -30 -322 180 70
3899 70 201 -70 79 2 -181 -241 -186 -153 -258 -32 -184 -23 -101 101 168 210 25 128 188 157 21 17 -51 -37 -182
3924 -182 163 -252 -293 -29 -57 -112 -58 -98 90 77 -129 -36 10 52 159 5 -23 110 -12 220 -19 33 33 81 -88
3949 -88 -67 166 -305 -108 -132 -128 -71 -159 -7 -1 150 91 -46 86 248 244 150 -70 243 -147 -109 96 16 46 -230
3974 -230 -181 -142 -251 0 -96 -33 -42 105 -36 15 -82 55 344 92 -11 68 -117 26 -51 -150 -279 -103 86 -10
3998 -10 131 -4 -125 -245 207 -57 52 282 346 5 212 33 -40 155 140 -14 -253 -73 174 -289 59
4019 59 -259 55 -169 97 -12 12 140 239 14 18 -203 57 39 -31 15 -3 -6 -41 161 10 44 -15 -135 45 11
4044 11 -124 -195 162 77 -1 138 88 -49 127 25 102 -27 -57 -104 -1 -267 1 143 67 -46 -40 -152 -88 -11
4068 -11 -114 42 124 -47 126 32 -45 -34 218 -33 42 -126 74 -59 -172 137 -146 -14 -1 106 -256 -25
4090 -25 -59 27 37 -25 123 -49 181 -102 46 148 124 -47 238 -45 -173 102 -66 -196 -65 -28 165 175 71
4113 71 6 -93 72 215 122 -34 8 58 -213 -11 15 68 56 3 58 -78 -110 2 2 27 -1 -16 16 194 148 120 40
4140 40 88 -54 7 -84 250 135 172 36 -135 -154 112 -47 -9 -42 -182 93 -108 109 -251 72 35 -33 -107 -87
4164 -87 114 13 -39 221 -176 -21 -76 187 21 23 16 61 -41 43 94 159 -134 146 44 -87 3 -124 184 59
4188 59 114 143 -43 87 205 10 -284 59 123 90 10 -294 -271 -31 -89 -126 -84 134 233 232 38 123 297 -131 136
4213 136 -38 -90 23 -236 -121 33 84 92 -4 -15 -111 78 29 -39 267 8 72 167 0 428 -28 164 20 -67
4237 -67 56 41 -69 59 -75 7 -110 -81 -53 130 -63 -24 -44 78 32 -19 -43 60 -15 -14 157 199 70 -69 -146
4262 -146 -96 -119 -47 101 -271 1 162 -163 -141 52 195 -7 37 -59 108 73 76 88 15 -20 207 103 126 20
4286 20 -108 -20 -211 -1 33 -28 -212 56 -175 68 194 -61 165 -135 -142 185 -141 143 105 -57 40 -1 132
4309 132 -62 -82 -17 -40 -191 50 141 -50 38 -173 -83 249 155 -94 -136 22 154 100 -68 77 80 -209 -137 259
4333 259 106 -108 162 -119 10 -150 111 21 47 -156 9 -92 -170 347 216 -21 -182 241 -118 -149 -13
4354 -13 -51 85 -131 68 -174 99 -107 -35 -21 -95 116 141 117 144 125 182 18 -164 -8 22 160 -251 31 -24
4378 -24 -123 -126 -28 52 -165 -26 -13 63 48 274 -58 78 180 144 67 -28 -115 69 -147 0 36 46 -113 86 2
4403 2 -115 -78 40 62 -224 -47 -45 80 100 -148 -49 178 13 0 178 -140 74 58 -255 -233 -93 -32 45 122 21
4428 21 -14 -178 39 39 19 -76 44 184 -44 6 -78 29 30 88 -128 19 21 -125 -78 -141 130 52 76 4 -123 -143
4454 -143 69 29 99 92 148 83 121 -98 -15 1 84 -97 -122 -131 -58 27 -144 40 103 158 -42 251 139 -54 -30 186
4480 186 167 -73 12 91 -160 -338 -162 -46 -57 37 -16 -107 -46 43 -45 106 -128 -106 27 -49 -58 -48 81 62 -33 -4
4506 -4 -41 41 -2 85 -148 -32 -105 55 -103 -90 -50 22 7 219 -11 107 116 110 -64 51 114 58 -134 -110 29 -120
4532 -120 6 63 116 186 -19 -98 44 -161 -66 -123 137 83 101 51 -28 -54 -74 -210 4 153 -57 23 18 24 -147 145
4558 145 -72 -110 -73 26 55 -68 -1 66 104 41 187 130 -70 -44 -223 102 204 -28 -161 -18 -85 129 31 -87
4582 -87 38 135 -28 157 -234 10 -72 -112 125 -118 142 -170 33 -56 92 137 -107 -46 -17 -171 105 84 46
4605 46 -215 82 131 -151 66 121 -48 -59 172 69 4 98 -41 -44 138 14 23 -72 -90 32 -68 -35 -67 -31 51
4630 51 -160 -2 178 -120 65 -13 121 58 263 -48 54 8 -224 -115 64 -232 -131 -154 103 -46 -2 10
4652 10 -108 -23 -118 58 177 112 38 -26 138 -39 8 64 44 -10 85 -79 -57 -23 -8 -180 126 -29 105 -143 -10
4677 -10 210 -85 153 -69 102 -130 73 -133 -13 160 -189 103 125 11 164 -268 -245 -118 -192 85 384
4698 384 34 -84 222 136 124 73 -38 11 81 -16 197 -44 -85 17 73 -194 -37 -26 -192 132 25 -1 -110
4721 -110 -34 110 126 164 -42 19 223 -154 -7 92 80 -46 -50 -108 60 -89 -248 160 -39 -75 154 -92 53
4744 53 131 104 149 -211 -47 313 56 135 86 -132 48 10 5 -219 70 -34 -60 118 62 -159 32 130 125 -15 146
4769 146 18 -121 -45 181 13 -16 50 177 -17 26 -216 -39 155 134 -51 -139 138 68 303 68 123 -173 315
4792 315 75 78 102 168 124 63 -99 -130 39 140 -120 -111 42 132 -220 -112 -21 143 48 98 248 -124 212 -107
4816 -107 48 -131 178 37 291 -47 -88 108 -118 -166 -196 9 -207 -44 128 -114 -34 220 121 -262 186 -129
4838 -129 -15 42 8 91 13 47 17 120 -76 -43 -103 -50 -75 106 60 -44 36 -60 16 33 89 -24 14 -110 50 -69
4864 -69 4 -194 -110 120 31 27 14 -44 98 -143 164 -60 -79 56 -34 100 181 50 -8 65 -48 61 58 -105 -249
4889 -249 173 -127 46 5 -230 -159 102 96 46 226 -49 -36 162 135 -139 71 48 87 222 -58 108 98 -137
4912 -137 -72 -5 129 78 13 -82 -161 -243 108 -168 -17 70 161 0 -3 -55 20 1 -69 -61 28 -173 216 38 154 -5
4938 -5 -4 -75 54 -104 134 -100 59 155 118 5 -77 30 -246 -185 149 239 -178 111 37 -137 59 52 -142 23
4962 23 32 10 -156 115 17 -136 158 16 130 183 -203 61 4 132 6 70 49 -54 -27 41 -141 129 36 -86
4986 -86 -110 71 -175 -52 202 4 110 -147 162 -68 46 -59 -179 158 -44 -331 -106 -8 175 -142 -75
5007 -75 106 -38 -3 -29 -75 -104 -152 31 83 73 30 -19 125 -115 -211 -74 -190 94 40 66 115 32 -16 258 127
5032 127 41 111 62 -24 42 -43 18 -15 118 -190 -155 250 -36 -59 -72 86 87 57 -132 -117 -72 -106 41 -63 -100 12
5058 12 46 276 -62 -118 54 -20 102 102 36 204 29 73 -57 106 -206 -70 -12 37 -153 120 196 -29 145 -30
5082 -30 9 314 110 -48 -53 22 -11 -157 76 130 6 -122 -16 -142 -75 -50 -193 -69 53 79 -70 -242 81
5105 81 185 -59 158 -130 18 39 136 43 60 -296 166 -76 69 -153 -8 -55 -85 184 -183 44 98 8 91
5128 91 143 -176 -41 -119 -45 -10 26 -57 116 -298 42 125 70 -39 -17 -42 -5 26 -114 133 29 -14 145 46 -173
5153 -173 -45 73 140 117 -37 -47 159 -116 -108 151 -10 15 -9 -26 124 -67 13 -78 39 -44 -198 -51 151 -18
5177 -18 123 105 -67 -74 24 26 -241 123 -109 37 -73 -123 -84 -96 -149 -15 -36 -137 -137 154 -230 62 -179 -92 -54
5202 -54 -84 -66 -143 -167 -255 -137 -73 69 40 -137 -129 -17 100 -4 42 -13 14 68 61 156 -149 107 -218 -180 -99 -139 -94
5229 -94 -116 -226 -41 -85 85 -112 -153 -99 145 215 36 -13 -68 28 154 70 34 -64 -155 104 76 -81 22 -12 -33
5254 -33 82 -87 -2 -239 23 231 -120 68 51 100 -76 22 -98 6 -147 55 68 89 185 -35 -1 -6 -35 174
5278 174 -257 29 -128 -16 -47 -113 45 7 268 144 158 71 118 -173 -133 55 9 -271 -115 14 117 53 -34
5301 -34 -7 199 154 -97 141 180 -32 -43 96 87 110 -50 2 -157 27 8 -81 -23 -199 -109 8 -103 -144 113 92
5326 92 161 133 -8 -96 242 -3 84 54 -57 -98 -196 50 34 -63 -20 48 -3 12 -153 24 127 -27 61 -1 3 122
5352 122 -75 11 54 -89 -9 88 23 187 14 -128 63 -24 -310 19 57 50 -161 66 -34 70 231 85 27
5375 27 81 -184 119 153 -67 -59 29 251 207 -89 17 -195 -106 -223 145 319 135 34 -82 -13 81 -28 137
5398 137 218 124 -62 232 -41 -141 71 -9 -52 -283 -260 -137 -149 -67 75 138 -92 -74 220 60 133 -87 -18 151
5422 151 13 219 90 -76 201 -105 54 80 -104 -169 16 -166 181 11 -128 235 170 46 -78 206 109
5443 109 -124 33 3 -110 90 -97 96 95 67 -16 -72 -97 125 114 -149 165 -31 -144 66 234 190 7 -8
5466 -8 -115 42 39 -6 93 -120 -103 18 67 24 -193 -130 -18 -175 106 -31 187 115 -18 -15 -31 18 84 108 -25 -196
5492 -196 -19 -91 -40 -76 -101 -61 174 -146 63 136 -257 -61 -74 54 154 187 -4 12 107 28 8 -22 35 -127 -41
5517 -41 5 31 -64 -245 -30 40 -25 -66 136 -118 98 64 191 53 141 50 140 59 52 -119 -7 82 -42 -104 69
5542 69 104 25 -153 -65 80 72 201 -67 -13 33 -104 41 6 -200 -157 99 0 52 -134 -143 101 -73 -6 -201 -34
5567 -34 44 -47 109 -123 98 -173 -27 93 90 -209 149 105 -31 30 -104 111 -31 37 240 4 -21 64 131 74
5591 74 -78 -60 189 -79 -116 63 -6 -111 131 155 118 89 142 -45 -64 197 -6 156 -112 64 -172 -94 40
5614 40 -154 -32 -71 1 195 -43 -117 149 -11 -80 108 180 -97 277 150 -109 -26 41 -250 -22 -43 98 63
5637 63 -134 122 -12 34 111 56 -20 -23 -30 67 1 47 117 -120 62 36 -14 140 -70 34 -53 144 149 -32 102 227
5663 227 -47 119 -26 48 -12 -86 -6 -82 119 20 238 21 1 -117 76 -64 14 -113 -88 148 -54 81 21
5686 21 -99 -87 41 -60 7 -5 0 -117 -24 211 -2 -51 -143 -87 121 10 72 -313 121 -110 -134 -36 103 62 -3
5711 -3 233 -11 -37 -45 90 23 -5 -5 6 223 75 -81 -294 -42 -153 -37 -56 -26 -42 23 -60 -89 212 89 -264
5736 -264 -72 -9 -36 -146 -220 -36 -109 90 73 -24 -9 -136 -20 269 -3 342 -82 125 -89 213 -77 -15 153
5759 153 -101 -84 -193 25 -83 55 34 2 38 22 -137 -84 -144 48 48 -58 -39 70 77 -62 -47 31 7 41 -3 4
5785 4 -111 148 -209 -72 40 55 -46 -151 289 82 -78 -161 106 67 216 -52 20 -48 106 -115 -73 128 -231
5808 -231 100 -104 -127 111 -248 91 2 69 239 -224 47 -258 35 191 19 23 81 26 -54 84 -190 49 -44
5831 -44 36 -71 -66 58 47 -123 -84 -88 -209 -85 89 7 -11 -4 49 -173 179 -25 179 67 49 112 -203 -98 39
5856 39 96 -12 -235 -215 101 10 -44 246 77 184 1 84 163 286 82 -196 -126 -158 -83 52 15 -116 68 -36
5880 -36 -113 15 20 -111 -23 -25 -17 -119 43 28 175 170 -145 -59 -145 8 48 -117 -150 -38 -19 -232 68 50 50 82 -64
5907 -64 219 262 63 83 -52 117 -111 -83 18 -62 -76 -135 -21 9 -173 14 -35 -78 -157 125 83 -7 -51 -151 -85
5932 -85 -217 86 181 21 177 117 -41 134 -307 -8 -65 5 -24 -69 -285 -33 78 -99 29 65 -15 -6 86 67
5956 67 239 -80 -36 90 -79 -44 -47 -203 -249 -93 33 62 -158 39 -99 -58 -178 -137 314 101 -175 -189 41
5979 41 -65 168 -114 -75 119 88 -19 -276 -130 51 -87 -147 18 -142 22 193 -3 75 -62 -33 -9 135
6001 135 6 48 47 -44 -110 -9 -50 -152 143 155 -66 166 -49 -25 2 -117 -13 66 -286 -6 70 -16 -11 84 213
6026 213 -119 -179 9 82 -98 -11 -104 85 0 -195 14 76 -77 -48 -22 65 234 104 124 -124 71 -75 90
6049 90 -121 53 -162 -159 -268 33 -179 -358 22 -26 97 32 285 -43 -199 158 31 153 87 -95 172 -72
6071 -72 66 73 132 106 186 -20 11 -49 -66 -197 30 -199 -48 68 220 -139 14 38 -98 143 -25 -29 11 15 -206
6096 -206 35 -52 1 -64 -283 86 103 94 31 155 -20 10 -4 27 -107 20 178 47 11 -16 -72 10 -70 -46 -30 -74
6122 -74 -1 -165 -58 -56 -109 -38 -66 -114 -68 9 -83 89 -3 126 -27 -74 -9 110 -53 -80 -108 -19 -102 -29 -146 47
6148 47 -281 -70 -25 42 18 16 -76 -44 187 131 56 -76 142 15 12 41 -85 -102 30 -53 117 -142 31 -75 -146
6173 -146 -173 165 145 17 101 69 123 0 -33 -69 -16 -208 123 167 -59 -85 -47 121 57 -179 -36 68 60 -9 94
6198 94 73 156 206 28 95 271 11 -44 -154 -106 97 -125 -146 73 -2 45 114 -39 -208 115 -133 -76 234 106
6222 106 -244 -41 198 -2 102 -75 106 159 -281 -52 170 -16 -131 129 125 -117 -73 85 49 -57 46 32
6244 32 122 -137 266 -2 1 128 75 98 36 63 36 -247 -14 -85 -97 -28 -52 -94 30 9 -101 217 26 -117 192
6269 192 7 30 48 143 -79 -87 -28 36 -211 55 242 -198 21 23 233 23 -23 -165 42 65 282 116 -26 -54
6293 -54 90 -53 237 69 127 -74 -209 -78 -283 46 -14 55 -200 -38 78 32 -150 -128 184 -45 70 200
6315 200 166 217 -110 165 -162 -108 -25 -92 14 -121 22 -30 63 8 -88 -406 -232 -87 77 40 108 29 -121 28
6339 28 -64 -218 -25 -40 28 152 -27 -128 -239 -344 156 179 -43 -118 20 -70 38 129 130 81 23 94 106 -46 203
6364 203 -95 -129 -114 -43 62 -113 -48 64 39 30 0 81 56 -44 18 148 9 -9 -87 79 -60 -35 6 -49 48 -186
6390 -186 20 -6 -39 4 141 23 -95 -51 -241 170 -98 -30 -130 140 73 -99 137 -6 -218 73 60 -59
6412 -59 -251 -36 -79 -9 8 -42 17 106 -24 155 64 -146 -69 -39 -70 57 117 -123 -39 13 -147 157 67 30 29 -146
6438 -146 73 -46 95 84 -31 -98 64 141 14 -122 39 31 29 331 -277 9 -16 68 -159 152 -53 24 -153
6461 -153 139 37 12 47 39 -214 -132 310 68 99 -30 53 -15 211 -56 49 73 -111 -98 72 -181 -50 145
6484 145 -90 44 147 90 152 115 179 61 23 305 -46 25 -53 -83 -297 -49 48 -4 -155 113 89 40 -7 -77 0
6509 0 144 -130 -15 -98 -32 3 146 130 -100 205 39 54 -47 -43 -106 -163 19 -61 -7 -91 -23 43 -142 129 117 92
6535 92 88 -9 -6 -85 134 -1 157 42 80 -70 126 2 12 98 -164 -5 105 -210 -47 -79 192 102 -12 -98
6559 -98 188 -85 -35 107 76 -35 -80 -44 -133 -41 8 -24 46 4 157 -13 -95 -21 67 82 135 209 123 258 -51 -31
6585 -31 -21 -90 -153 -40 -292 -232 -103 31 164 48 47 237 16 -106 23 118 -104 -27 -30 21 -54 -48 -389 44 -11
6610 -11 -44 -258 127 -66 118 75 52 -60 -78 30 -100 446 195 -6 -78 132 76 97 -103 -171 -37 -118 -18
6633 -18 -72 -46 164 -132 -7 -78 -45 44 -24 12 94 155 -45 209 107 -63 22 57 16 -5 23 112 -157 -63 99 -37
6659 -37 144 -154 71 55 16 125 44 -33 -3 195 6 104 161 -112 168 -39 26 -5 -53 -229 -158 -13 51 -114
6683 -114 -143 96 66 -37 -84 202 42 -171 171 12 127 585 634 -77 -270 43 400 -15 118 213 169 174 -26
6706 -26 26 77 73 -37 -282 -39 344 356 89 -180 2 -12 -136 72 18 68 541 207 -137 81 17 -220 -294 5
6730 5 -278 -249 -77 -118 38 446 363 189 193 -315 15 -70 -236 313 -320 -119 48 -141 -90 -304 -12 210 -447
6753 -447 61 -371 405 359 346 124 9 -255 -213 464 18 136 -289 325 457 -174 -179 721 2 -111 -116 76
6775 76 -666 -70 65 -96 -444 295 124 739 198 -27 447 -172 -251 34 237 -27 -176 -227 15 223 128
6796 128 -95 149 -175 235 -80 -317 -24 -498 -32 -514 -277 348 -421 -203 -400 0 -410 198 -103 20
6816 20 -338 48 -6 -26 -23 213 270 -52 512 -8 306 423 302 485 65 -235 -258 43 -183 19 -172 -326
6838 -326 -376 -295 317 -93 -57 -334 -66 463 174 -540 -859 293 83 78 111 -459 -21 115 197 251 197 -54 24
6861 24 65 -276 26 -95 -190 80 89 54 268 -238 180 74 115 -91 387 114 -95 56 -87 -141 -53 -171 -202
6884 -202 103 -105 64 72 33 -128 119 64 -120 -69 -39 21 -52 39 -20 69 -17 -51 76 -46 -102 -246 36 -211 197
6909 197 68 -69 238 -88 -27 77 -38 34 159 3 -64 32 77 -208 93 -29 -33 -223 50 -154 190 53
6931 53 -172 65 -65 39 -191 -11 145 247 -35 57 51 -82 -54 -127 10 -125 -11 -150 -17 -220 58 74
6953 74 -82 -88 -15 -116 115 238 220 -45 -99 21 -86 187 -173 -196 -182 -132 -3 -172 33 63 38 -93 180 87
6977 87 17 -49 70 289 108 82 68 128 17 106 -160 83 110 -87 -36 61 -8 153 28 -3 222 -109 -94 73
7001 73 152 -123 -162 38 99 79 47 114 113 1 -165 11 -229 14 -90 -44 36 226 38 -104 -65 -38 -83 73 184
7026 184 -46 -76 -157 -44 -44 89 -137 94 -123 45 -41 -346 -280 -75 -11 65 -51 53 59 -116 -15 -12 5 67 -63
7051 -63 -42 32 110 141 -90 -98 -39 -181 187 -105 -57 -299 -51 199 -41 36 -55 182 110 124 93 75 67 -174 63 15
7077 15 -193 -99 -75 87 -212 -95 28 -119 4 2 104 2 -99 62 -6 -20 232 57 -39 -166 144 -65 -76
7100 -76 230 -239 -240 -14 -13 230 -89 -41 50 57 -44 32 93 196 207 4 45 71 21 -3 61 -171 57 228 -232 -136
7126 -136 3 40 -127 -147 -41 -92 21 160 96 -85 43 22 34 71 62 76 -153 23 -16 103 52 21 123 157 -128
7151 -128 -240 -119 141 96 158 -134 -90 201 124 -115 -31 -69 0 33 146 -32 -44 -4 -38 -275 -200 60 -13 38 -100
7176 -100 -211 -84 -20 -121 88 145 191 96 -136 27 -61 -121 103 18 65 -11 19 81 275 -265 26 -11 53 305
7200 305 100 36 -13 118 119 -83 165 -112 247 -55 -131 51 200 -76 155 -53 -60 -280 83 -229 59 -38 -18
7223 -18 -38 20 162 56 -69 -58 63 247 -162 -152 261 -3 -4 4 51 -254 -9 58 -90 74 0 -64 49 -140
7247 -140 -69 68 -95 -117 123 264 58 -123 -162 -238 -106 -220 -129 118 32 38 -116 -76 24 167 294 -79 147
7270 147 -15 -96 58 -100 176 115 -132 -72 -106 -95 -19 -106 -69 -50 -61 -102 5 -11 -10 122 196 13 35 -129 84
7295 84 -49 274 12 177 138 244 -159 -109 56 -99 8 -68 -209 -238 -47 -91 -5 182 102 -28 -8 110 123
7318 123 -11 19 185 143 -6 -35 2 71 -74 -138 -20 59 40 -1 25 104 -44 63 -173 38 171 -65 109 93
7342 93 -184 29 -51 -43 -56 -99 -168 10 -8 199 49 131 109 33 60 -150 34 58 -109 -223 41 -29 65 345 47
7367 47 -124 57 109 79 42 -8 85 152 134 -11 -159 223 -7 -122 53 -141 29 -79 -201 165 13 -56 -26
7390 -26 13 -57 43 136 -32 -36 -214 11 -217 -144 46 -80 151 161 -78 -3 157 3 -3 -102 261 9 -37 -86 -103
7415 -103 -48 -253 -45 223 -160 158 -76 209 12 -168 -85 12 -71 -52 -41 -12 -110 8 6 20 -37 -93 -37 -84 -131
7440 -131 -77 1 75 -39 68 29 -30 -18 115 -15 135 143 101 -12 -10 -10 36 -60 -127 27 8 -16 19 -73 -13 -134 -142 30
7468 30 89 -61 128 90 45 12 242 115 129 -16 -185 -21 203 273 -272 52 -2 191 122 -206 -201 -49 -122 -37
7492 -37 171 -39 -109 -29 151 4 45 -116 -69 285 -119 70 -104 -58 -31 -99 159 125 243 11 16 -3 -173 75
7516 75 18 61 -75 20 -6 144 85 97 -131 85 16 -218 -2 -134 8 77 -51 25 93 216 215 67 -131 35
7540 35 234 -152 -120 59 187 -190 -211 112 32 -39 46 70 58 -181 27 -56 -42 61 15 115 -50 109 32 57
7564 57 74 147 -216 47 1 205 -152 -149 102 98 -162 -107 -142 46 -176 154 -63 63 -98 183 112 -180 203 100
7588 100 88 -28 17 91 -68 71 0 -228 -45 -79 94 61 -23 164 2 -106 145 -40 -9 71 -118 49 194
7611 194 72 67 123 -80 31 27 -185 -64 -155 -149 -125 -51 6 -116 -82 119 102 -89 -87 61 -104 313 143 137 38 -20
7637 -20 -298 32 -45 -346 -119 27 -208 -102 -88 -61 -101 -185 121 51 206 46 -26 114 -144 14 -202 -87 41
7660 41 57 -150 -143 -147 -164 -101 -118 2 68 103 65 253 -105 -89 21 89 -73 147 -15 53 39 -91 -237 30 28 -149
7686 -149 -194 12 252 31 37 -110 -122 -103 12 32 -14 315 249 -6 -122 -116 -16 67 -26 -326 -211 88 39 30 -159
7711 -159 -136 -116 -130 -34 -49 71 -107 -74 175 218 133 115 39 100 -119 213 0 -5 199 -85 -11 38 52 98 46 -140
7737 -140 166 -54 95 68 -118 0 -17 -6 112 98 -140 -142 27 46 -137 -301 61 89 -53 200 109 -11 25
7760 25 -178 63 -108 103 -75 29 -51 -28 -2 68 -1 49 112 116 62 -98 139 -89 64 -308 -303 -134 -142 -174 -98 211
7786 211 2 12 11 139 88 -138 -89 87 47 -148 -213 52 -98 -42 18 -71 -4 159 83 -60 -4 -157 111 -44
7810 -44 -193 -95 107 -113 131 58 112 -64 139 -18 224 98 33 50 142 -121 -46 -53 -242 114 224 227 -101 266
7834 266 131 -16 74 21 113 -40 24 74 -121 -14 61 101 -247 35 -89 -131 42 -84 51 -21 -91 216 107
7857 107 100 54 -61 15 -168 -47 -339 -113 -131 16 44 137 -124 -187 145 121 30 -137 -11 45 31 -83 -120 -55 -70
7882 -70 48 -79 98 -58 -26 -139 -101 51 17 -63 73 43 -49 51 113 75 -10 -254 -104 13 -28 130 10 -204
7906 -204 116 156 -65 -93 177 -230 70 135 76 136 76 37 -62 86 9 -138 361 180 54 38 -132 77 163 116
7930 116 -195 48 105 99 -116 3 -213 -63 16 -95 216 -220 -8 89 -13 246 -41 -52 -92 -3 -51 -58 111 -17
7954 -17 -239 68 166 187 2 29 -24 -237 22 43 4 -164 -18 60 66 150 65 55 -51 -131 -382 -126 -150 184 -72
7979 -72 13 -93 -22 202 76 50 -32 -118 29 -175 -90 -100 -12 6 -32 108 -18 52 103 -75 -83 139 -19 -96 3 -1
8005 -1 55 -22 -30 6 -45 75 194 176 184 -90 -129 147 -30 226 102 -4 -48 -31 -12 138 -3 -154 -25 -27 -32 182
8031 182 -23 7 138 68 -51 -170 -33 -46 -85 10 3 50 96 -123 -19 81 -57 50 -31 -44 127 210 35 -14
8055 -14 81 37 -242 86 -98 -123 91 -199 -86 -168 83 -96 -76 -152 -43 -278 62 -146 -55 -23 311 224 -15
8078 -15 -179 136 -75 51 -139 46 -176 -129 -139 -64 166 53 27 -79 -213 51 -116 -30 -16 179 181 -175 142
8101 142 139 99 92 183 -13 -136 -161 -196 -81 -32 -249 -101 15 70 -191 -57 -168 -57 -243 -109 -53 -86 37 126
8125 126 73 -71 42 -140 7 -19 -59 -220 -67 41 -168 -19 30 105 33 88 43 40 239 -172 152 118 -112 55
8149 55 283 78 -91 -6 26 2 -224 -28 14 -102 -275 -124 -196 16 22 -1 78 22 -73 28 -37 172 55 -33 -100
8174 -100 -70 -48 -168 68 -40 190 -81 -170 29 -138 21 45 -248 124 -121 132 -65
8191f5
$$ Imaginary data points
##PAGE= N=2
##DATA TABLE= (X++(I..I)), XYDATA
0 0 0 0 0 0 0 0 0 0 0 0 0 -8 8 -8 8 -8 16 -16 24 -24 32 -35 40 -48 57 -70 80 -94 105 -121 141 -160 182 -206
34 -206 233 -262 295 -328 367 -412 456 -507 563 -625 691 -763 842 -928 1022 -1128 1242 -1367
52 -1367 1506 -1663 1838 -2034 2258 -2515 2815 -3166 3592 -4109 4762 -5616 6780 -8471 11166
67 11166 -16128 28325 -124597 -76121 201368 36928 -99042 -23677 69492 -17337 -38438
78 -38438 24872 31471 -33912 193 62722 43973 -33682 -41410 21012 56727 -18305 -77210 -17321
91 -17321 56315 16319 -36833 -16307 4301 -30897 -24128 27270 16301 -23530 11829 42475
103 42475 827 -22545 7254 4507 -17037 10357 31193 -17841 -37257 24079 38836 -31764
115 -31764 -52872 2497 24688 -7164 -12213 19047 19742 -16571 -21407 14680 20932 -14318 -18391
128 -18391 31417 47079 -12757 -46399 104 24865 -20431 -37778 9720 30649 -10645 -30444
140 -30444 4083 15911 -16388 -21256 13464 23879 1479 -91 23997 18650 -18658 -21895 15874
153 15874 25593 -8785 -22396 7487 19994 -13682 -35953 -11948 8108 -6896 -14657 6519
165 6519 15922 -2432 -9381 11386 18257 -5955 -14942 14700 33572 9432 -16409 -5170 12312
178 12312 -1222 -21806 -13790 2928 197 -7498 -2941 1265 -6590 -11901 -2188 9977 7616 -259
192 -259 4469 16657 15468 -1439 -11290 -668 9829 -926 -10178 -59 8030 -4392 -17363
205 -17363 -11863 -1342 -3230 -6981 1354 10913 7179 -1601 1037 11259 7921 -7035 -2638 17660
219 17660 13519 -10662 -10372 9957 4142 -20942 -17259 7313 4077 -16108 -9107 11539 6683 -12001
233 -12001 -8666 11080 14167 590 -477 12730 14912 -784 -7437 5491 8407 -9127 -14844
246 -14844 2544 8428 -9590 -16930 -1881 3845 -10367 -12030 5520 12062 953 -3959 7007
259 7007 14628 4681 -5700 2575 13835 6747 -7018 -4692 7120 665 -16575 -11641 4776 -1002
273 -1002 -15780 -8315 10172 6889 -10990 -6991 13635 12760 -4015 -1968 14456 14612 -3228 -7773
287 -7773 7283 8715 -9099 -12811 1581 3945 -9816 -14254 238 5750 -8537 -11231 5086
300 5086 10684 506 -3638 7398 15028 4433 -4346 3597 9822 2288 -5657 -3434 3442 -1075
314 -1075 -12025 -9305 203 -2610 -9399 -6417 3716 5708 -2968 -2793 8795 10230 623 -516 8243
329 8243 12223 1257 -6714 3474 7553 -6233 -13090 -2134 4032 -6760 -15235 -3104 7339
342 7339 -4299 -11099 1947 11007 3287 -4131 5298 16242 5758 -6170 3073 12206 1611 -10415
356 -10415 -3760 7456 -1699 -16436 -7279 6173 -3737 -14479 -4346 8577 3386 -7788 -544
369 -544 14129 7969 -4403 1621 12747 8747 -3850 -4404 7181 4870 -10058 -9964 1291 357 -10669
384 -10669 -10936 1227 4041 -6970 -6632 6363 8199 -380 -1454 7641 11561 3555 -2009 3965 7464
399 7464 101 -5988 -3033 1651 -2917 -10390 -6470 1367 -2947 -9996 -4747 5088 4905 -2679 -1253
414 -1253 9122 9986 1315 -91 6528 8621 733 -3865 2075 4162 -6444 -11047 -1765 2115 -7608
429 -7608 -12218 -249 7006 -3706 -10207 2416 11184 3125 -2665 6037 12665 4320 -3751 2876
443 2876 8368 -1686 -8650 -354 5890 -4776 -14540 -6068 4649 -3245 -12741 -2826 9350 2927
457 2927 -6239 1209 11985 5867 -3741 3745 13166 4212 -6766 -1272 6499 343 -10096 -6656
471 -6656 1995 -2093 -10645 -7523 1289 2369 -3598 -4085 4684 7795 -670 -1005 9746 11563 660
486 660 -3463 5369 7336 -3876 -7577 -53 500 -5793 -6811 -3084 -1424 -3999 -7220 -4262 4159
501 4159 6080 129 -576 8346 9227 -2075 -2376 9946 8701 -3262 -2807 4394 139 -9549 -8305
516 -8305 -198 -586 -6981 -7183 -1125 3525 -1084 -6709 1664 11467 3805 -4422 5986 14633 3417
531 3417 -6630 2586 8224 -4665 -8251 2950 2815 -8644 -10807 -2314 2215 -3634 -8493 -2408
545 -2408 6523 4660 -2296 -227 10107 8150 -3327 1040 11341 3681 -6951 -43 6724 -1891
559 -1891 -10764 -4668 1151 -5834 -10209 -3476 3293 2841 -1402 -3265 3149 6854 706 -1136 7517
574 7517 10944 1863 -2327 4977 4164 -8107 -7932 3513 2979 -6836 -8723 -3015 -1003 -4640 -5250 -596
590 -596 3698 4186 1787 2018 7599 6719 -1879 -1246 7709 6265 -2537 -3361 2777 -338 -9665 -7235 2072
607 2072 -532 -8007 -6195 76 2517 -1305 -2501 3761 7539 3445 421 4853 9102 2794 -4347
622 -4347 2836 7986 -4123 -11906 -2633 4204 -3835 -10665 -2472 4652 -3692 -9307 -50 6728 2451
637 2451 -1807 2787 10191 6194 -2588 638 7333 2411 -4205 -299 6337 -904 -13022 -8949 2121
652 2121 -1265 -8833 -3925 4180 2292 -3965 -1100 6704 4783 -1366 2370 9079 7031 -553 -1895
667 -1895 3035 2944 -4683 -5484 229 -377 -6223 -7601 -2397 763 -2819 -5265 -103 4974 3439 601
683 601 2956 6649 4995 655 2040 4891 1514 -3569 -2553 1735 1248 -6226 -8774 -2357 342 -5579
699 -5579 -6710 1600 5355 -1123 -3442 5413 8424 364 -1701 5955 8166 1508 -2194 1720 2655
714 2655 -3823 -7736 -2197 1657 -3509 -9128 -4246 3380 -719 -7938 -1085 8317 3024 -2638 4865
729 4865 10467 3433 -2953 2319 7295 667 -4691 -649 1655 -3035 -6274 -5000 -742 -1619 -6873
744 -6873 -4163 3664 2707 -2959 -972 6454 6923 -201 736 8032 5502 -1985 -425 3219 717 -4783
760 -4783 -5294 -1146 -860 -5364 -5545 -1516 -246 -1849 -3238 588 5152 2149 -685 4692 7468 3853
776 3853 -203 1304 4701 1278 -4296 -2041 1131 -2161 -6251 -5646 -1509 -795 -5291 -4116 2351 3262
792 3262 -28 -101 3984 5990 2174 -262 4783 6398 398 -2873 854 3034 -2328 -7967 -2954 1233
808 1233 -4349 -7713 -1914 2507 -1379 -4717 756 6858 2871 -1159 3731 7356 3885 -1119 741
823 741 5094 1546 -5030 -2799 1787 -1506 -7140 -5615 507 -771 -6512 -3428 3928 2007 -2270
838 -2270 1030 6518 4900 -101 1604 6551 3435 -1698 -756 2170 -120 -4332 -4976 -1351 -1214 -5438
854 -5438 -5261 -586 759 -2298 -2373 2406 4799 1417 581 5026 5747 1900 551 2639 2951 -789 -3687
871 -3687 -1645 -509 -2854 -5012 -4373 -1354 -1454 -3639 -2471 1398 2169 78 741 4991 5651 1314
887 1314 652 4300 4449 -69 -2415 499 1634 -3473 -6578 -2407 -184 -3751 -5572 -1861 2114 -458
903 -458 -3252 1694 5980 2706 -264 2743 6883 3836 -1711 305 4673 908 -5399 -3255 1189
918 1189 -1806 -7213 -5026 1187 -888 -5610 -1547 4002 2144 -1563 1278 5775 4836 444 1629
933 1629 5078 3119 -1480 -1859 646 416 -3926 -5303 -901 -786 -5349 -4992 13 974 -1821 -1160 3670
950 3670 4197 658 1718 4714 3859 1715 1405 1539 861 -806 -2536 -2543 -1327 -2483 -4402 -3745 -708
967 -708 -1218 -3835 -1412 3031 2203 293 2499 4070 2821 2070 2643 3072 2183 372 -1176 -1549 -811
984 -811 -2473 -5375 -2812 718 -2465 -5873 -1522 2424 -937 -2240 2538 5455 2064 1128 4204 4135
1000 4135 1044 144 1324 1950 497 -3516 -4091 -744 -1569 -5850 -4787 768 1242 -4130 -2590 3890
1016 3890 2746 -1432 2478 6623 3093 -404 1804 4324 1757 -2241 -858 1034 -1201 -3685 -4270
1031 -4270 -2702 -1423 -3508 -3903 745 1338 -1522 -685 2814 3984 975 1498 5805 4684 -437 22
1047 22 1850 -364 -1973 -1610 -400 -1564 -4515 -4314 -1443 -1745 -2051 -813 328 2048 1544 732 2898
1064 2898 3286 2450 2500 2416 2253 1463 -986 -875 -640 -2733 -3422 -2572 -1832 -1614 -3029 -3211 -601 543 236
1083 236 751 2316 4238 3050 464 2058 4470 1635 -700 1215 1977 -1478 -5145 -2900 585 -2702
1099 -2702 -5335 -2348 467 -1184 -3218 -548 4054 2938 -547 1876 5929 3999 -770 58 4137
1114 4137 2109 -3456 -1912 1939 -1502 -6159 -3987 100 -1299 -4411 -2034 1780 763 -1501 306
1129 306 3265 3490 1965 1506 4064 4040 -230 -1747 805 1699 -1999 -3759 -469 -539 -4961 -4616 -468
1146 -468 -969 -2477 56 2548 1602 872 1926 2189 2318 3566 3146 1017 1075 1173 -1820 -2692 -89 -504
1164 -504 -4158 -4017 -1307 -1958 -3229 -1134 919 -219 399 2079 2282 2462 3058 1913 1132 3213 3032
1181 3032 -810 -1881 1081 -461 -5086 -2719 1225 -2134 -5421 -2221 1179 -1261 -2667 1389 3911
1196 3911 2046 1245 2390 3431 2567 582 541 2663 1851 -2544 -3452 316 -204 -5382 -4920 553 1
1213 1 -4396 -2170 3295 1323 -2410 557 4984 3461 508 1831 3744 2300 -540 -539 937 -156
1229 -156 -3036 -3574 -1457 -856 -2943 -3747 -864 181 -1484 -1072 2115 3160 1314 967 3711 3660 1292
1246 1292 620 1643 980 -429 -994 -1054 -1732 -2352 -2550 -2689 -2387 -1132 -1007 -1535 79 1908 1189 374
1264 374 2264 3417 2320 1246 2618 2625 319 -1297 -314 -768 -2142 -2862 -2711 -1601 -1097 -2522 -2002
1281 -2002 -197 582 -587 26 3312 3485 233 1106 4827 2858 -1049 -276 2629 476 -2844 -1971
1297 -1971 515 -1970 -5012 -2758 -610 -1249 -2299 -892 1888 2203 416 717 3328 3211 1136 342
1313 342 2818 3312 -832 -1996 1092 80 -3964 -3306 -131 -579 -3810 -2906 622 388 -1729 156
1329 156 2288 2110 2101 2017 2563 2933 1215 230 482 524 -365 -2219 -2148 -411 -1688 -3897 -2168 -912 -1702
1348 -1702 -1648 1 1166 1201 647 1939 2541 1783 2268 1792 913 1839 905 -1321 -1462 -936 -1818 -3306 -2681
1367 -2681 -567 -1171 -2905 -852 1427 201 -753 936 2939 2482 1130 1989 3331 1679 -51 -78
1383 -78 622 -72 -1955 -2811 -990 -842 -3105 -3179 -660 140 -1651 -1196 2252 2940 59 615 3950 2685
1401 2685 164 905 2635 1606 -1193 -1298 385 -956 -3120 -2618 -1601 -1176 -2085 -2318 -41 1253
1417 1253 -170 -319 1833 2989 1676 810 2706 3237 355 -576 1116 481 -1820 -1859 -1195 -1215 -2397
1434 -2397 -2543 -1475 -1050 -1261 -844 259 1223 1932 1626 1515 2119 2244 1498 1200 1325 1072 -658 -1567 -824
1453 -824 -615 -1963 -2682 -1662 -862 -1490 -1532 -712 406 772 332 1029 2389 2621 1520 1337 2380 1945
1471 1945 -301 -836 1078 -327 -2964 -2835 -712 -1093 -2967 -2049 186 -111 -1620 -118 1984 1547
1487 1547 847 1396 2679 2881 959 188 1187 1168 -746 -1832 -502 -381 -2629 -3378 -1314 -753 -2673
1504 -2673 -1525 1202 1252 -145 198 2347 2082 1135 1776 2295 1654 819 -32 -217 -295 -1365 -2026 -1650 -844
1523 -844 -1848 -2782 -2186 -484 -587 -611 1262 2091 1020 886 2011 2174 1952 1405 1384 259 -696 -690 -1270
1542 -1270 -1626 -920 -1372 -2536 -1880 -932 -1219 -1561 -311 1146 942 778 2233 2630 1144 828 1369 1883
1560 1883 1150 204 -223 -722 -1584 -2221 -2314 -1290 -537 -1680 -1944 186 530 -1019 -650 2236 2887 836
1578 836 1079 3327 2272 -685 189 1432 318 -978 -1067 -443 -1645 -3130 -2304 -1036 -265 -554 -1235
1595 -1235 -613 1244 567 600 2485 3078 1294 64 1429 2034 -67 -884 698 -163 -2495 -2175 -1211
1612 -1211 -1627 -1821 -1742 -975 -411 -33 737 526 692 1779 1176 1014 2554 2459 511 234 22 -565 -1331
1631 -1331 -1388 -802 -1180 -1884 -1291 -1340 -1543 -371 -442 -219 1200 1910 1106 1416 1977 1639 550 632 1737 701
1651 701 -926 -401 -610 -1912 -1954 -1595 -1374 -1308 -1513 -941 -227 431 283 339 1062 2160 1193 976 2140 2037
1671 2037 124 52 762 -181 -1654 -1831 -914 -1268 -2109 -1737 -612 -697 -984 -742 343 1372 1023 844 2199
1690 2199 2633 1212 283 785 1160 -11 -804 -81 -104 -1817 -2308 -1574 -1422 -1722 -1561 -271 742 378
1708 378 27 963 1646 1178 1175 1581 2023 1217 392 351 -16 -1087 -1297 -1200 -1608 -1406 -1293 -1510 -1209 -777 -1054
1729 -1054 -156 674 1022 1350 1220 1623 1821 1550 1185 741 27 -69 -298 -1006 -831 -940 -1707 -1922 -1571 -1112
1749 -1112 -937 -1024 171 1317 312 607 1738 1447 930 951 1847 1455 326 -129 -30 -444 -1906 -1769 -1362
1768 -1362 -946 -1330 -1641 -257 -12 -1026 -441 1056 1319 766 1232 1999 2086 533 438 947 433 -775 -934
1787 -934 -466 -480 -1621 -1989 -1171 -851 -1794 -1312 69 923 455 421 1587 1863 918 742 1485 1192 543 281
1807 281 349 -299 -903 -1573 -1718 -1291 -1411 -1447 -1132 -393 163 -281 260 727 769 1266 1470 1905 1488 1035 846
1828 846 539 -366 -452 -488 -1340 -975 -792 -1610 -1754 -990 -720 -920 -534 639 940 653 893 1663 1419 1108
1848 1108 896 1193 681 62 -203 -16 -734 -1394 -1838 -1499 -1015 -1339 -1486 -171 196 -76 66 902 1396
1867 1396 825 817 1858 1913 570 319 1044 282 -864 -1264 -462 -839 -2057 -1566 -608 -945 -1450 -767 39
1886 39 709 534 899 1558 1731 1005 543 1067 1362 238 -620 269 271 -1212 -1651 -736 -1059 -1709 -1262 -419
1906 -419 -223 -372 217 992 729 789 1405 1057 1413 1238 831 306 286 0 -656 -1079 -1093 -1006 -1332 -1334 -843 -905
1928 -905 -484 -330 -195 360 1131 847 1119 1449 1575 1068 423 663 1202 -383 -747 -175 -791 -1629 -1725 -1043
1948 -1043 -921 -1273 -1027 156 536 76 192 1279 1284 800 906 1409 1458 621 -63 713 248 -967 -1463 -896
1968 -896 -866 -1622 -1882 -591 -169 -862 -420 586 827 316 740 1659 1934 841 882 1308 772 -390 -387 -229
1988 -229 -520 -1182 -1299 -1089 -941 -1027 -1045 -352 186 224 191 862 1368 844 661 1150 1246 743 553 655 146 -413
2010 -413 -857 -876 -1141 -1201 -648 -1185 -912 -188 -258 -529 189 985 925 1082 997 1464 1356 415 578 664 130 -389
2032 -389 -856 -791 -535 -1412 -1755 -647 -374 -892 -1114 10 911 261 232 1525 1454 893 880 1249 1406 302
2052 302 -599 -288 -49 -757 -1159 -1104 -780 -1260 -1840 -698 325 -38 -442 675 841 490 638 1390 1741
2071 1741 818 480 945 266 -638 -332 -627 -728 -966 -1011 -1201 -1013 -843 -1100 -250 630 921 85 764 1558
2091 1558 598 617 1174 1208 352 214 297 -422 -1119 -739 -535 -1204 -1083 -699 -1053 -1173 -252 281 67 579 1130
2112 1130 1171 647 1094 1291 851 554 737 190 -503 -168 -790 -1437 -900 -761 -925 -913 -265 -256 -988 -404 1284
2133 1284 716 475 1276 1886 482 164 799 929 -65 -291 31 -362 -1218 -1120 -1133 -1137 -896 -768 -473 -141 69
2154 69 34 287 1209 1208 727 1021 1759 1039 -50 196 657 -433 -1021 -435 -369 -1146 -1403 -672 -617 -917 -301
2175 -301 -33 -97 505 616 783 1075 995 1035 830 710 365 78 -220 -132 -683 -1316 -903 -854 -1194 -1163 -514 -361
2197 -361 -406 178 783 531 370 994 1115 597 600 1089 560 34 -257 77 -712 -1042 -704 -973 -1172 -1010 -589
2218 -589 -348 -353 -273 113 692 994 745 882 1342 1152 322 274 677 223 -763 -510 -380 -749 -1560 -706 -573
2239 -573 -792 -839 -160 98 116 247 666 939 843 622 907 980 625 286 203 127 -542 -1008 -1117 -481 -1001 -1119
2261 -1119 -641 -168 -513 -287 276 503 546 395 963 1175 845 733 758 647 -164 -316 14 -639 -677 -918 -888
2282 -888 -678 -887 -750 -177 -52 -57 148 415 790 737 888 1161 813 390 439 365 -71 -183 -424 -364 -809 -1188
2304 -1188 -644 -533 -633 -432 -5 -37 165 96 769 1030 469 681 1312 902 276 285 68 39 -599 -639 -263 -726
2326 -726 -1138 -877 -726 -482 -779 -265 559 596 4 527 1228 1149 697 736 717 627 -113 -2 176 -681 -860 -696
2348 -696 -698 -759 -831 -632 -222 -207 -154 426 520 536 639 930 1040 767 270 633 266 -382 -219 -116 -406 -803 -790
2371 -790 -721 -463 -1069 -422 127 68 71 380 706 1020 836 470 966 823 373 107 192 62 -397 -858 -750 -730
2393 -730 -1033 -713 -456 -799 -640 -123 125 511 455 698 863 699 722 1017 501 194 164 -140 -276 -528 -643
2414 -643 -565 -838 -994 -720 -486 -427 -235 -8 71 416 710 517 982 1144 438 630 523 333 -314 -211 -97
2435 -97 -361 -982 -800 -530 -713 -1012 -311 -186 39 -78 375 622 637 727 575 1014 915 553 150 80 -36 -490
2457 -490 -542 -432 -962 -957 -572 -515 -520 -390 -3 293 194 414 688 743 468 667 688 604 257 27 91 -210 -718 -665
2481 -665 -708 -541 -725 -704 -546 -276 -137 -80 211 579 538 370 620 757 478 425 464 148 71 -62 -347 -908
2503 -908 -747 -530 -854 -723 -374 -343 -306 -206 170 111 404 597 589 765 785 514 241 671 435 -239 -457 26
2525 26 -443 -1172 -726 -120 -584 -633 -421 282 110 132 483 731 719 525 930 576 527 178 -45 148 -175 -480
2547 -480 -649 -519 -317 -823 -811 -93 -237 -332 132 680 356 342 634 743 549 767 735 417 165 76 -146 -669
2569 -669 -509 -309 -522 -780 -632 -658 -383 132 -85 -19 212 665 501 337 914 532 -5 202 544 81 196
2590 196 -230 -177 -728 -680 -667 -548 -731 -174 106 -393 -129 308 308 476 824 829 747 319 615 388 29 -2 -450
2613 -450 -429 -347 -575 -1012 -602 -76 -415 -583 28 353 80 -41 611 1063 554 431 545 422 186 215 -11
2634 -11 -83 -271 -634 -531 -616 -377 -721 -869 -220 34 -289 171 598 459 394 470 857 514 616 566 509 -383
2656 -383 -167 -225 -574 -687 -438 -485 -727 -336 -156 -394 -187 152 485 426 546 671 502 530 695 546 346
2677 346 243 13 -435 -376 -337 -577 -590 -330 -457 -630 -343 -65 118 292 258 637 528 355 372 456 374 259
2699 259 82 117 -243 -414 -412 -675 -650 -605 -644 -401 -261 -348 -259 182 535 292 799 850 716 159 371 507 134
2722 134 -91 -166 -76 -500 -591 -388 -251 -707 -500 -552 -141 -52 111 274 503 593 560 697 510 629 295 166
2744 166 47 113 -96 -329 -435 -390 -731 -566 -302 -292 -59 -138 265 58 476 608 406 330 457 473 204 392
2766 392 260 -136 -339 -446 -351 -267 -721 -441 -479 -306 -310 -374 -218 387 206 -39 481 624 714 236 471 423 310
2789 310 -59 -5 29 -636 -768 -174 -381 -488 -459 -208 -232 -165 172 378 242 315 548 494 242 432 66 94 202
2812 202 -71 -66 -288 -141 -477 -602 -257 -360 -407 -457 -82 238 184 331 660 502 192 603 425 179 178 289
2834 289 -43 -97 -215 -194 -577 -263 -285 -500 -296 -125 -263 -183 268 191 415 475 479 590 334 534 192 174 154
2857 154 130 -281 -425 -244 -444 -219 -599 -221 -146 -377 -163 289 195 174 433 578 452 442 401 380 39 -91
2879 -91 -97 -340 50 -250 -559 -601 -263 -682 -432 -185 4 133 172 225 826 225 304 491 552 101 218 116 20
2902 20 -18 -143 -300 -413 -383 -510 -405 -314 -198 -92 -101 291 376 405 416 448 312 423 376 228 -99 -299 -9 -466
2926 -466 -236 -495 -388 -535 -307 -488 -154 -306 -257 165 303 249 494 346 243 427 43 189 71 46 -51
2947 -51 -66 -159 -420 -388 -468 -465 -327 -161 -103 -32 -95 253 306 251 606 412 539 278 254 330 427 6 -340 -204 -437
2972 -437 -370 -382 -317 -218 -282 -341 -132 26 123 80 463 535 372 286 312 314 231 -118 68 96 -1 -373 -246 -456 -340
2997 -340 -483 -289 -341 -144 42 80 106 274 230 506 381 602 583 297 135 -27 65 -297 -338 -142 -334 -180
3019 -180 -336 -382 -97 79 -228 -77 214 187 268 273 627 430 267 164 206 52 182 -94 -315 -117 -425 -648
3041 -648 -374 -153 -159 -270 -148 -76 424 330 486 692 142 415 346 191 328 350 93 6 -339 -95 -301 -383 -528
3064 -528 -85 -217 -490 -128 -124 -40 36 276 279 471 549 301 224 269 279 -363 -74 64 -322 -496 -293 -120 -341
3087 -341 -357 15 22 -164 -27 422 99 237 175 288 382 315 163 242 138 193 -37 -332 -41 -420 -518 -422 -363 -381
3111 -381 -219 -39 -51 -93 80 249 193 282 476 458 121 17 132 -108 -223 -232 -148 -285 -295 -274 -113 -98 -75 -50
3135 -50 -91 120 319 172 159 409 331 174 283 218 172 98 44 -252 -436 -447 -416 -485 -447 -252 -40 -213 -107 -133
3159 -133 -13 42 387 284 325 272 125 304 148 126 -148 -168 80 -274 -255 -453 -339 -262 -162 -117 -107 -139 19
3182 19 187 222 354 297 384 446 140 105 -109 239 48 -339 -95 -35 -50 -298 -166 -248 -90 -66 41 3 258 253
3206 253 350 113 318 404 425 240 110 108 11 -127 -308 -147 -88 -273 -357 -310 -61 -282 -99 143 98 275 341 255
3230 255 183 328 403 162 -114 215 161 -203 -115 -110 -305 -168 -426 -125 -273 -221 -58 -190 140 266 175 139 252
3253 252 434 147 151 165 229 38 29 -54 -312 -367 -246 -169 -148 -13 -331 -233 -121 132 -84 198 283 151 203 340
3277 340 463 170 -114 205 -54 -211 -69 -344 -93 -501 -328 -180 -161 -36 92 42 296 128 54 129 214 1
3299 1 400 189 230 -76 -124 -104 -95 -165 -140 -123 -193 -500 -236 -56 7 -137 236 -3 241 148 243 118 208 195 327
3324 327 131 31 -14 -308 47 -309 -244 -262 -50 -308 -252 -189 -38 -19 121 176 378 165 45 54 248 99 354
3347 354 190 -124 -204 0 -4 -119 -148 -59 -163 -220 42 107 202 -26 68 87 215 178 301 201 342 154 -106 22
3371 22 186 -136 -221 -197 -264 -294 -420 -255 5 -227 -292 72 111 223 168 50 342 29 -34 293 56 19 144
3394 144 -62 -32 9 -415 -357 -313 -178 -215 107 -93 86 126 101 296 203 101 63 -65 204 216 166 -75 -109 -140
3418 -140 -135 -232 -239 -26 -33 -232 -280 -58 204 -17 150 203 207 -2 128 125 54 27 -31 95 5 -202 -223 -198 -311 -222 -77
3445 -77 -179 44 -94 -35 133 113 327 133 162 220 49 291 153 117 -51 69 22 -121 -246 -73 -220 -106
3467 -106 -77 -290 -68 156 81 46 145 301 144 214 309 -90 -15 193 -86 -118 -193 1 5 -266 -197 -238 -232 -406 -51
3492 -51 36 122 186 281 248 79 136 123 188 297 -151 128 -289 -124 -38 -121 -59 29 -258 -267 -224 -67 -62 47 44 133 146
3519 146 219 132 102 50 341 56 118 185 61 -16 -174 -136 -177 45 -205 -217 -316 -234 102 -91 66 81 -66 0 308
3544 308 254 112 22 -350 -84 56 48 -93 -100 -211 -135 13 -306 -3 -107 -85 198 25 338 95 138 -3 149
3567 149 259 204 25 -109 149 11 -184 -296 -280 -386 -57 51 -156 -165 42 143 101 -58 38 186 -57 -146
3589 -146 140 131 103 246 -88 -52 -289 -175 71 -84 -261 -182 -250 69 -94 193 87 64 115 174 25 -63 90
3612 90 169 -2 94 104 -108 58 -122 -24 -258 -137 -172 56 1 -92 -5 -209 259 96 168 149 122 262 -31 12
3636 12 7 9 26 -129 -78 114 -60 -342 -146 -76 -69 -175 139 -42 156 20 2 326 111 182 33 100 32 106 98 53
3662 53 -116 -303 -15 -168 -16 -259 -16 40 -134 -164 122 88 195 -26 18 162 68 184 174 73 -90 128
3684 128 -195 -62 -116 -83 45 -165 -147 7 -44 67 -17 -66 77 215 230 155 42 306 -15 202 14 205 -348
3707 -348 -169 -103 -49 -169 -14 -14 -112 50 93 55 115 80 101 172 -26 180 102 290 9 57 -175 -97 -203 50 -223
3732 -223 58 -145 -116 -123 -173 -141 -117 129 4 64 -28 106 19 69 113 147 145 -65 39 25 -128 -100 -141 -4 -179 -26
3758 -26 -186 -49 26 202 95 173 214 140 207 86 17 14 159 -137 -9 -9 -224 111 -63 -95 -333 -87 -129 -30 -180
3783 -180 -167 160 29 61 179 117 206 19 74 112 -18 -15 155 -162 -213 -24 -180 -157 -99 -279 -150 33 152 94
3807 94 94 242 88 127 105 210 -40 -63 145 152 -92 77 -73 -176 -47 -218 115 -14 1 -61 -5 120 200 189
3831 189 221 -115 241 176 67 -108 393 -143 75 -34 -11 -252 -251 -202 -52 -101 104 140 -127 129 -190 -15 -108
3854 -108 3 32 102 18 118 285 205 -254 132 148 32 -57 135 -339 -16 -92 -21 -28 -130 74 185 96 222 60
3878 60 37 179 -146 87 -69 -72 -76 105 14 -190 -171 79 24 -212 -147 37 -183 -164 205 18 36 18 12 236 -19
3903 -19 83 36 58 -279 -139 -240 -126 97 -158 -249 92 -51 166 -14 12 159 108 -123 82 148 -31 159
3925 159 -18 62 267 -109 -385 -64 23 -46 -329 -44 -208 -39 -99 -204 -176 -5 -51 -48 -66 77 71 77 159 123 -37
3950 -37 112 20 45 -279 -164 -129 -150 -201 -93 175 7 -114 41 -31 -43 171 123 141 68 133 -20 142 137 -214 -80
3975 -80 -241 -37 20 -133 -67 -85 57 22 -20 169 30 54 85 44 152 -11 85 257 123 137 -119 -75 -9 -103 -121
4000 -121 -20 60 36 -70 -32 -11 51 208 -52 269 34 156 -46 -15 217 -64 20 223 -43 -18 -110 -104 -249 -52
4024 -52 -23 129 -61 -6 -25 -70 15 103 175 -7 -30 142 34 10 239 88 127 -40 9 -46 -55 12 13 -12 130 -158
4050 -158 167 92 -31 200 12 111 -22 233 44 35 -57 120 176 -139 -182 2 -77 52 -70 -107 161 19 2
4073 2 46 -219 -129 41 152 164 110 98 88 116 -34 -25 52 -57 -3 -35 -189 -89 -70 -73 102 12 3 215 15 -6 15
4100 15 246 172 266 53 23 233 67 -137 153 112 -75 34 91 -119 -75 38 -193 87 -62 151 41 -81
4122 -81 -107 183 -43 238 -55 -39 -94 139 -122 -145 -180 -6 57 -54 -55 -254 3 188 -25 -26 -140 -7 110 2
4146 2 246 50 118 -177 61 -43 7 93 -84 -85 -70 -83 -19 33 -137 -96 -152 117 57 67 -76 152 136 176 257 -72
4172 -72 103 157 -77 111 -220 68 -12 -97 -216 -21 -18 12 98 -29 88 -24 103 220 -40 26 179 65 142
4195 142 -17 -149 -74 -182 -44 -54 -33 -146 58 69 36 -41 4 143 -120 2 68 179 43 -118 37 164 -9
4218 -9 56 175 70 108 75 8 -240 -37 30 -206 129 -161 123 168 -9 -55 6 -57 36 -85 -28 99 199 115 -46
4243 -46 193 120 12 -186 -276 -126 35 -5 -89 217 75 -30 -181 149 -72 105 325 89 135 229 -36 47 -342
4266 -342 7 8 22 -119 -203 -172 -196 -49 38 15 -166 -40 66 288 64 169 102 -287 88 62 29 -43 27 -152
4290 -152 -190 20 10 -276 -1 -83 -130 -215 -64 -7 118 88 -174 12 107 387 -74 -119 63 -9 -115 -149 11 81
4314 81 -52 -80 -132 -178 -76 -5 -26 -183 95 126 -107 153 -26 -35 -42 -73 -200 3 39 8 101 5 103 -189 22 -263
4340 -263 -65 -17 177 -67 220 -34 138 95 118 -24 -85 -21 -219 54 12 121 -131 41 101 -322 -195 -30
4362 -30 2 11 -46 -4 32 60 -75 190 49 160 230 -1 -10 181 -226 70 -44 56 -61 -74 -40 -41 -116 45 -29 -11
4388 -11 -38 0 10 34 -74 41 133 -89 253 275 -49 76 31 63 49 -68 -47 152 -210 -98 -38 -8 -31 -41 -142
4413 -142 77 102 -265 119 -27 56 -63 -14 -62 -166 -73 156 168 -88 -129 32 -127 39 94 -55 89 -44 77
4436 77 101 -19 -233 -19 106 64 189 12 77 -250 50 61 -29 5 -84 23 -68 104 -72 31 52 -83 -28 -32
4460 -32 114 76 -178 -59 89 62 51 -28 -171 -57 -93 -50 37 -222 23 238 169 -37 44 -27 140 76 184 3
4484 3 -216 -90 -107 4 69 184 106 -163 -20 201 -41 -223 -37 242 -16 75 -58 113 16 45 180 143 228
4507 228 135 59 -58 -46 -49 123 150 -29 122 266 -121 -197 -72 -174 -223 -96 -65 75 -169 -96 114 128 55 54 131
4532 131 -55 110 143 -5 -26 12 -145 -62 -62 -287 162 -160 -166 53 6 34 39 81 250 25 -83 125 102 42 -119
4557 -119 4 -66 140 -15 14 -39 15 111 -91 -26 -44 83 -84 63 37 216 208 180 118 53 14 184 185 159 -179 -36
4583 -36 -50 98 -206 3 -84 118 30 -33 -250 -35 72 -97 190 150 -183 123 63 245 -167 30 -49 12 -108
4606 -108 -2 153 -94 -140 -110 -8 181 35 314 -131 26 104 -122 -86 82 58 22 136 82 -72 -7 103 -197
4629 -197 -78 45 68 169 -84 -247 -40 38 -26 -176 83 188 -96 -264 -19 115 47 -207 66 -86 -83 -137
4651 -137 -8 -27 62 196 206 104 145 -160 22 -11 -116 118 170 62 94 8 19 -94 -33 175 10 153 -49
4674 -49 -26 -171 18 -24 119 -212 -50 -63 143 67 -152 -265 59 27 144 -51 156 -95 102 -88 21 -3
4696 -3 174 -118 19 -58 -239 -75 -122 -16 -74 99 -127 -101 -92 -4 -74 126 -4 266 51 -88 -51 230 19 -98
4720 -98 95 39 -75 -3 -69 -137 39 193 249 204 150 54 -120 -115 166 346 147 -49 -60 35 -132 20 54 -30 -47
4745 -47 59 -108 -94 -66 69 -103 71 112 147 -100 -67 -38 -22 -113 -53 -1 75 -85 -75 98 -128 -74 37 -45 84
4770 84 103 99 81 63 -128 128 49 -26 48 160 -31 0 -114 -47 -48 -21 18 19 -157 -83 -94 -71 61 113 -38 -5 8 -36
4798 -36 56 -94 166 -24 162 -51 58 80 -6 80 15 -154 95 -58 -117 -143 113 -165 -66 41 46 -69 -168 -60
4822 -60 21 110 112 191 -7 -139 -98 36 -158 -63 88 -22 -57 113 -17 -98 -53 44 88 24 25 234 -21 97 -56
4847 -56 -9 -149 -24 166 170 -39 57 33 -166 56 103 -27 60 100 8 -23 238 74 -85 -65 98 70 82 21 -31
4872 -31 -7 -170 4 151 -91 -79 -33 106 33 -79 -81 43 94 188 191 -9 -75 -119 249 -27 145 266 -208 -14
4896 -14 258 -40 -109 -44 -169 -63 -113 -119 70 142 102 146 152 247 45 146 10 -119 157 -169 -12 26 166 34
4920 34 28 -39 -82 -91 20 140 -133 129 -152 50 -83 86 203 64 258 -61 84 193 70 -13 172 -109 -71
4943 -71 -168 128 -63 -22 -69 -107 -11 -96 -92 97 -154 -209 -73 -40 -38 -104 133 35 -34 -229 -58 139 61 54 30 -144 6
4970 6 25 237 85 122 120 -42 -34 85 158 15 -70 16 -14 98 78 30 12 33 -147 52 -1 -162 -21 127 -103 -1
4996 -1 117 237 -38 142 -23 -168 17 -32 13 304 -98 118 -186 -96 114 -4 47 119 88 -96 -112 -130 -93 -142
5020 -142 116 -190 17 111 46 -70 103 -120 153 -95 56 -83 -13 305 -14 172 -7 -14 86 -246 96 31
5042 31 25 89 -86 96 141 -2 -84 185 -54 124 152 -131 -162 23 -232 204 13 25 158 -67 49 11 18 -2
5066 -2 113 76 -36 27 -55 222 -24 -73 81 -22 123 -43 -24 -80 -159 -92 150 -245 57 -19 210 62 99 68
5090 68 -14 68 44 -39 -51 -212 -85 37 96 -80 -73 -83 217 100 103 119 -1 -68 138 81 -198 1 31 44 -188 -3
5116 -3 -72 112 -182 -117 -127 -26 -4 -141 80 75 -1 89 -194 -57 -132 183 -104 133 251 253 29 -85 56 -34 -21
5141 -21 47 -35 74 -3 68 -70 55 -52 -106 -122 45 156 153 124 -193 -88 -6 206 -21 -151 135 -156 -325 211
5165 211 -27 10 -79 -163 37 -49 -102 -201 -11 218 181 -81 -42 55 13 -182 -159 17 152 29 136 -86 73 106
5189 106 -105 -363 -21 59 -41 -115 -106 -45 36 -59 94 -36 107 71 -110 144 64 -36 41 -317 23 61 -140 -128
5213 -128 -126 -106 -188 51 51 -79 135 229 -8 -103 -207 -213 74 -7 131 -25 -172 -49 4 -165 25 135 -197 -81
5237 -81 95 -55 32 -44 173 -110 86 27 78 4 9 27 95 -61 -83 71 -174 114 -54 11 200 40 -69 17
5261 17 -33 -59 -164 -13 89 39 -355 -37 -98 121 77 -76 -236 6 -112 -73 -18 -79 63 154 90 120 167 168 133
5286 133 46 186 54 -98 96 34 -90 -13 62 -29 108 -131 -5 -37 -67 27 -179 -93 58 -50 -54 -52 -288 -61
5310 -61 188 180 24 43 -49 44 -12 73 -73 19 90 -48 2 -92 6 -245 -139 79 -35 -107 159 -110 233 198 60
5335 60 43 -24 -171 -143 35 -31 86 223 -20 223 -4 -36 -58 -60 79 -106 -183 48 155 -103 236 157 179 64
5359 64 -177 65 122 -46 253 -289 64 -138 -136 5 -193 54 -242 14 -22 33 68 18 -38 -134 54 208 66
5382 66 -96 21 259 -40 5 -122 -54 159 86 -21 78 -26 89 -43 -250 -78 62 28 20 81 189 -70 -7
5405 -7 -53 152 45 97 -31 -143 -164 -171 -19 20 -77 -227 103 -36 169 155 -51 -42 -139 225 -165 117 -25 -34 -42 40
5431 40 -61 22 -9 0 -35 -10 128 -146 67 -90 -280 57 -107 184 49 176 108 181 -35 -101 -28 124 90 4
5455 4 219 -59 59 -147 -100 -45 -90 -81 114 188 186 19 142 -89 142 -23 -92 -77 -139 -66 -20 191 -375 -26 -67
5480 -67 -4 -208 0 177 -69 -119 -215 -258 -89 149 113 -43 -1 -10 -7 -132 -16 -19 41 84 -76 80 -99 -201 71
5505 71 46 -58 25 8 43 -30 120 101 364 262 51 70 41 -73 -125 -17 89 -43 -47 -11 -45 -96 -134 39 139
5530 139 17 85 48 -1 -41 -44 -128 3 -5 78 149 50 11 -13 -259 -145 -6 -27 98 -23 19 109 64 27 123 7 69
5557 69 59 178 -43 -27 -192 131 70 84 155 58 22 49 -75 -27 128 -62 26 -17 -94 -26 -7 -19 -13 -28 -2 20 3
5584 3 110 18 -94 -11 207 -2 -89 77 240 -40 -77 9 -77 -141 -34 -44 154 144 188 24 298 192 -102 131
5608 131 18 -104 -100 7 106 -12 172 -128 -116 -75 -51 -25 16 84 149 53 10 70 223 95 -131 -145 12 -157 -34
5633 -34 -7 -102 -127 109 -126 177 91 -9 -121 -130 55 22 45 -63 113 315 147 101 -149 257 130 12 -20 -121
5657 -121 61 -253 55 158 83 -237 -236 95 -24 -119 121 122 0 241 62 100 -8 86 -51 232 -15 49 -45
5680 -45 -45 -23 -130 45 -29 176 -76 -91 -210 -54 92 45 -72 38 46 -10 -24 47 52 -5 -107 -55 191 94 -38 47
5706 47 -259 83 -161 65 -181 21 162 14 228 -126 110 -62 -91 151 186 110 130 60 -147 20 -31 -142
5728 -142 -2 -246 32 -37 67 -27 87 46 -9 -230 76 130 26 -2 -42 -14 1 3 89 159 15 48 119 345 44
5753 44 -47 47 175 -68 55 60 189 23 261 -52 21 -107 -66 32 29 -150 -210 92 31 70 61 55 60 -85 315 237 -86
5780 -86 11 190 -59 61 73 -10 -32 -48 -170 -118 -71 24 65 -46 187 26 -110 199 19 -27 119 -45 -42 -10 29
5805 29 71 -106 -101 38 -127 7 223 169 -116 -285 -239 -1 -151 -194 -173 12 122 -79 331 91 -185 -68 169
5828 169 43 14 52 -61 -81 -41 -185 51 -73 -53 -53 85 -177 -98 37 13 -117 -91 63 -17 -66 -29 18 -136 -142
5853 -142 -79 0 41 -174 2 -73 -76 65 -17 -170 -38 86 -2 193 145 -46 1 19 110 -7 51 69 32 -110 -12
5878 -12 -130 17 -74 -241 -37 -39 -147 52 39 178 11 -129 14 104 140 20 38 -2 -116 -295 69 3 65 -23
5902 -23 -65 -15 -177 80 49 -44 -282 -109 16 75 87 131 202 -116 77 85 -85 -113 6 -104 117 -50 -55 -59 -19 -15
5928 -15 63 -232 -85 152 -51 -57 133 -92 192 161 -27 93 27 -19 82 -9 41 -38 265 -66 -115 22 -16 14
5952 14 181 113 -64 178 217 -60 32 -221 75 16 -32 172 -7 108 62 -81 24 59 100 -101 -311 -148 52
5975 52 -47 165 -169 -127 -37 123 218 -145 -190 21 135 111 -91 -28 139 -315 6 -190 16 88 -63 75 67 57
5999 57 -51 -156 -37 179 -102 53 112 -101 28 -194 60 66 -43 97 27 -107 -141 -39 50 -66 -88 -136 123
6022 123 -128 -61 95 152 146 36 -48 -108 34 31 -42 -210 -21 -116 78 135 -15 134 11 -1 56 23 110 12 96 53
6048 53 -98 23 -104 -80 181 30 -97 -115 -106 8 -16 -99 -113 -78 8 5 -132 -6 -79 -195 21 44 -126 -17 -22
6073 -22 17 -14 -155 210 -13 -201 -258 -10 -27 -248 180 10 -189 34 -90 -94 120 175 51 -6 -50 -59 -131 -1
6097 -1 98 -32 65 -4 -79 58 105 21 9 -145 177 94 -268 174 255 -198 -40 -171 89 15 -189 -70 12 -88
6121 -88 244 52 -99 128 13 -132 -102 122 -188 -136 -170 135 -27 -193 -84 24 412 -14 72 -7 143 4
6143 4 279 -143 -3 -94 -130 -15 124 -173 -72 -145 -27 33 -174 132 168 82 -218 73 286 -80 43 108 -107
6166 -107 235 41 115 -11 -76 18 -60 82 -83 180 -52 -32 -43 179 148 -146 -10 92 193 18 55 -44 41
6189 41 156 -12 -123 -87 -274 -95 92 247 -19 -56 -136 7 -59 -42 191 -42 77 -14 89 -88 -14 123 -54
6212 -54 -208 54 -60 -7 -103 -145 73 -32 -85 -154 45 12 2 -7 -98 126 -92 226 161 205 -126 45 156 221 -171
6237 -171 -262 -28 -78 43 -26 -22 108 118 -143 28 -112 118 -62 -86 -151 -105 -24 -15 39 215 159 96 -64 -84 -84 -3
6263 -3 -104 -66 -134 -52 -46 -48 126 245 233 -30 102 -118 70 4 15 -36 -145 -158 53 52 -101 -156 -258 -46 -169 -34
6289 -34 30 94 52 -57 144 112 126 22 126 163 -50 -103 55 104 59 -42 76 -159 -16 -98 -16 17 41 -104 151
6314 151 99 134 52 -59 39 19 51 -215 86 -173 79 -53 -100 57 46 -14 -45 103 165 6 -200 -65 99 16
6338 16 14 129 -112 84 271 -90 138 -55 -108 -33 -203 80 -81 -27 -88 115 120 -40 -127 -111 41 26 101 59 -202
6363 -202 235 48 25 60 115 -100 -39 -22 -146 -33 -104 -9 -43 39 -97 -79 118 -304 -4 -42 37 -219 -36 104
6387 104 1 38 214 106 129 -119 -134 39 51 -12 94 -51 48 -134 -19 18 -65 -44 9 65 -30 40 165 176 -32
6412 -32 -8 -68 -61 -180 -126 -99 135 -76 -149 -75 -55 -9 -3 -1 78 25 -18 -33 -105 383 30 284 -180 -32 21 57 112 174
6440 174 177 -49 -103 243 -72 -217 68 184 186 -80 231 149 77 146 119 341 9 -175 53 -57 -106 41 1 44
6464 44 -135 73 -137 33 240 -45 -73 49 -155 -37 -193 34 -60 39 65 -99 237 7 -28 -117 -98 62 134
6487 134 59 -41 -93 22 275 62 70 -2 -30 194 51 -194 97 117 -24 248 78 57 -42 -96 -259 -39 27 -112
6511 -112 -184 -217 -51 164 -34 -164 12 -141 -65 -36 -46 15 139 185 50 55 62 -145 -40 -98 50 -53 -138 -1
6535 -1 38 -65 81 -171 -81 -22 -86 -25 234 -106 -28 163 -24 -83 -125 -185 -91 -80 -184 -144 -61 91 -56 141 -98
6560 -98 197 -9 -60 67 185 -55 -19 -99 60 87 -116 160 -2 -116 135 -173 46 14 -49 -65 -85 129 -39
6583 -39 114 169 194 322 169 81 -67 -72 20 -31 54 42 -32 46 -2 -187 -167 10 80 -270 17 96 201 170 35 -68
6609 -68 -138 218 -40 137 169 -186 -105 -334 -109 -30 -58 37 12 -155 120 81 -29 -55 131 213 38 116 122 34 32 -127
6635 -127 37 -40 -251 -44 -141 131 153 -31 13 52 29 141 163 142 87 -163 60 180 -114 -74 -87 19 -28 -186
6659 -186 60 35 -257 -192 30 -115 -64 -10 243 28 5 161 8 234 -120 -69 2 185 34 -78 112 28 -143
6682 -143 -98 64 -147 -315 106 214 47 -405 -50 -379 161 105 -87 -171 139 -183 228 513 274 -223 -144
6703 -144 486 -344 503 259 256 167 -171 166 -363 259 469 -504 93 13 298 176 127 -421 -393 -95 -322 -547
6725 -547 -267 81 128 314 -345 104 146 342 144 149 350 182 415 42 88 353 53 268 144 -178 465 -39
6747 -39 397 -247 474 -456 -336 -24 -261 -793 793 -270 -188 421 50 -213 -285 -273 -85 -147 -8 425 683
6768 683 155 -436 269 -251 -157 -602 -814 131 164 -443 84 -451 -320 -468 -3 678 266 -330 -403 -158 -155 530
6790 530 212 -284 -529 121 63 -289 245 440 -357 -524 384 -144 133 92 71 -370 -267 -177 139 -234 -209 683
6812 683 -434 -83 -763 41 299 68 -19 -31 -80 264 -72 146 -183 -370 -267 -103 306 -99 -211 -90 -335
6833 -335 -260 63 329 -118 256 -333 -68 508 -84 93 -509 -171 -62 34 -86 -2 -47 -121 440 386 -104 235
6855 235 -70 -408 -97 27 570 374 -172 -15 14 -199 238 -170 -121 -27 178 76 -183 77 -53 53 28
6876 28 4 -139 114 -152 54 33 -102 45 175 -207 20 14 0 56 -55 -303 20 32 103 -7 34 68 144 321
6900 321 146 10 173 -116 182 152 -42 -63 -147 20 -34 -141 -124 320 -78 -74 -104 27 57 18 -12 37 54 -66
6924 -66 66 -105 -14 -120 80 30 -251 41 46 -139 -141 27 123 129 75 116 -63 192 -12 77 76 -63 10 -61 -28 67
6950 67 162 41 -23 127 59 197 -241 -87 -67 60 142 64 32 225 -257 -141 -152 70 -191 -3 -1 -35 -67 -9 58
6975 58 28 116 30 46 197 36 8 56 48 182 140 194 104 80 -68 -13 101 -120 220 87 -251 -158 -42 -13 129
7000 129 -44 -34 -168 72 -38 -134 92 -62 -43 -101 164 -63 -25 -38 -72 69 45 -232 140 -62 25 -181 60
7023 60 -108 71 -71 -75 49 46 31 -186 -44 -4 6 107 30 -20 -218 -120 15 53 17 -284 -58 -24 -93 -34 12 -125
7049 -125 -116 102 212 -81 42 34 226 105 23 -11 215 79 -114 -94 6 2 -36 13 -11 -127 121 -71 -55 74
7073 74 133 -15 -57 59 -28 96 97 -70 -58 -57 226 -126 65 -37 -156 146 -29 -126 45 3 14 -15 -37 39 -148
7098 -148 177 -151 -44 25 180 -24 71 26 171 140 -43 80 -99 14 -159 -185 -25 58 -63 -89 -99 -38 -30 179
7122 179 107 -217 -88 19 -161 -88 51 160 -202 17 61 -61 -96 -147 -169 34 42 20 -40 -70 54 26 -38 -134 -6
7147 -6 29 149 -198 -345 189 -65 12 24 206 32 -67 -18 111 89 -174 137 174 -26 -93 -45 215 -109 54 270
7171 270 -37 19 -165 37 28 -71 118 78 17 -23 -14 68 -24 114 -107 -22 145 76 -122 25 115 -81 -22 -6 138
7196 138 8 74 -58 61 83 -209 171 96 -127 -45 -21 18 -224 6 1 91 138 87 -62 -35 18 -262 7 -164
7220 -164 -23 -157 115 -177 -165 -156 83 40 100 117 41 -96 -80 -23 -124 88 107 32 -73 127 36 -16 -61 -148 32
7245 32 -70 -3 -62 -248 -56 -51 -208 178 125 -68 -122 146 26 152 -40 -181 -63 -25 -67 237 -14 70 119 -108
7269 -108 -186 -208 132 115 22 -9 -44 -143 30 155 88 21 17 -30 -11 123 50 97 288 181 -17 116 -9 -6 123 13
7295 13 -68 -314 95 44 -58 -70 246 2 -25 64 -134 -44 15 -69 -115 -3 -72 68 18 3 -77 -109 194 -118 -35
7320 -35 54 -24 209 32 172 49 28 64 -200 -102 -103 -88 80 -68 -238 78 22 87 -212 64 114 -27 -223 -173
7344 -173 -149 24 -114 -170 190 -131 -10 -68 -121 -172 -159 -104 245 -117 -146 192 5 87 -185 -83 -69 13 -167 -45
7368 -45 -17 76 -71 -311 -18 -114 10 28 -110 -300 52 -171 201 -78 -62 -61 14 -100 198 -92 48 6 -135
7391 -135 83 36 35 -69 17 54 76 2 26 138 46 27 -186 -36 -51 129 107 76 -63 52 10 -14 84 86 -51 71
7417 71 131 12 -45 2 -82 130 117 20 64 -58 -131 -244 73 15 98 110 -102 15 62 -111 172 -39 47 -202 242
7442 242 -143 -207 -123 -38 -160 119 -176 65 20 26 147 65 241 -237 136 106 -41 -5 -53 8 -46 9 18 85 -109
7467 -109 -3 -11 85 -224 -15 -261 -42 139 -165 178 -140 -44 125 -122 158 -20 27 11 6 108 -222 -105 -12
7490 -12 -40 -64 -10 -108 -43 -135 -224 40 -46 -111 100 71 -82 3 255 50 -213 45 8 -33 -130 -16 -197 -85 -22
7515 -22 39 -19 121 -116 108 -36 -114 -26 -232 -58 -114 93 133 151 -46 -59 53 44 -79 -40 -23 -108 -24 62 -101
7540 -101 -10 -48 81 117 -120 155 -14 -15 -88 -65 106 -38 -187 8 71 -253 183 31 -28 67 56 208 -79 130
7564 130 102 123 183 -77 -184 -225 39 -19 -102 17 -68 -102 116 40 -114 55 -49 -89 -34 -5 78 57 39 -32 10 -52
7590 -52 -5 84 -91 195 -194 -11 -178 181 -223 -58 -126 6 -187 -79 126 -7 -52 32 178 142 110 -53 -43
7613 -43 -104 -5 11 96 -6 -166 -103 -110 -102 -186 121 -92 50 147 161 13 109 -43 156 -27 -82 248 -78 133 30
7638 30 -97 134 -64 -142 0 -79 -105 -213 56 225 -13 -58 74 30 -104 -52 24 50 -175 7 -45 -38 133 -17
7662 -17 61 -39 -4 -101 114 -68 -175 -185 -63 234 -109 -45 55 -135 34 218 -124 38 -86 52 75 78 -47
7685 -47 -24 181 -43 138 -187 164 70 -231 -269 -95 46 105 -52 -12 126 190 85 240 14 3 -23 91 -95
7708 -95 -165 70 24 0 24 -231 -88 -78 -140 -1 -24 44 55 97 135 -92 141 379 234 216 -10 30 54 139 -33
7733 -33 164 -182 -68 -67 99 -288 160 226 123 -133 -136 -23 -33 -161 -28 -29 45 124 196 -62 -72 45 -34 -59 -145
7758 -145 14 241 -48 23 -226 -58 -122 147 -15 73 108 -9 7 23 -24 133 -8 27 -37 36 14 56 -1 -92 -173
7783 -173 -219 17 -129 22 121 81 -85 58 -6 39 -18 234 -125 0 24 29 -1 -143 151 71 19 20 142 -25 122
7808 122 120 -80 124 26 53 -68 23 72 -16 -57 175 -8 33 151 -217 -248 -310 36 -144 101 181 -230 -31 150
7832 150 -285 127 94 17 141 -116 -24 -115 305 77 200 119 -103 5 -91 -118 -28 -9 -37 -12 63 -141 -188 -93 -62
7857 -62 -51 221 -54 83 -121 122 227 130 69 -16 -45 -16 47 -40 -111 -26 67 -17 12 79 26 -14 73 -62 -56 -49 95
7884 95 -72 63 -146 34 -134 -74 -185 -54 -75 1 203 54 194 -91 -170 120 174 92 82 -61 45 138 92
7907 92 -61 -146 2 6 8 178 101 -125 -51 -5 -166 -217 -63 -43 -2 28 -65 48 78 48 93 85 -24 38 11 18 -73 -102
7935 -102 31 27 109 -209 -199 -32 76 -124 143 187 48 95 119 35 -178 -67 170 -10 84 -84 18 0 113
7958 113 -24 -110 -107 -53 122 -155 143 -193 -206 108 55 -208 -169 -209 56 356 36 -178 13 -85 -19 11 -77 134
7982 134 81 137 -42 75 -143 98 -42 171 34 113 239 199 54 -119 -120 -187 -113 109 97 94 89 -85 -57 37 -45
8007 -45 92 18 14 -133 127 174 -36 -5 220 89 14 22 18 -166 64 47 -131 -27 -133 -78 -30 86 61 140 -163
8032 -163 67 -87 52 -73 -33 -181 27 -134 -3 -36 -86 82 -134 55 32 -114 -201 -108 -95 47 -94 -25 -121
8055 -121 -67 -71 -49 1 -238 -106 -14 26 -185 -235 -78 -98 -27 140 53 46 71 -208 -119 1 53 -110 -22 -92 -82 -177 289
8082 289 73 121 -63 199 -46 214 -60 -58 72 -137 89 -72 15 -37 -18 -32 14 108 127 105 9 -54 -51 206 -74
8107 -74 221 -353 45 97 174 171 243 123 -85 -51 -30 -18 -180 110 114 -62 135 -90 226 99 -81 32 42 -35
8131 -35 58 25 71 0 7 -31 -128 -96 110 79 204 44 75 -27 -10 4 -35 -57 58 -71 166 83 -23 26 120 -104
8157 -104 -112 -16 -164 -154 -183 46 -160 -13 -77 40 37 -74 136 -131 189 20 -19 138 -15 54 -136 104 156 78
8181 78 166 44 59 167 40 -106 56 -120 -99 -117
8191a17
##END NTUPLES=NMR FID
##END=
