##TITLE=1H_Ser AmONEA
 200.13Hz, CD3OD
 8 sc
31.8.7.2026
##JCAMPDX= 6.0         $$ Bruker NMR JCAMP-DX V2.0
##DATA TYPE= NMR FID
##DATA CLASS= NTUPLES
##ORIGIN= UXNMR, Bruker Analytische Messtechnik GmbH
##OWNER= pz
$$ XWIN-NMR		Version 3.5
$$ Fri Jul 31 14:23:07 2026 Russian Standard Time (UT+4h)  she@DPX200
##.OBSERVE FREQUENCY= 200.1313
##.OBSERVE NUCLEUS= ^1H
##.DELAY= (6, 6)
##.ACQUISITION MODE= SIMULTANEOUS
##.ACQUISITION SCHEME= undefined
##.AVERAGES= 8
##.DIGITISER RES= 18
##SPECTROMETER/DATA SYSTEM= spect
##.PULSE SEQUENCE= zg30
##.SOLVENT NAME= MeOD
##.SHIFT REFERENCE= (INTERNAL, MeOD, 0, 14.3821)
##AUDIT TRAIL= $$ (NUMBER, WHEN, WHO, WHERE, WHAT)
$$ ##TITLE= Audit trail, XWIN-NMR		Version 3.5
$$ ##JCAMPDX= 5.01
$$ ##ORIGIN= Bruker BioSpin GmbH
$$ ##OWNER= she
$$ F:/spectra/data/she/nmr/H-C/1/audita.txt
$$ ##AUDIT TRAIL=  $$ (NUMBER, WHEN, WHO, WHERE, WHAT)
(   1,<2026-07-31 14:21:14.90 +0400>,<she>,<DPX200>,
      <created by zg, POWCHK disabled, PULCHK disabled
       configuration hash MD5:
       00 E9 B6 7A A2 85 ED C7 34 08 36 98 17 FE 4E 26
       data hash MD5: 16K
       87 55 D5 29 C1 EE 25 F6 AF CA 2A 75 97 81 D3 52>)
$$ ##END=
$$ 
$$ hash MD5
$$ 78 30 34 7D A6 AE 0D E4 32 8F 10 A6 6F FD D7 4E
##$RELAX= 
##$RELAX= 
##$RELAX= 
##$RELAX= 
##$RELAX= 
##$RELAX= 
$$ Bruker specific parameters
$$ --------------------------
##$DU= <F:/spectra>
##$EXPNO= 1
##$NAME= <H-C>
##$PROCNO= 1
##$TYPE= <nmr>
##$USER= <she>
##$AMP= (0..31)
100 100 100 100 100 100 100 100 100 100 100 100 100 100 100 100 100 100 
100 100 100 100 100 100 100 100 100 100 100 100 100 100 
##$AQSEQ= 0
##$AQ_mod= 1
##$AUNM= <au_zg>
##$AUTOPOS= <>
##$BF1= 200.13
##$BF2= 200.13
##$BF3= 200.13
##$BF4= 200.13
##$BF5= 200.13
##$BF6= 200.13
##$BF7= 200.13
##$BF8= 200.13
##$BYTORDA= 1
##$CFDGTYP= 0
##$CFRGTYP= 5
##$CHEMSTR= <none>
##$CNST= (0..31)
1 1 145 1 1 1 1 1 1 1 1 1 1 1 1 1 1 1 1 1 1 1 1 1 1 1 1 1 1 1 1 1 
##$CPDPRG= <>
##$CPDPRG1= <>
##$CPDPRG2= <>
##$CPDPRG3= <>
##$CPDPRG4= <mlev>
##$CPDPRG5= <mlev>
##$CPDPRG6= <mlev>
##$CPDPRG7= <mlev>
##$CPDPRG8= <mlev>
##$CPDPRGB= <>
##$CPDPRGT= <>
##$D= (0..31)
0 0.7 0 0 0 0 0 0 0 0 0 0.03 0 0 0 0 0 0 0 0 0 0 0 0 0 0 0 0 0 0 0 0 
##$DATE= 1785493274
##$DBL= (0..7)
120 120 120 120 120 120 120 120 
##$DBP= (0..7)
150 150 150 150 150 150 150 150 
##$DBP07= 0
##$DBPNAM0= <>
##$DBPNAM1= <>
##$DBPNAM2= <>
##$DBPNAM3= <>
##$DBPNAM4= <>
##$DBPNAM5= <>
##$DBPNAM6= <>
##$DBPNAM7= <>
##$DBPOAL= (0..7)
0.5 0.5 0.5 0.5 0.5 0.5 0.5 0.5 
##$DBPOFFS= (0..7)
0 0 0 0 0 0 0 0 
##$DE= 6
##$DECBNUC= <off>
##$DECIM= 32
##$DECNUC= <off>
##$DECSTAT= 4
##$DIGMOD= 1
##$DIGTYP= 9
##$DL= (0..7)
0 120 120 120 120 120 120 120 
##$DP= (0..7)
150 150 150 150 150 150 150 150 
##$DP07= 0
##$DPNAME0= <>
##$DPNAME1= <>
##$DPNAME2= <>
##$DPNAME3= <>
##$DPNAME4= <>
##$DPNAME5= <>
##$DPNAME6= <>
##$DPNAME7= <>
##$DPOAL= (0..7)
0.5 0.5 0.5 0.5 0.5 0.5 0.5 0.5 
##$DPOFFS= (0..7)
0 0 0 0 0 0 0 0 
##$DQDMODE= 0
##$DR= 18
##$DS= 0
##$DSLIST= <SSSSSSSSSSSSSSS>
$$ [...]
##$SUBNAM0= <"">
##$SUBNAM1= <"">
##$SUBNAM2= <"">
##$SUBNAM3= <"">
##$SUBNAM4= <"">
##$SUBNAM5= <"">
##$SUBNAM6= <"">
##$SUBNAM7= <"">
##$SUBNAM8= <"">
##$SUBNAM9= <"">
##$SW= 18.0517328524113
##$SWIBOX= (0..15)
0 0 2 0 0 0 0 0 0 0 0 0 0 0 0 0 
##$SW_h= 3612.71676300578
##$TD= 16384
##$TD0= 1
##$TE= 0
##$TE2= 300
##$TE3= 300
##$TEG= 300
##$TL= (0..7)
0 120 120 120 120 120 120 120 
##$TP= (0..7)
150 150 150 150 150 150 150 150 
##$TP07= 0
##$TPNAME0= <>
##$TPNAME1= <>
##$TPNAME2= <>
##$TPNAME3= <>
##$TPNAME4= <>
##$TPNAME5= <>
##$TPNAME6= <>
##$TPNAME7= <>
##$TPOAL= (0..7)
0.5 0.5 0.5 0.5 0.5 0.5 0.5 0.5 
##$TPOFFS= (0..7)
0 0 0 0 0 0 0 0 
##$TUNHIN= 0
##$TUNHOUT= 0
##$TUNXOUT= 0
##$USERA1= <user>
##$USERA2= <user>
##$USERA3= <user>
##$USERA4= <user>
##$USERA5= <user>
##$V9= 5
##$VALIST= <valist>
##$VCLIST= <CCCCCCCCCCCCCCC>
##$VD= 0
##$VDLIST= <DDDDDDDDDDDDDDD>
##$VPLIST= <PPPPPPPPPPPPPPP>
##$VTLIST= <TTTTTTTTTTTTTTT>
##$WBST= 1024
##$WBSW= 4
##$XGAIN= (0..3)
0 0 0 0 
##$XL= 0
##$YL= 0
##$YMAX_a= 755128
##$YMIN_a= -593918
##$ZGOPTNS= <>
##$ZL1= 120
##$ZL2= 120
##$ZL3= 120
##$ZL4= 120
##$ABSF1= 10
##$ABSF2= 0
##$ABSG= 5
##$ABSL= 3
##$ALPHA= 0
##$AQORDER= 0
##$ASSFAC= 0
##$ASSFACI= 0
##$ASSFACX= 0
##$ASSWID= 0
##$AUNMP= <proc_1d>
##$AZFE= 0.1
##$AZFW= 0.1
##$BCFW= 1
##$BC_mod= 2
##$BYTORDP= 1
##$COROFFS= 0
##$CY= -3
##$DATMOD= 1
##$DC= 2
##$DFILT= <>
##$DTYPP= 0
##$F1P= 0
##$F2P= 0
##$FCOR= 0.5
##$FTSIZE= 0
##$FT_mod= 4
##$GAMMA= 1
##$GB= 0.15
##$INTBC= 1
##$INTSCL= 1
##$ISEN= 128
##$LB= 0.25
##$LEV0= 0
##$LPBIN= 0
##$MAXI= 10000
##$MC2= 0
##$MEAN= 0
##$ME_mod= 0
##$MI= 1.114404
##$NCOEF= 0
##$NC_proc= 0
##$NLEV= 6
##$NOISF1= 3.799351
##$NOISF2= 2.8
##$NSP= 1
##$NTH_PI= 0
##$NZP= 0
##$OFFSET= 14.38212
##$PC= 1
##$PHC0= -4218.828
##$PHC1= 5.792303
##$PH_mod= 1
##$PKNL= yes
##$PPARMOD= 0
##$PSCAL= 0
##$PSIGN= 0
##$REVERSE= no
##$SF= 200.129724274929
##$SI= 16384
##$SIGF1= 3
##$SIGF2= 2
##$SINO= 400
##$SIOLD= 16384
##$SREGLST= <1H.CDCl3>
##$SSB= 0
##$STSI= 0
##$STSR= 0
##$SW_p= 3205.1282051282
##$SYMM= 0
##$S_DEV= 0
##$TDeff= 0
##$TDoff= 0
##$TI= <>
##$TILT= no
##$TM1= 0
##$TM2= 0
##$TOPLEV= 0
##$USERP1= <user>
##$USERP2= <user>
##$USERP3= <user>
##$USERP4= <user>
##$USERP5= <user>
##$WDW= 1
##$XDIM= 8192
##$YMAX_p= 0
##$YMIN_p= 0
$$ End of Bruker specific parameters
$$ ---------------------------------
##NTUPLES= NMR FID
##VAR_NAME=  TIME,          FID/REAL,        FID/IMAG
##SYMBOL=    X,             R,               I
##VAR_TYPE=  INDEPENDENT,   DEPENDENT,       DEPENDENT
##VAR_FORM=  AFFN,          ASDF,            ASDF
##VAR_DIM=   8192,          8192,            8192
##UNITS=     SECONDS,       ARBITRARY UNITS, ARBITRARY UNITS
##FACTOR=    0.0002768,     1,               1
##FIRST=     0,             0,               0
##LAST=      2.2672688,     0,               0
##MIN=       0,             -593918,         0
##MAX=       2.2672688,     755128,          0
$$ Real data points
##PAGE= N=1
##DATA TABLE= (X++(R..R)), XYDATA
0@%%%%%%%%%%%%%%Qj6J6j6K2l0L3m1M9n8P3q5J00j16J32j50J73k03K29k60K97
35A57l31L71m18M70n23N82o50P21q00Q86r81J084j195J321j454J602j766J945
53A021k144K363k614K895l214L581m006M512n118N862o798Q025r716J2194j6222
68i379K4092o3848K93016K94219l3805j3338o3681k15475l60782k88071j53293
79e90345J5537J79368L16816L00156J98031R8385J6045j56032l19270l15549j62087
90d18945o2208q935J25469L04572L28426J92692L8122o9440j72976k38987k31569
101b13779j85464j17756L6340K35579L10761K17293J09035N2688l6346j75896
111B32455k57368k42064j73026n1288J17944K35487K28780J64681J28198P0061
$$ y = [0, 0, 0, 0, 0, 0, 0, 0, 0, 0, 0, 0, 0, 0, 0, 8, -8, 8, -8, 14, -16, 17, -24, 25, -33, 40, -45, 55, -61, 71, -79, 94, -109, 120, -140, 157, -174, 197, -221, 249, -274, 308, -342, 379, -421, 465, -516, 568, -627, 694, -760, 842, -924, 1021, -1123, 1240, -1374, 1521, -1693, 1888, -2118, 2394, -2724, 3138, -3660, 4365, -5351, 6843, -9379, 14713, -49135, 243881, 538100, 504295, 490957, 427276, 211801, -148981, -437052, -590345, -574808, -395440, -78624, 221532, 419563, 517948, 533993, 377961, 58691, -256858, -418945, -481153, -490088, -364619, -60047, 268379, 461071, 499193, 429753, 256777, 17790, -213779, -399243, -516999, -480659, -245080, 65681, 282974, 392009, 444697, 408351, 232455, -24913, -266977, -440003, -491291, -373347, -137860, 90920, 255601, 383799, 453860]
121D53860p9581k32416k52701j77485j15383l5778J19988K41738K15031J29937
131B67210R9244M6354j01978k31657k24570j48996r2249o032J38195K28272J87293
142A61086J08903P4631J9372j05884k08289k11772j53980o9914N0271J60659J82635
153G718J40030J12794R0561j468j41873k18732j87526j12504l6033N6855J44782
164a45396J70569J44562J15545O3316m7702j60782j91988j54836r8537k1570P7593
175b49226J46886J55390J36416J05563L1029p9425j57427j67915j39257q4351
185c02317O721R8456J35829J28640J23504J03888J9117j05949j74851j52500r6172
196b15634m9240P031P8844J29418J41096J28264P5410k4751j18366j46315j25598
$$ y = [453860, 374279, 141863, -110838, -288323, -403706, -439484, -319496, -77758, 137273, 267210, 366454, 412808, 310830, 79173, -145397, -294393, -386642, -392674, -254479, -26207, 161086, 269989, 344620, 363992, 258108, 49819, -161953, -315933, -385847, -335576, -174917, 7718, 147748, 260542, 351103, 349635, 207762, -10970, -198496, -311000, -347033, -290178, -145396, 25173, 169735, 285280, 348596, 300894, 140112, -51876, -206712, -305249, -326819, -249226, -102340, 53050, 189466, 295029, 326058, 246633, 89206, -78709, -217966, -302317, -295596, -197140, -61311, 67329, 190833, 294721, 313838, 207889, 33038, -119462, -215634, -264874, -257843, -178999, -49581, 91515, 219779, 295189, 270438, 152072, 5757, -119841]
207a19841r5721m7536K7335R2820J22045J30289J19245N8457m5427j27017j41333
218b6684j11732p4757k9554L1471Q9661J24860J33858J05815K6728p1050j25978
229G2638j19630r2759o9556k5530M3879J02728J26232J19327P8733K133p6118
240A62077j12008j09681r1591n8106l402N3464R4924J19676J15244O2648k2180
251B11065q6366j00652q9274p9880n9007m793O6223J12092J17911Q8762L4145
262B10226k9622p4473r0062r2124q3307m6159J7273P5597J07177J09080P7174
273A80780J6483m2255p1830q2203q8444p9183l4380L2041Q5497J07363R5023N5690
285A74582K396m3188o8459q0267q5221o9835k0430M4876R1180J00905P9247L8549
$$ y = [-119841, -215562, -263098, -235763, -142943, -20898, 109391, 228636, 287093, 241666, 114649, -26684, -138416, -213173, -242727, -211256, -121595, 3265, 137123, 242938, 269666, 198616, 72638, -46992, -139751, -209307, -234837, -190958, -88230, 38002, 157329, 236062, 238195, 162077, 50069, -59612, -151203, -209309, -212711, -159247, -64323, 55353, 170597, 233245, 211065, 124699, 24047, -65227, -145107, -204114, -208907, -142684, -30592, 87319, 176081, 210226, 180604, 106131, 16069, -76055, -159362, -205521, -188248, -112651, -5474, 103606, 180780, 197263, 155008, 83178, 975, -87469, -166652, -201032, -168991, -83494, 23869, 118892, 174582, 176978, 133790, 65331, -14936, -100157, -169992, -190422, -145546, -54366, 46539, 125786, 164335]
297A64335p340m1271o2542q0490q7322n9689j86N7522Q7229Q8592O7084K9118
309A55040j0590m1202o5039q3784q1249m4346J4281O3856Q4840P8402N4387K2224
321A46820j2261m3872p0489q4850p1911k7294K8373O6749P7374O8019M6963J6018
333A39639j6523m7452p3675q3601o0030r154L8709O4030O8338N9536M0687J3179
345A33683k0091n4357p8088p5624m3677L659M1657N9831O1259N4379L7672Q716
357A29019k8199o0554p6503o5672k9908J3171M2172N4787N7322N1540L2950J222
369A21347l4949o4395p3590n4578j6045J9298M0176N0257N4713M9330K8231o420
381A13375m4447o6916o4334m0616q258J9749L8742M9632N3386M5929K0613j6309
$$ y = [164335, 156995, 115724, 53182, -27308, -114630, -174319, -174505, -116983, -29754, 58838, 125922, 155040, 144450, 103248, 38209, -45575, -126824, -171170, -156889, -93033, -8193, 70209, 124596, 146820, 134559, 90687, 20198, -64652, -136563, -163857, -135484, -68735, 8639, 76658, 123621, 139639, 123116, 75664, 1989, -81612, -141642, -150796, -112087, -48057, 20281, 79817, 120504, 133683, 113592, 59235, -18853, -94477, -138154, -134495, -92838, -33007, 28252, 82631, 120303, 129019, 100820, 40266, -36237, -101909, -131817, -118646, -76474, -21687, 35635, 87175, 120125, 121347, 86398, 22003, -51587, -106165, -122210, -102912, -62736, -12479, 42234, 91564, 119795, 113375, 68928, 2012, -62322, -102938, -111196, -91447, -52705, -3073, 50313, 96242, 116855, 100546]
393A00546m9314o3755n6412l1089j071K1301L6165M8487N3918M1824J1284k5806
405H6078n3078n8768m4424k2550p66J9641L9243N1894N0780L2809Q49l1708n1394
418A8606n1619l7498j8425J938K2446M0709N1501M6324K4000p411l4539m8865
430G167m6695l1791j2307N327K1595M1013N2110M3668J5756j6826l8974m3861
442c818l7274k6203j3694M150K8217M7372N0375L2533L439k1310l2790l6767l6983
455d2753k9452j0329J5168L5470M3515L9510K4820K791j9678l6099m0107l2649
467d9793j9514l855J4219L2606M4566M0661J9466q145k6979l1693k9221k8011
479d5693k3274o697K1250M3976M4643K6039M427p468j4860k7919l9013l4303j3562
$$ y = [100546, 51232, -12523, -68935, -100024, -101095, -79794, -43629, 4858, 58776, 100600, 111884, 86078, 33000, -25768, -70192, -92742, -93508, -73867, -34624, 17270, 68050, 100859, 101708, 70000, 18606, -33013, -70511, -88936, -86998, -64552, -23843, 27658, 73982, 97982, 90571, 56032, 7167, -39528, -71319, -83626, -78299, -56704, -15691, 36419, 80087, 95843, 79017, 40043, -3818, -41092, -67295, -80989, -76839, -48622, -1250, 49125, 81658, 85097, 63787, 30997, -5770, -42753, -72205, -82534, -67366, -31896, 11619, 51129, 75949, 78740, 59062, 22963, -17144, -49793, -69307, -73162, -58943, -26337, 18229, 58890, 78356, 70211, 43232, 11539, -17682, -45693, -68967, -75664, -54414, -10438, 34205, 60244, 64671, 57203, 42343, 14424, -24589, -58892, -72454]
492g2454J0156K6211L3365L3705K5528R738r070k4467l1893l2084k4355r607Q410
505e6817K4743L5798L5468K0564m55j4100j9769k5237l1427k8129q846J7535L3914
518a6758L2451K1660J3011M968q661k4504l2527k9709j8094m94J7700K9203K9094
531A7340K1434J2771J855j2665k7140l1730k4264j2473J338J7888L0518K9131
543B4003J6582P289P91j2618k9243l2245j9677n061N158J6158K7226K7970J6746
556D3079K806m663j2364k5323l1151j9834m89J0730J6399K2792K4187J5249L391
569D4809o241j6197k5630k7024j5583J085J3275J6532J7992K1902J9575M174j4470
582C4199k2773k2230j8785j2114q27J1435J9888K2546J9700J2040r89j4361k1928
$$ y = [-72454, -62298, -36087, -2722, 30983, 56511, 66249, 57179, 32712, 819, -31265, -55620, -65227, -56817, -32074, 3724, 39192, 59756, 59301, 45201, 25432, 195, -31232, -59361, -68207, -50672, -16758, 15693, 37353, 50364, 55332, 46671, 22167, -10360, -40069, -58163, -58657, -40957, -11754, 17340, 38774, 51545, 53400, 40735, 13595, -18135, -42399, -54872, -53534, -35646, -5128, 24003, 40585, 47874, 48665, 36047, 6804, -25441, -45118, -50179, -45021, -28863, -1637, 26333, 43079, 45885, 41222, 28858, 3535, -27616, -47450, -47939, -37209, -20810, 1982, 26169, 41418, 44809, 38568, 22371, -3259, -30283, -45866, -44781, -31506, -14974, 3018, 24920, 44495, 48669, 34199, 11426, -10804, -29589, -41703, -42530, -31095, -11207, 11339, 31039, 43079, 42090, 27729, 5801]
595E801k0205j6082j1053J409J7063K1584J5751J2624J2312K192j6210k6393k0224
608b1431r299l122J937J0884J8473J9096J4218P122l126j6736k2424j5808p460
621b7676m948K45J2889K1710J8714J0452K729m542j3461j9784j9009j0706k68
634c3655Q061J3438J7175J7488J0570O74q706j5694j8643j5105p579J226R592
647b1158J4898J5818J3523Q479j063j1325j5969j4865j1819n994K120R535J4013
660c807J5880J3318M410n892j0778j0315j1690j3497q856L290J4561J5802J1156
673A3582Q018M818j622j0406j4817j4187r706l269M593J0828J4205J4001J0308
686B6346J199p893j2156j1377j0619r136l656N445J3409J5977J2366N003k188
$$ y = [5801, -14404, -30486, -41539, -40130, -23067, -1483, 14268, 26892, 39204, 41396, 25186, -1207, -21431, -30730, -33852, -31915, -21031, -2558, 16538, 30756, 37878, 34752, 18016, -4408, -20216, -27676, -32624, -32379, -19490, 2220, 20934, 31386, 34115, 29573, 16112, -3672, -22681, -33387, -33655, -25594, -12156, 5019, 22507, 33077, 33751, 25045, 9351, -9292, -24397, -31976, -30750, -21158, -6260, 9558, 23081, 31560, 30497, 19172, 3203, -11662, -23481, -29475, -27355, -17820, -3807, 12073, 25391, 29801, 23909, 13131, 2816, -8874, -22371, -31227, -27937, -13376, 2426, 13582, 21600, 26418, 24796, 14390, -427, -14614, -24320, -27589, -22996, -12168, 2037, 16038, 26346, 27545, 19652, 7496, -3881, -14500, -23636, -27292, -21847, -8438, 7539, 19905, 24908, 22720]
699B2720p127r682j1550j1432p728Q80Q475J1632J1730J0059N599j749q345j1536
713A946j1019p812l938R19O029J0467J2209J0118L511l417p926r880j0121q711
727a7625l394K693P146R666J0912R436L515m052q335j0730j0847p513j694M362
741a6460P919J0221J0037P303K128m319r624j1867r745m680O30N040Q129R612
755D324R012N435n79n701q467r562q504m063J984O113P733Q040O699L305m73m163
771A1133p693r421p496k864J842N068P448P936O309L116m95m714p756r140p106
786a3833k885J875N820Q525Q985O197J230k761n608p329q732o652j534L633P456
801e613Q791P282L754j39l518o263p697o419l584O2L635O134P498O322K865j396
$$ y = [22720, 15593, 5911, -5639, -17071, -24799, -23919, -15444, -3812, 7918, 17977, 23576, 21827, 13482, 1946, -9073, -16885, -20823, -19904, -13875, -3408, 8801, 18919, 22430, 19013, 11087, 1207, -8914, -17625, -21019, -18326, -11180, -1514, 9398, 18834, 22349, 18297, 9962, -768, -11615, -19128, -20822, -16460, -8541, 1680, 11717, 19020, 21148, 16829, 7205, -4662, -14407, -19087, -18457, -13417, -5288, 4324, 13336, 18771, 18192, 12491, 4024, -5538, -14042, -18105, -16121, -10008, -2275, 5765, 12464, 15769, 15296, 11133, 3440, -5981, -13477, -16341, -14499, -9431, -1983, 5953, 12262, 15378, 14883, 10169, 2413, -6727, -13833, -16718, -14843, -9023, -498, 8487, 14684, 15914, 13153, 7545, 216, -8516, -15168, -16702, -13069, -5613, 3178, 10460, 14214, 14075, 10557, 4294, -3403, -9822, -13406, -13344, -9709, -3575, 3923, 10245, 13110, 11714]
817A1714m141n458n566m893l012k43K605N530P207N729K406q37l278m984o419
832c640n530k789L58L211N742P000N891L190j398n313o893o113m190j542J189
847a0827M467O557O850M369J037k771n387o224o051k887L10K944M229N287M894
862F797L384J30k645m960n729m195j892K38K305M212M624M107K416N53k186m288
878B871n294m897k220O32K508M096M840M270K545j55k384m695n811m448j565R22
894h785L196M936N518L280R76j258k660m798n313l868p31K268L622M855M424K301
910G963j71j860k771l479m680l118j41K074L335M355M134J713q04j502j863l687
926e02m543k623J7K244L210L711L561K332r8k346l127l371l284k699l29K430M105
$$ y = [11714, 7573, 2115, -3451, -8344, -11356, -11599, -8994, -3464, 3743, 9472, 11878, 11041, 7763, 2779, -3640, -9170, -11959, -11601, -8390, -2648, 4352, 10243, 13433, 12035, 6722, -171, -6284, -10474, -12016, -10827, -6360, 197, 7047, 11416, 12453, 9682, 4295, -1929, -7980, -10867, -10557, -7613, -3384, 1903, 6797, 10181, 10311, 7666, 2706, -3023, -7218, -9110, -8872, -6567, -2355, 2269, 6376, 8792, 9345, 7159, 2871, -2423, -7320, -9540, -8908, -6400, -2304, 2536, 6806, 9351, 9196, 6812, 2117, -3694, -8142, -9707, -8785, -5589, -653, 4865, 8145, 9121, 7863, 5203, 405, -4908, -8776, -9507, -7239, -3617, 1238, 5662, 7963, 7792, 5932, 3161, -318, -4998, -8116, -8257, -6183, -2848, 1507, 5641, 7354, 6550, 5048, 3185, -502, -5045, -7668, -7651, -5407, -2197, 1514, 5075, 7407, 7309, 4963, 1836, -1535, -4819, -7518, -7847, -5417, -1312]
943a312M055L204J109p31j893l224l760l433j404P89K878L702L353J708J173P17
959F931k615n164l810o74L3Q3J594L750L931J629kq79j759l374l656j531k26R80
977d759K153L750K753P33j41P57j614m821m336l46J796R75Q45K596L181K328Q8
994E938j707l298k911k067q06K08R35K095L310K693P36o01j414j857l281k756
1010d783p54J353K203K103J593J371J872M84k546l947k375J93k43m32J205K256
1026d47K964J703N66r88k189k524j598o05r03q2J954L255K019L48M86q1k184l250
1044a556j776J39k07L5J444K822K528R81k87j431k369k094q65n24m05M57K236
1061h72K754J503O74n74j823k019j032o55j308m90J560K335J759J492M57o29k131
$$ y = [-1312, 2743, 5947, 7056, 6325, 4432, 1208, -2552, -5985, -7389, -6600, -3722, -20, 3333, 5041, 6214, 6931, 4316, -848, -4658, -5332, -5299, -5216, -3622, 128, 4059, 5688, 5686, 4807, 3048, -326, -3982, -5513, -5739, -4759, -2606, 1144, 3897, 4630, 4489, 5246, 3632, -1189, -5525, -5871, -4075, -3100, -2255, 341, 3522, 5850, 5938, 4231, 933, -1978, -4045, -4851, -4643, -3708, -1613, 1697, 4390, 5126, 4525, 3111, 1254, -2027, -4783, -5537, -4184, -1981, 122, 1715, 3086, 4958, 5442, 2896, -1051, -3426, -3233, -3476, -3908, -2703, -447, 2517, 4220, 4786, 3798, 1609, -915, -2513, -3118, -4021, -4103, -2149, 1106, 3125, 3473, 3959, 3878, 1694, -1556, -3332, -3193, -3400, -3365, -1921, 901, 3429, 4410, 4123, 2692, 323, -1771, -2636, -3160, -3565, -3108, -872, 1882, 3385, 4059, 3485, 1662, -357, -1389, -2044, -3352, -3842, -2282, 53, 1812, 3304, 3761, 3132, 1001]
1078A001j600p17q90j225l63J851K835J497L37L20L1k196k063l97m12j431k12
1095c634K317K523J287N01J63j027j723q43p87j661q24Q00K202K481R77l60q6
1112B306j31j019j684j701p59k66J211K030J127Q09J031J15j584j358q31j165
1128a869j451O1J855J731J084Q80M0m75n49m54j630k031r36J250K226J200m8L72
1146A256J233L23j497j747q56j363m33J366J754K78K74J274O74o38j142o77j290
1163a211j255n61J512J689N52Q7O67Q87j78j175j587j366p47N36J564R24k47K66
1181C57J697N52j008j469r71r80l46N84Q85N73L64Q33R55j14p31j321q66r08j19
1200b033P67J129L4J37J157R90j95j140j059r73n26K94P51J22j08R47J527M65
$$ y = [1001, -599, -1316, -2206, -3431, -3794, -1943, 892, 2389, 2726, 3046, 3077, 881, -1182, -1579, -1991, -3422, -3634, -1317, 1206, 2493, 2994, 3157, 2130, 407, -436, -1223, -2884, -3708, -2908, -706, 1775, 2752, 2392, 2306, 2175, 1156, -528, -2229, -2988, -3254, -2043, -13, 1114, 1923, 2954, 3069, 1485, 127, -704, -1869, -3320, -3259, -1404, 327, 1411, 2291, 2331, 1856, 1307, 853, -777, -2808, -3744, -2494, -268, 932, 884, 1256, 2489, 2812, 1315, -432, -1288, -2651, -3084, -1718, 36, 314, 588, 1862, 2536, 1898, 756, 79, -1211, -2466, -3027, -1515, 174, 726, 813, 1480, 2367, 2189, 1014, -573, -1939, -2686, -2150, -586, 338, 91, 357, 2054, 2606, 1598, 129, -842, -1822, -2168, -1584, -699, -126, 238, 1071, 2026, 1912, 1181, -140, -1006, -1914, -2033, -1266, -137, -103, 34, 1191, 2181, 1986, 846, -213, -1186, -1712, -1418, -667, -545, -653, 294, 1821, 2286]
1218B286j058j193m99n73l68J66L57L81L83J107J120p5j257r12m49m45k58L51
1236i36K37P9N22J168J091o07j013o49n66m10K6J79J78J04R12J030P11p73j135
1255A48m59j46k55n34J7J99P15R46J190l20q41m03m13k07j016L3L31M82M73J212
1275A152M43l06o56n86k85j11o27k88J93M03Q45J180J19p98n39N2q9m63p71j89
1295a321L67N60O30R48k22n75L38p0m69q07m82m46M52Q76J021N18l91k52k26k0
1315D29m30r86m04oP72J034M62L68o15j23j43k15p69l60j31J71P51P10L55k67
1335F03j55O5j21k99m70j45r9j60L85M51L91J75l9M1J07n57m37o99J04J62K51
1356d46O02K10M40K46k2n09q63p14O1J74M39L70L33L95L10Q0l97m93q24l16Q8
$$ y = [2286, 1228, 35, -464, -1037, -1405, -1239, -882, -501, -118, 989, 2109, 2034, 777, -135, -584, -1029, -1287, -936, -699, -620, -98, 1070, 2161, 1554, 541, -108, -674, -1084, -1058, -879, -701, -597, 315, 1345, 2056, 1283, 148, -311, -457, -712, -1246, -1229, -1030, -315, 631, 1821, 1501, 660, 257, -156, -363, -1379, -1346, -1015, -533, -60, 1152, 1595, 1289, 633, 47, -238, -349, -976, -1264, -1071, -668, 177, 1357, 1476, 678, 139, 191, 102, -361, -1132, -1321, -954, -394, 236, 1184, 962, 387, 725, 655, 186, -621, -1103, -1549, -1097, -221, 800, 1318, 927, 675, 449, 429, -1, -987, -1391, -1397, -625, 409, 871, 1239, 624, 501, 358, 143, -626, -986, -1117, -946, -195, 515, 870, 603, 448, 513, 392, 93, -377, -522, -621, -781, -396, 55, 446, 621, 582, 623, 730, 173, -264, -963, -859, -697, -446, 156, 366, 806, 1052, 1030, 521, -342, -1056, -995, -821, -382, -12, 321, 716, 1026, 1106, 709, 216, -608, -924, -836]
1377h36M76N41p9J15J38Q6R0j86l04n71J0Q7J44J85M7on7M86K98R2p93m66M9j11
1401e65O3K7K35L02N83K39J4n47m92l73j51m2J7M70L12M33K20k03j17k71l33l95
1423e74j22J5N88K54J28M2R0P5k71l56j87l7J07l0M3O6J94J52O2K5j83l37J74
1446h2J92k88l31R0K91L95J59l4Lj9m00k69K8n4l48J93L69M56J62m8j29j52j81
1469Cn56rJ84J87n3L21M15J61l01m2m02j62j24j7K16M3J56o6K91K85l81j67J11
1492I3r4k91j80J69L67Lk97L70R8J61j54j52q5k97j43l2K71J24l5J62P25j39l19
1515C25k13k81j63k21Q6K38N39M1j88K06K99j02p46l37K17P4j28K44L93J03l09
1536G7J14Nn1j73l21P3P7L2L9J08K94r7k77K05J82k76j91p8L0o3j83N07K78j71
$$ y = [-836, -360, 181, 102, 217, 355, 441, 531, 345, 41, -530, -520, -433, -289, -104, -57, -63, -120, 366, 664, 756, -37, -503, -454, -565, -502, -475, -240, 62, 645, 884, 898, 351, -141, -514, -665, -707, -690, -220, 92, 525, 745, 542, 425, 154, -179, -574, -696, -681, -93, 161, 289, 331, 421, 496, 225, -131, -318, -355, -248, -278, -235, -169, 25, 177, 239, 264, 81, -256, -82, 110, -178, -509, -419, -128, 267, 426, 392, 395, 376, -24, -293, -265, -319, -667, -474, -105, 351, 513, 465, 336, 184, 3, -553, -562, -378, -191, -244, 77, 492, 653, 352, 310, -92, -254, -378, -395, -179, -136, 20, -46, 245, 530, 149, -18, 93, -1, -292, -472, -303, 64, 67, -230, 140, 238, 399, 245, 93, 8, -289, -432, -464, -193, -69, -104, 58, 783, 644, 325, 112, -169, -332, -553, -467, -229, 310, 351, 163, 369, 668, 566, -180, -517, -300, -226, -354, -110, 283, 386, 77, 191, 196, 145, -28, -349, -276, -199, -167, -128, -20, 274, 177, -100, 105, 287, 11, -180, -258, -228, -291, -474, 33, 311, 140]
1560A40J9Kl4L1p0k72l90J62L55J8L28J75k74n6p2M1m16j56L15K09L1J73o6J6
1584B09P6l34m5m4J41K0k58O0K67o1l9J28K4k82J88q1J03p1K4k98L8L58j25L04
1608C02p2K18l36m43K42K38l47q7L20M0Q9J12j0k96j01j21J00Q9r8M6J10J66K6
1631A87n4J53j68k24j89K14L3j38J86qJ62k6Q9l12o9kL32n3j25j56J72O6K51j90
1655A31j8j50N8j26K52j46l76K93J57L26j38r4j44j53M6r4J55k21P2J52K05R9
1677B86o6l32J54L6j20J55K1k40k36K46M31j46k0j81j06O3O0L9j89l57K62M29
1699A89R8l01o6j37O2M17j63j19m58k3L86M36J3k81k63K49P8j18J0n1l58O0N76
1722B36j6p6l00LL40j48J61k58k05j03K62J77J07k4k37j73L65L35k01n66p3J07
$$ y = [140, 159, 161, 127, 158, 88, -184, -574, -412, -57, -39, 289, 464, 190, 134, 62, 103, -313, -469, -154, 55, 86, 259, 193, 209, 285, -49, -94, -138, 3, 23, -235, -175, 92, 31, -8, 120, 144, -138, 50, -31, 72, 1, 25, -273, -235, 123, -2, 302, 230, 448, 112, -331, -89, 149, -198, -285, 35, 75, 164, 276, 266, -30, -131, -252, -152, -63, -161, -115, -5, 161, 187, 133, 286, 118, -106, -295, -81, -48, -186, 0, -8, 154, 128, 217, -95, -164, -166, 166, 113, -12, -168, 4, 70, 321, 131, 113, -37, 21, -105, 147, 1, -375, -82, 75, 401, 263, 169, 25, -128, -82, -176, -21, -242, -170, -18, 187, 286, 220, -112, 42, 78, -42, 113, 134, -106, -342, -96, 335, 189, 169, -12, -118, -55, 5, 44, -145, -502, -240, 189, 287, -14, -80, -217, -155, 262, 99, -20, -478, -501, -115, 321, 334, 53, -210, 39, 117, -1, 9, -42, -400, -340, 236, 220, 144, -156, -153, 187, 39, 200, -58, -263, -366, -104, 73, 180, 156, -81, -254, 111, 446, 245, -321, -394, -287]
1744b87L54R8n5l31jJ29M86q9k44l20k19M58J95Q4k08l26J01K82L21j68k60k62
1766b62n2M15L10m41l34p8M54K83K5l22k93RK10J39M6j36m34K19M00K87l22l54
1788b31j11O3M52Q0j25k96k30M51K95L02l63n38j48L18L36rk21n19K12L57K83
1809C58j63k91j92J21M76N2j36l58l51K70O65j3j64q60J97N52L29j06n14k82n5
1830d65P64J10j30o10k81M72O30j85k01l57l77M85N87O5n25n10J1M45M16K4m13
1851d5l78l5M62P39l93o71l20M94M88K4l14m53j90O17K91K11m59o40O1N46N90
1872F25k58o23k25J10N77L30k33o08m26N48N27K53n74n96l7L41P86K8m39n68n5
1893e17N97M85j04q64l72M31O54M17k29o98l18L55P28n3m49p02j24P55M80J59
$$ y = [-287, 67, 165, 110, -221, -222, -93, 393, 304, 60, -260, -479, -21, 174, 258, 50, -276, -175, 107, 428, 260, 0, -262, -314, 101, 411, -30, -364, -442, 12, 295, 320, -2, -295, -286, -76, 63, 109, -27, -461, -242, 158, 445, 123, -231, -342, -279, 173, 253, 128, -168, -398, 53, 348, 650, 287, -251, -399, -81, 255, 246, 25, -494, -282, 75, 358, 195, -96, -288, -167, 309, 361, 225, -133, -484, -214, 451, 438, 274, -586, -389, 163, 492, 386, -128, -410, -465, 299, 409, 279, -331, -612, -140, 490, 305, 104, -253, -630, -145, 442, 507, -18, -528, -517, -72, 344, 368, -45, -423, -458, 4, 743, 350, -321, -641, -147, 341, 365, 51, -402, -592, 25, 316, 527, 68, -572, -511, 35, 625, 367, -256, -481, -371, 206, 536, 303, -305, -731, -183, 344, 597, 23, -573, -610, -269, 517, 545, 106, -462, -517, 80, 565, 461, -403, -775, -344, 310, 727, 498, -200, -518, -163, 565, 512, 63, -639, -763, -8, 472, 631]
1913F31m38o35j44P53M03j77p93m62M51Q79O0j76o39m40N77O11J22n74n57j30
1933f78P58N93k37n73o40L89N19N80k03r51k80K37P69N15m12q95m9L67P47M00
1953I56r45n38j49O88O66j03p66m35K14O22O81l53r65m77N18R22J69l91q55k26
1973g67O95O94M2n50q50q1R44N42j9r22n13L18J003J40k18q66l54L99Q06L29n87
1994A85r20j69P99P13J07q33o70M6Q17O98k43o69q22L36R46O43n39q61m23N10
2014c49Q48K48n18q83j66N51J073m4o68q88J22Q37P69l76r53o46O72Q78L94m42
2034D59r80l00O00Q03K49o81q87l53J031Q43q0r17o09J54Q07O12k50p89n47L68
2054d67R30N28p70o44n50O71R18K57p07r02l2P39Q07q1p61p53J18J030M94l09
$$ y = [631, 193, -442, -586, 167, 570, 393, -400, -862, -411, 468, 528, 352, -287, -727, -150, 461, 583, 9, -548, -678, 80, 673, 436, -137, -777, -388, 131, 711, 508, -443, -723, -486, 283, 798, 386, -509, -558, -191, 556, 956, 11, -527, -676, 12, 678, 575, -191, -626, -412, 210, 891, 538, -427, -904, -386, 536, 705, 314, -541, -767, -72, 622, 664, 114, -736, -817, 127, 669, 650, -272, -785, -467, 536, 676, 458, -408, -762, -363, 443, 772, 185, -735, -904, -105, 608, 715, -118, -788, -742, 75, 773, 530, -139, -961, -625, 321, 964, 425, -436, -859, -349, 499, 747, 229, -654, -820, -269, 804, 760, 92, -796, -674, 163, 932, 556, -397, -1043, -371, 507, 901, 459, -521, -821, -221, 582, 831, 150, -737, -1090, -59, 784, 704, -213, -822, -668, 139, 751, 501, -288, -835, -467, 463, 991, 221, -423, -973, -302, 616, 873, 166, -736, -768, -29, 778, 697, -64, -817, -699, 331, 825, 516]
2074E16r29m78L70R47L21l11j071l28O92R89J40q09r51R1Q37J009l26q99p86M82
2094d94P52N17l07q26m13M10Q91M14n88r14m96R02R66j59n10q61j4Q19O93j36
2114F46p78p09L00O94O84m51p65n27N31R16L29p59p48o6M51J083m4q71n88N3O49
2135C0O18j35p00m94K06Q86N28n20q93m35M00R68J68m99o93k33P42O56J70q89
2155a19n26R5P52P39l47p28n24M9R42N33o79n19l81L96Q75J55o00q07j22R19O63
2176G66mo79q21L27P09L54k96p77m05L71Q90M20k58j098l61M71P96M65p78q92
2196h00P7P35P03p1o13q13J67Q68M93l78p23l92M53Q06L09n66p02k83O38P88p1
2217F25n37q46nP76P30j92n83o73K45P71N66m93p88l20L75Q51J79m80p28j59N37
$$ y = [516, -413, -891, -521, 426, 747, 436, -635, -963, -271, 718, 858, 49, -902, -811, 26, 1035, 709, -190, -976, -494, 258, 775, 468, -358, -771, -361, 530, 944, 356, -558, -1054, -152, 814, 655, 145, -716, -730, 89, 782, 646, -132, -841, -541, 153, 837, 386, -379, -906, -375, 541, 870, 111, -637, -703, -252, 831, 787, -84, -672, -619, 30, 648, 513, -187, -681, -475, 411, 939, 419, -474, -909, -509, 459, 627, 128, -565, -798, -56, 600, 770, -119, -645, -550, 202, 941, 594, -134, -658, -609, 333, 866, 187, -332, -713, -317, 558, 713, 113, -694, -816, 103, 766, 762, 83, -738, -411, 298, 652, 356, -421, -826, -455, 435, 855, 597, -501, -862, -391, 405, 870, 92, -800, -723, 12, 715, 644, 31, -782, -615, 253, 746, 368, -355, -747, -294, 512, 821, 255, -447, -730, -92, 696, 625, 88, -758, -763, 13, 743, 551, -32, -705, -460, 311, 877, 384, -404, -724, -349, 502, 681, 201, -527, -686, -149]
2238a49P68m0m18q16J18P26M42Q5r79l55K42O80L15l13p91k28L37Q76K69p06p19
2259f56J3N57N13K65n99p70K22N70N24r3p18n13R1Q56M14k91p95l52M96O22K64
2280F20l81o21k87O44N64J04n11q65O7P33O37l34n47m95L20P62K92m55n13m73
2300g39M18P87K37n79q25J57M70N44k1n14o52K08Q08N13l36p76j25J61N63L02
2320F01m61o19l12P69L81K08n26q01O6O85N39k7n43m73n9P02L57l13l94l52J93
2341c79P55J52j97o92k21N59L91J36n97l92p2O79M25q8m66m49K2N60M08k63n57
2362b86m33M73N65L41n42n42j29M89M26Jl67m89J57M20M34j81n46j48k8N91K25
2383D31k00k63o16L87N45K88n99j80j90L82L77j3m04n28L95J71K83J52o40j29
$$ y = [-149, 619, 579, 161, -655, -537, 189, 631, 716, -263, -618, -376, 304, 619, 306, -485, -713, -376, 500, 769, 63, -656, -643, -86, 427, 692, 93, -677, -455, 115, 639, 546, -172, -685, -594, 262, 676, 385, -410, -762, -266, 356, 620, 239, -382, -669, -25, 539, 643, 132, -733, -666, 67, 704, 370, -177, -672, -352, 410, 702, 247, -266, -739, -321, 466, 703, 124, -701, -544, -74, 470, 449, -65, -717, -509, 299, 812, 476, -300, -425, -264, 299, 601, 140, -479, -791, -22, 359, 567, 41, -760, -694, -9, 530, 503, -40, -513, -572, 130, 487, 174, -220, -572, -379, 376, 528, 331, -361, -582, -23, 368, 504, -93, -485, -557, 122, 547, 459, -7, -456, -434, 126, 534, 271, -286, -719, -246, 319, 660, 118, -424, -553, -64, 362, 363, -4, -493, -336, 84, 518, 337, -209, -357, -385, 206, 431, 231, -32, -648, -261, 284, 572, -27, -207, -397, -15, 362, 349, -55, -583, -188, -17, 266, 418, -222, -351]
2403c51J00M41L17k58n47l5R3N00J87k60n00r8L88M68j92k50m36J08L95K88n4
2424C04l28n91L43M04M47k79n49j51J34N89J63k83o31j27M71M87k10k11m05K46
2444a77K62L42m30o7m04L52L42K94l31l70j66J17M39K05m65l03O9L27J50Q1k65
2465Bl17J90K46J70q0m58j0m7L82K58q6m53k65L00N10j5k75l36j7J61L31j3k58
2488h0j61J98l3M67j42k97j34K4N10O1l03k75p4K22K87J39k81l08o1L39j6Rrk41
2512a59r7J87N11l87K0j91o0J63K32j13l26j23K66L54k18L9l14m5K64J69Qk19
2534c9k67K61L9L88k15j93p2n4K92K8k40j34o6K64L12j43j87Kj63j9L27r1k28
2557a98j63K36J40K07p4k14k88K81J06J91r8j95j05J6K31l6K9j65O5Q3R7J59l53
$$ y = [-351, -251, 190, 507, 249, -298, -333, -240, 260, 447, 187, -313, -411, -23, 445, 253, 3, -433, -325, 70, 358, 304, -24, -615, -272, 132, 579, 300, -249, -400, -266, 323, 486, 203, -428, -555, -84, 403, 193, -18, -423, -177, 85, 427, -3, -70, -474, -122, 220, 514, 183, -187, -353, -236, 203, 408, -57, -360, -291, 36, 186, 267, 2, -315, -125, 121, 291, 211, -247, -257, -304, 78, 336, 250, -203, -468, -168, 342, 327, 52, -284, -301, -140, 191, 178, -80, -241, -43, -76, 391, 249, -48, -182, -158, 352, 413, 110, -165, -239, -17, 270, 409, 128, -180, -241, 98, 82, 91, 82, -159, -256, -69, 442, 55, 75, -116, -176, -13, 219, 106, -220, -343, -77, 277, 59, 98, -216, -261, 3, 172, 180, -39, -306, -45, -6, 382, 167, -26, -98, -152, 140, 168, -72, -206, -272, -8, 304, 161, -26, -24, -187, -206, 121, 30, -198, -361, -125, 15, 222, 148, -66, -354, -73, 33, 224, 126, -69, -174, -158, 73, 37, 66, -99, -34, 49, 146, 305, -48]
2580d8k30M7N19q9p9j98j86J09K79o5K09n06Q7J1L74k35l0k27J3K80n8K31k65
2603e7r1Q8K9J29L8j32j12j29K59K01j30l13K32m7K25n3k02KJ08l9J37l8m6j50
2627i1l5o4L03k05M6j76K67J7J41j92q6j8j33L14J75k02r6J67k52J66l4j3j42
2650a43M0J66j1M6j21k02L01q9J46r1r8J1m9Q1J25j24j05rO4J89j65K5j46m0L39
2675A40o2J58k13r6J66N9j33Nr4j67L65j10J53r2J7j81J47mJ84j01j64j15J98
2698F0L0Kp7k41K77l8O1Oj39pL7J44m2j01j09kK28N1q2j50N4M5J32j42J18Rj24
2725@L8K7P0j16m1p5j52L43L3j70P8j53J40O7p5J24j41k31M04j26j37K00k42J28
2749gJ88p1j37j0k3K02J36j63k1q9n1O4j55J19J9m7j72J42N3J08j04m6J27j43
$$ y = [-48, -278, -231, 288, 199, 120, -78, -264, -155, 124, 59, 268, -238, -151, -140, 234, -1, -31, -258, -245, 35, -23, 208, -57, -148, -60, -31, 98, 136, 4, -108, -237, 22, 223, 93, -220, 12, -35, 190, 137, -65, -63, 45, 6, 143, 105, 59, -91, -126, -190, 113, -92, -46, -222, 45, 62, 203, 11, -75, -93, -226, 88, 263, 61, -35, 132, -120, 46, 12, -1, -143, -103, 63, 52, 98, -23, -225, 76, -13, 133, 42, -56, -45, -94, -13, 112, -12, -117, -126, -62, 127, -38, -13, -159, -199, 140, 78, 236, 23, -73, 93, 152, 19, 24, -70, -237, 128, 18, 171, 79, 96, -85, 62, 58, 242, 141, -23, -138, 60, 90, 92, 15, -226, 51, 13, 74, 80, -59, -66, -29, 115, 73, -28, -137, -139, 89, 140, 58, -92, -38, 7, 139, -3, 115, 124, 0, 38, 65, 135, 19, -22, -97, -249, 94, 127, -43, 35, -118, 22, 89, 14, 138, -3, -234, 170, 44, -93, 107, -135, -7, 181, 110, -27, -37, -60, 142, 278, 115, 94, 5, -46, 18, -137, -18, 1, -46, -218, -76, -23, 85, -19, -65, 62, -81]
2773h1jlN8j50J83J05j12K5m4l0K96r8k09m0J06o0M7oM6k1j37Q1n0K18n5k76J14
2800i4M6J27q1M2j35J75j35N7R4k94J31L9M1K8k69L33p6j32J68J7P8j04j15r0
2824a49K76o1k20K36j82rJ51k47J27kP8j16K22j21k3L3l0NJ44k54J36rJ8qj0J8
2850Cq4J03J5R3J9j07j70J64j6N0j38J7J57j07l0J82k24j1J32p6J09j26n3j0Q9
2875a9k9P5K0k1j13N0p1J22j6N8L7j09K6p9o2Q9O1j39n8J71j2kK3N4Q5rk08N5
2903b1O4n7J25q4R9k27M3k7J49j58J6Q9n1O2K0j20N0J10j98J91J4j21j10J47k4
2928a9L1p5M4J3K2m5J27p8o7K3rkL3K3O8j72n8j1k5R7P7j21K1J07j7n0J55q9J21
2957A24j59L6Pn4M2K8J5r6J42r3n5j4l7K86j03p1N0J47j49j40L7q8J48K0O6K7
$$ y = [-81, -82, -85, -27, -177, 6, 111, -1, 24, -20, -50, 246, 148, -61, -101, 5, -55, -8, -14, 32, 11, -126, -45, -95, 123, 68, -208, -94, -48, 79, -2, 40, -95, 80, -55, 2, 96, -198, -67, -28, 13, 41, -228, 105, 29, -103, 65, 82, 160, 56, -59, -149, 127, 66, -154, 82, -100, -109, 42, -205, -78, -80, -2, -118, 104, -17, -40, -7, -37, -32, 112, -142, -6, -15, 3, -5, -15, 3, -81, 22, 37, 130, 149, 42, -128, 36, 20, 70, -68, -51, 106, -1, -31, 151, -73, -84, 48, -28, 81, -45, -98, -108, -19, -48, 27, 47, 26, -87, -37, -108, 14, -2, 56, 93, -16, 10, -69, -131, -42, 19, -120, -178, -7, -19, -21, 2, 56, 141, 132, -76, -21, 43, -14, 111, 27, 126, -101, -58, -85, 64, -94, -78, 11, -40, 22, 42, -78, -28, 82, -116, 75, 89, -32, -142, 5, -19, 12, -63, -19, -6, 16, -29, 98, 20, -47, -24, -33, -35, -2, 21, 89, -83, -141, -152, -177, -80, -3, -124, -103, 4, -13, -63, 92, 3, 124, -35, 1, 8, -46, -4, 24, 39, -57, 85, -8, -63, -77, -114, 172, 69, -2, 48, 195, 46, -94, -57, -145, 3, 23, 89, 116]
2983A16j20Q0j01j1P6k14L05k88J73j1O4Q9j5j25o%p2J48n7p0r2K82k39L20k13
3008A9j26J5J60Mj23qK3O0M0j17J6J0k5j53K15k3J44j17K3q6J83j63Q6q7M1j01
3034i0Q1L6M5j50p9J72Q1o1k4J04j66J09r5r8J44L1j20n5J42j42P0q0K19j73J28
3059B9n2J16j2k4j27L9P6M5j10P1M3k21J40p0k1M9N7J02j67N0J99k89K30k26L9
3084c4r3J15Kn2o1J89q9J56j0j05p5R2o6q4J19J04p2n4O1P0j80j6J89j09O4%L
3111F4j01m7J25lJ2J01j14j71J52jn5n5J3lJ15o0l3J14P6o3l0j55J76%r5P7q9
3138e0K1r4J40Rj52J92j19Mj3J16L6j09R2j29J5K17j73j42J31J2J8K3j22P3J9
3163A5k4O8k1q0K00Jj43k6N3Q4j79j09J31lq4J54l7j71K07J27k77K6J68l7J6j70
$$ y = [116, -4, 76, -25, -36, 40, -174, 131, -157, 16, 5, 69, 158, 143, 18, 12, 12, -60, 88, 31, -39, -131, 151, -88, 232, 19, -107, -92, 68, 72, -51, -59, -36, 24, 64, -53, -37, -27, -52, -205, 10, -13, 131, 14, 37, -49, 134, -29, 57, -30, 11, -90, -9, 27, 72, -78, -157, 15, 96, 35, 11, 115, -51, 58, -37, -135, 9, 40, -80, -135, 7, -135, -65, -145, 74, -99, 29, -23, 93, 81, 57, -70, -31, 45, 90, -20, 51, 94, -127, 13, -57, -78, -29, 28, 130, -37, 13, 212, -77, 153, -73, -34, -127, -12, -10, -62, -123, 66, -23, 133, 123, 18, -57, 35, -31, -115, 4, 108, 36, -18, 43, 113, -67, -83, 106, -3, 61, 61, 64, -37, -84, 41, 38, 50, 151, 37, -134, 18, 17, -38, -93, -80, -83, 32, -28, -61, 53, 129, 66, 36, -119, 57, 57, -38, 39, -50, -29, -123, 17, 26, -126, 66, -53, -49, -62, 54, 90, -19, 73, -56, -41, 176, 3, -139, -8, 4, 22, 45, -77, -4, 15, -9, 59, 38, -42, 158, 159, 16, -10, 43, 127, -52, -161, -30, -33, -117, 37, 0, -171, 36, 163, -114, -88, 80, 43, 59, -111]
3189a11l0N3J10N3m5k02J16R3N0o8O3m7j85J18L3N0j24O5j08J58n7n8N5j33K23
3214G2m4MJ00k53J64l3p2N0Ok6R1m7L7kJ8j55R2R6P0l4n7J30l77J65K18Lk08l8
3242c0l2K03Q3k00k7N8l9q3j18L9J33l0l8J61k18J96j12O8p3K23m7r4o4o1J77
3267G5j70K41j12r6M6J17p3R1j11l8q0J67J9q5k0L1p5J38kp1Q0k57K25n8P6k1
3293C7P9j27j6p1R5q3M3L7%O3j34P4k88L39N7j45O4m9J04r7j5n6Q4M0j00K59P1
3320B65l72K64k26J05r4n9J13J69j92j34J55K9M7j14K5n4J08j34J27j10O8K5j32
3343a21Q9j30O0L1J09n1L2j96K07q5L6J23j06lL2O8J23k34l0mO1j3k9O4j90K88
3369A31j11k6Qk05N2J93j0J4j35N9J7K0m2K3pj26j9J52Kj6mr8J63o8R6j86J14
$$ y = [-111, -141, -88, 22, 75, 30, -172, -56, 37, 87, 19, 82, 35, -150, -32, 1, 51, -73, -8, -116, 42, -15, -73, -18, -151, 72, 28, 32, 132, -121, 43, 10, -62, -12, -6, -32, 59, 12, 49, 47, 65, -90, 2, 98, 168, 134, 77, 207, -170, -5, 213, 216, 8, -30, -62, 141, 224, 24, -3, 55, 16, -67, -185, -146, -13, -43, -81, 80, -138, 58, -54, 14, -59, 164, 117, 23, -41, -102, 75, -95, 146, 34, -62, -16, 101, 28, 119, 8, -30, -110, 57, 76, -9, -29, 2, -73, 65, 63, -8, 72, -185, 40, -18, 58, 37, 116, -11, -27, -98, -3, -86, -43, -6, -6, 57, -77, -3, -291, 48, 105, -40, 24, -25, 79, -18, -33, -89, -5, 35, -65, 194, 265, -107, 157, -69, 36, -58, -117, -4, 165, -27, -161, -6, 23, 70, -44, -19, -73, 35, -99, 28, -82, -14, 11, -121, -32, -162, -102, -71, 38, -13, 19, -177, 30, -55, -19, 104, -2, -5, 27, 95, 218, -16, -46, -50, 11, -2, -31, 33, -157, 131, 20, -6, 2, -203, -151, 42, 32, 46, -89, -30, -13, 7, -35, -12, -19, -145, -164, -12, -10, -26, -30, -128, 35, -33, 63, -123, -9]
3396in0j88J04O4K3K3qL0k3R8P2l64L19r5J64j99lLk0J33M4o7jJ3k31J05K7J48
3424A12j2j67P2qm9P9o7N9q8L3l9O7p3Q0q3nJ27p8l7J46N4o4L8o7l2q4J78q4N0
3453E8q2K1J4l0O1l9o6J96j5o0j64Ml3K43j19L5j17k0O3j5q7J92J4j1j54J14k9
3480b6m4L6O1o4J13p1J46j96K6O5O7p3N5m4j05J00L2j50N0k27K52j06J60J6j05
3505c2P2r3j5R7K0L2j35q0J08K38j63P0q7J9j5j43J4K17k54RJ48j81L00j44q8
3530h6M3J01j69O2lQ1q5M0J8ON1j14K12j67O0l4l8j17O9K52j78j36o6K07J65k10
3556c6j8J18j02K4N1k5L2k9o5j0R5k8j93K06Rj02j04J20j45K03n7K6K09k73K0
3581g4P5K2J34k47J25J0j09J1k3L6k6j11L8R8J47j39K5K24k47J8j10J42m4J92
$$ y = [-9, -59, -247, -143, -79, -56, -33, -41, -11, -34, 64, 136, -228, 91, -4, 160, -39, -42, -39, -59, 74, 118, 51, 50, 63, -168, -63, -36, 112, 100, -67, 5, -3, -52, 27, -40, 19, -69, -36, -75, -8, -81, -1, -84, -89, 38, -40, -77, 69, 123, 59, 97, 30, -2, -86, 92, 8, 58, -24, -3, 11, -19, 42, 3, -63, 133, 118, 58, -106, -102, -135, 108, -11, 24, -93, -113, -50, -65, -152, 40, 54, 43, -111, 3, -26, -70, -34, 27, -37, 76, 5, 151, -45, -19, 46, 113, 40, 95, 51, -54, 46, 78, -72, -22, -249, 3, -103, 57, 73, -32, 40, -53, -68, 29, 49, 81, -54, -134, -26, 212, 49, 119, 32, 51, 36, -107, -93, 124, -130, -121, 27, -154, 146, 2, -86, -43, 58, -111, -49, -52, 29, -56, -16, 2, 8, 59, -55, 157, -10, 50, 16, -22, -139, -70, 182, 4, -132, -198, 9, 174, -36, -54, 64, -38, -14, 37, 12, 44, 15, -50, -60, 35, 7, -186, 20, 29, -73, -177, -57, -202, 1, -56, -30, 179, -94, -74, 1, 23, 157, -90, 35, 45, -64, -53, -76, -40, -66, -177, -139, -41, 106, -33, -8, 216, -31, -13, -123, 19, -25, 167]
3605A67k04q7Q4p8K02j56l2J05m8J11j71P7j8R2J8J5K4%N4k87K39Q5l13K8J32
3630C9q8M7q7j0J31j94K36k16K29o1m5k5O1p7R5poj55J33P3L1j24k8k0N5J28q3
3657C2J34q3m8m1q1J42r3mJ10q3J40j23r8jJ0O1J75j05K8j54P5j51K00j51L4J08
3683C3J06r8l5r9J32k5L4R1j02J19p2m1n8kM4j62J91j86R9j4J88j91l0j1O9J06
3709H6j13J95k83P0R9k06L16j46jj13P5j05J98j55K18j82J03m9L0j59K42m2p5
3732CJ5Q7K0j73J05j24M3r1L9J65l00J07K19k01p6R1O8J30k35J70j36J59j54P2
3756Cj9JK4n3K14j22j26N7J73k20J01j72O9M8l7j40J39P5J26j88P9P2pj22l6%
3782f1M6O7j84Q6q0J58r9J05o8J1o5j1R9J1m4pj64J20K28l7j93J43Q3k73J57j00
$$ y = [167, -37, -124, -40, -118, 84, -72, -104, 1, -47, 64, -107, -30, -48, 44, 62, 77, 101, 101, 155, -132, 107, 192, -121, -93, 39, -49, -2, -89, -99, 32, -162, 74, -142, 87, 26, -19, -44, 17, -60, 35, 28, 22, -133, 0, 73, 104, -20, -48, -68, -13, 115, 32, 166, 83, 35, -6, -87, 55, -38, -42, 68, -15, 125, 2, -96, -97, -87, -26, 149, 44, 72, -82, -7, -158, 42, -109, -75, 33, 139, 41, 6, -93, 39, 14, 48, 139, 37, 156, 84, 43, -15, -17, 27, -135, 56, -130, -31, -45, 143, -48, -78, -89, -20, 86, -27, 168, -115, -45, 54, -152, 164, 18, 17, -96, -21, -126, 72, -83, 135, -47, 56, 7, 37, -122, 120, 78, 3, 18, 105, 125, -48, 57, -67, -24, -115, -76, 89, -211, -104, 115, -86, -162, -71, -3, 127, -108, 62, -74, 85, -69, 3, -16, -15, 9, -44, 170, 48, -78, -21, 152, -68, 33, -139, -70, -22, -59, -199, -60, 15, 141, -47, 32, 104, 97, -25, -61, -61, -15, 52, -132, -46, -126, 32, -67, 38, -30, -19, -84, -95, 4, 15, -29, -36, -200, -80, 148, 111, -82, 61, 144, -129, 28, -72]
3808g2M9M8j69J40j9J40l4k98K48J4o8J5j9J7K7p8J26p9K0p9J18q0M9j53J87p2
3834b2j68K71p0J9QM8k91L49j43p8P2L4j47J32j33J69o7J45o7J1j37n5J59j4J15
3859A40Rj89j6k1J94L7m0r7M4J43j66j24J47mJ67j42k04K32k2j58J6J46r4M7n6
3884a1O8n4J2Pq1j15J31r8Q2J79j96J48j80J33Q1n3o1l6K4l7J22j7j24K18j80
3909c8J22%j77M4J0L2J58j74lJ90j73K6m4Q7l0mN1j46L8Q2j72L4J32k6R4Pj00
3936B0R8j52k4K38j40M9j33J65k12J36j22R8l0m8R3n9j28N4R6N7j0J65k57j5J47
3961H6lmr6j01Q6N0j58J75o8n1k4J16l3J28k80O4O0q9J78l6j28P8J11R5r4o8j88
3988a94L9K29m6J52k4j89jo2J81j46N4L5N2j10M6J13j47pO6K7p0N0L1j72J89%
$$ y = [-72, -23, 25, -144, -4, -23, 117, 83, -215, 33, 47, -21, -6, -25, -8, 19, -59, 67, -12, 8, -71, 47, -33, 16, -137, 50, -22, -190, 81, 11, 30, 38, 86, -205, 144, 1, -77, -5, 29, -118, 14, -119, 50, -17, 128, 61, 72, -65, -120, 39, 25, 140, 149, -40, -56, -77, 117, 154, 114, 17, 61, 204, 38, -86, 61, 57, 224, 82, -122, 110, 88, -70, -54, 92, -2, 45, -11, 57, 3, 15, 22, -59, -174, -43, -141, -59, 120, -76, 72, -108, 25, 106, 53, -8, -44, -20, -57, 65, 48, -76, 142, -38, 84, 84, -93, -49, -39, -7, 151, -23, -26, 164, -9, 17, -27, 60, 30, 26, 77, -69, -31, 51, -121, -87, 45, 19, 113, 120, 20, 118, -34, -58, 180, 40, 89, -44, 121, -91, 45, -77, 21, -9, -57, 36, -23, -151, -97, -1, 56, 46, 211, -46, -61, 86, 83, 79, -17, -118, -32, 18, -140, 35, -33, -84, -108, 8, -25, 103, -177, -113, -53, -142, 36, 0, -128, -50, 61, 156, 62, -6, -194, -155, 74, 28, 180, 156, -33, -34, -96, 85, -61, -7, 28, 80, -30, 16, 129, -18, -25, 41, 68, -2, 48, 79, -93, 96, 96]
4014I6m9k24N1M8J55p1k7o2J16p8L8l5j09p1L20l60J51J93l4k19O7J29J81k00
4038FR8l6p8k0J04k38N4J47k0n9j95L18r4n9M2L26k26K6j35k1j7J11l6JMp1J32
4065F4l4j07O0L8J84l69J77Nr9o3M6J36J08o7k03M0J77k8J9k12jK10j22K47k37
4090c1nm8J4J28K0o1m0J06k01K6J38l0j89J73m9K26k00M5j73L39q9Q2r9j71l9
4115a28K37P2l03l9N9K4K65j20R1j69r5L8K1K1j5K4J9N1j43J88j82j39J48J92
4139A17k0M7m6j83p0J42Q6j1p8j99J11L61j56K7j24r8l6K69J32l93L5j27K35J58
4163A79j34j59Pj07K92j66K44j18l45J18J74K81k34j25j31J85J38K2L4l27l0K26
4185B4J21k00J51j25j07J62J43k10m1j12K56j8P6P4l04P7J85j22J47j19J3o0M7
$$ y = [96, 47, -177, -126, -78, 77, 6, -21, -83, 33, -45, -7, -42, -151, -222, 98, -262, -111, 82, 48, -171, -104, 25, 206, 6, 104, 68, -10, -30, 74, -164, -110, 37, 17, -42, -237, 81, -13, -72, -30, 296, 70, 96, -39, -60, -77, 34, -2, -1, 3, -68, 64, 30, -77, -17, 21, 205, -164, 13, 18, -81, -144, -98, 38, 146, 79, -124, -84, 93, 65, 84, -128, -129, 81, -41, 206, -31, -36, -84, -70, 58, 78, 17, -23, 83, -118, -92, 46, 16, -173, 0, -49, 177, -23, 22, -151, 188, 99, 181, 82, -89, -128, 109, 181, -122, -161, -102, -78, 187, 67, 158, -11, -106, -68, -47, -26, -41, -17, 2, 53, -90, 98, -84, -223, -75, 117, 97, 144, 98, -85, -155, -13, 73, 62, -16, -215, -104, 257, 101, 128, 4, -94, -130, 139, 271, -122, -87, -214, 21, 179, 45, -114, -107, -214, 78, -88, 156, 38, -307, -189, -15, 266, 32, -93, -224, -39, 99, 121, 155, -172, -202, 24, 145, -55, 96, -29, -136, 26, 169, -41, -82, -194, 62, 44, 120, 194, -110, -33, 152, 30, 177, 58, 71, 11, 58]
4208E8J11m9j33j17J18J18N0j92K0k55J36J71P7l3j93J2J32K63l09m0l4J29l2
4231HQ5j11L8l0j20J76P7L3j85j46J90Q6N7p3j69m0K05N5r5Q5k44N6OJ92L1j05
4257F2p3j82K88j20Q6k94K57o3M0J28j47M6j30m4L07L4l03N4j42K05J29L4k51
4280g9j04J06J79m3jj93J15m7J62R3n9l00J92j67K66L6j56j15j22K41J47o1j51
4303f1P3j26J69J53l05R7j05Q3Q6J06j26l13J3K32nJ42j84o1J2K28M1J6m30R0
4327a75J1K60J01j81n4k06K33O3J2J4k75J73o1J59K1j89r0r9L14J59j81m0k22
4350b53J63P2J57k0j8k32K65Mn9m7j21J00J03K5p6Rl37K48j4R5J2k84J28p9J88
4375B9L04l85P6k80L10k1Q6j01m0n9J29K4J61l30J4j3L94j78j8j16j40K27J25
$$ y = [58, 169, 120, -13, -130, -12, 106, 156, -36, -16, -271, -135, 36, 113, 80, -113, -101, 31, 294, -15, -55, -89, 40, 8, 93, -18, 20, -10, -130, 46, 123, 156, -29, -175, 15, 101, 158, 85, -84, -124, 81, 136, 41, 126, -118, -62, -56, 136, 167, 62, -11, -193, 95, -25, 61, -233, 24, -39, 1, 129, -18, 28, -102, -146, 161, 195, -108, -54, -196, 9, 138, 172, -79, -183, -77, 102, 59, 58, -135, -20, -67, 95, 188, 129, -171, 21, -146, 120, 156, 0, -115, -237, 4, 151, 90, -61, 12, -114, 55, 208, -97, 0, -105, -22, 64, 170, 44, -269, -256, -24, -29, 113, -71, -132, -120, 108, 149, 165, -265, -175, -164, 96, 197, 16, -38, -244, -11, 52, 64, 78, -197, -24, -85, 74, 95, -94, -184, -283, 31, 190, 9, -31, -253, -90, -18, 139, 119, 101, -131, 134, 138, 79, 32, -89, 11, 114, 139, 63, 72, -265, -17, -31, 64, 76, -208, -80, -159, 29, 333, -52, 24, -256, 54, 33, 119, 18, -22, -81, 48, 72, 233, -97, -83, -96, 298, 120, 102, -14, -154, 73, 198]
4398A98j18m1k8j35J84Q7o7k91J07j7j0K66J35m62KJ18J11J37j39j37j05N02j01
4421A96j0k13j62N8K29J1P1j87j20l2K13l7R0j05j27n4L24P6k3k02k45J82K61
4444A94j12k16m5J36q4K72m6n3k19R7M0J09Q8j26p7n5P5K10k04o7QM0J45l2j00
4469b2j04q4K94j1P0j87j7q3R0K53j61k00J09j1J95J14j05k10m3J23J82j87k41
4492b36J09N0J56RJ9p9k33J65J15K7K2j3k47J34J04K16k97l3o7J72J7Nj30j18
4516a33J26J5J81l7j24j69K13j6J36k12J94q2j89J79O4N9l98k01M63k0P0l5k75
4539a91J80N7j3jOq2L0KQ9j34r0p4NM29j36j62p8m5K14O4J15k07j93K47P7q0J30
4566A59k60R0j15J94J47l71L6O4J35J14K0k13n7K4R8m1J55j20j54J16j20M3P2
$$ y = [198, 80, 39, 11, -124, 60, 147, 80, -211, -104, -121, -131, 135, 270, -192, -190, -72, 39, 176, 37, -100, -205, 297, 196, 186, -27, -189, -131, 98, 109, 180, -7, -127, -159, 54, 17, 107, 2, -125, -179, 145, 221, 198, -4, -249, -67, 194, 82, -134, -179, -43, -127, 145, 99, 46, -173, -76, -36, 73, 161, 35, -42, -97, -22, 188, -16, -83, -75, -35, 110, 78, -22, -126, -210, 84, 73, 143, -44, -61, -144, -54, 199, 38, -162, -53, -64, 131, 245, 140, -70, -113, 10, 192, 5, -236, -127, -77, 79, 88, 107, 28, -205, -40, 75, 102, 124, 111, -136, -2, 102, 318, 21, -12, -79, 93, 110, 115, -15, -133, -7, 8, 189, 152, 28, -141, 72, 56, 192, -20, 174, 92, -97, 82, 146, 205, -193, -394, 69, 49, 119, 84, -191, -11, 46, 33, 32, 38, -44, -14, -12, 77, -57, -147, -221, -216, 213, 77, -85, -163, -208, 6, 70, 185, -22, -215, 32, 109, 29, 159, -101, -11, -126, 68, 215, -156, -120, -56, 79, 193, 213, 0, -57, -33, 65, 24, 179, 59, -95, 21, -99, -56, 16]
4589A6p5l8J59k16L58q2j65k5j5J39k5mj39J10p0K33j22j13j09J70J75j1l2k58
4613a39P0J90P9j97j26j8J13l7J56n3j16q6pJ84J75j97j25jQJ50L5R5j53k04Q0
4638a24J33J03j69p4J53j6J01k01Q1J12k71K15J27k14R1q2J6K11j42l0l8k10M0
4661a88K77Qj42J2j16J64J02M3j45k41Q9J9J72j32J70j53N4ln2J39j7l6J01j7
4685A08jJ1k56k1J44J87k2j94M1j07K16K1j8j49L1p8K28ON8k15r3R4K03k71n1
4710a28l0K8J70R8r0m2LnpJQ6k65K06L1l4p5O8MK9n7lJ55m0k64J48L5J52j99J52
4739A27j27K0j5J35M8k98k37L28J38m8J4j37k9J44k05K78O4j49j87j8K74j66Q9
4762D3k70M9K65n0n9RN1L5N6j15J29q0l04J88K08p0n1J32j56J67j21Q4n3j30n0
$$ y = [16, -59, -97, 62, -154, 204, 122, -43, -68, -83, 56, 31, 27, -112, -2, -72, 161, 39, -74, -183, -13, 162, 151, 119, -139, -69, 121, 200, 3, -123, -141, -28, -65, 91, 38, -78, -164, -171, 13, 188, -9, -134, -135, -127, 23, 58, 153, 0, -204, -124, 9, 112, -57, -131, 22, 6, 107, -94, -13, 99, -172, 43, 170, -44, 47, -35, -19, 192, 50, 20, -18, -228, -188, 89, 97, -45, -33, -149, 15, 117, 160, 15, -226, -137, -118, 54, -78, 92, -61, -7, -10, -62, 77, 60, 24, 125, 108, 107, 118, -138, -159, -15, 172, 150, -44, -3, -110, 106, 127, 109, -40, -9, -87, 141, 147, 205, -10, -103, -9, 194, -77, -128, -158, -130, 40, 138, 48, 6, 9, 4, -3, -2, 84, -181, 25, 56, 22, -53, 15, 19, 48, -9, -12, 143, 103, -161, -13, 22, 174, -25, 127, 0, 20, 5, 140, 188, -110, -347, -19, 119, 71, 85, -52, -81, 63, -142, 136, 200, 51, -136, -154, 120, -46, 43, -227, -178, 87, 37, -22, -13, 38, 73, 129, 14, 143, 63, -241, -53, 155, 85, 34, 166, 10, 177, 56, 140, 87, -43, -93]
4787i3k4J53j49J13j71J24J76K7j37o6j6j69P5J74Pj35P1k6J28p1L0N8j11J43
4811A11n5p9j03LL06k11k5J0J8j64J90J2k0J58k02oQ8K1N6j38R8k01M8J31k36
4836a90J20l3K72J22l01j9J26j05O8l5J06j68n5J32J3R7k01K5J8l9l8Q6J84j98
4860a3n0mO8L5j38Q9j20J60R4q9p0Q6L1j11q3L5l2n2O7J39nj2N5k3j12J83j97
4887f9O9j1j59J77p2qJ87j52J69r8j28J84rj70R2O4k11L09k18q6Q7J18M1j16O
4912dRo8L4Q2j18L9l0N4J20l73K37j72J90n6ml9K6L3j6Q1N4pq6N2N5j90K11N8
4940A72l08L8M14k44n3lq8K3R8R2k95J46j24J16J69q8k17M8J04M6q7NqM2j8R1
4966G1P1j54MO9j39J70P9j28K7J36k27l9J55j78J29j52K10p1m0O7Mm2n3M4j0L9
$$ y = [-93, -117, 36, -113, 0, -171, -47, 129, 156, 19, -47, -63, -232, -157, 17, 24, -111, -40, -66, 62, -9, 21, 79, -32, 111, 56, -23, -126, -123, 183, -28, -53, -43, -25, -189, 1, 13, -7, 151, -51, -57, 31, 52, 108, -30, 68, -133, -85, 46, -190, -70, -103, 169, 291, -10, -29, 97, -8, 60, 25, 131, -37, -92, 40, 53, 150, -51, -26, -8, -47, -85, 1, 185, -13, -63, -67, 1, 36, -102, -13, -133, 27, 121, 32, -38, 48, 79, -32, -115, -80, -112, -164, -97, 42, 37, 25, 80, 57, -55, 128, -69, 0, -11, -170, 7, -65, -73, 114, -38, 131, 33, -95, 89, 80, -90, 2, 66, -145, 164, -54, -140, -53, 65, 106, -10, -4, 5, -63, -29, 53, -65, -26, -56, -2, 118, -255, -18, -190, 0, -56, -60, -99, -73, -40, -56, 25, 79, 72, -14, 38, 93, -97, 114, 172, -136, -98, 316, 72, 19, 16, -72, -49, 49, 141, -154, -8, -132, -16, 153, 65, -152, -104, 0, 46, -41, -36, -44, -2, -20, 71, 142, -12, -8, 61, -78, 92, 171, 43, 70, 206, -21, -60, 95, -83, 46, -106, 104, 33, -7, 60, 64, 22, -31, 13, 3, 42]
4992D2J61l38K69j56J75j39j0P2Jp7J24j59J26k01j17L80l10K37j71l1J84j1k71
5015b20J44K87k21k58K13p9J79k5oJO3Q1j02q7N7j92K39K6j15K23l20J02k29K34
5039eo2M6L98m17j5R0j00J3j30K04L8p2Jo9R7O3j71K38l47Q0M1J84n0q3R6j14
5065d6Pj06K51o8m3L8j07j1K1K06j90J16M0j20J58k30J97KN5j64nj05L4J46j72
5090i6j0N5J61j60J26j84K85r1J29j78K4k5JK8mn1j34J14J54j91P9k4J02k15o0
5115a65Q4J07j94J31J54j44j05J93o8n5R4r5P8np9L0k0m3J59k12J59O7j08k7l2
5140i6J36J2Q8r1K4j28K3J67j62K67j59J01j52K39k79k1K0J00J61j83j14Q9J28
5163A70j03j03m0J4K35l29K10j92L3K09r8n2J46j5j22O5n2R5j67J63r9R9j14j27
$$ y = [42, 203, -135, 134, -22, 153, 14, 4, 76, 77, 0, 124, -35, 91, -110, -227, 153, -157, 80, -91, -122, 62, 51, -220, -76, 211, -10, -268, -55, -134, 45, 20, 14, 15, 78, 159, 57, -30, 27, -165, 74, 100, -15, 208, -112, -10, -239, -5, -67, -21, 377, -40, -55, 35, -65, -52, -182, 22, 60, -12, -11, -80, 17, 80, -91, 147, -200, -120, -79, 105, 55, -28, 68, -46, -39, -145, 106, 38, -5, 33, -74, -85, -64, 142, -48, 68, 108, -12, 146, -84, 113, 115, 170, 6, 1, -104, -70, 76, -96, -106, -51, 110, -50, 76, -108, 177, 86, 215, 37, 61, 36, 37, 65, 61, 10, -124, -10, 144, -47, 32, 8, 110, -105, -165, -81, 26, -168, -37, 117, -27, -132, 61, -7, -62, 32, -63, 15, 10, -69, -39, -59, -102, 57, -155, 4, 71, -37, -64, -96, 40, 52, 140, 49, 73, -55, -32, 135, -27, 240, 81, 182, 30, 269, -10, -31, -11, 89, 250, 67, -47, 42, 170, 67, -36, -76, -62, 173, -156, 54, -138, -105, 104, 6, -46, 100, 85, -37, 28, -24, 71, -96, 67, -32, 67, -47, -174]
5187a74R2J88j60K84j35o7O1k23N4M1J62j69R6r2J61j39J17l2q9m3L9k9P2oN3
5212F2j51J77J4L7o2O6j25j49J56j84L2J66Q8j11j7k0Q7J89k86q5J43J00r1j25
5236h9K33o1l6N5K0o3J28q2L0j35q2O3j33J39r8J50P2n6QKj40m7Q1r2RP8R1r6
5264e1N8j40K20j48J48%j68j04J37j4R2j75J38m7J43j34J69j68pJ80l50K58O3
5287A00j64J2M0j33J44M9Jm9K9j4p7j1J52M8j23p6J87j10o0Or5L07j56k6L2o1
5313d8m7%J41r8Q9J4q5J41q2l6J26j52j1L0K11j63j32J3P8j22J76k17J18Q5n5
5338b6NM2l5J35q5L6q1k42L77p8J6K8j02M0J24k15K17k10L7j5L6m4J44j53qK02
5364A45k67K8Q0N5O3k01J45r1K5l8k4R6J6qKj5m7K2mj03K35j94K6kK09j76j33
$$ y = [-174, -82, 106, -54, 230, 95, 28, 89, -134, -80, -39, 123, -46, 50, -42, 119, -20, 97, 65, -24, -67, -28, -57, 15, 9, 62, -89, 88, 102, 139, 77, 143, 18, -131, 25, -159, -127, 39, 127, 16, -1, -21, 66, 255, -31, -116, 27, 127, 36, -89, 144, 83, 47, 102, 122, 59, 187, 105, 135, 0, -82, -19, -152, -13, -111, 39, 111, 55, 63, 65, -75, -122, -41, -133, -124, -46, 45, -51, 7, -133, 87, -61, 87, 87, -81, -185, -48, -62, 30, -145, -7, -54, 89, -45, 124, -44, -51, 129, -221, 37, 100, -64, -52, -12, -145, -1, 48, 49, 0, 29, 15, -62, -73, 79, 127, 4, -72, 115, 5, -55, -49, -144, 163, 7, -19, 13, -48, -95, -95, 46, -52, 37, 51, -34, 107, 25, -11, 115, -37, -48, -18, 193, 30, -102, -89, -11, -133, 43, -174, -56, 29, -26, -21, 21, -14, 121, 36, 72, -9, -251, 126, 48, 64, 92, -10, 30, 154, -61, 156, -54, -17, -32, 4, -40, 104, -49, -57, 145, -122, -94, -14, 41, 104, -97, 48, -43, -18, -56, -80, 16, 32, 24, 26, 11, -36, -14, -18, -121, 114, -80, -54, -56, 153, -23, -156]
5391a56J59J8k2k2P9j22m6P3l4J66N1r4N8p0l3m4n7N6P4m3klJ02n3k11J17JK03
5419A45j60l9J51N5k76J23pL9JJ80l60J81OJQ8k48J49N2l34M10k62J39Q9oj45
5444b8L4j9l3L1J80j14k1jj61J66J7l5q0j12K15j76q7P5K79p2o1M8k0p6K48j42
5470E5k01L59l27O6K74j56n1N9j70J88j96L0J28n1j47L21k83P3l2M2J30k36J81
5493E6j45P3n8J85j90J3K0K7P7j29m2J23K9q2J84j68P0J92k45o1J84Jl6j52J27
5518E3j42n4r2K94o5n7J44k44J20PJ24l05J63J32L9k23QQ9J6P3j72K08j32m7O9
5543Fn9P1jO0j82J52K4k9op4Q9j68J43j19K13j68K64k52lN1j86Q6Q0R4j36J95
5569A45j11J75k57J5n5J24k2j25J4K60k46J29q5R8j34L3J08m8j43K09O6q9R6j57
$$ y = [-156, 3, 21, -1, -23, 56, -66, -112, -39, -73, 93, 144, 50, 108, 38, 5, -39, -96, -40, 34, -9, -11, -14, 88, 35, -176, -59, -58, 145, -15, -54, 97, 152, -124, -1, -8, 31, 32, 212, -148, 33, 39, 40, 128, -120, 29, 81, -253, 157, -105, 34, 123, 117, -28, 6, -13, -46, -15, 165, 51, 30, 29, -132, 34, 51, 16, -64, -176, 39, -137, -224, -149, 130, 58, -3, 45, 25, -51, 197, 55, -146, 213, -114, -48, 226, 70, 19, 78, -92, 96, -100, -70, 58, 7, -140, 181, -102, -29, -61, -19, 111, -125, 56, -89, -16, -74, 111, -79, -66, -46, -19, 58, -71, -113, 10, 39, -43, 141, -27, 43, 235, -10, -71, 113, 114, 78, -74, 53, -89, -143, -235, 59, -6, -63, 81, -163, -43, -36, 88, -217, -54, 78, 117, -106, -98, -9, 7, 80, -92, 116, -16, -63, 6, -53, 18, 17, 77, -105, 47, 71, 42, 36, -38, 51, -117, 26, -93, 120, -48, 216, -36, -39, 12, -174, -88, -8, 86, -50, 145, 34, 209, -48, -33, -88, 36, 14, -111, -97, 163, -83, 46, -39, 59, -75, -42, 66, 18, -125, 84, 150, 61, 157, 0]
5593@q9RN8qJ52j91K00p8j71J78j25K31p8l6q0o2L5K01k40J39K8j46kR3M5m5j55
5620a37J4J52J08m44L97N2j41nM3j47J08k4JkOL0mj35J73j84K25j93J11o1K55
5645A98l92J74P8j91L13j62k8j87J85l5K4R9j45J93j62R7n3O5mq2rJ42K5j18k15
5670a90L02j57J26j39M1L9j78K34n4m3J50k02R8N3j28p7lM1j1K2J03J12l48J55
5694e4J30%j30R1k2qR4J9o8J45k07N7j7o6j24R3P3k1j76rK15O0j56J51p6j49K38
5721H3j20J34j19l8J6j26K67rk07L5P0o3K2m2J47R4o0k87J98j6PJ14j83R8Qq1
5747e8LJ0J95j69j32K67M4j79R6m3j05O6M6k2J85k42J08k05K52j70KM1O0l4L3
5772D9RL1p7q0N9j17R2J05n2R3k01o0K41n8j76K95j80Q8L0j12j8m0K2l0k5K31
$$ y = [0, -89, -80, -22, -30, 122, -69, 131, 53, -118, 60, -65, 166, 88, 52, -28, -90, -55, 146, -94, 45, 73, -73, -75, 18, 63, 18, -137, -123, 29, 137, -307, 90, 142, 1, -4, 39, -108, 0, -24, -23, -25, -19, 11, 7, -128, 45, -139, 86, -107, 4, -57, 198, -194, -20, 58, -133, 180, 18, -10, -197, -12, -47, -23, 76, -69, 124, -38, 59, 6, 71, 67, -15, -24, 118, 143, 25, -190, 112, -45, 81, -58, -17, 22, -156, 78, 24, -19, 131, -71, 27, 80, -48, -125, -128, -87, -98, -76, 27, 139, -209, -54, 76, 76, -54, 37, 15, 7, 101, 120, 52, 197, -10, 47, 30, -36, -160, -67, 6, -15, -191, -200, 15, 75, -81, 70, -6, -155, 83, -37, 97, -22, -60, -44, -170, 97, 88, -119, -84, -14, -77, -55, -97, 50, 144, 84, -203, -5, -21, -14, 100, -83, 15, 23, -58, -55, -45, 150, -19, -151, 116, 160, -19, 77, 34, -71, -5, 41, 19, 204, -38, 70, -135, 117, -53, -51, -10, 50, 16, 49, 58, 89, 12, -68, -9, -126, -34, 71, 19, 112, -89, -149, 92, 34, -142, 153, -27, 61, 91, -21, -39, -79, -57, -87, -112, 119]
5798A19k50R3R0o2J08m1j52k5J72J34k47k3K48n4l0j61J85j80O7K7j45M5J08q4
5822e8k6J09J08r8q2M6J61k44J13J11k89K4l9J88O9j42N1R1j54J62j63P5Jm5M3
5847A2j30K51k22J20j53J22j62M9Q8j7O0qJ32j93O9L3n3j47J8J15M5m1J16j4o8
5872B2J26j66j11k1J58r2J81p0j97K17j31J66k7O2qm2m7N6J2j97J23R6j16%m0
5897d6J8O9n5P3l08J61J65K9q8j03J49n2K1n5J93k1q8j09M7j04R3k44J27J91j07
5922d4N0J1j88M1J79j37Q7Mk2LP7j69J73j56m5J93k46Q9J73k04J53r5J9J10k12
5947a56L57j40j24m1Q7k16L65k64K28kj22J7P6o6l5n8P4P7k17J49K2O2j21j9k8
5972i5K2m7K17K3L1r1j29j0Q6M5o2k0K62k10L8k5LJ76j92k4J02k22J66j95J42
$$ y = [119, -131, -38, 52, -10, 98, 57, -95, -120, 52, 186, -61, -84, 164, 110, 80, -81, 104, -76, -9, 18, -127, -82, 26, -58, -84, 25, 133, 35, -47, -1, 160, -84, 29, 140, -149, -125, -164, 24, 93, -49, 2, 93, -61, 101, -62, 13, 14, -31, 12, -118, 133, -89, 31, -122, 0, -162, -113, -25, -42, 18, 10, 142, -51, 18, 51, -2, -149, -131, -16, 29, -12, 104, 90, 22, 148, -18, -129, -150, 8, -84, 97, 27, -170, 47, -84, 82, 55, 117, 109, 67, 20, 76, 88, -109, 14, 110, -6, -6, -46, -28, 41, -14, 59, -249, -88, 77, 106, 18, -85, 64, 12, 33, -22, 171, 150, 62, -47, 0, -104, -11, -255, -128, 63, -44, 6, 17, -171, -130, 49, -88, -1, 3, -19, -16, 61, -108, 65, -91, -136, 57, -189, -100, 73, -131, 22, -73, -54, 56, -156, 201, 61, -63, -104, -17, -233, 132, -132, 96, 94, -28, -11, 65, -1, -36, -94, -20, 57, -160, -11, 11, 73, -48, -67, -95, -73, -120, 97, 120, 151, 60, -69, -79, 7, 52, -10, -30, 232, 22, 60, 35, 38, 214, 22, -2, 100, -122, 44, -151, -9]
5997iJ2p5J55j75K64k28J25j11R7j55J57o6j02N2q8k6J35J64k42J25R3j57O8K6
6021C9j27R8lq6L17k57j28J73j14J10j3m5K70j68l2j0k9K6j19J32k7q3J42p9J4
6046AJ33lj65N3Q7OK1l50K55K44k12J7J15l11J66q3rn4l1Q1k8J33K9n4j9k0J4
6073A6J59n06K96j32J73o7J71j73K7Q6j0Pj9j55J47j5O2k06K97j53J22q7j5m0
6097a5J19L5J0j8r9j61N8K33k8k63K4J02M3Q6p9K0k26L8K3O9N5n9J20j76J99o3
6123D7j18R9j48J83j01k2qQ0J01l6Oj81K18P0k87nJ59j85J47Lm1N5q8N5rj55K07
6150D6j10R9j25J60j06k2J52j9j44J03q5k8M5Q1j32L8m3R0k2j56O3OK00jj50q7
6176a47L54k91J25R8j35J19j09n8J52l4n7p8J7P1j27K59j93k07K50l3O6K1j23
$$ y = [-9, 3, -72, 83, -92, 172, -56, 69, -42, 55, -100, 57, -9, -111, -59, -147, -173, -38, 126, -116, 9, 102, -55, 13, 39, -88, 10, 7, -79, 238, -19, -147, 26, -88, 22, 9, -36, 234, 66, 34, 24, -5, 21, -98, 34, 7, -76, 66, -13, 1, 134, 131, -34, 19, 106, 112, 133, -217, 38, 282, 70, 87, 202, -109, 57, -26, -35, -89, -120, -39, -67, 66, 95, 41, 22, 2, 16, 175, -331, -35, -167, 6, -61, 110, -63, -36, 50, 40, 47, 28, -127, 20, 5, 67, -139, 158, 5, 127, 40, 25, -15, 104, 139, 149, 131, 32, -129, -71, 162, 134, -129, -105, -3, 40, 126, 47, 67, -159, -121, -98, -29, 26, -33, 87, -89, 110, 47, -71, 28, -120, 63, -38, -60, -68, 12, 113, 77, 83, -98, 120, 190, -97, -102, 57, -128, 19, 22, -19, 36, -52, 3, -6, -161, 46, -64, 35, -90, 70, -36, -58, 94, 75, -69, 34, -51, -79, -34, 47, -85, -47, -90, 0, -22, -178, -115, -109, 91, 90, -60, -147, 207, -84, 41, 139, 4, 123, 14, -44, 108, 74, 17, -61, -44, 27, -100, 159, -34, -241, 9, -24, 42, 63, -60]
6199f0K29k79N7l1L7R4j96L7J77l6j67J61o8J13m0N6j00L1j33R4K9m1Pk9l6J70
6225G6j00q9k5J86o4m6L8J59n6k8Q4j2o8j28j21K12j01p1K6J60J00j3k30K14m1
6250F2j25J03j04P6j3j26J64J6j26K02N6j84N5n8l0K32k14m5J41k8p0J72nk25
6274g4K11l4r6%K6Qp2K5K9j06O2N7n9o8J42j3j27J98m9k31L84k36qK08j84M0r6
6301f3P6l8N4O1O7m5m2q7J04l3j87K30j9j23lLn9M9n5J87m6k09m3L68j32ol9J71
6329A41j93m2MJ90L1j38k7O2o3R1N9j08Q6L6j63j2o7J78j42k3J71MP1l04K04j72
6355a26J88k00J95m3R7r4k9P8j03j6K90j37r4q0o5J8P8N0L9J02m4k70L5J77q5
6380c9%O3Mj00J73p9R5q1m1K0M6k07M3O7J79j19k4o2N9o4O4k9J59j80Q0nk5J69
$$ y = [-60, 169, -110, -53, -84, -47, 47, -149, -112, 65, 29, -138, 23, -45, 68, 28, 84, -16, 15, -118, -24, 5, -36, -29, -58, -94, 76, -24, -113, -138, 48, -16, -62, -24, 135, 79, 51, 135, 123, 55, -73, -194, 18, -83, -154, -128, 32, 132, 119, -111, 103, 62, -63, 40, -64, 12, -1, -127, 37, 53, -73, 129, 185, 1, 56, -2, -32, 200, -14, -59, 82, 54, -16, 156, 151, -74, 137, 103, 7, 7, 33, 41, -31, -6, 23, -83, -21, 36, -23, -91, 51, 38, -89, 109, 60, -171, 213, -23, -31, 177, -7, 33, -63, 13, -25, 29, 90, 157, 112, 70, -17, 87, 54, -133, 97, 78, -45, -48, -45, -104, -55, -110, 77, 31, -178, -221, 147, 15, 9, -30, 141, -52, -94, -90, 100, 131, -7, -34, 28, -35, 56, 115, 7, 93, 129, -34, -46, -113, 65, -77, -100, 71, 75, 146, -158, 46, -126, 62, -138, 57, 14, 111, 17, -12, 66, -37, -53, 237, 100, 6, -74, -139, -121, -43, 7, 46, 148, 104, -166, -131, 46, -39, -39, 24, 28, -72, 101, 22, 117, 36, -5, 15, 61, -146, -103, -36, 143, 24, 0, -62, -3, -67, -3, -32, 127, -53, 27, 22, -3, 166]
6408A66k69K56k63L2J02o9m3J89j55j11J97j5Nj0n9L6R7p8M4j50K9J63j49N4L9
6433C8m2q0J87p3R5q7j55pNJ96j85J88P7j94l1M1O7j01J03r5J9M1K8j83P1L3O5
6460B1L4k98J96QJ80J5j15j80K11o2J14k40K88j97k6O3J26O1j89p6O1j72J94p9
6484f2J76j42J30N0r8J4L1j18j08Q3J39j55QJ5J40Rj17J15j32np0rL9K2m6J16
6510B5J25o7p9J2p9K22j93K23j75o0J4R0Q2j30o8P5J7L0J41k69P6r8Q9o9m1J77
6536G0k55J21M9L9J13k40k9R3K4L4L7P9k71OK32j00P5q3Jp7J16L9j08Mo9R8r5
6563i7Q3jl3N3l8K81k17rj08j3J28R3q6k30R0J8J73J21k87O1l5r7K00Kp3%o0K4
6591e7O3k0L2q8N0J08k0J4k41J01J11qj00k7J99j55K64p4j53k0n8L9M2J05k21
$$ y = [166, -103, 153, -110, -78, 24, -45, -88, 101, -54, -165, 32, 17, 22, 12, -47, -11, 86, 8, 52, -98, -69, 94, -55, -1, 38, -4, -84, 103, 30, 125, 38, -117, -124, -119, 77, -108, 80, 157, -37, -68, -27, 40, -61, 42, -53, -34, 7, 35, -148, -77, -44, 21, 55, -243, -47, -39, 141, 156, 41, -139, 72, 10, 124, -116, 172, -25, -51, 12, 138, 199, 10, -66, -5, -177, 17, -62, 114, -28, 102, 152, 54, 68, 99, -19, -127, -44, 95, -60, -52, -37, 103, 112, -5, 110, -22, -27, -97, -106, -67, -45, -91, 25, 150, 83, 4, 16, -63, 159, -34, 189, 14, -46, -32, 58, 140, 10, -58, 17, 34, 64, 205, -64, 12, -86, 3, -66, -107, 70, -185, -64, -15, 24, 137, -103, -132, -39, -15, 19, 56, 135, -136, -130, 102, 2, 77, -6, -5, -82, 34, 73, -35, -31, -100, -2, -97, -14, -15, -48, 5, -33, 248, 31, 22, -86, -99, 29, 122, 36, -194, -104, -86, 87, 208, -79, -18, -53, -150, 50, 52, -21, -21, -81, -57, 6, -14, 18, -70, -20, 88, 68, 82, -159, -58, 53, 45, -55, -82, 117, -38, 226, 152, -1, -21, -79, -40, 2, 107, -114]
6616a14k5N4J24j53J8J17Nnp7k1K4n8R5N5j35N7R2Kk73Q5K40r0J07j46n6J92j38
6643b4M0M5j93J29J45lJ9j01r3j11K82m9j60R5j10J47L9o5n3j17J61o4n5K35L7
6668A76j03j54J1MQ0J76k83QO7Kn6J29j02o8K17k31Q3J07on4o2Q1m9j3l2J36O4
6695A28j98mM2n7J58L6j28j14N8K7J03nj40k0P1q7O9Q1l2L8k33J19P1P2j15J07
6721D7J9K8o4j73J29Q5k31K03k1j3R0j49J32j93P1j8J4J3J72j82K41j22j06j35
6745a63L6J82Q9k54Q2q2J37q3P2L2j67O4M08k78o7J86k41P9jJ68k24k8l3J45M8
6770A07k11j2Q4J19k10K09j17j1M1j03K45k17K52j83N9J7l5k7P5q7n9N8J04j12
6794a4k2n5L9J08J80j88l2n8K15j82J62k43k1K01j69N4R4j9j87O7J87R5l16L5
$$ y = [-114, -139, -85, 39, -114, -96, 21, 26, 21, -56, -77, -53, -111, -16, 39, -96, -39, 53, 55, -218, -133, 107, 17, 124, -22, -78, 114, -24, 16, 61, -132, -3, 142, 139, 158, 57, -36, -147, 135, 86, -74, 21, -89, 58, 97, 32, -21, -138, 23, -41, -96, 139, 176, 73, -81, -70, -66, 14, 190, -93, -85, -18, -16, -72, 57, -45, -113, 104, -127, -44, 63, 57, 3, -59, 22, -27, -40, -72, 64, 128, -70, -74, -32, -89, 69, 105, -23, -137, -79, -52, 51, 46, -94, -114, -43, -130, -61, 20, -12, 26, -207, -88, -17, 55, -60, 47, 66, 94, 30, -143, -14, 71, -160, 43, 22, 9, 99, -50, 82, -111, -40, -58, -44, -31, 141, -41, 200, 78, -28, -163, -127, 55, 144, -110, -28, -110, 27, -56, 16, 48, -119, -55, 353, 75, 8, 194, -47, 32, 31, 199, -25, -53, -86, 59, 107, -104, -116, -32, 87, -123, 86, -31, -42, -1, -104, 141, -76, 176, -7, 52, 69, 34, 7, 82, -5, -64, -6, 98, -14, -36, -91, -52, 56, 236, 48, 16, -42, 173, -9, 153, -90, -111, 90, -79, -25, 69, 50, -137, -70, 117, 212, -104, -69]
6818f9J36j51K04M1l39K06j34J02m2Q9o0r6N0n0J46J02j01N6j52N3j01J69n0j19
6842a10J93l5j33J77k64Q3J52l4r7o5o6J17j0K49k43k8j5M9K01j03j15L2l8K6
6866g7J16Q4r5LJ3q5L2L4K2j98J55J0n0j20Q8J19p0M1K9L6j67J63k10J55j54J04
6892b2M9j48J81m5Rj71J54p5K9j58J59O1j45J37K2m0J12j19L2M1m7O9p9l1m0K20
6918A55l7j33O1l0p5J59p7j66L17j68j34K45j16n2L9j10J7J29n3j6J64p4k7q7
6942f9K5L9ol4K45k41Q7k13R1k0Q3or6K70k52lJ95j58J22M8m5r2N0K8J6m8rj73
6970a66K67M7j58N7m1r4K19m3j4k9j1L8m6j42R4q2J26k9J9k03O4Q7L6P8j56P9
6996ck1P0j05k8J91m42K79J71r6j25J57L0j11J00M6lj03M1J69j61l2O4j14r5J36
$$ y = [-69, 67, -84, 120, 161, -178, 28, -106, -4, -46, 43, -17, -113, -63, -113, 33, 135, 34, 90, -62, -9, -110, 59, 9, -110, 83, 48, -85, 92, -172, -89, 63, 29, -68, -133, -199, -82, -92, 157, -86, -114, -129, -80, 121, 18, -97, -65, -103, -77, 39, 123, 28, 31, 44, -41, -9, 25, 47, -151, 4, 14, -36, -156, -68, 51, -19, 22, 51, 87, -80, 83, -127, 28, -126, -22, 27, -121, 60, 15, 24, -147, 7, -68, -39, -197, -38, 23, -122, 15, 37, -3, 109, -10, 22, 63, 16, 85, 6, -25, -65, 155, 118, -15, 46, 16, -59, 100, 23, -143, 174, 6, -128, 117, 1, -51, -12, -122, -105, 24, -29, -45, 119, 45, 18, -69, -44, -5, -11, -45, 200, -41, 46, -167, -76, -96, -13, -19, -115, 155, -97, -100, 95, -63, 59, 107, 62, -30, 20, 48, 64, 16, 7, -166, 101, 148, -10, 47, 6, -88, 131, 88, 74, 45, 34, 72, 26, -116, -22, -104, 22, -7, 12, -191, -127, -40, -4, 74, -82, -3, -24, 46, -59, -87, 104, -338, -59, 112, 16, -109, 48, 78, -33, 67, 113, 110, 7, 48, 217, 56, 24, 88, -26, -121, 15]
7021A5R6k10J48l25J68J04J57M7o0k52J30o0J50q0r2R1j7j5Oo3J20n4k5N7j9n0
7047c3Q0p0J52j30m4J14j65jj5J15J0j49J45j08L8j04L0K09m2k09J36n9J49j00
7071e1L7P5J00j91j05K48r2MP0K5l41K15j2K1q5P9O1j16Q9J16l9n9K0j8q6L5k4
7098b4J25m7k71M07k12J55n7m8ql6J04k4m6j17o4K22o2mlM7j5j3k1q6J8r5Q3M9
7126d3J01j27J25m7O4j16k8J84m4J7j57K5k3jJ04j93J29j63Q1J57J08j75J13j16
7150b5q9J36K7n9P5k01J51J6r6q1J96qm4R6Q0n5m7j66J76p1k15J00P1j7kL2k0
7177d0P6N8p2J10l58K12J70l44J77m7J82k39o6L19m7m0o6K2J5l9l0J59k14J05
7201Cjj17J3J34j16J20O2q8kp4L1J08k05P6J04M2m7j42q9K38j16J49n4j42NJ73
$$ y = [15, 111, -99, 49, -276, -108, -4, 153, 200, 140, -112, 18, -42, 108, 28, -64, 27, 10, -5, 1, -62, 58, 4, -21, 36, 17, -33, 47, -23, 129, -1, -45, 69, -96, -97, -112, 3, 13, -136, 9, -99, -61, -165, -135, 74, 32, -177, -41, -100, 49, -51, -14, 61, 161, -30, -135, 113, 21, 25, 95, 120, -221, -6, -18, 3, -82, -3, 58, -58, 31, 147, 108, 49, 69, 51, -35, 0, -24, 101, 54, -217, 190, -22, 133, 76, 28, 20, -16, 88, 64, 18, -99, -163, 59, -3, -7, -10, 37, 22, 9, -12, -98, -80, -175, -92, -43, 58, -69, 56, 9, 73, -43, -71, 113, 69, 86, -71, -46, -69, -70, 34, -159, -30, -193, -112, 45, 153, -22, 91, -25, -114, 22, 49, -10, 65, -136, 15, 31, -65, -146, 50, 42, -2, 94, 174, 119, 72, -94, 82, 11, -204, -104, -33, -50, -52, -20, -40, 36, 94, 22, 132, -226, -14, 156, -188, -11, -58, 124, -115, -181, 138, 91, 51, -15, 7, 22, -17, -47, 112, -102, 3, 2, -115, -102, 32, -84, 36, 98, 10, 8, -66, -35, 73, -132, -56, 48, 90, 43, -99, -188, 50, -66, 83, 29, -113, -108, 65]
7227F5k30K66r3q0k9P8L0j13J37N0j58J19J9m8L5n0J29l8q8J88m3j6O9k14J00
7252H5p3o0L0n2oPj1J8J36Nm8l2k9m6j6p9K22n0p7K06k80R8r8J72j44R2K1l5J6
7281b8o7J0K18j17r9R4J3mp1Q2Q8j19j28J36R3r4J4m9q2RM9J09j80N1m3J31J1
7308B7N2m5N5O0k23p0K42j7O4j14p6j68R6J58j52J59Jr8J14m1o4K6K56l00l7J56
7334F1j89J88l2m0R9p8J28k83Q4R5K01l22M2K8r4K3J27n2J10j80P4l0R5r9M4k8
7360b8J35j6M8j43%q6kRM9j17m1J26L1J58n7J11j93l9l9J49o0k2J25k35M4j3M4
7387f2P4N3j5rO2j34J8o1M8j65J55q5O2K7J39r8lNk1Q4q5O9j39l5M1j12L91j18
7415H6j0J3j37M6R7j68L6J9O9M7p1r0pj43N2N9J05n0J53M4j17J07j09j53J58j02
$$ y = [65, -165, 101, 8, -72, -101, -23, 7, -106, 31, 81, -77, 42, 61, 13, 48, -2, 127, 89, 1, 189, 146, 130, 199, -15, 85, 12, -48, -18, -70, -76, -69, -80, -62, 74, 79, 31, -1, -30, -76, -92, -171, 51, 1, -76, 130, -150, -52, -150, 22, -122, -30, -9, -44, -28, -95, -85, 133, 16, -83, 11, 24, 20, -51, 31, 119, 0, -128, 8, 101, 7, 21, -28, -110, -101, -52, 57, -123, -72, -115, 16, 27, 79, 34, 89, 149, -74, -144, 98, 81, 145, 31, -45, -213, -117, 41, -111, 48, 49, -49, 65, 24, -40, -14, 242, -58, -95, 61, -128, 60, 28, -12, 87, 9, 137, -146, -62, 33, 234, -88, -46, -18, -112, -89, 38, -14, 96, -84, -10, -40, 55, -44, 0, -28, 107, 91, 139, -4, -4, -90, -92, -83, -34, -151, -192, -66, -35, 123, 66, 177, -16, -55, -94, 55, -5, -27, 98, -137, -93, -106, -62, 12, 65, 50, 41, 103, -31, -13, -74, -26, -191, -36, -121, -59, -32, 107, 9, 6, 11, -10, 74, -11, 58, -81, -116, -75, -187, 204, 86, 76, 89, -48, -2, 95, -73, -37, -18, 51, 98, 27, -63, -70, -213, -161, -102, 3, -47, 106, 150, 33, 140, 31, -122, 36, -66]
7441f6J80Kn6j78Q8P2j08J11n0JQ0j30O6qj03M3r8l5J55J12m5j15J19m2J48o8
7467G5Q3j79K7o7K9N4p8j8K43j27p9M8r7K5J8N2p8L6J43j35J28j76P5N4l2O2k28
7494a42j4J08L6j5J12k78K19m4n5J43n2Q7Qj67j67K44o3O7Nj22R7N3N5k01Q1J3
7520HJ03K5p9j01k0J9J10o4j9Nj95K04J95j12l5p2J39n8qj01K41k46J20j27O5
7545cj06pQ0J5p7R8Qr8J76k13J87pP4o9K3k02j09l8L05O0q1n7PM3Q4l62J57M2
7573g0R8j40J50o1j21K13l7qq5J30j05p9N6Q2q8J14nj29o2J82j85K11j37J21N0
7598I5l4L0J01j84pr4k1O8P9k5K7j58J17j5k9Q3mm7J8N4n7r9J05j6O5K0j40J6
7626e2J10j37K8R1o0K8j0J6j5qp0J8M8j3j41J86o7m5J22J19k7j52l5J79k87L1
$$ y = [-66, 114, 116, 60, -118, -30, 42, -66, 45, -5, -4, 76, -54, 12, 4, -99, -56, -154, -189, -34, 78, 33, -82, 37, -5, 143, 75, 158, -21, 6, -61, -32, 22, -56, -74, 169, 42, -37, 11, -86, -61, -43, 9, -69, -33, 110, -25, 103, -73, 2, 56, 24, 86, -142, -156, -48, -12, -27, 85, -193, 26, -18, -73, 70, 18, 105, 113, -54, -221, 23, -40, 27, 32, -90, 7, 60, 115, -86, -5, 8, 111, 136, 57, -44, -64, -45, 65, 1, -18, -13, -208, -4, 191, 79, 44, -28, 111, 53, 45, -56, 185, -61, 59, -68, -3, -109, -116, -36, -21, -98, 0, 8, -90, 86, -127, 60, 53, 127, 58, 81, -121, -230, -268, 37, 97, 16, -41, -34, 9, 93, -269, -112, -70, 28, -112, 38, -23, -144, 69, 32, 24, -61, 69, -36, -115, -59, 23, -65, 49, 44, -85, -147, 35, -150, 61, -76, 45, 95, 61, 91, 192, 8, 1, -93, -114, -46, 33, 8, 35, -123, -6, -21, -50, 33, 29, -18, 0, 54, -3, -102, 3, -13, 52, 72, -68, -52, 58, -79, -51, 40, -20, 8, -2, 14, -1, -9, -79, -61, -13, -26, -167, 19, -48, -93, 29, 148, 121, -31, -66, 113, -174, -143]
7652a43J00j6J53q2j33N5O4J1o5qJ38j40J48n1L8j71l4J42Q4q0Q6j82P8P7j03
7677c4n9M2j40J47J52j29J8J40o0l2j65Q8o0J19jj33N2J34p4q3J30NL7j83J38
7702D9m1l5j32Q8q0M6K67m38L76j64J38J2k01K56mL0l13L23j60p1q2R5j93J44
7726i0J14j63L08k79N8O3j36QK99j96J75j99L14j53k5j74L2J74j20K15k47q8J91
7749H1l3m2O0p4J27k5j02J34r5q6N3J00L6j86M4j82K95k23K7J86j99K19j04L2
7773D3L0m0n1J34j07o1RL6j8O4O6k50M9Q4L6J9K09q9o8o7o6R0O0j38l7O2o3j30
7801a94L83k99J23N6M4k78jK86j84P0q8J47K8L4P3k18Mo5P4K70l83J52r4K47k82
7826i5j20K26J7j49J78j7j78O6r3L68k00l7J62N3j66L8k05K19k50J53J15Q4j48
$$ y = [-143, -43, -59, 94, 12, -121, -66, -2, 9, -56, -64, 74, -66, 82, 31, 69, -102, -136, 6, 90, 10, 96, -86, -8, 69, -34, -93, -51, -191, -44, 108, -21, -3, 137, 77, 45, -120, -32, -92, 27, 26, -107, -55, 79, 5, -78, 52, 57, 94, -89, 49, 8, -27, -159, -71, -151, -105, 162, -276, 100, -64, 74, 86, -115, 141, 137, 167, -146, 177, 17, -54, -136, -41, -234, -90, 24, -139, 169, -110, -52, 11, -125, -117, 182, -14, 161, -38, 276, 123, 98, -76, -44, 130, 10, 225, -22, -110, 81, 48, 6, 66, -8, 119, 94, -8, 126, 31, -55, -2, 98, 134, -52, -8, -190, 105, -118, -91, 95, -104, 115, 11, 43, 73, 33, -18, 116, 9, -52, -43, -7, -25, 39, 105, -145, -96, -12, 24, 43, 252, 163, 95, 28, -38, 52, 112, -26, -63, -1, -64, -194, 189, -110, 13, 69, 113, -165, -166, 120, -64, 6, -82, 65, 93, 127, 200, -18, -14, -79, -5, 265, -118, 34, -60, 187, -95, -215, 11, 28, -121, 57, 40, -138, -72, -165, 203, 3, -34, 128, 181, 15, 53, -152, 67, -183, -30, 85, 169, 21]
7849B1K0j75Q4j1M5O2l1R4j27O1j30R0K11l07J05M8j67R0m6J14j3M9k07J25q5
7874h0Q0K5j86K30J0j52K17j57K50l44L7J78k85J28P9p8J81l10K12p1J39k12m5
7897a54N5P1M7M9j30N1n9K25k6l38K86M2k31J73kk73K99oj55J27N4j08N5M2j33
7922c9K64l13j4J72j3j31J06j06L7n1M0j11J79m1j04L2J19k2L0Q3k10J26OMp7
7947c4J08m3n9n4J12J3l3m3k13L40Qk06J79j7Jj01J30k1J26k50J59m5k4k18M7
7972a38K6J54j5J2j62K63l9j50l2J9R0R6k65J45M5ll3p2N6r8P8j22kK00m0J0m1
7999a8J50j23L9KJ70k35l0l1j4J97m3j68J31n1J12q9r5O3J31j73K27j37r9K52
8023A68k36L0J5J21j98J04J71m2j43m1J33n8j65K34j2P0k44J37o6M4q4J39j77
$$ y = [21, 41, -134, -50, -61, -16, 46, 15, 109, -18, 43, -87, 3, 214, -93, 12, 60, -107, -17, -63, 51, 38, 87, -120, 5, -80, 0, 25, -161, 69, 79, -73, 144, -13, 237, -107, -70, 108, -177, -49, 30, -48, 133, -177, 35, -36, 103, -109, -154, -99, -28, 19, 68, -62, -11, -70, 155, 129, -209, 77, 119, -112, 61, 59, -214, 85, 79, -76, 51, 105, -3, 52, 94, -39, 225, -88, -102, 70, 57, -74, 32, -74, -37, -88, -48, -159, 20, -21, -125, -93, 26, 4, 34, 117, -93, 33, 39, 43, -34, 74, 31, -28, -82, 30, 43, 10, -33, -246, 94, 102, -104, 75, 58, 59, -42, 88, 67, 193, -57, 102, 57, 33, -185, -138, -112, 42, 27, 39, -123, 140, 101, -49, -81, -62, 28, 124, -141, 4, 49, 46, 13, -59, -3, -101, -23, -145, -147, 53, 13, 23, -18, 132, 9, 48, 50, 220, -15, -45, -76, -90, 107, 64, -104, 27, -24, 88, -1, -96, -33, 98, -75, 152, 15, -84, 168, -68, -38, -23, 98, -100, 4, 175, 133, -10, -51, 82, 24, -141, 93, 81, 151, -93, 44, -22, 22, -62, 77, -100]
8046a00J81j62L1Q2O0j68M7o5Q3L7L0o3k1J01l9n2P1n3O9K1j86J90K8K5k37p8
8072a68K85p5J69k99L3N1J24l4j34K40l06K81l04J17l4M0nj53K54j49J55j74J83
8095I7mp6o5J30J4o1O4q3M0O6k49J45lJ5lj47J45Q8O6j29j94L2J60j06N2j14P5
8122d5J68j90J74j21K1q0M8R5q8J28j17J1J30k97J70Q0k33J20J95j30m3o2J49
8145H3k54L33l00R9r5M7R6j05J8J19kK1q0J3q8K04k24J2J89j25oj1j25J06RN3
8171a3o1Q2m8L2Q8j79O0K3J5q4K9K1J36q7K2n3P5J3Mj22
$$ y = [-100, 81, -81, -50, 32, 92, -76, -29, -94, -11, 26, 56, -7, -28, 73, 34, -18, 53, 0, 69, 90, -96, 94, 122, 147, -90, -168, 117, 42, 211, -88, -55, -4, 120, 86, -48, 192, -114, 167, -137, -20, -54, -14, -19, -172, 82, -67, 88, -86, 97, 93, 17, -48, 82, 96, 35, 99, 16, 56, 122, -127, 18, 15, 30, 27, -120, 25, 113, 179, 50, -144, -112, 48, -58, -6, -120, -45, 123, -67, 107, -14, 7, -73, -25, 70, -18, 110, -7, 4, 134, -163, 7, 87, -146, -26, 169, 39, -4, -66, 83, -171, 162, -138, -39, -134, -87, 9, -96, -78, 41, 39, 60, -20, -7, -95, 109, -115, -103, 86, -39, -45, -56, -181, -75, -66, -13, -74, 8, -40, -8, 80, -99, -39, -16, -1, -85, -56, -35, 101, 14, 36, -17, 58, 71, 75, -47]
8191d7
$$ Imaginary data points
##PAGE= N=2
##DATA TABLE= (X++(I..I)), XYDATA
0@%%%%%%kKqJ6j6J7j7K4l5M3n6P2q9J06j24J49j80K14k48K90l40L95m59N25o00
31c21O84p77Q83r96J123j263J418j586J767j972K193k433K696k982L296l638M015
48B107m425M875n374N920o527P198p949Q797r755J0855j2127J3621j5404J7576
62I388k0292K3800k8537L5316m5905O4942j09926M20147M06195m50119k18716
73H6293k19704j93459k54073j2975J58680L05850L06202K92560J12501o1672j96788
84C23415k15652k79004k75116j42037J03425K07308K10717K26377K69229J46941
94E75603p7596k40286k57380k36803j77325o9618N6308J43103K37624L02913K29913
105D86456J9329j39242j75458j91788k30720j92417n9472Q1925J90558K68171
$$ y = [0, 0, 0, 0, 0, 0, 0, -2, 0, -8, 8, -8, 9, -8, 16, -19, 24, -32, 40, -49, 57, -67, 82, -98, 116, -132, 158, -182, 213, -246, 279, -321, 363, -414, 469, -527, 596, -667, 751, -835, 932, -1040, 1153, -1280, 1416, -1566, 1730, -1908, 2107, -2318, 2557, -2817, 3103, -3424, 3774, -4175, 4622, -5133, 5722, -6405, 7216, -8188, 9388, -10904, 12896, -15641, 19675, -26230, 38712, -71214, 348933, 755128, 305009, 86293, -133411, -326870, -580943, -593918, -435238, -129388, 176814, 469374, 581875, 520203, 323415, 107763, -171241, -446357, -588394, -484969, -277661, -66944, 159433, 428662, 575603, 498007, 257721, 341, -236462, -413787, -483405, -427097, -283994, -46370, 256543, 486456, 505785, 366543, 191085, -703, -231423, -423840, -483312, -401387, -210829, 57342]
115E7342K55713J27121k3041r6998j40453k18232k56130j53485J8455J21268J67872
126a40568K30817K35632J02114n6846j12254j33930k06487k29895j12105M5420
136c78102J24903J66366K18516J99881O4119p1325j14509j33460j86863j92979
146c03453r1763M1096J34026J95141K09687J35564J7054n4083q4432j43605k06856
157a51624j78248m9675P7347J43215J73686J75614J16093J8103n4003j05252j67181
168a925j95766j29404j0651P9626J35988J72597J60724Q7105K850n9049j20093
179A22002j74685j68541q9183O330Q1800J42568J69966J31099N2554o473n1151
190B16286j19992j83045j62302n6606M6600R5977J18665J35533J19214O1316p731
$$ y = [57342, 313055, 440176, 417135, 320137, 179684, -38548, -294678, -448163, -429708, -308440, -140568, 90249, 325881, 427995, 371149, 258895, 124965, -81522, -311417, -423522, -378102, -253199, -86833, 131683, 331564, 395683, 324358, 209849, 76389, -110474, -303453, -395216, -354120, -220094, -24953, 184734, 320298, 337352, 283269, 198837, 55232, -151624, -329872, -379547, -302200, -158985, 14701, 190315, 306408, 324511, 270508, 165256, -1925, -197691, -327095, -337746, -258120, -122132, 50465, 211189, 298294, 301144, 242095, 122002, -52683, -221224, -310407, -304077, -222277, -79709, 90257, 221356, 273910, 267437, 216286, 96294, -86751, -249053, -305659, -259059, -163082, -44417, 91116, 210330, 271646, 263915]
201B63915p6307j44533j70143j16702k7111L9578Q5259J26985J36786R8318M1041
212B57086j5047q3343j50345j60261r5451o952N3957R0003J15941J21354R0972
223B17914L6332l0332j04733j54683j37506o2057J0422N0568Q3435J17333J20098
234A46791P7936J4352n0866j11303j39472j10310m6763J0386N4877R4026J13138
245E2792R9454O2234R437n9686j21234j32104q5535k4365J5686M6092Q6696J17295
257F6762J03837M8549j9018p6564j10615j07157p0251k6342J2483N6704R9798
268b1814J12829Q4618L2346k8103q3705j09684r2513n3950k0146J5284O2723J04652
280B537J08262P0867J3434m4323q5085r6937p8616m6776j4568K2605O9602J04698
$$ y = [263915, 187608, 43075, -127068, -243770, -270881, -231303, -146044, -19059, 117727, 216045, 257086, 242039, 158696, 8351, -151910, -247361, -254313, -200356, -110353, 5588, 126942, 217914, 254246, 223914, 119181, -35502, -173008, -235065, -224643, -174075, -90640, 26693, 146791, 224727, 239079, 188213, 76910, -62562, -172872, -219635, -209249, -154372, -60346, 52792, 152246, 214480, 223917, 164231, 42997, -89107, -174642, -199007, -183321, -137229, -50533, 66762, 170599, 219148, 200130, 123566, 12951, -94206, -164457, -190799, -178316, -121612, -21814, 91015, 175633, 207979, 179876, 96171, -13513, -106026, -159976, -180122, -164838, -102115, 2537, 110799, 181666, 195100, 150777, 65692, -31245, -109861, -156637, -171205, -148600, -78998, 25700]
292B5700R9644N4628l697n3069q2034q3816o6134m2857j4250L0928Q2001J03642
304E0686Q2294L6106j2705n4160p6692p6257o1877l9957n666M3378Q6924R6653
316F8727O8793K2132k2559n3897p0655p1600n9960l4406O356N5479Q8843Q6544
328H3797N2284J0157k6008n3206o7683o7614n5024k7564J8111O6015Q7150P1673
340I2088L7335K622k7196n0685o4963o6926n1415j5318L2270O9357P8176N9105
352I4450K7764j573k7235n0636o6529o4862m2106k501M0947O9276O9515M7861
364I4371K1378l576k9589n3479o5773n9602l3110Q834M8697O6740N8583L8544
376I2018J7904n255l2317n6438o6466n3526j9364K0631M9501N8720N1354L4773
$$ y = [25700, 125344, 179972, 176275, 123206, 41172, -42644, -108778, -151635, -165885, -134957, -52956, 50686, 132980, 169086, 156381, 102221, 25529, -50728, -112605, -152562, -158228, -114850, -27926, 68727, 137520, 159652, 137093, 83196, 12541, -59059, -119019, -153425, -147069, -91590, -2747, 83797, 136081, 146238, 120230, 67024, -659, -68273, -123297, -150861, -132750, -66735, 20415, 92088, 129423, 132045, 104849, 54164, -10799, -77725, -129140, -144458, -112188, -42831, 35345, 94450, 122214, 120641, 93406, 42770, -23759, -88621, -130727, -133228, -92281, -23005, 46510, 94371, 115749, 112173, 82584, 29105, -36668, -96270, -129380, -120546, -71849, -5109, 53474, 92018, 109922, 104667, 72350, 15912, -50554, -104080, -123444, -102813, -53312, 5408, 56762, 91535]
388I1535J4760r229l6770n9475o3044m3264r025K6590M9859N3509M3796L0558
400H9800J3150j2791m3212o1582n7695l2246K713L0491M4046M6869M2515L0675
412I2733P318k1967m7666n8715m8693k1795Q348L0326M1817M4760L9824K5994
424I2284J386k7896m9926n4101m0131j5040J2468L2667L9897L9575L6115K3886
436I1184k605l3767n2908n0708k9934m747J4686K7201L6355M2115L7832J7051
448I1755j4059m0612m8744l8722k1248n702J0973K9610M3062M2656K7746M780
460H1495j7868l5755m3269l7772k1258M04J9125L1400L6464L5864K6337M420k2794
473E6793m1892m2948k7939r523K750J2485K6945M1399M1765K0029j0867l1736
$$ y = [91535, 106295, 97066, 60296, 821, -62223, -105487, -114512, -87922, -38063, 15446, 59242, 89800, 102950, 90159, 46947, -14635, -72330, -104576, -101863, -71372, -27326, 19543, 62058, 92733, 100051, 78084, 30418, -28297, -76990, -98785, -90437, -60111, -18294, 26466, 66290, 92284, 93670, 65774, 15848, -38253, -78384, -93424, -80956, -48289, -8392, 31183, 67298, 91184, 88579, 54812, 1904, -48804, -78738, -83485, -68799, -41598, -5243, 36872, 74704, 91755, 77696, 37084, -11660, -50382, -71630, -77332, -66359, -36749, 6313, 48969, 76715, 81495, 63627, 27872, -15397, -53169, -74427, -74023, -54898, -23498, 12966, 48830, 75167, 79587, 56793, 14901, -28047, -55986, -65509, -62759, -50274, -23329, 18070, 59835, 79864, 68997, 37261]
485C7261l3862k7451k4143j9168j166K3893L9134L7852K5281R522p614k3892l3913
498A734l3760k3713q486P761K2854L2787L3538K5692Q840j2950l0501l3020k4415
511c3639j6111r049L926K3641L8794L6646J6802m942j6435k0493k5555k8193k0648
524e5256m433J4004K7272L3483K7873J3137l831j5722k2299k6794k6698j6589
536e5853J703J7524K5787K9508K6030J1210q805j9031k0392k3032k5919j5103
548e6373O952K2288K5346K3560K0742R677q259k1340k2709j9935j9362j2957O073
561d6297K4510K7668K0265J4041O353p766j9359k2212k1129j7717p429R352K3788
574a5932K6247J8092R198M093l677j8310k8817k4171j0251J741J0462J8908K3219
$$ y = [37261, 3399, -24052, -48195, -67363, -68529, -44636, -5502, 32350, 57631, 67153, 59539, 35647, 1734, -32026, -55739, -64225, -56464, -33610, -823, 32715, 58407, 67247, 54297, 23796, -9224, -33639, -49750, -58799, -54873, -31232, 7562, 44208, 61010, 56068, 39633, 19140, -6415, -34608, -55256, -59689, -45685, -18413, 15070, 42943, 56080, 52249, 36527, 14228, -12566, -39264, -55853, -54150, -36626, -10839, 18669, 44699, 55909, 47104, 28073, 7681, -15351, -41270, -56373, -49421, -27133, -1787, 21773, 42515, 52192, 43933, 22593, -116, -20051, -39413, -52370, -46297, -21787, 5881, 26146, 40187, 46540, 38774, 19415, -2797, -23926, -41643, -49072, -39720, -15932, 10315, 28407, 37605, 41698, 38021, 19711, -9106, -33277, -43528, -41787, -31325, -12417, 10802]
587A0802J9886J1081j47j1297k0189k4278j9815p404M122J0984J8624K4347J8389
600C5105L061n982p957j4966k4704k2101m968J0756J5639J5008J6059J4986P228
613C7164m163j2747j8186k1415j6325j607J0482J2267J2963J7516J7098N218r039
626B9226j5046j6764j6694j3676l958Q185J6874J8451J4910J0028K603p285j5873
639A0981j8781j6181r605N66J0271J5814J6987J3975O970j118q450j4995j7808
652a1374j4359m729K995R265J4067J5607J2245N918j465j0651j7131j4679p828
665b2119k909l53O195J5360J9181J1665M56n729q313j1330j4631j1792l931M556
679b3694J0433J4172J4063R493L321m353j2029j6079j3132n891l02L943Q761J3903
$$ y = [10802, 30688, 41769, 41622, 30325, 10136, -14142, -33957, -41361, -37239, -26255, -7631, 16716, 35105, 38166, 32184, 24227, 9261, -15443, -37544, -42512, -31756, -16117, -1109, 14950, 29936, 37164, 33001, 20254, 2068, -19347, -35672, -37279, -26797, -14530, -1567, 15949, 33047, 38265, 29226, 14180, -2584, -19278, -32954, -36912, -28727, -11853, 6598, 21508, 31536, 34139, 26854, 10981, -7800, -23981, -33586, -33020, -22749, -6935, 10052, 24027, 30997, 29879, 21429, 6434, -11374, -25733, -30462, -27467, -18202, -4135, 11472, 23717, 29635, 28170, 17519, 388, -14291, -22119, -25028, -25381, -19186, -3826, 15355, 27020, 27476, 21747, 13434, 2104, -12527, -24319, -28250, -23694, -13261, 911, 14974, 24467, 27788, 23435, 11406, -4673, -17805, -23696, -23998, -20055, -11294, 2609]
693B609J4934R611l78q589j3185j2527r269n332q78N108J1707J3802J1008M432
707B3053j015o678j1218j2992r848l362K486P052R486J0302R252N491q80q043
721A3086j2028j0975p346k977J538O746J0749J0576P482L525j078p502j1816j1190
735a1210p212k392L223Q368J0998R986O154K093l237q027j0952j0799p128l50
749b0485O164R693R783P699M684P11m654r205j0121p548m282J83N423R546R317
764F908O384K629r95m880p542p622o925m478N83N798Q705P800O333K801j446m711
780I342p334p914o845l627J002N920Q620Q658O105K850k227p290q581p047n039
795a3407k532J910O846R278Q276M962M32m397p533p390o497l978q3M063O584P158
$$ y = [2609, 17543, 27154, 26776, 18187, 5002, -7525, -16794, -22126, -23004, -17896, -6189, 7613, 18621, 23053, 22038, 15360, 4142, -8850, -18698, -22060, -19574, -12522, -3036, 7266, 16518, 22009, 21129, 13086, 1058, -9917, -17263, -20240, -18702, -11956, -1207, 9369, 16851, 20376, 19298, 11796, -20, -11210, -18422, -20814, -17591, -9223, 1775, 11761, 17915, 20008, 16771, 8744, -2208, -13007, -20135, -20485, -14321, -4628, 5155, 12854, 17538, 18249, 13595, 4390, -5731, -13279, -17561, -17378, -11955, -2409, 6908, 13292, 15921, 14926, 10046, 2504, -5118, -12043, -16521, -15938, -10140, -1435, 6365, 12698, 15499, 14053, 9342, 2008, -5906, -12751, -16378, -15376, -9456, -836, 7822, 13927, 16777, 14550, 7260, -1321, -8368, -13407, -15939, -14029, -7183, 2095, 10371, 15333, 15765, 11368, 3835, -3555, -10052, -14030, -14113, -10050, -3466, 3692]
811C692O219L766k88m265p039p109m607k134M57L127N393N839N669L711K26m199
827H458o530o014m830k982J28L697N809O196N447L208j99l800p071p647n402j427
843a2959K294M430O025O173M853K012j778n592o913o006m050o76L101N641O267
858B822M224K617O92k141m623n818n251k984M71L274M363M734M063K658o9k351
874F681l636m682m715l123l81K752M862N092L798K417l1k295m143n158m347l003
890i912J69L576M956M895M225J958j355l620m732m045l531k280J114M003N188
905F09M530K970O52j863m102m025l192k309j409J094L623M887L629K207O04k202
921E703l784l618k288k122j456J175L835M415L187J944K94j747l515l999l176
$$ y = [3692, 9911, 13677, 13389, 9124, 2085, -5024, -9631, -11765, -11308, -8181, -2788, 3051, 8720, 12431, 12657, 8458, 1928, -4086, -8916, -11898, -11770, -8073, -2264, 3932, 9379, 12587, 12388, 8588, 1517, -6130, -11532, -12959, -10665, -6235, -210, 5963, 10816, 12828, 11050, 5458, -1455, -7461, -11511, -12187, -9086, -3445, 2822, 7046, 9663, 10355, 8214, 3591, -2227, -7478, -10462, -9991, -6717, -2354, 2380, 6443, 9101, 9032, 6681, 3045, -1637, -6352, -9475, -9856, -7104, -2242, 2850, 6648, 9065, 9034, 6739, 2596, -2562, -6909, -9912, -9743, -6167, -1211, 3684, 7909, 9867, 8512, 4892, 160, -3885, -7416, -9696, -8582, -4579, 609, 5139, 8109, 8761, 6898, 2796, -1229, -4421, -6730, -8139, -7045, -3422, 1465, 5094, 7301, 7905, 5703, 1919, -1699, -3987, -6109, -7565, -6390, -2555, 1860, 5047, 6991, 7285, 5538, 2023, -1976, -5152]
936e152j384k64J406L174M247L941J514o08k446l761l343k449j768Q9K108M157
952e39L983K903M06j398k240k230l569m041j006K887L065K054K281K977J121j497
968E157k902k751k664k173j037J566K864K633K519K455M37k283k541j590k068
983b378l638j216K768M456K169Q14J506R96q54k721l592k871j229P02J763K610
999g15K339J994J786J25k124l150k510j510j600p5K197L590K821J069J67q01n71
1016C032j793l367l652K39K295K071R72J825K216J134q11j996k446k582j792K91
1032d364J467J084J421K580K482J47j564j924j637k171k292K15K042J624J358
1047D68J817J843N14j251k404k569j897n90Q87J179J013J433K421J542l08j841
$$ y = [-5152, -6536, -6800, -5394, -2220, 2027, 5968, 7482, 6874, 4428, 667, -2676, -5125, -6893, -6804, -4696, -539, 3444, 6347, 6753, 5355, 3115, 885, -2684, -6725, -7731, -4844, -1779, 275, 2556, 5533, 6654, 5157, 2255, -496, -3160, -5333, -6370, -4804, -1940, 693, 3212, 5667, 6104, 3821, 1280, -310, -2378, -6016, -7232, -4464, -8, 2161, 2975, 4481, 5477, 4623, 1902, -1690, -4561, -5790, -5088, -3325, -715, 1624, 3618, 5404, 5529, 3405, 255, -2255, -3765, -5365, -5440, -3243, 347, 3168, 4237, 4404, 3603, 3032, 1239, -2128, -5780, -5541, -3246, -1175, -203, 1622, 3838, 4972, 4161, 2165, -281, -2863, -4655, -4364, -2897, -1813, -392, 2188, 4670, 4817, 3253, 1329, -308, -2479, -4771, -4556, -2514, -890, 468, 2285, 4128, 4642, 3391, 987, -1582, -3479, -4069, -3182, -2003, -990, 443, 2864, 4406, 4098, 2257]
1063B257j774k415j570M4Q38N22P42K423K386N54p62j062k033k265j032K70L89
1080b488M82J023K422K300K05j640j018j140k099j648O14J285K9P18K802K009
1096C856l98j393r91j756j469k80J36j05O14J816K527J208q35j753r24o74r20
1113a341j147n53Q54J398J794J572N95j155l48p86k063j197j01L20n0J296K559
1130A647J059p3n68j095j233p84l41q35p81Q52K223K266M80j194p59M37m68k137
1148a304j169j08L71Q31K107J529j43o84o1p5j444j406n46J09q5J039J784J498
1166B243l6r10k93J65j114j333j107k57J076J472J807M30q27j75N04m01j967j555
1184b278q9M80P61J186J325K39l53K96k30r01j424p65m38M06Q46J353J117j79
$$ y = [2257, 483, -1932, -3502, -3458, -2620, -2098, -1356, 1067, 3453, 4007, 3245, 2183, 150, -2115, -3147, -2877, -2488, -2006, -983, 1439, 3739, 3944, 2304, 1286, 146, -1953, -3601, -2987, -1702, -1673, -955, 1847, 3856, 3458, 2065, 1074, -682, -2151, -2431, -2295, -2400, -1786, 30, 2557, 3765, 2930, 1177, 253, -421, -1341, -2488, -3041, -2187, -789, 1005, 2577, 3172, 2017, 1669, 883, -1180, -2377, -2478, -2158, -2208, -912, 1647, 2706, 2633, 2065, 970, -263, -1047, -1388, -2223, -3004, -2152, 71, 2337, 2817, 1623, 864, 1301, 833, -1304, -2473, -2581, -2210, -1379, 728, 2257, 2114, 1430, 1369, 1294, -150, -1556, -2102, -1993, -2078, -1039, 745, 2243, 2207, 1297, 1004, 1169, 55, -1278, -2385, -2642, -1566, -94, 1713, 2143, 1316, 1141, 1645, 1244, -723, -2278, -2367, -1887, -1126, 60, 1385, 1624, 1271, 1567, 1337, 436, -988, -1753, -2191, -1785, -939, 414, 1531, 1352]
1202A352k49L39L02j315j937n59J55M59Q98J098L72n3L94P76o50k017j055j45
1220a835L57L05P16P85N95J24N88J60q29j560j115K79Q2M11N20R49K51K94O01
1239A678j7r86j673l05J3J16L69P73L72L28O36N81l29j659j125k75M73J79q9M74
1259d66R08O62P67M4j100j453k77Nj53j49M80N12R09L03N45j68j017r14m45L18
1279f89r3m4L54N19O31M32L97o27j008o68M82j9m48n77N15J031M88N55K4n84p24
1300e3%k45k99o23KP63O40O76L60R7p35p35l52J21l13m14J01O84J010O93M1p12
1322G07q15l96Q6m4k92j82M71O77N16P9m6n49l02j01J8l36J30k0K12K51L40K40
1344F44J21l32k13j28l20l54k81J75K85M79L57L29K05k65l65k40n69o97n4P87
$$ y = [1352, 1103, 1442, 1744, 429, -1508, -2067, -1912, -1453, -555, 543, 915, 862, 1256, 2032, 1382, -635, -1690, -1835, -1478, -1173, -457, 328, 923, 1047, 1635, 1795, 966, -594, -1709, -1430, -1348, -937, -417, 532, 783, 1077, 1678, 1661, 675, -998, -1303, -1290, -1174, -805, -32, 340, 668, 1304, 1885, 1556, -103, -1228, -1503, -1030, -851, -940, -466, 442, 1104, 1871, 1915, 815, -638, -915, -910, -1063, -1212, -732, -220, 689, 992, 1537, 1369, 352, -562, -1007, -689, -782, -826, -472, 47, 678, 1110, 1507, 880, -128, -796, -314, -333, -781, -1358, -843, 188, 676, 1231, 1255, 671, -53, -53, -298, -597, -1220, -1218, -455, 185, 861, 1221, 1318, 583, -152, -504, -383, -696, -1110, -1009, -325, 685, 1378, 1419, 707, -108, -504, -418, -462, -754, -936, -465, 212, 728, 807, 761, 212, -90, -191, -173, -509, -379, -399, -187, 64, 404, 644, 765, 433, 220, 92, -228, -582, -863, -688, -403, 76, 433, 762, 967, 702, 337, 97, -472, -1169, -1223, -436]
1364d36N30N41J10N1j92N2n32m57n58k84M39O23N92J96j84j52L5k08j03n14p5
1385e26p1l0N53L64J37J25l23j47L72mn79n78j15L16L72J68M3J32L60J72j32l36
1407B73p09m39K7K28L86L37L42K89R5m15j80n42k73N7k84K74N32L62K34K5l48
1428B71k1j62l84l65K05R7L56n6J88J42P2J35k80j02k92%j29nK30m44K73Q01M6
1451E76j5j87k78l21k28j80K68J85M7O5M60K62n9k83m26j60l99K22J57L45L3P4
1473A58K43K43p8n21l02j07o0J32O2M10L9pJ27k1k09q3j09l1L6j20p6J64L65k69
1497a4J52J87R7j57j79k46L3j34M4o1K00M29l29Q1M49k90l40l97J89R1o0J31M36
1520C12K03k58j92M8m7L8n22j34K81K33K43m6K66r8k86j33M6q9j72P3K53J51R6
$$ y = [-436, 94, 635, 745, 796, 604, 656, 124, -333, -891, -1175, -736, -113, 479, 675, 491, 339, 374, 166, 63, -451, -526, -597, -627, -74, 290, 427, 552, 229, 82, 454, 450, -129, -707, -822, -506, -134, 34, 77, 209, 569, 741, 609, 273, -436, -875, -848, -620, -234, 103, 445, 734, 829, 414, 234, -308, -581, -524, -808, -534, -2, 360, 594, 619, 271, 250, 88, -296, -661, -456, -359, -3, -59, 129, 271, 343, 478, 198, 96, -196, -196, -325, -330, -100, -544, -271, 530, 576, 561, 374, 96, -225, -453, -633, -365, -180, -133, -68, 392, 654, 595, 312, -114, -274, -673, -451, -294, 51, 84, 158, 401, 644, 566, 45, -257, -364, -424, -292, -230, 180, 219, 212, 339, 318, 109, 26, -83, -114, -78, -198, -274, -110, 255, -14, 138, 325, 422, 265, 86, -160, -127, -261, -217, -278, -78, 351, 22, 103, 552, 262, -78, -475, -286, -195, -255, -124, 312, 515, 257, 65, 113, 66, 104, -418, -552, -271, -38, 205, 159, 425, 327, 41, -92, -46, -135, -307, -234, 19, 170, 266]
1543B66j0L3p2l29j4j0K17j14l61K27J98j21q1M07K09l58j02j04J26q5j33k7M0
1566a98L84J54k1P5l08j95k97M2o2J58MK98J67K3Q8q4j77k19J42l36M0M74J4k86
1590a20K23J27M8j34o0j60j48K4J21J36j86K82j72L6K19j2K0j52O8m92Q7J36L32
1613B23l28J61K19J44j72n3k87k92P8J58K1K22On0J31K23j58k41p8k6k47J09L44
1636A07J77l36K48J1p2j6j19k13o2J42J77m6l1KJ59K1J00r1j86pK8k06J68l9j40
1661b24J60K43J07j07Q2k98J15j48j48mO1k8J65K14J33j24k86J27r7J73k24K3
1683h5M8k6J14L69j52l17K3J6j8O1r2j04p9J15N06L8m85j49J46N8K87j42j85k48
1707c01L0K87L37k32j73j37J52M40l29k20J80l20R8M42J17k25l45O4J41K91k18
$$ y = [266, 256, 289, 217, -112, -126, -136, 81, -33, -394, -167, 31, -90, -171, 236, 445, 87, -15, -119, 7, -78, -211, -238, -198, 186, 340, 319, 394, 86, -109, -406, -364, -426, -268, -264, 34, 201, 224, 312, 228, 51, -168, -26, -362, -322, 152, 166, -120, 103, 230, 278, 144, 84, -76, -224, -200, -79, 57, -129, 153, -19, 17, 236, 224, 244, 92, 160, -332, -245, -109, 223, -105, 56, 275, 419, 247, 194, -93, -385, -307, -149, -128, 94, 100, 50, 181, 404, 246, 5, -73, -99, -346, -237, 107, 284, -52, 196, 207, 135, 119, 0, -213, -275, -133, 44, -2, -33, -31, 128, 149, 249, 158, -28, -35, -7, -213, -45, -84, -224, -64, 179, 286, 179, 261, -37, 78, -70, -218, -222, -161, -189, -24, 190, 323, 199, -87, 40, -57, 116, -108, -85, -37, -63, 51, 420, 268, -49, -26, -10, -28, 33, -59, -163, -242, -127, 379, 417, -68, -217, -71, -13, 274, 132, -53, -301, -271, 16, 353, 121, -52, -189, -37, 403, 74, -146, 34, -286, -188, 254, 371, 146, -199, -135, 6, 297, 79]
1728G9j82q0L4L18Q0n8l21m8l5L28O7p9k62j68J80L86J3K1n48p5M01K41j24n20
1752c52J52j77M47K34J2l25k46P9L56O7l24k29J5J94M49kl61o3j57M07J92j70
1774A98m41j9O0J38M02j97j97m47M75K76N3l40j35j29J84N21j05k25m32J68K70
1795G8M41k11p06k30K23M92M00l45m27J19J70N72L2m46o19O7L41K04J83k68k93
1816b23l2L85K69l11k70l96L30P11k0l26n22Q3K29N16R4l12p37p8O49L08m8m09
1838a10k88%N76M87j26q31l71M89N29j3k04o94P1K87P11Jl64p05j5N44N77j36
1860D15o47j86j73R05K75j10o34l69K03O85J98m92o22r7O21N42L3l00p37L6M87
1881C3O83j81r04m70M08O57L09j29n91m11M72O10J22l03r31J0O21N59O6n46n31
$$ y = [79, -103, -183, -149, 169, 249, 191, -130, -178, -213, 115, 182, 103, -159, -327, -147, 239, 252, 273, -275, -350, 51, 292, 168, -352, -200, -377, 70, 304, 316, -9, -255, -176, 180, 247, -77, -306, -291, -97, 352, 350, -11, -74, -231, 176, 368, 198, -243, -262, -202, -64, 338, 141, -56, -503, -28, 248, 301, -39, -174, -303, -119, 402, 297, 72, -360, -192, 78, 519, 308, -398, -628, -405, 87, 487, 142, -285, -166, 4, 576, 608, 162, -457, -390, -49, 155, 338, 70, -223, -255, 130, 399, 88, -182, -578, -248, 463, 443, 117, -405, -322, -93, 423, 517, 205, -532, -610, 39, 347, 299, -110, -398, -398, 178, 665, 539, -292, -663, -174, 355, 342, 138, -556, -485, -198, 513, 514, 150, -555, -570, -26, 551, 415, -232, -418, -591, 314, 589, 479, -155, -524, -321, 364, 562, 70, -552, -649, -28, 514, 547, 247, -490, -454, 33, 716, 535, -369, -839, -431, 226, 535, 406, -185, -596, -124, 486, 608, 305, -626, -616, 5, 564, 630, 84, -447]
1902d47K9M54O66j34r04m82L58Q24K65k79o57m15N22N90L57n68q00MO37N83o0
1923E43p56l35M6N08P30r3j013j76K06P33L51m83o62l23N39N15L55n67p79L1N29
1944a01O64J4n56p92R4Q30O46m01p63l47K94Q78M32o25p52j47M51P70J17n71p40
1965f05k40Q70O56j1q19p15N05M73M51k92o47n09M85Q21L28l38j038j29P56O69
1985F71M5n95p52L0N17R21j93n66p85K99N72O94m82r02l80N98R12J33m81p60k11
2006g15O64P32Q7o32j035K91N79P62Q4r97n83K21Q83N21l68q62l75J73J055L15
2026H00p17o54r6O06P55J04p31q91j5R24N62J5r98m58K65Q74N38l09j091n12O44
2047c85P45L45m36p84l16P85R57k22p42q85K30R21Q07l91p88q88N29R69M41l41
$$ y = [-447, -418, 36, 702, 568, -336, -818, -460, 364, 629, 350, -307, -722, -200, 390, 747, 179, -621, -617, 20, 603, 543, -213, -548, -502, 6, 736, 643, -370, -546, -340, 393, 744, 261, -401, -724, -185, 330, 685, 118, -661, -630, -101, 563, 577, 21, -771, -677, 153, 799, 398, -365, -712, -418, 460, 892, 267, -485, -632, -181, 589, 706, 135, -605, -845, 25, 681, 670, -149, -864, -359, 114, 565, 273, -374, -883, -398, 423, 751, 413, -625, -754, 2, 671, 716, 121, -631, -601, -84, 837, 644, 78, -707, -408, 164, 858, 376, -526, -906, -308, 604, 737, 256, -504, -715, -51, 681, 768, 136, -899, -608, -29, 733, 817, -180, -763, -542, 341, 862, 494, -368, -743, -570, 485, 800, 83, -571, -667, -61, 694, 798, 67, -824, -839, 85, 647, 662, -336, -794, -529, 345, 883, 574, -517, -1029, -385, 360, 705, 269, -515, -831, -46, 911, 689, -53, -938, -708, 213, 1020, 629, -159, -1047, -518, 451, 892, 551]
2067E51j172l77N76J015K80p78p50r9R83M57m8m46q62J65P41N93l76r35m30M60
2087d52J026L00l84r57l83N87P88L92p99p00k51R54N21K00r00o47J38P67N72l91
2107C81o64o14M33R26L11o24p04k62N94Q18J74m93q98j72P81P63k15q69m10L15
2127d29R15L29l02p67p86N39R46J26j40j174k10Q77O54K07n64r40oQ18P26k24
2147E95r04n06K92P83M90l36q99m58N32J038M46p92r50j59P37P48K42q81p32O7
2167f47N83Q34j46p94r56O93P47M49l87q10n74N91P23O26p59p96j44O72Q51j13
2187F43o91p86K10P48P92l30o70p28M07P82M89n74n60m07M09Q04L68p34q67k4
2207g19O15O53J62p58p84K96O70P45m16o30o92M17R51L60n75p00l22M85Q71J43
$$ y = [551, -621, -998, -422, 593, 873, 95, -655, -754, 229, 686, 638, 192, -670, -505, 236, 829, 453, -482, -912, -452, 574, 874, 490, -467, -850, -263, 525, 917, 118, -582, -833, 121, 642, 842, -58, -705, -567, 200, 772, 381, -283, -897, -464, 462, 773, 149, -555, -817, -223, 595, 769, 276, -622, -794, -13, 750, 535, -334, -744, -429, 486, 815, 513, -254, -1040, -501, 445, 571, 431, -743, -953, -76, 578, 785, 221, -719, -725, 93, 819, 595, -309, -815, -523, 260, 750, 414, -485, -943, -411, 627, 1073, 281, -669, -828, -91, 657, 899, 18, -714, -647, -64, 770, 624, -170, -1126, -433, 314, 763, 376, -434, -1008, -417, 306, 932, 173, -623, -767, -95, 756, 643, -48, -834, -624, 124, 916, 586, -84, -812, -405, 377, 866, 292, -268, -675, -266, 538, 906, 172, -695, -719, -104, 549, 711, -47, -831, -535, 135, 880, 464, -166, -858, -441, 510, 870, 295, -405, -727, -242, 629, 772]
2227G72o28o64k4N22P17m9q73m96L21O00M40k74n89n72N30O69L29l94q03k39N02
2248b03P07N1n32o55r5O75P65k48n23o32J34P66N64l46q09m00M96P06L36n24q55
2269f22L9N36M99J60p53l70k15P50O42p7q32m32L34O17L40k30p37l92M02Q40K04
2290G03n23m87l49N33O18j20o12l86L5P96M47r4o98m97K79N31M13k45o44l72L73
2311b99O61K17l75p02p9O14M96n2l39o20j02O57N55k08o49m18K81O11L78m62n57
2332c92j85L53N68J06l19o09j6N52L56O2n06m59N2N21L85J8n49n33K92O19K97
2353F13m42m71k70M64N36K19o44o95J74M09N92o8m44m81K68L46N13k22o68l40
2373f11K86O10L43m60o08QJ35O50J77m22o01j5N92L85j31l84m16r6P02K28k27
$$ y = [772, 144, -520, -544, -22, 695, 646, -227, -723, -402, 198, 638, 364, -225, -797, -267, 402, 731, 337, -466, -705, -203, 504, 555, 23, -632, -727, -52, 713, 465, -58, -690, -556, 210, 774, 428, -381, -781, -285, 421, 757, 233, -622, -583, -47, 452, 612, -141, -511, -726, 24, 666, 589, -243, -675, -341, 276, 616, 386, -351, -743, -341, 499, 703, 180, -307, -656, -123, 495, 375, -237, -623, -588, 208, 655, 561, -137, -634, -355, 176, 589, 344, -300, -672, -299, 362, 579, 204, -498, -577, 37, 533, 481, 142, -478, -580, 77, 632, 424, -225, -643, -362, 249, 627, 165, -392, -577, -224, 344, 450, 131, -478, -494, 58, 414, 476, -30, -489, -437, 84, 469, 487, -62, -595, -303, 316, 613, 171, -300, -570, -106, 430, 649, 5, -690, -516, -107, 485, 417, -27, -508, -240, 106, 619, 397, -271, -611, -325, 285, 628, 168, -440, -432, -297, 353, 530, 108, -493, -508, 84, 469, 338, -46, -462, -558, 144, 372, 145]
2394A45l06l34K72L75K24k68n13k5M00M30P8l19m87k9L67K36M8m06l37R4M72L36
2416D53k24n22r8M60J57J12j55n96j24M89N22j62k42l70o3K99N09p2m73m10K53
2437b57N74J7j33l93m6J56L55K35l76k57l53L77L88p1k26m03N4L47N73k63l86
2458h8k96K26K62M01k76n15j06K92K29J48r2l50k41L28L04N4k28k86L4L02K25
2479C27j77l51j35K48K70J1M6m20j31K60L33R0l48j89p1L95M4J91l00k71p3M86
2501B35o0ml43j26R2M44N5k64l3l23K26K43J24r9k35%K5M29m7m66j70k5L70K82
2525C30k39r8l00nL35J82j30l08q7J51L45r6j68N7j40M07n2j21p8k12N8L28P8
2548B37p7k53k21J13J84K43Jj96l19L47J98r6j18l09L2R4K85K91k85k05n3K43
$$ y = [145, -161, -495, -223, 152, 376, 108, -405, -430, -30, 400, 478, 159, -328, -357, 10, 246, 294, -112, -449, -355, 117, 453, 229, -293, -391, 69, 226, 338, 183, -413, -537, -48, 474, 312, 70, -300, -363, -64, 445, 373, -100, -510, -257, 317, 334, 201, -192, -238, -82, 273, 508, 132, -125, -478, -101, 287, 216, -10, -413, -359, -12, 561, 298, -88, -384, -158, 104, 505, 229, -286, -392, -100, 129, 277, 185, -165, -406, -78, 226, 280, 52, -234, -200, 102, 327, 150, -201, -336, -88, 182, 193, 239, -181, -312, -52, 281, 371, 23, -166, -237, 158, 202, 393, 93, -178, -251, 235, 175, 171, -172, -298, -206, 238, 293, 29, -4, -327, -101, 142, 266, 167, -68, -68, -43, 386, 339, -127, -297, -322, 48, 330, 91, -7, -307, -312, 23, 205, 75, -233, -320, -169, 176, 80, -88, -31, -171, 236, 184, 63, -15, -227, -169, 159, 237, 160, -93, -314, -201, -17, 226, 227, 31, -288, 59, 257, 161, 43, -266, -234, -140, 145, 436, 151, -54, -107, 136]
2570A36J02p8j76j84J60L6L52k96j06k42K29K01j4j17j91j8K10K31j37j32j20
2591a54K7P7J59K7j85j08O3J00P7k43J53j22J18J79m3k79J25j83K32Q6Q6j68o6
2614d2k18L07P1Kk77p0J85l8J80Rk47j14L67j32O2po3j19Q9K83j46j34j08Q7J23
2639E0K83k35j25R4k7k7J82j38k33RK9L42M5j70j13NJ16J41k2k16O1j60K14m5
2663F0P0j49r5J61p3J91k03J5j1M5N3J8k12k6R4j4J45M0j48j22J08J41q8J04J3
2688A17j98K1J69K6r6L2j48j04J73O1m4P1k51K99k8j07l2K35k51K22j08l1j62
2711a34j5J91J14j20l0Q6j89j4J31P5o3k11J24J49N3k45J12MK9O1j32R1pj42m2
2736a24J48o6M1L2K2o4O5n0p0J42j68Q4J91j02N8j38K5M7K0p9K7j46N3P0K2j06
$$ y = [136, 238, 160, -16, -200, -40, -4, 348, 52, -54, -296, -67, 134, 120, 3, -188, -206, 4, 235, 98, -34, -154, -127, -50, 109, 136, -49, -157, -94, 6, 83, -160, -7, -129, -11, 168, 125, -154, -29, -212, 20, 106, 192, 24, -42, -260, 47, 118, 120, -157, -227, -42, -80, 100, 109, -138, -252, 115, -17, 45, 38, -25, -144, -55, 228, 82, -52, -160, -73, 50, 333, 98, -27, 67, 40, 13, 195, 57, -176, -167, -138, 204, 249, 79, -34, -29, 87, 228, 206, -10, 51, -109, 105, 60, 130, -19, -114, 47, -26, 165, -38, -23, -34, 11, 64, 82, -130, -156, -62, -76, 69, 109, -39, -161, -53, 88, 0, 104, 117, -81, -60, 109, 135, 39, 71, -77, -181, -8, 53, 9, 80, -171, 128, 100, -7, -39, 196, -55, 167, 59, 28, -134, -149, 42, 156, 36, 6, 92, -97, -111, 20, 95, 32, -179, -55, 94, 147, -98, 14, 18, 47, 108, -24, 67, 60, -82, -124, 24, -42, -1, 31, 53, -11, 54, 4, -66, 76, -92, -8, 183, 81, 139, 1, 26, 73, 93, 14, 41, -105, -52, 18, 40, -66]
2762f6J07j08J41r3K12j59J3J29k02J31j48q6J70j35Q5J79j41j83M5J66j5J7R
2785F8j46j22J14J44k47K29q4j17K45p2N4o7k47M03k01J7K5j7%M5j57K96j7r1
2809E5pj34L6K9j01J41J05r9J02k26l1p8K04j13p0J13O7j4m0O6J6K1M5o3p7J28
2835G5l6no6l3M0j72J85J66k53K09o7Q0m7r7m5J45q2QN7k90J20K66n3k7J20l90
2861a92K14r7M9J21j12q2J05Q4OK9k02qL9K1Qm2P4j19L2J60j26j66K42j90J79
2886B7j74J36N7N4j66l6O8M7J92J51l23m0J05j9J11j66j29K7R3qJ09j62N7q3J77
2911A05k35J97j70J82nr2l0L5J2J4j30L32j99n9P1p6J84j96J22k50K65j6qn0L2
2936C5j72J91oO9r7m3J2l6J11o1M7N5j5r0N6p7j39J87j57K86K1j45k3k0P9p5j16
$$ y = [-66, 41, -67, 74, -19, 193, 34, 47, 176, -26, 105, -43, -129, 41, -94, -9, 170, 29, -154, -109, 57, 42, 59, 68, -78, -200, -86, 58, -189, 40, -44, -161, 84, 12, 66, -1, -248, 155, -46, -29, -4, -21, -21, 24, -133, 163, 146, 55, 48, -86, -50, -21, -122, 19, 124, 25, 127, -99, -130, -208, -4, -117, -187, -74, -7, -21, -61, 5, 21, 42, 87, 24, -53, 75, 39, 34, -32, -65, -25, -197, -12, 154, -99, 110, 43, 123, 76, -21, -66, 79, -3, 5, 62, -228, -108, 158, 105, 78, 198, -192, 22, -75, -26, 95, -17, -99, 6, 90, 96, 125, -77, -85, -46, -25, -17, -59, 15, -104, -72, 88, -38, -204, 38, -152, 27, -147, -11, 46, 100, -66, -102, -34, 13, 205, 356, 33, -7, 98, 79, 190, 24, -105, -78, 15, 7, 116, -46, 11, -72, 105, -130, 67, -103, 79, 74, -18, -48, -13, -1, 13, -117, 215, 16, -43, 28, -48, 136, -60, 62, -188, 77, 61, 53, 3, 35, -137, 54, 48, 117, 20, -23, -11, -47, 64, 3, 50, 105, 90, 0, 56, -21, -160, 27, -130, 156, 177, 32, 9, -11, 68, -7, -123]
2963a23J98j3k0nj11m5Q2P1k33L19j43J2j6l5R6j41J78l7q6K8J65k9k05P8r2K8
2989g9J50j18J57nn3r2J42n6j65Q2j0p6R7J4j3J6J8j9o6K7J0L9j11N7J37mj68
3016h9o7K41k05J96o2P2j58J37L5k13J89o1q7J67jj09j02P4k2J82j35O6j08J65
3040A05j34Q7L9j32N1l5K14j81L7j49J37o8q6O7oj20K25k28L3K13J4o7M5j29J54
3065H6k77J5K63o8K5j05O1R9m9m7L9k3J40j91P8j13o5k8K28j70K61j76p9Qj7k5
3091a30J06J91j37R4o8j0r1Q3Nk5J0qk6M9r9n3M8NpJ71J7j57K6O8r7J9M4q6Q8
3120C0j72J8R1P7j19P9R3m3j50M2JJ40L3j18OR5j82J25k18R8M8n8k7J36j80K25
3146G0nn5pp8J62q6j5J1O1lP6q4K2j91R9n2%QK0N2J63k38J58q5oM7K2j18m0J73
$$ y = [-123, 75, 62, 42, 37, -74, -119, -37, 34, -199, 120, -23, -11, -27, -62, 34, -107, 71, 34, -52, -24, 141, 112, -93, -15, -107, -79, 71, -47, 110, 105, 52, -40, 102, 46, -119, -37, -47, -123, -26, -12, -25, -9, 9, -10, -76, -49, -39, 0, -111, -54, 83, 79, -89, -156, 85, -120, 76, 14, 86, -72, 65, 100, -113, 76, 15, -72, 95, 94, -15, -117, -43, -65, 117, -18, 48, -60, 105, -29, 58, 97, -35, 16, -19, 195, 14, 51, -98, 39, -29, -115, -48, -54, -174, 51, -177, -144, 69, 83, 16, 61, -68, 86, -191, -176, 87, 19, 44, -61, 0, 99, 50, 3, 42, 19, 159, -32, 46, -67, -132, -160, 68, -102, 159, -17, -96, -88, -105, -130, -24, 167, 30, 124, 56, 46, -45, 38, 43, 18, 28, 20, -6, 43, -56, -109, -61, -56, -63, 108, 125, -32, -6, 62, -35, -16, 28, -58, 30, -142, -124, -33, 44, -75, 4, 97, 54, -96, -54, -53, 87, 120, 2, 8, 103, -79, 46, -172, -74, -26, -84, -111, 25, -155, 70, 65, 10, 3, -75, 87, 1, -14, -3, 58, 55, 131, 47, 69, -122, -23, -75, -75, -67, -47, 5, 168, -70, 88, 3, -3, 44, 66, -52, -92, 81]
3176H1o9r5O6O3Nj06J56j36J73j05L1j78L0K19qn5P4j1k60Q4J0P4j42J35P3k30
3202a21J7J45n1L1J31j69l9J22j66R2p8K07m4k6j45L5J13j7n9O0J08j15p5P8o4
3227c0K6n9P8J12j28n4K10k51Q4J17M3p5p0J1o7J28m3mj29m5K79j04P1j90R1j18
3253a17K19j04k8j0O2J78p8m4M6p9j81J53R6k67J19J60j30jK6k4j40R7J12p5J02
3278I2L7j82Qj78L56k52J40k1r5K25j02k3O6O2j80l01L33n0q3o1J57J3J01j44
3302h2P7J71k08n6J09nr7K1lj4P0j38J87%J4q4K25j71R9k25O3J52j62R8j75J38
3328DQ7o3j69Q5J8K2j55J01j6j3n8K08m3j30K46j51Q6j44L8K51l39J43r3PJ10
3353C2K2j07o1J91M5j06J4n9j78J55M7J66k56oj5K69o1j11L5J3p0J34P2l34M2
$$ y = [81, 12, -83, -17, 46, 51, -55, 101, -35, 138, 33, 64, -114, -84, 135, 127, 72, 146, 135, -125, -41, -31, 43, -99, 36, 109, -121, -104, 41, -10, 21, 152, -17, -56, 66, -100, -8, -86, 121, 77, 51, -94, -59, 54, 37, -22, 38, 146, 31, -44, 34, -30, -4, -63, 15, 127, -1, -55, 155, -96, -12, 105, 148, 73, 3, 14, -53, 75, 32, 28, -101, -146, 133, 29, 100, -90, 1, -117, 102, -2, -30, -40, 22, 200, 122, 78, 124, 45, -136, 17, 113, -154, -35, 125, -5, -6, 20, -4, -144, -47, 65, -10, 92, 129, -53, -45, -223, 133, -119, 21, 0, -95, 130, 28, 5, 71, 133, -47, -348, -15, -65, -148, -209, -52, -39, 62, -82, -5, 166, -42, -98, 11, 6, -91, -70, -73, -87, -17, -155, 32, 32, 46, -38, 187, 16, 115, -110, -47, 105, -57, 41, -134, 4, 91, 28, -141, -56, -38, -16, -171, -70, -86, -99, -157, 51, 8, -122, 124, -27, 59, -85, -47, 204, -135, 8, -85, -78, 32, 54, -53, -114, 77, 122, 16, 30, -29, -207, -52, -5, 161, -95, -101, -116, 153, 92, -19, 16, 29, -41, 93, 165, -169, -127]
3378a27J92p4N6J6k8j61J08M2o6M3k1J34j36R9j29J75j04r3K00j96o6J68j27J7
$$ y = [-127, 65, -9, 47, 63, 35, -126, -18, 24, -42, 1, -20, 114, -22, 77, -52, 123, 19, -74, 126, -70, -136, 32, -95, -78]
$$ [...]
8191F0
##END NTUPLES=NMR FID
##END=
