##TITLE=1H_Ser AmODNEA
 200.13Hz, DMSO
 8 sc
3.8.2026
##JCAMPDX= 6.0         $$ Bruker NMR JCAMP-DX V2.0
##DATA TYPE= NMR FID
##DATA CLASS= NTUPLES
##ORIGIN= UXNMR, Bruker Analytische Messtechnik GmbH
##OWNER= pz
$$ XWIN-NMR		Version 3.5
$$ Mon Aug  3 14:02:54 2026 Russian Standard Time (UT+4h)  she@DPX200
##.OBSERVE FREQUENCY= 200.1313
##.OBSERVE NUCLEUS= ^1H
##.DELAY= (6, 6)
##.ACQUISITION MODE= SIMULTANEOUS
##.ACQUISITION SCHEME= undefined
##.AVERAGES= 8
##.DIGITISER RES= 18
##SPECTROMETER/DATA SYSTEM= spect
##.PULSE SEQUENCE= zg30
##.SOLVENT NAME= DMSO
##.SHIFT REFERENCE= (INTERNAL, DMSO, 0, 14.3821)
##AUDIT TRAIL= $$ (NUMBER, WHEN, WHO, WHERE, WHAT)
$$ ##TITLE= Audit trail, XWIN-NMR		Version 3.5
$$ ##JCAMPDX= 5.01
$$ ##ORIGIN= Bruker BioSpin GmbH
$$ ##OWNER= she
$$ F:/spectra/data/she/nmr/H-C/1/audita.txt
$$ ##AUDIT TRAIL=  $$ (NUMBER, WHEN, WHO, WHERE, WHAT)
(   1,<2026-08-03 14:00:56.42 +0400>,<she>,<DPX200>,
      <created by zg, POWCHK disabled, PULCHK disabled
       configuration hash MD5:
       00 E9 B6 7A A2 85 ED C7 34 08 36 98 17 FE 4E 26
       data hash MD5: 16K
       A0 ED 4A FE B5 AF D6 BA 92 78 BF CA 1E DF D3 D2>)
$$ ##END=
$$ 
$$ hash MD5
$$ 00 66 14 E2 D7 40 8C 9B 4F 14 49 09 B5 93 74 AF
##$RELAX= 
##$RELAX= 
##$RELAX= 
##$RELAX= 
##$RELAX= 
##$RELAX= 
$$ Bruker specific parameters
$$ --------------------------
##$DU= <F:/spectra>
##$EXPNO= 1
##$NAME= <H-C>
##$PROCNO= 1
##$TYPE= <nmr>
##$USER= <she>
##$AMP= (0..31)
100 100 100 100 100 100 100 100 100 100 100 100 100 100 100 100 100 100 
100 100 100 100 100 100 100 100 100 100 100 100 100 100 
##$AQSEQ= 0
##$AQ_mod= 1
##$AUNM= <au_zg>
##$AUTOPOS= <>
##$BF1= 200.13
##$BF2= 200.13
##$BF3= 200.13
##$BF4= 200.13
##$BF5= 200.13
##$BF6= 200.13
##$BF7= 200.13
##$BF8= 200.13
##$BYTORDA= 1
##$CFDGTYP= 0
##$CFRGTYP= 5
##$CHEMSTR= <none>
##$CNST= (0..31)
1 1 145 1 1 1 1 1 1 1 1 1 1 1 1 1 1 1 1 1 1 1 1 1 1 1 1 1 1 1 1 1 
##$CPDPRG= <>
##$CPDPRG1= <>
##$CPDPRG2= <>
##$CPDPRG3= <>
##$CPDPRG4= <mlev>
##$CPDPRG5= <mlev>
##$CPDPRG6= <mlev>
##$CPDPRG7= <mlev>
##$CPDPRG8= <mlev>
##$CPDPRGB= <>
##$CPDPRGT= <>
##$D= (0..31)
0 0.7 0 0 0 0 0 0 0 0 0 0.03 0 0 0 0 0 0 0 0 0 0 0 0 0 0 0 0 0 0 0 0 
##$DATE= 1785751255
##$DBL= (0..7)
120 120 120 120 120 120 120 120 
##$DBP= (0..7)
150 150 150 150 150 150 150 150 
##$DBP07= 0
##$DBPNAM0= <>
##$DBPNAM1= <>
##$DBPNAM2= <>
##$DBPNAM3= <>
##$DBPNAM4= <>
##$DBPNAM5= <>
##$DBPNAM6= <>
##$DBPNAM7= <>
##$DBPOAL= (0..7)
0.5 0.5 0.5 0.5 0.5 0.5 0.5 0.5 
##$DBPOFFS= (0..7)
0 0 0 0 0 0 0 0 
##$DE= 6
##$DECBNUC= <off>
##$DECIM= 32
##$DECNUC= <off>
##$DECSTAT= 4
##$DIGMOD= 1
##$DIGTYP= 9
##$DL= (0..7)
0 120 120 120 120 120 120 120 
##$DP= (0..7)
150 150 150 150 150 150 150 150 
##$DP07= 0
##$DPNAME0= <>
##$DPNAME1= <>
##$DPNAME2= <>
##$DPNAME3= <>
##$DPNAME4= <>
##$DPNAME5= <>
##$DPNAME6= <>
##$DPNAME7= <>
##$DPOAL= (0..7)
0.5 0.5 0.5 0.5 0.5 0.5 0.5 0.5 
##$DPOFFS= (0..7)
0 0 0 0 0 0 0 0 
##$DQDMODE= 0
##$DR= 18
##$DS= 0
##$DSLIST= <SSSSSSSSSSSSSSS>
##$DSPFIRM= 0
$$ [...]
##$SUBNAM0= <"">
##$SUBNAM1= <"">
##$SUBNAM2= <"">
##$SUBNAM3= <"">
##$SUBNAM4= <"">
##$SUBNAM5= <"">
##$SUBNAM6= <"">
##$SUBNAM7= <"">
##$SUBNAM8= <"">
##$SUBNAM9= <"">
##$SW= 18.0517328524113
##$SWIBOX= (0..15)
0 0 2 0 0 0 0 0 0 0 0 0 0 0 0 0 
##$SW_h= 3612.71676300578
##$TD= 16384
##$TD0= 1
##$TE= 0
##$TE2= 300
##$TE3= 300
##$TEG= 300
##$TL= (0..7)
0 120 120 120 120 120 120 120 
##$TP= (0..7)
150 150 150 150 150 150 150 150 
##$TP07= 0
##$TPNAME0= <>
##$TPNAME1= <>
##$TPNAME2= <>
##$TPNAME3= <>
##$TPNAME4= <>
##$TPNAME5= <>
##$TPNAME6= <>
##$TPNAME7= <>
##$TPOAL= (0..7)
0.5 0.5 0.5 0.5 0.5 0.5 0.5 0.5 
##$TPOFFS= (0..7)
0 0 0 0 0 0 0 0 
##$TUNHIN= 0
##$TUNHOUT= 0
##$TUNXOUT= 0
##$USERA1= <user>
##$USERA2= <user>
##$USERA3= <user>
##$USERA4= <user>
##$USERA5= <user>
##$V9= 5
##$VALIST= <valist>
##$VCLIST= <CCCCCCCCCCCCCCC>
##$VD= 0
##$VDLIST= <DDDDDDDDDDDDDDD>
##$VPLIST= <PPPPPPPPPPPPPPP>
##$VTLIST= <TTTTTTTTTTTTTTT>
##$WBST= 1024
##$WBSW= 4
##$XGAIN= (0..3)
0 0 0 0 
##$XL= 0
##$YL= 0
##$YMAX_a= 560374
##$YMIN_a= -496829
##$ZGOPTNS= <>
##$ZL1= 120
##$ZL2= 120
##$ZL3= 120
##$ZL4= 120
##$ABSF1= 10
##$ABSF2= 0
##$ABSG= 5
##$ABSL= 3
##$ALPHA= 0
##$AQORDER= 0
##$ASSFAC= 0
##$ASSFACI= 0
##$ASSFACX= 0
##$ASSWID= 0
##$AUNMP= <proc_1d>
##$AZFE= 0.1
##$AZFW= 0.1
##$BCFW= 1
##$BC_mod= 2
##$BYTORDP= 1
##$COROFFS= 0
##$CY= -3
##$DATMOD= 1
##$DC= 2
##$DFILT= <>
##$DTYPP= 0
##$F1P= 0
##$F2P= 0
##$FCOR= 0.5
##$FTSIZE= 0
##$FT_mod= 4
##$GAMMA= 1
##$GB= 0.15
##$INTBC= 1
##$INTSCL= 1
##$ISEN= 128
##$LB= 0.25
##$LEV0= 0
##$LPBIN= 0
##$MAXI= 10000
##$MC2= 0
##$MEAN= 0
##$ME_mod= 0
##$MI= 1.114404
##$NCOEF= 0
##$NC_proc= 0
##$NLEV= 6
##$NOISF1= 3.799351
##$NOISF2= 2.8
##$NSP= 1
##$NTH_PI= 0
##$NZP= 0
##$OFFSET= 14.38212
##$PC= 1
##$PHC0= -4220.53
##$PHC1= 11.9923
##$PH_mod= 1
##$PKNL= yes
##$PPARMOD= 0
##$PSCAL= 0
##$PSIGN= 0
##$REVERSE= no
##$SF= 200.129724274929
##$SI= 16384
##$SIGF1= 3
##$SIGF2= 2
##$SINO= 400
##$SIOLD= 16384
##$SREGLST= <1H.CDCl3>
##$SSB= 0
##$STSI= 0
##$STSR= 0
##$SW_p= 3205.1282051282
##$SYMM= 0
##$S_DEV= 0
##$TDeff= 0
##$TDoff= 0
##$TI= <>
##$TILT= no
##$TM1= 0
##$TM2= 0
##$TOPLEV= 0
##$USERP1= <user>
##$USERP2= <user>
##$USERP3= <user>
##$USERP4= <user>
##$USERP5= <user>
##$WDW= 1
##$XDIM= 8192
##$YMAX_p= 0
##$YMIN_p= 0
$$ End of Bruker specific parameters
$$ ---------------------------------
##NTUPLES= NMR FID
##VAR_NAME=  TIME,          FID/REAL,        FID/IMAG
##SYMBOL=    X,             R,               I
##VAR_TYPE=  INDEPENDENT,   DEPENDENT,       DEPENDENT
##VAR_FORM=  AFFN,          ASDF,            ASDF
##VAR_DIM=   8192,          8192,            8192
##UNITS=     SECONDS,       ARBITRARY UNITS, ARBITRARY UNITS
##FACTOR=    0.0002768,     1,               1
##FIRST=     0,             0,               0
##LAST=      2.2672688,     0,               0
##MIN=       0,             -496829,         0
##MAX=       2.2672688,     560374,          0
$$ Real data points
##PAGE= N=1
##DATA TABLE= (X++(R..R)), XYDATA
0@%%%%%%%%%%%%%qJ6j6J6j6K4l2L6m4N6o4P2q8J02j18J40j60J81k10K39k71L07
35A62l47L90m39M93n47O11o79P54q40R30j029J139j255J384j529J683j852K040
53A069k247K480k741L032l364L746m189M712n337O101p063Q311r999J2424j6203
68i268K2873m8013M06901J87881n04845m34738m0759L19849L68264J13563k56798
79A24910l89058j63212L05748M24576J25506k58953m06820j65061K38645L97331
89B33612J98358k69168m66079j37400L03387M19446J20615k81934l80719j62356
99d22238K48660M60341J46878l13550m03848p8792K97562L28645R0366k12818
109A41206l86916j62887K60824M05649J30729k87597l71807p8250K36462L46357
$$ plain form
0 0 0 0 0 0 0 0 0 0 0 0 0 0 0 -8 8 -8 8 -8 16 -16 20 -24 32 -32 40 -48 54 -64 76 -84 97 -113 126 -145 162
35 162 -185 205 -234 259 -288 323 -356 398 -442 488 -541 598 -657 727 -802 881 -971 1069
53 1069 -1178 1302 -1439 1593 -1771 1975 -2214 2498 -2839 3262 -3801 4510 -5489 6935 -9268
68 -9268 13605 -34408 372493 560374 55529 -379209 -419968 -100119 268145 381708 124910
79 124910 -264148 -427360 -121612 302964 428470 169517 -237303 -402364 -163719 233612
89 233612 431970 162802 -303277 -440677 -137290 282156 402771 120837 -259882 -422238
99 -422238 -173578 286763 433641 120091 -283757 -362549 -64987 263658 354024 141206
109 141206 -245710 -408597 -147773 257876 388605 101008 -270799 -349049 -112587 233770
119B33770J31244k44608l81065j29921K96162M05562M3485k96965k90564m6964
129b79864J97962K56353J22689j60949l55168j43628K41667L54896J13125k37998
139A09085l33781j11085K09348L58540J23392k62216l45169p2062K68434L16570
149B61056L8557k34970k88319p8523K20405K86894P4165k07777k77597n3667J86029
160g3747K42087J10051j54039l04559j47923J99530L64008R9241k63900k97560
170b26811m6831K16847K57617N7741j85898k75861q5100K13180K77957O9646j95586
181G6901k64938o8650J75771K57956R6108j92090k81116p0922K09315K69637M6314
192B54286j94128k31302q0201J59260K60930R1249j81548k73338o2064K08130
$$ plain form
119 233770 365014 120406 -260659 -390580 -94418 311144 354629 57664 -232900 -279864
129 -279864 -81902 174451 297140 136191 -218977 -362605 -120938 233958 347083 109085
139 109085 -224696 -335781 -126433 232107 355499 93283 -251886 -323948 -55514 261056
149 261056 299613 64643 -223676 -302199 -81794 205100 279265 71488 -206109 -259776 -73747
160 -73747 168340 278391 124352 -180207 -328130 -128600 235408 334649 70749 -226811
170 -226811 -273642 -56795 200822 258563 72665 -203196 -288296 -75116 202841 272487 76901
181 76901 -188037 -256687 -80916 177040 273148 81058 -200058 -270980 -61665 207972 254286
192 254286 60158 -171144 -251345 -92085 168845 260094 78546 -194792 -256856 -48726
202d8726K37209N0481j72050k37791o9900J61765K43474Q1897j72856k36926o9783
213b33206J56240K40509Q1588j64345k57101r1947J94729K70958M8810k00831
223D5404k26879k6506J69819J87271N5419j37093k17128p3802J49762K29440P4332
234B30039j58729k21379p4553J45042K33545P4467j64107k31294n9094J76686
244d9377K16088M2519j51119k04192o2569J40772K08652P4860j50374k20338n2835
255b07913J55065K02631N2683j45437j97919o6943J38511K15136O1889j50037
265E7666k01674n3152J45494J91386N5513j33248k03848o3334J46765K03226N5051
276A99845j48537j92574m3679J32742J83183N5859j32707j88495n7149J37564
$$ plain form
202 -48726 188483 238964 66914 -170877 -240777 -79012 164462 246359 73503 -163423 -233206
213 -233206 -76966 163543 245131 80786 -176315 -268262 -73533 197425 246235 45404
223 45404 -181475 -207981 -38162 149109 204528 67435 -149693 -223495 -73733 155707 230039
234 230039 71310 -150069 -224622 -79580 153965 228432 64325 -166969 -226063 -49377
244 -49377 166711 209230 58111 -146081 -208650 -67878 140774 215634 65260 -155078 -207913
255 -207913 -52848 149783 202466 57029 -140890 -207833 -69322 145814 207703 57666
265 57666 -144008 -197160 -51666 139720 195233 61985 -141863 -205197 -58432 144794 199845
276 199845 51308 -141266 -184945 -52203 130980 186839 54132 -134363 -191512 -53948
286e3948J93537M6944j33863j80456n6873J27363J84983O0250j32111j95186m8157
297a87517J44733J80264M0182j35142j71037m3037J20924J73517N1609j25927
307D8569j71632m8561J23425J72441M7609j19977j75048n5301J28887J78234M4514
318A73160j32146j69571l2624J24285J54051M1465j13932j59793m7852J13811
328d9146J67599M6826j21081j61411m3989J18065J60978M0541j17089j59585l9189
339a57481J20959J51750L5070j10853j48713m0149J05069J51072M8264j11129
349D3859j56939m0576J15513J52628L3083j12868j42458l6644J06341J44024L6665
360A42628j03876j43004l8438J04447J40407M0837j02088j46067l8507J06828
$$ plain form
286 -53948 139589 186533 52670 -127786 -184659 -57296 127687 187937 55826 -139360 -187517
297 -187517 -42784 137480 177662 42520 -128517 -171554 -50630 122887 174496 48569
307 48569 -123063 -171624 -48199 124242 171851 51874 -123174 -178475 -49588 128646 173160
318 173160 41014 -128557 -161181 -36896 117155 158620 44688 -115105 -162957 -49146
328 -49146 118453 165279 44198 -117213 -161202 -43137 117841 158382 41293 -118292 -157481
339 -157481 -36522 115228 150298 39445 -109268 -149417 -44348 106724 154988 43859
349 43859 -113080 -153656 -38143 114485 147568 34700 -107758 -144402 -38061 105963 142628
360 142628 38752 -104252 -142690 -38243 102164 143001 40913 -105154 -143661 -36833
370c6833J43605L4618j10157j36331k8021J01771J30403L1055r5204j28452l9445
381a32991R4103J34876L7906r5856j35527l7018R8227J33788L7350j00167j35206
392a00515k9862J00863J27366K7349r7062j21444k9256R1069J23612L1091r1114
403C2097j22476l3398R1626J23034L0411r0753j21161k9036R0502J18238L0201
414A19285q9644j18956k7380Q7191J14584L0471q4057j15421l3266Q5615J19145
425H7567K8604q8399j14135k7975Q6229J13249K7738q4459j12718k6639Q4268
436b6670J09809K7205q4697j10583k3143Q4099J06054K3393q0365j03912k5724
447a04534P8790J04276K2991p7314r9013k6122P3195J01983K9320p3860j04495
$$ plain form
370 -36833 106772 141390 31233 -105098 -133119 -31348 99055 130110 34906 -93546 -132991
381 -132991 -38888 95988 133894 38038 -97489 -134507 -36280 97508 134858 34691 -100515
392 -100515 -130377 -29514 97852 125201 28139 -93305 -122561 -31492 92120 123211 32097
403 32097 -90379 -123777 -32151 90883 121294 30541 -90620 -119656 -29154 89084 119285
414 119285 29641 -89315 -116695 -29504 85080 115551 31494 -83927 -117193 -31578 87567
425 87567 116171 27772 -86363 -114338 -28109 85140 112878 28419 -84299 -110938 -26670
436 -26670 83139 110344 25647 -84936 -108079 -23980 82074 105467 25102 -78810 -104534
447 -104534 -25744 78532 101523 24209 -74804 -100926 -27731 74252 103572 29712 -74783
458g4783k9577P4162J04523L2198p7355j09318k5840Q4154J04828J7419q2873
469A7538r6175j6653P6602R2509J7008o9801q8827k3897O6889R3566K6260p1653
481B3366r5411k0759P0288R0858K4724o7597r4240k4645P0329R2633K1312o9437
493B1421r0128k2398O9408R1384J9790o8419q7229k2163O5268Q9208K3868o8893
505B1117r0725j7189O9488Q4722J7612o7354q4032j6798O5929Q0909J6343o1319
517A8703p9547k0856O2825Q2879J5602o4023p5499j5782N5267P5361K4166n4081
529B5015q1943k5324N8350Q4219K4087o3895q5877j7109O7790P9224J1600o1895
541A4242p3461j5834N9600P5322J3128n9976p0041j2468N4207O8508J7537n3277
$$ plain form
458 -74783 -104360 -30198 74325 106523 29168 -80150 -105990 -21836 82992 100411 17538
469 17538 -78637 -95290 -18688 73821 90829 21028 -67799 -91696 -24807 68759 95019 23366
481 23366 -72045 -92804 -22516 68342 93066 25469 -68771 -93416 -23087 69546 90858 21421
493 21421 -68707 -91105 -21697 69687 89477 21058 -66171 -88334 -23066 66142 90010 21117
505 21117 -69608 -86797 -17309 67413 85025 17671 -66361 -83159 -17230 63679 80022 18703
517 18703 -60844 -81700 -18875 64004 79606 15583 -59916 -75698 -20431 54930 79096 25015
529 25015 -56928 -82252 -23902 60317 84404 20509 -65368 -82477 -14687 64537 76137 14242
541 14242 -59219 -75053 -15453 59869 72997 13021 -57020 -69488 -15281 53227 70764 17487
553A7487p0364j7262N1197O9423K2079n0711p5750k1823N7464P5241J5033n6911
565A5103o9659j5097N4177O8746J4967n2477o6853j6517M9964O8918J8431n4222
577A5481o8868j2233N2084O2874J4823m7257o5986j7780N1043O6961J2977n0760
589A3359o1804j3699M7656O1691J3914m6586n9928j5408M3482O1832J9158m5866
601A7801o4869j5710M7199O1446J5737m5904o2654j5381M8590O1819J2101m7128
613A3047n8843j3890M6553O0056J0327m8060n3879p546M1477N0635J3886l8628
625A5135n4872j6041L9707N5791J6847m0557n7296j5367M3139N5958J1734m1063
637A3115n4179j4383M1147N6355J2777m2865n3072j0533L9894N0822J2653l9831
$$ plain form
553 17487 -52877 -70139 -18942 50481 72560 21849 -53901 -75724 -18260 56981 72014 15103
565 15103 -54556 -69653 -15476 53270 68237 15760 -51093 -67610 -17646 51272 69703 15481
577 15481 -53387 -65620 -13536 49338 64161 16904 -49082 -66862 -15819 51142 64119 13359
589 13359 -48445 -62144 -14488 47203 61117 14531 -45397 -60805 -17323 44509 63667 17801
601 17801 -47068 -62778 -15579 45867 61604 15700 -46954 -62335 -13745 48074 60175 13047
613 13047 -45796 -59686 -13133 46923 57250 9190 -44689 -52235 -10758 39877 53763 15135
625 15135 -39737 -55778 -16071 39720 56567 16010 -41286 -56653 -13514 42444 54178 13115
637 13115 -41064 -55447 -14300 42055 54832 11967 -41105 -51638 -11744 39078 51731 11900
649A1900n2565j0761M0324N0366J1255l8130n0146j2988L8383N0441J1155l8444
661A0790m8439j0955L7399M9112J0929l7710m7844j1011L5359M7044J2970l5491
673A2153m7977j0973L6201M5947J1413l4582m7530j3182L6177M8687J0762l6786
685A0310m5260r468L4846M4192R673l4759m4491r349L3746M4101J0574l3073m3690
698c2648j0168L2703M1935R921l1829m2539j0305L2912M3377R466l2446m1705
710c1326j0578L1052M2276R803l2622m1067p507L2201L9723Q274l1112l9776r583
723d0242L0273L9366R416k9387l8645r096L0234L8417P948k9974l8199r188K9511
736i566L8927Q889k9641l7096p503K7931L6178Q300k8293l7105q289K9065L6771
$$ plain form
649 11900 -40665 -51426 -11102 39264 50519 12389 -37757 -50745 -12362 38079 49234 10790
661 10790 -37649 -48604 -11205 37907 48836 11126 -36718 -47729 -12370 34674 47644 12153
673 12153 -35824 -46797 -10596 35351 46764 12182 -35348 -48530 -12353 36334 47096 10310
685 10310 -34950 -44418 -9572 34620 44293 9534 -34957 -44306 -10560 33541 44115 11042 -32648
698 -32648 -42816 -10113 31822 41743 9914 -32625 -42930 -10018 33359 42825 10379 -31326
710 -31326 -41904 -10852 31424 41227 8605 -32462 -39969 -7768 31955 40229 9117 -30659 -40242
723 -40242 -9969 29397 38813 9426 -29219 -38315 -8081 30336 38284 8310 -29889 -39077 -9566
736 -9566 29361 38250 8609 -28487 -35990 -8059 28119 36419 8126 -28979 -37268 -8203 28568
749B8568P897k7773l5400q087K6588L4640Q108k6521l4905q280K7242L5157Q293
762C5527k7069l4843p988K6203L3517P857k6016l3201o744K6244L2292O977k5078
775G678l2641q180K4648L2701P914k4276l1969o970K4452L1026O982k4333l1704
788b4672p323K4146L1381P759k3593l0306p094K3085K9433O749k3185k9743o841
801c0204K3280K9766P074k2514k8869p365K1460K8446P330k1674k8917o382K2342
814f227K8597O415k2014k8136o519K0752K7566O628k0800k6850n730K0474K6889
827B1045O169k0778k7165o438K0196K6670O563j9652k6127o045J9797K5506N668
840B5409j9551k5534o236J9496K5596O151j8801k4642o298J8475K4228N772j8242
$$ plain form
749 28568 36465 8692 -26708 -34795 -8207 26433 34541 8020 -26885 -35165 -7923 27234 35527
762 35527 8458 -26385 -34373 -8170 25347 33204 7188 -26013 -32757 -6513 25779 32756 7678
775 7678 -24963 -33143 -8495 24206 32120 7844 -24125 -31095 -6643 24383 31365 7032 -24672
788 -24672 -31995 -7849 23532 31291 7698 -22608 -29702 -6617 22816 29565 6380 -23363 -30204
801 -30204 -6924 22842 29916 7402 -21467 -28832 -7372 21074 28404 6730 -22187 -28569 -6227
814 -6227 22370 28785 6771 -21365 -27884 -7132 20434 27062 6262 -20588 -26318 -5844 21045
827 21045 27214 6436 -20729 -27167 -6971 19699 26262 6610 -19517 -25562 -5765 19741 25409
840 25409 5858 -19676 -25912 -6416 19180 25331 6530 -18112 -24410 -5935 18293 24065 5823
853E823k4619n915J8718K4520O391j8647k4384n723J7639K3717N605j7810k3370
866a8055n440J8469K2987N133j7215k2612o162J6568K2664N909j6418k2272n370
879b1814J6691K1975N300j6448k2407n508J6162K1966N970j6071k1596n379J5935
892e224K1013N186j5623k1204n823J5774K1847N253j5907k0524n123J5197J9821
905A4663N569j5245k0348m838J5348J9926N021j4332j9955n443J4405J9382M869
918A9022j3910j9002n294J4066J9443N254j4066j9280n557J3817J9181N699j4499
931D874j9371l897J4465J7984L784j3243j8066m617J3294J7892M428j2918j7149
944a2540m573J2399J7510M496j2633j7196m878J2396J7550N077j2674j7548m514
$$ plain form
853 5823 -18796 -24711 -5993 18527 24918 6271 -18113 -23836 -6197 17520 23125 5315 -18055
866 -18055 -23495 -5026 17961 23094 5879 -16733 -22895 -6327 16337 22246 5828 -16444 -21814
879 -21814 -5123 16852 22152 5704 -16703 -22211 -6049 15917 21887 5816 -15780 -21159 -5224
892 -5224 15789 20975 5352 -15852 -21675 -5901 15946 21199 5292 -15232 -20355 -5158 14663
905 14663 20232 4987 -15361 -20199 -4851 15075 20096 5764 -14191 -19634 -5229 14153 19022
918 19022 5112 -13890 -19184 -5118 14325 19579 5513 -13767 -19324 -5507 13674 19373 4874
931 4874 -14497 -18394 -3929 14055 17839 4596 -13470 -18087 -4793 13099 17527 4609 -12540
944 -12540 -17113 -4714 12796 17292 4659 -12537 -17415 -5019 12531 17608 4934 -12614 -17128
957a7128J2945J6557M176j2039j6979m631J2910J6847L576j1794j6165m551J1670
970d606J6650M548j3017j5550l434J1810J5066L998j1442j5309m065J1532J5028
983A1209L476j0629j5074m081J1286J4780L297j0236j3932m584R553J5626M576
996A5267j1140j5261l250J0587J4167M308j0777j4796l621J1274J4115L083j0604
1009C352j3765l528J0928J3754K125j0087j2361l024R066J3105L326r641j2890
1022i640l058Q904J2902M278r828j3432l193J0196J2180K496q428j1960m029R083
1036c529J2835L109r319j2093k737Q319J2052L452q776j2028k919Q718J1397L477
1050A1958q853j2235k576R099J1013K638p861j0995l363P987J1401K593q459j0180
$$ plain form
957 -17128 -4183 12374 16550 4511 -12468 -17099 -4189 12658 16234 4440 -11725 -16276 -4606
970 -4606 12044 16592 3575 -11975 -15409 -3599 11467 15465 4023 -11286 -15351 -3819 11209
983 11209 14685 4056 -11018 -15099 -3813 10967 14264 4028 -9904 -14488 -4935 10691 15267
996 15267 4127 -11134 -14384 -3797 10370 14678 3901 -10895 -14516 -3242 10873 13956 3352
1009 3352 -10413 -13941 -3013 10741 12866 2779 -9582 -12606 -3540 9565 12891 3250 -9640
1022 -9640 -12698 -3794 9108 13386 3558 -9874 -13067 -2871 9309 11805 3377 -8583 -12612 -3529
1036 -3529 9306 12415 3096 -8997 -11734 -3415 8637 12089 3313 -8715 -11634 -2916 8481 11958
1050 11958 3105 -9130 -11706 -2607 8406 11044 3183 -7812 -11175 -3188 8213 10806 2347 -7833
1064g833k993P676J1043L533q255j1327k321P713J0015K877p235j0495l025Q084
1078b543J0324K414p350j0301l047P831J0053K144p213r021k457N913R878L362
1092I987p158j0180k018O660R279L018o260j0017k938P050R818K045o848r220
1106f782k789P047R374K191o599q446k638N979Q984K650o667q555k320O152Q300
1121E881L078o022r058k593O526Q155K086n843p570k820N834Q527K327o109q315
1136e916k014N393P784K525n290q088k000N494P592K490n548q063k325N971P386
1151E391J885m825p208k633N279P739J690n648o961j768M936O996K635n076p402
1166d970k025M920O935J856m506p213j884M995O657K216m814o954k003M730O644
$$ plain form
1064 -7833 -10826 -3150 7893 11426 3171 -8156 -10477 -2764 7251 10128 2893 -7602 -10627 -2543
1078 -2543 7781 10195 2845 -7456 -10503 -2672 7381 9525 2312 -6709 -9166 -3253 6625 9987
1092 9987 2829 -7351 -9369 -2709 6570 9588 3328 -6689 -9627 -2577 7241 9286 2438 -6782
1106 -6782 -9571 -2524 6850 9041 2442 -6004 -8642 -2663 6321 8971 2304 -6251 -8571 -2419 5881
1121 5881 8959 2937 -6121 -8714 -2188 5967 8053 2210 -5360 -8180 -2346 6181 8508 2399 -5916
1136 -5916 -7930 -2537 5247 7772 2482 -5606 -7606 -2112 5480 7970 2422 -5641 -7966 -1995 5391
1151 5391 7276 2451 -4757 -7390 -2111 5628 7318 1670 -5291 -7059 -2123 4873 7508 2432 -4970
1166 -4970 -6995 -2075 4860 6716 2210 -5003 -6887 -1892 4765 6981 2167 -4787 -6790 -2060 4584
1181D584K066n014o190j755M232O539K196m490p077j521M362O291K024m259o187
1196d199j927M465O279J583m471o175j526M012O008J923l926n916j857L666O108
1211D047J686l991o056j250M048N295J726l554n587j776L784N342J388l545n380
1226c823j505L674N362J797l826n378j557L437N271J663l515m875j568L299N056
1241C512J668l509n180j307L311M608J652l232m518j577L056M804J572l577m549
1256c266j343L128M551J410k799m786j402K904M428J659l264m173j341K971M228
1271B905J322k463m571j566K968L964J447k651m148j338K758M046J640k801m350
1286b838j145K629L799J424k498l861j392K513L934J243k570l858j149K343L575
$$ plain form
1181 4584 6650 1636 -4554 -6309 -2077 4462 6658 2168 -4909 -6430 -2068 4223 6247 1988 -4199
1196 -4199 -6126 -1661 4618 6201 1730 -4445 -5971 -1959 4049 5972 2046 -3870 -5727 -2061 4047
1211 4047 5733 1742 -4314 -5564 -1516 3779 5505 1951 -3636 -5412 -1628 3714 5102 1557 -3823
1226 -3823 -5328 -1654 3708 5505 1679 -3699 -5256 -1819 3452 5115 1600 -3275 -4843 -1544 3512
1241 3512 5180 1671 -3509 -4816 -1505 3103 4755 1523 -2995 -4572 -1516 3288 4860 1283 -3266
1256 -3266 -4609 -1481 3070 4480 1681 -3105 -4507 -1603 2825 4484 1220 -2953 -4294 -1323 2905
1271 2905 4227 1764 -2807 -4373 -1405 2559 4006 1355 -2793 -4131 -1373 2673 4313 1512 -2838
1286 -2838 -3983 -1354 2445 3869 1371 -2490 -3882 -1369 2565 3808 1238 -2620 -3769 -1426 2149
1301B149J588k377l440j519K243L659J220k372l508j185K357L315J072j850l291
1316a939j706K418L326J180k061l287r56J672L254J502k208l137j129J751L269
1331A949J193j990k858j441K013L111J182j893l089j131J762L047J155j649l051
1346a690j320J845K861J258j766k981r54J609K907Q75j602k717j084J444K883
1361A568J276j609k702j106J557K386J242j299l050q10J260K621J224j549k516
1376a507j006J594K206R25r30k669j028J371K429R36j163k259j172J104K539Q85
1392B255j116k198j209J220K428R52j278j951j067J017K017J132j166k280q18
1407b062J103K159P33p77k048j332J102J945J172r61j992j148Q45K194Q40q30
$$ plain form
1301 2149 3737 1360 -2080 -3599 -1356 2303 3523 1151 -2357 -3542 -1185 2130 3202 1352 -1939
1316 -1939 -3645 -1227 2099 3279 1218 -2069 -3025 -1353 1901 3403 1195 -1942 -3071 -1320 1949
1331 1949 3142 1152 -1706 -3147 -1134 1977 3159 1266 -1823 -2954 -1192 1855 3010 1361 -1690
1346 -1690 -3010 -1165 1696 2954 1188 -1793 -2747 -1138 1769 2644 1042 -1675 -2759 -1315 1568
1361 1568 2844 1235 -1467 -2573 -1016 1370 2612 1313 -1737 -2547 -1287 1334 2558 1009 -1507
1376 -1507 -2513 -919 1287 2212 1282 -1387 -2415 -1044 1385 2321 1158 -1101 -2273 -1169 1370 2255
1392 2255 1139 -1059 -2268 -1048 1380 2332 1054 -897 -1964 -947 1070 2202 1036 -1244 -2062
1407 -2062 -959 1200 1933 1156 -892 -2224 -1122 823 1995 1034 -958 -2106 -1261 933 1773 943
1423I43j995r76R25J855J152p80j935j006P88J680Q26m30j929r26Q93J800J063
1440A948j041j641r60N99J936Q87o58j955n22N31J414J083o22j596j089P25J497
1457E36R79l75j512j148M91J720P59p31j353p14L74J455P33r3j605r52N71J241
1475C76Q77l45j509r26N91J508Q98o60j288r75M82J321Q09m23r81q26K24J294
1493D47R66o39j049r58M49R04J121k21j301j041M92J376N67j51j196j005L60R82
1511A03J171n68r41r35P4J231J060l41j068p83L90P12R79j15r92j173K18J200
1529B22P20l10o68r97n8J247R75l08j193n47K19O41P75lq82r06J22J080P17n6
1549G90p75r14J86R03P56k08q16o56J19P76P10q4r07n52K7L94J078N8j036n04
$$ plain form
1423 943 -1052 -2028 -1103 752 1904 1124 -811 -1817 -1029 651 1477 1047 -882 -1808 -915 885 1948
1440 1948 907 -734 -1694 -1095 841 1728 1070 -885 -1407 -876 538 1621 999 -597 -1686 -961 536
1457 536 1515 1140 -372 -1520 -1029 691 1450 719 -634 -1348 -974 481 1214 1121 -484 -1436 -865 376
1475 376 1253 908 -601 -1527 -936 572 1470 810 -478 -1453 -971 350 1159 736 -245 -1071 -847 447
1493 447 1413 774 -275 -1233 -784 120 1241 1020 -281 -1322 -830 546 1113 962 -234 -1239 -879 103
1511 103 1274 706 -235 -1170 -1096 135 1195 854 -214 -997 -607 105 1084 969 -23 -1196 -978 222
1529 222 942 632 -36 -1033 -1091 156 1131 823 -370 -917 -698 -57 718 715 -167 -1073 -951 129 846 790
1549 790 15 -899 -713 190 946 738 -78 -734 -615 161 871 787 -120 -672 -645 -251 827 885 -151 -655
1569f55N7P15M32K71q08q32N7Q87O53L5p30q53k09R35Q64j20q29n96k8N83O56
1590D85K73q15o86K6O01O09J92o78p92kP50P12P6n42p82q3M03Q00J91p61n51j70
1612g44O59P41J83r14n02M2M93M65O07r29o20j72O48P34J9o15m20n92O59P87J04
1633F33m59m22l53L75P94Q5m20p15k29O27N08L31n10p70m2K17Q91k8k79o01k60
1654f27M42O28O6k28n73m06K67P52K97l50q04k62K24J015J53l95n99m10M66O61
1674C17J9j45p32l8K46Q07N0l80k63o31K58R49L47o45m49l52M47N67L23m03n76
1695b84m90K96P00O29m72q10M4J89N32M34n03l29q23O60N88J31O8q23l07K61O15
1716C06K75j08n52l57l3P46N65n94m01l80K72L66M44j09o21l46L07M68J96r8p18
$$ plain form
1569 -655 -598 117 549 820 12 -820 -763 124 777 812 82 -771 -980 -45 819 699 -130 -726 -754 -171 485
1590 485 758 -57 -743 -717 -116 493 685 7 -785 -787 -37 675 751 209 -573 -656 -253 547 738 -23 -574 -744
1612 -744 -85 656 839 -75 -577 -535 -42 423 1030 101 -519 -691 -43 691 710 95 -325 -917 -258 529 633
1633 633 174 -248 -601 -226 568 653 233 -482 -711 -84 424 755 245 -525 -567 -350 541 513 234 -367 -627
1654 -627 -185 443 509 281 -292 -698 -431 321 618 268 -536 -798 -574 441 594 199 -400 -810 -344 317
1674 317 336 191 -541 -579 -333 474 524 144 -119 -750 -492 457 804 159 -290 -642 -195 372 695 292 -284
1695 -284 -774 -478 222 851 379 -431 -387 -198 334 768 265 -64 -887 -227 361 492 560 -263 -570 -309 306
1716 306 581 473 -79 -436 -469 277 842 248 -153 -533 -261 105 549 440 -181 -527 -220 248 444 346 -372
1737c72j68P7P64M70l79n61l06K52L62J94q7k94n71J19N43K23J35m98m49L02M45
1758B01L90k49o17j67J01N63k6L9k48l96K44L24L91k56p39k87K98O09M24k23n77
1779b01m37J36O05M45m45j94m48M56J56L75qn43l72k6M42M52j48l95k49j11O86
1800A76L45r1o29j11N0J44O79ko17m06P1L40N17J65o73n40K24N50N42l16l34l12
1822b28o9K89L69K14o57k77R9J52L74K09o32m73J44N86L58O6n14l96J94J32K61
1843B01J28j65o75K74L13M57l70l35j68j72Q98o9N6n77m6q5L03L82j77k98j14
1864b39j13j0O67K01n88n01L12O14K9J3l43l56k6M71K86K0m33l06o8K28N20J06
1886D84n02k15j48N03K22o5m37j92J9L54J17J22k40k60j3j0P49l38l7l00j88N73
$$ plain form
1737 -372 -540 -463 301 771 392 -169 -475 -223 139 333 246 -48 -619 -500 43 266 401 -97 -546 -244 201
1758 201 591 342 -275 -442 -341 222 196 235 -13 -409 -165 159 550 294 -445 -732 -434 175 599 376 -201
1779 -201 -638 -502 103 548 103 -91 -539 -83 73 448 440 -103 -475 -501 -59 393 245 -150 -399 -510 176
1800 176 521 430 -199 -310 -260 -116 563 561 -56 -462 -391 -51 466 631 -42 -582 -358 192 734 418 84 -228
1822 -228 -297 -8 361 575 -82 -359 -260 -108 266 475 -157 -630 -486 100 458 524 10 -386 -192 -60 201
1843 201 329 164 -511 -237 76 533 163 -172 -340 -512 386 317 373 -204 -250 -335 -32 350 173 -125 -239
1864 -239 -352 -362 305 506 -82 -583 -271 343 372 385 42 -314 -340 131 417 437 4 -302 -370 -142 378 484
1886 484 -18 -233 -381 122 344 279 -158 -350 -331 23 140 262 22 -238 -251 -261 488 150 113 -187 -375 198
1908A98L39o9m07m28J31J83L45k95O8l92J23K75L86j35m01m09J98K14K63J51m79
1929a41j41j56N15L17j39j64r5k67R2N38j69j51l59k51M40K35k0k86j69J99QM08
1951B44j22Rk54j76L21K53j14o3j94k99L11M52j4l48k04j75L64L90K1m59m52L00
1973b09J02L83Ok33j30j53L35K29Jj05m70j08M07N42k15m44l98L76O1K80j46j65
1995e4j38KR4L08K22m60l7k60M00M39k61l02m03L3M28K52j6l14j12k1J45M33j04
2018B74m24j65r5N61k6J68k04l62q0L87J36j24K08m65K7J36L41J14k32m26j29
2039c80O1N33M2k36l49j32N03J14R7m8l91R3J93J2L7j87j27j89M87n7K00k41l33
2062b98P0M11O5L3j73j74J00NJ16K26k72j33o3J43J5N4L9l89j08R8L63N8Kk17
$$ plain form
1908 198 537 468 61 -367 -236 -53 292 -3 65 -327 -204 71 457 322 -79 -488 -290 -76 187 338 -141
1929 -141 -282 -438 77 394 255 91 -4 -271 -179 359 190 39 -320 -571 -131 104 84 -202 -371 -172 -164 244
1951 244 122 131 -123 -299 22 275 161 98 -96 -395 -84 368 354 6 -198 -373 -9 381 402 -57 -509 -209
1973 -209 -107 276 282 49 -81 -234 101 330 331 226 -244 -352 55 597 382 -62 -460 -84 -23 257 111 -54
1995 -54 -192 -190 -96 212 434 -26 -63 -323 77 516 255 -47 -450 -417 11 263 247 -67 -179 -200 -55 378 274
2018 274 -150 -315 -410 151 125 293 89 -273 -353 34 170 46 254 -211 -184 -48 293 407 175 -251 -380
2039 -380 -319 214 256 20 -329 -461 42 156 253 205 -186 -93 100 112 149 -38 -165 -354 133 76 276 35 -298
2062 -298 -228 183 248 281 108 -66 34 39 155 381 109 -24 -87 56 71 125 164 -225 -333 -235 128 186 188 -29
2086b9k72K22J95J63j27l73q3L06J61J27j18l12q0J91K08j38r5n2k49L34J71j65
2108a5K3q4j23KL45L64j60m27j11K83K66k70p4j06p7Q3K2K3j7q5j53J85K22L31
2132D47m52k15n1J83J81KJ93n37L35o7J16j58L3P6l89J16L32J66o6n48O8J64J81
2155A10j75J28l09J1N4J55L68l68r0j36J94J23Q0J59n74L7oM55o7J65l50k72K89
2178a9J82j37K2l7m3oJ11N8n9L5j95j60N49J8k43l81K9R4J72J59j61P5j82R8J47
2203A26J17r8q8j88J06O3L54k64l59P6J59L65k84Jj27j11LJ78J25M8k93j86J10
2226a67K28K79m23l8r4J85J74Q0o6j5k54N5K0L16j34k09j40N2o0M02k6j91j90
2249b16R2K02J83m3m20J06J83J88q2j64j35j6L3J43K12j12j70k88K73R0L2M2l5
$$ plain form
2086 -29 -301 -79 116 279 152 -221 -304 2 163 290 172 -140 -220 -29 179 41 -54 -106 -355 -21 150 -15
2108 -15 8 -76 -199 -197 148 512 352 -75 -186 97 363 93 19 -87 -164 -81 -59 -36 -53 -138 -291 -106 116 447
2132 447 -5 -220 -271 -88 93 95 288 -249 86 19 135 -23 10 86 -303 -187 145 311 245 -303 -235 -71 110
2155 110 -65 63 -246 -235 -181 -26 342 -26 -116 -252 -58 65 145 304 -270 -233 -239 216 149 314 -36 -308 -19
2178 -19 163 26 48 11 -32 -38 73 131 72 107 -88 -248 301 319 76 -305 -276 -182 -10 149 -12 63 -119 -21 126
2203 126 243 145 57 -131 -25 38 392 128 -231 -155 4 369 85 86 -41 -152 -149 29 154 202 -91 -277 -167
2226 -167 61 340 -83 -121 -215 -30 144 224 158 143 -111 -56 -36 280 146 -63 -203 -151 -211 191 165 -26 -216
2249 -216 -124 78 261 218 -202 -96 87 275 193 29 -106 -122 -89 54 266 154 -16 -304 -31 59 91 133 98
2272I8q1M5p3M35n06P5J15k29PL52mj51l27R4M75k14J88m74K8p0K52J54k95K11
2296A05k83J76n2K52l79J52j59O7J12R8P6j46k52k9M40m4m1k63M2J25rn9K00k92
2320a63j08K0K18N4L38k44l7J0N9k88J34r5Jn3J59J11N9k28j28N4J47j45J06l3
2344e2j80LK64k8K33k18q5Jk1J61N9j19k09L1K44J75N4k30j88K48k08K81j89l2
2368eL1Mj33L68r1q3j56r4MM30j37p7k75N6K29kJ88k24rj00K14k02L45l68j3K08
2394A08n1j8K9k9j17j3l1P4O1k48J26j87L2L58l0j2j89j4N7J56N1r7k80L2K88
2419E6j4M02o35J18j14K10J00K09k57j28Q3j55J76L5J02k89J6J6J80k2k23r7J31
2442a00P4J61j00K7j07q6K50j02J19j14Lk68J65J53J07r4r5k2J46Ll0N2j03k82
$$ plain form
2272 98 17 62 -11 424 -82 -7 108 -121 -114 238 234 83 -244 -150 325 111 299 -175 -147 -217 35 189 -106 105
2296 105 -178 -2 -54 198 -181 -29 -188 -121 -9 89 165 19 -233 -262 178 134 93 -170 -128 -3 -12 -71 129 -163
2320 -163 -271 -251 -33 21 359 115 78 88 147 -141 -7 -102 -101 -154 5 116 175 -53 -181 -127 20 -125 -19 -52
2344 -52 -232 -229 35 7 240 22 -63 -62 -83 78 137 18 -191 -160 84 259 313 83 -105 143 -65 216 27 -5
2368 -5 26 30 -103 265 174 91 -65 -159 -155 275 138 61 -214 -158 71 69 257 33 24 -76 138 -64 281 -87 -100 108
2394 108 57 39 68 39 -78 -91 -122 -48 13 -235 -109 -296 -264 94 64 52 -137 -151 -94 62 113 16 -264 -232 56
2419 56 42 444 -191 -73 -187 23 123 332 75 -53 30 -125 51 86 188 -101 -85 -69 111 89 -134 -231 -100
2442 -100 -26 135 35 62 -45 -131 119 17 136 22 25 -243 -78 75 182 88 -7 -29 117 120 90 142 39 -243
2466b43ML46N6k18N3j37j6N9O4J4K21k71J8K90m09K66j51q8J85P4j47O6j63J6
2490a11N6J46n1j19L4o8R6Q7k34K13l06P8J20L73j85j45R8j21p5K85k0Qk65J62
2514E6L9Kj23J08j88J53J32r1N2j54M3j51J3J57R8K0j82P3J91k71J40k86J13n
2538f1J93k50J20M3k4L9J6o1k24K41k0j57L30m69J82J20j28Q7L8k2L6kj15J3P5
2563@J01q5oj19j77J78J52k1k40K57k09K17J22M3k04j05k23K34J05J99k67k40
2585b88K01o7L21p9J44m25MK66m0j74J35N7j07J41r3L2n5K21k21J91j84Q4n2j53
2609a41K23k01J46k9K06l8j97L2%J99j27J2j69O9J27L2o2k4J7j02J41k77K82j08
2633A1k38K71P8j21j54P8K54k02M3j41K19M9l77J66M5K48k26j80L7j40J56K80
$$ plain form
2466 -243 -239 107 163 -55 -2 -139 -155 -96 -32 -18 203 -68 -50 240 -169 97 -54 -142 43 117 -30 36 -127 -111
2490 -111 -55 91 40 -79 -45 -113 -17 70 -164 49 -257 -179 -59 314 129 -16 82 -39 -114 171 151 159 -106 56
2514 56 95 97 -26 82 -106 47 179 88 140 -14 29 -122 -109 48 146 166 -16 57 248 -23 117 -169 -56 -61
2538 -61 132 -118 2 45 21 60 76 15 -209 32 12 -145 185 -284 -102 18 -110 -23 15 -7 29 27 -88 -75 0
2563 0 101 16 10 -109 -286 -108 44 23 -217 40 -169 48 170 213 9 -96 -319 -85 20 219 -48 -288
2585 -288 -87 -154 167 88 232 -193 -189 77 37 -137 -2 55 -52 89 -4 28 -27 194 -27 164 -20 64 12 -141
2609 -141 82 -119 27 -2 204 166 -31 1 1 200 73 85 -84 -15 112 144 82 58 75 -27 114 -163 119 11
2633 11 -227 44 122 1 -153 -75 179 -23 20 -121 98 147 -230 -64 -19 229 3 -177 -140 -280 -124 156
2655A56j58o5J45k9qj9j23pL3M5J43k13J17oJ04k87K41Lj2j30J64oj3l9j99K63
2681A00j43O2j08L2k1j3r6K8K32P6q9k38k8l3K52R8l61L22j9lM1l4J8k0r1q4K31
2708A11K7j52n4J6k2P5n3K24k03J2k06J27K04k2j88N7j04R6J68j21n0j20J03r4
2732a69L46k48j5JJ97k61K44j32J49k54J45K56j72m4j34NM8mK04k8l52J99K7l7
2756b9K11k92L1K0j94P0J16J12l1Q6M2j72K98k35j33K27k05J48J24k81r3J01O
2779g3L40k85N0J67l38M6j9O2J69k58Q8n0J29j67J86j09JnR5J94l05l6R0OK26
2804B04k6j81j51K90j57q7K15K7j46J16j69l8J96m1J7r6K9J5K7J51m26J71J3L7
2828a0o1K4K34l10N4K05r6L4L8j14n0N9J37k41J23J58j92J43j26mm5j04n0L29
$$ plain form
2655 156 -2 -67 78 49 41 22 -101 -108 -75 -30 113 -100 17 11 115 -172 69 72 60 -70 94 88 75 36 -163 100
2681 100 -43 19 -89 -57 -78 -91 -187 -159 73 149 60 -178 -206 -239 13 111 -250 72 53 50 91 57 75 55 -36 -120 111
2708 111 138 -14 -68 -52 -74 1 -52 172 -31 -19 -225 -98 106 84 -104 -47 -151 -55 113 -8 -58 -178 -75 -169
2732 -169 177 -71 -86 -85 112 -149 95 -37 112 -142 3 259 87 43 -91 -86 -38 -42 162 134 -218 -19 8 -29
2756 -29 182 -110 -79 -59 -253 -183 -67 45 14 100 142 -30 268 33 -100 127 -78 70 194 -87 -180 -79 -73
2779 -73 267 -18 32 199 -139 -93 -112 -50 119 -139 -51 -101 28 -139 47 -62 -61 -66 29 223 -82 -118 -28 -22 204
2804 204 178 -3 -154 136 -21 -108 107 134 -12 104 -65 -103 93 52 69 -27 2 17 44 195 -231 -60 -47 -10
2828 -10 -71 -47 187 -123 -69 136 40 74 112 -2 -52 7 144 -97 26 184 -8 135 9 5 -40 -144 -194 135
2852A35N9r8k62m2J76J42N9k44M3j14K00m8K7p4J27j45k7Q9J15M5l30K2J92L2
2876G9j13j75K34l07L06om8Q5j12nQ6m7J7L5o8l7r2P8J9K9J78k48l3J99j96MN
2903a33m8J52P5j03M2J60m5m4j12L2O8r4J1J09l6qj95K13j7J18j85J65l14L09
2927A20j66o5R5P6n2r1j89J93K91j66R4k07j2J99j43J36j30j63L45k14J09j26
2949f6J06j1J87j19J5m9M0j07j07P2r2J24j3N3J26j00J0M7j85n6N2J37J43k77
2973g0J03J9r3k7K11o1r0q6k1J85p9P3k0j45M1J44m2J11n9l44Q3J34J94J14m78
2998b03M51n56L92k99L59p8j06P9q1N2J69r6j85K2J12oj87L25k29J04j42J68K5
3021I0j55J01k37n4L0K26N5q5j15k1N5J05rj59P9J70M3j33l4m4K4j24M37m8l45
$$ plain form
2852 135 194 96 -166 -208 -32 110 169 -75 -32 -146 54 6 33 -41 86 -59 -86 3 118 163 -167 -145 47 79
2876 79 -34 -209 25 -282 24 18 -30 55 -57 -62 24 -23 -6 29 -39 -76 -168 -90 -71 -42 136 -112 -145 54 -142 -138 -133
2903 -133 -181 -29 46 -57 -15 145 100 56 -56 -24 44 -50 -39 70 34 26 -169 44 27 145 -40 125 -189 120
2927 120 -46 -111 -16 60 8 -83 -272 -79 212 46 140 -67 -79 120 -23 113 -17 -180 165 -49 60 -66
2949 -66 40 29 216 97 112 63 103 -4 -111 -39 -131 -7 -20 33 159 59 69 116 -69 -125 -73 64 207 -70
2973 -70 33 52 -41 -68 143 82 -8 -94 -115 70 -9 64 44 -101 -60 84 42 153 94 -250 -167 -33 161 275 -203
2998 -203 248 -308 84 -215 144 66 -40 39 -42 10 179 83 -102 -80 32 26 -161 164 -65 39 -103 65 90
3021 90 -65 36 -201 -255 -225 1 56 -29 -144 -165 -110 -5 -14 -173 -94 76 119 -14 -48 -92 -68 -192 245 197 -148
3046a48K22j07k8J5K63l45%K51p5N0l17J12J50Qr3J14j11J44j64J47r9j9l1O5
3070DL6q3J59j47j23oO2O0k5J66J64q6j14j32K4J68M0k12j0j7J97k26J19k96L06
3095B8Lp6p7L4R2J76j99J2N5p0p4M3Q0m3J1p7J53o6J9L3j18m4o2J60K9j12K99
3122B09n4p7j74R6N5p4J5p3J98j43o0j8J34L8o1m1P2p8J41j0k53L0N3K67j09%
3148H3M4j12R3k35J65J48L7n00K84L7r4j9R9p2l7J01K3j5J09j22j10J66n8%J1
3173B6J68j93j05j0K15J01j05R5j88o8K4J30k40K81j09J32q6j53K21Qq2q9o5j09
3197b01L04k24P0Q7l6k55K94k31L31nm3p9R6l94K26p5J15o0O4J28k79Q5O0J18
3221I6Q2l50lJ55n1N8J2j93R2O2P2j79K79k04L11k24O5j33j79K52n7q2J54r1Q4
$$ plain form
3046 -148 74 -33 -61 -46 217 -128 -128 123 48 98 -219 -107 43 51 -42 72 -39 105 -59 88 -11 -30 -61 4
3070 4 40 -43 116 -31 -154 -160 -98 -38 -63 103 267 181 67 -65 -41 127 167 -45 -55 -72 125 -101 18 -278 28
3095 28 31 -45 -122 -88 4 180 -19 -7 48 -22 -96 -53 27 -16 -5 -82 71 5 24 57 -61 -105 -167 -7 22 -90 209
3122 209 155 78 -96 0 55 -19 -4 -77 121 -22 -82 -100 34 72 11 -30 42 -36 105 95 -158 -128 -75 192 83 83
3148 83 127 15 108 -127 38 186 223 -277 7 44 -50 -69 30 -42 -79 22 45 30 139 17 -93 73 15 15 26
3173 26 194 1 -104 -114 101 202 97 192 4 -64 -40 90 -150 131 22 154 68 -85 136 144 62 -27 -92 -201
3197 -201 103 -121 -51 36 0 -255 39 -192 139 134 91 12 108 -286 -60 -135 -20 -80 -16 112 -167 -82 -22 96
3221 96 178 -172 -175 -20 -71 -13 -1 -194 -102 -40 32 -147 132 -72 239 15 80 -53 -232 20 -37 -119 35 -56 28
3246B8k51M15j78j49K91l19R5R7o6J55k07R7m7J9jj98L98k07j58J28M8J03m5L1
3270G9P6j51j43K4L75j17j14j94J73kL8k31k9L75k76J05l6j7J74L9l8k7j78K90
3294A95k4r2j11J87k85J06l6L09j39k42j37J13QJ75J61j92k1Q1j68o7J33J07j47
3317h6K86k84P1J35k15RJ51l9j81J69j93J45r0J05Q8j18J75k91R0O9Mj06J67O5
3341A26j6o7J7j09J65r5l7m3j4K52j98n3J87k02K02p5j65J07j72J24J08r9J51
3364I4K8k14K07j77J20l3MQ0J6k59K67j73K09l69K77p8l8R9k89L85j34O5j44J46
3388H9j96LJ82k15K97l24K74r6k12M87n4j28m6m6j58J9rK8J5K01j89k19L16J40
3412A59j88p7R3J49j24j09K61j34m0J37k48Q8R1l46M34j58J4q6J9O1J88j50l2
$$ plain form
3246 28 -223 192 14 -135 156 -163 -68 29 -37 118 -89 8 -39 -20 -21 -219 179 -28 -186 -58 -10 93 48 79
3270 79 155 4 -139 -115 260 143 29 -165 8 6 44 -187 -216 159 -117 -12 -48 -65 109 148 110 83 -95 195
3294 195 171 79 -32 155 -130 -24 -60 249 110 -132 -269 -156 -148 27 188 -4 -25 56 -112 -179 -46 61 -86
3317 -86 200 -84 -13 122 -93 -84 67 28 -153 16 -177 -32 -122 -17 71 -47 128 -163 -73 -4 0 -106 61 126
3341 126 110 43 60 -49 116 21 -16 -59 -73 179 -19 -72 115 -87 115 40 -125 -18 -190 -66 42 -57 94
3364 94 122 -92 115 -62 58 25 29 109 125 -134 133 -40 169 -200 77 -1 -39 60 -229 156 22 87 -57 89
3388 89 -107 -104 78 -137 160 -164 110 14 -198 289 235 107 61 15 -143 -124 -133 -105 -90 111 -78 -297 19 159
3412 159 -29 -106 -13 136 12 -97 164 30 -10 127 -121 -33 58 -288 146 -12 2 -84 -65 -4 184 34 2
3435Bj29N3j55J98Q1j83L34j39l3K4k42J40Q8l1J44m3k67J44L7J83o8k20J33J99
3459B50l51J56p3j1Nj44lJ42J87j82M6j8J57p9k3j3j54J86m8j7K9J1P9j38M4K7
3485F5j39J81j13j71K5k6J06PP0k0Rp9K17J25k75O2j04K37j55J66l8j87p9J50
3509C4K9n1j15L6J20j03%r8K08j56K36k00J36j7p7k34J21J84J90l31J19j00L7
3532c2P3k07K56o1N1j17P0r2O8J59q6R1l25J66n2o1L34j78j70K6P6p2J10L25m94
3557a42j10J73J1o6J1J76M8J80l70R8P5l5J53j00J66m1j89l7J87J7o4L6l10L25
3581A92l69J13P6J63q7r1J4P9l1p5J13k54J15l5J55oj4j70J22j08J60k96K96p1
3605iP1jQ7j10j39K28j97k09J12r2K52J01j90k3J82J09j54o9m6J19O1k18J17J53
$$ plain form
3435 2 -127 -74 -229 -31 50 -133 201 62 29 53 -189 -49 39 8 152 109 -158 -14 23 206 138 -82 51 250
3459 250 -101 55 -18 -29 -24 -168 -171 -29 158 -24 22 4 161 82 59 46 -108 78 30 13 42 53 132 -6 38 65
3485 65 -74 107 -6 -177 -152 -178 -72 -65 5 -15 -6 -85 132 257 -18 44 -60 177 22 188 150 -37 -116 34
3509 34 63 12 -103 -67 53 -50 -50 -148 60 -96 140 -60 76 59 -18 -252 -131 53 243 -88 31 -69 -32
3532 -32 41 -166 90 29 80 -37 33 -59 9 168 82 173 -152 14 -38 -99 235 57 -113 -87 -11 -83 27 352 -142
3557 -142 -252 -79 -68 -134 -123 53 101 281 -89 9 84 49 202 102 268 227 38 1 188 205 141 177 -133 192
3581 192 -177 -64 12 175 88 -3 11 90 59 -16 97 -157 -42 -77 78 72 58 -112 10 -98 62 -234 62 -9
3605 -9 62 61 148 38 -101 127 -70 -279 -167 -259 -7 94 -96 -119 63 172 18 -51 -97 22 83 -135 -18 135
3629A35l2n2j75J47Q6j94J51l56M15j15j22J50n3oo6k2M7K12l3q2K0L08k13k39
3653h9J93k24Q6K15j74O3J37k17J50k53O8L43k07k00J61M1q8j55K72k83J16K93
3675B48k00k56M8J78j21L8J36j13K63m38L7K04j8P5M6n8r3p4O4J65k61K79j37
3698A2j87J89O2j1j9J75k10p6J00n5r5K02q5j29J72m6j02L76j68N4p4k77K85k70
3722a77L82k15j7o3n1K90q6j24rK40j35q7K14r5J21n1r6j80j2P1J34J82m01L59
3746A94n4l1K3j22l7q9j16K45J70nk44J11n9k4q2P0m9LK26O8l41K88l26L19r4
3771D4j55J38l0p7M7M8j41K14R3l79J69J24J57k58m4O6J4J18jj89k5P6k29L02
3795H2m0j34n2J92rJ10m1J13n6M2k79j70K13Pp2N2J81j64K4j11Q3J04J02l03J96
$$ plain form
3629 135 103 51 -124 23 109 -85 66 -290 125 10 -112 38 -15 -21 -87 -109 -62 150 117 35 55 363 150 -89
3653 -89 104 -120 -34 181 7 70 207 -10 140 -113 -45 298 91 -109 52 93 5 -150 122 -161 -45 248
3675 248 48 -208 -160 18 -103 -65 71 -42 221 -217 -180 24 6 81 127 69 -24 -98 -34 131 -130 149 12
3698 12 -175 14 76 65 46 221 11 -65 35 -20 -115 87 2 -127 45 -1 -103 273 105 159 85 -192 93 -177
3722 -177 205 -10 -27 -90 -141 149 63 -61 -70 170 35 -52 162 67 188 137 41 -139 -151 -80 54 236 -165 194
3746 194 140 109 132 10 -27 -116 -232 13 183 178 -66 45 -14 -38 -120 -50 -99 -96 130 198 -143 145 -181 138 44
3771 44 -111 27 -3 -80 -33 15 -126 88 181 -198 -29 95 252 -6 -50 16 30 148 147 -42 -67 9 -220 82
3795 82 42 -92 -144 48 39 149 108 221 165 207 -72 -242 -29 -22 -94 -42 139 -25 -1 -112 -29 75 177 -126 70
3820G0j80l7J41nK9Kk3j17J37j01j27L36J0J14k15J29j72J53p6NJ40j74qm2J60
3845A49k07M7R0J03j70J97j80K3k47J93q6K99jj93L4q5k8L26m68J88Q0q8o5P3
3869a6p2Q6J12q0J12j29k3m6J19M4M4j77j60R5j33K98j09K3J79n8j73J08P2ol55
3894b45L34p8L4j40K3n2J92n8j40P8J25j38L2p9n1O6K01q8o1k8K09J72l03PO5
3919G7l9Lp3Jm1M9j36J75r3j77K84M4j44J05J3j72J37L5j60L8K4j13Q6J41j42
3944g8K04j82J03L6j24K3j73O9Q2j9J14j39K44k41j1J54j05j2M4O2k55K75rR6
3968A58k04R4L1j39j8J29j99J53K6j7lJ41n7q7N9j75K89k8R5q3n5k55Q8k14J65
3993a06K04J12r4l49J30J19p1K3Q7l49J26J46N0P3j21J20m5O3j13P5j18K1o9K99
$$ plain form
3820 70 -110 -147 -6 -11 18 20 -3 -120 17 -84 -211 125 135 249 34 163 -9 144 68 73 213 39 31 -11 149
3845 149 -58 -11 79 182 12 209 29 52 -195 -2 -88 211 210 17 51 -34 -62 264 -204 -16 64 -24 -89 -16
3869 -16 -88 -2 110 30 142 13 -10 -56 63 107 151 -26 -186 -91 -224 74 -35 -12 167 109 -64 44 116 110 -245
3894 -245 89 11 45 -95 -72 -124 68 10 -130 -52 73 -65 -33 -112 -163 -97 104 16 -45 -73 136 308 5 12 77
3919 77 38 41 -32 -31 -72 -23 -159 16 -77 -254 30 74 -70 35 48 -124 13 48 -112 -74 -50 -163 -77 64 -78
3944 -78 126 -56 47 83 -41 -18 -191 -122 -40 -59 55 -84 160 -81 -92 62 -43 -55 -11 51 -204 71 62 158
3968 158 -46 48 79 -60 -78 51 -148 5 31 14 11 152 95 8 67 -108 181 153 248 165 110 -145 -57 -271 -106
3993 -106 98 210 116 -233 -103 16 -55 -32 55 -294 -168 -22 28 101 -20 100 55 118 5 80 -38 -17 -86 213
4017B13l97J90o6m2J23O4J09k4j73rj01P4k3J70N6l15K70j42J35j72J63P3m21
4040b45K42p4O6j99K67q1o9K74j99R2p9Pj40J39k6j24K45j51K8J23r3k00M6J42
4064iK7K8j3j94J85oJ28j34K6K0k1k15L44k11j29J63m4kK2ll0l6Q5LLr8J91j07
4092b7R6kM4j03J61j12qj19J49j27On5J8K62j44R7k31Q0j02J31J5k08J63Q0k8
4117C6j49L3J9O2n7M2K73k06j95K9J81k3q8p6LJ45Q7j61Q9m6m3Mo7J13Q3j51J41
4144G8j9j45mJ24j08K4J08j01K09j73Mp8l0K41k02L34k60K35k31p3j8K54j35J89
4168B23l35O9J4j18J54l9Q4j63L4J44j12K74j92q7p7R2J03p6p3M3O0j03l1Q9R9
4193G6%r6l6j1j64M19j59n6L47j76j06N2k33L51r4j65j5P9P5j53J08j6Po2J2Q9
$$ plain form
4017 213 -184 6 -60 -102 21 85 194 170 -3 -12 -113 -39 -62 108 164 -151 119 -23 112 -60 103 176 -245
4040 -245 -3 -77 -11 -210 57 -24 -93 181 -18 74 -5 2 -138 1 -25 -149 96 -55 -27 96 3 -197 -151 -9
4064 -9 18 46 33 -161 24 18 146 12 38 58 37 -178 166 -45 -174 -11 -55 -57 -35 -38 -68 -104 -19 -16 -13 -111 80 -27
4092 -27 69 67 111 8 169 57 49 -70 79 -48 -42 -97 -79 183 39 136 -95 -15 -117 14 29 -179 -16 64 36
4117 36 -113 -80 -61 1 -56 -14 259 53 -142 -113 68 45 -43 -119 -116 29 116 -45 44 -2 -45 -41 -108 5 88 -63 78
4144 78 59 -86 -90 34 -74 -50 58 -43 166 -7 -3 -81 -111 130 -72 262 2 237 6 -67 -85 169 34 223
4168 223 -112 -43 -29 -147 7 -32 52 -111 -77 67 -45 229 37 -50 -127 -35 68 -8 -81 -38 22 -81 -112 -23 76
4193 76 76 -20 -56 -67 -231 188 29 -27 320 144 38 90 -143 208 114 -51 -66 13 88 -65 43 27 34 -28 -16 73
4219G3K0m08J67L08k53J61k9J62q5k34k6J03Q7J8k21N4K18j87N4K21j72l08K66
4242a1R6L3k91N0jJ98k12O2N6p8K34j09J5j46J38J5K0j2j04Q6J04l27K03O6mk15
4268a34J72L8j48j1J4J62k5PMJ13k55K89k60Q3p1k38K49J19r7M2j7n1p3M14j52
4293A74p0k71L77k50N8pm2j1J24k33M7L2O0P5l09J17J78j5P3J2l8r2J27k09O0
4318c3O6O2J97l05M0j33O1K3j14L9pM1L05j60q7L02l72M6N5o4nj5J19O5j10k2
4344fj23J00rJ63j56J24l4m7P8k26K54l28J87k2j96J88l4K02j75n6j2J47M8l5
4368C2K66k39l22K72K3R4l9j72n8OK07j67Q9j35K46o7q2P4l9o3n4M4K20k25P2
4393a7j14OK81o3n9k51J68k23K92q6j1k5J30N9m5j71L12k61J35K1%j6j3K9k13
$$ plain form
4219 73 93 -315 -148 160 -93 68 39 201 116 -118 -144 -41 46 64 -157 -103 115 -72 -18 203 31 -277 -11
4242 -11 85 118 -173 -123 -124 74 -138 -76 -20 -98 136 27 42 -104 34 49 69 57 -47 39 143 -184 19 85 81 -134
4268 -134 38 76 -72 -83 -69 93 68 75 79 192 -63 226 -34 49 -22 -260 -11 108 11 53 36 -15 -88 326 174
4293 174 104 -167 210 -40 18 11 -31 -42 82 -151 -104 -72 -12 63 -246 -129 49 34 107 119 81 -11 116 -93 -33
4318 -33 33 95 292 -13 27 -106 -45 -22 -136 -97 -104 -63 242 82 -5 297 -75 -29 26 -38 -43 -58 61 126 16 -6
4344 -6 -129 -29 -38 125 -31 93 59 12 90 -136 118 -210 -23 -45 -241 -53 -87 115 -60 -116 -128 19 67 32
4368 32 298 59 -263 9 32 126 87 -85 -143 -137 70 -97 -8 -143 103 36 -46 28 -11 -74 -128 -84 136 -89 -17
4393 -17 -131 -125 156 93 34 -217 -49 -272 20 -66 -77 -102 28 87 42 -129 183 -78 57 78 78 62 49 78 -135
4418a35J1L07q8l36J10J51J4p9q3L0J68K2k2j39P0M9l02M36j49r3K49m32O7K54
4442H0l55L43N4j93O7J32j81K13p9j46q2J49o8j14J72R2m9J84k00j01J53k36K95
4465A30j10k36K05j3J66j47k7j7K07k17J97%l31m4M05k9j42J70j37k34J36J23
4487E5Kk31RJ84j87J40n7MK59m07M21p0k27J80K13l71j91J93O2q4p5M00l82J23
4511c7j65J25m1J45p8J27m7P5j76kpK49j07k8k54M37j18k10J84rj64o5M15o3M9
4536B35k79K21m6l07O8j2mJ31o5J50k95J01m4q3J67r6J07Q1j87J92p%j4j21m3
4561a50J75j5J2L8k2j68J45o1K20m1j24JN6M4j33J5k6n5J45J8n9k6J82j54L7k02
4587a48r3K99Q2k36J51j46J09J3l7M7L0j12J19O5j98J65k89J56KL6p8J68l22K41
$$ plain form
4418 -135 -124 183 95 -241 -131 20 34 -45 -128 -98 70 92 70 -69 1 50 -252 184 35 -58 191 -241 -174 80
4442 80 -275 68 122 -71 -4 128 -53 160 81 -65 -147 2 -66 -180 -8 84 35 219 19 -82 71 -165 130
4465 130 20 -216 -11 -24 142 -5 -32 -49 158 -59 138 138 -193 -237 168 139 -3 167 30 -204 -68 55
4487 55 57 -174 -165 19 -168 -28 -85 -81 178 -229 192 122 -105 75 288 -83 -274 -81 -19 -103 -178 222 -160 -37
4511 -37 -202 -77 -118 27 -51 76 29 104 -72 -74 -81 168 61 33 -221 216 98 -112 72 63 -101 -166 249 186 235
4536 235 -44 177 131 -176 -108 -120 -124 7 -58 92 -203 -102 -146 -229 -62 -158 -51 30 -157 35 28 28 14 -107 -150
4561 -150 25 10 22 60 38 -130 15 -46 174 133 9 10 66 110 -23 -8 -34 -89 56 74 15 -11 171 17 54 -148
4587 -148 -241 58 140 -96 55 -91 18 31 -6 41 71 -41 78 143 -55 110 -179 -23 -21 15 -63 105 -217 24
4611B4J39j67P8j1j55jJ97mR9k61K55k28l25L67M7j63K33k02K79j47J05l96J54
4634h3K11k21q2J08J68m8j2k7k09J93j3J8J20l6j43J13l7J5N8j09L0q9L9J05j9
4659E0J37j65j63N3n7P9J82j21J5O6N5j28O8Nj27j81K31N6q5O1j43J55k6j11K88
4684A94K3k05K5k4kJ49k46l28L79q3J97Q3l95K43O5j42n1J66r7rM3k13K72o9R0
4709F5k57K55j52Q0J0k08J14M4J22O7k18L3k11P2L26j12K4k34L5L27j25k57K93
4732I3L3j7j78J7j09J59K3R1q7j37O0L8J9Q3r3j14J94K3o8L1j26p1K4J69j31J07
4758C3M4J38P4l7k90j29L9J61L5J6j21l5q9J36K57j33k06J49k2J15j42L8k06J29
4782d6r1n4L40j65j41jK58j8k44O1K99m51L10R7k99R0r0J97l20K62l1J19N9k58
$$ plain form
4611 24 163 -4 74 63 -92 -93 104 100 199 -62 193 -35 -360 7 54 -109 124 -78 201 54 159 -237 -83
4634 -83 128 -93 -175 -67 101 53 41 14 -195 -2 -15 3 123 87 -56 57 20 35 93 -16 14 -75 -36 69 50
4659 50 187 22 -141 -88 -145 -66 116 -5 10 76 131 3 71 76 -51 -232 -1 55 -30 31 -112 43 17 -94 194
4684 194 217 12 37 13 11 160 -86 -414 -35 -118 79 162 -233 10 75 -67 -118 48 -49 -58 -15 -228 44 -25 65
4709 65 -192 63 -89 -9 1 -207 -93 -49 73 140 -78 -45 -256 -184 142 30 54 -180 -145 182 57 -200 93
4732 93 126 109 -69 -52 -161 -2 21 112 25 -112 -52 -14 5 88 -5 -119 75 98 30 61 -65 -136 -112 57 -74 33
4758 33 77 215 289 252 -38 -167 -128 33 68 84 -37 -72 -161 -25 232 99 -107 42 20 135 -7 31 -175 -46
4782 -46 -137 -191 149 -16 -157 -158 100 82 -162 -101 198 -253 57 154 -145 -55 -145 52 -268 -6 -37 82 141 -117
4806a17J53j66j51M04k29K7M39j79Kk82N3J22o3m3j25J27J18N1k73L7J87j38L17
4829B71l27m6J46l20J49p4R4k1J16r0J9k36J77R4j2K04j57K03j07o2j53J98j39
4852g3J84l14K99k03O5J94k31J15j23K09J22k25l48K84L41j89k34K69j00K5R3
4873A60q0K1q4O1k81o3M21n1QP9k76j26K27J83j80j4J99l01K08O9j08M4j04N4
4897F6j68K14j2j21o1J22j59J80l3J47l41L09j31P7j70J99j08L2J01j89J34l44
4919b56L43j67Pj15K19j6L3oK13j65N8j71J45j36J35k21K16p6J46K3k87P0J13
4942A05j50M2J72j78j33J3K7K98o6l12P2m7OJ13P5o7k10M91l33j7K06n3j47M0
4966e3J38j22K09j72L0k35J61J45p7j52M9O8j07K6J56j92J43R9k1n8j4j08j7J90
$$ plain form
4806 -117 36 -130 -281 123 -106 -79 360 181 183 -99 -46 76 13 -30 -155 -28 90 141 -132 -95 92 -46 271
4829 271 -56 -102 44 -276 -127 -201 -107 -128 -12 -102 -83 -319 -142 -48 -60 144 -13 190 83 21 -132 66 -73
4852 -73 111 -203 96 -107 -42 152 -79 36 -87 122 244 19 -329 -45 296 107 -127 142 42 67 160
4873 160 80 101 17 78 -203 -266 155 104 112 191 -85 -211 16 199 19 5 204 -97 111 180 72 116 12 66
4897 66 -102 112 100 -21 -82 40 -119 61 28 175 -166 143 12 89 -81 118 10 42 143 -46 88 -256
4919 -256 87 -80 -73 -188 31 15 48 42 255 90 148 -23 122 -14 121 -100 116 40 186 209 -78 -8 105
4942 105 -45 -3 169 -9 -142 -129 -102 196 130 -182 -110 -157 -151 -38 37 -30 -240 251 -82 -99 107 54 -93 -53
4966 -53 85 -37 172 0 30 -205 -44 101 24 -128 -79 -11 -118 -92 64 -128 15 114 93 35 21 -87 -104 86
4990H6j01L1K4J02j11o2L8q7J72j24J55p5L2l36J19J55n6k6j19J35L6n2K99k78
5014d3J62q6j5q3q3K67j76K31k27OJ28o4K6j43J39J82k02J75j07L0j38j31K85
5037A33k05J24j35O9j5J09j9j13O7M8J3j6q7J35m5M3j13K8J48l17K54j24J80k67
5061a05J15N1k37K29J38j19O6l01K11o8M3q4K44j75N1m9J02L3j29J40l30K11J65
5084B02j44R6l12R7jL2J98k97Q6n2R3O3Q6p2j7l35L12j52Q2mJ22o5P3M8J0j79
5110c0J66j48j83L9J61k5l2K57q5q4L5j30k36J85K28j22O7K02k32r5J6J68l48
5133b26K70q3j07J67l5L6k44K27P5o6r4m5Q9J19j81J77O7l15J43q2J92j99J9l6
5157a32J03j54K78k36J57p7J4Q4n1J30M9k80q0L03k99Q8Q7R8r9J8rj2O4J20l34
$$ plain form
4990 86 -15 16 40 142 31 -31 7 -80 92 -32 123 48 80 -256 -137 18 -38 -64 -183 -48 -12 -64 235 -43
5014 -43 119 33 18 -65 -148 119 -57 174 -53 -47 81 17 43 -100 39 221 19 194 87 117 -21 -152 133
5037 133 -72 52 -83 -14 -29 80 61 -52 15 63 76 60 -27 108 63 106 -7 21 169 -148 106 -18 162 -105
5061 -105 10 61 -176 53 191 72 138 -163 48 -20 23 -61 183 8 59 10 112 145 16 156 -174 37 202
5084 202 58 154 -158 -61 -62 -30 168 -129 -43 -95 -2 61 147 75 58 -277 35 -117 -35 -39 83 18 91 139 149 -30
5110 -30 136 -12 -195 -156 5 -20 -52 205 120 36 71 -59 -295 -110 118 -4 63 265 33 -62 -46 122 -226
5133 -226 44 -39 -146 21 -14 22 -222 5 80 14 -80 -125 -36 83 -98 79 146 -169 -26 -108 84 -115 -96 -132
5157 -132 -29 -183 95 -141 16 -61 -47 37 -14 116 165 -115 -195 108 -191 -103 -16 82 -17 1 -8 -20 44 164 -170
5182a70L75k45r4J82K73k47r1l7K67j41q7P0j58K15r8J04j31J01nK41n01K99j60
5205c8Q2M6j40k62M6L49k68J20J05j32j0Q5L9l7j63K06N3J13r0oJ83k70N0l06
5229b45K55O2j49R5K08m39M2J05J53Q3l78J96j1J33l40M66j96j22N4J00j90J87
5251F9r9j02J08N9K3j39%O0J56j2j03j56K58j62J28j45nK5j63K77j93L09j50M6
5275H9j24l6J13m0J92k19M9k7m8P8j40j02K32n0o1J33m0J64P0k24K60l47K3L5
5299b0j4L8m1J40r7j1k6R5k24K33Q4j91J56L5j54k7K37j98j07L37j53M6K3j67
5323fK43m49J81L15m35K27k60J05J21N8J10j40kq5o2J5n5N0R6K9n4k2j13J92l34
5348b75K73J52j64O4j56K62O7l55K2O6K13m4o1q1n3m3J54l2J72j37q8J81m1j70
$$ plain form
5182 -170 205 -40 -134 48 321 74 -17 -54 213 72 -15 55 -103 112 14 118 -13 88 83 324 -177 122 -38
5205 -38 44 90 -50 -312 -266 83 -185 -65 40 -92 -102 -17 22 -15 -178 28 81 194 104 98 281 11 61 -245
5229 -245 10 72 -77 18 226 -213 -171 -66 87 170 -208 -12 -23 110 -230 236 40 -82 -28 72 -118 69
5251 69 -30 -132 -24 35 58 -81 -81 -21 135 123 20 -136 122 -40 88 -57 -62 -37 -200 77 -116 193 43 89
5275 89 -35 -71 42 2 194 -25 24 -3 -51 27 -113 -215 17 -33 -94 39 -1 163 233 9 269 -78 -55 -20
5299 -20 -34 4 -37 103 6 -5 -31 64 -160 73 157 -34 122 157 3 -24 213 15 -92 245 92 138 161 -6
5323 -6 237 -212 -31 284 -151 76 -184 -79 42 100 210 70 68 -17 -79 -64 -119 -69 27 56 2 -20 -133 59 -275
5348 -275 -2 150 -14 50 -106 156 223 -132 -110 -44 169 125 64 -17 -70 -113 41 9 181 44 -44 137 96 -74
5372g4k2N9J91k44L34k71O8l19K51j95N1K27r8J79o8k09J76n0M9j64K79j19j79
5395a48K25j67J99k0j09K0j67L09l78L79q2k7J38k95K98k32J10j32Oj51L48j54
5417c0J0k44M04j36J2J11j13N7j32J46j47j8J58l38J06J89N5J7j16q8J96Q2j30
5440E1j54LJ22Krm9M3Q0J65k57J31m14K76J58k39j53J01L66m14j6K19p6l9J88
5464H5r0JJ26j89L39l67K10j03o7L4m4J53l73L42M8k03R7j63N1p3J38M5r3J31
5488C5K16n8m2P6k88O2j08K25l54L26k2n7Q4j42K04O1j70j36J26O3l58M37mk36
5512f0j4K37Qk62N5J91p5j62J82j32M2k7p7J26P5k30K29j03j58J46l6Q8r5j44
5536a96K01j29L61k33p2J37r9M6p0J76l81L08j05K17k38N2o2P6NMm1J57k11N4
$$ plain form
5372 -74 -96 -37 154 -90 244 -27 41 -278 -27 -222 -171 56 -42 137 69 -140 36 -14 35 -129 150 31 -148
5395 -148 77 -90 109 89 -20 0 -167 142 -236 143 61 34 172 -123 175 -57 53 -79 -73 -224 124 -30
5417 -30 -20 -264 140 4 16 127 14 71 -61 85 -62 -80 78 -260 -154 35 90 107 -9 -97 99 181 51
5440 51 -103 -100 22 24 15 -34 9 89 254 -3 128 -286 -10 148 -91 -244 -143 223 -191 -207 12 -64 -103 85
5464 85 -5 -4 122 -67 272 -95 115 12 -55 -21 -65 88 -285 57 105 -98 -1 -164 -113 -186 -48 -3 -96 35
5488 35 251 193 151 227 -61 1 -107 118 -236 90 68 11 95 -47 157 218 48 -88 38 101 -257 180 176 -60
5512 -60 -74 163 171 -91 -36 155 80 -82 100 -32 10 -17 -94 32 107 -123 106 3 -155 -9 -45 43 -52 -196
5536 -196 5 -124 237 4 -68 69 -30 16 -54 122 -259 49 -56 161 -77 -25 -87 -11 -6 -2 -43 114 -97 -43
5560d3R0k0Q2k51J35K17j60J15j00j14L4J8J45k49M1K05j71J7k13J06L33k91P1
5583cm1K15k15j41J46K00p4k44Q7j0J52l4N5l1j12M8o4J45j21m5J67j35J54n0
5607D9k48K51n7J9J03Mj77J40k5j05J65j53q6K29j46JL4j4J6J76j68k0k07L49
5631A30l21K21K91l94m1J13J96J69m50mO3k8n5rJ93J1j58J26oj09J86j58j24K65
5655A07k45J5J55j35Rl1J51J68j94q6M0J38J72k32j49%L5o5K1n2K58k89J21J79
5679I1J18k25l46L19j0J14j28J29m7j35j18K09J87j3j51r6J47q8R7J38l50K39
5701H1j60J64l03K32J56K9l66K50pj08O4k73J09J26o3J40k2j02J38mj39O3k19
5724b14L93k38K36j35l5pj03j88J74P5N0Mj42J99pn6J47J30j73L7j20M4j41J90
$$ plain form
5560 -43 47 27 109 -142 -7 210 50 165 65 -49 -15 3 148 -101 -60 145 -26 -9 -222 -116 217 -74 -3
5583 -3 -44 171 -44 -185 -39 161 87 -157 -70 -80 72 38 93 62 -50 -2 -66 79 -42 -87 80 -55 99 49
5607 49 -199 52 -5 14 117 121 -56 84 59 -46 119 -34 -120 109 -37 -36 -2 -16 0 176 8 -12 -219 130
5631 130 -191 30 321 -73 -114 -1 195 364 -86 -90 -27 -55 -110 -119 74 85 -73 53 47 -62 124 -34 -158 107
5655 107 -138 -123 32 -103 -94 -125 26 194 0 -86 -46 92 264 32 -117 -117 -82 -147 -126 -178 80 -209 -88 91
5679 91 209 -16 -362 -43 -53 61 -67 62 15 -120 -238 -29 158 145 -6 -102 45 -43 54 192 -158 81
5701 81 -79 85 -218 14 170 199 -167 83 76 -32 32 -241 -132 -6 -69 71 49 -53 85 81 -58 5 -214
5724 -214 179 -59 177 42 7 0 -103 -291 -117 -42 8 12 -130 69 62 6 153 283 110 147 27 71 -70 120
5748A20j77j61pK95j11J53k23J74k4r1K65k04p8Jn4O5r3J63l1J41n5j48m9J93
5772F4k42J98j6qj70J50J54j10o8J23m0j57K36j33Q2lj2q8J54k13J30Kj00q1j6
5797a64J56n2k1Q3M1J22j20J07k92K19Mr8N6m1M4l1j15K62j95J38j07N8l7j49
5821a32J51N2p0J6K4k26J51O9j40j04J29O7L8p8j33J51J31j16j00K08j18p6J83
5844G7k15K21l3j80j31K16J07j2j22J64J4k09J37l49N00j61nj6M9pJ05l4l07J34
5868e7L35l69J30J38l16l8J56M8nq7m1K40j24j17J56n0K52k27j59J29j2J08l07
5891b17P5K30o3j58N3m9O4K32j97Ro0M7P0j59Q7P5l09J32L9j54J65O0j28Q4J57
5916H5J49j76j31J17j07J76j48q3K74m95L57K4j05Q4P8p3j46J21J35p9k01K18
$$ plain form
5748 120 -57 -218 -225 70 -41 112 -111 63 39 -52 213 9 -69 -68 -122 -57 -150 13 -18 123 68 -80 -129 64
5772 64 -178 20 4 -4 -174 -24 130 20 -48 75 35 -122 114 -19 63 60 48 -40 114 -99 31 33 -67 -148 -164
5797 -164 -8 -60 -81 2 43 165 45 152 -140 79 83 -15 41 0 44 13 -102 160 -35 103 -4 54 17 -132
5821 -132 19 71 1 17 41 -185 -34 35 -105 -209 -80 -13 25 -53 -186 -35 96 -20 -120 88 -30 -106 77
5844 77 -138 83 50 -130 -261 -45 62 50 -72 92 106 -103 34 -315 185 24 19 3 52 45 150 116 -191 -57
5868 -57 278 -91 39 177 -139 -177 -21 27 22 -65 -106 134 10 -107 49 -1 251 24 -135 -6 -18 90 -217
5891 -217 -142 88 25 -133 -80 -129 -65 167 -30 -21 -81 -34 36 -123 -36 39 -270 -138 -99 -253 -88 -28 -156 -72 85
5916 85 234 58 -73 44 -63 113 -35 -118 156 -339 18 42 -63 21 99 26 -120 1 136 57 -144 74
5938G4m0k42L29J34k03j06q5J9L3K75m38L06m5m3P2L5Q5j85P3J02k83o9J16J09
5962B3o8j60J98q5J66l57L03l8qM9r5J18J23M8l24q5K97J30k45k71K33Q7J32j42
5986B9j4j12K37j67k3K39k07N3K6r3M8j11p6m0L48k65J90o1J36k7o9L9j08J53
6010A25k86K17K60j62l26K64o9j72J58J60k34M6O3J1l7k7K11j89j31J77j0P7l20
6033a94K41j8J1jj4k83K72Q7k04J53K0q4j89K86j2j6j92k7L46m15k0K40k22M20
6057A85k07J8j39P3R7k01M8J77jn1j2O8Nk8J4J8j35M5K0J09o6J71l46J63k6r9
6083a00K48r4k52K25J16k00K36j86k0J36no2r1n1J52j58J73m1o3J24l3k26K20
6106D8m5J72j47o7L5k21K54M7j07k29P4K50J67k55K1L6l2L8k3N9j87K11J08l57
$$ plain form
5938 74 34 -208 121 255 52 -54 -139 -120 -87 188 -250 56 11 -32 40 75 160 -25 48 150 -133 -202 -86 23
5962 23 -45 -205 -7 -92 74 -283 20 -18 -26 23 -72 46 169 217 -107 -192 105 235 -10 -281 -48 39 171 29
5986 29 15 -97 140 -27 -50 189 -18 35 61 -32 16 -95 -171 -211 137 -128 62 1 137 110 41 80 -28 125
6010 125 -161 56 316 154 -172 92 23 -149 9 169 -65 -19 44 55 18 -9 202 13 -118 59 49 126 -194
6033 -194 47 29 40 39 25 -258 14 101 -103 50 70 -14 -203 83 71 55 -137 -164 182 -233 -253 -13 -235 185
6057 185 -22 -4 -143 -70 27 -174 -126 51 50 -1 -13 55 60 32 46 64 -71 -26 -6 103 37 208 -138 25 -1 -100
6083 -100 148 54 -198 27 143 -57 179 -7 -27 109 104 42 -49 -100 52 -106 67 26 -37 87 54 -172 48
6106 48 3 175 28 -39 -4 -225 29 76 -31 -260 -186 64 231 -24 -3 33 1 39 16 75 -112 99 207 -150
6130a50LJ83J00j14J73k6r5r3j47J72l2R2J49j08p7l1J41p9K42m21L9m4J07K3
6154Gj18J93J01j38k1J5j65J11q1Q2K49p1l61L05k51J64l7L5m2Q1k59L75l35K0
6178a41L13j01j58kljJ88l3q2Q5J29l64o6K09M5k70R7J14K01k09K10j76j0m8J58
6203H5k37m7J25J31k07P5j1o0K04j01K4J56r7J10k9J6j0j23j06LJ14P3k18J56
6227B6m2J99k75L0j5Q0o0J63j83j9J82r0j80J47N9rP3N7R5l09j8J02j67K60j60
6252e4l5M2K01k1oj32n5m5KL1Q4K10l62K39k79J98M1J57l49L6P2O2Mn5M9O8j24
6279b1R0j43J8J46j12k4n7J08j20K08l26J63rJ20k02K86p5O2l22K80j30P9L8k48
6303a91M6K40k41L14q8m7m6J30j04Q7r1M5l23J89N8l3O5j57N04k78pJ24j40n2
$$ plain form
6130 -150 -147 36 136 22 195 169 74 -19 -166 6 -26 66 215 107 30 -1 140 61 303 -118 -79 -123 -16 7
6154 7 -111 82 183 45 24 39 -126 -15 -96 -14 235 164 -197 108 -143 21 -16 19 -23 58 -201 174 -161 -141
6178 -141 172 71 -87 -89 -92 -93 95 62 -20 65 194 -170 -236 -27 18 -252 -155 -41 160 -49 161 -15 -25 -73 85
6203 85 -152 -199 -74 57 -150 -75 -86 -146 58 -43 -19 137 40 150 121 137 127 4 -102 -99 15 88 -130 26
6227 26 -16 183 -92 -62 -77 3 -57 106 -77 -96 86 -4 -184 -37 22 13 86 143 238 -71 -89 13 -154 106 -54
6252 -54 -89 -47 154 133 127 -5 -60 -105 -103 -72 12 222 -140 99 -180 18 59 216 -133 -97 -25 37 41 -14 35 103 -21
6279 -21 69 -74 -56 90 -22 -46 -103 5 -115 93 -233 -70 -79 41 -161 125 50 112 -210 70 -60 19 57 -191
6303 -191 -145 95 -146 168 80 33 -13 117 13 100 9 54 -269 -80 -22 -55 10 -147 357 79 72 196 56 4
6327DM8O0m2n4K1K08l70M12l07K06k88J86r0L3M0N1j1k40M8l2J32J02L2l49J76
6352b4J33r9R0j42m0L03l54K82j86L11m79K95k6P5j31M4J31l1j85J99l55K48j53
6375i4P0n5J95k18r9K45M4l9j80NK19J7p8J50k33Q9p5m6K24l55K01k4M7N1j51
6400i0RJ48J22j72Q9L4k59K18k2k16K86j01k00P0L85l63nl2J42j78R6L30j71k94
6424a74K18K9k54K19o4mJ16p5j00K49k23o6K43m21K90K31l43J94K9M7l22jQ7m8
6448a43L12L9k26L42l79O2l84L55R7N4j33m3mL3K17j61k45K57J28P0j14l39K59
6471E4K3L9qj29k32L50l61L24k31J61j87J00J32j32J07J18N7l45J00j82K51Q8
6493I7k8k08K94k85L96j36j17k4j05L6n3N2j45L61m12N50l99J40J16qk42L05j12
$$ plain form
6327 4 52 112 70 16 37 245 -125 287 -20 186 -102 84 -6 27 67 118 107 -133 -85 -117 15 117 149 -200 -24
6352 -24 109 10 100 -42 -82 221 -133 149 -37 274 -205 90 64 139 8 52 183 152 -33 166 -189 59 -94
6375 -94 -24 -79 116 -102 -201 44 88 49 -131 -126 93 110 32 182 -51 38 -37 -83 141 -214 -13 -37 10 61 -90
6400 -90 -81 67 189 17 106 140 -119 99 77 -139 147 46 -154 -84 301 -62 -67 -99 43 -135 -39 291 120 -174
6424 -174 44 73 -181 38 -26 -30 86 11 -89 160 -63 -129 114 -307 -17 214 -129 65 94 141 -181 -182 -95 -143
6448 -143 169 208 -18 324 -55 7 -377 -22 75 129 -4 -47 -51 -18 199 38 -207 50 178 248 134 -205 54
6471 54 77 116 108 -21 -253 97 -264 60 -171 -10 -197 -97 35 -97 10 128 185 -160 -60 -242 9 97
6493 97 69 -139 155 -130 266 130 13 -11 -116 -80 -133 -81 -226 135 -277 273 -126 14 130 122 -120 185 73
6516G3J37k07P0k22K6J14j35K56m67L46J15k2j77l1J74K53n23J26k9K62k12J84
6538A11r6r8o5jL69j26j05M3k7Q3r4j68L01k53J93Q5%k24O9J1J53k11J5J09l4
6563D0P4j0j08M6j45J38j47Q2k21K65O6r8M8K6k28P3J08j31K15M7j39k6J60j19
6587A6L5m3n5K09j51k0M8K05j73j07P5j2R4J90k32l9j74K38k64J17pM8R5k71K08
6612C0m0P5j28J32m1J18M1j54J17m7j52J14N5k65J70Rj4j8m3L0j8r6J04J3m8K72
6638B16l09J73j10o8L51l76J77m5o3Q8n0J19o7p4K59m25J79J14K32n05K09Q5l31
6661b21K14K60m8k99J54j08oK49l6k66N5j76K35J1r7K3J20k00J15P2K8j65J12
6684B6q1M1J5J0j10J22j4J55j9k38QJ95n7r3R5j8k65R2J79k79K13J12l3j62J07
$$ plain form
6516 73 210 3 73 -149 -123 -9 -144 112 -355 -9 106 84 -93 -124 50 303 -220 -94 -123 139 -73 111
6538 111 15 -83 -148 -149 220 94 -11 32 5 88 -6 -174 127 -126 67 152 152 -72 -3 8 161 -50 -35 74 40
6563 40 114 104 -4 42 -103 35 -112 -30 -251 14 80 -18 30 56 -172 -99 9 -122 93 140 1 -25 135 16
6587 16 51 8 -47 162 11 -9 39 244 71 -36 39 27 121 311 79 40 -134 104 -160 -43 -50 -2 93 -178 30
6612 30 -10 65 -63 69 28 146 187 33 150 103 -49 65 120 -145 25 34 20 2 -41 -11 -29 -125 -21 -8 -56 216
6638 216 -93 80 -30 -98 253 -123 54 9 -54 34 -16 103 36 -38 221 -204 -25 89 321 -184 25 110 -221
6661 -221 -7 253 205 -94 60 -48 -54 195 159 -107 -52 -228 7 18 -79 -56 64 -136 -21 51 79 -86 26
6684 26 -55 -14 1 11 -99 23 9 164 145 -93 -85 110 53 -40 55 37 -228 -136 43 -236 -23 89 56 -106 1
6709AK0K11o2L0j14l21L41j92k8J23j22P0P5n3mn0q2Q9J14mM5j18ol4K05j34%
6736@K02l42K28r6j19K7M7J8L6RN8j3K7j02p3M7r7J92K3J45k73k4K20j35j11P1
6762c5J13N8K8m36K88K56k64k10M16j01Pq6Pj25P4J67l11J0R4J08j53M7Q1R8k37
6787a06r5O0K21J44m06L83j90JK1J18K5p2o2Q1o8p2J20j16j8K09n3l7rj00p5J44
6813D8R5l33L50j98k13L04Kj41L08j56J07k78K5q4J86K29m52K80J84n3l62K41
6835H9R8k06j3M5J63L5l14J86k34J64j62L09Q7Nm01P2R3J02m4l6P5k23J78J10
6859A78N3j47k35L45l04K15j27J13j19j80J00J29j29K20N5Rk16J49k42K37j71
6880f7J96k69P2N3r4j59J95J65k85Q2J78pj02m3Jr2J70qJ50k18J04P6j1J4m3p1
$$ plain form
6709 1 21 232 170 200 86 -235 106 -86 -114 9 -113 -43 32 -21 -25 -75 -157 -68 46 42 87 -31 -37 -71 134 0 0
6736 0 202 -140 88 -8 -127 -100 -53 -35 1 10 68 55 82 -20 -93 -46 -143 49 72 217 -56 -80 140 5 -106 -35
6762 -35 78 136 164 -272 16 272 8 -202 214 113 120 34 41 -84 -10 157 -154 -144 -50 58 -95 -48 33 131 -106
6787 -106 -201 -141 80 224 -182 201 11 12 33 151 176 104 42 123 55 -17 103 -13 -31 178 125 88 79 -21 -96 48
6813 48 143 -190 160 -38 -251 53 55 -86 222 66 173 -105 -80 -164 22 251 -201 79 263 210 -152 89
6835 89 187 -19 -32 13 176 211 -103 83 -151 13 -149 160 247 252 -149 -77 16 118 74 38 113 -110 68 178
6859 178 231 84 -151 194 -110 105 -22 91 -28 -208 -108 21 -108 112 167 176 -40 109 -133 104 -67
6880 -67 129 -140 -68 -15 -109 -268 -73 92 -193 -111 67 60 -42 -85 -84 -176 -6 -14 136 -82 22 98 87 101 58 -13
6906a3OJ5J0R8j89J24N3l13K23m0Nk8Or7R2JJ31j86J25LJ34k16l4K11j7j19o5
6933h0K8K13K5j64lN5n8k69J39K5J47qj4j67L32Mk1j98J38j64o1N1k4r8j1J18
6959f5J87k73J23P6p6M2j4j39N2J29j18q4K32j32l6R3M0J33k34O5P2q1K56n8k51
6984f1J06k1N1m6j07J14q0RO4O4j52R7N1l7j02o8M74m01O0j6n5j6J53%j34J13
7010F0p0R5N4K9j71P1L5Lj64J27K05l41J31j9j64O8O6J2M9j76J32j06J13Nn2R0
7036H2k40J7J60L7q9M3j00K07k09J16p0J7L34l22J34k09P2K01k10o9K15l39J50
7059g2l5L13k01l0j2p6J05j38N09l10R8m9j71K01M8k32l2P8O6j90j19M31j28j3
7083D1M0n2N6k21K64j35J70k99J22J43r6rN7k41K93j24k30J39J32j78J81k9j79
$$ plain form
6906 -13 -7 8 18 116 -73 51 104 -209 14 -26 -21 -49 -43 -140 -48 -47 84 -102 23 26 160 -56 -90 121 104 -15 -80
6933 -80 -52 161 186 22 19 74 16 -253 -114 -89 58 50 36 -131 201 205 184 -14 124 -40 -101 -50 -74 -172 -183 -65
6959 -65 122 -151 -28 48 -28 14 0 -139 -87 42 -76 -160 72 -60 -96 -3 37 170 -64 1 73 -8 248 190 -61
6984 -61 45 24 75 29 -78 36 -44 -35 29 93 -59 38 89 52 -50 -118 356 -45 15 -1 -56 -72 81 81 -53 60
7010 60 -10 85 139 168 -3 68 103 106 -58 69 274 -67 64 45 -119 -51 15 27 76 -100 32 -74 39 44 -8 82
7036 82 -158 -141 19 56 -33 10 -90 117 -92 24 -46 -29 305 -17 117 -92 -20 181 -29 -98 117 -222 -72
7059 -72 -107 206 5 -25 -37 -113 -8 -146 363 53 151 102 -69 132 180 -52 -84 -6 60 -130 -249 182 54 41
7083 41 81 29 85 -136 128 -7 163 -136 -14 129 33 24 81 -160 133 9 -221 -82 50 -128 53 24 -155
7106a55oJ72P1j57K3jL8j29J59j86K68r8M1j37K54q9k12J64Q4j25J0k11J51J29
7130E8j20L8K0J44N1k26J98j82j24J35m3O9l1L7P4m6j45P8l9O5J30k73K49Q6j59
7155D4n9k3J35j07J54m25M02p4N1K3j95M6rl7j03K05l11M92p0k47J14j17Q4N9
7179C2k7l8o2J73n5N5j63J20j04m1K08l7pk12L05Ok47j00K99j64J95r8mj3j53
7204a32J84j17o2J58n1O1K8m8n4r9L43k53J89j93m8L2o7J05j63J13L2R5j0j61
7228a18J39M4l9J8j13J77n8j73j00J96Q5J05l9r0L9r6N7j28J56l9l6N3k18K93
7252A15k89K26L9q4j88K0R8j14J91k23P5p7L51r7P6j53J05n3M1J56l2l38J58j33
7276a30R0J02M9j79J30k04J18O2j38Q0j15K62q5J04K1k16n6RJ02J81k86K37k30
$$ plain form
7106 -155 -161 11 82 -75 -52 -53 -15 -144 15 -171 97 -1 40 -97 157 68 -144 20 104 -21 -11 -222 -71 58
7130 58 -62 -24 -4 140 191 -35 163 -19 -143 -8 -51 18 -13 24 98 52 -93 -15 -54 11 141 -132 117 203 44
7155 44 -15 -38 97 -10 144 -281 121 47 98 121 -74 -28 -37 -74 -177 28 -283 209 139 -108 6 -111 -27 32
7179 32 5 -33 -95 78 23 78 -85 35 -69 -110 98 61 54 -158 147 153 -94 -194 105 -59 136 38 34 21 -132
7204 -132 52 -65 -127 31 -20 41 69 21 -33 -132 211 -42 147 -46 -94 -62 -129 -24 -187 -74 -42 53 43 -118
7228 -118 21 65 26 44 -69 108 50 -123 -223 -27 58 163 124 34 73 -23 34 -94 62 23 -13 40 -178 115
7252 115 -174 52 91 7 -181 -161 -63 -177 14 -209 -134 -211 140 43 119 -34 71 18 59 215 183 -155 3 -130
7276 -130 -40 62 111 -68 62 -142 -24 38 -100 -20 -135 127 42 146 167 -49 -105 -96 6 187 -99 138 -92
7299i2l4J03n7L3K30j30k4J01j15P8L7l08L72k96j8J89k71K92j15M0K7p1J96j14
7323E3Pl14J61J28J18j4k01r6O2J92m6j01n1J89n6L0j98J8J37r7j51L71m8R4k42
7348e5N4k5Qp4n1K56Jp2P5j27j03P3P5n1O2P4j37J57OP2m32J41J46J30m7l33J37
7375d0K1J69j65K6J70k1j34J57k73o2P5R9j27L7J78j24K0J27QMk26Q3N4L4n0j0
7401C0K38k27%k0P8n4j44J0Q5k33K41rK5j95J94Q6j90j2rj8J03r4J00K9j34N6
7427f4p2j52N17k09K7L9n9q6K6R6q8K26l56J08J35k07K46j29J07m7j29J60j2k10
7451a33Q7J37K12m09Q4KJ97k55J17j44om7K9NK86j38Ml8l4J15j2L4J05j03k34
7476a39M0K36j76LJ99j7j58rN7lM2k36J65j47J37k1k3P5J09j28M4q2J9J1j90K36
$$ plain form
7299 -92 -126 -23 -80 -47 183 53 29 130 15 93 130 -178 194 -102 -120 69 -202 90 -25 15 42 -29 167 53
7323 53 60 -254 -93 35 153 139 -62 -158 -96 96 50 -51 -102 87 31 61 -137 -119 18 -79 -230 141 93 187 -55
7348 -55 -1 -26 -18 -92 -143 113 114 42 117 -10 -113 -40 35 -16 46 120 -17 140 146 218 -214 -73 73 203 156 -177 -40
7375 -40 -19 150 -15 11 181 160 26 183 -90 -152 -77 22 -105 -68 110 -14 6 133 141 145 -81 2 56 90 40 30
7401 30 268 41 41 21 99 45 -99 -89 -4 -237 4 -5 20 -175 19 105 -85 -97 -106 -124 -21 -115 -15 14 -120 -64
7427 -64 -136 -288 229 20 47 86 27 -59 -33 63 -25 201 -155 -47 88 -119 127 -2 105 58 -71 89 77 -133
7451 -133 -46 91 303 -106 -22 -20 177 -78 39 -105 -111 -158 -129 -124 162 24 28 -10 -44 71 59 93 198 95 -139
7476 -139 -99 137 -39 -36 163 146 -12 -21 36 33 75 -161 4 -143 -6 -27 -50 25 134 6 50 -32 -13 -2 -192 44
7502D4J3j81N3J15L8j20j10P2J58k24P1L64q8j01L9J2j88R6j42O6j08J61l32K25
7526f7k4J30p1L21k53k27L34m6J27k36l9n7J86Jk72K95k7k5j99L00j83o6jr2L20
7551A29m34K00J13j10K55r0k43r5K13J19Q6k31Q2joR3q1j0n7p0J46J05j57J19
7575G5k04lJ00K19r6k69K09M9m9j54J20r1J19N3j93L04k04o3K5J17j42J98P2r3
7599I9j82N9R2p0K13l20L07j85lJ43l33L00j01j33K57l36L28j28j3m8N8p6j07
7622a79J17oRN9J41k95Q6J98N7j92K1k38K25J94j26J40k77NL26j67j49R8K8k54
7646a79L53m15L18j58j30L7J00J9j71L44n3q8l3P8o5M2N2l4l4J11k12Q9Q3pj83
7671a36K82j10J0k0j83J72J16k14k8J08j84J17K16O6m88L31j38Ll7K97j23m3M3
$$ plain form
7502 44 57 -124 -71 44 82 -38 -148 -76 82 -142 -71 293 205 104 143 155 -33 63 -79 -13 -121 40 -292 -67
7526 -67 -91 39 -32 289 36 -191 143 97 224 -12 -51 -108 78 79 -193 102 75 50 -149 151 -32 -98 -99 -191 129
7551 129 -305 -105 8 -102 153 63 -180 -275 -62 57 143 -88 -6 -7 -13 80 -1 -11 -68 -138 8 113 -44 75
7575 75 -129 -132 -32 187 91 -178 31 80 31 -123 -3 -94 25 78 -115 189 -15 -78 -53 64 -78 120 192 99
7599 99 -83 -24 68 -2 211 -109 198 13 10 153 -180 120 19 -114 143 -193 135 7 -6 -54 4 -72 -179
7622 -179 -62 -68 -59 0 141 -154 -68 130 187 -5 16 -222 3 197 71 211 -66 -61 265 98 -51 47 75 -179
7646 -179 174 -241 77 -81 -211 -174 -74 -55 -226 118 65 -23 -56 22 -43 -1 51 17 -17 94 -118 -29 54 47 -136
7671 -136 146 36 46 26 -157 15 131 -83 -111 -3 -187 -70 146 212 -276 55 -83 -80 -117 180 57 14 57
7694E7L2M3k45J80l4q4M7l2J66k28K4N5o6J16k6P6j22n3J22j25O1J62j61j59K16
7719B2M6j45K0J46j85J84l19L06j32j68K40n1j71K35l5p1J44pQ7J61k12o1Q8k53
7743a31M9J95j17M3j30%J6k3M8J8L10l46Q0n2J81j90J66j79j26J75k6K8J15Po9
7768D2l8k64K20Q5J10l35M95o07L37M4l8k4l4P2O3k79l0R1O8J76j87n3L83j41
7792A56l89K57n7L4jM8q7J63j57PL9j5K8R1o7j58J85K5j80J72j59j25K43j18l1
7817i6J46j24O1J16j8j19J64j18J09j82J36p4j35m2J89j08J6J12L2J00n6j89K03
7840A23j56ql7J06J60l43L01k36L6R9r1J53K0n3j09k15L43J04r8l7j43J71N1k09
7864f8J70k07J6J44j36J55j23km4M2J48j84R8j3j4jn9K22j02K45n40K65l6j48
$$ plain form
7694 57 89 132 -113 67 33 -51 -4 -36 130 -98 -74 -19 -85 31 5 81 -41 -94 28 -97 -36 126 -35 -194 22
7719 22 68 -77 -57 89 -96 88 -231 75 -57 -225 15 -36 -207 28 -7 -78 66 59 146 307 95 34 122 -131
7743 -131 -82 113 -4 39 -91 -91 -75 -98 -50 -32 278 -68 12 -40 141 -49 117 -62 -188 -13 -39 -11 104 111 42
7768 42 4 -260 -40 45 155 -180 315 -292 45 89 51 27 -7 65 128 -151 -181 -90 -22 154 -33 -86 297 156
7792 156 -233 24 -33 1 0 48 -39 124 -33 -26 13 -2 26 117 50 -108 77 102 -78 94 -65 -190 53 -65 -96
7817 -96 50 -74 -13 103 85 -34 130 12 121 -61 75 1 -134 -176 13 -95 -79 33 65 165 109 -80 123
7840 123 -33 -41 -78 28 188 -155 146 -90 -54 45 -46 107 127 74 -35 -250 93 197 99 62 -81 90 141 -68
7864 -68 102 -105 -89 55 -81 74 -49 -51 -95 -53 95 -89 9 -4 -18 -19 -78 144 42 287 -253 12 -24 -172
7888a72O6Q4J13M1k86Q3M4J46j47j58L28k78Q4R4N0k51K33P9k50J71J66j93J32
7911A79k82K34M3j84q3N7M4K00l44J50Q0k19K7Q4l9K64k50o4K60k68J57JK4p6
7935eo5J86j20J31j68m9K42j24J0j18j61K33M4j3j68K90j98M7L1JKr9r9J32J53
7960A15j15n1P3nJ1j33L2mJ44j76P5j68J23K69k36l3P9K37k89L0k0J25M5j32K05
7985B01k01o8J78l53J62K40j03J11l47m7J54J99j00j89O4l0P3P5J39k36j88K30
8007c6j7j2l3K49k93J41n1J1j02K80k30Q1O4m7Rj22K08k02K85j62K40k19j33N1
8031d0K1J6J53k1k53J85j9r6k9J52j66O2R6j75K51l1j24j23J24j45K15J2j49J82
8055I8k00L2K00j91o2J98N1j21J3p9q9L00j79K03j87P2j26O2L2m3k9J79k14j62
$$ plain form
7888 -172 -106 -22 91 132 -154 -71 -27 119 -28 -186 142 -136 -52 42 92 -159 74 153 -97 74 240 47 179
7911 179 -103 131 174 -10 -93 -36 8 208 -136 14 94 -125 -98 -14 -53 211 -39 -103 157 -111 46 47 71 -5
7935 -5 -70 116 -4 127 -41 -90 152 28 38 -80 -241 -8 36 23 -145 145 -53 -6 25 26 28 -71 -170 -38 115
7960 115 0 -51 22 17 28 -105 -73 -77 67 -109 -34 -202 -79 190 -46 -79 0 237 -52 -22 -42 83 128 -4 201
7985 201 0 -68 110 -243 -81 159 56 167 -180 -227 -73 126 26 -163 -99 -129 -56 19 158 -78 -266 -36
8007 -36 -53 -65 -98 151 -142 -1 -52 -41 -143 137 -93 -12 52 5 14 -108 100 -102 183 21 261 42 -91 -40
8031 -40 -19 -3 150 129 -124 61 42 -54 -83 69 -97 -35 61 -114 137 106 -18 -141 -17 -162 53 65 -84 98
8055 98 -102 -70 130 -61 -123 75 126 5 18 -61 -150 150 -29 174 -13 59 -67 -5 27 -16 -45 134 -80 -242
8079b42K96j66J07J05l25K71k0Q9r3n4n4k0R0o3q8J45K1m7J53j20J02j00j5k27
8103b55R1J86j49J74lp3p0P3K22j14k65M8L0J5J46m1O3p4l4r5J27J62k33L1l7
8128g5l3J80k04KK40j32l7l4L07k08J08k94J19l5J47R0M3j86O2n1l0j6j09L87
8152B41k68J83l00R1O8k4m0J08j36n2J25m1K5K16j84j06K01k94m5P4J50R5n3l
8176C1j46p5K93k94K83qk60K02J06k72pR9m0K41k42
$$ plain form
8079 -242 54 -112 -5 100 -225 46 26 115 22 -32 -86 -106 -16 -79 -167 -22 -1 -48 105 -15 87 -13 -28 -255
8103 -255 -164 22 -127 47 44 -29 -99 -26 196 82 -183 -135 -105 -90 56 15 78 4 -30 -125 2 164 -69 -38 -75
8128 -75 -108 72 -132 -130 110 -22 -59 -93 214 6 114 -180 -61 -96 51 141 184 -2 60 9 -21 -37 -146 241
8152 241 -27 156 -144 -53 15 -9 -49 59 -77 -129 -4 -45 -20 196 12 -94 107 -187 -232 -158 -8 87 34 31
8176 31 -115 -190 103 -191 92 84 -176 26 132 -140 -147 -48 -88 153 -89
8191h9
$$ Imaginary data points
##PAGE= N=2
##DATA TABLE= (X++(I..I)), XYDATA
0@%%%%%%%%%Qj6J6k4L2l2M0n6O4q0J02j18J40j64J92k28K68l11L59m15M77n46
31b92O23p06Q02r07J020j149J290j441J609j794J994k212K450k710K997l308L646
48A912m022M433m880N378n929O540p226P994q864R862j1018J2373j3992J5965
62H526j8428K1613k5909L2049m1618N8728r8686L65692K11687p10227l00256J72133
74c24696M97175K03821j02894l76235l06527O5839M25657L14391o2213m21089
84h6771l02549O9685L64998L42776j9065m06583l50562N0279M37449L28878j26461
95C02074l96682k99245M9265L90343L38817n2002m22735l32652J45281M01501
105A23965K32740r1590l34879k72312M6466L55671L39105p9425m08236k76529
$$ plain form
0 0 0 0 0 0 0 0 0 0 0 8 -8 8 -16 16 -16 24 -32 32 -48 54 -64 76 -88 104 -124 144 -167 192 -223 254 -292
31 -292 331 -375 427 -480 540 -609 681 -760 849 -945 1049 -1163 1287 -1423 1574 -1734 1912
48 1912 -2110 2323 -2557 2821 -3108 3432 -3794 4200 -4664 5198 -5820 6553 -7439 8526
62 8526 -9902 11711 -14198 17851 -23767 34961 -63725 301967 513654 -196573 -496829 -324696
74 -324696 172479 376300 273406 -102829 -409356 -343517 82140 396531 334318 -86771
84 -86771 -389320 -319635 45363 388139 369074 -37509 -388071 -337792 99657 428535 302074
95 302074 -94608 -393853 -344588 45755 384572 332570 -90165 -422817 -277536 123965
105 123965 356705 265115 -69764 -342076 -295610 60061 399166 319741 -88495 -365024
115c65024R2721L51717K55373q1420l28161k95288O3908M06049K91370j29425
125B61820l88158k16500J50461K82386J79178l1507k65411k66678K2225L26040
135E3856K95378q3052l48238k47876N7103L22214K75062o2494l36896k70548J04355
146b41136L61942K12519j19779l15421k05527J02194K87494K10108p2357k99199
156g9162j98968Q5514K57570J87131n5105k37192k26780J335L00863K89694o5144
167B59756l40471k35755J16109L01881J68726q1621k59740k01136P0879K73467
177G2095K09271p5336k84480j88773O9968K49700K00712n4520k56753k07687O1613
188b04190K89038J94197r6321k58882j73361O6493K33795J87714l3663k56600
$$ plain form
115 -365024 -272303 79414 334787 253367 -74794 -370082 -306174 99875 391245 261820
125 261820 -126338 -342838 -192377 90009 269187 237680 -27731 -294409 -272184 53856
135 53856 349234 266182 -82056 -329932 -272829 49385 324447 261953 -74943 -345491 -241136
146 -241136 120806 333325 213546 -101875 -307402 -205208 82286 292394 220037 -79162
156 -79162 -278130 -192616 64954 252085 196980 -40212 -266992 -265657 35206 324900 259756
167 259756 -80715 -316470 -200361 101520 270246 188625 -71115 -272251 -201372 72095
177 72095 281366 206030 -78450 -267223 -197255 52445 253157 198637 -58116 -265803 -204190
188 -204190 84848 279045 182724 -76158 -249519 -183026 50769 238483 204820 -51780
198e1780k12285P5795K66168J75545q3955k45909j61356N7224K30436J90543n3511
209A86915k36405j80829N0814K34227J75410m8265k27936k00820M7726K60923
219F1760J98921p3601k71047j63877J00764K21308J32978o2899j96969j50370
229b03032L6144K12119J79596n1002k20565j70424M2409K17860J73124m2425k23064
240d9260j80607O3876K33591J54745o8934k16495j46023N5764J95444J62004l8868
251A65237k10618j62707N1032K14882J51202o3852j97774j46818M2596K00613
261D3793J58778m3861k05951j57120N8212J98648J39244m6579j91936j48787M4549
272a51010J97413J57592n3298k04671j39277N4135J88617J34501m8626j79277
$$ plain form
198 -51780 -264065 -188270 77898 253443 169488 -76421 -237777 -180553 49883 240426 186915
209 186915 -49490 -230319 -179505 54722 230132 181867 -46069 -246889 -199163 61760
219 61760 260681 187080 -83967 -247844 -147080 74228 207206 144307 -52662 -203032
229 -203032 -166888 45231 224827 173825 -46740 -217164 -174755 43105 216229 173804 -49260
240 -49260 -229867 -165991 67600 222345 153411 -63084 -209107 -153343 42101 204105 165237
251 165237 -45381 -208088 -157056 57826 209028 145176 -52598 -199416 -156820 43793
261 43793 202571 158710 -47241 -204361 -146149 52499 191743 145164 -46772 -195559 -151010
272 -151010 46403 203995 150697 -53974 -193251 -139116 49501 184002 135376 -43901
282d3901j41841M2120J92492J40405n0006j86962j36758M8066J76867J38265l5564
293A43183j86095j44220M9537J90650J35176o0423j82976j20221M8415J71313
303D4339J27438m3420j69428j30875M3864J73490J24129m2142j68749j31006M1644
314a30716J73137J33295m5251j81201j21957N5678J66737J12622m9207j56094
324d2957j14482L5916J60596J23925m0928j62759j22566M3716J63070J15894m2146
335A17279j60658j16922M6903J59224J11038m6673j54683j05624M0825J45662
345C6371J13224l5744j50584j16352L8198J58532J10663m7644j50322j04524M3973
356a04209J45257J02515l8029j44002j05292L9895J40861J04118l5696j42005
$$ plain form
282 -43901 -185742 -143622 48870 189275 139269 -47693 -184451 -136385 40482 178747 143183
293 143183 -42912 -187132 -137595 53055 188231 127808 -55168 -175389 -126974 44339
303 44339 171777 128357 -41071 -171946 -128082 45408 169537 127395 -41354 -172360 -130716
314 -130716 42421 175716 130465 -50736 -172693 -117015 49722 162344 113137 -42957
324 -42957 -157439 -121523 39073 162998 122070 -40689 -163255 -119539 43531 159425 117279
335 117279 -43379 -160301 -113398 45826 156864 110191 -44492 -150116 -109291 36371
345 36371 149595 113851 -36733 -153085 -114887 43645 154308 106664 -43658 -148182 -104209
356 -104209 41048 143563 105534 -38468 -143760 -103865 36996 141114 105418 -36587
366c6587j05250L5556J44347J06952m3055j44553r8358M4083J39434R1770m0898
377I3441j28823r4938L3162J29684R8583l0933j33837j00234L5303J33292R9369
388A34069l5065j35968r7520L8759J35252R2586m3104j28366q6548L7616J24542
399C6253Q7847l4962j22951r0573L4340J23751Q9140l3512j24201q7349L6142
410h6075J20616Q6400l4973j20862q4882L4543J19168Q3490l3910j14069q4758
421a15312K8762J17594Q6506l2640j19052q3379L5685J15439Q0942l1998j14894
432c2347q1592L3901J12103Q0122l3097j12618p8030L4030J12291P5462l5382
443G4843j06933p4494L0688J06461P4444l1256j04167p1926K9938R9861P3906
$$ plain form
366 -36587 -141837 -106281 38066 145018 101963 -42590 -140948 -96865 42569 134339 93441
377 93441 -35382 -130320 -97158 32526 131109 100176 -33661 -133895 -98592 34700 134069
388 134069 99004 -36964 -134484 -95725 39527 132113 89009 -39357 -125905 -88289 36253
399 36253 124100 89138 -33813 -124386 -90046 33705 122845 89333 -34868 -122217 -86075
410 -86075 34541 120941 85968 -34894 -119776 -85233 33935 117425 83515 -30554 -115312
421 -115312 -86550 31044 117550 84910 -34142 -117521 -81836 33603 114545 82547 -32347
432 -32347 -113939 -80038 32065 112187 79090 -33528 -111558 -77528 34763 110225 74843
443 74843 -32090 -106584 -75896 30565 105009 73753 -30414 -102340 -72402 27459 101365
454A01365k4645j02948p7135K6478J02261P8029k4753j05026q0166K8599J10982
465C3041P5573l8577j06416o6966L7158J00618O3181l3441r3893o2744K7353R0031
477B4918O7603k3312r5897o9357K8988R4650O6181k6655r1979o8220K4232R5290
489B6442O7660k8704r2764o4957K7133R2736O4907k7954r2220o2624K7150Q8020
501B4825O4200k3788r1633o5045K9287R1591N9826l0114q7421n8924K8207Q7193
513B8204N6627k8577q1657n6242K3465Q2977N8923k6518q4578n3555K7684P5596
525B2349N3589j7871p6066o0552J7058Q0617O2814k0302q4485o2798K6178Q8335
537B8866N5364l1373q0864n0395K6691P6999N2336k6326p8063m8589K7308P1767
$$ plain form
454 101365 76720 -26228 -103363 -76885 25376 103405 78652 -26374 -106540 -77941 33041
465 33041 108614 70037 -36379 -103345 -66187 34431 97612 64171 -29722 -92466 -65113 24918
477 24918 92521 69209 -26688 -96045 -67057 27593 93774 67119 -24860 -93080 -68848 26442
489 26442 94102 65398 -27366 -92323 -65190 27546 92453 64499 -27721 -90345 -63195 24825
501 24825 89025 65237 -26396 -91441 -62154 29437 89263 59149 -28272 -87196 -58989 28204
513 28204 84831 56254 -25403 -81645 -58180 24797 83720 57202 -27376 -80931 -53247 22349
525 22349 75938 58067 -17999 -78551 -61493 19124 81938 61636 -22849 -85647 -59469 28866
537 28866 84230 52857 -28007 -78402 -51711 25288 77624 51298 -26765 -75354 -48046 23721
549B3721M7684k1179p1012n0618K0607P0342N0362j7177o9452n5704J6206P6858
561B0638N5319k4095p5590m9114K3645P1414M8506k1926p0297m7522K0903O7127
573A9008M9851j8494p1091m9777K3365P0009M3661k1636o3554m6913J7216O7860
585A9505M8265k1752o7349m3788K1219O3650M3454j9161o2955m2935J8285N9793
597A6231M4860j4043o2762m8007J7238O4435M4547j7993o1701m5234J7351O4374
609A9296M4385k1168o2483m1555J9478O0824M2395k0420o2042l7323K2555N5410
621A9352L4206j6169n2108l9474J3168N4723M1561j3434n5503m2693J4570N7945
633A6144M0674j7754n5968l8396J5795N5136M0600j6136n7297l7886J8352N3124
$$ plain form
549 23721 71405 50226 -20786 -71404 -50797 19545 69907 52730 -16722 -72426 -56220 20638
561 20638 75957 51862 -23728 -72842 -49197 22217 70723 48797 -21500 -69022 -48119 19008
573 19008 68859 50365 -20726 -70503 -47138 22871 66532 44896 -18658 -65571 -48355 19505
585 19505 67770 46018 -21331 -65119 -43900 19750 63204 44043 -18912 -61847 -43562 16231
597 16231 61091 47048 -15714 -63721 -46483 17952 62499 44506 -17195 -62429 -45078 19296
609 19296 63681 42513 -19970 -61525 -42047 18777 61172 40752 -21290 -58613 -36058 19352
621 19352 53558 37389 -14719 -54193 -41025 13698 55259 41825 -13678 -56371 -41801 16144
633 16144 56818 39064 -16904 -55300 -39505 15631 56231 40095 -17202 -55088 -36736 16388
645A6388L5889j5616n2419l7369J6442N3927L5568j7194n0786l5791J4111N1355
657A4505L6514j5398n1053l4540J5767M9577L4827j5526n0202l4164J5258M8025
669A3590L4087j3041m7617l4927J3980M8584L2716j4705m6198l4019J2348M8487
681A3285L5523j4187m8984l2553J5210M5896L1130j4332m5509l1138J4610M5027
693A3978L1128j3227m4570l1707J2908M4196L0183j3153m2111l0570J2365M3937
705A3357L0844j3548m3958k9804J2664M2204L0331j2175m2921k9335J4542M2074
717A4275K7272j4202m0546k8038J2642M0526K8110j1502l9790k7916J1881L9540
729A2252K7379j2897l9560k6684J2117L9278K7937j1987l9294k6986J2416L7484
$$ plain form
645 16388 52277 36661 -15758 -53127 -36685 17242 52810 35616 -15170 -50961 -36850 14505
657 14505 51019 35621 -15432 -49972 -34205 15372 50199 34673 -15529 -49693 -34435 13590
669 13590 47677 34636 -12981 -47908 -33928 14656 47372 32667 -13531 -47550 -35202 13285
681 13285 48808 34621 -14363 -46916 -31706 14190 45320 30988 -14521 -45659 -31049 13978
693 13978 45106 31879 -12691 -44398 -31490 12706 42889 29736 -12375 -42945 -30580 13357
705 13357 44201 30653 -13305 -43109 -30445 11759 42090 29915 -13006 -42341 -27799 14275
717 14275 41547 27345 -13201 -41239 -28597 11929 40039 28537 -11253 -39169 -27288 12252
729 12252 39631 26734 -12826 -39510 -27393 11885 39822 27835 -11459 -38445 -26029 11455
741A1455K5724j1852l7356k5944J1599L8444K5989j1857l7472k5482J1147L6031
753A0426K4501j0241l5575k4401J0830L5861K4772j0998l6136k4924J0879L5173
765A0167K4258j0380l4350k3593J1028L4031K2774j1091l3491k3144R956L2994
777I159K4262r669l2860k3133J0007L2069K2031j0078l1895k2437R799L2274K2943
790C2472r679l1738k2188R256L0883K1334r697l0188k1174R745L0528K1293r514
803B1333l0007k0997Q598K8946K0682q219k8806k0378Q561K9566K0403r502k9098
816h918k0317Q839K8226J9830p861k7535j9426Q279K7626J8768q398k7754j9024
829b7665Q230K7323J9366p841k6852j8793P854K6142J8045q054k5879j8232P861
$$ plain form
741 11455 37179 25327 -12029 -37973 -26374 12070 38059 26202 -11270 -36752 -25605 10426
753 10426 34927 24686 -10889 -35290 -24460 11401 36173 25175 -10961 -35885 -25006 10167
765 10167 34425 24045 -10305 -33898 -22870 11161 33935 22844 -10647 -33791 -23835 9159
777 9159 33421 23752 -9108 -32241 -22234 9835 31866 21788 -10107 -32544 -22745 9529 32472
790 32472 22793 -8945 -31133 -21877 9006 30340 20643 -9545 -30719 -20974 9554 30847 21333
803 21333 -8674 -29671 -21073 7873 28555 20336 -8470 -28848 -20287 9279 29682 20180 -8918
816 -8918 -29235 -20396 7830 27660 19799 -7736 -27162 -18883 8743 27511 19113 -8641 -27665
829 -27665 -19435 7888 27254 19413 -7439 -26232 -18378 7764 25809 17755 -8124 -26356 -18495
842a8495K6259J8196p328k5705j7975P132K4879J7618p212k4709j7390P109K5048
855G427J7719p193k5008j7595P025K4191J7368p124k3706j6761P213K4134J6114
868B3804p470k3413j6167O733K2407J6637n903k2781j6053O290K2418J5756o488
881A5770k2398j6034O420K2170J6213n970k1855j5780N815K1415J5721o448k1134
894f095j5458O005K1477J5418n674k1721j4887O086K0566J4478n774j9982j5028
907b0589O149K0651J4389o117j9774j4605N297J9467J4345n072j9474j3488M949
920a3872J8987J4206n066j9162j4390N122J8870J4177m474j9052j4498N561J9402
933E811J2782n997j8196j2418M667J8279J3363n400j7703j2762N023J6705J2860
$$ plain form
842 -18495 7764 25960 18632 -7073 -25048 -17916 6963 24581 17369 -7340 -24730 -17621 7427
855 7427 25146 17953 -7055 -24650 -17625 6566 23934 16810 -6896 -23657 -16444 7690 23804
868 23804 16334 -7079 -23246 -16513 5894 22531 16628 -6153 -22206 -15916 6502 22258 15770
881 15770 -6628 -22662 -16242 5928 22141 16171 -5684 -21464 -15649 5766 21487 15039 -6095
894 -6095 -21553 -15548 5929 21347 15673 -6048 -20935 -14849 5717 20195 14421 -5561 -20589
907 -20589 -14440 6211 20600 14483 -5291 -19896 -14599 4868 19213 14141 -5333 -18821 -13872
920 -13872 5115 19321 14255 -4907 -19297 -14175 4695 18872 14398 -4654 -19152 -13591 5811
933 5811 18593 12596 -5600 -18018 -13351 4928 18291 12891 -4812 -17574 -12551 4154 17014
946A7014m227j7261j2824M646J7034J2760l883j7491j3428M679J7737J2186n046
959A1896j6363j2001M055J7143J2479n256j6898j1421M383J5762J2537m018j6955
972d657j1894N361J6027J0667m379j5353j1252M301J5594J0753m413j4695j1131
985a5071L882J5199J0923m317j4646j0088L285J3691J1570k738j5354j1531M639
998a0556J4616J0398l654j4411j1134L878J5050J0223m587j3978r975M098J4219
1011D187R913m837j3669q564L955J2482R326l211j3003r744L751J2973R322l093
1025I788j2709j0580L772J3672Q971m225j2016q634K941J1939R506l154j2774
1038c503q800L509J1918Q837k751j2123r038L361J1691Q546l060j1561r065L305
$$ plain form
946 17014 12787 -4474 -17298 -12652 4382 17142 13259 -4232 -17660 -12981 4756 16942 11896
959 11896 -4467 -16468 -12413 4730 17209 11953 -4945 -16366 -11983 3779 16316 12298 -4657
972 -4657 -16551 -11190 4837 15504 11125 -4228 -15480 -11179 4415 15168 10755 -3940 -15071
985 -15071 -11189 4010 14933 10616 -4030 -14118 -10833 2858 14428 11690 -3664 -15195 -10556
998 -10556 4060 14458 10804 -3607 -14741 -10863 4187 14410 9823 -4155 -14130 -10032 4187
1011 4187 14100 9263 -4406 -12970 -9015 3467 12793 9582 -3421 -13165 -9414 3559 12881 9788
1025 9788 -2921 -13501 -9729 3943 12914 8689 -3327 -11961 -9020 2919 12425 9271 -3503
1038 -3503 -12303 -8794 3124 11961 9210 -2913 -11951 -8590 3101 11647 8587 -2974 -12039 -8734
1052h734J2480Q007l936j0751p882K569J0890Q541l104j1289p454L024J0240Q296
1066A0897k732j1005q371L183J0888P476k745r756q145K453J0923P410l337j0096
1080b957p295K683J0114P618k828j0183o604K836Q550P421j811j0206p559L067
1094g154R828O702k059r148p421J770R800P123k713r524o672K532R453P031k549
1109F999r316o520K272Q385O697j828q962o505K685Q550O124j960q294p130K016
1124f787Q799O501k439q076n565J651P687O647k025q681n968K311P706O008j679
1139F090p883n934J785P885N457j517p910n940J948Q072N647k006p250n402J328
1154e630P058N810j699p619n445K394O988N366j611p293n462J790O969M877j608
$$ plain form
1052 -8734 3746 11753 7817 -2934 -10816 -8247 2643 11184 8080 -3209 -10663 -7639 2601 10897
1066 10897 8165 -2840 -11211 -8028 2860 10336 7591 -2165 -10310 -7857 3066 10476 7139 -2957
1080 -2957 -10252 -7569 2545 10163 7335 -2848 -9452 -6616 1934 9355 7544 -2662 -10221 -7154
1094 -7154 2674 9376 7317 -1831 -9252 -7482 2318 9441 6728 -2796 -9468 -6936 2517 9548 6999
1109 6999 -2317 -8837 -6565 1820 8517 6689 -2273 -8778 -6093 2457 8581 6621 -1673 -8803 -6787
1124 -6787 2012 8513 6074 -2002 -7567 -5916 1771 8418 6393 -2288 -8256 -5945 1761 7769 6090
1139 6090 -1793 -7727 -5942 1943 7400 5883 -2027 -7967 -6019 2053 7700 5694 -1556 -6958 -5630
1154 -5630 1428 7238 5539 -2080 -7525 -5131 1857 7223 5612 -1681 -7143 -5353 1616 6493 4885
1169D885o316n197J604P034N026j915o901m957J533O581N366j932o431m692J798
1184d514O273M408j135o453n286J812O418M611j434n737m806J035O225M772j760
1199D429o086m508J387O248M397j144n897m564J312N678M242j311n623m457J554
1214d343N999L878j288n114m369Q05N381M379j458n232l910J427M935M190j346
1229C934n024m194J299M899M082j057m992l723J217M714L781j097m961l834J241
1244c715M834L610j019m627l465P41M584L673r24m798l573J070M436L605o63m504
1260g35l624N91M683L490j010m297l283R37M057L320q39m019l369O04M294L112
1276C912l55m377l144J002L610L046m36l780l389O55L890L295r96l680k834O62
$$ plain form
1169 4885 -1431 -6628 -5024 2010 7036 5121 -1780 -6737 -5204 1377 6743 4811 -1620 -6312 -4514
1184 -4514 1759 6167 5032 -1421 -6707 -4895 1523 6134 4700 -1037 -5843 -4808 1417 6189 4429
1199 4429 -1657 -6165 -4778 1470 5867 4723 -1174 -5738 -4426 1252 5494 4183 -1440 -5897 -4343
1214 -4343 1656 5534 4246 -868 -5237 -4432 949 5328 3870 -1362 -5272 -3845 1090 5280 3934
1229 3934 -1090 -5284 -3985 914 4996 3939 -1053 -4776 -3559 1155 4936 3839 -1122 -4956 -3715
1244 -3715 1119 4729 3710 -917 -4382 -3641 943 4616 3692 -1106 -4679 -3609 827 4432 3769 -735
1260 -735 -4359 -3768 915 4405 3395 -902 -4185 -3248 809 4129 3290 -729 -4098 -3494 800 3912
1276 3912 3557 -820 -3964 -2962 648 3694 3258 -522 -3911 -3256 634 3929 2933 -747 -3581 -2919
1292b919L592L240p84l743k919O20L572K796n94l471k866O34L304K554O5l486
1308d05k888N48L206K554n00k892k667L35K728L150m71l104k855O12L275K418
1324C044l60k912k937M35L141K596m44l161k309M75K761K455m76k571k506M25
1340b344K772K364l14k869k254L32K507K349m0k821k298J10K752K456k82k490
1356g0k626M49K362K454l41k368k286K79K526J927j43k256k117M0K346K066O7
1373B309k501k171K10K307K092m02j971k093K06K174J943p5k287j702k58K110
1389a09K239Lk224j917J50J699K143M0k086j768l30K124J921K7j908j976K13J902
1407A43J591m3j567j618k56J668J928j9j732j477k58J839J320j3j481j677j2J702
$$ plain form
1292 -2919 673 3913 3129 -614 -3533 -2913 659 3455 2861 -610 -3476 -2842 462 3016 3081 -405
1308 -405 -3293 -2745 461 3015 2515 -377 -3044 -2709 19 3169 2698 -406 -3261 -2649 626 3044
1324 3044 2684 -228 -3165 -2730 411 3007 2563 -598 -2907 -2432 329 2784 2308 -263 -2769 -2344
1340 -2344 428 2792 2478 -391 -2645 -2313 194 2543 2503 -318 -2616 -2506 246 2702 2420 -70
1356 -70 -2696 -2247 115 2569 2228 -140 -2426 -2147 379 2306 2163 -93 -2210 -2170 176 2242 2309
1373 2309 -192 -2363 -2153 154 2246 1844 -127 -2220 -2014 160 2103 2028 -259 -1961 -2219 -109
1389 -109 2130 2133 -91 -2008 -1858 -159 1984 2024 -62 -1830 -2160 -36 1885 1912 4 -1972 -1759 143
1407 143 1734 1691 124 -1494 -1750 -82 1846 1827 95 -1382 -1640 199 1519 1506 25 -1652 -1664 38
1425C8J530K9j398j754n5J632J515J04j421j483l12J587J562J03j568j527m5J356
1443a07J487R5j290j494r5J687J031r7j080j242l71J247J799J2j443j363k88J421
1461i1J446J03j249j299l79J118J303M65j097j494k17J183J262J84j007j629J31
1478a267J114J252K44j267q01m30P84J453J51j050j147k01J071J054L98j099j076
1495h17m96J177J032K67r02j076l97J019J147Q3q44r43l53N64J382M57r68j173
1513h41p6N49J160L46n82j307n72J025Q73N14p79j166n19R83J023L84p19r70j98
1532h72O84J066J00o74j017l49O81J040L18o44r67l92P09J186O2m49j087k76N51
1551c30R08L62n77r32j93L59R95M72n55j127k35M45N96P07l25j154o01P88R06
$$ plain form
1425 38 1568 1597 199 -1555 -1610 22 1537 1641 220 -1263 -1575 12 1574 1677 109 -1418 -1463 -107
1443 -107 1380 1475 185 -1309 -1404 283 1314 1217 137 -1105 -1476 -229 1570 1582 139 -1224 -1512 -91
1461 -91 1355 1458 209 -1090 -1469 -351 952 1417 320 -1174 -1391 -208 1054 1238 231 -1398 -1267
1478 -1267 -153 1099 1343 76 -725 -1155 -371 1082 1233 183 -964 -1165 -94 960 1358 259 -817
1495 -817 -1313 -136 896 1163 261 -815 -1212 -193 954 1037 193 -750 -1103 -539 843 1300 332 -841
1513 -841 -917 -368 792 1138 556 -751 -1323 -298 575 1089 310 -856 -1375 -392 631 1015 296 -674 -872
1532 -872 -188 878 978 304 -713 -1062 -381 659 977 333 -634 -1026 -317 869 931 482 -605 -881 -330
1551 -330 578 940 363 -569 -762 -403 592 1064 509 -618 -853 -408 188 895 570 -584 -1185 -397 509
1570E09K30l59q16n91O47J030L62m71r86k23J22P16P10n09q13m35M81R79M19l53
1590F49j018m77K28Q94N63m05p42m38K48P39O77l93p81q02N35N86N50Jj104j40
1610f30L51O90J89k79p23j23K8O62M50J3n82p74P0Q95O14m3j124l72K50O96M75
1631G33j21j056j50Q1N89P23m67n25m74K63M82O13k57n90l49j34N86O69l86l75
1651a45m94K23N54M29j39n63n64nP98K39L06n98p19J49M60N68Q1n97n75N6N84
1672D8M28j42m16n31Q1N14O53j72o09m94r9R20K67K25o80n75K12N38K05q5k56
1693C2n00J66J81N97k8n10m74M9N34K99N3l20o92J92K81Q14k40n28k60r7N72M76
1715E97j50m77n35J8M14O23n3l18n82m0N19N74J60p47m92J36J67P30j13k44o94
$$ plain form
1570 509 739 380 -436 -1027 -380 650 1012 541 -445 -668 -546 170 880 371 -442 -877 -396 583 1002 649
1590 649 -369 -846 -618 276 839 434 -308 -746 -498 241 918 525 -256 -1058 -523 63 613 614 -490 -630
1610 -630 -279 411 600 321 -402 -525 -497 165 615 628 46 -728 -658 237 851 808 -316 -688 -438 258 733
1631 733 612 -444 -594 -513 76 799 332 -193 -667 -404 78 691 434 -156 -505 -639 -53 616 230 -145
1651 -145 -639 -416 138 567 428 -135 -699 -704 94 333 639 41 -678 -529 -69 499 580 -17 -592 -536 48
1672 48 476 334 -82 -613 -532 -18 635 463 -146 -640 -739 181 448 673 -7 -582 -370 168 373 288 32
1693 32 -468 -302 -121 476 448 -62 -536 -487 47 346 399 79 -613 -421 -140 674 434 -94 -354 -451 121 597
1715 597 447 -30 -565 -547 -133 490 437 119 -463 -503 16 590 750 3 -489 -353 -186 544 431 187 -507
1736e07L4L58O01O5m84n48J06M47L22rk07n23J31J69M20k3k22m98l06P27K97M
1758C54k87l71k07N36N26P2m32o16q4L81L37K54n3m79n49L40O51Q6l63n17L9k9
1780d11N68M19m40p33P6M09K91L23k78p33J3K93O77J02n74l69j67J63O81K84j91
1801D03q33L0K00N35J49m10k44l70L75N71ll65k79k95L60M52J86k26o89q1M46
1822h8K22L33m19m46r9K51N34J28l11l69k07M67L01L90o52m23N2R1P15k75R5n83
1844b93j4J56L99R7j62k45k98L38J57L96k09n50j3J00M58k7l48l15j73N45K65
1865B64J46p7n06j82J7O04N58p50m37j81N31K55J46l35l47o6J10K83K59p3k78
1886e9k50l8O27J44k22m02j48K61M03n9l5k26l65J69M46J08k02l09j77K94J31
$$ plain form
1736 -507 -473 -115 486 551 67 -481 -375 72 394 385 178 -345 -214 -45 375 352 130 -368 -674 53 350 354
1758 354 67 -304 -511 25 551 623 191 -425 -509 -128 209 463 410 -69 -618 -278 373 459 96 -421 -382 -411
1780 -411 157 576 136 -597 -521 -112 179 502 224 -509 -496 -203 474 576 2 -367 -534 -371 310 594 403
1801 403 -430 -400 -200 335 484 74 -170 -540 -165 406 403 38 -241 -536 -176 276 462 236 -453 -534 -88
1822 -88 134 467 48 -398 -497 -246 288 416 105 -264 -471 -4 297 687 35 -388 -336 -245 470 195 290 -293
1844 -293 -307 -151 248 345 183 -62 -360 -22 135 531 322 -228 -241 -141 317 290 -58 -373 -546 -1 264
1865 264 410 333 -173 -355 -338 266 824 74 -363 -544 -13 242 388 53 -294 -360 -250 33 292 219 -59
1886 -59 -309 -347 280 424 202 -200 -348 -87 316 257 222 -4 -369 -200 246 354 152 -157 -334 -40 91
1907I1M00k71k17m41J97K61M90m65k17j93J58L96K56k30k58l40K14K06M27k34
1927B30n05l8J55M29p7j30l77o8J63L88K73j16k85n10O1N91K21r2m15k65L25K72
1949B30N8j14k36l63J74M05j2Ql86l0J29L61q6K96n38k93L05K98j8k0l67j28L29
1972BJ57J92l15l01m4J05L59K82j21l27m29K22K63L93k28l62j58M7K91L39p4n18
1994b25KQ1M04N3j76k90j35k20O08L34k91l93mJ90J27J45j38j73O6q9O6M10P1
2017D23n26k16Q6L63J46m9m19j67J34M00K88k61l46l2j2K34L31j98j5l83o4L26
2039D3J09J65n07j91K85K54K54l40k02j86K52Q4J43P5l96K7j10K06K87j12j84
2060d4l2j55M51j31J85l80j14N3J05K90P9j48j70l41K63J80J38k73k63j70N84
$$ plain form
1907 91 491 220 3 -438 -241 20 510 45 -172 -365 -207 189 445 215 -43 -383 -169 37 464 230
1927 230 -275 -313 -158 271 194 64 -313 -381 -218 170 443 327 42 -468 -407 184 405 313 -102 -367 -42 230
1949 230 288 174 -62 -425 -251 154 142 150 -236 -266 -137 224 138 434 -104 -397 -92 206 188 168 -199 -327 2
1972 2 159 351 36 -265 -309 -204 155 437 316 -11 -440 -218 45 438 210 -152 -310 -263 28 367 293 -225
1994 -225 -223 -142 262 315 139 -151 -286 -506 102 436 145 -248 -252 -62 65 210 72 -101 -35 -124 -58 352 423
2017 423 -103 -319 -233 130 276 227 -192 -359 -225 175 463 202 -144 -176 -188 46 377 179 164 -219 -283 43
2039 43 152 317 -190 -381 -96 158 412 72 -130 -316 -64 20 163 238 -158 -131 -241 -35 252 140 -44
2060 -44 -76 -231 220 89 274 -106 -220 -167 -62 228 307 159 -11 -352 -89 91 229 -44 -307 -477 107
2081A07q1J60l89J06Q8J5K22m3o3j67k4J88K25N7m97j16jL36Q0j54k72J68J01
2104D6K6J36j63j71P6p2o0M04K61n08k92J71K65j6P4k83j12J04L23O6o9j89k44
2127b27J73r7L62k09j0l38L48NJ24P7j89q5J81M0j19L67m84q7mJ20J16J52l44
2150a28O4l43L63L17m9q3k51o7L67j03J00l40l1p2R5L54k68J20k63K6mL97Oj73
2174C4j55j53J53JK80j43o9K02l54L83N8k18r8k2N3J94n7j36p5K2J82j93K07M8
2198A44l43j28L18K5J7j68j09J66j47L92K8l26l5p9J31J83kM2k48L2L7J51j51
2221g0j37J23pqJ02K24k16q3Qj45K70J89o6k57p0L11k90K25l0k18n4J69J82K08
2245C60m33K4P5o9R1J73j39k12J32O0n6R6o7j98N4J24M9J83l59p7o4K61L7m2L5
$$ plain form
2081 107 26 186 -203 -97 -9 6 228 185 122 -45 -69 119 344 401 -96 -212 -213 123 203 49 -223 -55 46
2104 46 72 208 45 -126 -50 -122 -182 222 483 -25 -317 -146 119 103 177 -106 -218 -114 209 275 206 17 -227
2127 -227 -54 -151 211 2 -8 -346 2 7 131 208 19 -66 115 155 36 403 -81 -168 -172 -52 64 216 -128
2150 -128 -64 -407 -44 273 224 141 -110 -177 190 87 187 -153 -184 -256 -161 193 -75 45 -218 -192 -196 201 207 34
2174 34 -121 -274 -121 -120 160 17 -52 150 -204 179 237 19 -79 -101 -48 146 89 -47 -122 -100 82 -111 96 144
2198 144 -199 -327 -9 16 33 -135 -244 -78 -225 167 195 -131 -166 -245 -114 69 67 109 -139 -107 -70 81 -70
2221 -70 -207 -84 -91 -99 3 227 11 -72 -64 -209 61 250 184 -73 -143 168 -122 103 73 -145 -199 -30 152 360
2245 360 -73 -49 26 -43 48 221 82 -130 2 62 6 102 35 -163 -109 15 64 247 -112 -189 -253 8 45 3 38
2270C8j50J2N6J46j9j89p5J07J2L39j52j62r2J37oP9l3q8O8l93J02J97K26j46
2294A4k34K08k47M41N4j83J07k26J37n7K09l02k75L65o9n9R5M5O2k14m2L24Q6
2317B39k62j08M6O9K40p2J91m20o4R4J69j93L11l92r2J40q0L59k10o4j68K33K26
2340A92k32j02J09j32J77K03l9k10p0K08j30O5M6L5k92oR4P0K05n0n06L54K04
2363A93mr7j62J00J6j59J11J70j96L8j56p1J52P4k6j32J21J58o7J77r5m06K3K39
2387AJ78p4M8j72J29mrj51K20l22J94J11j01Q9j76j47K35j80J82l8J60k55L2j01
2411a51K79j43j4L7j06l2J33K61j43m09K66q2Q8L45l58m6l6N6j12P2K23k73lM3
2435a05K70k4K8k24R7J27l25K99j8j20J69m5j32J83K5k13k35J83J77K86m91j0
$$ plain form
2270 38 -112 -100 -44 102 83 -106 -181 -74 -62 277 125 -37 -129 8 2 81 48 -40 28 -365 -263 -66 160 14
2294 14 -220 -12 -259 182 236 53 160 -66 71 14 223 -79 -354 11 -58 -117 -22 23 85 -129 -171 153 239
2317 239 -23 -131 -85 -16 224 152 343 -77 -141 -47 122 -71 240 -152 -244 -104 -184 175 -35 -99 -267 -34 192
2340 192 -40 -142 -33 -165 12 215 176 -34 -104 104 -26 39 85 120 -172 -178 -84 -14 191 141 -365 -11 193
2363 193 189 92 -70 30 46 -113 -2 168 -28 10 -146 -217 -65 9 -17 -149 -28 130 63 240 145 -261 -238 1
2387 1 179 105 153 -19 110 106 97 -54 166 -156 38 149 48 137 -39 -186 49 -131 51 13 173 -82 -50 -151
2411 -151 128 -15 -29 8 -98 -130 3 264 121 -288 -22 -104 -16 329 -29 -75 -111 -55 -167 -95 128 -145 -148 -105
2435 -105 165 141 169 -55 42 169 -156 143 125 5 174 129 -3 180 205 -8 -243 -60 117 403 -88 -98
2457i8J0J93j23jK9j42k11J87K64j99J11j38q8J80O4J13l34K80k71J84L8j51J24
2480B1l5j05j4J33J80p4K1n9j51J60j00J97k06p0p9K46j34K15Mk40P2j32Q4J26
2504F0j77J98j25p8J03J8O2j28O7J39m2j13j1j26J86LLj0j94K00l97M93M0o1k5
2529H5m11M10R1k49K54k91K25j08J26Q2j87k6m7j05l0L31k88J22q6n4K50m7J6
2552F3k88L62m23L76j10q3K20l92N4L80m7Q1m33K59j05O2J56K1k48L7J34n7q6
2575f7mOn0QL6L25k15k36J28LN6K19j72k46J58l3M4K06j82P7q7k41J81L02j67
2600D9q1Jk04J92J33J04r5k42J59J81l9j01k26n2J44K18lo7k64K12j29J27j2J56
2624A61l03r1K89k12L18J8n7l47J44L15j18k06O1j12J01J54m1k04K84q1k80J41
$$ plain form
2457 -98 -88 105 -18 -19 10 -132 -343 -156 108 -91 20 -118 -206 -26 38 151 -183 97 -174 10 48 -103 21
2480 21 -14 -119 -133 0 180 106 127 68 -83 77 -23 174 -32 -102 -181 65 -69 146 150 -90 -18 -150 -66 60
2504 60 -117 81 -44 -122 -19 -1 61 -67 0 139 97 -16 -27 -153 33 36 39 29 -165 35 -362 131 171 110 85
2529 85 -326 84 175 -74 180 -111 114 6 132 214 27 1 -46 -151 -181 150 -138 -16 -102 -156 94 47 63
2552 63 -225 137 -286 90 -20 -103 117 -275 -221 159 112 193 -240 19 -86 -24 132 153 -95 -58 76 19 -67
2575 -67 -71 -65 -115 -107 -71 254 39 -197 -69 -66 -10 209 37 -209 -51 -84 -40 166 -16 61 -26 -267 -86 216 49
2600 49 -32 -31 -235 -43 90 194 99 -143 16 197 158 57 -169 -221 -77 141 138 71 -193 19 -110 17 5 161
2624 161 -142 -233 56 -156 162 180 123 -224 -80 235 117 -89 -28 -140 -39 115 74 -130 154 73 -207 -66
2646f6J01j20rj8O6k4J22j34N8j99O3J81O9k33J59k32L09k23K56J8m40M16n8l5
2670B7K2k09K14l45K88k02K27P0j0j26K63k59JJ30L8l65K05K06o9L0n6R6o1r8
2694A7M06l88Rj73J92P0j2p2j64N5n8K26P1Pl26J67k27J82k3j0j51L1Q9K03P6
2719A97j18j27K22l98K08j2K57j57l14J31J43O4j31L0k49K01j7K35o2j03p6K56
2741A80k71J00J0L4k95k2L73R0l30N0j33L96k59J37Q8q2O4k90L03j04P1l18K60
$$ plain form
2646 -66 35 -85 -94 -112 -46 -70 52 -82 -24 -223 -160 21 90 -143 16 -216 93 -130 126 144 -296 120 62 27
2670 27 49 -160 54 -291 -3 -205 22 92 82 -44 219 -40 -39 91 129 -236 -31 175 106 136 80 176 115 17
2694 17 423 35 44 -129 63 133 121 49 -115 -60 -118 108 179 186 -140 27 -200 -18 -41 -51 -202 -171 -82 121 197
2719 197 79 -48 174 -224 -16 -28 229 72 -242 -111 32 96 -35 -5 -254 -53 -70 165 103 0 -76 180
2741 180 -91 9 19 53 -242 -264 109 199 -131 -81 -214 182 -77 60 148 66 130 -160 143 39 110 -208 52
$$ [...]
8191a38
##END NTUPLES=NMR FID
##END=
