##TITLE=1H_Ser AmNCS-2h
 200.13MHz,CDCl3,
 8 sc
 
 26.6.2025
##JCAMPDX= 6.0         $$ Bruker NMR JCAMP-DX V2.0
##DATA TYPE= NMR FID
##DATA CLASS= NTUPLES
##ORIGIN= UXNMR, Bruker Analytische Messtechnik GmbH
##OWNER= pz
$$ XWIN-NMR		Version 3.5
$$ Thu Jun 26 15:57:47 2025 Russian Standard Time (UT+4h)  she@DPX200
##.OBSERVE FREQUENCY= 200.1313
##.OBSERVE NUCLEUS= ^1H
##.DELAY= (6, 6)
##.ACQUISITION MODE= SIMULTANEOUS
##.ACQUISITION SCHEME= undefined
##.AVERAGES= 8
##.DIGITISER RES= 18
##SPECTROMETER/DATA SYSTEM= spect
##.PULSE SEQUENCE= zg30
##.SOLVENT NAME= CDCl3
##.SHIFT REFERENCE= (INTERNAL, CDCl3, 0, 14.3821)
##AUDIT TRAIL= $$ (NUMBER, WHEN, WHO, WHERE, WHAT)
$$ ##TITLE= Audit trail, XWIN-NMR		Version 3.5
$$ ##JCAMPDX= 5.01
$$ ##ORIGIN= Bruker BioSpin GmbH
$$ ##OWNER= she
$$ F:/spectra/data/she/nmr/H-C/1/audita.txt
$$ ##AUDIT TRAIL=  $$ (NUMBER, WHEN, WHO, WHERE, WHAT)
(   1,<2025-06-26 15:55:46.34 +0400>,<she>,<DPX200>,
      <created by zg, POWCHK disabled, PULCHK disabled
       configuration hash MD5:
       00 E9 B6 7A A2 85 ED C7 34 08 36 98 17 FE 4E 26
       data hash MD5: 16K
       DE 5E C4 F6 82 B3 07 F0 2D CD 92 45 35 BD 68 B4>)
$$ ##END=
$$ 
$$ hash MD5
$$ AE 7A 8F 60 20 E9 3A 1E 92 2E A4 28 63 3D AD 15
##$RELAX= 
##$RELAX= 
##$RELAX= 
##$RELAX= 
##$RELAX= 
##$RELAX= 
$$ Bruker specific parameters
$$ --------------------------
##$DU= <F:/spectra>
##$EXPNO= 1
##$NAME= <H-C>
##$PROCNO= 1
##$TYPE= <nmr>
##$USER= <she>
##$AMP= (0..31)
100 100 100 100 100 100 100 100 100 100 100 100 100 100 100 100 100 100 
100 100 100 100 100 100 100 100 100 100 100 100 100 100 
##$AQSEQ= 0
##$AQ_mod= 1
##$AUNM= <au_zg>
##$AUTOPOS= <>
##$BF1= 200.13
##$BF2= 200.13
##$BF3= 200.13
##$BF4= 200.13
##$BF5= 200.13
##$BF6= 200.13
##$BF7= 200.13
##$BF8= 200.13
##$BYTORDA= 1
##$CFDGTYP= 0
##$CFRGTYP= 5
##$CHEMSTR= <none>
##$CNST= (0..31)
1 1 145 1 1 1 1 1 1 1 1 1 1 1 1 1 1 1 1 1 1 1 1 1 1 1 1 1 1 1 1 1 
##$CPDPRG= <>
##$CPDPRG1= <>
##$CPDPRG2= <>
##$CPDPRG3= <>
##$CPDPRG4= <mlev>
##$CPDPRG5= <mlev>
##$CPDPRG6= <mlev>
##$CPDPRG7= <mlev>
##$CPDPRG8= <mlev>
##$CPDPRGB= <>
##$CPDPRGT= <>
##$D= (0..31)
0 0.7 0 0 0 0 0 0 0 0 0 0.03 0 0 0 0 0 0 0 0 0 0 0 0 0 0 0 0 0 0 0 0 
##$DATE= 1750938945
##$DBL= (0..7)
120 120 120 120 120 120 120 120 
##$DBP= (0..7)
150 150 150 150 150 150 150 150 
##$DBP07= 0
##$DBPNAM0= <>
##$DBPNAM1= <>
##$DBPNAM2= <>
##$DBPNAM3= <>
##$DBPNAM4= <>
##$DBPNAM5= <>
##$DBPNAM6= <>
##$DBPNAM7= <>
##$DBPOAL= (0..7)
0.5 0.5 0.5 0.5 0.5 0.5 0.5 0.5 
##$DBPOFFS= (0..7)
0 0 0 0 0 0 0 0 
##$DE= 6
##$DECBNUC= <off>
##$DECIM= 32
##$DECNUC= <off>
##$DECSTAT= 4
##$DIGMOD= 1
##$DIGTYP= 9
##$DL= (0..7)
0 120 120 120 120 120 120 120 
##$DP= (0..7)
150 150 150 150 150 150 150 150 
##$DP07= 0
##$DPNAME0= <>
##$DPNAME1= <>
##$DPNAME2= <>
##$DPNAME3= <>
##$DPNAME4= <>
##$DPNAME5= <>
##$DPNAME6= <>
##$DPNAME7= <>
##$DPOAL= (0..7)
0.5 0.5 0.5 0.5 0.5 0.5 0.5 0.5 
##$DPOFFS= (0..7)
0 0 0 0 0 0 0 0 
##$DQDMODE= 0
##$DR= 18
##$DS= 0
##$DSLIST= <SSSSSSSSSSSSSSS>
$$ [...]
##$SUBNAM0= <"">
##$SUBNAM1= <"">
##$SUBNAM2= <"">
##$SUBNAM3= <"">
##$SUBNAM4= <"">
##$SUBNAM5= <"">
##$SUBNAM6= <"">
##$SUBNAM7= <"">
##$SUBNAM8= <"">
##$SUBNAM9= <"">
##$SW= 18.0517328524113
##$SWIBOX= (0..15)
0 0 2 0 0 0 0 0 0 0 0 0 0 0 0 0 
##$SW_h= 3612.71676300578
##$TD= 16384
##$TD0= 1
##$TE= 0
##$TE2= 300
##$TE3= 300
##$TEG= 300
##$TL= (0..7)
0 120 120 120 120 120 120 120 
##$TP= (0..7)
150 150 150 150 150 150 150 150 
##$TP07= 0
##$TPNAME0= <>
##$TPNAME1= <>
##$TPNAME2= <>
##$TPNAME3= <>
##$TPNAME4= <>
##$TPNAME5= <>
##$TPNAME6= <>
##$TPNAME7= <>
##$TPOAL= (0..7)
0.5 0.5 0.5 0.5 0.5 0.5 0.5 0.5 
##$TPOFFS= (0..7)
0 0 0 0 0 0 0 0 
##$TUNHIN= 0
##$TUNHOUT= 0
##$TUNXOUT= 0
##$USERA1= <user>
##$USERA2= <user>
##$USERA3= <user>
##$USERA4= <user>
##$USERA5= <user>
##$V9= 5
##$VALIST= <valist>
##$VCLIST= <CCCCCCCCCCCCCCC>
##$VD= 0
##$VDLIST= <DDDDDDDDDDDDDDD>
##$VPLIST= <PPPPPPPPPPPPPPP>
##$VTLIST= <TTTTTTTTTTTTTTT>
##$WBST= 1024
##$WBSW= 4
##$XGAIN= (0..3)
0 0 0 0 
##$XL= 0
##$YL= 0
##$YMAX_a= 318101
##$YMIN_a= -341191
##$ZGOPTNS= <>
##$ZL1= 120
##$ZL2= 120
##$ZL3= 120
##$ZL4= 120
##$ABSF1= 10
##$ABSF2= 0
##$ABSG= 5
##$ABSL= 3
##$ALPHA= 0
##$AQORDER= 0
##$ASSFAC= 0
##$ASSFACI= 0
##$ASSFACX= 0
##$ASSWID= 0
##$AUNMP= <proc_1d>
##$AZFE= 0.1
##$AZFW= 0.1
##$BCFW= 1
##$BC_mod= 2
##$BYTORDP= 1
##$COROFFS= 0
##$CY= -3
##$DATMOD= 1
##$DC= 2
##$DFILT= <>
##$DTYPP= 0
##$F1P= 0
##$F2P= 0
##$FCOR= 0.5
##$FTSIZE= 0
##$FT_mod= 4
##$GAMMA= 1
##$GB= 0.15
##$INTBC= 1
##$INTSCL= 1
##$ISEN= 128
##$LB= 0.25
##$LEV0= 0
##$LPBIN= 0
##$MAXI= 10000
##$MC2= 0
##$MEAN= 0
##$ME_mod= 0
##$MI= 1.114404
##$NCOEF= 0
##$NC_proc= 0
##$NLEV= 6
##$NOISF1= 3.799351
##$NOISF2= 2.8
##$NSP= 1
##$NTH_PI= 0
##$NZP= 0
##$OFFSET= 14.38212
##$PC= 1
##$PHC0= -1199.777
##$PHC1= 10.3922
##$PH_mod= 1
##$PKNL= yes
##$PPARMOD= 0
##$PSCAL= 0
##$PSIGN= 0
##$REVERSE= no
##$SF= 200.129724274929
##$SI= 16384
##$SIGF1= 3
##$SIGF2= 2
##$SINO= 400
##$SIOLD= 16384
##$SREGLST= <1H.CDCl3>
##$SSB= 0
##$STSI= 0
##$STSR= 0
##$SW_p= 3205.1282051282
##$SYMM= 0
##$S_DEV= 0
##$TDeff= 0
##$TDoff= 0
##$TI= <>
##$TILT= no
##$TM1= 0
##$TM2= 0
##$TOPLEV= 0
##$USERP1= <user>
##$USERP2= <user>
##$USERP3= <user>
##$USERP4= <user>
##$USERP5= <user>
##$WDW= 1
##$XDIM= 8192
##$YMAX_p= 0
##$YMIN_p= 0
$$ End of Bruker specific parameters
$$ ---------------------------------
##NTUPLES= NMR FID
##VAR_NAME=  TIME,          FID/REAL,        FID/IMAG
##SYMBOL=    X,             R,               I
##VAR_TYPE=  INDEPENDENT,   DEPENDENT,       DEPENDENT
##VAR_FORM=  AFFN,          ASDF,            ASDF
##VAR_DIM=   8192,          8192,            8192
##UNITS=     SECONDS,       ARBITRARY UNITS, ARBITRARY UNITS
##FACTOR=    0.0002768,     1,               1
##FIRST=     0,             0,               0
##LAST=      2.2672688,     0,               0
##MIN=       0,             -341191,         0
##MAX=       2.2672688,     318101,          0
$$ Real data points
##PAGE= N=1
##DATA TABLE= (X++(R..R)), XYDATA
$$ [...]
$$ plain form
1839 363 521 427 -118 264 650 106 -268 350 124 -93 -276 -13 -337 -585 -249 -42 -106 -313 -129 286 263
1860 263 146 313 638 317 -167 530 610 20 231 57 270 -119 -700 34 -322 -595 -479 -171 21 -247
1880 -247 -469 78 615 -32 295 404 139 276 367 -70 330 -101 -76 -87 -272 -304 -463 -351 -297 -613 -192 -107
1902 -107 -284 3 237 128 170 528 397 403 68 4 393 319 -540 -153 154 75 -305 -473 3 -48 -579 -222
1924 -222 212 301 -281 -86 250 676 58 201 394 328 18 6 -55 121 -394 -581 -95 -128 -244 -541 -520 -33
1946 -33 0 -620 -58 299 221 -41 4 723 570 62 -209 90 203 -51 -198 -298 150 -31 -559 -254 73
1967 73 -313 -551 -343 347 523 -223 136 661 357 71 -3 446 610 127 -339 332 -86 -98 -364 -387 93
1988 93 -234 -741 160 -3 -171 110 -49 538 490 21 71 644 336 139 80 204 221 -499 -610 231 -281 -409
$$ packed form
1839C63J58r4n45L82L86n44l74O18k26k17j83K63l24k48L36K07o4k07J84M15k3
1860B63j17J67L25l21m84O97Q0n90K11j74K13l89n81P34l56k73J16L08J92k68
1880b47k22N47N37o47L27J09k65J37R1m37M00m31K5j1j85l2j59J12N4l16M21Q5
1902a07j77K87K34j09M2L58j31Ol35o4L89p4q59L87L07p9l80j68M76n1n31L57
1924b22M34Q9n82J95L36M26o18J43J93o6l10j2o1J76n15j87M86l3j16k97K1M87
1946c3L3o20N62L57p8k62M5P19j53n08k71K99J13k54j47j00M48j81n28L05L27
1967G3l86k38K08O90J76p46L59N25l04k86p4M49J64m83m66O71m18j2k66k3M80
1988I3l27n07R01j63j68K81j59N87m8m69N0N73l08j97n9J24J7p20j11Q41n12j28
$$ plain form
2010 -409 -469 -327 -129 -239 -289 236 193 185 261 139 754 540 -66 248 561 -11 94 67 -246 -96 -371 -419 -313
2033 -313 -222 -477 -134 -393 260 219 -42 141 327 224 469 -166 -96 519 -54 -248 401 -139 -599 -303 -95
2054 -95 127 -244 -544 156 273 -325 -244 8 533 251 -13 205 440 -36 -79 111 1 44 -425 -249 155
2075 155 -123 -396 -163 -137 -28 -265 -229 -22 86 -247 333 296 244 106 438 306 196 -260 37 -127 -468
2096 -468 -129 -170 -132 -204 -229 254 -43 -135 -43 256 -19 -241 457 36 245 232 418 90 -465 -275 94 53 -257
2119 -257 -338 -61 -9 -543 -549 75 -186 -35 184 333 518 94 77 282 563 -35 208 556 331 -153 -270 -91
2141 -91 -22 -754 16 -57 -682 -298 109 -81 -104 -238 238 240 -11 44 476 241 -55 141 -32 -394 -355 -155 280
2164 280 -123 -488 -59 84 -211 -451 -29 161 -388 -16 189 571 -64 166 135 709 140 -190 127 301
$$ packed form
2010d09o0J42J98j10n0N25m3qP6j22O15k14o06L14L13n72J05k7l13J50k75m8J06
2033c13R1k55L43k59O53m1k61J83J86j03K45o35P0O15n73j94O49n40m60K96K08
2054i5K22l71l00P00J17n98Q1K52N25k82k64K18K35m76m3J90j10M3m69J76M04
2075A55k78k73K33K6J09k37L6K07J08l33N80l7n2j38L32j32j10m56K97j64l41
2096d68L39m1L8p2k5M83k97r2R2K99k75k22O98m21K09j3J86l28n55J90L69m1l10
2119b57q1K77N2n34oO24k61J51K19J49J85m24j7K05K81n98K43L48k25m84j17J79
2141i1O9p32P70p3o25L84M07j90k3j34M76Kk51N5M32k35k96J96j73l62L9K00M35
2164B80m03l65M29J43k95k40M22J90n49L72K05L82o35K30l1N74n69l30L17J74
$$ plain form
2184 301 -121 -171 -106 -78 -220 -454 -118 340 -267 -277 381 14 125 276 492 172 28 -117 195 53 -63
2205 -63 120 -29 16 -416 -101 -2 -279 -75 58 -222 -64 95 -84 442 343 54 427 600 66 177 344
2226 344 -1 -154 -74 -66 -107 -600 -394 293 -106 -281 -217 90 7 -231 -146 363 -70 -12 323 291 179 101 98 376
2250 376 -135 -258 43 -137 -436 1 -147 9 -240 -271 15 -33 -109 158 209 250 112 374 38 498 -30 141
2272 141 271 -40 -42 -69 -262 85 -204 70 268 -369 -288 299 105 89 160 488 650 80 -81 247 105 165
2294 165 -25 -165 -76 -194 -324 12 -185 -402 -268 77 -198 -125 -23 230 234 -135 469 489 207 469 148 -213
2316 -213 26 -137 70 27 -288 -444 50 -304 -337 -79 64 145 -96 -124 190 195 -11 305 170 -35 120 4
2338 4 52 121 -185 76 -211 -149 -338 -442 -245 -388 4 -144 -34 -104 222 211 320 -1 -90 87 296 89 15
$$ packed form
2184C01m22n0O5K8j42k34L36M58o07j0O58l67J11J51K16l20j44j45L12j42j16
2205f3J83j49M5m32L15R9k77K04J33k80J58J59j79N26r9k89L73J73n34J11J67
2226C44l45j53Q0Qm1m93K06O87l99j75O4L07q3k38Q5N09m33N8L35l2j12p8lK78
2250C76n11j23L01j80k99M37j48J56k49l1K86m8p6K67N1M1j38K62l36M60n28J71
2272A41J30l11kk7j93L47k89K74J98o37Q1N87j94j6P1L28J62n70j61L28j42O0
2294A65j90j40Q9j18j30L36j97k17J34L45k75P3J02K53Ml69O04K0k82K62l21l61
2316b13K39j63K07m3l15j56M94l54l3K58J43Q1k41k8L14Nk06L16j35k05J55j16
2338DM8O9l06K61k87O2j89j04J97j43L92j48J10p0L26j1J09l21q9J77K09k07p4
$$ plain form
2361 15 332 27 -386 -259 47 -213 -326 -245 32 -70 -111 -72 140 297 -7 -57 281 255 24 476 92 108
2383 108 139 5 5 -222 -208 -31 190 -302 -98 -149 -205 17 -15 -49 215 131 288 362 126 320 57 58 165 -304
2407 -304 -62 21 -296 -233 -119 -186 42 -225 -206 150 124 -11 -30 89 -214 -18 146 172 187 -43 -31 8 -13 22
2431 22 -8 -81 -111 -110 -230 141 8 -295 -25 151 126 57 160 220 313 83 -181 68 280 87 -354 126 -180
2454 -180 77 -187 -182 -299 56 -232 -278 -27 31 -125 61 351 110 235 -57 305 418 -30 -133 37 214
2475 214 319 -302 -125 -3 -230 -399 -347 -13 -151 15 87 160 40 13 -18 371 233 19 122 239 302 -106
2497 -106 -57 -166 88 74 -216 -221 254 -156 -203 -132 -19 97 -165 -371 302 369 107 52 120 92 104 46 -77 108
2521 108 -197 -75 -22 -166 -272 -284 -369 101 114 5 97 117 389 431 261 477 94 71 -34 59 181 64 -267
$$ packed form
2361A5L17l05m13J27L06k60j13Q1K77j02m1L9K12J57l04n0L38k6k31M52l84J6
2383A08L1j34%k27J4J77K21m92K04n1n6K22l2l4K64q4J57P4k36J94k63JJ07m69
2407c04K42Q3l17O3J14o7K28k67J9L56k6j35j9J19l03J96J64K6J5k30J2L9k1L5
2431B2l0p3l0Jj20L71j33l03K70J76k5o9J03O0R3k30k64K49K12j93m41M80l06
2454a80K57k64Nj17L55k88m6K51N8j56J86K90k41J25k92L62J13m48j03J70J77
2475B14J05o21J77J22k27j69N2L34j38J66P2P3j20k7l1L89j38k14J03J17O3m08
2497a06M9j09K54j4k90nM75m10m7P1J13J16k62k06O73O7k62n5O8k8J2n8j23J85
2521A08l05J22N3j44j06j2q5M70J3j09R2K0K72M2j70K16l83k3j05R3J22j17l31
$$ plain form
2544 -267 -103 -160 -99 -214 -217 120 94 27 -159 329 233 -31 110 115 241 -115 34 261 140 71 -230 -88 50
2567 50 31 -453 -11 23 -264 -300 35 159 149 -360 287 45 -18 236 126 120 -39 221 -125 -33 -20 -96 -270 -271
2591 -271 -125 207 -330 -211 107 283 -7 -1 -46 172 283 -218 293 -25 258 -143 140 128 128 -91 -66 -226
2613 -226 -381 -88 -89 -347 -129 -246 -250 -39 -144 -117 -137 145 173 204 121 217 109 20 -64 -111 -30 -159 -82 -105 -459
2638 -459 -362 -361 2 202 231 242 83 -68 307 93 381 43 374 78 -7 -19 6 -172 77 -83 -87 167 -45
2661 -45 -171 173 41 79 -204 123 239 202 61 273 93 79 140 200 -61 72 -94 184 379 -443 -141 -269
2683 -269 -65 -28 -188 -123 118 -174 184 213 291 133 246 102 98 107 39 168 -118 -90 -75 -156 86 -17 177 27
2707 27 -250 38 303 -159 67 137 433 245 18 235 463 119 -83 19 246 -12 -65 -130 23 107 -546 -15
$$ packed form
2544b67J64n7O1j15lL37k6o7j86M88r6k64J41NJ26l56J49K27j21o9l01J42J38
2567E0j9m84M42L4k87l6L35J24j0n09O47k42o3K54j10oj59K60l46R2J3p6j74j
2591b71J46L32n37J19L18J76k90Om5K18J11n01N11l18K83m01K83j2%k19K5j60
2613b26j55K93jk58K18j17mK11j05K7k0K82K8L1q3R6j08q9q4m7Q1j29P7k3l54
2638d59R7JL63K00K9J1j59j51L75k14K88l38L31k96q5j2K5j78K49j60mK54k12
2661d5j26L44j32L8k83L27J16l7j41K12j80j4O1O0k61J33j66K78J95q22L02j28
2683b69K04L7j60O5K41k92L58K9P8j58J13j44mRo8J29k86K8J5q1K42j03J94j50
2707B7k77K88K65m62K26P0K96j88k27K17K28l44k02J02K27k58n3o5J53Q4o53N31
$$ plain form
2729 -15 92 -270 -256 -77 -74 344 -141 29 -5 -246 -58 308 86 -155 -125 -256 -180 -55 -120 -17 43 -79 -87 0
2753 0 264 108 46 70 56 -37 391 436 143 121 -31 51 173 -11 -24 -221 -137 -316 -109 -200 -84 -82 182 54 -149
2778 -149 -165 430 17 -44 40 560 238 -49 120 101 -107 -200 -164 -172 142 -96 -165 -79 191 -95 191 211 76 106
2802 106 62 256 122 -248 279 26 -180 150 -32 3 -262 -134 27 56 -463 37 -95 -176 -141 -369 153 25
2824 25 121 93 -7 215 -110 71 -238 70 146 191 -271 112 -79 132 -212 -105 -238 -296 -10 24 -13 404 204
2847 204 -218 208 263 243 204 151 -13 82 -21 182 56 -103 -88 142 -70 -151 -248 139 293 -163 133 97 -58
2870 -58 220 124 158 145 197 -60 136 -110 -61 -165 -112 27 42 -359 -494 67 -126 44 35 252 -278 -145 -134 138
2894 138 51 363 -72 -94 -34 -178 255 6 -74 91 110 -165 -210 147 14 -207 100 138 -127 -140 29 32 25 78
$$ packed form
2729a5J07l62J4J79LM18m85J70l4k41J88L66k22k41L0j31P6J25o5J03O0j22qQ7
2753@K64j56o2K4j4r3M28M5k93k2j52Q2J22j84j3j97Q4j79K07r1J16KK64j28k03
2778a49j6N95m13o1Q4N20l22k87J69j9k08r3L6qL14k38o9Q6K70k86K86K0j35L0
2802A06m4J94j34l70N27k53k06L30j82L5k65J28J61K9n19N00j32q1L5k28N22j28
2824B5R6k8j00K22l25J81l09L08P6M5m62L83j91K11l44J07j33n8K86L4l7M17k00
2847B04m22M26N5k0l9n3j64R5j03K03j26j59J5K30k12q1r7L87J54m56K96l6j55
2870e8K78r6L4j3N2k57J96k46M9j04N3J39J5m01j35N61j93J70rK17n30J33J1K72
2894A38q7L12m35k2O0j44M33k49q0J65J9k75m5L57j33k21L07L8k65j3J69LpN3
$$ plain form
2918 78 -182 163 -62 -239 -118 186 -34 -358 -33 29 -173 19 -345 199 20 -206 73 414 -116 -210 137
2939 137 37 -38 68 383 274 -189 139 -65 -97 255 -93 87 35 -20 -69 -9 -68 85 -39 127 -201 144
2961 144 249 123 138 -192 -149 -3 -196 18 -270 -97 -101 20 34 -70 -207 69 -35 92 -93 34 165 210
2983 210 50 45 184 34 195 -268 -1 145 -226 -19 -51 56 -198 -253 -131 -274 -7 -4 -17 -54 157 66 86
3006 86 154 -5 151 78 11 35 -138 -123 -144 118 -36 -222 -41 -62 -109 -152 -11 -81 25 1 120 83 42 58 55 94
3032 94 150 -65 65 10 -158 26 -202 -88 144 214 -23 -62 -116 -268 17 59 29 70 114 -150 -84 282 -29 -131
3056 -131 -272 264 -6 69 198 -166 -158 239 -118 -89 -72 155 63 116 231 60 -13 -84 256 -226 141 335 -7
3079 -7 88 29 -67 -15 -48 13 259 14 -165 -19 129 -35 -14 104 -55 217 48 245 50 114 97 -66 -166 -162
$$ packed form
2918G8k60L45k25j77J21L04k20l24L25O2k02J92l64N44j79k26K79L41n30r4L47
2939A37j00p5J06L15j09m63L28k04l2L52l48J80n2n5m9O0n9J53j24J66l28L45
2961A44J05j26J5l30M3J46j93K14k88J73mJ21J4j04j37K76j04J27j85J27J31M5
2983B10j60nJ39j50J61m63K67J46l71K07l2J07k54n5J22j43K67Lj3l7K11r1K0
3006H6O8j59J56p3o7K4j73J5k1K62j54j86J81k1m7m3J41p0J06k4J19l7m1J6lL9
3032I4N6k15J30n5j68J84k28J14K32P0k37l9n4j52K85M2l0M1M4k64O6L66l11j02
3056a31j41N36k70P5J29l64QL97l57K9J7K27r2N3J15j71p3p1L40m82L67J94l42
3079gR5n9r6N2l3O1K46k45j79J46J48j64K1J18j59K72j69J97j95O4j7j63j00M
$$ plain form
3103 -162 -158 104 81 -232 -317 13 93 -307 199 160 356 -17 -126 53 -52 -79 -14 109 -13 21 -134 40 -64
3126 -64 -148 -216 -275 -138 -98 -159 116 -37 -75 19 -74 -5 26 -21 -54 -14 134 91 73 -73 71 259 -128 218 -55
3151 -55 -81 58 -196 -84 -149 56 -95 182 55 12 25 19 60 -54 396 100 -223 -50 -228 -28 37 -203 -44
3174 -44 -56 -254 55 -239 -196 -176 -140 -110 312 313 -178 -113 115 -21 -6 69 -116 121 55 91 336 -68 99 -29
3198 -29 -124 -250 -81 268 68 35 -64 108 121 160 62 32 297 67 -172 37 -19 -293 68 -295 -214 4 -83 -94
3222 -94 -220 -452 -26 28 116 32 -121 46 223 121 111 371 -38 60 38 228 -195 128 102 -35 -124 -28 153
3245 153 21 -95 43 71 74 63 168 398 -142 208 209 -47 49 -1 42 95 -40 -118 116 -60 -316 -209 53 -90
3269 -90 -109 107 61 38 126 152 497 313 16 97 130 258 22 -5 -121 61 6 -142 -52 -55 -22 2 260 -48 -62
$$ packed form
3103a62MK62k3l13q5L30Q0m00N06l9J96l73j09J79j05k7O5J23j22L4j55J74j04
3126f4q4o8n9J37M0o1K75j53l8R4r3O9L1m7l3M0J48m3j8j46J44J88l87L46k73
3151e5k6J39k54J12o5K05j51K77j27m3J3oM1j14M50k96l23J73j78K00O5k40J59
3174d4j2j98L09k94M3K0L6L0M22Jm91O5K28j36J5P5j85K37o6L6K45m04J67j28
3198b9r5j26J69L49k00l3r9J72J3L9r8l0K65k30k39K09n6k74L61l63Q1K18q7j1
3222i4j26k32M26N4Q8q4j53J67J77j02j0K60m09R8k2J90m23L23k6j37q9R6J81
3245A53j32j16J38K8Lj1J05K30n40L50Jk56R6n0M3N3j35p8K34j76k56J07K62j43
3269i0j9K16m6k3Q8K6L45j84k97Q1L3J28k36k7j16J82n5j48R0lL3K4K58l08j4
$$ plain form
3294 -62 128 -12 133 289 88 161 -220 -137 -68 -130 -12 210 -133 -104 88 109 -116 -36 88 63 95 4 58 175
3318 175 88 124 -2 509 182 194 -68 204 -116 37 6 -335 -173 -276 -18 -349 4 -143 12 162 -58
3339 -58 39 79 85 54 -38 -58 -153 162 175 -73 82 189 -174 -170 -254 -24 -111 56 5 -14 281 -130 382 114 63 508
3365 508 166 -50 123 -26 -4 -167 -112 262 -77 -20 -144 -96 137 122 -24 127 -212 19 -102 -17 5 65 247
3388 247 399 -23 -187 -25 51 121 -223 37 -17 46 -299 -198 133 50 -102 112 -74 6 221 149 63 -68 155
3411 155 271 19 45 111 -72 21 -12 147 213 -36 -148 275 -142 -117 -43 74 -117 -159 65 -122 -94 -4 10 -29
3435 -29 -371 -183 -140 -73 -122 19 33 -51 64 54 -21 -83 -18 128 66 266 59 -51 -127 153 -136 58 196 121
3459 121 18 180 -120 -65 50 -109 -6 96 -194 -46 -20 -12 215 61 13 123 296 129 164 34 57 310
$$ packed form
3294f2J90j40J45J56k01P3l81Q3O9o2J18K22l43K9J92K1k25Q0J24k5L2r1N4J17
3318A75q7L6j26N11l27J2k62K72l20J53l1l41J62j03K58l31L53j47J55J50k20
3339e8R7M0Ol1r2k0r5L15J3k48J55J07l63Mq4K30q7J67n1j9K95m11N12k68n1M45
3365E08l42k16J73j49K2j63N5L74l39N7j24M8K33j5j46J51l39K31j21Q5K2O0J82
3388B47J52m22j64J62P6P0l44K60n4O3l45J01L31q3j52K14j86Q0K15p2q6j31K23
3411A55J16k52K6O6j83R3l3J59O6k49j12M23m17K5P4J17j91m2K24j87K8R0J4l9
3435b9l42J88M3O7m9J41J4q4J15j0p5o2O5J46o2K00k07j10p6K80k89J94J38p5
3459A21j03J62l00N5J15j59J03J02k90J48K6QK27j54m8J10J73j67L5j30K3K53
$$ plain form
3481 310 -109 -163 177 -142 189 -92 -180 -17 24 -197 147 -135 94 203 -83 279 -288 135 -365 233 -125
3502 -125 25 95 -273 -84 4 -166 51 -40 2 -140 6 -13 -210 16 111 -41 38 -81 240 46 49 152 45
3525 45 144 -57 -70 162 -318 126 -65 -104 45 -17 -43 -197 -104 153 -80 103 128 -89 -66 15 162 -111 -136 246
3549 246 -173 178 -19 -161 43 -21 191 -156 -135 -109 -20 61 110 193 36 29 141 291 12 101 53 90 -205 -215
3573 -215 -153 245 2 127 80 49 -142 44 -279 -384 -26 -302 118 60 18 20 88 -58 27 -149 -136 -72 -93 116
3597 116 -93 -50 -127 -107 -171 -313 165 47 -182 -105 -34 74 361 157 124 159 -122 -29 -152 198 318 -113 143
3620 143 -86 -42 74 -73 -62 242 132 -215 46 121 156 -50 -25 4 -4 52 -79 0 96 303 -34 4 291 37
3644 37 139 -190 -172 -44 43 -100 96 -37 13 -147 66 266 29 35 -23 -16 19 135 -61 41 -180 -34 -108 -19
$$ packed form
3481C10m19n4L40l19L31k81q8J63M1k21L44k82K29J09k86L62n67M23n00N98l58
3502a25J50P0l68J89Q8j70K17r1M2j42J46j9j97K26R5j52P9j19L21j94LJ03j07
3525D5R9k01j3K32m80M44j91l9J49o2k6j54R3K57k33J83K5k17K3Q1J47k73k5L82
3549B46m19L51j97j42K04o4K12l47K1K6Q9Q1M9Q3j57pJ12J50k79Q9m8L7k95j0
3573b15O2L98k43J25m7l1j91J86l23j05L58k76M20n8m2KO8j46Q5j76J3O4k1K09
3597A16k09M3p7K0o4j42M78j18k29P7P1J08K87k04l3L5k81R3j23L50J20m31K56
3620A43k29M4J16j47J1L04j10l47K61P5L5k06K5K9qN6j31P9R6K07l37L8K87k54
3644C7J02l29J8J28Q7j43J96j33N0j60K13K00k37On8PL5J16j96J02k21J46p4Q9
$$ plain form
3668 -19 -164 -5 268 -168 289 -51 -167 129 249 -184 42 -106 -36 317 344 243 -27 -18 180 -261 -207 -118
3690 -118 -133 92 -144 17 72 125 42 61 -22 338 -3 -17 156 86 186 27 105 69 87 -40 -324 -37 -81 -131
3714 -131 -156 142 -79 -28 -88 203 264 97 218 38 141 33 82 93 31 -40 -253 208 -144 61 78 -124 -113
3737 -113 -176 -198 -43 -116 123 -26 107 -100 -28 359 70 -70 79 36 -182 -125 18 -68 -91 169 10 295 271
3760 271 77 8 8 -41 60 -176 17 38 -45 222 -47 5 115 64 4 -99 124 -14 -41 -3 -189 106 112 -159
3784 -159 -78 149 -27 33 78 120 3 -209 46 -78 -70 -16 123 74 23 3 -44 -48 -37 214 -37 -72 -65 -163 -233 105
3810 105 53 50 48 7 99 -289 -205 -48 82 120 -142 -176 115 67 64 58 -89 -236 113 -69 54 166 21 211 319
3835 319 -100 -137 151 241 -21 124 122 63 -161 -91 -285 -20 -58 -15 -26 -283 38 -416 -131 -65 213 37 -141
$$ packed form
3668a9j45J59K73m36M57l40j16K96J20m33K26j48P0L53K7j01k70RJ98m41N4Q9
3690a18j5K25k36J61N5N3q3J9q3L60l41j4J73p0J00j59P8l6J8j27k84K87m4n0
3714a31k5K98k21N1o0K91O1j67J21j80J03j08M9J1o2p1k13M61l52K05J7k02J1
3737a13o3k2J55p3K39j49J33k07P2L87k89j40J49m3k18N7J43q6k3K60j59K85k4
3760B71j94o9%m9J01k36J93K1q3K67k69N2J10n1o0j03K23j38k7L8j86K95Ok71
3784a59Q1K27j76O0M5M2j17k12K55j24QN4J39m9n1k0m7mJ1K51k51l5Pr8p0L38
3810A05n2lkm1R2l88Q4J57J30L8k62l4K91m8loj47j47L49j82J23J12j45J90J08
3835C19m19l7K88R0k62J45kn9k24P0j94K65l8M3j1k57L21m54K85O6K78j76j78
$$ plain form
3858 -141 11 177 57 -19 66 -38 30 99 155 48 -50 243 46 -1 343 1 -35 -7 -91 107 56 341 193 129
3882 129 -204 -116 17 -304 -128 -167 -70 -234 -232 -140 -52 -133 56 167 -239 46 -146 30 1 224 138 274 121
3905 121 203 18 63 255 -139 57 -19 109 -72 103 192 75 -271 118 -41 169 -18 -136 21 107 -54 191
3927 191 58 -148 153 -31 -270 68 -153 -157 28 -338 119 -175 -197 75 66 -213 -227 152 -139 -53 -275 -201 -38
3950 -38 -121 -200 88 -24 90 119 68 11 71 33 156 62 44 -5 77 7 49 -13 157 27 -209 206 -65 49 -279
3975 -279 -216 96 -78 -209 -23 -206 149 -24 -125 -18 -43 187 -3 145 -75 -87 -20 196 37 -61 83 -80
3997 -80 -108 279 -8 -123 -211 -8 -7 65 -177 -61 -14 -66 -47 -88 323 135 99 -37 334 154 68 -28 -85 -71 103
4022 103 -61 28 -168 -223 -65 3 87 162 -7 -8 -50 107 -114 -45 59 180 302 -184 87 -14 -8 150 -74 -82
$$ packed form
3858a41J52J66j20p6Q5j04O8O9N6j07r8K93j97m7L44l42l6K8q4J98n1K85j48o4
3882A29l33Q8J33l21J76l9R7j64KR2Q8q1J89J11m06K85j92J76k9K23q6J36j53
3905A21Q2j85M5J92l94J96p6J28j81J75Q9j17l46L89j59K10j87j18J57Q6j61K45
3927A91j33k06L01j84k39L38k21mJ85l66M57k94k2K72rk79j4L79k91Q6k22P4J63
3950c8q3p9K88j12J14K9n1n7O0l8J23r4j8m9Q2p0M2o2J70j30k36M15k71J14l28
3975b79O3L12j74j31J86j83L55j73j01J07k5K30j90J48k20j2O7K16j59r8J44j63
3997h0k8L87k87j15q8K03JP2k42J16M7n2J9m1M11j88l6j36L71j80q6r6n7J4J74
4022A03j64Q9j96n5J58O8Q4P5j69jm2J57k21O9J04J21J22m86K71j01OJ58k24q
$$ plain form
4046 -82 -190 -130 -36 48 60 -150 113 162 -123 98 -77 -56 -63 184 -123 -187 -99 -159 -46 -136 -125 -256 -75 -66 120
4071 120 -1 -110 164 -221 -21 -37 35 29 48 120 126 36 73 22 23 104 -135 179 129 -97 84 -142 -314 210 -43
4096 -43 -12 -129 -81 87 -33 119 197 -64 142 -299 -215 -90 142 46 115 -20 74 -55 77 -88 -3 -141 163
4119 163 241 -76 -202 -162 423 45 118 240 -88 159 -28 121 -38 20 267 -86 195 82 -6 140 -192 -76
4141 -76 115 -110 99 30 -25 -84 -74 197 -86 -37 49 98 69 -188 -90 -198 -186 -282 -98 -182 -200 -254 -76 47 69
4166 69 -40 -47 75 29 -184 73 79 197 90 106 179 -2 -113 -61 -200 34 1 17 -125 -146 -17 -5 250 13
4190 13 -17 -288 146 30 75 -51 47 -269 -102 -168 -327 -42 -159 79 157 198 61 -193 73 -7 177 208 -133
4213 -133 196 56 184 -14 170 -96 -281 170 65 -78 24 36 127 -49 0 -174 -118 -83 -132 318 0 -218
$$ packed form
4046h2j08O0R4Q4J2k10K63M9k85K21j75K1pK47l07o4Q8o0J13r0J1j31J81RJ86
4071A20j21j09K74l85K00j6P2oJ9P2Or0L7n1JQ1k39L14n0k26J81k26j72N24k53
4096d3L1j17M8J68j20J52P8k61K06m41Q4J25K32r6O9j35R4j29J32j65Q5j38L04
4119A63P8l17j26M0N85l78P3J22l28K47j87J49j59N8K47l53K81j13q8J46l32J16
4141g6J91k25K09o9n5n9J0K71k83M9Q6M9k9k57R8j08J2r6J84q4j8n4J78J23K2
4166F9j09pJ22m6k13K57OJ18j07J6P3j81j11N2j39K34l3J6j42k1J29J2K55k37
4190A3l0k71M34j16M5j26R8l16J67o6j59K85j17K38P8M1j37k54K66q0J84L1l41
4213a33L29j40J28j98J84k66j85M51j05j43J02J2R1j76M9j74N6L5m9M50l18k18
$$ plain form
4235 -218 118 49 -163 171 208 97 301 -51 94 172 -104 85 -131 -8 -172 49 -56 -79 -52 152 -6 141
4257 141 9 -71 -307 118 -140 138 11 118 -195 4 246 -98 152 -231 -30 -6 -73 -144 -155 20 77 74 -164
4280 -164 7 374 238 -95 104 -74 -50 60 -33 22 -85 1 -32 153 -43 -113 -163 -224 23 33 59 -66 270
4303 270 22 -15 295 87 103 18 440 74 -298 9 -184 -63 -152 37 132 43 103 -40 118 -134 113 44 -196
4326 -196 -156 -33 -217 155 -63 -263 133 -187 -255 152 -75 194 -234 -33 165 52 -120 -5 145 -63 -238
4347 -238 87 23 45 -143 87 49 104 126 -25 5 110 36 -265 -122 41 -44 -65 -83 -47 39 -93 98 160 382
4371 382 -31 21 114 10 65 115 -98 -31 118 115 277 -315 -160 -26 -36 -38 -69 -175 339 156 79 27 122 230 169
4396 169 -91 -23 89 -300 29 45 -83 -275 -148 8 135 4 -108 -78 88 36 164 -21 2 57 56 91 127
$$ packed form
4235b18L36o9k12L34L7j11K04l52J45P8k76J89k16J23j64K21j05k3K7K04j58J47
4257A41j32q0k36M25k58K78j27J07l13J99K42l44K50l83K01K4o7p1j1J75N7lk38
4280a64J71L67j36l33J99j78K4J10r3N5j07Q6l3J85j96p0n0o1K47J0K6j25L36
4303B70k48l7L10k08J6q5M22l66l72L07j93J21q9J89R5q9O0j43J58k52K47o9k40
4326a96M0J23j84L72k18k00L96l20o8M07k27K69m28K01J98j13j72J15J50k08j75
4347b38L25o4K2j88K30l8N5K2j51L0J05p4l01J43J63q5k1j8L6Q6j32J91O2K22
4371C82m13N2R3j04N5N0k13O7J49lJ62n92J55J34j0kl1j06N14j83p7n2R5J08o1
4396A69k60O8J12l89L29J6j28j92J27J56J27j31j12L0J66n2J28j85K3N5jL5L6
$$ plain form
4419 127 -52 46 9 145 19 -14 209 -58 104 -89 56 -87 145 -3 76 -137 -193 107 291 -149 143 -7
4441 -7 77 109 -192 163 -94 -40 79 75 39 -199 -56 -339 -101 -128 106 16 104 357 219 74 4 4 232 89 -45
4466 -45 -164 -305 -328 -75 -476 -212 -31 -14 -120 156 146 67 62 -34 172 -164 -31 -82 -219 -61 55 48 -56 -163
4490 -163 14 -159 -70 -27 144 -111 -109 -267 -54 -266 58 81 30 -294 -168 -52 101 289 -73 124 -16 22
4512 22 160 -88 -128 -51 -89 -25 -168 76 -190 255 -197 96 63 22 77 8 27 -10 -19 180 212 104 -194 -68 -230
4537 -230 -181 66 -202 118 27 98 -72 95 32 268 246 112 220 396 -80 -68 -2 -299 42 126 -78 122 -65
4560 -65 200 -6 -183 -18 -195 -116 48 6 -37 89 5 -72 3 49 -121 -91 -76 26 -210 -98 -186 137 58 92
4584 92 142 -181 -150 40 41 -3 -230 66 175 492 -149 53 143 170 320 229 94 118 92 179 -21 144 -83 42
$$ packed form
4419A27j79R8l7J36j26l3K23k67J62j93J45j43K32j48P9k13n6L00J84m40K92j50
4441gQ4L2l01L55k57N4J19ml6k38J43k83K38k7K34r0Q8K53j38j45p0%K28j43j34
4466d5j19j41k3K53m01K64J81J7j06K76j0p9nr6K06l36J33n1j37J58J16pj04j07
4490a63J77j73Q9M3J71k55Kj58K13k12L24K3n1l24J26J16J53J88l62J97j40L8
4512B2J38k48m0P7l8O4j43K44k66M45m52K93l3m1N5o9J9l7rJ99L2j08k98J26j62
4537b30M9K47k68L20r1P1j70J67o3K36k2j34J08J76m76J2O6k97L41Q4k04K00j87
4560f5K65k06j77J65j77P9J64m2m3J26q4p7P5M6j70L0J5J02k36J12q8L23p9L4
4584I2N0l23L1J90Jm4k27K96J09L17o41K02R0K7J50r1j35K4k6Q7k00J65k27J25
$$ plain form
4608 42 -12 -23 -200 -102 150 203 284 -94 -102 -187 88 -28 -229 149 65 -150 -107 -55 -116 46 -148 136 -93 -167 237
4633 237 -282 51 165 96 188 59 295 21 98 -234 179 113 -62 -16 252 27 28 136 -90 -91 211 -344 87
4656 87 -132 -95 126 135 -1 -130 -102 -125 -267 -122 101 -72 -43 -175 -26 -120 -46 137 188 -35 -63 58 -98 -91
4680 -91 -78 82 -81 78 38 234 17 -2 -147 -313 -11 297 17 -16 -46 -31 -107 53 -166 -279 -41 137 150
4703 150 67 274 -108 -128 -88 -225 -120 211 -81 163 284 108 -8 -190 42 148 14 135 38 92 -27 47
4725 47 -139 101 264 -77 26 -42 79 133 -90 12 -39 21 23 -37 35 -280 -256 -217 13 29 4 -76 78 80 -146
4750 -146 54 -54 -99 109 -15 37 248 -151 -53 144 91 -158 29 -38 -79 261 -53 -77 69 -12 76 -221 -38
4773 -38 -30 6 -307 150 -35 -43 132 -61 72 -78 85 76 2 -78 -180 67 158 5 106 106 -5 -112 182 162 167
$$ packed form
4608D2n4j1j77R8K52N3Q1l78qq5K75j16k01L78q4k15M3N2o1J62j94K84k29p4M04
4633B37n19L33J14o9R2j29K36k74P7l32M13o6j75M6K68k25JJ08k26jL02n55M31
4656H7k19L7K21Rj36j29K8k3j42J45K23j73K9j32J49r4P4J83N1k23k8J21j56P
4680i1J3J60j63J59m0J96k17j9j45j66L02L08k80l3l0J5p6J60k19j13K38J78J3
4703A50q3K07l82k0M0j37J05L31k92K44J21j76j16j82K32J06j34J21r7N4j19P4
4725D7j86K40J63l41J03o8J21N4k23J02n1O0Ko0P2l15K4L9K30J6k5q0J54Kk26
4750a46K00j08m5K08j24N2K11l99R8J97n3k49J87o7m1L40l14k4J46q1Q8k97J83
4773c8QL6l13M57j85qJ75j93J33j50J63rp4q0j02K47R1j53J01%j11j07K94k0N
$$ plain form
4798 167 -104 156 6 128 280 210 -56 -83 32 225 -109 153 -23 139 214 -147 -24 -63 -173 -20 -56 -35
4820 -35 101 -128 -369 55 -67 -213 7 -262 -84 11 -237 14 -112 140 135 -132 121 -196 -52 127 18
4841 18 -226 28 149 41 77 108 311 -131 -239 76 -111 -279 101 -86 162 132 -118 -46 333 141 37 186
4863 186 64 138 -130 143 144 216 -91 -126 267 -103 -73 -229 -90 -257 106 -104 49 -75 14 39 34 117 -104 195
4887 195 -93 14 -128 -148 142 -271 99 -132 47 -89 -278 183 38 -9 72 64 -206 -78 -79 129 -41 -46 61
4910 61 84 -119 -219 -274 87 85 -75 -132 117 -76 147 -82 -83 126 -17 -125 -71 -93 -168 56 48 234 -16 205
4934 205 -139 32 -15 -36 282 14 102 -147 -40 192 126 -231 -5 -212 23 -191 75 -44 153 -164 -330
4955 -330 178 -317 326 -18 -375 91 -232 -67 92 50 191 -136 -101 -33 198 199 -9 -99 -96 -131 50 343 -61
$$ packed form
4798A67k71K60j50J22J52p0k66k7J15J93l34K62j76J62P5l61J23l9j10J53l6K1
4820c5J36k29k41M24j22j46K20k69J78R5k48K51j26K52nk67K53l17J44J79j09
4841A8k44K54J21j08L6L1K03m42j08L15j87j68L80j87K48l0k50P2L79j92j04J49
4863A86j22P4k68K73JP2l07l5L93l70L0j56J39j67L63k10J53j24Q9K5nQ3k21K99
4887A95k88J07j42k0K90m13L70k31J79j36j89M61j45m7Q1qk70J28jK08j70nJ07
4910F1K3k03j00n5L61kj60n7K49j93K23k29jK09j43j08N4k2p5K24qJ86k50K21
4934B05l44J71m7k1L18k68Q8k49J07K32o6l57K26k07K35k14K66j19J97l17j66
4955c30N08m95O43l44l57M66l23J65J59m2J41l27L5O8K31Jk08r0Ll5J81K93m04
$$ plain form
4978 -61 -271 167 138 52 -114 149 1 67 -124 1 111 101 81 -97 156 -61 94 23 -249 118 -111 -1
5000 -1 -302 -19 91 -131 206 -151 -60 -53 224 -259 -106 101 -168 78 104 5 218 138 225 41 22 33 150 -143
5024 -143 -133 -223 -126 196 -58 -22 221 156 68 -7 144 52 68 73 3 -171 -11 7 -24 248 187 161 167 -46 120 -35
5050 -35 -332 68 423 -89 104 -285 51 -102 102 168 112 97 -50 -252 -100 -306 -187 337 -32 193 -105
5071 -105 -56 25 40 -6 -185 9 -45 -368 43 -240 -51 355 108 90 43 43 -130 94 94 47 -99 -256 78 101
5095 101 -17 18 27 225 -81 -83 307 85 -68 316 -5 46 -41 145 -55 144 -85 -176 231 16 -129 -153 91
5118 91 269 -115 11 -111 -74 -161 61 -249 -63 27 30 35 27 80 -139 -69 -246 189 145 80 -89 93 -145 117 17
5143 17 -1 -33 346 -81 -53 142 167 45 -22 43 -72 112 4 -43 -2 170 -35 195 -25 72 -184 -61 127
$$ packed form
4978f1k10M38k9q6j66K63j48O6j91J25J10j0k0j78K53k17J55p1k72L67k29J10
5000al01K83J10k22L37l57R1PK77m83J53K07k69K46K6r9K13q0Q7j84j9J1J17k93
5024a43J0r0R7L22k54L6K43o5q8p5J51r2J6Np0j74J60J8l1K72o1k6Ok13J66j55
5050c5k97M00L55n12J93l89L36j53K04O6n6j5j47k02J52k06J19N24l69K25k98
5071a05M9Q1J5m6j79J94n4l23M11k83J89M06k47j8m7%j73K24%m7j46j57L34K3
5095A01j18L5RJ98l06kL90k22j53L84l21N1q7J86k00J99k29r1M07k15j45k4K44
5118I1J78l84J26j22L7q7K22l10J86R0LNqN3k19P0j77M35m4o5j69J82k38K62j00
5143A7j8l2L79m27K8J95K5j22o7O5j15J84j08m7M1J72k05K30k20R7k56J23J88
$$ plain form
5166 127 300 153 238 -56 78 -121 -40 -179 -21 -137 30 117 -7 76 214 94 174 23 -19 -69 -226 -31
5188 -31 21 19 76 113 -208 9 -194 100 -246 134 -124 51 26 217 -37 175 -162 -74 208 -170 -42 6 400
5211 400 -268 -113 103 302 -3 -13 114 197 106 203 13 -332 -96 -207 -81 95 29 -18 -111 10 -57 -197 -248
5234 -248 -187 76 255 220 44 203 42 66 -53 21 -42 -73 -285 -61 72 -116 -5 62 30 -45 32 -180 -99 12
5258 12 209 62 15 227 78 6 99 171 146 -39 -61 -114 71 -164 -27 -4 -309 -165 -85 121 64 -211 -51 -158
5282 -158 204 -89 -48 109 82 86 129 -78 -64 93 -131 -127 -224 -164 117 -216 93 -86 -225 242 -352 20 53 -39
5306 -39 -42 219 33 26 60 -118 -28 21 434 -37 115 -3 -26 -203 -136 -283 116 52 -219 102 10 -21 -205 -488
5330 -488 104 17 4 -74 -16 29 -172 15 -252 -142 -10 -115 100 116 214 71 102 -115 -146 179 143 -147 52
$$ packed form
5166A27J73j47Q5k94J34j99Q1j39J58j16J67Q7j24Q3J38j20Q0j51m2n0j57J95
5188c1N2kN7L7l21K17k03K94l46L80k58J75k5J91k54K12l37Q8K82l78J28M8L94
5211D00o68J55K16J99l05j0J27Q3r1R7j90l45K36j11J26J76o6m7r3J21o7j40n1
5234b48O1K63J79l5j76J59j61K4j19P4o3l1k12K24J33j88J11O7l2p5P7k12Q1J11
5258A2J97j47m7K12j49p2R3P2k5j85k2n3J85k35J37K3l05J44Q0K06n7k75J60j07
5282a58L62k93M1J57k7MM3k07J4J57k24Mr7O0K81l33L09j79j39M67n94L72L3r2
5306c9lK61j86pL4j78R0M9M13m71J52j18k3j77O7j47L99o4k71L21r2l1j84k83
5330d88N92q7j3p8N8M5k01J87k67J10J32j05K15J6R8j43L1k17l1L25l6k90J99
$$ plain form
5353 52 -88 97 -220 -150 185 -18 -149 -95 -38 -120 7 264 -35 13 -94 -44 -95 -128 3 208 72 150 -61
5376 -61 68 -39 258 19 22 13 268 223 215 -208 -312 209 94 62 95 -171 -7 249 84 -163 -129 200 -12 59
5400 59 -147 28 114 -144 38 143 -150 -42 -155 46 101 -91 117 23 185 -303 -133 -13 -258 64 280
5421 280 -75 20 62 2 52 -101 -82 208 77 -162 174 175 196 208 10 -6 323 1 118 -149 -311 -6 -50 53
5445 53 -169 -242 -15 198 19 -152 3 207 129 -75 -90 -67 -142 156 12 262 102 84 -97 52 42 87 151
5468 151 -43 313 206 239 -220 26 -235 -114 163 -305 -5 108 9 0 109 -170 11 80 180 24 -54 -51 91
5491 91 122 -55 231 -236 28 -32 -117 385 -47 -65 57 -70 -19 -76 -37 -220 -121 201 -128 -67 -27 -16 245 -124
5515 -124 -225 88 459 -87 -9 -3 -224 146 67 74 -13 141 77 53 75 25 215 258 -129 106 313 -47 -43 11 -24
$$ packed form
5353E2j40J85l17P0L35k03j31N4N7q2J27K57k99M8j07N0n1l3J31K05j36P8k11
5376f1J29j07K97k39LrK55m5qm23j04N21j15l2L3k66J64K56j65k47L4L29k12P1
5400E9k06J75Q6k58J82J05k93J08j13K01N5j92K08r4J62m88J70J20k45L22K16
5421B80l55R5M2o0N0j53J9K90j31k39L36JK1J2j98j6L29l22J17k67j62L05m4J03
5445E3k22p3K27K13j79j71J55K04p8k04j5K3p5K98j44K50j60j8j81J49j0M5O4
5468A51j94L56j07L3m59K46k61J21K77m68L00J13r9rJ09k79J81O9J00j56p8LJ42
5491I1L1j77K86m67K64o0q5N02m32j8J22j27N1n7L9j83R9L22l29O1M0J1K61l69
5515a24j01L13L71n46P8Ok21L70p9Pq7J54o4k4K2n0J90M3l87K35K07l60MN4l5
$$ plain form
5540 -24 186 -213 -151 68 23 -22 -26 12 56 105 -13 -16 -149 251 181 66 -33 -229 -106 -77 -119 -18 -189 -2 -20
5565 -20 299 -47 7 90 -33 70 177 181 168 38 107 -303 -210 44 -52 343 9 -19 -111 -188 -71 -144 438 93
5589 93 85 254 -250 -28 18 157 -93 -98 -89 63 -57 3 -28 111 72 -290 11 21 261 -327 87 -33 30 57 109
5614 109 28 -24 6 -216 -48 165 -42 -51 -55 -61 187 118 -65 77 100 -116 110 388 -25 -19 -219 5 -3 -70 -17 173
5640 173 -78 244 29 24 29 -79 -20 124 125 9 42 117 -255 127 -73 67 167 250 -38 74 -78 -50 56 116
5664 116 202 40 181 126 338 17 -77 -62 -68 -139 -345 45 37 157 20 -243 -16 32 138 -93 42 1 103 176
5688 176 -52 138 -21 72 -68 -57 41 -113 -153 -157 -127 100 -24 61 139 225 122 253 69 143 134 118 446 250 176
5713 176 144 -228 -103 140 69 -69 -9 -159 119 238 -157 80 130 -36 79 149 -40 -176 103 32 69 114 -21
$$ packed form
5540b4K10l99O2K19m5m5mL8M4M9j18lj33M00p0j15r9j96J23K9m2J01j71J87j8
5565b0L19l46N4Q3j23J03J07Mj3j30O9m10R3K54r6L95l34k8r2p7J17p3N82l45
5589I3qJ69n04K22M6J39k50nRJ52j20O0l1J39l9l62L01J0K40n88M14j20O3K7N2
5614A09q1n2L0k22J68K13k07rmoK48o9j83J42K3k16K26K78m13Ok00K24qo7N3J90
5640A73k51L22k15nNj08N9J44Jj16L3P5l72L82k00J40J00Q3k88J12j52K8J06O0
5664A16Q6j62J41n5K12l21r4J5op1k06L90qJ20j37k63K27M8J06k31J35m1J02P3
5688A76k28J90j59R3j40J1R8j54m0mL0K27j24Q5P8Q6j03J31j84P4rj6L28j96p4
5713A76l2l72J25K43p1j38O0j50K78J19l95K37N0j66J15P0j89j36K79p1L7M5j35
$$ plain form
5736 -21 120 -38 133 121 117 28 -164 26 -32 -17 -49 283 11 -69 -9 88 29 123 138 -30 -40 -206 -22 116 -168
5761 -168 180 22 -65 -71 204 -246 -15 163 -217 -8 54 150 -24 77 180 60 -369 56 96 -57 142 -148
5783 -148 250 -38 147 351 -94 -3 -119 -191 46 -56 -66 204 -106 129 -20 -15 168 175 152 -140 58 -253 -172
5806 -172 -15 153 241 -28 -111 -143 103 -90 -289 81 328 183 -130 62 10 38 -149 68 242 28 144 48
5828 48 217 7 8 0 -30 -83 161 105 159 -118 -15 -90 -8 87 124 40 341 -258 -247 259 34 60 -102 -138 177 35
5854 35 -115 -200 18 30 16 136 31 193 30 41 17 186 -58 139 -45 -210 -81 138 -210 209 207 -389 -185
5877 -185 -213 69 89 84 203 -224 -187 149 160 -137 38 -80 298 -386 -228 53 328 -36 123 -34 114 5
5899 5 121 118 85 105 76 189 -6 124 2 147 38 26 4 91 166 82 183 -116 184 -171 236 4 -464 83
$$ packed form
5736b1J41j58J71j2mq9j92J90n8J5l2L32k72q0O0R7n9R4J5j68j0j66J84J38k84
5761a68L48j58q7oK75m50K31J78l80K09O2R6j74J01J03j20m29M25M0j53J99k90
5783a48L98k88J85K04m45R1j16p2K37j02j0K70l10K35j49NJ83Pk3k92J98l11Q1
5806a72J57J68Q8k69q3l2K46j93j99L70K47j45l13J92n2K8j87K17J74k14J16r6
5828D8J69k10Jql0n3K44n6N4k77J03p5Q2R5L7q4L01n99J1N06k25K6j62l6L15j42
5854C5j50q5K18J2j4J20j05J62j63J1k4J69k44J97j84j65J29K19l48M19kn96K04
5877a85k8K82K0nJ19m27L7L36J1k97J75j18L78o84J58K81K75l64J59j57J48j09
5899EJ16ll3K0k9J13j95J30j22J45j09j2k2Q7P5q4J01k99L00l55M07k32m68N47
$$ plain form
5923 83 30 174 -97 -1 -154 2 21 -173 -293 -6 -17 142 -166 32 -71 117 -16 101 68 -31 92 36 -20
5946 -20 109 93 87 70 112 -206 115 107 16 -139 -72 -141 -53 242 459 222 -163 -124 23 8 -52 -61 87 -235 20 -118
5972 -118 7 103 -50 -21 61 111 3 77 72 -177 137 -117 81 -10 -162 -147 -56 -194 -18 113 -150 -28 -27 -42
5996 -42 -156 17 55 146 -20 54 -173 -172 160 75 -193 -246 -158 -96 114 118 66 36 -250 -338 -9 -96 -1 91 119 74 -186
6023 -186 -216 78 99 -57 13 -364 -21 -61 178 -55 127 -89 11 -138 -340 46 0 -221 80 -14 16 35 -229
6046 -229 169 -30 99 76 -327 86 -67 -187 -168 28 75 -24 -74 47 -61 -254 198 99 262 87 30 74 182
6069 182 13 108 -133 55 -5 -18 183 -137 26 -127 106 -165 14 -49 151 -22 -52 77 -8 -13 29 363 133
6092 133 -83 -132 -86 -21 -20 -183 -129 180 38 -61 -53 -184 -123 117 110 -9 -136 57 -33 -50 164 157 142 -149 2 -16
$$ packed form
5923H3n3J44k71R6j53J56J9j94j20K87j1J59l08J98j03J88j33J17l3r9J23n6n6
5946b0J29j6oj7M2l18L21qr1j55O7o9Q8K95K17k37l85L9J47j5o0rJ48l22K55j38
5972a18J25R6j53K9Q2N0j08P4nk49L14k54J98r1j52J5R1j38J76J31k63J22Jj5
5996d2j14J73L8R1j66P4k27JL32q5k68n3Q8O2K10Mn2l0k86q8L29q7R5R2K8m5k60
6023a86l0K94K1j56P0l77L43m0K39k33J82k16J00j49k02L86m6k21L01r4L0J9k64
6046b29L98j99J29k3m03M13j53j20J9J96M7r9n0J21j08j93M52r9J63j75n7M4J08
6069A82j69R5k41J88o0j3K01l20J63j53K33k71J79o3K00j73l0J29q5nM2L34k30
6092A33k16m9M6O5Jj63N4L09j42r9Qj31O1K40pj19j27J93r0j7K14pj5k91J51j8
$$ plain form
6118 -16 -24 7 -139 -180 -210 -16 38 -182 56 230 -102 278 44 -95 -76 108 -101 68 50 189 92 74 19 12 -207
6143 -207 -195 -124 -285 89 -36 297 -49 170 61 177 73 -10 11 106 158 39 231 -6 88 -27 301 56
6165 56 47 -122 -119 112 107 -139 -49 -66 -225 -260 200 -10 -93 130 -71 149 -311 61 -99 -25 -139 -262 25 30 14
6190 14 -62 244 -106 99 117 183 -88 210 -105 -120 194 278 -103 -38 9 -55 241 -78 109 18 -40 237 312 113
6214 113 170 -234 134 -73 68 -151 315 394 -175 93 -237 147 7 29 -347 -123 42 290 5 103 -211
6235 -211 46 -160 79 34 252 -89 104 162 188 443 -102 71 127 205 14 -36 134 27 63 169 231 25 -258
6258 -258 114 -72 37 117 -12 -60 -115 100 35 128 47 154 73 15 -37 -138 -287 -149 182 -220 86 -84 -73
6281 -73 72 28 88 -37 3 -164 283 99 9 284 211 74 -120 17 14 -133 11 -83 -77 140 141 -332 -39 -132 191
$$ packed form
6118a6qL1j46m1l0J94N4k20K38J74l32L80k34j39J9J84k09J69j8J39r7j8n5pk19
6143b07J2P1j61L74j25L33l46K19j09J16j04q3K1R5N2j19J92k37R4j15L28k45
6165E6rj69LK31nk46R0j7j59l5M60k10q3K23k01K20m60L72j60P4j14j23K87Nj6
6190A4p6L06l50K05J8O6k71K98l15j5L14Q4l81O5M7o4K96l19J87r1n8K77P5j99
6214A13N7m04L68k07J41k19M66P9n69K68l30L84j40K2l76K24J65K48k85R8l14
6235b11K57k06K39m5K18l41J93N8K6K55n45J73N6P8j91n0J70j07L6J06O2k06k83
6258b58L72j86J09Q0j29m8n5K15o5R3q1J07q1n8n2j01j49J38L31m02L06j70J1
6281g3J45m4O0j25M0j67M47j84r0K75p3j37j94J37lj47J44r4OK17Jm73K93r3L23
$$ plain form
6306 191 -38 -81 202 -114 59 24 -114 184 -226 -189 -181 17 -121 -203 189 -42 79 -68 109 74 -82 30
6328 30 -47 -197 140 -97 -279 228 -143 -54 48 -114 97 116 -11 206 -98 -41 -136 -215 -172 143 19 32 -240
6351 -240 -57 203 50 313 37 112 -158 -84 70 -387 -182 -183 -11 -127 170 -63 -63 86 1 60 190 4 -17
6374 -17 85 -63 35 115 -112 248 150 41 166 -91 -290 -148 4 -317 -56 -101 -159 -40 229 -66 -81 -100 -226
6397 -226 171 166 77 -3 68 97 -98 122 113 39 218 230 52 -36 -17 -43 -168 -74 150 79 95 -45 269 201 167 210
6423 210 131 50 113 347 -231 2 -181 -113 -53 -155 -199 232 -127 -65 -174 163 49 -7 289 -38 -253 58 -126
6446 -126 -143 -151 -126 141 35 -2 166 -66 24 159 290 72 -41 -450 -89 223 303 101 -171 -8 -208 -126 25
6469 25 175 32 271 83 46 99 -139 160 126 22 -313 41 -79 -31 167 23 88 -101 287 38 -256 -11
$$ packed form
6306A91k29m3K83l16J73l5j38K98m10L7QJ98j38q2L92k31J21j47J77l5j56J12
6328C0p7j50L37k37j82N07l71Q9J02j62K11J9j27K17l04N7r5p9M3L15j24J3k72
6351b40J83K60j53K63k76P5k70P4J54m57K05jJ72j16K97k33%J49q5N9J30j86k1
6374a7J02j48R8Q0k27L60r8j09J25k57j99J42J52l21K61m5n8J19K69k95j5j9j26
6397b26L97nq9q0P1K9j95K20rp4J79J2j78q8J9k6j25R4K24p1J6j40L14o8l4M3
6423B10p9q1O3K34n78K33j83O8O0j02m4M31l59O2j09L37j14n6K96l27k15L11j84
6446a26j7qK5K67j06l7J68k32R0J35J31k18j13m09L61L12Q0k02k72J63k00Q2J51
6469B5J50j43K39j88l7N3k38K99l4j04l35L54j20M8J98j44O5j89L88k49k94K45
$$ plain form
6491 -11 -68 125 -25 83 -49 121 -61 -206 -439 -129 -14 111 199 -152 58 319 151 -11 -170 94 242
6512 242 -14 -145 156 -82 -273 -31 -289 -109 -66 156 115 -24 -68 89 -50 -383 86 -5 47 -32 -108 50
6534 50 88 -175 91 -3 145 195 -219 -5 -4 15 318 7 -169 34 92 -74 -250 114 168 134 250 -72 314
6557 314 150 29 102 -300 -28 103 253 166 -191 70 64 13 -125 36 53 -101 278 -104 -115 -85 -154 9 181
6580 181 160 3 -40 32 -37 -58 -52 -27 -31 -178 54 -155 -114 -216 8 30 -80 -165 209 53 65 -219 -105 81 -379
6605 -379 -102 -68 -4 -338 -40 -119 111 240 -24 -80 153 108 -62 60 -15 -39 -4 -25 137 134 -206 119 -92 153
6629 153 1 232 -168 193 80 -85 32 164 -18 -170 0 -38 60 -31 -81 103 17 -28 76 116 -27 -23 -195
6652 -195 118 -120 -71 101 12 -43 -230 212 4 -37 59 177 18 107 48 153 160 -179 352 71 -162 134 -118
$$ packed form
6491a1n7J93j50J08j32J70j82j45k33L10J15J25Q8l51K10K61j68j62j59K64J48
6512B42k56j31L01k38j91K42k58J80M3K22m1j39m4J57j39l33M69r1N2p9p6J58
6534E0L8k63K66r4J48N0m14K14JJ9L03l11j76K03N8j66j76L64N4l4J16l22L86
6557C14j64j21P3m02K72J31J50q7l57K61on1j38J61J7j54L79l82j1L0o9J63J72
6580A81k1j57m3P2o9k1OK5mj47K32k09M1j02K24K2j10q5L74j56J2k84J14J86m60
6605c79K77L4O4l34K98p9K30J29k64n6K33m5j70J22p5k4L5k1J62ll40L25k11K45
6629A53j52K31m00L61j13j65J17J32j82j52J70l8R8r1n0J84q6m5J04M0j43Mj72
6652a95L13k38M9J72q9n5j87M42k08m1R6J18j59Q9n9J05Pl39N31k81k33K96k52
$$ plain form
6675 -118 -99 -49 -78 -135 -207 -228 -296 94 231 -98 115 69 -142 -71 -133 151 -123 58 137 -103 43 121 140 -118
6699 -118 -158 110 -248 -36 -168 -202 -232 -19 159 186 4 78 105 -119 116 -110 -32 -132 -45 83 210 292 50
6722 50 110 159 40 -216 88 -55 -55 -65 -61 -139 -134 -78 -164 100 68 150 -1 -41 4 160 90 -131 -19 -109 187 -214
6748 -214 2 -256 78 154 -127 4 288 128 46 72 422 4 -139 10 146 -152 -82 -103 170 88 -74 237
6770 237 -92 -149 -52 6 -55 179 -48 43 42 -64 53 165 -36 154 -272 -125 -37 -163 -144 328 -204 -216 -54
6793 -54 -18 109 1 155 -12 -236 343 -87 194 -66 48 153 127 -115 35 30 54 128 24 -202 -89 123
6815 123 -366 170 5 258 135 -52 110 84 85 122 346 15 123 122 -138 104 92 284 -190 206 129 -133 -133
6838 -133 30 -82 143 252 -23 135 -39 115 159 171 267 55 -8 108 -44 -113 63 77 -130 57 -405 -192
$$ packed form
6675a18J9N0k9n7p2k1o8L90J37l29K13m6k11P1o2K84k74J81P9k40J46P8J9k58
6699a18m0K68l58K12j32l4l0K13J78K7j82P4K7k24K35k26P8j00Q7J28J27Q2k42
6722E0O0M9j19k56L04j43%j0Mp8NN6q6K64l2Q2j51m0M5J56p0k21J12r0K96m01
6748b14K16k58L34P6k81J31K84j60q2K6L50m18j43J49J36k98P0k1K73q2j62L11
6770B37l29n7R7N8o1K34k27R1jj06J17J12k01J90m26J47Q8j26J9M72n32j2J62
6793e4L6J27j08J54j67k24N79m30K81k60J14J05k6k42J50nK4P4j04k26J13K12
6815A23m89N36j65K53j23j87J62k6JL7K24l31J08jk60K42j2J92m74L96p7k62%
6838a33J63j12K25J09k75J58j74J54M4J2R6k12o3J16j52o9J76J4k07J87m62K13
$$ plain form
6860 -192 93 -103 -165 -193 -23 238 -32 218 203 43 -45 -345 -43 172 -4 -8 -198 51 -293 265 -54 -181
6882 -181 -32 -18 -23 -308 343 -43 -6 82 216 -268 79 -141 27 139 22 167 78 -12 -24 -87 -110 -229 181
6905 181 -119 -294 -79 52 102 -37 -58 -44 0 -163 -266 118 -13 -90 -9 -75 -44 -83 52 27 32 302 31 -236
6929 -236 52 -15 4 91 19 15 -84 -136 274 176 132 56 14 -80 -59 -177 -110 214 -84 18 -30 -195 -78 56 -37 -232
6955 -232 92 27 32 131 -134 -26 -37 17 43 -32 43 -37 -69 -171 2 -132 -15 -231 -143 -132 -139 -166 -325 16 78 50
6981 50 -127 24 -49 101 138 -110 -53 -285 -100 15 8 223 13 166 -274 183 -194 152 -20 -127 213 120
7003 120 120 45 -6 96 25 -130 -109 99 154 -145 -27 -108 -196 -109 -56 14 -139 14 28 212 -36 41 -58 48 -216
7028 -216 1 143 -104 145 -78 141 -168 0 -38 112 -106 -52 -41 -150 252 124 -55 186 -178 -164 8
$$ packed form
6860a92K85j96o2k8J70K61k70K50j5j60q8l00L02K15j76mj90K49l44N58l19j27
6882a81J49J4nk85O51l86L7Q8J34m84L47k20J68J12j17J45q9r0j2o3k3j19M10
6905A81l00j75K15J31N0j39k1J4M4j63j03L84j31p7Q1o6L1l9J35k5NK70k71k67
6929b36K88o7J9Q7p2mr9n2M10r8m4p6m2r4K1j18O7L24k98J02m8j65J17J34r3j95
6955b32L24o5NR9k65J08j1N4K6p5P5q0l2j02J73j34J17k16Q8J1pk7j59L41O2k8
6981E0j77J51p3J50L7k48N7k32J85J15pK15k10J53m40M57l77L46j72j07L40r3
7003A20%p5n1J02p1j55K1K08N5k99J18q1q8Q7N3P0j53J53J4J84k48P7r9J06k64
7028b16K17J42k47K49k23K19l09J68l8J50k18N4J1j09M02j28j79K41l64J4J72
$$ plain form
7049 8 -190 -138 -73 -163 134 -124 33 -40 -240 -5 185 -214 -147 -150 219 64 50 -91 49 -175 -127 -20 7 109
7073 109 92 -103 -32 -97 -237 -46 -49 135 272 -69 202 -72 -300 -41 20 314 75 46 125 115 -10 26 -79
7096 -79 -113 97 -149 7 80 74 416 -195 78 -177 153 -46 -1 -46 -48 3 -38 171 49 -3 312 -5 -117 -86
7120 -86 165 98 55 -7 -80 -24 72 193 50 -227 -14 -251 -19 -5 -171 115 215 62 -167 41 -186 -204 11
7143 11 -187 179 -30 154 -107 -37 295 -225 -222 -91 242 34 -88 -188 -38 36 17 -257 -194 -104 82 230 -441
7166 -441 52 -26 0 19 168 -169 -67 -83 -238 61 -168 -151 30 179 -49 229 46 133 -31 316 30 219
7188 219 82 90 49 -39 272 6 -71 -85 34 -81 -91 -104 -104 210 -141 294 17 -90 -178 -32 44 -108 149 8
7212 8 -105 38 40 4 228 -25 -160 98 74 -46 202 -83 -162 -51 -98 -126 -98 117 104 -20 284 -181 -194 -75
$$ packed form
7049Hj98N2O5r0K97k58J57p3k00K35J90l99O7lL69j55j4j41J40k24M8J07K7J02
7073A09j7j95P1o5j40J91lJ84J37l41K71k74k28K59O1K94k39k9P9j0j25L6j05
7096g9l4K10k46J56P3oL42o11K73k55L30j99M5m5kN1m1K09j22n2L15l17j12L1
7120h6K51o7m3o2p3N6R6J21j43k77K13k37K32J4j66K86J00j53k29K08k27j8K15
7143A1j98L66k09J84k61P0L32n20LJ31L33k08j22j00J50P4j9k74O3R0J86J48o71
7166d41M93p8K6J9J49l37J02j6j55K99k29J7J81J49k28K78j83Q7j64L47k86J89
7188B19j37Qm1q8L11k66p7j4J19j15j0j3%L14l51M35k77j07q8J46P6j52K57j41
7212Hj13J43Kl6K24k53j35K58k4j20K48k85p9J11m7k8K8K15j3j24L04m65j3J19
$$ plain form
7236 -75 47 106 15 156 -69 -79 -137 -111 217 219 186 -220 31 -62 124 165 77 -107 163 -26 79 -61 37 -72
7260 -72 196 215 17 -197 54 160 75 -27 29 -48 -219 -12 103 8 212 -36 26 5 142 -90 -49 1 -376
7283 -376 46 195 -91 96 -227 102 94 44 159 159 -129 126 363 -51 242 0 33 217 -60 46 -103 9
7305 9 300 41 192 11 -25 -30 -31 -82 -193 -172 -7 -94 -62 -55 58 299 -207 -13 -113 -148 -160 108 187 253 13 -80
7331 -80 -26 -197 -12 -86 -157 150 228 155 131 235 -33 53 -171 -208 -39 -345 -62 -81 -106 148 44 -147 -22 147
7355 147 31 -82 -165 -49 -38 -179 112 62 8 7 -28 -51 -63 -91 -102 -149 -258 -21 -50 -116 36 -75 53 48 81 -53
7381 -53 -266 28 92 92 -247 104 230 232 108 59 -123 -212 51 -44 -55 -23 -141 41 181 -217 173 -28 -69 3
7405 3 -236 -114 260 -88 52 -162 -76 -62 -349 54 98 6 -67 -123 -99 -120 29 -5 181 115 -111 210 77 209
$$ packed form
7236g5J22N9r1J41k25j0n8K6L28Kl3m06K51r3J86M1q8j84K70j89J05j40R8j09
7260g2K68J9j98k14K51J06q5j02N6p7j71K07J15r5K04k48O2k1J37k32M1N0l77
7283c76M22J49k86J87l23L29qn0J15%k88K55K37m14K93k42L3J84k77J06j49J12
7305IK91k59J51j81l6njn1j11K1J65q7L2PJ13K41n06J94j00l5j2K68P9O6k40r3
7331h0N4j71J85p4p1L07P8p3k4J04k68Q6k24l7J69l06K83j9k5K54j04j91J25J69
7355A47j16j13q3J16J1j41K91n0n4jl5k3j2k8j1m7j09K37k9o6J52j11J28nL3j34
7381e3k13K94O4%l39L51J26Kj24m9j82q9K63r5j1L2j18J82J40l98L90k01m1P2
7405Ck39J22L74l48J40k14Q6J4k87M03M4r2p3n6K4k1J49l4J86o6k26L21j33J32
$$ plain form
7429 209 -114 84 72 -114 105 -86 -127 55 21 -25 174 72 -197 -82 -4 49 -187 -162 251 41 -86 61
7451 61 35 -105 179 -104 149 34 -234 -100 -39 -39 -9 80 139 310 235 -175 -146 13 125 9 58 66 69 72 -14 -185
7477 -185 -113 262 -150 -15 -210 -59 -249 -59 -19 -66 -177 50 -60 135 103 -83 -218 -3 36 -161 -160 -117 253
7500 253 -65 -39 -182 -207 -96 90 -1 57 26 226 16 24 -55 -106 19 23 134 -180 68 99 24 4 -104 -161 94
7525 94 24 85 -23 -21 6 30 -36 -66 -162 -205 97 -65 68 55 173 -25 72 -131 187 37 157 -7 114 -41
7549 -41 -176 -259 78 -43 106 45 189 136 -88 -34 -163 -101 -10 109 145 141 -57 -352 -88 146 -387 293 27
7572 27 53 108 18 85 -194 21 -22 117 -18 23 -48 198 -112 -129 -241 106 -51 -270 34 -305 83 62 -43
7595 -43 156 -3 99 73 136 145 -37 -319 -233 70 -215 -41 44 157 305 274 33 5 279 -99 90 -5 171
$$ packed form
7429B09l23J98j2j86K19j91m1J82l4m6J99j02k69J15P8N3k36K5M13k10j27J47
7451F1k6j40K84k83K53j15k68J34O1%L0Q9N9J71p5m10K9J59J12j16M9QLLq6j71
7477a85P2L75m12J35j95J51j90J90M0m7j11K27j10J95l2j86j35K15L9j97JM3L70
7500B53l18K6j43k5J11J86r1N8l1K00k10Qp9n1J25MJ11l14K48L1p5k0j08n7K55
7525I4p0O1j08KK7K4o6l0r6m3L02j62J33j3J18j98R7k03L18j50J20j64J21j55
7549d1j35q3L37j21J49o1J44n3k24N4j29O2R1J19L6mj98k95K64K34n33O80k66
7572B7K6N5r0O7k79K15m3J39j35M1p1K46l10j7j12L47j57k19L04l39L88k1j05
7595d3J99j59J02k6O3Rj82k82Q6L03k85J74Q5J13J48l1k41k8K74l78J89r5J76
$$ plain form
7618 171 -57 63 -37 -148 -157 -119 38 15 183 206 40 278 -208 140 -236 169 -106 -170 109 25 -116 276
7640 276 190 -157 -1 43 111 -143 294 112 -4 -113 -215 197 2 -47 -130 -2 -189 -3 110 173 74 58 148
7663 148 9 -233 87 47 -315 -109 -167 84 -464 -49 269 221 50 84 147 -64 -228 127 -82 128 -108 -85
7685 -85 225 50 149 18 109 -55 105 -105 137 -67 129 133 -17 182 -177 -59 77 25 13 -69 19 43 -55 -78
7709 -78 118 96 -152 151 75 193 95 209 33 170 -276 -248 33 52 -69 109 -244 -159 24 -53 -149 -14 13
7732 13 -341 -168 -171 -117 13 84 -137 -109 -107 -216 -55 -12 -125 -27 -90 -109 -39 68 140 -20 4 -97 5 -190 -97
7757 -97 -64 37 -48 85 -64 -5 -222 333 44 -109 -120 67 -156 70 192 194 95 -115 -124 90 -32 -202 -46
7780 -46 204 12 -158 74 81 -85 -96 328 124 101 149 4 -17 13 45 -102 62 -156 -94 241 162 76 -42 -172
$$ packed form
7618A71k28J20j00j11rL8J57k3J68K3j66K38m86L48l76M05k75o4K79q4j41L92
7640B76q6l47J56M4O8k54M37j82j16j09j02M12j95m9q3J28j87J86J13O3r9j6R0
7663A48j39k42L20m0l62K06n8K51n48M15L18m8j71L4O3k11j64L55k09K10k36K3
7685h5L10j75R9j31R1j64J60k10K42k04J96Mj50J99l59J18J36n2j2q2Q8K4r8k3
7709g8J96k2k48L03p6J18r8J14j76J37m46K8K81J9j21J78l53Q5J83p7r6J35K7
7732A3l54J73lN4J30P1k21K8Kj09J61M3j13R8o3j9P0J07P2j60K4j01J02j95R3
7757i7L3J01q5J33j49N9k17N55k89j53j1J87k23K26J22Kr9k10rK14j22j70J56
7780d6K50j92j70K32Pj66j1M24k04k3M8j45k1L0L2j47J64k18O2L35p9q6j18j30
$$ plain form
7804 -172 -173 78 42 -53 118 -67 -209 76 -374 239 -314 139 83 -123 -178 -45 -18 -98 -17 -232 -215 -37 -46 -155
7828 -155 -55 133 27 -55 67 19 -186 163 -119 -112 49 94 220 51 135 39 -147 48 174 24 -14 -23 -143
7851 -143 -10 46 -77 111 -74 18 -90 -10 285 -89 -193 -302 -55 32 -162 282 148 59 124 71 -106 -10 145
7874 145 57 103 -32 -201 -86 63 50 -141 58 -2 -27 59 1 -232 -79 -205 170 -293 -249 156 110 -74 0
7897 0 -215 119 114 -22 -237 -59 368 72 199 25 -54 -79 -98 190 89 -204 -27 -262 101 -91 -40 93 -71
7920 -71 83 399 145 144 42 -49 -191 -148 -125 -78 2 8 -116 -147 -63 -119 -88 -51 -26 88 100 -16 -19 169 38 -189
7946 -189 13 -166 -30 63 -194 -213 68 91 -42 -32 272 -112 51 -150 -345 15 -17 231 92 40 33 -37 330
7969 330 172 168 -114 107 223 -38 -40 -14 178 34 -51 -104 -92 -104 91 14 -49 27 238 158 -18 -375 -45 -26 -104
$$ packed form
7804a72jK51l6r5J71j85j42K85m50O13n53M53n6k06n5J33K7q0Q1k15J7J78rj09
7828a55J00J88j06q2J22m8k05L49k82PJ61M5J26j69Q4r6j86J95J26j50l8rj20
7851a43J33N6j23J88j85R2j08Q0K95l74j04j09K47Q7j94M44j34q9O5n3j77R6J55
7874A45q8M6j35j69J15J49j3j91J99o0k5Q6n8k33J53j26L75m63M4M05m6j84P4
7897@k15L34nj36k15J78M27k96J27j74p9k5j9K88j01k93J77k35L63j92N1J33j64
7920g1J54L16k54jj02r1j42M3K3M7Q0Oj24l1Q4n6L1L7K5J14J2j16lJ88j31k27
7946a89K02j79J36R3k57j9K81K3j33J0L04l84J63k01j95L60l2K48j39n2pp0L67
7969C30j58mk82K21J16k61kK6J92j44q5n3J2j2J95p7o3P6K11q0j76l57L30J9p8
$$ plain form
7994 -104 263 -122 95 -99 -76 21 346 -27 -68 137 98 80 -63 -89 -38 -103 -276 248 126 282 -10 -160 -74
8017 -74 -1 51 -182 -157 236 -207 150 -118 52 87 -169 -46 -6 74 -65 37 -10 -119 63 32 157 -32 74
8040 74 15 -13 -174 -203 13 86 70 79 123 65 118 118 -43 173 248 -122 -99 -44 332 82 51 -230 -64 182 10 79
8066 79 -81 -347 97 106 -64 88 -20 -43 -124 137 -13 235 -13 -308 -85 -8 207 111 -66 156 92 -275 -205
8089 -205 -379 -281 173 -43 13 13 24 99 140 61 -15 -70 -3 51 350 -64 186 -183 -118 6 -76 102 35 225 194
8114 194 -65 60 241 -182 -7 -234 -128 85 -87 59 -203 19 -34 -80 -295 55 101 40 -17 -107 -26 -71 341
8137 341 122 91 142 71 79 -66 -2 -55 206 150 241 13 -118 68 128 278 -109 204 122 -158 143 -80 -213 39
8161 39 -142 114 -269 -233 72 31 65 -201 -174 84 208 -122 150 -150 -84 -111 -152 -52 -228 28 -7 53 182
$$ packed form
7994a04L67l85K17j94K3R7L25l73m1K05l9j8j43k6N1o5j73N24j22J56k92j50Q6
8017g4P3N2k33K5L93m43L57k68J70L5k56J23M0Q0j39J02m7j09J82l1J25j89J06
8040G4n9k8j61k9K16P3j6RM4n8N3%j61K16P5l70K3N5L76k50l1k81J66K46j72O9
8066G9j60k66M44Rj70J52j08k3q1K61j50K48k48k95K23P7K15r6j77K22o4l67P0
8089b05j74R8M54k16N6%J1P5M1p9p6n5O7N4K99m14K50l69O5J24q2J78o7J90l1
8114A94k59J25J81m23J75k27J06K13j72J46k62K22n3m6k15L50M6o1n7r0Q1m5M12
8137C41k19l1N1p1Qj45O4n3K61n6R1k28j31J86O0J50l87L13q2k80L01k23j33K52
8161C9j81K56l83L6L05m1L4k66K7K58J24l30K72l00O6k7m1J00j76K56l5O0J29
$$ plain form
8184 182 219 -24 78 38 239 -5 119
$$ packed form
8184A82L7k43J02m0K01k44J24
8191A19
$$ Imaginary data points
##PAGE= N=2
##DATA TABLE= (X++(I..I)), XYDATA
$$ plain form
0 0 0 0 0 0 0 0 0 0 0 0 8 -8 8 -8 8 -16 16 -24 24 -32 40 -48 56 -64 72 -88 104 -120 136 -156 176 -204 232
33 232 -262 295 -333 374 -420 468 -524 582 -647 718 -794 880 -971 1072 -1182 1303 -1437
50 -1437 1581 -1741 1922 -2118 2340 -2591 2876 -3200 3580 -4024 4556 -5210 6029 -7092 8540
65 8540 -10626 13917 -19897 34278 -146201 -6476 318101 35423 -216544 -138122 111366
76 111366 92304 -1348 -29320 -33324 -67166 38890 148015 38477 -149016 -90483 129715
87 129715 149975 -67801 -128842 9951 93553 25864 -27716 -28098 -22367 -808 56465 50520
99 50520 -56517 -70991 54959 89539 -15077 -66797 13119 53204 -7818 -22193 32337 968
111 968 -68020 -6060 75913 6349 -103794 -49018 83755 43922 -86071 -57270 54589 31551
$$ packed form
0@%%%%%%%%%%Qj6J6j6J6k4L2m0M8n6P2q8J04j20J36j60J92k24K56k92L32l80M36
33B32m94N57o28P07p94Q88r92J106j229J365j512J674j851K043k254K485k740
50a437L018l322L663m040M458m931N467o076O780p604Q580r766J1239j3121J5632
65H540j9166K4543l3814N4175j80479J39725L24577k82678k51967P8422K49488
76A11366j9062r3652k7972m004l3842J06056J09125j09538j87493N8533K20198
87A29715K0260k17776o1041J38793Q3602o7689n3580l82N731K1559N7273n945
99E0520j07037j4474J25950L4580j04616n1720P9916M0085o1022j4375N4530l1369
111I68o8988O1960Q1973o9564j10143N4776J32773l9833j29993K8801J11859k3038
$$ plain form
123 31551 -49132 -12676 54336 -3401 -74229 14494 100503 -3308 -106837 -18141 98546
134 98546 39513 -78714 -52359 43290 35052 -18659 -8539 2178 -19223 -1841 47873 32288
146 32288 -44274 -38541 53330 64813 -19650 -44306 15266 40538 1679 -16961 7928 163
158 163 -25890 2930 30689 -10698 -44642 -4608 33564 -280 -33488 2217 26503 -15359
170 -15359 -25012 26258 32534 -27181 -43172 20388 46856 -16042 -49290 -1159 25220 -6123
182 -6123 -20240 1660 -784 -25743 -3417 39667 8751 -47518 -17711 51676 40641 -28220
194 -28220 -35282 23970 39987 2297 -12859 -3160 -2295 4769 20321 8089 -29930 -28895 26206
207 26206 39564 -18084 -44982 2823 42319 14668 -26378 -13692 17347 14045 2981 2235 -8408
$$ packed form
123C1551q0683L6456O7012n7737p0828Q8723Q6009j03811j03529Q8696J16687
134I8546n9033j18227K6355R5649q238n3711J0120J0717k1401J7382M9714j5585
146C2288p6562N733R1871J1483q4463k4656N9572K5272l8859j8640K4889p765
158A63k6053K8820K7759m1387l3944M0034L8172l3844l3208L5705K4286m1862
170a5359r653N1270O276n9715j5991O3560K6468o2898l3248M8131K6379l1343
182f123j4117K1900k444k4959K2326M3084l0916n6269K9807O9387j1035o8861
194b8220p062N9252J6017l7690j5156R699Q65P064J5552j2232l8019J035N5101
207B6206J3358n7648k6898M7805L9496k7651m1046J2686L1039l302j1064p46j0643
$$ plain form
220 -8408 -14416 5778 22189 -2832 -36387 -16124 24678 10254 -28058 -21946 7748 9539 -8618
233 -8618 -7899 6601 -829 -8129 10856 16596 -5308 -13417 6793 19995 220 -17655 582
246 582 13358 -4344 -10611 2741 5506 -7533 -8987 9767 11924 -9993 -6618 15410 11739 -3593
260 -3593 -1407 10683 9217 -4024 -300 11268 -589 -12241 625 8005 -3604 -15837 -7071
273 -7071 9350 -396 -15932 -4394 6879 762 -4528 -708 4068 485 -2306 7070 4834 -10107
287 -10107 -3337 10456 3271 -12224 -10775 5320 7557 -10553 -12085 2790 3977 -1823 -1795 297
301 297 2928 2063 5346 9450 -247 -4188 9702 12463 88 -7607 -443 10534 2350 -10744 -3338
316 -3338 3130 -2397 -2835 -1034 -1406 -2734 -1260 5666 3955 -6374 -923 9279 4788 -2706 -3644
$$ packed form
220h408o008K0194J6411k5021l3555K0263M0802j4424l8312O112K9694J791j8157
233h618P19J4500p430p300J8985N740k1904q109K0210J3202j9775j7875J8237
246E82J2776j7702o267J3352K765j3039j454J8754K157k1917L375K2028l671j5332
260c593K186J2090j466j3241L724J1568j1857j1652J2866P380j1609j2233Q766
273g071J6421r746j5536J1538J1273o117n290L820M776l583k791R376k236j4941
287a0107O770J3793p185j5495J449J6095K237j8110j532J4875J187n800K8K092
301B97K631q65L283M104r697l941J3890K761j2375p695P164J0977q184j3094P406
316c338O468n527m38J801l72j328J474O926j711j0329N451J0202m491p494r38
$$ plain form
331 -3644 2319 5188 -3685 -5830 -125 -2641 -4985 -2462 -3055 -4312 -5546 -2186 3852 -1802 -5734
346 -5734 3898 6456 1077 -467 2412 6393 3237 -1689 2621 3071 -2017 -348 1018 -1342 -2396
361 -2396 -3213 291 1237 -3610 -1648 3226 1623 1043 1436 3047 4281 1056 1874 5662 976 -2305
377 -2305 941 1732 -820 -4196 -4781 -481 -1712 -4968 -3233 -3347 -2349 769 -248 -1284 -1065 327
393 327 4948 3878 -1598 -1289 2287 4026 2725 -2966 -4272 -613 1148 1209 -3049 -7871 -3209 3841
409 3841 3351 -2160 -5805 441 7930 5289 431 -143 1382 4945 6437 2774 -1669 -4171 292 6364
425 6364 1433 -7238 -7776 -467 5406 75 -8371 -5237 2722 4300 1210 -2398 -994 2261 2933 3967
441 3967 2509 -2775 -2153 1864 3189 -167 -6837 -6205 1431 2555 -3674 -7922 -3679 3798 3004 -3590
$$ packed form
331c644N963K869q873k145N705k516k344K523n93j257j234L360O038n654l932
346e734R632K558n379j544K879L981l156m926M310M50n088J669J366k360j054
361b396q17L504R46m847J962M874j603n80L93J611J234l225Q18L788m686l281
377b305L246P91k552l376n85M300j231l256J735j14R98L118j017j036K19J392
393C27M621j070n476L09L576J739j301n691j306L659J761O1m258m822M662P050
409C841m90n511l645O246P489k641m858n74J525L563J492l663m443k502M463O072
425F364m931q671n38P309N873n331q446L134P959J578l090l608J404L255O72J034
441C967j458n284O22M017J325l356o670O32P636J124o229m248M243P477p94o594
$$ plain form
457 -3590 -2505 2458 4324 3112 1095 1806 2957 871 2631 4543 24 -4322 -2417 3970 3832 -6586
473 -6586 -9205 1813 6836 -412 -7130 -3442 5822 5072 -1516 148 3101 654 1157 3714 4515 -903
489 -903 -7715 -956 7988 1200 -9607 -8438 1345 6156 -3678 -8882 -1613 2483 1012 150 287 2088
505 2088 751 -877 4609 6407 -803 -4620 -482 5884 4042 -6709 -6591 2579 2336 -3121 -4725
520 -4725 -678 2751 -1598 -3606 4988 5787 -2320 -3213 4174 10220 2028 -8246 -52 9812 2380
535 2380 -7014 -4474 3606 2895 -6810 -5576 2948 -404 -5756 -1904 3767 2377 -4833 -3268 8368
550 8368 6378 -5165 -4319 5801 8869 -1044 -9613 -957 7605 776 -7061 -5472 -152 2657 -1676
565 -1676 -3980 -302 -291 -542 2889 3135 745 -2113 48 8717 6900 -5137 -5846 4014 8731 788
$$ packed form
457c590J085M963J866j212k017P11J151k086J760J912m519m346J905O387j38j0418
473f586k619J1018N023p248o718L688R264p50o588J664K953k447N03K557Q01n418
489i03o812O759Q944o788j0807J169R783M811r834n204P269M096j471q62J37J801
505B088j337j628N486J798p210l817M138O366j842j0751J18R170k43n457j604
520d725M047L429m349k008Q594P99q107q93P387O046q192j0274Q194R864p432
535B380r394K540Q080p11r705J234Q524l352n352L852N671j390p210J565J1636
550H368j990j1543Q46J0120L068r913q569Q656Q562o829p837J589N320K809m333
565a676k304L678J1k51L431K46k390k858K161Q669j817j2037p09R860M717p943
$$ plain form
581 788 -10493 -4839 6941 2918 -6423 -6165 1095 3934 -2212 -3703 3432 2985 -2852 425 5950
596 5950 4005 -2869 -3547 5999 5708 -5087 -5690 2318 3362 -3375 -7784 -1607 4642 -1684 -6375 -1580
612 -1580 3179 2400 -1891 -2115 3674 3742 520 1286 1911 1132 646 -88 1387 694 -3374 -2932 404 917
630 917 -1193 -4661 -2496 3389 1717 -2326 -799 2396 3812 493 -504 3786 2958 -1421 -406 2934
646 2934 1811 -2171 -4921 234 2842 -2763 -5740 -2041 1660 469 -2868 -2197 2340 1646 534 1749
662 1749 1325 728 1249 2057 2015 -515 -2118 719 1319 -1382 -3119 -2901 -134 799 -1819 -2993 -1085
679 -1085 1206 2859 599 -1307 1057 3384 3585 1456 -824 692 2411 1216 -123 -1775 -2534 -293
695 -293 344 -1215 -3207 -3324 456 1616 -1411 -2193 326 2451 2804 443 -484 2017 2604 1106 78
$$ packed form
581G88j1281N654J1780m023r341K58P260K839o146j491P135m47n837L277N525
596E950j945o874o78R546k91j0795o03Q008J044o737m409O177O249o326m691M795
612a580M759p79m291k24N789O8l222P66O25p79m86p34J475o93m068M42L336N13
630I17k110l468K165N885j672m043J527L195J416l319r97M290q28m379J015L340
646B934j123l982k750N155K608n605k977L699L701j191l337O71M537o94j112J215
662A749m24n97N21Q08m2k530j603K837O00k701j737K18K767R33k618j174J908
679a085K291J653k260j906K364K327K01k129k280J516J719j195j339j652p59K241
695b93O37j559j992j17L780J160l027p82K519K125L53k361r27K501N87j498j028
$$ plain form
712 78 -829 33 301 -904 -1642 -2325 -2242 -377 -1156 -2622 -1096 -252 574 808 -213 1161 2420 1607 2169
731 2169 1174 541 1534 870 -298 -234 -1411 -719 29 -1932 -1634 -1223 -1579 204 -621 -656 873 480 1068
750 1068 1714 822 1150 1715 1006 1261 260 -241 243 -638 -1738 -830 -1599 -2025 -1197 -2134 -710 -489 -1455
769 -1455 389 927 809 1713 816 472 2275 1003 990 1052 -582 406 552 -1426 -1138 -1752 -1394 313 -1794
788 -1794 -2190 3 -403 347 1011 -281 1185 2229 1038 1877 724 392 2008 589 -615 -228 -1241
805 -1241 -300 14 -2398 -1625 -659 -1524 -152 -653 -536 991 347 1009 1506 156 1153 2270 458 724
823 724 453 -272 522 -600 -2145 -818 -1475 -1035 -701 -2162 -1024 -166 -501 775 244 -349 1618 2024
841 2024 926 1215 481 1252 1845 -577 -462 155 -1082 -427 -1005 -1573 -1055 -1766 -1000 639 -977 -838
$$ packed form
712G8r07Q62K68j205p38o83Q3J865p79j466J526Q44Q26K34j021J374J259q13N62
731B169r95o33R93o64j168O4j177O92P48j961K98M11l56J783q25l5J529l93N88
750A068O46q92L28N65p09K55j001n01M84q81j100R08p69m26Q28r37J424K21r66
769a455J844N38j18R04q97l44J803j272j3O2j634R88J46j978K88o14L58J707k107
788a794l96K193m06P50O64j292J466J044j191Q39j153l32J616j419j204L87j013
805a241R41L14k412P73R66q65J372n01J17J527o44O62M97j350R97J117j812K66
823G24k71p25P94j122j545J327o57M40L34j461J138Q58l35J276n31n93J967M06
841B024j098K89p34P71N93k422J15O17j237O55n78n68N18p11P66J639j616J39
$$ plain form
859 -838 781 645 1336 1312 200 1655 906 417 1512 212 -1171 -388 -43 -46 -1291 -2800 -789 -285
877 -285 -1449 -451 -592 -965 439 1088 1945 1019 -916 1222 3444 1202 -595 -342 704 1094 -908
894 -908 -1413 -559 -1303 -1385 -7 -390 -1566 -1916 -127 2778 783 -1750 428 2663 2183 1056 -336
911 -336 709 1246 300 217 -682 -1569 -536 -386 -864 -1544 -1841 -1270 232 -57 364 -624 -729 1793 3112
930 3112 960 -876 -193 3339 2956 -1693 -1999 785 666 -1025 -1729 -501 -761 -2733 -531 2118 -176
947 -176 -3567 -1081 3818 3535 -1698 -2759 2976 4495 233 -1337 78 1590 126 -1114 737 -192
963 -192 -3331 -2150 1418 683 -2409 -3460 97 3600 886 -1783 -729 1641 3294 1526 -867 -104
979 -104 1398 800 14 -1420 -986 -456 -2195 -535 1315 -1343 -3720 -1141 2525 2830 -3064 -3431 3275
$$ packed form
859h38J619j36O91k4j112J455p49m89J095j300j383P83L45lj245j509K011N04
877b85j164R98j41l73J404O49Q57r26j935K138K222k242j797K53J046L90k002
894i08n05Q54p44q2J378l83j176l50J789K905j995k533K178K235m80j127j392
911c36J045N37r46q3q99q87J033J50m78o80k97N71J502k89M21r88j05K522J319
930C112k152j836O83L532l83m649l06K784j19j691p04J228k60j972K202K649k294
947a76l391K486M899k83n233j061N735J519m262j570J415J512j464j240J851r29
963a92l139J181L568p35l092j051L557L503k714k669J054K370J653j768k393P63
979a04J502n98p86j434M34N30j739J660J850k658k377K579L666L05n894l67O706
$$ plain form
996 3275 4617 18 -2275 921 4404 645 -2486 1089 1764 -2608 -2293 1324 1689 -2995 -5507 1000
1012 1000 4446 -1925 -4724 -26 4047 2138 -2295 -691 3539 1927 -604 1252 913 -565 -1140
1027 -1140 -257 1506 -993 -3722 -890 1460 48 -1638 -2792 -692 2727 1323 -775 -1173 728
1042 728 3601 1510 -1671 68 1674 138 -362 -453 460 -1304 -3461 394 2609 -2408 -4347 -55
1058 -55 3596 1016 -3697 -1123 4285 1925 -1631 515 2715 1016 -1491 -74 3285 -500 -4101
1073 -4101 -284 2539 -398 -3391 -2121 1620 1172 -2325 -898 1489 340 287 1049 1376 669 -188 1143
1090 1143 2348 -657 -758 605 54 -569 -924 -1376 -1185 -1012 -145 447 -1999 -1301 1508 1620 -487 -488
1108 -488 1151 2701 386 -692 1766 1314 -1153 -225 1380 614 -2291 -2319 1460 746 -3145 -1884 1584
$$ packed form
996C275J342m599k293L196L483l759l131L575O75m372L15L617L65m684k512O507
1012A000L446o371k799M698M073j909m433J604M230j612k531J856l39j478n75
1027a140Q83J763k499k729K832K350j412j686j154K100L419j404k098l98J901
1042G28K873k091l181J739J606j536n00r1R13j764k157L855K215n017j939M292
1058e5L651k580m713K574N408k360l556K146K200j699k507J417L359l785l601
1073d101L817K823k937k993J270L741m48l497J427K387j149n3P62L27p07q57J331
1090A143J205l005j01J363n51o23l55m52J91J73Q67N92k446O98K809J12k107j
1108d88J639J550k315j078K458m52k467R28J605p66k905k8L779p14l891J261L468
$$ plain form
1125 1584 805 -1130 -825 1561 1366 -855 359 2778 642 -1075 345 1668 524 -1809 -757 1469
1141 1469 -589 -2385 -616 156 -641 -1655 -143 1039 -647 -998 1525 1902 -293 -32 1488 1453 -209
1158 -209 -515 1115 612 -1435 -644 1014 -673 -1725 -834 331 -415 -2031 -209 1643 206 -448 918
1175 918 1784 533 -310 1335 1816 -476 -981 962 615 -1247 -1606 80 511 -1693 -2020 784 -8
1192 -8 -1592 -649 1151 1078 -416 -118 2182 1231 -709 527 2050 287 -1105 -627 1084 -241 -2284
1209 -2284 -897 806 -1127 -1229 0 405 -250 -1102 624 1844 -322 -11 1747 1370 146 -346 833
1226 833 1368 -790 -1005 581 -347 -1511 -777 13 -488 -1525 -740 957 96 -945 405 1731 854
1243 854 -187 659 1376 411 -952 738 1142 -1028 -1161 49 -119 -998 -1930 -126 363 -1299 -1184 905
$$ packed form
1125A584p79j935L05K386j95k221J214K419k136j717J420J323j144k333J052K226
1141A469k058j796J769P72p97j014J512J182j686l51K523L77k195K61J520l5j662
1158b09l06J630n03k047P91J658j687j052Q91J165p46j616J822J852j437o54J366
1175I18Q66j251q43J645M81k292n05J943l47j862l59J686M31k204l27K804p92
1192hj584R43J800p3j494K98K300r51j940J236J523j763j392M78J711j325k043
1209b284J387J703j933j02J229M05o55q52J726J220k166L11J758l77j224m92J179
1226H33N35k158k15J586r28j164P34P90n01j037P85J697q61j041J350J326q77
1243H54j041Q46P17r65j363J690M04k170j33J210j68q79r32J804M89j662J15K089
$$ plain form
1261 905 471 -68 429 1121 1496 -435 30 2042 1014 -888 389 475 -19 -980 -1077 126 -612 -1601 -171
1280 -171 365 -681 -346 121 743 613 -699 963 1670 -231 63 822 530 98 -635 -46 295 -1445
1298 -1445 -1060 72 -730 -1099 -735 0 377 -575 -69 1203 320 -119 1063 898 426 387 323 941 -50
1317 -50 -964 234 -63 -1234 -1067 -594 -141 -563 -1216 -72 551 -623 -67 637 638 698 409 640 1265 -6
1337 -6 -111 645 -77 -594 -798 -436 -247 -998 -1076 50 -635 -670 13 -16 397 552 140 756 887 -19 766
1358 766 727 -50 171 148 -176 28 -867 -428 -299 -1082 -658 -94 -234 -139 -238 146 757 40 273 938 542
1379 542 636 619 339 433 -1 -362 19 -242 -691 -472 -872 -270 -137 -952 -157 -22 162 209 189 477 933 569
1401 569 266 978 281 329 99 -254 55 -43 -874 -527 -363 -942 -768 -469 -321 316 -153 -9 524 477 891
$$ packed form
1261I05m34n39M97O92L75j931M65K012j028j902J277Q6m94r61r7J203p38r89J430
1280a71N36j046L35M67O22j30j312J662P07j901K94P59k92m32p33N89L41j740
1298a445L85J132q02l69L64P35L77r52N06J272q83m39J182j65m72l9o4O18r91
1317e0r14J198k97j171J67M73M53m22o53J144O23j174N56P04JO0k89K31O25j271
1337fj05P56p22n17k04L62J89p51p8J126o85l5O83k9M13J55m12O16J31r06P85
1358G66l9p77K21k3l24K04q95M39J29p83M24N64j40R5r9L84O11p17K33O65l96
1379E42R4j7k80R4m34l61L81k61m49K19m00O02J33q15P95J35J84M7k0K88M56l64
1401E69l03P12o97M8k30l53L09r8q31L47J64n79J74K99J48O37m69J44N33m7M14
$$ plain form
1422 891 390 236 1181 549 54 155 582 65 -555 -683 -26 -221 -1173 -817 -248 -222 -385 -637 490 1346
1442 1346 163 8 587 980 547 -239 96 1114 149 -875 -140 198 -440 -1142 -1027 375 45 -1358
1460 -1358 -493 262 405 -76 -360 852 1283 -84 7 951 678 263 -347 272 426 -315 -964 -456 34
1479 34 -235 -736 -898 206 254 -573 -163 411 760 346 -314 701 1341 -58 -527 499 559 148 -1016
1498 -1016 -875 550 -359 -1396 -478 173 51 -771 -645 875 841 -714 87 1321 1065 123 -302 689
1516 689 857 -577 -950 321 250 -633 -1121 -449 288 -596 -1401 -75 459 189 19 57 973 929 13 265
1536 265 1009 511 47 -261 -270 762 -356 -977 -183 0 -298 -797 -798 630 535 -651 260 710 424 254
1556 254 78 698 1164 -234 -336 714 395 -655 -778 -374 485 -1051 -1400 214 105 -720 -602 -90
$$ packed form
1422H91n01j54R45o32m95J01M27n17o20j28O57j95r52L56N69K6j63k52J127Q56
1442A346j183j55N79L93m33p86L35J018r65j024P35L38o38p02J15J402l30j403
1460a358Q65P55J43m81k84J212M31j367R1R44k73m15o10O19J54p41o49N08M90
1479C4k69n01j62J104M8q27M10N74L49m14o60J015O40j399m69J026O0m11j164
1498a016J41J425r09j037R18O51j22q22J26J520l4j555Q01J234k56r42m25R91
1516F89J68j434l73J271p1q83m88O72P37q84q05J326N34k70j70L8R16m4r16K52
1536B65P44m98m64l08rJ032j118o21P94J83k98m99jJ428r5j186R11M50k86j70
1556B54j76O20M66j398j02J050l19j050j23M04Q59j536l49J614j09q25J18N12
$$ plain form
1574 -90 620 228 -546 708 1176 382 245 436 355 27 -188 36 377 -652 -540 -322 -479 -495 -215 -403
1594 -403 -127 -43 -189 390 40 374 630 131 336 373 297 370 -241 -131 419 -283 -1008 -217 -70 -587 -799
1615 -799 -313 355 -193 -729 528 713 205 306 554 983 400 -71 253 595 -214 -609 -151 -166 -505 -849
1635 -849 -616 -118 -612 -734 359 143 -187 -143 513 778 227 -104 592 443 -157 144 55 169 -454 -180
1655 -180 -199 -168 -765 -375 -48 -372 -482 -136 287 108 109 658 608 117 176 465 102 125 -167 262 233 -927
1677 -927 -305 -66 -387 -444 -429 -100 210 -583 50 526 306 -134 487 725 442 -58 116 640 -66 -582 99
1698 99 -68 -621 -452 -441 -301 -308 -726 -159 93 -319 -244 106 422 230 277 687 503 151 122 364 -31 -157
1720 -157 -160 -337 -58 -597 -394 153 -346 -549 -121 160 21 -199 404 885 119 63 707 621 95 396 -65
$$ packed form
1574i0P10l92p74J254M68p94j37J91q1l28k15K24L41j029J12K18j57j6K80j88
1594d03K76Q4j46N79l50L34K56m99K05L7p6P3o11J10N50p02p25P91J47n17k12
1615g99M86O68n48n36J257J85n08J01K48M29n83m71L24L42q09l95M58j5l39l44
1635h49K33M98m94j22J093k16l30M4O56K65n51l31O96j49o00L01q9J14o23K74
1655a80j9L1n97L90L27l24j10L46M23j79JN49n0m91N9K89l63K3k92M29k9j160
1677i27O22K39l21n7J5L29L10p93O33M76k20m40O21K38k83n00J74N24p06n16O81
1698I9j67n53J69J1J40pm18N67K52m12P5L50L16j92M7M10j84l52k9K42l95j26
1720a57lj77K79n39K03N47m99k03M28K81j39k20O03M81p66n6O44q6n26L01m61
$$ plain form
1741 -65 281 -212 -461 36 -199 -822 -375 -109 -223 -489 -123 292 142 -64 540 824 457 109 461 372 343
1762 343 -299 -43 367 -291 -795 -115 -318 -292 -478 -441 424 -192 -474 308 248 28 147 259 542 356 -125
1783 -125 331 583 -311 -203 27 -300 -159 -704 -366 -78 -672 71 25 -326 -240 356 232 362 -122 624 777
1804 777 88 30 165 45 0 -86 -9 -41 -748 -438 154 -327 -722 -325 273 89 -125 -117 610 567 -169 451 837
1827 837 197 -38 10 287 -35 -421 -323 -75 -342 -304 -170 -269 -30 -468 -226 548 48 -57 397 353 122 289
1849 289 -51 348 -32 -119 391 142 -433 -98 -147 -400 -421 -298 -224 126 -473 131 292 271 218 531 818 254
1871 254 143 260 634 -136 -320 204 -197 -156 -366 -406 -67 -479 -380 160 205 58 -199 180 428 285 -56
1892 -56 340 162 421 216 44 72 -244 188 -248 -416 -443 -430 -350 -626 -103 -138 -174 -98 209 670 369 -44 138
$$ packed form
1741f5L46m93k49M97k35o23M47K66j14k66L66M15j50k06O04K84l67l48L52q9k9
1762C43o42K56M10o58n04O80k03K6j86L7Q65o16k82P82o0k20J19J12K83j86m81
1783a25M56K52q94J08K30l27J41n45L38K88n94P43m6l51Q6N96j24J30m84P46J53
1804G77o89n8J35j20m5q6P7l2p07L10N92m81l95L97N98j84k14QP27m3p36O20L86
1827H37o40k35M8K77l22l86R8K48k67L8J34r9K39m38K42P74n00j05M54m4k31J67
1849B89l40L99l80q7N10k49n75L35m9k53k1J23P4L50n99O04J61k1n3L13K87n64
1871B54j11J17L74p70j84N24m01M1k10m0L39m12R9N40M5j47k57L79K48j43l41
1892e6L96j78K59k05j72K8l16M32m36j68k7J3Q0k76N23l5l6P6L07M61l01m13J82
$$ plain form
1915 138 270 219 19 106 506 117 -385 -335 3 -303 -347 -476 -120 11 -230 -247 346 99 149 195 356 405 466
1938 466 71 334 505 -112 -19 -177 29 -277 -507 -360 -84 -335 -596 -329 -170 504 56 -121 624 406
1958 406 -60 260 81 604 529 -533 66 489 -60 -358 -238 -18 20 -580 -334 331 -141 -309 15 131
1978 131 673 1 -14 180 658 253 56 -239 119 -58 -310 -176 225 -414 -19 -447 -213 -4 -514 40
1998 40 267 272 -89 14 204 467 124 -361 488 466 -126 -23 75 98 -87 -567 -133 -31 -337 -526 -77 129
2020 129 -93 -69 -68 593 49 13 362 385 350 -27 4 455 -71 -257 2 -62 -176 -20 -319 -369 243 -236 -177
2043 -177 -81 -85 437 137 46 570 374 236 318 286 241 200 -469 -62 -208 -283 -527 -310 -65 -142 -695 -344 387
2066 387 -185 14 166 322 439 186 148 535 128 -545 -50 282 218 -449 -419 -118 -41 -686 -347 -6 -303
$$ packed form
1915A38J32n1k00Q7M00l89n02N0L38l06m4j29L56J31k41j7N93k47N0M6J61M9O1
1938D66l95K63J71o17R3j58K06l06k30J47K76k51k61K67J59O74m48j77P45k18
1958D06m66L20j79N23p5j062N99M23n49k98J20K20L8o00K46O65m72j68L24J16
1978A31N42o72j5J94M78m05j97k95L58j77k52J34M01o39L95m28K34K09n10N54
1998D0K27Nl61J03J90K63l43m85Q49k2n92J03R8K3j85m80M34J02l06j89M49K06
2020A29k22K4JO61n44l6L49K3l5l77L1M51n26j86K59o4j14J56k99n0O12m79N9
2043a77R6mN22l00r1N24j96j38Q2l2m5m1o69M07j46p5k44K17K45p7n53L51P31
2066C87n72J99J52J56J17k53l8L87m07o73M95L32o4o67L0L01P7o45L39L41k97
$$ plain form
2087 -303 -52 54 467 104 -28 262 461 221 453 376 -12 54 -125 -274 -112 -183 -86 -131 -511 -444 102 -201
2109 -201 -165 -139 158 488 63 53 360 351 -174 176 140 400 -83 -8 10 62 -282 -288 -100 -284 -303 -336 115 461
2133 461 -73 -239 340 494 94 -10 87 223 5 222 24 -158 61 57 -143 -515 -331 -67 -84 -204 -145 -112
2155 -112 67 -63 35 60 304 211 137 553 229 -288 202 166 -266 69 -73 -39 -144 -467 -170 -23 -137 138
2177 138 15 19 113 200 328 590 62 -47 237 159 -172 -61 -200 189 -543 -58 129 25 34 -286 -96 -50 -203
2200 -203 -126 229 139 -134 127 150 119 -83 158 211 128 -227 -129 85 -667 -235 -395 -397 -173 -369 287 178 -397
2223 -397 17 304 224 126 243 371 295 -176 -40 387 53 -245 -101 -77 -81 -614 -162 121 -11 -426 -29 13
2245 13 -126 20 68 586 267 38 274 280 87 62 -110 172 -157 -321 -24 10 -416 -372 -220 -67 -140 -237 10
$$ packed form
2087c03K51J06M13l63j32K90J99k40K32p7l88O6j79j49J62p1R7m5l80O7N46l03
2109b01L6K6K97L30m25j0L07rn25L50l6K60m83P5J8N2l44oJ88j84j9l3M51L46
2133D61n34j66N79J54m00j04R7J36k18K17j98j82K19mk00l72J84K64j7j20N9L3
2155a12J79j30R8K5K44r3p4M16l24n17M90l6m32L35j42L4j05l23K97J47j14K75
2177A38j23MR4Q7J28K62n28j09K84p8l31J11j39L89p32M85J87j04Rl20J90M6j53
2200b03P7L55r0k73K61K3l1k02K41N3q3l55R8K14p52M32j60kK24j96O56j09n75
2223c97M14K87q0r8J17J28p6m71J36M27l34k98J44K4mn33M52K83j32m15L97M2
2245A3j39J46M8N18l19k29K36Oj93k5j72K82l29j64K97L4m26M4J52J53p3r7K47
$$ plain form
2268 10 310 -213 114 322 76 208 279 430 188 45 -44 292 145 -70 246 -225 -400 -35 -22 229 -179
2289 -179 -181 -2 530 -146 168 333 535 133 -29 219 202 -31 193 144 -218 -251 -46 -63 -71 -130 -220 117 -28
2312 -28 -24 -8 432 241 367 114 614 412 42 529 350 -95 213 0 78 -61 -576 -126 32 -140 -181 50
2334 50 -247 98 138 174 296 306 75 433 15 414 63 431 -241 -315 5 -114 -61 -243 -85 -130 -58 -297 181
2357 181 235 151 -40 374 308 111 -66 39 175 -40 -33 -69 -62 -384 -45 393 -192 22 -46 5 85 -33 40 111
2381 111 88 174 44 -9 287 72 171 401 -35 85 36 -140 -73 -180 -266 -137 -219 -294 -108 34 60 276 338 -102
2405 -102 186 355 374 14 67 331 37 113 66 333 -207 -245 0 -200 -62 -251 -77 34 290 92 -39 -118
2427 -118 380 159 313 294 206 -10 -304 -85 63 16 -230 -224 -9 -176 -216 -356 -41 241 -183 -204 62 125 157
$$ packed form
2268A0L00n23L27K08k46J32P1J51k42j43q9L36j47k15L16m71j75L65J3K51m08
2289a79kJ79N32o76L14J65K02m02j62K48j7k33K24m9l62l3K05j7qn9r0L37j45
2312b8MJ6M40j91J26k53N00k02l70M87j79m45L08k13P8j39n15M50J58j72m1K31
2334E0k97L45M0L6J22J0k31L58m18L99l51L68o72p4L20j19N3j82J58m5P2k39M78
2357A81N4q4j91M14o6j97j77J05J36k15Pl6Pl22L39M38n85K14o8N1Q0j18P3P1
2381A11k3Q6j30n3K96k15R9K30m36J20m9j76O7j07q6J29q2p5J86J42K6K16O2m40
2405a02K88J69J9l60N3K64k94P6m7K67n40l8K45k00J38j89J74J11K56j98j31p9
2427a18M98k21J54j9q8k16k94K19J48m7k46OK15j67m0j40L15K82m24k1K66O3L2
$$ plain form
2450 157 99 50 171 -97 121 108 41 125 25 -189 -134 -67 -126 -21 -162 193 144 -302 50 66 366 -138 -57 175
2474 175 316 -200 350 162 -156 38 52 -51 -156 124 -467 -73 108 -273 9 -67 169 28 -175 422 200
2495 200 42 25 138 -188 128 -8 99 159 -112 -362 -222 -195 110 -121 -8 -202 -209 -239 294 29 29 -91 332
2518 332 262 151 -199 -22 201 171 120 16 -29 -13 -42 -300 77 -248 -51 11 -41 71 66 -45 217 14 137
2541 137 191 39 -17 196 123 -332 -177 -112 98 -6 -248 158 57 -393 73 259 -65 125 105 29 104 -26
2563 -26 -132 347 188 -115 99 15 159 -87 -319 -50 -132 148 -144 -292 -92 -19 -27 252 384 137 21 169
2585 169 340 251 340 505 284 186 102 -215 -58 8 -314 -131 -191 -97 -88 118 -156 128 231 -143 -29 334 102
2608 102 278 -137 61 224 22 76 -32 310 -55 -341 -121 -77 -189 -126 -177 142 -75 34 -203 340 205
$$ packed form
2450A57n8m9J21k68K18j3o7Q4j00k14N5O7n9J05j41L55m9m46L52J6L00n04Q1K32
2474A75J41n16N50j88l18J94J4j03j05K80n91L94J81l81K82p6K36j41k03N97k22
2495B00j58j7J13l26L16j36J07O0k71k50J40K7L05k31J13j94pl0N33k65%j20M23
2518C32p0j11l50J77K23l0n1j04m5J6k9k58L77l25J97O2n2J12nj11K62k03J23
2541A37N4j52n6K13p3m55J55O5K10j04k42M06j01m50M66J86l24J90k0p6P5j30
2563b6j06M79j59l03K14q4J44k46k32K69q2K80k92j48K00P3qK79J32k47j16J48
2585A69J71q9Q9J65k21r8q4l17J57O6l22J83o0R4RK06k74K84J03l74J14L63k32
2608A02J76m15J98J63k02N4j08L42l65k86K20M4j12O3n1L19k17J09k37N43j35
$$ plain form
2629 205 -65 268 219 106 238 63 96 -244 -207 -60 30 -329 -122 -91 -18 38 -52 9 92 -198 157 -92 9
2652 9 136 88 242 92 187 134 154 -13 82 302 15 -198 -126 94 106 -40 -132 4 -8 -76 -15 172 -25 51 32
2677 32 424 142 -350 -256 35 -193 -325 -161 -83 -55 -318 -156 -46 -225 227 144 146 326 35 194 253 188 116
2700 116 228 182 5 -45 53 84 -158 -263 -102 -105 -189 -202 -155 -125 5 -131 240 200 -157 181 -53 448 247 95
2724 95 220 -3 -156 -119 -92 -30 -197 -26 -66 17 -210 -133 206 40 -14 -20 44 -31 28 -71 67 47 120 219 135 -331
2750 -331 60 -203 -236 40 -138 -90 -14 -446 65 -121 -204 -198 -197 251 297 -117 201 236 117 -65 50 106 -10 11
2774 11 -39 170 -82 -145 -275 -65 -2 -152 94 275 -21 -50 17 333 -91 64 21 230 123 -124 52 113 -360
2797 -360 90 102 -180 63 -354 -78 114 -90 183 178 -95 -20 8 -229 -13 106 -99 35 -109 -82 100 -252
$$ packed form
2629B05k70L33m9j13J32j75L3l40L7J47R0l59K07L1P3N6r0O1Q3k90L55k49J01
2652IJ27m8J54j50R5n3K0j67R5K20k87k13P2K20J2j46r2J36j2o8O1J87j97P6j9
2677C2L92k82m92R4K91k28j32J64P8K8k63J62J10j79M52q3KJ80k91J59N9o5p2
2700A16J12m6j77n0R8L1k42j05J61lq4j3M7L0J30j36L71m0l57L38k34N01k01j52
2724I5J25k23j53L7K7O2j67J71m0Q3k27P7L39j66n4oO4p5N9r9J38k0P3R9q4m66
2750c31L91k63l3K76j78M8P6m32N11j86q3OJM48M6m14L18L5j19j82J15N6j16K1
2774A1n0K09k52o3j30K10O3j50K46J81k96k9O7L16m24J55m3K09j07k47J76O1m73
2797c60M50J2k82K43m17K76J92k04K73nk73P5K8k37K16J19k05J34j44K7J82l52
$$ plain form
2819 -252 -164 -120 -52 182 10 -69 89 -250 -24 81 222 409 98 211 212 88 85 -2 -178 202 -94 154 -155
2842 -155 -141 -218 41 -124 -136 -135 26 -95 -22 -102 206 96 -264 93 279 -97 -106 85 31 -42 -110 47 76 -112
2866 -112 -144 -218 -130 -100 -107 82 230 128 -183 218 226 21 -39 124 -6 116 -54 -57 79 -72 -4 5 260 -105 -99
2891 -99 -4 -100 -24 -53 41 203 105 318 113 287 53 21 128 54 -51 134 -184 -233 205 -295 113 25 -133 117
2915 117 33 -250 48 -124 -48 120 73 71 354 140 93 14 21 22 -247 172 -361 58 -197 110 -137 -341 -109 -60
2939 -60 -10 -157 -52 258 151 112 331 -136 97 -149 97 7 -44 -28 68 -134 -35 114 -85 -336 -221 -90 8
2962 8 -102 122 -13 -75 -110 142 92 98 119 -158 253 -98 -200 -206 77 -244 -101 -238 -130 -146 75 38 166 263
2986 263 134 68 224 361 198 151 140 -91 -143 114 -63 -278 139 -147 -103 -68 21 -56 14 -99 -41 212 -16
$$ packed form
2819b52Q8M4O8K34j72p9J58l39K26J05J41J87l11J13Jj24lq7j76L80k96K48l09
2842a55J4p7K59j65j2JJ61j21P3q0L08j10l60L57J86l76rJ91n4p3o8J57K9j88
2866a12l2p4Q8L0pJ89J48j02l11M01Qk05o0J63j30J22j70lJ36j51O8RK55l65O
2891i9R5r6P6k9R4J62r8K13k05J74k34l2J07p4j05J85l18m9M38n00M08q8j58K50
2915A17q4k83K98j72P6J68m7kK83k14m7p9PJk69M19n33M19k55L07k47k04K32M9
2939f0N0j47J05L10j07l9K19m67K33k46K46r0n1J6R6k02R9J49j99k51J15J31R8
2962Hj10K24j35o2l5K52n0OK1k77M11l51j02oK83l21J43j37J08j6K21l7J28R7
2986B63j29o6J56J37j63m7j1k31n2K57j77k15M17k86M4L5Q9p7P0j13N8K53k28
$$ plain form
3009 -16 97 212 272 270 90 235 187 60 46 -18 -99 58 -231 295 -23 -115 -164 -141 -5 107 239 130 253 -84
3033 -84 23 -97 89 37 63 -114 323 190 -182 -218 -191 -370 -32 -79 91 -54 61 107 -27 85 -313 146
3055 146 23 169 105 -99 41 132 -289 -189 102 -62 -152 -294 -144 -147 -150 -88 -20 -110 118 176 -372 36 -65 -81
3079 -81 486 60 -106 261 3 -20 2 172 -213 -110 -161 56 -335 259 152 222 91 -79 -113 118 -87 -116
3101 -116 160 143 95 118 -6 -60 16 -127 -165 -82 54 -42 79 157 -153 -31 131 -65 -127 271 -35 134 -9
3124 -9 -66 68 25 -18 25 165 159 131 -82 -107 192 93 -117 38 143 -47 144 119 -65 72 78 44 27 -128 -14
3149 -14 -100 -63 35 -291 84 -117 26 -37 28 126 -44 48 -61 56 4 244 173 -78 -270 -122 137 -5 66 -435
3173 -435 -109 86 -97 -127 -47 6 -114 -131 50 -92 112 -8 -93 0 -56 -286 164 67 144 64 125 154 211 189 -55
$$ packed form
3009a6J13J15O0kj80J45m8j27j4o4q1J57k89N26l18r2m9K3J36J12J32j09J23l37
3033h4J07j20J86n2K6j77M37j33l72l6K7j79L38m7J70j45J15M6j34J12l98M59
3055A46j23J46o4k04J40R1m21J00K91j64r0j42J50llO2O8r0K28N8n48M08j01j6
3079h1N67m26j66L67k58k3K2J70l85J03n1K17l91N94j07P0j31j70l4K31k05k9
3101a16K76j7m8K3j24n4P6j43l8Q3J36r6J21P8l10J22J62j96o2L98l06J69j43
3124in7J34m3m3M3J40ok8k13k5K99r9k10J55J05j90J91k5j84J37Ol4j7j55J14
3149a4q6L7R8l26L75k01J43o3O5R8j70R2j09J17n2K40p1k51j92J48K59j42P1n01
3173d35L26J95j83l0Q0N3j20j7J81j42K04j20q5R3n6k30M50r7P7q0O1K9N7k2k44
$$ plain form
3198 -55 -254 -28 -25 75 -265 88 -101 -310 105 -166 -30 -196 81 115 153 128 -28 -28 32 204 -16 3 129
3221 129 -82 -50 -9 70 -58 122 103 113 -23 45 -12 209 -107 61 66 145 102 33 133 90 -45 -408 28 -92
3245 -92 48 238 -13 316 127 -32 -118 193 -73 0 -24 178 9 167 172 -16 157 -26 190 98 20 1 -41
3268 -41 -16 -8 -48 153 -251 279 54 -79 27 -212 103 0 255 48 -76 -129 -55 157 54 93 -235 -163 200
3291 200 -149 -227 175 9 301 201 176 31 -122 100 18 87 -230 52 -145 -151 79 -52 -48 94 -169 -20 49
3314 49 -165 58 -180 115 60 -159 -53 66 -56 313 69 28 36 -144 -116 132 -117 -74 370 -146 -74 -17 84
3337 84 -305 146 -244 -19 -107 -186 128 54 105 356 218 -157 18 -176 -48 131 56 384 -125 -96 86 17 -246
3360 -246 -27 -265 121 -60 111 -27 10 195 -22 263 28 -34 25 207 -91 74 24 297 -183 -6 -19 117
$$ packed form
3198e5j99K26LJ00l40L53j89k09M15k71J36j66K77L4L8k5j56%O0J72k20J9J26
3221A29k11L2M1P9j28J80j9J0j36O8n7K21l16J68NP9m3o9J00m3j35l63M36j20
3245i2J40J90k51L29j89j59q6L11k66P3k4K02j69J58Nj88J73j83K16r2p8j9m2
3268d1K5Qm0K01m04N30k25j33J06k39L15j03K55k07j24n3P4K12j03L9l28P2L63
3291B00l49p8M02j66K92j00k5j45j53K22q2O9l17K82j97oK30j31MJ42k63J49O9
3314D9k14K23k38K95n5k19J06J19j22L69k44m1Qj80K8K48k49M3M44n16P2N7J01
3337H4l89M51l90K25q8p9L14p4N1K51j38l75J75j94J28J79p5L28n09K9J82o9k63
3360b46K19k38L86j81J71j38L7J85k17K85k35o2N9J82k98J65n0K73m80J77j3J36
$$ plain form
3382 117 115 106 60 320 35 182 -74 -133 -201 -107 -199 -41 -162 139 -140 100 167 -89 -39 -27 40 -216 -178 9 -31
3407 -31 -88 -101 -142 103 -77 -74 125 -53 0 69 317 196 18 -100 53 -158 17 47 -265 57 -6 -74 -94 -239
3431 -239 -182 162 -201 31 37 69 95 -64 -8 118 82 -1 5 64 18 132 -114 -254 28 -222 33 72 -100 -37 138
3456 138 45 352 99 -22 211 -91 91 -161 293 156 36 17 -20 -54 -15 96 -11 -212 -25 19 19 40 -61
3479 -61 62 78 304 182 47 179 136 90 -17 216 21 -50 -36 64 91 -102 -231 -67 61 -29 78 -14 -23 -29
3503 -29 -156 10 -136 272 -66 -353 -61 131 4 2 -145 -71 -126 -184 -220 -96 135 14 138 18 -271 170
3525 170 -81 483 -120 73 153 181 24 56 -303 -258 66 -40 -141 -69 31 124 60 163 66 -149 -11 145 -7
3548 -7 -437 -45 163 -160 -31 -116 -40 -28 83 143 -49 -103 163 51 27 -61 35 233 -301 183 5 -92 285 -300
$$ packed form
3382A17krm6K60k85J47k56n9o8R4r2J58j21L01k79K40O7k56N0J2O7k56L8J87m0
3407c1n7j3m1K45j80LJ99j78N3O9K48j21j78j18J53k11J75L0l12L22o3o8k0j45
3431b39N7L44l63K32OL2K6j59N6J26l6q3ON9m6J14k46j40K82k50K55L9j72O3J75
3456A38r3L07k53j21K33l02J82k52M54j37j20j9l7l4L9J11j07k01J87M4%K1j01
3479f1J23J6K26j22j35J32m3m6j07K33j95p1J4J00K7j93j29J64J28r0J07r2ro
3503b9j27J66j46M08l38k87K92J92j27kj47P4n5n8l6J24K31j21J24j20k89M41
3525A70k51N64o03J93Q0K8j57L2l59M5L24j06j01P2J00R3o4J03r7k15J38J56j52
3548gm30L92K08l23J29q5P6J2J11O0j92n4K66j12k4q8R6J98n34M84j78r7L77n85
$$ plain form
3572 -300 120 81 132 199 23 -2 -77 -249 -205 -64 -44 -217 -194 -71 149 -184 86 -47 113 -259 175 101 53
3595 53 103 115 324 166 114 -77 50 -50 -299 -214 -249 72 -261 67 301 24 -65 56 45 68 -123 -10 142
3618 142 18 211 23 181 -122 -55 99 45 154 -239 117 -16 93 -13 -160 90 87 39 75 -36 139 117
3640 117 145 304 212 -65 -278 -66 -253 -101 -15 -97 -202 -123 40 72 -141 -156 22 -22 35 56 385 201 150 11
3664 11 -9 -55 -15 35 7 256 101 -58 -195 -243 -145 -212 203 165 501 248 15 55 186 164 -245 234 19 -84
3688 -84 155 -132 -47 22 110 66 -156 -170 110 67 -61 39 -68 -146 102 70 63 244 90 83 17 52 -2 204 -180
3713 -180 -122 44 -19 -32 99 -198 -163 156 -286 5 -80 -41 113 -41 20 -37 -89 -182 -157 143 -38 -188 206 -96
3737 -96 -126 -94 27 124 -65 165 91 140 17 -16 6 -148 43 13 -61 -273 -145 -180 95 -49 118 -42 304 -46
$$ packed form
3572c00M20l9N1O7j76k5p5j72M4J41K0j73K3J23K20l33K70j33J60l72M34p4m8
3595E3N0J2K09j58n2j91J27j00k49Q5l5L21l33L28K34k77q9J21j1K3j91J13J52
3618A42j24J93j88J58l03O7J54n4J09l93L56j33J09j06j47K50lm8L6j11J75k2
3640A17K8J59r2k77k13K12j87J52Q6q2j05P9J63L2k13j5J78m4N7K1L29j84n1j39
3664A1k0m6M0N0k8K49j55j59j37m8R8o7M15l8L36k53k33M0J31k2m09M79k15j03
3688h4K39k87Q5O9Q8m4k22j4K80m3j28J00j07p8K48l2pJ81j54po6L5n4K06l84
3713a80N8J66o3j3J31k97L5L19m42K91q5L9J54j54O1n7n2r3K5L00j81j50L94l02
3737i6l0L2J21R7j89K30p4M9j23l3K2j54J91l0p4k12J28l5K75j44J67j60L46l50
$$ plain form
3761 -46 -117 431 -183 -22 -274 -28 71 120 25 194 -299 170 -252 241 -197 -48 100 -63 9 347 136 190
3783 190 4 125 42 4 37 52 -128 -82 -89 -93 130 -29 345 34 73 93 230 -56 4 -150 -14 -250 9 -24
3807 -24 77 -253 -268 229 96 -54 323 -8 -82 189 -63 124 113 184 234 -73 -34 62 -151 188 -28 -228 112
3830 112 146 -187 -207 -96 -129 172 77 198 -115 371 -111 101 101 184 150 -350 51 4 223 5 -176 74 7
3853 7 -263 -44 22 -46 71 120 2 90 48 166 145 43 211 2 226 -1 -116 -160 -272 -175 -301 -98 -74 -174
3877 -174 87 20 158 79 -45 -174 -28 64 116 114 -64 121 -213 -77 76 9 -296 -51 140 -483 -283 -61
3899 -61 -131 -64 40 21 46 123 -28 47 187 289 -316 -214 -166 142 104 331 -20 -85 -27 117 -213 -31 50 -181
3923 -181 207 113 3 6 211 -43 198 290 -96 10 133 -35 -372 -8 -50 -26 115 129 -69 -56 -79 80 305
$$ packed form
3761d6p1N48o14J61k52K46R9M9r5J69m93M69m22M93m38J49J48j63P2L38k11N4
3783A90j86J21q3l8L3J5j80M6pmK23j59L74l11L9K0J37k86O0j54J36k36K59l3
3807b4J01l30j5M97j33j50L77l31p4K71k52J87j1P1N0l07L9R6k13L39k16k00L40
3830A12L4l33k0J11l3L01r5J21l13M86m82K12%Q3l4n00M01m7K19k18j81K50o7
3853Gk70K19O6o8J17M9j18Q8m2J18k1j02J68k09K24k27j15m4j12R7j26K03K4j00
3877a74K61o7J38p9j24j29J46R2N2kj78J85l34J36J53o7l05K45J91o23K00K22
3899f1p0O7J04j9K5P7j51P5J40J02o05J02M8L08l8K27l51o5N8J44l30J82Q1k31
3923a81L88r4j10LK05k54K41R2l86J06J23j68l37L64m2K4J41J4j98J3k3J59K25
$$ plain form
3946 305 250 -12 -115 21 33 -143 -4 213 289 -57 91 -41 14 18 109 190 -164 353 40 -14 -307 -80 68
3969 68 239 -60 -7 160 -80 132 125 297 196 198 104 29 150 81 -18 -168 -355 -16 -36 -7 263 -88 173 95
3993 95 -57 -102 125 341 27 361 -94 167 320 -240 -157 -274 -45 -172 -111 -201 84 140 8 -118 -257 -328
4015 -328 33 -6 -199 -169 242 17 36 77 134 -152 171 95 159 -60 82 142 -28 11 -149 -159 -154 -106 -17 114 -109
4040 -109 259 -103 280 -46 79 -68 200 -34 189 -177 119 56 123 81 -80 -171 -58 85 -61 34 259 -16
4062 -16 188 -124 108 -85 75 -96 270 75 -63 16 -212 110 49 -32 34 104 -133 126 141 118 45 -18 175
4085 175 12 -150 -169 -58 56 -84 -171 -184 79 -29 -161 58 -39 -3 105 -48 -38 -24 72 -196 -34 140 -215
4108 -215 -67 131 27 -36 -134 71 -44 10 35 -5 -22 160 -90 -19 70 -184 30 68 227 19 -161 -103 168
$$ packed form
3946C05n5k62j03J36J2j76J39K17P6l46J48j32N5MR1Q1l54N17l13n4k93K27J48
3969F8J71k99N3J67k40K12pJ72j01Kr4p5J21o9r9j50j87L39k0K9K70l51K61p8
3993I5j52m5K27K16l14L34m55K61J53n60Q3j17K29j27O1r0K85N6j32j26j39p1
4015c28L61l9j93L0M11k25J9M1N7k86L23p6O4k19J42O0j70L9j60j0NM8Q9J31k23
4040a09L68l62L83l26J25j47K68k34K23l66K96o3O7m2j61r1J13J43j46R5K25k75
4062a6K04l12K32j93J60j71L66j95j38P9k28L22o1q1O6P0k37K59J5k3p3o3J93
4085A75j63j62j9J11J14j40q7j3K63j08j32K19r7L6J08j53J0J4R6k68J62J74l55
4108b15J48J98j04o3r8K05j15N4K5m0j7J82k50P1Q9k54K14L8J59k08j80N8K71
$$ plain form
4131 168 -36 35 152 193 73 12 -232 10 -13 -201 30 -127 -361 -44 -9 -94 124 14 -39 287 -131 235
4153 235 343 310 65 58 101 9 25 -12 -169 -265 -45 -98 -230 160 145 71 125 122 -135 172 43 -42 268 67 -140
4178 -140 -133 -86 49 -80 -36 208 -71 -75 -217 70 41 120 -199 -31 -140 18 41 -24 84 29 -139 265 102 28
4202 28 116 113 198 -34 -101 -132 -335 -98 -105 51 132 -49 110 -99 -2 112 25 30 175 133 38 117 -134 -243 -229 -51
4228 -51 -299 12 156 -155 53 -5 -206 106 -63 -44 159 52 -4 -72 152 -5 -22 11 -131 -322 43 33 74
4251 74 29 72 71 195 -226 -11 82 69 255 85 -151 38 170 -34 300 148 -188 155 5 -62 60 18 158
4274 158 26 -49 87 -244 49 201 36 -132 -276 -355 40 -82 -120 76 22 102 253 -53 114 -109 321 0
4296 0 -17 -38 -90 37 -21 144 122 65 96 -95 5 202 100 59 103 20 136 -66 -17 -128 45 -6 95 -82 -79
$$ packed form
4131A68k04P1J17M1j20o1k44K42k3j88K31j57k34L17L5q5K18j10n3L26m18L66
4153B35J08l3k45pM3r2J6l7j57r6K20n3j32L90j5p4N4lk57L07j29q5L10k01k07
4178a40PM7J35j29M4K44k79mj42K87k9P9l19J68j09J58K3o5J08n5j68M04j63p4
4202B8Q8lQ5k32o7l1k03K37pJ56Q1j81J59k09R7J14q7NJ45m2r5P9k51j09J4J78
4228e1k48L11J44l11K08n8k01L12j69J9K03j07n6o8K24j57j7L3j42j91L65j0M1
4251G4m5M3jJ24m21K15R3j3J86j70k36J89J32k04L34j52l36L43j50o7J22m2J40
4274A58j32p5J36l31K93J52j65j68j44p9L95j22l8J96n4Q0J51l06J67k23M30l21
4296@j7k1n2J27n8J65k2n7L1j91J00J97j02m1M4q3J16k02M9j11J73n1J01j77L
$$ plain form
4321 -79 -77 -146 262 99 21 -55 -187 -211 -100 -108 -171 141 -55 -157 117 28 -86 -77 19 82 303 -231 -193 -223 27 215
4347 215 22 -79 -3 -81 56 59 102 112 -61 234 116 -70 170 -223 -2 -5 -248 102 -35 159 -80 1 319
4370 319 113 -1 -41 81 -33 -15 70 240 75 230 102 -70 -33 -189 15 108 165 54 -19 -37 -152 296 16
4393 16 -130 -19 -99 238 92 -70 -64 -43 -16 -9 -85 -78 115 61 -178 -62 66 116 -148 68 -269 125 -39 -11 38
4418 38 -79 201 227 149 -36 194 116 17 157 212 -31 61 -197 -134 70 311 -358 263 70 -283 253 263 178
4441 178 41 -83 113 -27 77 145 1 125 209 -99 -32 73 -53 -46 -124 -99 -154 -93 61 59 -118 2 203 -137
4465 -137 18 193 -89 356 36 59 12 -101 -354 -42 -105 -22 46 -5 143 -98 85 -108 99 275 -84 -87 131
4488 131 -87 99 -27 175 4 -168 265 -76 -217 -181 -52 -66 -112 137 89 28 70 65 -60 -149 -31 -119 10
$$ packed form
4321g9Ko9M08j63p8p6j32k4J11qo3L12j96j02K74q9j14RR6O3K21n34L8l0K50J88
4347B15j93j01P6p8J37LM3J0j73K95j18j86K40l93K21lk43L50j37J94k39Q1L18
4370C19k06j14m0J22j14J8Q5J70j65J55j28j72L7j56K04R3N7j11p3j8j15M48k80
4393A6j46J11q0L37j46j62OK1K7Pp6PJ93n4k39J16J28N0k64K16l37L94j64K8M9
4418C8j17K80K6p8j85K30p8r9J40N5k43R2k58O3K04K41o69O21j93l53N36J0q5
4441A78j37j24J96j40J04O8j44J24Q4l08O7J05j26Pp8K5n5O1J54kj77J20K01l40
4465a37J55J75k82M45l20K3m7j13k53L12o3Q3O8n1J48k41J83j93K07J76l59lK18
4488A31k18J86j26K02j71j72M33l41j41L6J29j4m6K49m8o1M2nj25q9J18q8J29
$$ plain form
4511 10 -155 66 -179 19 -26 66 129 73 -124 36 -225 -265 -155 -52 161 -23 -187 23 242 -43 19 105 -50
4534 -50 -201 -168 81 -132 -159 143 102 -52 85 -68 97 2 -177 109 -374 -7 -73 157 95 88 -106 22 -173
4557 -173 -190 54 96 -78 193 -153 -42 -43 19 -36 -36 -97 -125 29 69 -73 -48 -166 68 137 -15 149 -251 86
4581 86 -6 20 48 136 -36 357 95 -119 -120 238 211 326 -205 169 -164 164 -77 223 87 67 136 -277 -6
4604 -6 -217 280 -63 -48 193 129 162 64 -76 -140 251 -107 206 -132 9 -11 -58 137 252 217 307 213 17 208
4628 208 -152 199 -213 -256 9 -42 -96 167 -2 118 -28 -16 -144 2 -38 4 197 -4 88 -61 -240 -48
4650 -48 -26 -25 133 -296 -260 63 140 -56 -71 84 -122 41 199 -172 -60 -37 -119 -113 -339 -112 60 -40 -223 120
4674 120 28 -32 -299 20 233 43 -42 88 40 191 -359 -163 -165 -213 -161 -43 322 72 -58 73 85 -192 -86
$$ packed form
4511A0j65K21k45J98m5R2O3n6j97J60k61m0J10J03K13j84j64K10K19k85O2Q6j55
4534e0j51L3K49k13k7L02m1j54J37j53J65r5j79K86m83L67o6K30o2pj94J28j95
4557a73j7K44M2j74K71l46J11jO2n5%o1k8J54M0j42K5j18K34O9j52J64m00L37
4581H6r2K6K8Q8j72L93k62k14jL58k7J15n31L74l33L28k41L00j36k0O9m13K71
4604fk11M97l43J5K41o4L3r8j40o4L91l58L13l38J41k0m7J95J15l5R0r4j96J91
4628B08l60L51m12m3K65n1n4K63j69J20j46J2j28J46m0M2J93k01R2j49j79J92
4650d8K2JJ58m29L6L23P7j96j5J55k06J63J58l71J12K3q2Ok26K27J72j00j83L43
4674A20r2o0k67L19K13j90q5J30m8J51n50J96km8N2J18L65k50j30J31J2k77J06
$$ plain form
4697 -86 129 -331 -97 -88 44 -14 -340 194 170 72 1 -163 -4 -121 72 -63 -359 -37 49 47 135 259 -18 3
4721 3 -79 -83 161 132 193 -48 240 -64 -169 140 95 -278 -108 -224 -69 -20 205 193 70 -126 170 60 49 -122
4745 -122 -164 158 -46 -230 -165 -54 168 172 -86 214 -116 29 87 344 -16 157 205 -160 130 -45 -69 -149 254
4768 254 -43 90 7 133 30 198 68 163 52 -151 35 -2 52 119 155 -89 -253 -217 -157 -186 50 101 8 -23
4792 -23 -312 126 62 125 19 6 69 95 -80 1 -147 -47 305 -210 16 85 17 -88 -42 -112 -18 -168 -132 -63 -37
4817 -37 248 -180 -118 213 -167 38 -179 59 -27 -64 101 155 -329 170 -6 225 -390 -66 67 -169 -100 224
4839 224 209 267 170 183 -136 18 -133 -236 16 -50 80 14 355 -377 51 -156 218 -136 -52 133 -79 42
4861 42 173 -28 3 -14 71 -118 -5 -21 -37 266 -21 -3 97 205 -191 382 224 19 126 -83 2 -315 -93
$$ packed form
4697h6K15m60K34RJ32n8l26N34k4r8p1j64J59j17J93j35k96L22Q6kQ8J24k77K1
4721Cq2mK44k9O1k41K88l04j05L09m5l73J70j16J55M9K25j2j23j96K96j10j1j71
4745a22m2L22k04j84O5J11K22Mk58L00l30J45N8K57l60J73M8l65K90j75k4q0M03
4768B54k97J33q3J26j03J68j30R5j11k03J86l7N4O7L6k44j64L6O0k9K36N1r3l1
4792b3k89M38o4O3j06j3O3K6j75Q1j48J00L52n15K26O9o8j05M6p0R4j50L6O9K6
4817c7K85m28O2L31l80K05k17K38q6l7J65N4m84M99j76K31o15L24J33k36O9L24
4839B24j5N8r7J3l19J54j51j03K52o6J30o6L41p32M28k07L74l54Q4J85k12J21
4861D2J31k01L1j7Q5j89J13j6j6L03k87J8J00J08l96N73j58k05J07k09Q5l17K22
$$ plain form
4884 -93 -118 -27 -45 27 -93 -223 30 233 147 137 -46 439 68 -216 -88 -235 -49 -194 144 61 44 154 138
4907 138 -105 -107 -1 -488 15 342 -126 -125 28 71 65 -178 74 166 31 16 -219 97 244 162 79 -87 -40 64
4931 64 195 254 185 79 14 36 109 71 112 93 -131 -65 46 41 -133 -108 -50 31 100 -232 8 -116 -61 235 -38 33
4957 33 64 111 82 -111 -19 170 -181 145 0 -69 -19 -32 -255 -96 2 -299 -58 -35 96 58 -107 245 -87 -30
4981 -30 -3 -3 -21 196 35 -66 250 65 -294 94 5 -186 148 0 154 -46 -84 -146 6 -91 137 41 -22 304
5005 304 43 84 122 -103 83 -117 -47 -191 65 123 85 -165 -48 293 72 -34 -138 -95 108 8 121 12
5027 12 14 -77 -92 9 283 -47 126 138 -20 59 44 -19 193 341 49 185 -114 108 19 -109 9 -178 -73
5050 -73 72 -112 -118 82 -51 -187 155 -28 -230 144 116 294 -128 22 88 -18 -181 41 -191 142 36 -114
$$ packed form
4884i3k5R1j8P2j20j30K53K03q6j0j83M85l71k84J28j47J86j45L38q3j7J10j6
4907A38k43kJ06m87N03L27m68JJ53M3ok43K52R2j35j5k35L16J47q2q3j66M7J04
4931F4J31N9o9j06o5K2P3l8M1j9k24O6J11nj74K5N8Q1O9l32K40j24N5K96k73P1
4957C3L1M7k9j93R2J89l51L26j45o9N0j3k23J59R8l01K41K3J31l8j65L52l32N7
4981c0K7%j8K17j61j01L16j85l59L88q9j91L34j48J54k00l8o2J52r7K28r6o3L26
5005C04k61M1L8k25J86k00P0j44K56N8l8k50J17L41k21j06j04M3K03j00J13j09
5027A2Kr1j5J01K74l30J73J2j58P9j5o3K12J48k92J36k99K22q9j28J18j87J05
5050g3J45j84oK00j33j36L42j83k02L74k8J78m22J50O6j06j63K22k32L33j06j50
$$ plain form
5072 -114 -189 -101 145 -228 214 -209 -71 -52 236 79 -287 -2 69 -215 40 -61 -158 22 34 39 -54 138 -78
5095 -78 70 -370 3 -180 -3 -179 -43 41 196 -22 -72 106 4 -94 -94 60 -9 59 -148 -63 -8 52 -53 276
5119 276 -414 -84 -170 -23 -9 69 -33 111 70 69 30 22 93 -62 99 392 -44 -123 149 20 -86 42 56 -61
5143 -61 -15 143 9 -19 66 -80 116 -250 171 83 -92 164 -268 129 276 -30 -126 -95 126 123 -282 127 13
5166 13 144 3 -351 105 -196 -63 77 -187 -82 126 132 96 122 -115 96 -151 79 61 -76 44 -91 -46
5188 -46 268 99 -130 284 -200 38 270 -306 -134 10 112 59 278 -93 -28 367 183 -49 184 -107 -184
5209 -184 24 -125 54 -185 -114 -68 11 -176 -49 6 -77 -131 -6 81 3 98 4 95 -12 -188 -217 -130 -45 -46 -96 272
5235 272 -31 -147 244 118 153 -229 -21 77 19 -105 -77 -146 71 -130 92 63 -24 -63 290 -36 -32 -54 -33 -84
$$ packed form
5072a14p5Q8K46l73M42m23J38J9K88j57l66K85P1k84K55j01r7J80J2Nr3J92k16
5095g8J48m40L73j83J77j76J36Q4J55k18n0J78j02r8%J54o9O8k07Q5N5O0j05L29
5119B76o90L30q6J47J4P8j02J44m1jl9qP1j55J61K93m36p9K72j29j06J28J4j17
5143f1M6J58j34k8Q5j46J96l66M21q8j75K56m32L97J47l06r6L1K21lm05M09j14
5166A3J31j41l54M56l01J33J40k64J05K08Ol6K6k37K11k47K30j8j37J20j35M5
5188d6L14j69k29M14m84K38K32n76J72J44J02n3K19l71O5L95j84k32K33k91p7
5209a84K08j49J79k39P1M6P9j87J27N5q3n4J25Q7p8R5r4R1j07j76k9Q7Q5jn0L68
5235B72l03j16L91j26L5l82K08R8n8j24K8o9K17k01K22k9q7l9L53l26Mk2K1n1
$$ plain form
5259 -84 -46 -232 -23 24 90 -198 -232 390 8 16 15 -326 -159 28 167 12 96 -237 -117 166 -93 150 259
5282 259 -59 -62 -6 104 -25 42 159 -96 79 58 70 59 195 117 114 -75 121 172 75 -79 144 147 -15 152 16
5307 16 243 -37 -185 -58 -47 -248 -186 34 238 -30 -4 -209 32 185 -41 136 -91 50 73 194 -168 -16
5329 -16 -251 126 18 126 44 -76 186 161 -104 -12 -4 145 -67 -126 147 -17 -64 -307 -13 -58 -168 -30 -60
5352 -60 -42 115 -39 149 99 -88 129 24 -65 174 -169 -339 99 142 98 -199 125 6 -201 -81 219 56
5374 56 43 -4 -71 110 51 152 41 -99 -168 -5 -120 -177 -52 109 -337 -133 83 -61 31 99 -153 174 -20
5397 -20 28 -69 152 10 3 74 -125 -185 -81 191 -215 -8 109 32 102 -132 169 59 -14 10 59 -33 97 350
5421 350 284 35 86 -11 183 163 -40 -12 50 -39 -74 -128 -53 -154 -39 369 130 -213 -41 -11 193 276 3 -151
$$ packed form
5259h4L8j86K09M7O6k88l4O22l82Qjl41J67J87J39j55Q4l33J20K83k59K43J09
5282B59l18lN6J10j29O7J17k55J75k1J2j1J36p8lj89J96N1r7j54K23Lj62J67j36
5307A6K27k80j48J27J1k01O2K20K04k68K6k05K41J53k26J77k27J41K3J21l62J52
5329a6k35L77j08J08q2j20K62k5k65R2QJ49k12n9K73j64m7k43K94m5j10J38l0
5352f0J8J57j54J88n0j87K17j05q9K39l43j70M38M3m4k97L24j19k07J20L00j63
5374E6j3m7o7J81n9J01j11j40o9J63j15n7J25J61m46K04K16j44R2O8k52L27j94
5397b0M8r7K21j42pP1j99o0J04K72m06K07J17p7P0k34L01j10p3K4M9r2J30K53
5421C50o6k49N1r7J94k0k03K8O2q9l5n4P5j01J15M08k39l43J72L0K04Q3k73j54
$$ plain form
5445 -151 -182 -75 244 2 -55 -172 -19 156 -76 -78 -25 -109 -58 65 206 94 -176 137 25 -82 -103 -115 89
5468 89 100 -38 118 -2 11 95 -84 49 -146 -199 -103 -41 8 5 -298 112 -17 2 114 132 47 -93 -4 75 205
5493 205 195 90 -70 187 93 -44 -66 58 335 200 5 -195 -17 -44 -57 -206 113 -58 34 160 149 -81
5515 -81 -288 95 -111 47 -34 160 8 -132 -104 -209 331 -120 239 180 271 71 -127 51 -32 -42 -277 236
5537 236 -241 -184 -142 -25 -65 -126 -186 -7 74 -86 113 226 41 -164 -232 42 -290 -45 -16 155 -396 -92 61
5560 61 -130 89 42 39 -75 155 -8 59 -100 114 184 138 128 -130 -123 -61 72 98 95 21 82 33 8 -231 107 -49
5586 -49 114 -259 184 121 211 92 -24 145 -54 -124 -20 49 242 -216 185 103 -52 19 79 104 136 101 24 176
5610 176 42 2 -110 -56 -237 102 -89 97 -31 187 -5 15 -138 -121 19 -70 122 -166 -15 -117 162 69
$$ packed form
5445a51l1J07L19k42n7j17J53J75k32kN3q4N1J23J41j12k70L13j12j07k1j2K04
5468H9J1j38J56j20J3Q4j79J33j95n3R6O2M9ll03M10j29J9J12J8q5j40Q9P9J30
5493B05j0j05j60K57r4j37k2J24K77j35j95k00J78k7j3j49L19j71R2J26j1k30
5515h1k07L83k06J58q1J94j52j40K8j05N40m51L59n9R1k00j98J78q3j0k35N13
5537B36m77N7M2J17m0o1o0J79Q1j60J99J13j85k05o8K74l32K45K9J71n51L04J53
5560F1j91K19m7lj14K30j63O7j59K14P0m6j0k58PO2J33K6lp4O1m9k5k39L38j56
5586d9J63l73M43o3R0j19j16J69j99p0J04O9J93m58M01q2j55P1O0K5L2l5p7J52
5610A76j34m0j12N4j81L39j91J86j28K18j92K0j53J7J40q9J92k88J51j02K79r3
$$ plain form
5632 69 -207 -117 -96 171 -228 58 149 -30 -224 -80 -47 -186 -32 26 42 -72 -62 -41 73 -233 -14 94 -232
5655 -232 74 -54 -170 -186 41 114 -95 -27 -36 73 -55 101 131 -155 44 -14 -134 338 -110 30 -228 -152 -89
5678 -89 -265 80 16 163 15 118 197 125 -59 -82 275 85 133 -270 4 -170 30 116 -132 128 -225 -43
5700 -43 92 -57 94 -115 -103 204 330 -15 -45 24 -14 -121 -6 160 334 -49 -14 -107 -210 -250 -63 55 28
5723 28 -285 154 111 132 -110 -112 12 66 242 -12 151 -50 100 -92 -196 -65 129 195 -78 2 -132 1 -52
5746 -52 60 -30 40 -218 -386 -2 127 101 -54 -71 -177 288 -34 116 126 -208 -73 -76 62 373 358 94 -218
5769 -218 -60 5 96 -67 -92 193 260 -108 145 -59 17 84 109 -124 -69 -119 -250 -30 66 -306 -140 -5 -108
5792 -108 202 221 -113 -30 -92 38 213 242 186 72 144 70 132 -127 -32 115 119 1 -122 -30 94 109 115 -129 -41
$$ packed form
5632F9k76R0K1K67l99K86R1j79j94J44L3j39J54N8J6j14J0K1J14l06K19J08l26
5655b32L06j28j16j6K27P3k09O8rJ09j28J56L0k86J99n8j20M72m48J40k58P6O3
5678h9j76L45o4J47j48J03P9p2j84k3L57j90M8m03K74j74K00Q6k48K60l53J82
5700d3J35j49J51k09J2L07J26l45l0O9l8j07J15J66J74l83L5r3j03m0J87J18k7
5723B8l13M39m3K1k42kJ24N4J76k54J63k01J50j92j04J31J94O6k73Q0j34J33n3
5746e2J12r0P0k58j68L84J29k6j55j7j06M65l22J50J0l34J35lJ38L11j5k64l12
5769b18J58O5R1j63k5K85O7l68K53k04P6O7K5k33N5n0j31K20R6l72J66J35j03
5792a08L10J9l34Q3o2J30J75K9n6j14P2p4O2k59R5J47Mj18j23R2J24J5Ok44Q8
$$ plain form
5817 -41 -147 -72 8 27 -75 184 285 -203 119 110 -221 -18 -70 -59 150 54 -144 -211 -96 90 104 -331 74 -130
5841 -130 -167 -9 -169 67 87 -204 308 334 -114 49 201 -80 -8 118 -99 -144 -142 -57 -222 -149 -70 -1 -96 -83
5865 -83 -23 -37 -136 -3 121 87 -101 -226 93 -53 89 70 -81 19 -108 -206 113 -455 -83 91 -155 175
5887 175 138 -34 89 41 -58 -157 38 -53 -65 -122 -178 -149 -167 54 191 -106 -65 130 -35 87 -6 136 340 -109
5911 -109 -32 -47 144 -60 -110 -266 10 167 110 90 -147 -51 69 -159 -222 -26 -399 -243 -6 -164 146 137 -95
5934 -95 113 263 -51 24 343 -100 -40 -170 114 -64 -163 100 -137 -39 -97 -244 -165 316 36 -146 157 -46
5956 -46 -125 -57 169 20 51 392 87 -148 -298 -164 105 197 38 146 133 -269 -213 -31 -78 -70 -29 -14 303 -72
5980 -72 -31 -292 55 -87 -47 -157 -20 200 51 -17 -114 -140 35 35 73 -55 -299 -50 4 31 136 12 90 282
$$ packed form
5817d1j06P5Q0J9j02K59J01m88L22rl31K03n2J1K09r6j98o7J15J86J4m35M05k04
5841a30l7J58j60K36K0k91N12K6m48J63J52k81P2J26k17m5KQ5j65P3P9O9r5J3
5865h3O0j4r9J33J24l4j88j25L19j46J42j9j51J00j27r8L19n68L72J74k46L30
5887A75l7j72J23m8r9r9J95r1j2n7n6K9j8K21J37k97M1J95j65J22r3J42K04m49
5911a09P7j5J91k04n0j56K76J57n7k0k37R6J20k28o3J96l73J56K37j58L10rk32
5934i5K08J50l14P5L19m43O0j30K84j78r9K63k37R8n8j47P9M81k80j82L03k03
5956d6p9O8K26j49L1L41l05k35j50J34K69R2j59J08j3m02N6J82m7QM1J5L17l75
5980g2M1k61L47j42M0j10J37K20j49o8r7k6J75%L8j28k44K49N4K7J05j24P8J92
$$ [...]
8191I0
##END NTUPLES=NMR FID
##END=
