##TITLE=1H_Ser AmNCS-1H
 200.13MHz,CDCl3,
 8 sc
 
 26.6.2025
##JCAMPDX= 6.0         $$ Bruker NMR JCAMP-DX V2.0
##DATA TYPE= NMR FID
##DATA CLASS= NTUPLES
##ORIGIN= UXNMR, Bruker Analytische Messtechnik GmbH
##OWNER= pz
$$ XWIN-NMR		Version 3.5
$$ Thu Jun 26 14:58:21 2025 Russian Standard Time (UT+4h)  she@DPX200
##.OBSERVE FREQUENCY= 200.1313
##.OBSERVE NUCLEUS= ^1H
##.DELAY= (6, 6)
##.ACQUISITION MODE= SIMULTANEOUS
##.ACQUISITION SCHEME= undefined
##.AVERAGES= 8
##.DIGITISER RES= 18
##SPECTROMETER/DATA SYSTEM= spect
##.PULSE SEQUENCE= zg30
##.SOLVENT NAME= CDCl3
##.SHIFT REFERENCE= (INTERNAL, CDCl3, 0, 14.3821)
##AUDIT TRAIL= $$ (NUMBER, WHEN, WHO, WHERE, WHAT)
$$ ##TITLE= Audit trail, XWIN-NMR		Version 3.5
$$ ##JCAMPDX= 5.01
$$ ##ORIGIN= Bruker BioSpin GmbH
$$ ##OWNER= she
$$ F:/spectra/data/she/nmr/H-C/1/audita.txt
$$ ##AUDIT TRAIL=  $$ (NUMBER, WHEN, WHO, WHERE, WHAT)
(   1,<2025-06-26 14:57:07.28 +0400>,<she>,<DPX200>,
      <created by zg, POWCHK disabled, PULCHK disabled
       configuration hash MD5:
       00 E9 B6 7A A2 85 ED C7 34 08 36 98 17 FE 4E 26
       data hash MD5: 16K
       D3 6B 48 AF CB 34 D5 D7 CF AC A2 53 D1 4D 06 A4>)
$$ ##END=
$$ 
$$ hash MD5
$$ 24 0B 6F 62 98 33 DE 8F E6 A8 53 2C 52 C6 E4 B5
##$RELAX= 
##$RELAX= 
##$RELAX= 
##$RELAX= 
##$RELAX= 
##$RELAX= 
$$ Bruker specific parameters
$$ --------------------------
##$DU= <F:/spectra>
##$EXPNO= 1
##$NAME= <H-C>
##$PROCNO= 1
##$TYPE= <nmr>
##$USER= <she>
##$AMP= (0..31)
100 100 100 100 100 100 100 100 100 100 100 100 100 100 100 100 100 100 
100 100 100 100 100 100 100 100 100 100 100 100 100 100 
##$AQSEQ= 0
##$AQ_mod= 1
##$AUNM= <au_zg>
##$AUTOPOS= <>
##$BF1= 200.13
##$BF2= 200.13
##$BF3= 200.13
##$BF4= 200.13
##$BF5= 200.13
##$BF6= 200.13
##$BF7= 200.13
##$BF8= 200.13
##$BYTORDA= 1
##$CFDGTYP= 0
##$CFRGTYP= 5
##$CHEMSTR= <none>
##$CNST= (0..31)
1 1 145 1 1 1 1 1 1 1 1 1 1 1 1 1 1 1 1 1 1 1 1 1 1 1 1 1 1 1 1 1 
##$CPDPRG= <>
##$CPDPRG1= <>
##$CPDPRG2= <>
##$CPDPRG3= <>
##$CPDPRG4= <mlev>
##$CPDPRG5= <mlev>
##$CPDPRG6= <mlev>
##$CPDPRG7= <mlev>
##$CPDPRG8= <mlev>
##$CPDPRGB= <>
##$CPDPRGT= <>
##$D= (0..31)
0 0.7 0 0 0 0 0 0 0 0 0 0.03 0 0 0 0 0 0 0 0 0 0 0 0 0 0 0 0 0 0 0 0 
##$DATE= 1750935426
##$DBL= (0..7)
120 120 120 120 120 120 120 120 
##$DBP= (0..7)
150 150 150 150 150 150 150 150 
##$DBP07= 0
##$DBPNAM0= <>
##$DBPNAM1= <>
##$DBPNAM2= <>
##$DBPNAM3= <>
##$DBPNAM4= <>
##$DBPNAM5= <>
##$DBPNAM6= <>
##$DBPNAM7= <>
##$DBPOAL= (0..7)
0.5 0.5 0.5 0.5 0.5 0.5 0.5 0.5 
##$DBPOFFS= (0..7)
0 0 0 0 0 0 0 0 
##$DE= 6
##$DECBNUC= <off>
##$DECIM= 32
##$DECNUC= <off>
##$DECSTAT= 4
##$DIGMOD= 1
##$DIGTYP= 9
##$DL= (0..7)
0 120 120 120 120 120 120 120 
##$DP= (0..7)
150 150 150 150 150 150 150 150 
##$DP07= 0
##$DPNAME0= <>
##$DPNAME1= <>
##$DPNAME2= <>
##$DPNAME3= <>
##$DPNAME4= <>
##$DPNAME5= <>
##$DPNAME6= <>
##$DPNAME7= <>
##$DPOAL= (0..7)
0.5 0.5 0.5 0.5 0.5 0.5 0.5 0.5 
##$DPOFFS= (0..7)
0 0 0 0 0 0 0 0 
##$DQDMODE= 0
##$DR= 18
##$DS= 0
##$DSLIST= <SSSSSSSSSSSSSSS>
$$ [...]
##$SUBNAM0= <"">
##$SUBNAM1= <"">
##$SUBNAM2= <"">
##$SUBNAM3= <"">
##$SUBNAM4= <"">
##$SUBNAM5= <"">
##$SUBNAM6= <"">
##$SUBNAM7= <"">
##$SUBNAM8= <"">
##$SUBNAM9= <"">
##$SW= 18.0517328524113
##$SWIBOX= (0..15)
0 0 2 0 0 0 0 0 0 0 0 0 0 0 0 0 
##$SW_h= 3612.71676300578
##$TD= 16384
##$TD0= 1
##$TE= 0
##$TE2= 300
##$TE3= 300
##$TEG= 300
##$TL= (0..7)
0 120 120 120 120 120 120 120 
##$TP= (0..7)
150 150 150 150 150 150 150 150 
##$TP07= 0
##$TPNAME0= <>
##$TPNAME1= <>
##$TPNAME2= <>
##$TPNAME3= <>
##$TPNAME4= <>
##$TPNAME5= <>
##$TPNAME6= <>
##$TPNAME7= <>
##$TPOAL= (0..7)
0.5 0.5 0.5 0.5 0.5 0.5 0.5 0.5 
##$TPOFFS= (0..7)
0 0 0 0 0 0 0 0 
##$TUNHIN= 0
##$TUNHOUT= 0
##$TUNXOUT= 0
##$USERA1= <user>
##$USERA2= <user>
##$USERA3= <user>
##$USERA4= <user>
##$USERA5= <user>
##$V9= 5
##$VALIST= <valist>
##$VCLIST= <CCCCCCCCCCCCCCC>
##$VD= 0
##$VDLIST= <DDDDDDDDDDDDDDD>
##$VPLIST= <PPPPPPPPPPPPPPP>
##$VTLIST= <TTTTTTTTTTTTTTT>
##$WBST= 1024
##$WBSW= 4
##$XGAIN= (0..3)
0 0 0 0 
##$XL= 0
##$YL= 0
##$YMAX_a= 426834
##$YMIN_a= -458921
##$ZGOPTNS= <>
##$ZL1= 120
##$ZL2= 120
##$ZL3= 120
##$ZL4= 120
##$ABSF1= 10
##$ABSF2= 0
##$ABSG= 5
##$ABSL= 3
##$ALPHA= 0
##$AQORDER= 0
##$ASSFAC= 0
##$ASSFACI= 0
##$ASSFACX= 0
##$ASSWID= 0
##$AUNMP= <proc_1d>
##$AZFE= 0.1
##$AZFW= 0.1
##$BCFW= 1
##$BC_mod= 2
##$BYTORDP= 1
##$COROFFS= 0
##$CY= -3
##$DATMOD= 1
##$DC= 2
##$DFILT= <>
##$DTYPP= 0
##$F1P= 0
##$F2P= 0
##$FCOR= 0.5
##$FTSIZE= 0
##$FT_mod= 4
##$GAMMA= 1
##$GB= 0.15
##$INTBC= 1
##$INTSCL= 1
##$ISEN= 128
##$LB= 0.25
##$LEV0= 0
##$LPBIN= 0
##$MAXI= 10000
##$MC2= 0
##$MEAN= 0
##$ME_mod= 0
##$MI= 1.114404
##$NCOEF= 0
##$NC_proc= 0
##$NLEV= 6
##$NOISF1= 3.799351
##$NOISF2= 2.8
##$NSP= 1
##$NTH_PI= 0
##$NZP= 0
##$OFFSET= 14.38212
##$PC= 1
##$PHC0= -1200.591
##$PHC1= 11.5922
##$PH_mod= 1
##$PKNL= yes
##$PPARMOD= 0
##$PSCAL= 0
##$PSIGN= 0
##$REVERSE= no
##$SF= 200.129724274929
##$SI= 16384
##$SIGF1= 3
##$SIGF2= 2
##$SINO= 400
##$SIOLD= 16384
##$SREGLST= <1H.CDCl3>
##$SSB= 0
##$STSI= 0
##$STSR= 0
##$SW_p= 3205.1282051282
##$SYMM= 0
##$S_DEV= 0
##$TDeff= 0
##$TDoff= 0
##$TI= <>
##$TILT= no
##$TM1= 0
##$TM2= 0
##$TOPLEV= 0
##$USERP1= <user>
##$USERP2= <user>
##$USERP3= <user>
##$USERP4= <user>
##$USERP5= <user>
##$WDW= 1
##$XDIM= 8192
##$YMAX_p= 0
##$YMIN_p= 0
$$ End of Bruker specific parameters
$$ ---------------------------------
##NTUPLES= NMR FID
##VAR_NAME=  TIME,          FID/REAL,        FID/IMAG
##SYMBOL=    X,             R,               I
##VAR_TYPE=  INDEPENDENT,   DEPENDENT,       DEPENDENT
##VAR_FORM=  AFFN,          ASDF,            ASDF
##VAR_DIM=   8192,          8192,            8192
##UNITS=     SECONDS,       ARBITRARY UNITS, ARBITRARY UNITS
##FACTOR=    0.0002768,     1,               1
##FIRST=     0,             0,               0
##LAST=      2.2672688,     0,               0
##MIN=       0,             -458921,         0
##MAX=       2.2672688,     426834,          0
$$ Real data points
##PAGE= N=1
##DATA TABLE= (X++(R..R)), XYDATA
$$ [...]
$$ plain form
1816 295 607 486 377 189 830 349 126 175 441 -94 -185 -342 -113 -45 -614 -412 68 -305 -559 7 142
1837 142 120 178 496 278 395 172 785 247 -49 293 272 -163 -287 -336 -29 -358 -872 -367 91 -205 -102
1858 -102 -34 314 119 -72 360 467 196 334 536 688 -32 -42 -96 62 -525 -343 -111 -230 -362 -573 -300
1879 -300 -64 -265 -219 63 352 270 369 415 244 138 -22 360 -7 -172 -30 -248 -266 199 -220 -123 -462 -348
1901 -348 34 -8 -150 286 263 287 320 270 475 505 -172 216 309 -201 -94 -450 -187 -370 -352 -294 -309 -211 -340 -169
1925 -169 2 400 20 60 578 458 428 227 327 521 8 -188 44 -63 -464 -116 -375 -381 -177 -406 -268
1946 -268 67 148 -173 55 123 441 311 -62 393 441 181 -227 58 184 102 -235 -249 187 -449 -493 -441 8
1968 8 184 -504 -343 95 -84 0 267 470 532 122 -249 236 225 -143 -198 -113 103 -245 -745 -318 -82 -328
$$ packed form
1816B95L12j21j09j88O41m81k23M9K66n35r1j57K29O8n69K02M80l73k54N66J35
1837A42k2N8L18k18J17k23O13n38k96L42k1m35j24m9L07l29n14N05M58k96J03
1858a02O8L48j95j91M32J07k71J38K02J52p20j0n4J58n87J82K32j19j32k11K73
1879c00K36k01M6K82K89q2R9M6j71j06j60L82l67j65J42k18j8M65m19R7l39J14
1901c48L82m2j42M36k3K4L3n0K05L0o77L88R3n10J07l56K63j83J8N8j5R8j29J71
1925a69J71L98l80M0N18j20l0k01J00J94n13j96K32j07m01L48k59oK04k29J38
1946b68L35Q1l21K28O8L18j30l73M55M8k60m08K85J26q2l37j4M36o36m4N2M49
1968HJ76o88J61M38j79Q4K67K03O2m10l71M85j1l68n5Q5K16l48n00M27K36k46
$$ plain form
1990 -328 -371 -178 78 -23 13 -132 606 471 139 191 -41 119 -55 -200 -136 285 -575 -268 -28 -420 -143
2011 -143 -551 -50 -11 94 -78 325 329 224 -31 192 425 25 -235 95 205 -161 282 -45 -239 -132 -336
2032 -336 -65 -256 -110 -14 -68 51 379 -34 106 378 454 456 303 87 338 224 -273 -37 -72 -137 -656 -604 136
2055 136 135 -636 -185 30 85 -62 -2 294 512 310 -66 674 208 -11 -14 34 277 -81 -414 69 -67 -507
2077 -507 -338 -316 211 -160 -265 -8 96 -89 129 106 310 353 243 35 -25 -276 502 -255 -206 -289 -171 -302
2099 -302 -323 -226 -186 19 -108 10 252 157 161 395 347 291 6 70 599 -6 -167 143 195 -348 -505 -168 -111 -320
2123 -320 -388 -46 105 -8 -189 349 140 161 -70 283 500 87 276 6 -16 106 -124 -173 -127 -335 -335 -112
2145 -112 -266 -20 -92 -9 341 -70 225 220 215 228 599 209 102 191 364 29 -613 -335 -67 -337 -126 -286 -61
$$ packed form
1990c28m3J93K56j01L6j45P38j35l32N2k32J60j74j45O4M21q60L07K40l92K77
2011a43m08N01L9J05j72M03Mj05k55K23K33m00k60L30J10l66M43l27j94J07k04
2032c36K71j91J46R6n4J19L28m13J40K72P6Kj53k16K51j14m97K36l5o5n19N2P40
2055A36jp71M51K15N5j47O0K96K18k02l76P40m66k19lM8K43l58l33M83j36m40
2077e07J69K2N27l71j05K57J04j85K18k3K04M3j10k08o0k51P78p57M9q3J18j31
2099c02k1R7M0K05j27J18K42r5MK34m8n6k85O4N29o05j61L10N2n43j57L37N7k09
2123c20o8L42J51j13j81N38k09K1k31L53K17m13J89k70k2J22k30m9M6k08%K23
2145a12j54K46p2Q3L50m11K95nnJ3L71l90j07Q9J73l35o42K78K68k70K11j60K25
$$ plain form
2168 -61 -138 -390 -356 281 303 -92 59 120 -112 -24 276 268 -13 -521 178 76 154 -119 -327 164 -86 -245 -150
2191 -150 -109 -263 -49 -13 63 87 -28 231 367 324 108 223 65 -36 -149 -145 -141 -339 -330 135 -434 -258 -173 -45
2215 -45 -314 -90 64 220 182 -92 244 428 77 207 373 62 -171 -196 553 78 -255 -157 36 -147 -320
2236 -320 -198 -35 -24 139 62 336 -122 -95 324 309 147 73 -197 347 -99 80 -39 -229 -280 -175 -288 -112
2258 -112 -144 -212 -99 133 84 122 20 303 140 39 150 331 74 219 85 -98 -139 151 -113 -473 -140 -110
2280 -110 357 -103 -183 122 373 -97 186 178 46 47 137 61 363 20 13 -108 -240 -241 -303 46 -41 -58 -49 -10 -314 -27
2306 -27 42 174 -29 195 421 362 116 -51 113 -123 163 -365 271 7 -171 -314 28 -257 -311 -307 -42 132
2328 132 -96 165 326 405 -192 162 228 148 64 180 34 -85 52 -159 -195 -195 -236 -222 5 -58 -136 185 -91 -187
$$ packed form
2168f1p7k52L4O37K2l95J51O1k32Q8L00qk81n08O99j02P8k73k08M91k50j59R5
2191a50M1j54K14L6P6K4j15K59J36m3k16J15j58j01j13MMj98RM65n69J76Q5J28
2215d5k69K24J54J56l8k74L36J84l51J30J66l11k33k5P49m75l33R8J93j83j73
2236c20J22J63J1J63p7K74m58K7M19j5j62p4k70N44m46J79j19j90n1J05j13J76
2258a12l2o8J13K32m9L8j02K83j63j01J11J81k57J45j34j83m1K90k64l60L33L0
2280a10M67m60q0L05K51m70K83qj32JR0p6L02l43pj21j32jo2L49q7j7RL9l04K87
2306b7O9J32k03K24K26n9k46j67J64k36K86n28O36k64j78j43L42k85n4MK65J74
2328A32k28K61J61P9n97L54O6q0q4J16j46j19J37k11l6%m1J4K27o3p8L21k76r6
$$ plain form
2352 -187 1 154 238 262 -29 271 348 -54 -18 94 -12 -246 -33 -31 9 -335 -587 -146 -142 -108 93 176 299 -23
2376 -23 123 315 68 115 412 -137 48 -189 -21 -47 -3 -103 147 -423 -357 -45 -163 -237 35 -2 184 68
2398 68 15 25 278 223 53 191 81 84 -131 -94 -4 -53 -311 -23 -394 -52 -299 -441 101 -376 -26 58 292
2421 292 79 1 235 375 82 -25 350 19 -111 280 -148 99 -197 -421 -279 -51 -163 -21 273 157
2441 157 -28 -124 191 125 39 446 35 -84 188 220 -68 317 -94 -141 -88 -161 -178 -220 -115 -81 330 124 -48
2464 -48 -43 305 31 252 -35 33 195 -26 105 -98 108 -136 -217 -199 -180 -72 -282 -238 328 126 -163 -57 383
2487 383 27 -21 21 15 208 173 37 302 237 140 -63 -194 0 5 -182 136 91 -117 -171 166 204 276 -53 54
2511 54 249 104 339 -12 336 -131 -20 61 73 -55 -122 139 -105 142 -118 -104 -106 19 124 -33 -104 2 386
$$ packed form
2352a87J88J53Q4K4k91L00P7m02L6J12j06k34K13KM0l44k52M41ML4K01Q3J23l22
2376b3J46J92k47M7K97n49J85k37J68k6M4j00K50n70O6L12j18p4K72l7J86j16
2398F8n3J0K53n5j70J38j10Lk15L7R0m9k58K88l71L42k47j42N42m77L50Q4K34
2421B92k13p8K34J40k93j07L75l31j30L91m28K47k96k24J42K28j12J42K94j16
2441A57j85r6L15o6q6M07m11j19K72L2k88L85m11m7N3p3j7m2J05L4M11k06j72
2464d8NL48k74K21k87O8J62k21J31k03K06k44q1J8J9J08k10M4N66k02k89J06M40
2487C83l56m8M2oJ93l5j36K65o5r7k03j31J94Nj87L18m5k08n4L37L8P2l29J07
2511E4J95j45K35l51L48m67J11Q1J2j28o7K61k44K47k60J4kJ25J05j57p1J06L84
$$ plain form
2534 386 224 -37 -117 -96 -17 -45 -257 -162 -179 -172 -86 -85 -197 -145 -24 -14 -46 -93 7 54 -132 168 -98 138 293
2559 293 -106 108 243 -140 -250 -36 -22 -129 168 -154 -295 -86 31 -125 49 181 -61 303 65 -19 190
2580 190 103 -55 -85 140 219 -23 -139 -176 -137 80 -176 -45 35 -430 -81 -59 -225 178 98 6 -120 4 14
2603 14 206 -40 61 -34 57 65 118 59 48 140 -218 -296 57 -255 -89 -159 274 309 -34 161 405 132 -169 268
2627 268 307 -163 122 255 141 50 52 66 -166 -227 -132 138 219 36 71 387 -161 -87 130 284 235 5 175 188
2651 188 251 150 -242 -249 12 -54 -414 226 -353 22 -17 -53 18 28 -119 10 -124 -242 -29 241 -8 53 255
2674 255 183 51 -190 -80 16 -141 -37 34 -215 -134 -256 -4 75 -196 14 -15 -49 -136 14 153 1 9 -44 39
2698 39 -229 -199 -135 -198 -91 -123 74 -63 -356 -32 -17 244 -74 162 -43 8 -3 -143 34 -31 194 120 -381
$$ packed form
2534C86j62k61q0K1P9k8k12R5j7PQ6Jj12N2J21J0l2m7J00M7j86L00k66K36J55
2559B93l99K14J35l83j10K14J4j07K97l22j41K09J17j56J74J32k42L64k38q4K09
2580A90q7j58l0K25P9k42j16l7L9K17k56J31Q0m65L49K2j66M03q0r2j26J24J0
2603A4J92k46J01r5R1QN3n9j1R2l58p8L53l12J66p0M33L5l43J95K44k73l01M37
2627B68L9m70K85J33j14r1KJ4k32o1R5K70Q1j83L5L16n48P4K17J54m9k30J70J3
2651A88O3j01l92pK61o6l60O40n79L75l9l6P1J0j47J29j34j18K13K70k49O1K02
2674B55p2j32k41J10R6j57J04P1k49Q1j22K52P9k71K10k9l4q7J50J39j52Qn3Q3
2698C9k68L0O4o3J07l2J97j37k93L24J5K61l18K36k05N1j1j40J77o5K25p4n01
$$ plain form
2721 -381 -74 -147 -165 24 238 -407 -32 126 69 101 53 -173 -179 61 23 -30 -96 -65 -40 142 128 -106 395 -161
2745 -161 279 -21 -223 -148 -101 70 -57 -31 -153 59 231 37 105 -55 171 -98 130 0 -146 115 -111
2766 -111 205 87 -170 -92 -25 -17 -137 10 33 -249 96 -171 168 160 -33 39 181 -79 5 -21 -41 23 -232 -181
2790 -181 75 97 274 -169 169 -49 -233 178 258 3 336 131 129 73 -1 54 -25 -14 -310 -160 -164 -341 -170 61
2814 61 -292 -99 -133 97 -147 191 98 -196 149 -116 2 -406 386 -152 -98 107 131 -158 -136 -64 -72 170 36
2837 36 -234 -13 149 40 111 -73 137 116 -71 -101 249 257 7 -47 -21 -92 221 -44 37 -1 -322 -22 151 36
2861 36 78 0 -241 11 -23 46 213 -9 296 -40 57 295 -20 47 56 71 150 -27 -119 -243 -281 63 -388 72
2885 72 21 -25 -306 -144 229 37 -76 112 -24 -60 -109 -96 199 32 147 -179 -32 -201 173 112 129 -221 -102
$$ packed form
2721c81L07p3j8J89K14o45L75J58n7L2m8k26oK40l8n3o6L1K5J82j4k34N01n56
2745a61M40l00k02P5M7J71j27K6j22K12J72j94O8j60K26k69K28j30j46K61k26
2766a11L16j18k57P8O7Qj20J47K3k82L45k67L39qj93P2J42k60Q4k6k0O4k55N1
2790a81K56K2J77m43L38k18j84M11Q0k55L33k05kn6p4N5p9J1k96J50mj77J71K31
2814F1l53J93l4K30k44L38r3k94L45k65J18m08P92n38N4K05K4k89K2P2qK42j34
2837C6k70K21J62j09P1j84K10k1j87l0L50Qk50n4K6p1L13k65Q1l8l21L00J73j15
2861C6M2p8k41K52l4O9J67k22L05l36R7K38l15O7RJ5P9j77r2j24l8L44m51M60
2885G2n1m6k81J62L73j92j13J88j36l6m9J3K95j67J15l26J47j69L74o1J7l50J19
$$ plain form
2908 -102 -70 -69 -108 18 138 15 -71 -84 139 199 189 105 -255 121 46 -184 -127 -301 -43 102 -167 33 73 24
2932 24 193 68 202 -222 -185 43 202 40 124 207 -241 -31 -89 49 4 235 64 123 -74 44 87 135 -44
2955 -44 -52 114 -290 87 -34 -8 107 32 -55 -45 78 104 -35 333 -156 -68 -179 -226 -4 53 -181 54 187 -121
2979 -121 -11 44 188 24 429 79 146 158 -103 -156 250 -23 -124 -17 -44 51 -28 -66 -71 18 270 -1 201 -66
3003 -66 130 -8 199 187 -107 -91 -124 62 164 33 -30 -270 106 -33 -119 -152 -50 -76 171 -123 48 75 209
3026 209 87 58 -190 -6 34 -279 50 110 119 159 243 78 168 -137 32 176 302 169 16 -145 47 -97 45
3049 45 -7 -42 -62 141 283 -199 110 -166 144 95 -104 121 -82 96 -4 210 40 63 16 292 -162 -127 12
3072 12 -219 53 25 -248 75 83 -123 -162 25 -14 -35 -132 24 5 -98 -21 -31 -46 43 -244 -86 -61 9 261 170
$$ packed form
2908a02L2Jl9J26J20j23q6j3K23O0j0q4l60L76p5k30N7j74K58J45k69K00M0m9
2932B4J69j25J34m24L7K28J59j62Q4Q3m48K10n8J38m5K31j71N9j97J18M3M8j79
2955d4qJ66m04L77j21K6J15p5q7J0J23K6j39L68m89Q8j11m7K22N7k34K35J33l08
2979a21J10N5J44j64M05l50O7J2k61n3M06k73j01J07k7R5p9l8nQ9K52k71K02k67
3003f6J96j38K07j2k94J6l3J86J02j31o3k40L76j39q6l3J02k6K47k94J71K7J34
3026B09j22k9k48J84M0l13L29O0RM0Q4j65R0l05J69J44J26j33j53j61J92j44J42
3049D5n2l5k0K03J42m82L09k76L10m9j99K25k03J78j00K14j70K3m7K76m54L5J39
3072A2k31K72k8k73L23Qk06l9J87l9k1r7J56j9j03P7j0j5Q9k87J58K5P0K52r1
$$ plain form
3097 170 -154 -122 310 50 159 -6 146 -135 -301 -207 169 -5 123 85 97 169 3 56 -144 -171 47 142 103
3120 103 148 -235 113 206 -45 -53 30 -26 -120 89 140 157 84 137 -121 261 -76 186 -31 82 20 -69 35 -27 -34
3145 -34 160 -205 163 14 112 -18 -37 -316 -41 -101 33 134 81 -166 -67 51 -204 298 -60 64 -184 -78
3167 -78 -102 -41 135 -27 146 -15 -75 -58 -49 -102 -45 91 148 119 -285 117 -151 -105 142 -122 -104 -120 165 18 10
3192 10 -181 77 68 19 18 114 -4 102 257 121 -22 -178 65 -253 18 -108 245 122 117 168 -97 42 119 186
3216 186 -318 52 -57 18 -50 -30 -3 -172 -25 -101 -111 98 -42 -116 28 -249 -104 16 -185 29 -44 -17 -143
3239 -143 -183 -138 -104 29 8 -85 -65 130 -59 -36 -206 -70 2 91 -169 -114 -23 311 -46 232 -186 75 360 -132
3263 -132 45 32 -101 -8 55 -230 -94 -38 -73 200 -184 120 319 178 174 0 -159 116 151 -26 125 -204 -117
$$ packed form
3097A70l24L2M32k60J09j65J52k81j66R4L76j74J28l8J2P2j66N3k00k7K18R5l9
3120A03M5l83L48R3k51qQ3n6r4K09N1J7p3N3k58L82l37K62k17J13o2q9J04o2p
3145c4J94l65L68j49R8j30j9k79K75o0J34J01n3k47R9J18k55N02l58J24k48J06
3167g8k4O1J76j62J73j61o0J7Rn3N7J36N7k9m04M02k68M6K47k64J8j6K85j47q
3192A0j91K58rm9jR6j18J06J55j36j43j56K43l18K71j26L53j23nN1k65J39P7O7
3216A86n04L70j09P5o8K0K7j69J47p6j0K09j40p4J44k77J45J20k01K14p3K7j26
3239a43m0M5L4J33k1r3K0J95j89K3j70J36P2Q9k60N5R1L34l57K78m18K61K85m92
3263a32J77j3j33R3O3k85J36N6l5K73l84L04J99j41mj74j59K75L5j77J51l29Q7
$$ plain form
3286 -117 -268 79 -97 95 -152 231 -11 111 140 -117 -337 -28 -129 -179 -40 21 95 -258 -197 41 9 10 99
3309 99 14 120 54 -263 -15 -56 -121 27 -35 20 59 117 99 63 32 -111 107 -75 174 184 -10 -133 -55 -142 57
3334 57 -96 149 131 137 -123 -71 -46 -190 -61 188 280 152 11 -40 -8 -19 148 -139 80 -23 -36 51 80 64 -176
3359 -176 76 136 -96 -133 -151 241 21 -140 -154 -152 51 -177 10 35 -43 -49 154 -145 -57 172 -105 230 -121 -54
3383 -54 -33 76 -192 94 -334 14 -78 -195 -183 -213 207 82 -89 18 -58 22 92 68 169 -11 60 -32 66 337
3407 337 -206 226 279 32 -59 131 -11 80 -132 120 215 -250 87 5 296 -48 -160 -9 -114 -214 -26 51
3429 51 25 -167 17 154 -124 -105 141 -157 5 35 -184 -122 -118 -243 106 28 -29 -129 144 115 97 -23 22 -43
3453 -43 -142 -27 62 -142 -143 112 -35 -13 151 -55 38 -31 337 -100 -270 66 157 -34 63 -194 40 -4 -25 -177
$$ packed form
3286a17j51L47j76J92k47L83k42J22K9k57k20L09j01n0J39O1P4l53O1K38l2JQ9
3309I9q5J06o6l17K48m1o5J48o2N5L9N8j8l6l1j43K18j82K49J0j94j23P8q7J99
3334E7j53K45j8Ok60N2K5j44J29K49R2j28j41n1L2j1J67k87K19j03j3Q7K9j6k40
3359a76K52O0k32l7j8L92k20j61j4KK03k28J87K5p8oK03k99Q8K29k77L35l51O7
3383e4K1J09k68K86m28L48r2j17J2l0M20j25j71J07p6Q0P0k4J01j80P1r2R8K71
3407C37n43M32N3k47r1J90j42R1k12K52R5m65L37q2K91l44j12J51j05j00J88P7
3429E1k6j92J84J37k78J9K46k98J62L0k19O2Mj25L49p8n7j00K73k9j8j20M5o5
3453d3r9J15Q9k04jK55j47K2J64k06R3o9L68m37j70L36R1j91R7k57K34m4k1j52
$$ plain form
3477 -177 -66 19 -212 -337 92 27 -86 -182 47 133 -10 9 -224 -398 -119 10 -146 -14 -17 106 33 -77 -62
3500 -62 -83 -171 -122 28 -13 242 103 -167 25 144 -130 62 -76 -209 -72 -75 23 59 -54 -69 -52 78 205 165
3524 165 -344 -339 122 126 300 -2 135 4 24 -3 78 -207 -169 -279 -74 -20 -93 -113 2 -35 -47 -3 46 25 61 -4
3550 -4 -36 100 -165 25 69 190 8 -17 -277 6 10 51 145 20 261 -34 65 343 -145 -144 -333 66 85 153 -98
3575 -98 -80 22 140 38 100 328 -43 144 145 105 92 -101 -228 -90 233 170 46 -198 30 -214 117 8 2
3598 2 -86 -166 53 -18 11 -24 -13 -94 4 -64 108 -213 -200 -85 -189 -124 312 93 100 -169 -167 52 -2 -94 109 82 -219
3625 -219 -157 93 197 7 158 -137 106 -17 86 -40 -48 357 120 140 -85 77 -15 -10 171 62 88 56 -68
3648 -68 51 -3 39 52 -117 -6 36 123 10 180 -266 -25 43 165 162 -78 -102 -57 -8 229 118 278 -46 -127
$$ packed form
3477a77J11Q5k31j25M29o5j13r6K29Q6j43J9k33j74K79J29j56J32lJ23p3j10J5
3500f2k1q8M9J50m1K55j39k70J92J19k74J92j38j33J37lR8L6j13j5J7J30J27m0
3524A65n09NM61MJ74l02J37j31K0k7Q1k85L8j10K05N4p3k0J15l7j2M4M9k1L6o5
3550dl2J36k65J90M4J21j82k5k60K83MM1R4j25K41k95R9K78m88Jj89L99J9O8k51
3575i8J8J02J18j02O2K28l71J87Jm0j3j93j27J38L23o3j24k44K28k44L31j09o
3598Bq8q0K19p1K9l5J1q1R8o8J72l21J3J15j04O5M36k19Pk69KK19n4r2K03k7l01
3625b19O2K50J04j90J51k95K43j23J03j26qM05k37K0k25J62r2NJ81j09K6l2j24
3648f8J19n4M2J3j69J11M2Q7j13J70m46K41O8J22lk40k4M5M9K37j11J60l24q1
$$ plain form
3672 -127 -3 65 -161 -118 90 94 -22 -181 -81 170 229 -261 -293 22 115 162 -201 47 131 -47 55 -146 26
3695 26 -194 -193 -41 -335 -208 -45 63 -115 -97 245 -335 72 100 -3 -170 -269 24 86 60 29 7 23 278 239
3719 239 240 153 6 -63 18 270 15 179 -12 347 112 -85 -66 197 183 140 -27 -163 -69 169 221 -135 -174 80
3743 80 -45 -72 -30 182 -149 -105 157 81 49 127 -37 -44 -40 -71 -57 117 -91 -114 -34 -70 57 -10 -363 116 30 -45
3769 -45 -173 69 -363 335 46 -88 15 -48 48 52 -8 79 11 -88 147 162 -149 -35 -416 -47 -195 35 -93
3792 -93 -133 -199 198 254 -22 -59 11 -161 -66 150 201 80 136 141 -48 92 -270 90 -217 -28 -62 16 16 87 112 -67
3818 -67 365 82 -23 -71 -75 28 0 -133 13 105 22 -326 217 -33 -31 10 -4 -165 23 128 115 -92 56 -147
3842 -147 56 49 -134 103 -42 -116 86 -74 -200 -205 -300 -125 -452 153 4 86 98 -87 -259 -33 -38 -22 -82 -55
$$ packed form
3672a27J24O8k26M3K08Mj16j59J00K51N9m90l2L15R3M7l63K48Q4j78J02k01J72
3695B6k20JJ52k94J27J63J08j78J8L42n80M07K8j03j67r9K93O2k6l1k2J6K55l9
3719B39Jq7j47o9Q1K52k55J64j91L59k35j97J9K63j4m3j67j36R4K38N2l56l9K54
3743H0j25k7M2K12l31M4K62p6l2P8j64pMl1J4J74k08k3Q0l6J27o7l53M79q6p5
3769d5j28K42m32O98k89j34J03o3R6Mo0Q7o8r9K35J5l11J14l81L69j48K30j28
3792i3m0o6L97N6k76l7P0j72R5K16N1j21N6Nj89J40l62L60l07J89l4P8%P1K5j79
3818f7M32k83j05m8mJ03k8j33J46R2q3l48N43k50KM1j4j61J88J05j3k07J48k03
3842a47K03pj83K37j45p4K02j60j26nr5J75l27O05j49Q2J2j85j72K26nJ6o0K7
$$ plain form
3866 -55 132 33 107 -407 138 -49 106 -306 -30 -19 -179 28 -5 -168 -19 102 171 48 58 289 184 175 -59
3889 -59 32 137 -4 -241 -152 50 -33 -95 136 -43 248 43 -68 -174 -40 77 380 -138 -275 6 42 165
3911 165 -74 113 337 -267 57 84 265 81 66 -42 18 17 -21 -31 -51 -282 -249 -174 -77 226 221 20 -85 -41 127
3936 127 140 200 0 -95 106 -13 93 108 100 160 -71 299 196 92 -79 -53 -113 -108 -199 240 198 89 -4 263 107
3961 107 356 201 87 54 -317 201 136 -26 57 -72 45 -42 140 -102 -18 176 44 -42 -78 -110 -1 174 -181
3984 -181 -140 -170 325 209 -38 -133 36 -127 -89 -75 -161 60 61 225 102 69 -370 120 -163 0 -79 96 -88
4007 -88 92 -109 -125 -72 -54 -12 -8 -36 -129 -71 1 -12 17 -353 -72 -125 26 288 -216 156 143 -3 41 297 221 78
4033 78 210 -264 -58 75 99 -215 23 -15 -56 131 -183 254 120 -91 13 199 -159 153 -158 -136 -68 33
$$ packed form
3866e5J87r9P4n14N45j87J55m12K76J1j60K07l3j63J49J21O9j23J0K31j05rk34
3889e9R1J05j41k37Q9K02q3o2K31j79K91k05j11j06J34J17L03n18j37K81L6J23
3911A65k39J87K24o04L24K7J81j84j5j08O0jl8j0k0k31L3P5R7L03nk01j05M4J68
3936A27J3O0k00r5K01j19J06J5qO0k31L70j03j04j71K6o0Nr1M39m2j09r3K67j56
3961A07K49j55j14l3l71N18o5j62Q3j29J17q7J82k42Q4J94j32q6l6l2J09J75l55
3984a81M1l0M95j16k47r5J69j63L8J4q6K21JJ64j23l3m39M90k83J63p9J75j84
4007h8J80k01j6N3J8M2Mk8r3N8P2j3K9l70K81n3J51K62n04L72j3j46M4K56p6j43
4033G8J32m74K06J33K4l14K38l8m1J87l14M37j34k11J04J86l58L12l11K2O8J01
$$ plain form
4055 33 223 130 116 -144 261 -190 -251 56 -30 -166 123 129 45 64 137 142 215 51 -70 -117 -71 -21 61 -104 16 -72
4081 -72 -80 27 -171 139 130 111 85 -6 47 77 177 -138 -111 259 -278 -37 -27 -98 -301 -162 -260 88 -34 -5 48
4106 48 -15 5 -35 -340 78 365 84 -116 -14 -224 -44 -148 105 179 -90 -184 237 159 -7 -4 -33 -262 -51
4129 -51 -150 -98 76 -175 10 -156 -62 74 227 -166 131 -291 -241 -95 -102 89 -44 141 0 30 53 -54 -205
4152 -205 -210 233 94 208 -187 110 -22 235 250 -149 72 127 -388 -212 -231 -101 64 75 155 126 253 -174 91
4175 91 6 -75 -2 30 -13 147 31 -27 109 -56 47 2 217 114 49 -169 102 -80 -107 170 -208 241 7
4198 7 -172 -97 -43 -107 -56 -106 -327 -255 -180 103 52 -189 132 -56 -122 129 -204 13 -63 -125 38 94 -9 255 350
4223 350 30 128 86 -71 100 -17 36 -135 -150 -42 -22 -177 -290 -344 -65 -168 -120 -43 106 -147 -414 -92 148
$$ packed form
4055C3J90r3j4k60M05m51o1L07q6j36K89Oq4J9P3NP3j64j21m7M6N0Q2j65J20q8
4081g2qJ07j98L10rj9k6r1N3L0J00l15K7L70n37K41J0p1k03J39r8L48j22K9N3
4106D8o3K0m0l05M18K87k81k00J02k10J80j04K53P4k69r4M21p8j66Lk9k29K11
4129e1r9N2J74k51J85j66R4J36J53l93K97m22N0J46pJ91j33J85j41L0K3j07j51
4152b05nM43j39J14l95K97j32K57J5l99K21N5n15J76j9J30J65J1Q0k9J27m27K65
4175I1q5q1P3L2m3J60j16n8J36j65J03m5K15j03o5k18K71j82k7K77l78M49k34
4198Gj79P5N4o4N1n0k21P2P5K83n1k41L21j88o6K51l33K17p6o2J63N6j03K64R5
4223C50l20R8m2j57J71j17N3j71j5J08K0j55j13n4K79j03M8P7J49k53k67L22K40
$$ plain form
4246 148 -3 10 24 135 103 119 -34 -21 -35 -32 306 -161 -201 39 29 -152 -93 12 213 129 135 -162 182 -117 -104
4271 -104 173 -167 132 -192 -52 59 -165 79 54 158 -367 -211 -67 -195 -52 63 -8 39 -51 -147 90 -151
4293 -151 -29 -183 66 93 -191 -169 -129 -222 -113 -44 62 -63 4 -229 -106 88 54 -5 -85 301 -146 -125 208
4316 208 12 113 -134 144 40 -106 150 -15 31 -120 433 49 30 152 -91 -166 191 -58 82 -140 25
4337 25 60 171 121 100 85 143 82 64 55 67 22 -21 57 126 -10 145 -193 -230 152 -200 89 55 -162 123 11 122
4363 122 -155 117 -31 71 -168 -123 -187 -167 -180 -109 50 -166 223 -154 95 105 115 -41 -67 -53 -9 52 317 -39
4387 -39 -124 -199 -5 -197 1 -183 11 33 -45 215 -67 330 -18 -75 -60 -148 25 4 -18 -121 92 117 133 -155
4411 -155 -265 -5 -99 -40 -7 31 -144 -90 -161 270 161 -46 66 -14 152 -264 275 92 180 59 121 -46 275
$$ packed form
4246A48j51J3J4J11l2J6j53J3j4LL38m67m0K40j0j81N9J05K01q4Ok97L44k99J3
4271a04K77l40K99l24J40J11k24K44k5J04n25J56J44j28J43J15p1M7r0r6K37k41
4293a51J22j54K49K7k84K2M0r3J09O9J06j25O7k33J23J94l4n9q0L86m47K1L33
4316B08j96J01k47K78j04j46K56j65M6j51N53l84j9J22k43p5L57k49J40k22J65
4337B5L5J11n0k1j5N8o1j8rJ2m5m3P8O9j36J55l38l7L82l52K89l4k17K85j12J11
4363A22k77K72j48J02k39M5o4K0j3P1J59k16L89l77K49J0J0j56k6J4M4O1K65l56
4387c9q5p5J94j92J98j84J94K2p8K60k82L97l48n7J5q8J73k1k2j03K13K5J6k88
4411a55j10K60r4N9L3L8j75N4p1M31j09k07J12q0J66m16N39j83Q8j21O2j67L21
$$ plain form
4434 275 -96 -159 -63 -92 67 132 123 -55 -50 -73 -6 -14 11 -8 -117 199 134 158 -82 -81 -131 -62 -51 -251 7 -34 -97 73
4462 73 38 -102 -132 102 -326 23 -79 -100 -147 126 -105 59 -96 73 -231 -228 -267 -145 -133 -245 133 -104 302
4485 302 -73 -11 280 203 314 46 103 221 102 -100 179 161 -15 39 -145 -1 194 52 -324 253 -119 -110
4507 -110 -336 -68 -212 -39 92 88 4 -245 27 -332 168 -273 -101 58 157 -13 103 -143 16 -21 -99 -5
4529 -5 -238 -132 309 201 -151 -37 210 -46 133 75 174 172 4 84 -12 -75 -44 -58 -102 -128 263 0 47 -96 -116
4554 -116 16 -27 -75 -101 -92 76 20 -17 147 -19 7 -16 -145 -89 208 -81 126 187 98 166 92 48 -103 170 -124
4579 -124 60 158 283 -87 -124 342 -85 93 -50 77 112 76 217 -157 -82 9 163 -90 -266 1 100 -50
4601 -50 98 -146 28 -11 68 -97 -18 31 33 -219 -155 -9 -76 -68 288 138 -117 -79 206 -78 63 137 101 -39 74
$$ packed form
4434B75l71o3R6k9J59O5rj78Nk3O7qK5j9j09L16o5K4k40Jn0O9J1k00K58m1o3J70
4462G3l5j40l0K34m28L49j02k1m7K73k31J64j55J69l04Ll9J22J2j12L78k37M06
4485C02l75O2K91p7J11k68N7J18j19k02K79j8j76N4j84J44J95j42l76N77l72R
4507a10k26K68j44J73J31mq4k49K72l59N00m41J72J59R9j70J16k46J59l7p8R4
4529ek33J06M41j08l52J14K47k56J79n8R9kj68Q0r6o3L1j4m4k6L91k63M7j43k0
4554a16J32m3m8k6RJ68n6l7J64j66K6k3j29N6K97k89K07O1q9O8p4m4j51K73k94
4579a24J84R8J25l70l7M66m27J78j43J27L5l6J41l74P5R1J54k53j76K67R9j50
4601e0J48k44J74l9P9j65P9M9Kk52O4J46o7QL56j50k55L8K85k84J41P4l6j40J13
$$ plain form
4626 74 298 71 256 -206 234 95 -175 -63 122 20 -198 -136 92 -289 -263 -55 -286 269 10 0 49 -143
4648 -143 -56 213 -4 -74 89 -310 112 35 -183 34 -191 131 -77 14 -38 285 128 97 -168 -115 132 -230
4670 -230 139 154 -56 -2 48 -102 -89 100 -87 150 -33 -57 189 -107 259 201 81 98 209 127 -133 -131 112
4693 112 108 211 77 272 194 189 113 -121 280 45 -144 -176 -5 -223 92 -37 -96 -120 -156 -214 -244 -67 238 -159
4717 -159 164 123 26 116 -5 73 -128 152 37 -216 267 -292 88 -147 385 -39 130 19 94 207 147 -84
4739 -84 75 129 -100 -18 -186 -9 -69 93 -89 -112 166 -51 77 25 106 -43 -9 148 52 192 -130 -43 65
4762 65 249 -278 89 -96 -31 -108 -143 -57 66 108 -170 -88 169 80 37 -77 -178 -108 -46 -80 -232 -96 42 78
4786 78 -47 -33 152 209 220 28 4 -183 -186 84 -261 -28 348 92 -10 -14 -64 68 69 73 332 -34 15 267 58
$$ packed form
4626G4K24k27J85m62M40j39k70J12J85j02k18O2K28l81K6K08k31N55k59j0M9j92
4648a43Q7K69k17p0J63l99M22p7k18K17k25L22k08R1n2L23j57l1k65N3K47l62
4670b30L69J5k10N4N0j50J3J89j87K37j83k4K46k96L66n8j20J7J11q2k60KK43
4693A12mJ03j34J95p8np6k34M01k35j89l2J71k18L15j29n9k4l6n8l0J77L05l97
4717a59L23m1r7R0j21P8k01K80j15k53M83n59L80k35N32m24J69j11P5J13o0k31
4739h4J59N4k29Q2j68J77o0J62j82k3K78k17J28n2Q1j49L4J57r6J40l22Q7J08
4762F5J84n27L67j85O5p7l5Q6J23M2k78Q2K57q9m3j14j01P0O2l4j52J36J38L6
4786G8j25J4J85N7J1j92k4j87lK70l45K33L76k56j02mn0J32JMK59l66M9K52k09
$$ plain form
4811 58 79 -62 -128 -83 -124 135 -197 -173 -83 177 -67 -139 -41 -5 78 235 55 71 -115 207 16 76 -77 144
4835 144 160 -243 104 -407 160 -75 -99 176 -177 75 256 95 -15 -25 84 -94 -61 -303 78 -90 -108 -98
4857 -98 -44 -30 -122 46 -182 -39 -24 -184 -24 110 21 -183 -56 -82 -64 205 -79 -145 -161 115 -57 59 45 -161
4881 -161 73 -61 275 -45 -306 86 48 -141 -143 91 -70 51 37 140 253 127 276 162 -25 -20 99 87
4903 87 -116 -102 182 -98 52 -137 140 -85 129 7 98 -157 304 34 -166 -97 134 188 371 -51 42 -38
4925 -38 -54 -136 -327 191 -54 157 127 -251 -206 -283 50 39 -386 42 -74 164 2 -82 24 -131 129 225 62
4948 62 115 -68 -129 36 50 -149 43 -248 123 -25 -258 183 114 95 -81 9 6 214 26 34 -31 -235 -14 253
4972 253 118 88 -203 100 8 -33 -331 281 -12 150 159 169 230 78 -18 -31 17 -19 20 -124 -188 81 -245 131
$$ packed form
4811E8K1j41o6M5m1K59l32K4R0K60k44p2R8L6Q3J57j80J6j86L22j91O0j53K21
4835A44J6m03L47n11N67k35k4K75l53K52J81j61j10j0J09j78L3k42L81j68j8J0
4857i8N4J4r2J68k28J43J5j60J60J34q9k04J27k6J8K69k84o6j6K76j72J16j4k06
4881a61K34j34L36l20k61L92l8j89kK34j61J21j4J03J13j26J49j14j87NJ19j2
4903H7k03J4K84k80J50j89K77k25K14j22R1k55M61k70k00O9K31N4J83m22R3q0
4925c8j6q2j91N18k45K11l0l78M5p7L33j1m25M28j16K38j62q4J06j55K60R6j63
4948F2N3j83o1J65J4j99J92k91L71j48k33M41o9j9j76R0lK08j88Qo5k04K21K67
4972B53j35l0k91L03r2m1k98O12k93J62RJ0O1j52r6j3M8l6L9j44o4K69l26L76
$$ plain form
4996 131 -52 -24 34 -37 -125 -219 156 78 -115 86 107 -33 32 70 244 279 20 49 258 18 -17 -69 -278 162
5020 162 -50 -98 23 -54 73 -79 -111 238 272 130 100 69 -51 83 -145 -414 -48 -20 -5 18 105 233 -9
5043 -9 350 99 126 -27 181 -30 0 -51 -153 21 -67 -151 78 68 68 -156 -99 131 -119 40 47 -330 50 61 -4
5068 -4 217 25 299 -166 22 6 -21 -95 183 364 -109 -71 2 -224 43 127 -100 -68 62 -77 215 -66 -10
5091 -10 51 125 -23 -246 -121 198 -14 18 -132 187 -31 90 -4 -150 159 -37 -68 -277 -151 -220 -70 -84 96
5114 96 14 119 -4 -28 -342 -95 -95 55 -38 204 406 -20 -100 110 -51 -72 -325 -321 -141 -53 61 -183 -1 73
5138 73 161 -71 -213 114 42 173 194 360 260 -65 -26 -397 147 -175 -192 -176 -143 -223 -73 98 -64 35 66 203
5162 203 53 19 -12 37 -115 289 111 147 -388 -141 -44 150 -123 112 115 156 -199 19 -36 -125 120 227 -102
$$ packed form
4996A31j83K8N8p1q8r4L75p8j93K01K1j40O5L8J74L5k59K9K09k40l5n2k09M40
5020A62k12m8J21p7J27j52l2L49L4j42l0l1j20J34k28k69L66K8J5K3Q7J28k42
5043iL59k51K7j53K08k11L0n1j02J74q8q4K29j0%k24N7K30k50J59Pl77L80J1o5
5068dK21j92K74m65J88j6k7p4K78J81m73L8P3k26K67Q4k27L2J30j39K92k81N6
5091a0O1P4j48k23J25L19k12L2j50L19k18J21r4j46L09j96l1k09J26o9J50j4J80
5114I6q2J05j23k4l14K47%J50r3K42K02m26q0K10j61k1k53MJ80Q8J14k44J82P4
5138G3Q8k32j42L27p2J31K1J66j00l25L9l71N44l22j7J6L3q0J50J71j62R9L1J37
5162B03j50l4l1M9j52M04j78L6n35K47R7J94k73K35LM1l55K18n5q9K45J07l29
$$ plain form
5185 -102 -203 -208 -289 -24 293 15 306 215 -23 120 -106 358 -319 -183 -8 -70 -134 178 -131 109 153 -148
5207 -148 -18 50 158 64 -88 -205 -43 -236 112 -93 -17 -116 62 258 10 374 168 242 -101 -77 -118 126
5229 126 80 32 -65 114 36 -96 89 196 -10 -49 77 158 100 97 17 -58 87 -6 266 168 58 50 -48 -150 27
5254 27 223 -209 -60 179 -78 -59 251 -69 -68 9 -163 -110 132 130 -217 -239 -183 255 -183 200 106 130 125 79 -16
5279 -16 -65 -50 54 250 35 -53 115 -193 -127 214 103 -109 -173 82 -158 75 141 8 27 160 122 115 -81 36
5303 36 201 -359 2 35 -153 190 102 216 113 -25 17 124 -57 -7 -48 71 88 193 17 142 -232 304
5325 304 78 -294 -39 184 -66 8 35 -217 -121 32 130 191 -64 -23 84 10 149 -173 76 48 -155 36 -58
5348 -58 12 42 24 138 -70 -194 -317 25 -43 5 44 176 -64 246 -133 145 -112 -39 -20 4 -62 -2 219 -80
$$ packed form
5185a02j01nq1K65L17k78K91r1k38J43k26M64o77J36J75o2o4L12l09K40M4l01
5207a48J30O8J08r4j52j17J62j93L48k05P6r9J78J96k48L64k06P4l43K4m1K44
5229A26m6m8r7J79p8j32J85J07k06l9J26Q1n8lq0p5J45r3K72r8j10qr8j02J77
5254B7J96m32J49K39k57J9L10l20JP7j72N3K42kl47k2N6M38m38L83r4K4nm6r5
5279a6m9J5J04J96k15q8J68l08O6L41j11k12o4K55k40K33O6j33J9J33l8pj96J17
5303C6J65n60L61L3j88L43q8J14j03j38M2J07j81N0m1J19J7J05j76J25l74N36
5325C04k26l72K55K23k50P4K7k52R6J53R8O1k55M1J07p4J39l22K49k8k03J91r4
5348e8P0L0j8J14k08j24j23L42o8M8L9J32k40L10l79K78k57P3J9K4o6O0K21k99
$$ plain form
5372 -80 9 75 -86 -16 -21 -172 -106 -30 -137 322 -149 -171 74 198 157 -98 -1 129 56 54 -114 -31 -278 -20 58
5397 58 20 -153 4 181 -117 -97 -272 -30 162 -32 -203 -119 11 178 138 9 -155 71 -269 -208 53 -341
5419 -341 -25 -90 -259 91 36 42 -186 95 22 -16 -16 47 -156 166 201 44 -28 163 80 -110 -84 -122 119 -76 166
5444 166 350 99 -2 138 -129 207 -195 -12 58 142 193 -45 -76 20 -112 -208 -77 202 328 -164 144 83
5466 83 187 -24 245 -80 114 25 144 262 26 170 13 -123 106 82 49 53 -67 -106 -169 -40 -88 140 76
5489 76 21 93 70 70 184 11 -266 83 -155 -85 153 45 -9 -172 -68 -41 -94 -69 143 -103 -58 228 -16 23
5513 23 98 -99 -257 -21 -17 -116 -235 -241 60 270 -33 -119 112 54 -139 46 -94 115 -64 51 189 -80 30
5536 30 -47 -26 281 58 -72 -84 54 27 23 175 23 -133 48 256 28 74 -244 14 -37 131 217 146 -77 190
$$ packed form
5372h0Q9O6j61P0nj51O6P6j07M59m71k2K45J24m1k55R7J30p3kj68Q3k47K58P8
5397E8l8j73J57J77k98K0j75K42J92j94j71Q4J30J67m0j29j64K26l40O1K61l94
5419c41L16o5j69L50n5Ok28K81p3l8%O3k03L22L5j57p2J91q3j90K6l8K41j95K42
5444A66J84k51j01J40k67L36m02J83P0Q4N1k38l1R6j32r6J31K79J26m92L08o1
5466H3J04k11K69l25J94q9J19J18k36J44j57j36K29k4l3Mj20l9o3J29m8K28o4
5489G6n5P2k3%J14j73k77L49k38P0K38j08n4j63J04K7n3K5K12k46M5K86k44L9
5513B3P5j97j58K36Mr9j19oL01K10l03q6K31n8j93J85j40K09j79J15J38k69J10
5536C0p7K1L07k23j30j2J38k7mJ52j52j56J81K08k28M6l18K58n1J68Q6p1k23K67
$$ plain form
5560 190 111 98 -4 -24 56 115 -238 183 94 87 -64 -51 -24 81 -54 23 -118 78 205 -79 60 89 366 -38
5584 -38 -305 -178 1 237 -47 -38 -124 -234 39 -60 -126 10 208 41 62 -58 30 152 -109 85 89 224 92
5607 92 -112 159 -25 -344 229 91 34 368 -3 137 -150 -235 -127 -157 66 157 207 -162 166 -174 -95 -101 20
5630 20 -63 178 -67 -4 -33 -266 -22 169 -64 -154 -68 -76 -210 -1 -41 -176 -209 -80 -99 -33 29 -96 95 97 91 171
5656 171 46 26 -42 318 -54 61 -125 -77 -62 83 24 61 62 -27 69 4 12 73 74 -124 24 -241 69 6 143 -35
5682 -35 63 168 -135 -247 311 147 70 131 47 24 69 136 22 -76 -107 -85 -97 14 31 -82 -162 -88 122 135 100 126
5708 126 119 104 -28 -152 -123 -245 64 342 -283 -85 122 -51 190 -176 257 17 257 74 135 -238 -18 184
5730 184 -63 -158 -73 -222 59 -89 30 -133 188 177 -157 181 161 -18 101 -116 -106 98 108 206 114 -226 132
$$ packed form
5560A90p9j3j02k0Q0N9l53M21q9pj51J3K7J05j35P7j41J96J27k84J39K9K77m04
5584c8k67J27J79K36k84Rq6j10K73r9o6J36J98j67K1j20Q8J22k61J94MJ35j32
5607I2k04K71j84l19N73j38n7L34l71J40k87q5J08l0K23R1N0l69L28l40P9oJ21
5630B0q3K41k45O3k9k33K44J91k33r0Q6qj34K09m0j35l3J29j9O6O2j25J91KoQ0
5656A71j25k0o8L60l72J15j86M8J5J45n9L7Jq9R6o5QO1Jj98J48k65L10o3J37j78
5682c5R8J05l03j12N58j64p7O1q4k3M5O7j14r8l1K2j2J11J7j13q0P4K10J3l5K6
5708A26pj5j32j24K9j22L09K78o25J98K07j73K41l66M33k40K40j83O1l73K20K02
5730A84k47r5Q5j49K81j48J19j63L21j1l34L38k0j79J19k17J0K04J0R8r2l40L58
$$ plain form
5753 132 -132 -138 -145 -202 -186 -167 -98 55 57 -242 -47 8 105 -178 -64 98 36 18 22 131 88 -181 176 -243 -217 -81
5779 -81 -350 89 -61 212 75 -81 17 390 -151 -142 171 12 66 -15 -201 128 156 37 73 -41 324 7 150
5802 150 -113 -186 -139 100 350 -308 68 104 2 131 78 126 243 26 -214 -3 -106 36 -131 -19 -117 28
5824 28 -85 166 -42 32 30 65 177 24 -58 -164 -61 39 -213 -37 195 -114 -88 -106 30 62 -11 -338 147
5847 147 -168 -96 341 -64 -334 258 -147 -134 89 -88 -94 8 -52 168 -106 147 74 -57 -55 94 200 -180 163
5870 163 -61 -93 -72 -82 -8 253 -99 54 72 134 48 290 -127 51 -183 168 -80 170 84 192 -170 -21 -75
5893 -75 -172 77 -29 -18 -18 54 20 20 91 158 -204 150 36 -55 -81 -23 -191 -262 -155 86 226 -128 212 -22 170
5918 170 -220 -13 19 -64 -109 -162 254 73 -138 75 5 47 -110 -178 -338 128 -516 -180 -59 -152 81 19 -46
$$ packed form
5753A32k64opn7J6J9O9J53Kk99J95N5R7k83J14J62o2j8MJ09m3k69L57m19K6J36
5779h1k69M39j50K73j37j56R8L73n41RL13j59N4q1j86L29K8j19L6j14L65l17J43
5802A50k63p3M7K39K50o58L76L6j02J29n3M8J17k17k40K11j03J42j67J12r8J45
5824B8j13K51k08P4kL5J12j53q2j06J03J00k52J76K32l09K6j8J36L2p3l27M85
5847A47l15P2M37m05k70N92m05J3K23j77oJ02o0K20k74K53p3j31KJ49J06l80L43
5870A63k24l2K1j0P4K61l52J53J8O2q6K42m17J78k34L51k48K50q6J08l62J49n4
5893g5r7K49j06J1%P2l4%P1O7l62L54j14r1k6N8j68p1J07K41J40l54L40k34J92
5918A70l90K07L2q3m5n3M16j81k11K13p0M2j57o8j60M66o44L36J21r3K33o2o5
$$ plain form
5941 -46 110 50 -291 139 79 -127 -274 139 -45 -26 -72 238 -16 236 -95 -151 215 21 70 -131 113 68 -127
5964 -127 141 239 -167 -211 262 183 -141 11 -107 177 -58 -119 85 -83 -6 -219 -219 -128 147 -5 217 -99 17
5987 17 200 151 270 166 69 258 117 61 1 -119 -125 -23 44 52 -12 262 -151 123 78 -256 -173 87 45 -14 -68
6012 -68 111 -33 -153 -96 -30 -194 -98 19 -34 5 51 152 -144 107 -155 51 -287 26 114 217 -161 172 -59
6035 -59 -182 -67 53 -38 -202 329 32 368 88 -133 116 92 126 -227 63 -28 196 101 -59 -186 16 45
6057 45 -15 -201 130 258 -200 -125 -225 90 484 90 -86 -217 -129 146 -41 -187 141 -180 13 -33 118 -197
6079 -197 102 -295 274 -158 -312 -186 -96 133 9 -153 81 -171 -124 -120 -304 59 -68 -209 -54 46 -95
6100 -95 171 -107 -14 -177 99 -25 229 -159 -73 80 146 -109 74 125 -17 201 7 -76 -68 -94 -147 138 -156
$$ packed form
5941d6J56o0l41M30o0k06j47M13j84J9m6L10k54K52l31n6L66j94M9k01K44m5j95
5964a27K68R8m06m4M73p9l24J52j18K84k35o1K04j68P7k13%R1K75j52K22l16J16
5987A7J83m9J19j04r7J89j41n6o0j20oJ02O7Qo4K74m13K74m5l34Q3K60m2n9n4
6012f8J79j44j20N7O6j64R6J17n3L9M6J01k96K51k62K06l38L13Q8J03l78L33k31
6035e9j23J15J20r1j64N31k97L36k80k21K49k4L4l53K90r1K24r5j60j27K02K9
6057D5o0j86L31J28m58P5j00L15L94l94j76j31Q8K75j87j46L28l21J93m6J51l15
6079a97K99l97N69m32j54J26R0K29j24j62K34k52M7Mj84L63j27j41J55J00j41
6100i5K66k78R3j63K76j24K54l88Q6J53O6k55J83N1j42K18j94q3Qk6n3K85k94
$$ plain form
6123 -156 -194 244 -141 124 91 -169 -355 -187 -65 -66 -112 -45 141 -33 -104 222 -134 -151 -221 92 183 -128 -136 -145 48
6148 48 -114 -21 -320 -182 117 112 31 5 164 37 135 -213 -46 102 -11 -92 -196 37 -60 50 136 15 9 298
6172 298 213 79 5 13 -13 260 -81 -166 -28 -136 5 -25 48 40 111 277 -131 153 -35 150 -151 141 -24 -175
6196 -175 -22 -248 63 -70 -22 119 25 -53 -60 163 -112 31 -175 192 -50 41 -9 88 216 31 216 386 -13
6219 -13 -185 -73 -168 -21 50 98 11 154 188 -80 41 -190 -80 47 -160 75 -11 96 92 141 -30 -144 -286
6242 -286 330 -107 -224 -24 127 -192 -184 -124 143 156 -47 -62 104 -161 22 -131 -20 115 41 -93 -164 260
6264 260 92 39 -76 37 101 298 209 -4 54 380 99 111 -31 16 311 33 -121 -19 -209 -174 -79 143 70
6287 70 34 -20 60 70 233 66 91 -31 54 114 118 -125 1 -341 176 106 35 0 79 34 197 142 57 -202 -179 117
$$ packed form
6123a56l8M38l85K65l3k60j86J68J22jm6O7J86j74p1L26l56j7p0L13R1l11qrJ93
6148D8j62R3k99J38K99nq1k6J59j27R8l48J67J48j13q1j04K33r7J10Q6j21oK89
6172B98q5j34p4Qk6K73l41q5J38j08J41l0P3qP1J66m08K84j88J85l01K92j65j51
6196a75J53k26L11j33M8J41r4p8pK23k75J43k06L67k42R1n0R7J28j85J85J70l99
6219a3j72J12r5J47P1M8q7J43L4k68J21k31J10J27k07K35q6J07mM9j71j14j42
6242b86O16m37j17K00J51l19QO0K67J3k03j5J66k65J83j53J11J35p4j34p1M24
6264B60j68n3j15J13O4J97q9k13N8L26k81J2j42M7K95k78j54J02j90L5R5K22p3
6287G0l6n4Q0J0J63j67K5j22Q5O0Mk43J26l42N17p0p1l5P9m5J63n5q5k59K3K96
$$ plain form
6313 117 40 38 -160 28 -36 -93 121 146 -151 -9 171 85 -134 300 2 76 211 56 180 -8 -177 -45 -176
6336 -176 275 -112 -246 -60 -102 -92 50 57 -77 8 160 -20 -356 2 145 -47 -43 8 253 -67 -39 -248 94
6359 94 -124 128 261 -111 -19 -9 -54 -1 177 159 12 -220 -152 11 164 108 216 23 39 52 209 -210 169
6382 169 -24 244 91 71 8 58 80 58 98 -331 302 70 139 126 -95 -231 94 -266 -316 -273 -337 4 -20 -226
6406 -226 44 86 -38 9 -162 -199 111 184 -40 -53 -168 36 -61 31 -34 -102 231 48 -83 -10 118 15 0 -77
6430 -77 77 52 290 -169 96 -111 -122 72 -183 -122 -96 159 -246 73 -223 42 151 21 101 -221 -18 152
6452 152 1 -173 67 -176 -201 -189 298 120 106 158 -113 129 -231 -90 69 188 -242 358 -61 -127 -93 64
6474 64 -132 240 7 -265 -122 -155 39 180 -102 364 -35 224 -44 110 102 -19 291 253 175 -225 44 11
$$ packed form
6313A17p7kj98J88o4n7K14K5k97J42J80q6k19M34k98P4J35j55J24j88j69J32j31
6336a76M51l87j34J86m2J0J42Pj34Q5J52j80l36L58J43j92MN1K45l20K8k09L42
6359I4k18K52J33l72R2J0m5N3J78j8j47k32O8J63J53n6J08j93J6J3J57m19L79
6382A69j93K68j53k0o3N0K2k2M0m29O33k32O9j3k21j36L25l60n0M3o4L41k4k06
6406b26K70M2j24M7j71l7L10P3k24j3j15K04r7R2o5o8L33j83j31P3J28j03j5p7
6430g7J54k5K38m59K65k07j1J94k55O1K6K55m05L19k96K65J09j30Q0l22K03J70
6452A52j51j74K40k43k5J2M87j78j4N2k71K42l60J41J59J19m30O00m19o6L4J57
6474F4j96L72k33k72J43l3J94J41k82M66l99K59k68J54qj21L10l8p8m00K69l3
$$ plain form
6496 11 -17 244 119 -226 83 10 -51 -113 -12 -130 115 -290 -270 -20 95 -29 196 218 -152 -65 27 -38 102
6519 102 -245 62 108 -159 113 32 -31 18 96 68 200 -275 272 263 170 -309 152 1 264 165 -122 280 -1
6542 -1 -21 119 -152 -135 -194 158 59 -20 -35 12 -125 18 39 56 320 135 -181 61 189 -87 145 127 -225 -40
6566 -40 -118 113 141 -203 -254 54 204 109 82 -84 195 35 141 -27 -209 282 216 -189 -54 -90 35 -78 146
6589 146 -134 -140 -77 -104 -64 60 235 80 -222 2 70 1 -98 -23 -193 291 -3 15 120 -117 65 -39 -23 -213
6613 -213 -226 -64 -2 -31 53 -38 196 221 -75 -58 -12 -102 -237 28 24 -402 75 3 2 103 129 183 69 21 -72 191
6639 191 156 66 136 -172 247 112 -303 2 -9 68 93 -71 148 -44 84 -81 36 -181 -48 298 193 63
6661 63 -171 171 29 123 120 93 178 -137 -143 20 114 -199 -240 186 144 -19 -107 -70 141 -115 107 -151 -108 -36 190
$$ packed form
6496A1k8K61j25l45L09p3o1o2J01j18K45m05K0K50J15j24K25K2l70Q7R2o5J40
6519A02l47L07M6k67K72q1o3M9P8k8J32m75N47rr3m79M61j51K63r9k87M02k81
6542ak0J40k71J7n9L52r9p9j5M7j37J43K1J7K64j85l16K42J28k76K32j8l52J85
6566d0p8K31K8l44n1L08J50r5k7j66K79j60J06j68j82M91o6m05J35l6J25j13K24
6589A46k80oO3k7M0J24J75j55l02K24O8o9r9P5j70M84k94J8J05k37J82j04J6j90
6613b13j3J62O2k9Q4r1K34K5k96J7M6r0j35K65mm26M77p2jJ01K6N4j14m8r3K63
6639A91l5r0P0l08M19j35m15L05j1P7K5j64K19j92J28j65J17k17J33L46j05j30
6661F3k34L42j42R4lk7Q5l15oJ63R4l13m1M26m2j63q8L7K11k56K22k58M3P2K26
$$ plain form
6686 190 -100 80 -250 -20 66 229 181 6 -171 118 -203 163 308 -153 10 37 265 -23 118 45 112 88
6708 88 -61 212 150 -166 -40 -176 -27 104 -24 -185 -26 292 121 49 148 225 200 -87 -45 348 -253 43
6730 43 -97 -124 149 300 23 217 -197 -240 127 -86 -49 -16 -89 -343 -213 -34 3 26 81 -84 -247 -142 154
6753 154 125 101 -68 -44 145 -65 -89 105 307 -59 -375 129 136 -27 80 117 -80 -57 -284 93 99 201 -65
6776 -65 -143 -204 22 -80 -16 -183 -119 71 201 56 252 34 165 -117 79 -103 71 -73 121 209 90 -77
6798 -77 -47 93 -79 184 14 -26 99 -3 96 -141 -3 -253 46 -142 -110 290 -105 276 154 89 -57 -84
6820 -84 -258 -52 -178 184 -61 187 43 -242 163 101 2 49 90 142 241 34 142 -158 36 -64 -179 -35
6842 -35 41 56 283 -176 140 -90 -59 -199 -227 -7 19 23 -116 -153 5 -62 -139 70 -89 -277 -137 92 171 -224
$$ packed form
6686A90k90J80l30K30Q6J63m8j75j77K89l21L66J45m61J63K7K28k88J41p3O7k4
6708H8j49K73o2l16J26j36J49J31j28j61J59L18j71p2R9P7k5k87M2L93o01K96
6730D3j40k7K73J51k77J94m14m3L67k13L7L3p3k54J30J79L7K3N5j65j63J05K96
6753A54k9k4j69K4J89k10k4J94K02l66l16N04Pj63J07L7j97K3k27L77OJ02k66
6776f5p8o1K26j02O4j67O4J90J30j45J96k18J31k82J96j82J74j44J94Q8j19j67
6798g7L0J40j72K63j70m0J25j02R9k37J38k50K99j88L2M00l95L81j22o5j46k7
6820h4j74K06j26L62k45K48j44k85M05o2r9M7M1N2R9k07J08l00J94j00j15J44
6842c5P6J5K27m59L16k30L1j40k8K20K6Mj39l7J58o7p7K09j59j88J40K29P9l95
$$ plain form
6866 -224 -86 -33 -84 -145 -105 55 31 -4 -3 58 192 4 38 -111 -114 -16 -144 95 -65 296 23 153 -35 -101 37
6891 37 109 -22 -86 -76 87 -348 -124 -383 -10 119 67 165 -62 -273 -174 -122 25 -14 -8 -25 110 -130 -230 40
6915 40 -107 191 -5 -24 213 -137 27 29 75 183 90 33 -24 45 -95 -43 138 17 -146 30 -53 -95 196 134
6939 134 -154 22 -151 104 97 -237 89 -85 -79 -249 64 20 139 180 -98 1 -159 39 -196 -329 -26 -166
6961 -166 -134 138 -59 -28 159 -210 257 283 157 -164 385 94 23 -135 -27 97 33 -98 -213 -33 -161 -198
6983 -198 36 -134 0 187 25 -72 65 198 -142 104 -38 48 -25 123 -130 -15 62 46 168 -29 278 -82
7005 -82 181 84 -39 57 -44 -297 4 -110 -208 -66 -244 54 4 202 284 -117 60 24 -96 -62 87 188 82
7028 82 169 169 65 5 64 103 175 85 -74 181 46 222 124 83 182 -53 -103 88 22 -92 149 -127 -94 242 64
$$ packed form
6866b24J38N3n1o1M0J60k4l5JO1J34j88L4j49lR8j28K39j60L61k73J30j88o6J38
6891C7P2j31o4J0J63m35K24k59L73J29n2R8k27k11R9N2J47l9Oj7J35k40j00K70
6915D0j47K98j96j9K37l50J64KM6J08r3n7n7O9j40N2J81j21j63J76q3m2K91o2
6939A34k88J76j73K55pl34L26j74Oj70L13m4J19M1k78R9j60J98k35j33L03j40
6961a66L2K72j97L1J87l69M67K6j26l21N49k91p1j58J08J24o4j31j15J80j28l7
6983a98K34j70J34J87j62r7J37J33l40K46j42Q6p3J48k53J15P7j6J22j97L07l60
7005h2K63r7j23R6j01k53L01j14r8J42j78K98n0J98Q2m01J77l6j20L4J49J01j06
7028H2Q7%j04o0N9L9P2r0j59K55j35J76r8m1R9k35n0J91o6j14K41k76L3L36j78
$$ plain form
7053 64 -283 57 -92 117 15 98 -236 97 234 9 14 -191 -125 23 31 -47 223 32 -78 -53 -144 -160 291 -129
7077 -129 -159 -144 -144 -5 -133 -43 -12 -19 -235 -170 115 -252 49 -4 76 -196 38 381 -200 163 99 -26 108 63
7101 63 27 -142 282 -133 128 126 78 -24 -201 23 -190 182 83 -226 143 62 -113 19 -143 99 112 -1 -328
7124 -328 -206 -270 119 22 -137 213 74 104 -43 233 -83 19 -34 117 -31 -74 347 -9 -84 -271 138 -240
7146 -240 19 175 215 16 -61 -163 206 0 -160 -104 -55 -219 -160 -68 -230 13 -163 205 133 214 -32 101 -97
7169 -97 -271 163 -44 158 288 -23 86 -200 122 -28 188 128 -75 385 34 103 193 288 -66 65 77 -10
7191 -10 -169 52 242 -134 -27 82 75 144 -103 -16 24 81 -294 146 242 280 -157 58 -184 40 69 135 -306 -105
7215 -105 143 -23 -93 5 102 120 217 46 42 161 27 -307 87 -271 250 215 179 83 -74 -142 39 9 19 106 21
$$ packed form
7053F4l47L40j49K09j02Q3l34L33J37k25Nk05O6J48Qp8K70j91j10K5r1j6M51m20
7077a29l0J5%J39j28R0L1pk16O5K85l67L01n3Q0k72K34L43n81L63o4j25J34m5
7101F3l6j69M24m15K61km8j02j77K24k13L72r9l09L69q1j75J32j62K42J3j13l27
7124c28J22o4L89r7j59L50j39L0j47K76l16J02n3J51j48m3M21l56p5j87M09l78
7146b40K59J56M0j99p7j02L69k06j60N6M9j64N9R2j62K43j76L68p2Q1k46J33j98
7169i7j74M34k07K02J30l11J09k86L22j50K16o0k03M60l51O9R0R5l54J31J2q7
7191a0j59K21J90l76J07J09pO9k47Q7M0N7l75M40R6L8m37K15k42K24K9O6m41K01
7215a05K48j66p0R8R7J8R7j71mJ19j34l34L94l58N21l5l6r6j57o8J81l0J0Q7q5
$$ plain form
7240 21 -32 -142 97 -184 -128 199 -202 -7 -101 117 -44 -55 77 -133 -216 -197 -160 -28 105 89 27 125 -430 -96
7264 -96 32 333 120 -70 124 -121 73 139 -125 -83 -136 -35 5 -336 -8 101 -179 165 51 -277 45 127
7286 127 -82 -95 -98 18 -15 -67 -153 -39 -243 -259 -59 -42 28 6 -9 -13 177 186 75 -73 23 -104 87 143 -98 97
7312 97 -222 -70 15 -156 79 56 -169 -124 -65 7 204 -25 1 146 69 -43 -124 -181 -39 -154 -351 -37 165
7335 165 -145 -19 -140 -45 -199 -64 228 -215 90 101 -142 108 -2 18 -73 -173 213 -103 -163 65 95 162
7357 162 -200 91 -213 164 -68 -122 13 -5 -71 -32 -60 -169 -2 -16 103 -155 -79 -338 150 -92 41 68 224
7380 224 -106 -120 -349 -126 -2 -84 -44 203 276 152 132 -70 284 6 -96 -31 328 -157 -135 -20 -51 25 -21
7403 -21 -272 -101 216 -21 119 213 -72 -58 285 3 -94 -224 202 37 49 12 165 206 117 -83 22 -48 33
$$ packed form
7240B1n3j10K39k81N6L27m01J95r4K18j61j1J32k10q3J9L7J32J33j6o2R8n55L34
7264i6J28L01k13j90J94k45J94O6k64M2n3J01M0l41L28J09k80L44j14l28L22Q2
7286A27k09j3lJ16l3n2q6J14k04j6K00J7P0k2j5mJ90Rj11j48R6j27J91N6k41J95
7312I7l19J52Q5j71K35k3k25M5N9P2J97k29K6J45p7j12q1n7J42j15j97L14K02
7335A65l10J26j21R5j54J35K92m43L05J1k43K50j10K0r1j00L86l16o0K28L0O7
7357A62l62K91l04L77k32n4J35j8o6L9k8j09J67j4J19k58P6k59M88k42J33K7J56
7380B24l30j4k29K23J24q2M0K47P3j24k0k02L54k78j02O5L59m85K2J15l1P6m6
7403b1k51J71L17k37J40R4k85J4L43k82r7j30M26j65J2l7J53M1q9k00J05p0Q1
$$ plain form
7426 33 277 -140 112 18 -60 -96 -23 -295 -188 138 260 -71 -13 111 -325 189 392 -42 228 -110 181 123
7448 123 -28 37 176 -125 -285 -123 -109 -111 -64 241 242 94 287 31 -106 -4 16 174 256 150 -50 -51 -51 266
7472 266 -93 -128 11 -127 58 -188 225 58 -86 -243 -51 -167 -47 49 -18 9 283 102 -144 16 238
7493 238 -231 102 -138 14 201 -19 94 -171 -157 3 -16 -102 138 -59 -74 -82 -313 122 -112 100 -37 96
7515 96 235 -32 91 152 -59 -208 -162 62 -49 -146 85 -120 56 -186 118 -12 66 -70 177 139 45 -26 88
7538 88 136 157 -89 62 9 -77 298 19 8 -32 -55 102 123 -123 182 -206 184 -34 3 -106 -11 125 -119 -59
7562 -59 -47 -4 272 -94 -128 114 55 -120 -139 135 130 -113 95 -334 155 261 -49 -89 -147 136 -102 -480 -143
7585 -143 -237 -109 -92 16 149 93 87 -93 98 89 -284 66 -294 32 -279 32 35 145 -150 133 20 247 295
$$ packed form
7426C3K44m17K52r4p8l6P3k72J07L26J22l31N8J24m36N14K03m34K70l38K91n8
7448A23j51O5J39l01j60J62J4kM7L05Jj48J93k56j37J02K0J58Q2j06k00j%L17
7472B66l59l5J39j38J85k46M13j67j44j57J92j16J20R6o7K7K74j81k46J60K22
7493B38m69L33k40J52J87k20J13k65J4J60j9q6K40j97j5qk31M35k34K12j37J33
7515I6J39k67J23O1k11j49M6K24j11r7K31k05J76k42L04j30P8j36K47l8r4p1J14
7538H8M8K1k46J51n3q6L75k79j1m0k3J57K1k46L05l88L90k18L7j09R5J36k44O0
7562e9J2M3K76l66l4K42n9j75j9K74nk43K08m29M89J06l10m0n8K83k38l78L37
7585a43r4J28J7J08J33n6oj80J91rl73L50l60L26l11L11LJ10k95K83j13K27M8
$$ plain form
7608 295 -207 -170 -64 38 -64 -71 159 -187 62 106 -144 272 25 -340 169 -86 124 14 -122 226 59
7629 59 99 106 -65 27 71 -150 26 56 -95 46 -92 -68 214 180 25 111 -171 -37 -94 -4 5 -79 -116 183 -39
7654 -39 105 -153 91 103 18 82 113 165 -11 69 86 196 -92 166 -45 364 -175 24 56 -186 159 89 37 -10
7678 -10 -107 -11 170 68 50 -238 -12 179 205 14 178 116 -125 50 13 88 -66 57 -29 -23 -188 10 283 -189
7702 -189 68 99 -125 18 94 162 -66 -295 61 199 214 -38 100 189 29 203 -291 186 157 4 -128 12
7724 12 -67 -74 -49 43 -102 196 -206 -30 -26 -77 98 -138 -84 0 -132 158 -152 37 156 -67 130 -106 13 -28
7748 -28 -174 -130 29 -127 180 -10 167 78 13 169 -57 5 -278 -41 -111 -332 -57 -27 -24 146 -5 -49 -106 -36
7772 -36 -88 36 -17 250 -113 17 115 116 114 124 41 3 5 -26 99 -214 275 126 -280 125 87 -205 -32 103 265
$$ packed form
7608B95n02L7J06J02j02pK30l46K49M4k50M16k47l65N09k55K10j10j36L48j67
7629E9M0Pj71R2M4k21J76L0j51J41j38K4K82l4j55Q6k82J34n7R0Rq4l7K99k22
7654c9J44k58K44J2q5O4L1N2j76Q0J7J10k88K58k11M09n39J99L2k42L45p0n2m7
7678a0r7R6J81j02j8k88K26J91K6j91J64o2k41J75l7P5j54J23q6Oj65J98K73m72
7702a89K57L1k24J43P6O8k28k29L56J38J5k52J38Q9j60J74m94M77k9j53j32J40
7724A2p9pK5R2j45K98m02J76Mn1J75k36N4Q4j32K90l10J89J19k23J97k36J19m1
7748b8j46M4J59j56L07j90J77q9o5J56k26O2k83K37p0k21K75L0LJ70j51m4n7P0
7772c6n2J24n3K67l63J30R8JkJ0q3l8Kl1J25l13M89j49m06M05l8k92J73J35J62
$$ plain form
7797 265 -180 119 -296 -144 -23 -276 146 39 67 -26 85 -200 373 172 165 -216 -24 -32 168 286 -151 -90
7819 -90 -31 45 -123 11 -105 -133 240 142 63 14 -94 -109 115 92 -59 -38 266 44 -112 13 82 216 -69 -82
7843 -82 -59 -204 -40 -103 320 84 14 100 142 91 -347 -79 -298 186 -80 25 140 -88 4 34 316 185 -56
7866 -56 76 173 342 87 -94 83 9 91 -13 334 21 -130 210 29 -97 -8 68 78 147 -136 316 -101 -49
7889 -49 -38 -84 -29 -10 -350 67 -15 -10 -38 -70 -425 294 -67 25 -12 90 271 108 -151 -111 210 -147 64 -81
7913 -81 -81 58 119 64 -306 36 181 -225 67 160 133 107 -113 39 195 122 250 -165 255 69 -283 124 43
7936 43 135 10 -212 -177 -22 145 344 -140 -360 231 -237 157 -73 68 -7 102 -54 -34 -128 150 154 19 -22
7959 -22 -220 -40 -57 105 -176 150 1 -278 -73 -150 -14 -77 95 -99 -4 33 72 65 -175 -10 96 -25 110
$$ packed form
7797B65m45K99m15J52J21k53M22j07K8r3J11k85N73k01pl81J92qK00J18m37O1
7819i0N9P6j68J34j16k8L73r8p9m9j08j5K24k3j51K1L04k22j56J25O9J34k85j3
7843h2K3j45J64o3M23k36p0Q6M2n1m38K68k19M84k66J05J15k28R2L0K82j31k41
7866e6J32R7J69k55j81J77p4Q2j04L47l13j51L40j81j26Q9P6J0O9k83M52m17N2
7889d9J1m6N5J9l40M17q2Nk8l2l55P19l61R2l7J02J81j63k59M0L21l57K11j45
7913h1%J39O1n5l70L42J45m06K92R3k7k6k20J52J56p3J28m15M20j86l52M07q1
7936D3R2j25k22L5J55J67J99m84k20N91m68L94k30J41p5J09j56K0r4K78Mj35m1
7959b2j98J80j7J62k81L26j49k79K05p7J36o3J72j94R5L7L9pk40J65J06j21J35
$$ plain form
7982 110 89 93 333 18 135 223 68 -174 13 52 -352 -133 113 -112 9 -37 195 344 -71 -27 -41 -96 -60
8005 -60 8 -158 -78 -59 -188 -113 -118 -99 -292 112 -63 -71 -44 -128 40 -56 -49 -85 -176 -5 -58 96 134 -8 -60 91 53
8032 53 24 -49 93 21 48 145 72 -176 201 -99 -111 -21 -140 -178 32 152 79 -88 41 -229 -36 33 35 -61 -149
8057 -149 82 101 -4 54 -92 -69 36 129 125 71 75 216 138 99 424 262 138 -94 -167 -84 126 -205 172 -109
8081 -109 -321 61 40 -54 -68 111 -92 -172 -140 -152 -13 -24 76 279 -9 50 44 -134 -237 -12 -74 86 -226 -186
8105 -186 -26 194 -9 -183 67 -123 -13 193 -34 -318 -370 -17 119 -7 103 102 130 -169 -164 -84 172 264 194
8128 194 -16 3 31 2 96 23 61 -215 -165 25 -152 -54 -195 59 -89 160 180 83 80 16 146 -141 36 -178
8152 -178 46 -251 48 -76 -136 -152 -100 -146 7 188 54 -22 -257 -147 161 -171 46 -267 100 5 -179 10
$$ packed form
7982A10k1MK40l15J17Q8j55k42J87L9m04K19K46k25J21m6K32J49m15M4j4n5L6
8005f0O8j66Q0J9j29P5nJ9j93M04j75qK7q4J68r6Pl6r1J71n3J54L8j42n2J51l8
8032E3k9p3J42p2K7R7p3k48L77l00j2R0j19l8K10J20p3j67J29k70J93O9Kr6q8
8057a49K31J9j05N8j46K3J05R3mn4MJ41p8l9L25j62j24k32p3Q3K10l31L77k81
8081a09k12L82k1r4j4J79k03q0L2j2J39j1J00K03k88N9oj78j03K25o2J60l12M0
8105a86J60K20k03j74K50j90J10K06k27k84n2L53J36j26J10jK8k99NQ0K56R2p0
8128A94k10J9K8k9R4p3L8k76N0J90j77R8j41K54j48K49K0r7lo4J30k87J77k14
8152a78K24k97K99j24o0j6N2m6J53J81j34p6k35J10L08l32K17l13L67r5j84J89
$$ plain form
8174 10 -244 -19 116 -104 -32 -138 312 -5 105 -82 -109 -82 241 133 275 193 -20
$$ packed form
8174A0k54K25J35k20P2j06M50l17J10j87k7K7L23j08J42q2k13
8191b0
$$ Imaginary data points
##PAGE= N=2
##DATA TABLE= (X++(I..I)), XYDATA
$$ plain form
0 0 0 0 0 0 0 0 0 0 0 0 8 -8 8 -10 16 -16 24 -32 32 -40 51 -62 72 -88 102 -118 136 -160 182 -210 241 -274
32 -274 311 -352 399 -448 504 -567 632 -705 785 -871 967 -1071 1186 -1309 1447 -1592 1757
49 1757 -1935 2130 -2349 2589 -2857 3153 -3494 3876 -4314 4825 -5425 6146 -7028 8135
63 8135 -9572 11527 -14352 18803 -26903 46393 -197071 -14442 426834 39425 -302828
74 -302828 -189079 152597 122027 -4437 -38376 -49885 -90085 51394 196817 45823 -210223
85 -210223 -114816 176735 190675 -103258 -172026 18025 116002 26523 -42610 -34155 -33464 -2858
97 -2858 82327 61201 -77383 -88021 86537 122122 -23271 -76595 33780 77558 -10140 -12559
109 -12559 56573 -1209 -81670 10876 115081 -874 -139509 -38884 128208 49947 -120059
$$ packed form
0@%%%%%%%%%%Qj6J6j8K6l2M0n6O4p2R1j13J34j60J90k20K54k96L42l92M51n15
32b74N85o63P51q47R52j071J199j337J490j656J838k038K257k495K756l039L349
49A757l692M065m479M938n446O010o647P370q190R139j0250J1571j3174J5163
63H135j7707K1099k5879L3155m5706P3296k43464J82629M41276l87409l42253
74c02828J13749L41676l0570j26464l3939j1509m0200J41479J45423j50994k56046
85b10223R5407K91551J3940k93933o8768J90051R7977q9479o9133Q455O91L0606
97b858Q5185k1126j38584j0638J74558L5585j45393n3324J10375M3778q7698k419
109a2559O9132n7782q0461R2546J04205j15955j38635J00625J67092p8261j70006
$$ plain form
120 -120059 -55405 87672 38550 -65598 -4253 78295 -16540 -90579 40001 125617 -30910
131 -30910 -143717 51 129037 18509 -124575 -59211 59507 24595 -42340 -23236 -9686
142 -9686 -34158 -3061 56072 13086 -77732 -39107 79727 62833 -53105 -57800 30516 48737
154 48737 -12412 -26083 7721 -8822 -30621 14131 33222 -30266 -54080 14968 49070 -10156
166 -10156 -38328 22167 38650 -19317 -12501 53756 39078 -41214 -32719 57717 59780 -35521 -53123
179 -53123 22320 39793 -11313 -21941 6556 -3858 -27321 14613 51304 -11249 -63596 4643
191 4643 79755 30337 -55048 -31797 46888 43547 -11616 -21348 -6881 -5582 7581 20817 -9913
204 -9913 -54363 -27257 43821 30510 -49888 -55548 20699 50629 -2929 -41526 -7548 26015
$$ packed form
120a20059O4654J43077m9122j04148O1345Q2548r4835p4039J30580Q5616j56527
131c0910j12807J43768J28986j10528j43084O5364J18718l4912o6935J9104J3550
142i686k4472L1097N9133m2986r0818L8625J18834j6894j15938m695Q8316J8221
154D8737o1149j3671L3804j6543k1799M4752J9091o3488k3814O9048L4102n9226
166a0156k8172O0495J6483n7967O816O6257j4678q0292Q495R0436K063r5301j7602
179e3123P5443J7473n1106j0628K8497j0414k3463M1934L6691o2553n2347O8239
191D643P5112m9418q5385K3251P8685l341n5163r732J4467J299J3163J3236l0730
204i913m4450K7106P1078j3311q0398n660P6247K9930n3558l8597L3978L3563
$$ plain form
216 26015 13560 2136 -722 -15959 -13356 19070 24921 -21575 -48110 -1420 36640 -4063 -43119
229 -43119 -15664 18496 6728 -14003 -2357 10579 -3787 -2837 23753 17781 -13148 -9851 21930
242 21930 24663 -9220 -18765 9469 12828 -11344 -9442 6484 -1167 -15827 -3424 18586 4344
255 4344 -19153 765 25567 10379 -6971 3481 17424 8478 -3338 7572 12001 -8620 -10480
268 -10480 9962 7931 -14710 -19836 1916 12234 -10308 -19212 2294 9519 -2038 -3452 4506
281 4506 5084 -1284 4024 13559 -895 -13801 4225 14626 -4815 -20348 -8038 9619 -1696
294 -1696 -21121 -11442 4180 -1773 -7585 -3924 159 430 687 8115 7014 -5863 -190 15517 8495
309 8495 -7802 -7826 6770 9411 -8794 -13357 1082 1368 -6633 -4346 -931 -1816 -2358 3846 9750
$$ packed form
216B6015j2455j1424k858j5237K603L2426N851m6496k6535M6690L8060m0703l9056
229d3119K7455L4160j1768k0731J1646J2936j4366R50K6590n972l0929L297L1781
242B1930K733l3883r545K8234L359k4172J902J5926p651j4660J2403K2010j4242
255D344k3497J9918K4802j5188j7350J0452J3943q946j1816J0910M429k0621j860
268a0480K0442k031k2641n126K1752J0318k2542q904K1506P225j1557j414P958
281D506N78o368N308R535j4454j2906J8026J0401j9441j5533J2310J7657j1315
294a696j9425R679J5622n953n812L661M083K71K57P428j101j2877N673J5707p022
309H495j6297k4J4596K641j8205m563J4439K86q001K287L415q85n42O204N904
$$ plain form
324 9750 483 -4054 10189 14684 3365 -1671 4060 11140 4830 -5112 -639 3159 -3527 -4477 -1639
339 -1639 -2985 -5663 -4638 2471 2550 -6646 -1799 9371 5735 -964 820 6982 7827 426 -901 3909
355 3909 -695 -3949 -953 -2645 -6328 -7331 -4585 -874 -5124 -8338 -1880 1625 -943 -422 1618
370 1618 3605 2231 1178 6180 4681 -2771 -1205 3750 1266 -3853 -6967 -3369 -717 -4556 -5461
385 -5461 -4034 -4692 -797 2066 455 -549 449 4972 8269 3777 309 3343 5739 6036 1431 -3147
401 -3147 -1102 841 400 -1489 -7139 -6472 950 3143 -1944 -6407 -2140 7062 6660 531 823 3507
417 3507 5256 6951 4511 299 -2430 -1205 5139 3398 -7242 -10822 -3601 4173 1220 -10356 -10614
432 -10614 1092 5780 1096 -2748 -2132 2908 5172 4844 4393 -812 -3144 2068 5708 2469 -6024
$$ packed form
324I750r267m537J4243M495j1319n036N731P080o310r942M473L798o686r50K838
339a639j346k678J025P109P9r196M847J1170l636o699J784O162Q45p401j327M810
355C909m604l254K996j692l683j003K746L711m250l214O458L505k568N21K040
370A618J987j374j053N002j499p452J566M955k484n119l114L598K652l839r05
385e461J427o58L895K863j611j004R98M523L297m492l468L034K396K97m605m578
401c147K045J943m41j889n650O67P422K193n087m463M267R202m02o129K92K684
417C507J749J695k440m212k729J225O344j741j0640l580P221P774k953j1576k58
432a0614J1706M688m684l844O16N040K264l28m51n205k332N212L640l239q493
$$ plain form
447 -6024 -10534 -2321 4822 -1686 -10564 -9624 260 5153 -1777 -5307 94 3571 3523 3286 3972 3785 -117
464 -117 372 6938 5888 -4337 -7321 367 6567 -1951 -12492 -5159 6124 1095 -7752 -4917 4699
479 4699 6103 -2220 -1004 7629 6039 305 1547 6770 5904 -2990 -4159 5694 4454 -7364 -9090
494 -9090 266 5305 -3639 -12265 -2892 7049 1361 -4769 -2353 4978 7049 -205 -523 5788 4339
509 4339 -1056 -858 3074 3203 -5093 -7886 897 2899 -6414 -9790 -2426 4096 -1327 -8974 -884 8544
525 8544 1907 -5657 748 10734 7081 -6759 -3868 10431 7796 -6463 -8245 1818 5007 -4197
539 -4197 -9137 -285 1074 -5989 -3592 4151 3333 -4805 -5057 8510 12913 -1755 -7382 3900 12918
554 12918 5995 -7023 -4916 5549 3799 -4157 -5141 -2149 -816 -2815 -3794 531 489 -3228 -1130
$$ packed form
447f024m510Q213P143o508q878R40R884M893o930l530N401L477m8k37O86j87l902
464a17M89O566j050j0225k984P688O200q518j0541P333J1283n029q847K835R616
479D699J404q323J216Q633j590n734J242N223q66q894j169R853j240j1818j726
494i090R356N039q944q626R373R941n688o130K416P331K071p254l18O311j449
509D339n395J98L932J29q296k793Q783K002r313l376P364O522n423p647Q090R428
525H544o637p564O405R986l653j3840K891J4299k635j4259j782J0063L189r204
539d197m940Q852J359p063K397P743q18q138k52J3567M403j4668n627J1282R018
554A2918o923j3018K107J0465j750p956r84K992J333j999r79M325m2l717K098
$$ plain form
569 -1130 3873 4922 900 -2173 4549 8442 513 -3665 2557 6216 325 -8341 -4339 5985 893
584 893 -10442 -8043 2610 4667 -4542 -8833 1902 6859 -302 -2117 3685 4791 389 -680 5480
599 5480 5271 -4618 -5447 3784 4356 -4300 -9294 -3124 4366 -1156 -7892 -3649 2619 2473 -1143 -1244
615 -1244 3324 3942 1067 2639 4193 1967 544 630 2380 1435 -3696 -3941 43 410 -2572 -6036 -3722
632 -3722 2451 1633 -3144 -1923 2313 4158 2040 385 3570 3624 554 1837 3806 1314 -3236 -3695
648 -3695 1830 3067 -4804 -8381 -2113 2972 -16 -5716 -4389 1995 3644 1296 751 223 1415 4309
664 4309 4507 1838 -1985 -2055 2971 3194 -2395 -5896 -3946 502 1026 -3846 -6033 -2058 1669 2259 -698
681 -698 -1915 1282 3901 3630 2160 98 1390 3254 1776 315 -1912 -2279 -526 -208 -2788 -3912
$$ packed form
569a130N003J049m022l073O722L893p929m178O222L659n891q666M002J0324n092
584H93j1335K399J0653K057r209m291J0735M957p161j815N802J106m402j069O160
599E480k09r889q29R231N72q656m994O170P490n522o736M243O268j46l616j01
615a244M568O18k875J572J554k226j423Q6J750r45n131k45L984L67k982l464K314
632c722O173q18m777J221M236J845k118j655L185N4l070J283J969k492m550m59
648c695N525J237p871l577O268N085k988n700J327O384J649k348n45n28J192K894
664D309J98k669l823p0N026K23n589l501J950M448N24m872k187L975L727N90k957
681f98j217L197K619k71j470k062J292J864j478j461k227l67J753L18k580j124
$$ plain form
697 -3912 -3155 -291 403 -2750 -1934 1022 2692 2354 731 748 3870 3639 1499 684 776 1574 1262 -1411
715 -1411 -2178 -1701 -1583 -696 -2312 -3585 -1684 -207 -256 -322 -634 1424 3012 1837 2016 1495 1687 3048
733 3048 1299 -217 -187 -686 -967 -934 -2792 -2543 -2166 -2312 -1175 -1214 -1619 -21 533 941 2235 1133 1523
752 1523 2984 2072 1964 1337 324 283 -254 -1001 -792 -2664 -2741 -1349 -1879 -1441 -1457 -1830 -49 930 846 1655
772 1655 1110 1359 3329 2634 1162 1131 402 1515 1150 -1763 -1885 -1213 -1156 -915 -3006 -3253 -722 -480 58
791 58 129 -697 1323 2915 1781 1439 1681 1663 2969 1162 -51 -57 -776 -121 -854 -2825 -2196 -1165 -2221
810 -2221 -1354 -1741 -1393 631 296 315 1558 1278 2342 2801 1167 1493 1346 543 882 -688 -1341 -797 -1329
829 -1329 -1864 -1743 -2895 -1385 -755 -1200 -150 -483 -163 2338 2218 1412 1332 1718 2590 1919 -182 455 108
$$ packed form
697c912P57K864O94l153Q16K956J670l38j623J7L122k31k140q15R2P98l12k673
715a411p67M77J18Q87j616j273J901J477m9o6l12K058J588j175J79n21J92J361
733C048j749j516L0m99k81L3j858K49L77j46J137l9m05J598N54M08J294j102L90
752A523J461r12j08o27j013m1n37p47K09j872p7J392n30M38j6l73J781R79q4Q09
772A655n45K49J970o95j472l1p29J113l65k913j22O72N7K41k091k47K531K42N38
791E8P1q26K020J592j134l42K42j8J306j807j213op19O55p33j971O29J031j056
810b221Q67l87L48K024l35J9J243k80J064M59j634L26j47q03L39j570o53N44n32
829a329n35J21j152J510O30m45J050l33L20K501j20q06q0L86Q72o71k101O37l47
$$ plain form
848 108 -992 -533 -1328 -2154 -1697 -2461 -1173 -406 -1890 -1098 372 643 1372 1395 1364 2072 1580 1935 2835 524
868 524 -763 525 577 -283 -2275 -2668 -967 -1339 -2432 -1077 -1483 -1242 365 1274 1218 -83 293 3177
886 3177 3449 481 -185 1326 2455 690 -1790 -1211 -479 -1854 -1611 -812 -2161 -2802 -1553 707 1010
903 1010 -1751 -1128 2202 3326 1477 302 236 2254 2563 1359 -23 -1659 -949 558 -355 -1909 -2819
920 -2819 -2365 -127 37 -1221 -1280 -1680 409 3522 2595 -754 -757 2727 5327 1364 -2638 -153 2653
937 2653 526 -1976 -1965 -1287 -2181 -2677 734 969 -4289 -3768 2280 4641 65 -4121 372 6017 3081
954 3081 -1496 10 2405 1812 -348 -218 223 -2150 -3240 -41 934 -2811 -4225 -1933 2475 1788
970 1788 -2213 -1589 1654 3142 2727 -51 -423 2365 2641 1130 -521 -1144 89 -784 -1987 -389 -812
$$ packed form
848A08j100M59p95q26M57p64J288P67j484P92J470K71P29K3l1P08m92L55R00k311
868E24j287J288N2q60j992l93J701l72j093J355m06K41J607R09n6j301L76K884
886C177K72k968o66J511J129j765k480N79P32j375K43P99j349o41J249K260L03
903A010k761O23L330J124j849j175o6K018L09j204j382j636P10J507r13j554r10
920b819M54K238J64j258n9m00K089L113r27l349lL484K600l963m002K485K806
937B653k127k502J1O78q94m96L411K35n258N21O048K361m576m186M493N645k936
954C081m577J506K395n93k160J30M41k373j090L199R75l745j414K292M408o87
970A788m001O24L243J488m15k778l72K788K76j511j651o23J233q73j203J598m23
$$ plain form
987 -812 -3734 -2909 954 2144 -2154 -5096 1171 6621 1156 -3394 159 5253 3621 -1810 -625 3340
1003 3340 189 -3278 304 2254 -2517 -5928 -1585 4351 172 -7178 -2813 4965 3373 -1999 -2596
1018 -2596 2656 4559 608 158 2160 360 -528 761 1709 -470 -3516 -2829 1053 371 -2442 -3511
1034 -3511 -2210 1841 2181 -1477 -2328 874 3883 2975 -1083 -700 3423 2300 -587 -17 1052 -662
1050 -662 -3396 -1262 2768 -1228 -6194 -2148 3792 1669 -4546 -3071 4207 4221 -2027 -1034 3770 2729
1066 2729 -541 -285 3343 1419 -3084 -1647 2953 277 -4560 -3155 1259 1261 -3194 -3398 857 1350
1082 1350 -531 512 1046 1108 942 1948 2251 584 -714 1343 1257 -558 -763 -940 -1635 -1283 -758 -605
1100 -605 -2394 -2578 1355 1792 -1097 -1761 1620 3038 872 -623 2118 3233 -528 -773 1914 1260
$$ packed form
987h12k922Q25L863J190m298k942O267N450n465m550L553N094j632n431J185L965
1003C340l151l467L582J950m771l411M343N936m179p350M365P778j592n372n97
1018b596N252J903l951m50K002j800q88J289R48k179l046O87L882o82k813j069
1034c511J301M051L40l658q51L202L009r08m058L83M123j123k887N70J069j714
1050f62k734K134M030l996m966M046N940k123o215J475P278J4o248R93M804j041
1066B729l270K56L628j924m503J437M600k676m837J405M414Km455k04M255M93
1082A350j881J043N34O2j66J006L03j667j298K057q6j815k05j77o95L52N25J53
1100f05j789j84L933M37k889o64L381J418k166j495K741J115l761k45K687o54
$$ plain form
1116 1260 -2453 -2592 872 1131 -3410 -3560 834 999 -2259 -2219 995 1835 -572 -312 3198 1980 -761
1133 -761 862 2407 1241 -1457 -835 1258 106 -2689 -1502 232 -1341 -2219 -715 410 -635 -1556
1149 -1556 1100 2029 -132 -145 2014 2409 315 -7 1294 1389 -990 -563 1184 -973 -2347 -1655 191
1166 191 -917 -2853 -1067 1283 -340 -1780 671 1980 806 213 1143 2518 180 -1055 1609 1471
1182 1471 -1475 -1434 388 495 -1878 -2409 267 39 -2276 -1087 1054 396 -918 -78 2273 1604 -612
1199 -612 736 2800 770 -824 222 1665 155 -2242 -907 804 -1441 -2544 -503 36 -940 -1375
1215 -1375 37 1292 96 -339 2144 1841 30 361 1856 1551 -222 -644 908 57 -2246 -637
1231 -637 180 -1024 -2136 -1046 458 -173 -1784 -10 2018 320 -92 1485 1777 871 -309 942
$$ packed form
1116A260l713j39L464K59m541j50M394J65l258M0L214Q40k407K60L510j218k741
1133g61J623J545j166k698O22K093j152k795J187J734j573q78J504J125j045r21
1149a556K656R29k161j3K159L95k094l22J301R5k379M27J747k157j374O92J846
1166A91j108j936J786K350j623j440K451J309j174n93R30J375k338j235K664j38
1182A471k946M1J822J07k373n31K676k28k315J189K141o58j314Q40K351o69k216
1199f12J348K064k030j594J046J443j510k397J335J711k245j103K041N39r76m35
1215a375J412J255j196m35K483l03j811L31J495l05j773m22J552q51k303J609
1231f37Q17j204j112J090J504o31j611J774K028j698m12J577K92r06j180J251
$$ plain form
1247 942 2191 -530 -855 794 32 -1493 -1539 -622 66 -1865 -1789 801 112 -1030 89 1221 1132 196
1265 196 531 2158 1295 -640 522 1502 -273 -777 -488 187 -762 -2283 -770 297 -1867 -1181 213
1282 213 344 -203 -146 895 1597 95 -75 1788 855 63 282 361 317 -984 -1298 -32 -1012 -1977 -488
1301 -488 -272 -596 -968 -486 792 -5 -386 1045 1517 408 773 1116 877 344 -488 699 410 -1269
1319 -1269 -1078 123 -497 -1172 -1328 -327 99 -928 -370 879 518 126 718 1274 1292 499 587 1253 274
1338 274 -471 165 -103 -585 -883 -1119 -507 -992 -1200 -104 -32 -356 199 486 550 688 767 1201 1277 48 469
1359 469 462 -78 -376 -684 -349 -669 -1172 -737 -460 -838 -713 -446 -110 -53 58 440 1159 647 666 1091 1109 615
1381 615 591 365 272 230 -748 -685 -411 -690 -839 -1103 -749 -348 -296 87 335 380 1064 1156 445 931 633 413
$$ packed form
1247I42J249k721l25J649p62j525m6R17O88j931P6K590o89j142J119J132q9r36
1265A96L35J627q63j935J162R80j775n04K89O75r49j521J513J067k164O86J394
1282B13J31n47N7J041P02j502j70J863r33p92K19P9m4j301l14J266r80r65J489
1301d88K16l24l72M82J278p97l81J431M72j109L65L43k39n33q32J187k89j679
1319a269J91J201o20o75j56J001M26j027N58J249l61l92N92N56J8p93Q8O66r79
1338B74p45O36k68m82k98k36O12m85k08J096P2l24N55K87O4J38P9M34P6j229M21
1359D69pn40k98l08L35l20n03M35K77l78J25K67L36N7J11L82P19n12J9M25J8m94
1381F15k4k26r3m2r78O3K74k79j49k64L54M01N2L83K48M5O84R2p11M86k98k20
$$ plain form
1403 413 469 25 319 -13 -576 -488 -341 -833 -1175 -1056 -505 -415 -758 -252 568 552 479 652 792 970 528 305
1425 305 859 602 103 -493 -388 68 -429 -1444 -720 -75 -663 -1077 -760 157 738 -411 35 1066 989
1444 989 678 383 564 1319 -213 -463 551 433 -605 -1183 -729 -308 -618 -1149 -667 292 -405 -695 129
1463 129 517 770 -34 257 1497 982 71 -217 397 713 -380 -1124 76 39 -962 -1550 -857 -166 60
1482 60 -1403 -153 1023 594 -104 121 1296 1435 65 43 1350 879 -282 -706 95 496 -1037 -1770
1500 -1770 -378 12 -904 -1270 -476 697 4 -836 519 1520 372 114 501 1409 1068 -590 -223 739
1518 739 69 -778 -747 -313 -78 -1055 -1032 -48 13 -681 -203 232 503 529 209 804 1238 585 73 348 393 598
1540 598 -445 -904 -116 -269 -1058 -1164 -448 -59 -617 -1069 327 925 146 -32 498 1265 727 -250 546
$$ packed form
1403D13N6m44K94l32n63Q8J47m92l42J19N51R0l43N06Q20j6p3J73J40J78m42k23
1425C05N54k57m99n96J05M56m97j015P24O45n88m14L17R17N81j149M46J031p7
1444I89l11k95J81P55j532k50J014j18j038n78M54M21l10n31M82R59o97k90Q24
1463A29L88K53q04K91J240n15r11k88O14L16j093p44J200l7j001n88O93O91K26
1482F0j463J250J176m29o98K25J175J39j370k2J307m71j161m24Q01M01j533p33
1500a770J392L90r16l66P94J173o93q40J355J001j148k58L87R08l41j658L67R62
1518G39o70q47L1M34K35r77K3R84O1o94M78M35K71K6l20N95M34o53n12K75M5K05
1540E98j043m59P88j53p89j06P16L89n58m52J396N98p79j78N30P67n38r77P96
$$ plain form
1559 546 1139 18 -779 130 514 -249 -1102 -992 310 -468 -962 -709 167 18 -421 41 1039 595 27
1578 27 742 831 572 602 89 350 320 -543 -290 -126 -533 -581 -439 -488 -396 -268 -100 56 -166 436 639 120
1600 120 311 729 218 393 354 375 337 -643 -329 212 -396 -821 -629 -61 -200 -839 -332 464 136 -325 336
1621 336 533 706 26 123 618 661 -374 527 299 -319 -604 -556 -213 -684 -997 -400 -25 -578 -170 -51 404
1642 404 250 236 492 922 443 253 758 377 -97 -253 67 48 -636 -524 -204 -795 -848 -330 -161 -146 -238 122
1664 122 615 335 355 835 848 97 244 404 445 -179 -382 258 -210 -831 -710 -338 -298 -590 -576 192 118 -578
1686 -578 66 584 528 151 375 491 799 -109 428 284 -182 -464 -216 -324 -505 -822 -625 -413 -685 -543
1706 -543 39 146 -160 254 450 605 311 376 947 642 -294 282 324 -167 -332 -444 -97 -370 -794 -343 -165
$$ packed form
1559E46N93j121p97R09L84p63q53J10J302p78m94K53Q76j49m39M62R98m44n68
1578B7P15Q9k59L0n13K61l0q63K53J64m07m8J42m9R2J28J68J56k22O02K03n19
1600A20J91M18n11J75l9K1l8r80L14N41o08m25J92N68j39o39N07P96l28m61O61
1621C36J97J73o80R7M95M3j035R01k28o18k85M8L43m71l13N97L75n53M08J19M55
1642D04j54j4K56M30m79j90N05l81m74j56L20j9o84J12L20n91n3N18J69J5r2L60
1664A22M93k80K0M80J3p51J47J60M1o24k03O40m68o21J21L72M0k92J4P68p4o96
1686e78O44N18n6l77K24J16L08r08N37j44m66k82K48j08j81l17J97K12k72J42
1706e43N82J07l06M14J96J55k94O5N71l05r36N76M2m91j65j12L47k73m24M51J78
$$ plain form
1727 -165 -650 -282 -134 298 92 76 532 768 118 295 506 352 113 -362 -34 -99 -459 -625 -274 -480 -756
1748 -756 -541 -40 89 -242 -55 274 261 17 554 575 213 484 261 401 106 -150 -13 8 -587 -706 -239
1769 -239 -161 -378 -621 -300 351 -435 -121 435 368 133 485 421 634 100 -130 417 12 -398 -226 -456 -295
1790 -295 -695 -446 -48 -640 -109 -152 -70 191 131 421 444 405 285 494 602 -29 47 99 -50 -281 -360 -410 -191
1813 -191 -804 -591 126 -342 -424 -151 201 379 -162 341 540 555 152 500 675 260 -318 -166 19 -389 -611
1834 -611 -137 -345 -127 -330 -584 129 -293 -204 219 180 110 373 315 307 295 165 296 270 -111 -35 -74 -353 -634
1857 -634 -489 -272 -543 -664 14 151 -133 -181 243 454 334 -104 386 382 145 -87 463 74 -216 -192 -343
1878 -343 -73 -344 -562 -153 -331 -506 -50 -20 77 262 301 320 273 201 219 352 239 84 334 143 -205 -329
$$ packed form
1727a65m85L68J48M32k06j6M56K36o50J77K11j54k39m75L28o5l60j66L51k06k76
1748g56K15N01J29l31J87L29j3k44N37K1l62K71k23J40k95k56J37K1n95j19M67
1769b39P8k17k43L21O51p86L14N56o7k35L52o4K13n34k30N47m05m10J72k30J61
1790b95m00K49L98n92N31m3Q2K61o0K90K3l9j20K09J08o31P6N2j49k31p9n0K19
1813a91o13K13P17m68q2K73L52J78n41N03J99J5m03L48J75m15n78J52J85m08k22
1834f11M74k08K18k03k54P13m22Q9M23l9p0K63n8qj2j30J31k6l81P6l9k79k81
1857f34J45K17k71j21O78J37k84m8M24K11j20m38M90mk37k32N50l89k90K4j51
1878c43K70k71k18M09j78j75M56L0R7J85L9J9m7p2J8J33j13j55K50j91l48j24
$$ plain form
1900 -329 -153 3 -473 -249 -265 -328 -254 47 294 134 67 145 546 361 32 381 357 275 -270 -58 72 -232
1922 -232 -294 -294 -199 -467 -525 -506 39 -19 -173 -233 337 577 220 264 125 412 257 302 125 219 287 -244 -534 32
1946 32 26 -617 -228 -356 -179 -82 -345 82 38 -389 -61 171 495 424 135 226 613 185 -288 158 -185 64
1968 64 -295 -270 -145 -215 -242 -181 -22 151 -75 -189 499 402 42 248 526 511 282 77 225 292 89 -569 0
1991 0 -323 -424 -514 -390 69 -61 -289 81 469 247 248 -72 646 586 -39 -117 29 192 -207 -233 -213 -46 -403
2014 -403 -580 -165 -225 -115 -219 -105 351 217 2 18 339 291 304 121 407 53 -304 166 241 -466 -58 -387
2036 -387 -289 -38 -544 -651 8 -130 -230 178 -200 384 205 209 169 262 294 255 147 157 337 -420 -366 -27 29
2059 29 -333 -650 -115 79 17 -335 299 240 44 213 114 473 315 37 761 396 93 -8 31 -51 -274 -312
$$ packed form
1900c29J76J56m76K24j6o3P4L01K47j60o7P8M01j85l29L49k4q2n45K12J30l04
1922b32o2%R5k68n8J9N45n8j54o0N70K40l57M4j39K87j55M5j77R4O8n31k90N66
1946C2oo43L89j28J77R7k63M27m4m27L28K32L24p1k89R1L87m28m73M46l43K49
1968F4l59K5J25p0k7O1J59J73k26j14O88r7l60K06K78j5k29k05J48O7k03o58N69
1991@l23j01r0J24M59j30k28L70L88k22Jl20P18o0o25p8J46J63l99k6K0J67l57
2014d03j77M15o0J10j04J14M56j34k15J6L21m8J3j83K86l54l57M70P5p07M08l29
2036c87R8K51n06j07O59j38j00M08l78N84j79Mm0R3L2l9j08J0J80p57N4L39N6
2059B9l62l17N35J94o2l52O34n9j96J69r9L59j58k78P24l65l03j01L9q2k23l8
$$ plain form
2081 -312 -319 -175 -259 -300 111 -297 137 -70 -17 21 89 46 205 -91 107 318 -182 151 -108 24 194 -326 -261
2104 -261 -350 -260 -415 -248 -22 74 -117 125 310 -297 -81 197 199 -17 120 -55 122 -292 -447 178 69 -228
2126 -228 -167 -163 -114 -308 -153 32 -49 -145 201 414 240 347 81 236 236 -51 198 17 59 -304 -235 -281 -386 -387
2150 -387 -179 -79 -179 -67 255 347 -66 282 397 355 -17 211 186 47 -118 95 63 -30 -228 -239 -231 54 -282
2173 -282 24 20 -315 -330 -91 99 -6 -82 119 329 80 31 230 -59 14 46 -184 -34 -217 -140 -138 0 -355
2196 -355 -111 196 111 -213 9 462 124 -11 329 70 57 52 98 329 -10 -163 -24 -191 -400 -323 42 -422
2218 -422 -174 -342 308 322 -138 11 172 189 177 21 226 409 -87 71 277 -79 -114 -157 25 -19 -423 -188
2240 -188 90 51 -343 59 -115 -17 282 142 190 46 -123 331 -13 98 24 53 -84 -476 -258 19 -66 -585
$$ packed form
2081c12pJ44q4m1M11m08M34k07N3L8O8m3J59k96J98K11n00L33k59J32J70n20O5
2104b61q9R0j55J67K26R6j91K42J85o07K16K78Kk16J37j75J77m14j55O25j09k97
2126b28O1MM9j94J55J85q1r6L46K13j74J07k66J55%k87K49j81M2l63O9m6j05j
2150c87K08J00j00J12L22R2m13L48J15m2l72K28k5j39j65K13l2r3j98j1QK85l36
2173b82L06ml35j5K39J90j05p6K01K10k49m9J99k89P3L2k30J50j83P7KJ38l55
2196c55K44L07q5l24K22M53l38j35L40k59j3nM6K31l39j53J39j67k09P7L65m64
2218d22K48j68O50J4m60J49J61J7j2j56K05J83m96J58K06l56l5m3J82m4m04K35
2240a88K78l9l94M02j74R8K99j40M8j44j69M54l44J11p4K9j37l92K18K77q5n19
$$ plain form
2262 -585 99 -91 -236 -180 45 86 -52 -9 90 290 155 -528 37 177 117 -230 -117 -104 -72 -182 -145 -25 -282
2285 -282 -25 -194 7 -409 -117 217 142 -412 86 43 372 212 52 137 86 -56 -193 -155 -199 -94 -342 -154
2307 -154 -235 -244 -19 71 120 16 -48 225 71 327 72 129 262 -39 404 0 -114 -278 -202 76 -219 -334 -247
2330 -247 77 -173 42 -308 151 -115 -56 269 283 122 -21 126 194 -76 48 -41 117 -157 -206 42 -394 -77
2352 -77 -163 95 -178 -83 189 361 35 38 305 165 239 391 231 158 -270 40 168 165 -51 4 98 271 -194 -433
2376 -433 -126 151 -212 57 -54 129 -124 151 290 61 237 20 52 -31 59 -289 -181 -145 -208 -103 -66 -138
2398 -138 27 -74 -467 44 260 360 85 -34 173 374 353 -19 32 84 352 -93 -133 -131 -418 -355 -70 42
2420 42 -352 -120 309 -126 -270 -286 377 260 196 171 80 -33 96 -186 54 80 -313 -81 -83 -146 -423 -30 5
$$ packed form
2262e85O84j90j45N6K25M1j38M3R9K00j35o83N65J40o0l47J13J3L2j10L7J20k57
2285b82K57j69K01m16K92L34p5n54M98m3L29j60j60Q5n1j42j37L8m4J05k48J88
2307a54q1rK25R0M9j04o4K73j54K56k55N7J33l01M43m04j14j64P6K78k95j15Q7
2330b47L24k50K15l50M59k66N9L25J4j61j43J47O8k70J24q9J58k74m9K48m36L17
2352g7q6K58k73R5K72J72l26LK67j40P4J52j60p3m28L10J28lk16N5R4J73m65k39
2376d33L07K77l63K69j11J83k53K75J39k29J76k17L2q3R0l48J08L6o3J05L7p2
2398a38J65j01l93N11K16J00k75j19K07K01k1l72N1N2K68m45m0Kk87O3K85J12
2420D2l94K32M29m35j44j6O63j17o4k5r1j13J29k82K40K6l93K32ko3k77L93L5
$$ plain form
2443 5 -72 53 -118 -12 -131 257 315 -2 -72 49 335 213 222 -57 298 -198 -27 -15 -133 175 -80 83 -79
2466 -79 -14 11 -19 107 -290 24 264 34 246 4 8 68 147 -224 124 -88 -17 -128 -131 208 -45 100 -70 -263
2490 -263 212 140 -19 343 227 -182 160 139 55 169 107 10 165 17 -17 68 72 -127 -216 -197 -169 47 222 12
2514 12 205 148 211 -188 245 308 -43 -142 -85 133 154 -247 202 207 -77 82 -157 41 -54 -193 -104 82 171 -26
2538 -26 116 150 248 489 75 171 207 -236 -139 -155 -165 -248 -74 -197 -4 -312 -284 -47 137 108 -232 111 61 -29
2562 -29 274 278 122 65 2 -385 89 -246 -69 -132 -21 2 -41 -231 -251 6 -300 -93 -29 123 -160 376 -40
2585 -40 10 88 126 272 13 -112 138 14 -10 -134 -174 -77 -1 -186 -323 -297 -163 39 93 3 -175 122 232 63
2609 63 -240 -73 90 253 -226 213 53 -147 -64 -120 70 78 -84 -74 81 -50 -89 -84 -246 -107 -91 -53 -3 -9 366
$$ packed form
2443Ep7J25j71J06j19L88N8l17p0J21K86j22Rk79L55m96J71J2j18L08k55J63j62
2466g9O5K5l0J26l97L14K40k30K12k42MO0P9l71L48k12P1j11lL39k53J45j70j93
2490b63M75p2j59L62j16m09L42k1q4J14o2r7J55j48l4Q5Mj99q9J9K8K16J75k10
2514A2J93n7O3l99M33O3l51r9N7K18K1m01M49Nk84J59k39J98r5j39Q9J86Q9j97
2538b6J42L4R8K41m14R6L6m43R7j6j0q3J74j23J93l08K8K37J84k9l40L43n0r0
2562b9L03Mj56n7o3l87M74l35J77o3J11K3m3j90k0K57l06K07O4J52k83N36m16
2585d0N0P8L8J46k59j25K50j24k4j24m0R7P6j85j37K6J34K02N4r0j78K97J10j69
2609F3l03J67J63J63m79M39j60k00Q3n6J90Qj62J0J55j31l9Nj62J39J6L8N0oL75
$$ plain form
2634 366 73 79 -20 -11 -112 -55 -25 -9 -172 -579 76 94 -235 131 13 228 -145 -42 153 152 125 50 -164 22
2658 22 -42 -29 -205 -131 1 -146 -164 -136 -142 -518 36 172 -229 -129 -199 78 -80 272 89 81 125 -23 -193 73
2682 73 -12 -199 5 -287 23 -290 208 -278 142 73 -140 356 -33 102 90 101 -70 250 120 -96 -85 70
2704 70 -46 56 -156 -155 74 -492 -61 101 76 54 -52 525 83 13 -89 65 97 189 107 56 9 -122 -148 53
2728 53 -25 36 170 -237 -266 -197 114 159 128 287 362 5 165 27 127 184 242 13 41 -22 -70 -100 -113 -54 -63 -433
2754 -433 -35 -16 -236 71 281 -42 -44 -38 51 -5 57 25 103 146 103 -153 -90 71 47 -177 -200 -246 -2 113 -108
2779 -108 -175 -164 -108 4 -166 78 220 281 232 96 -2 -96 72 -129 -101 94 -103 -60 -52 168 70 -242 48 -179
2803 -179 -30 153 -116 -142 36 -68 146 22 141 -38 138 -133 63 -203 -92 84 -153 23 -251 -27
$$ packed form
2634C66k93Or9Rj01N7L0J6j63m07O55J8l29L66j18K15l73J03J95jk7p5k14J86
2658B2o4J3j76P4J32j47j8K8ol76N54J36m01J00p0K77j58L52j83qM4j48j70K66
2682G3q5j87K04k92L10l13M98m86M20o9k13M96l89J35j2J1j71L20j30k16J1J55
2704G0j16J02k12JK29n66M31J62k5k2j06N77m42p0j02J54L2R2q2n1m7j31k6K01
2728E3p8O1J34m07k9O9L11M5l1J59P5l57J60j38J00N7N8k29K8o3m8l0j3N9rl70
2754d33L98J9k20L07K10l23kOQ9n6O2l2P8M3m3k56O3J61k4k24k3m6K44J15k21
2779a08o7J1N6J12j70K44J42O1m9j36r8r4J68k01K8J95j97M3QK20r8l12K90k27
2803a79J49J83k69k6J78j04K14j24J19j79J76k71J96k66J11J76k37J76k74K24
$$ plain form
2823 -27 -352 -317 60 -211 -44 -36 129 96 71 140 -35 -102 -41 141 -80 17 -116 59 -92 -236 -81 103 -57
2846 -57 -19 -25 23 -54 99 -118 7 -37 -47 -46 49 -69 135 -239 61 -255 46 172 -27 93 -201 -73 166 -25
2870 -25 41 -62 -51 402 158 153 53 44 80 116 137 -2 -89 -39 -205 51 -67 -147 92 33 -82 -31 -43 -9 36 116
2896 116 -186 -77 37 88 -21 -163 68 105 53 -186 -198 -150 60 -32 -149 -159 94 44 17 -42 -60 163 25 -61
2920 -61 -198 12 88 -90 153 24 -69 79 -285 -34 -44 -172 -13 -38 49 167 101 -70 119 83 116 -104 27
2943 27 165 -172 -291 -354 212 -6 127 32 10 127 -85 -72 -35 84 -230 46 -326 51 110 149 236 289 -62
2966 -62 -148 -37 -230 -170 -167 -81 44 -138 6 -168 186 -282 -43 -59 -137 -54 -134 -83 330 250 90 -131 174 -244
2990 -244 -177 -57 142 50 -129 52 27 -136 46 -184 -21 -122 -111 -31 12 233 226 33 92 -29 -88 -40 74 -98
$$ packed form
2823b7l25L5L77k71J67QJ65l3k5O9j75o7O1J82k21R7j33J75j51j44J55J84j60
2846e7L8oM8p7J53k17J25m4j0JR5j18K04l74L00l16L01J26j99J20k94J28K39j91
2870b5O6j03J1M53k44nj00rL6L6K1j39q7N0j66K56j18q0K39n9j15N1j2L4M5Q0
2896A16l02J09J14N1j09j42K31L7n2k39j2M8K10r2j17j0K53n0k7n9j8K23j38q6
2920f1j37K10P6j78K43j29r3J48l64K51j0j28J59k5Q7J18o6j71J89l6L3k20J31
2943B7J38l37j19o3N66k18J33r5k2J17k12J3L7J19l14K76l72L77N9L9Q7N3l51
2966f2q6J11j93O0LQ6J25j82J44j74L54m68K39j6p8Q3q0N1M13q0j60k21L05m18
2990b44O7J20J99r2j79J81k5j63J82k30J63j01J1Q0M3K21pj93N9j21n9M8J14j72
$$ plain form
3014 -98 -15 -48 61 -207 49 -295 145 -144 -233 -167 -247 21 71 -243 -28 96 -61 28 81 110 -190 246 33
3037 33 -9 -38 14 75 200 93 54 -97 -15 21 3 -72 -44 -11 -171 50 222 90 -27 121 150 81 63 -114 62
3062 62 152 92 -117 -81 -28 371 -87 253 175 -20 158 -180 278 21 112 91 118 126 377 52 83 -132 71 22
3086 22 -277 157 -225 44 -15 -85 -197 -28 198 -241 31 -38 161 142 -238 123 -203 7 -95 -120 -62 -205
3108 -205 -233 -146 45 7 -141 185 56 -30 102 -95 7 42 -254 20 -101 39 -70 80 222 -53 27 -280
3130 -280 18 -75 -16 -113 64 239 -121 353 186 -247 -23 -208 -181 -8 161 43 -78 -124 181 227 35 -11
3152 -11 147 136 -259 -35 11 273 -83 -2 -147 -162 187 -55 54 69 58 283 451 72 -46 -208 -330 302
3174 302 -136 113 100 -167 -49 -166 184 -174 -268 -60 -16 8 -295 -185 -18 -233 10 -38 115 -70 -33 112
$$ packed form
3014i8Q3l3J09k68K56l44M40k89q9O6q0K68N0l14K15J24j57Q9N3K9l00M36k13
3037C3m2k9N2O1J25j07l9j51Q2L6j8p5K8L3j60K21J72j32j17J48K9o9j8j77J76
3062F2R0o0k09L6N3L99m58L40p8j95J78l38M58k57R1k1K7QK51l25L1k15K03m9
3086B2k99M34l82K69n9p0j12J69K26m39K72o9J99j9l80L61l26K10j02k5N8j43
3108b05k8Q7J91l8j48L26j29q6J32j97J02L5k96K74j21J40j09J50J42k75Q0l07
3130b80K98r3N9r7J77J75l60M74j67m33K24j85K7J73J69j18j21m6L05M6j92m6
3152a1J58j1l95K24M6K62l56Q1j45j5L49k42J09J5j1K25J68l79j18j62j22O32
3174C02m38K49j3k67J18j17L50l58r4K08M4K4l03J10J67k15K43m8J53j85L7J45
$$ plain form
3196 112 51 -170 70 120 -9 126 106 30 198 82 288 153 -196 -169 -39 220 -162 -49 -158 151 229 8
3218 8 133 4 -213 200 -45 97 -203 -1 145 -283 167 27 93 151 45 53 228 203 211 124 -64 60 126 -88
3242 -88 -33 -45 -198 157 -256 85 -2 178 -25 58 -185 48 45 -292 193 -204 93 -49 115 -40 -234 -15
3264 -15 225 -166 20 -110 -122 -107 244 -84 -54 56 -136 -94 -224 6 -167 -181 -27 -66 15 -172 -16 -147 -190
3287 -190 -46 -55 12 -100 157 -43 67 29 -93 61 -86 -227 138 127 -134 97 -76 43 -204 -44 111 -289
3309 -289 16 -19 107 -91 67 -285 267 -4 -50 -73 -84 -14 117 96 90 -132 248 339 2 26 198 187 22 -187
3333 -187 -2 -8 -240 -22 -104 184 55 -101 -44 124 121 141 0 304 -154 40 79 287 92 -46 295 -157 -98
3356 -98 -316 -82 -29 40 67 107 -29 -157 -341 -27 203 159 65 -185 88 -55 -170 -121 -126 308 -7 157 88 84
$$ packed form
3196A12o1k21K40N0j29J35k0p6J68j16K06j35l49K7J30K59l82J13j09L09P8k21
3218HJ25j29k17M13k45J42l00K02J46m28M50j40O6N8j06QJ75k5Qq7j88J24O6k14
3242h8N5j2j53L55m13L41q7J80k03Q3k43K33ll37M85l97K97j42J64j55j94K19
3264a5K40l91J86j30j2J5L51l28L0J10j92M2j30K30j73j4J54l9Q1j87J56j31m3
3287a90J44rO7j12K57k00J10l8j22J54j47j41L65j1k61K31j73J19k47J60J55m00
3309b89L05l5J26j98J58l52N52k71m6k3j1P0J31k1ok22L80R1l37K4J72j1j65k09
3333a87J85ok32K18q2K88j29j56N7J68lK0j41L04m58J94L9K08j95j38L41m52N9
3356i8k18K34N3O9K7M0j36j28j84L14K30m4r4k50K73j43j15M9nM34l15J64o9m
$$ plain form
3380 84 67 92 -93 -79 122 -148 53 238 -107 -253 -188 -50 66 354 43 6 -110 70 208 -233 -21 -106
3402 -106 2 31 236 -139 176 -59 87 84 208 137 89 37 6 69 88 296 187 64 -91 125 145 -82 17 174
3426 174 188 -97 -184 116 -165 -42 16 -48 131 -68 -243 -201 -53 -152 -58 165 -62 33 228 96 -105 92 233
3449 233 158 44 -16 83 58 -27 6 0 -95 27 -60 46 185 -76 -32 -60 58 15 176 -26 -25 264 44 -170 66
3474 66 56 0 78 73 6 41 228 158 -48 -148 34 -169 -360 -76 -64 38 -193 306 -156 196 48 227 85
3497 85 68 -82 193 56 -146 -10 33 268 134 -28 -146 -126 195 -21 46 -30 61 373 44 106 75 -172 5
3520 5 160 83 -1 -81 -196 -91 193 -33 -160 193 67 179 -176 -138 59 -107 -18 320 -11 76 66 -120 19
3543 19 88 227 43 24 -132 -91 121 273 -1 -30 70 -20 40 -17 -173 -270 -355 -37 109 85 48 -6 -42 -245 -50
$$ packed form
3380H4j7K5j85J4K01k70K01J85l45j46O5J38J16K88l11l7j16J80J38m41K12q5
3402a06J08K9K05l75L15k35J46lJ24p1m8n2l1O3J9K08j09j23j55K16K0k27R9J57
3426A74J4k85q7L00k81J23N8o4J79j99j75M2J48r9R4K23k27R5J95j32k01J97J41
3449B33p5j14o0R9k5q5L3or5J22q7J06J39k61M4k8J18m3J61k02JK89k20k14K36
3474F6j0n6P8no7L5J87p0k06j00J82k03j91K84J2J02k31M99m62L52j48J79j42
3497H5j7j50K75j37k02J36M3K35j34j62j18K0L21k16O7p6R1L12l29O2l1k47J77
3520EJ55p7q4q0j15J05K84k26j27L53j26J12l55L8J97j66Q9L38l31Q7j0j86J39
3543A9O9J39j84j9j56M1K12J52k74k9J00r0O0n7j56r7q5L18J46k4l7n4l6k03J95
$$ plain form
3568 -50 -29 -177 -93 -47 102 -112 126 74 -110 91 45 -68 205 198 -57 42 38 -77 -60 -37 -33 88 -186 -53 6
3593 6 -118 -10 190 -168 83 -113 124 -128 -92 -28 -75 3 -7 -125 -192 54 -217 -237 -184 -41 -47 -287 46 -289
3617 -289 92 -9 -18 -14 -184 -62 96 229 -5 167 52 -158 53 -124 32 -87 -50 -86 29 113 157 11 -141
3640 -141 -99 -111 260 107 23 35 122 127 -8 114 -114 -225 -109 19 116 92 -20 -22 31 76 176 172 -47 22 -75 13
3666 13 -53 -87 -61 93 148 -207 -85 -75 109 81 -94 -62 46 -284 -46 76 -128 -166 -163 -8 -193 -30 51 -97
3690 -97 88 -56 -160 206 -125 -136 -224 158 34 -141 -216 -130 120 -203 13 -8 -112 -12 -126 183 65 -80
3712 -80 53 131 -263 -25 86 59 268 158 115 14 93 -30 198 94 104 -49 13 -236 226 -54 -141 127 296
3735 296 239 -145 50 83 -110 -43 -43 -293 234 31 -108 -149 -79 -38 125 -268 33 7 108 -197 213 62 -149
$$ packed form
3568e0K1j48Q4M6J49k14K38n2j84K01m6j13K73pk55R9mj15J7K3MJ21k74J33N9
3593Fj24J08K00l58K51j96K37k52L6O4m7P8j0j18o7K46k71k0N3J43ok40L33l35
3617b89L81j01rMj70J22J58J33k34J72j15k10K11j77J56j19L7l6J15Q4M4j46j52
3640a41M2j2L71j53q4J2Q7Nj35J22k28j11J16J28R7k4j12kN3M5J00mk19O9r7Q8
3666A3o6l4K6J54N5l55J22J0J84k8j75L2J08l30K38J22k04l8LJ55j85J63Q1j48
3690i7J85j44j04L66l31j1q8L82j24j75p5Q6K50l23K16k1j04J00j14L09j18j45
3712h0J33P8l94K38J11k7K09j10m3j01P9j23K28j04J0j53O2k49M62k80q7K68J69
3735B96n7l84J95L3j93O7%k50N27k03j39m1P0M1J63l93L01k6J01l05M10j51k11
$$ plain form
3758 -149 -43 141 15 -90 55 388 -280 -235 207 60 -298 16 -82 103 -103 -67 -51 -99 -153 61 -152 213
3780 213 179 228 -115 -12 145 -117 -182 -103 56 -90 -185 187 211 45 -168 23 -127 294 -102 -163 3 60 -96
3803 -96 -73 -33 120 47 -234 -17 160 -171 -64 -40 1 -165 -251 -98 -56 -299 -10 -25 -146 -133 102 -33 168
3826 168 -204 89 286 131 85 6 -71 39 -72 150 313 -142 52 -71 242 -113 -22 -352 17 75 -184 155
3848 155 -164 66 234 75 -109 -77 89 -100 23 -147 308 169 -56 -99 93 -23 33 53 -287 -218 -38 -129
3870 -129 -94 89 173 222 217 -72 -28 145 115 -35 -8 -38 -72 -231 15 157 -15 -9 -4 79 82 108 5 -68 223 66
3896 66 -13 223 -3 -69 63 -95 -189 -356 -165 -201 17 25 -201 -29 107 -80 -43 23 -11 265 162 -47 26 -269
3920 -269 -62 -337 -11 209 158 162 -40 56 -144 -159 -50 -150 -151 -133 40 189 -61 -127 148 -81 136 77 -13 67
$$ packed form
3758a49J06J84j26j05J45L33o68M5M42j47l58L14r8J85k06L6J6m8n4K14k13L65
3780B13l4M9l43J03J57k62o5P9J59j46r5L72K4j66k13J91j50M21l96o1J66N7j56
3803i6K3M0J53p3k81K17J77l31J07K4M1j66q6J53M2k43K89j5j21J3K35j35K01
3826A68l72K93J97j55m6p9p7J10j11K22J63m55J94j23L13l55R1l30L69N8k59L39
3848A55l19K30J68j59j84L2J66j89J23j70M55j39k25m3J92j16N6K0l40O9J80r1
3870a29L5J83Q4M9nk89M4J73l0j50K7l0l4j59K46J42j72ONQ3LK6j03p3K91j57
3896F6p9K36k26o6J32j58r4j67J91l6K18Qk26J72J36j87L7O6l4K76j03k09P3k95
3920b69K07k75L26K20n1Mk02R6k00j5J09j00jJ8J73J49k50o6K75k29K17n9r0Q0
$$ plain form
3944 67 -185 46 -179 -118 37 43 -192 -194 275 147 45 -33 109 -4 -214 264 124 99 -13 153 174 -166 26
3967 26 119 -110 138 70 21 81 96 62 -114 -247 100 47 18 99 25 20 129 -54 -381 124 -63 158 -141 10
3991 10 -335 117 -26 177 -146 142 231 -73 309 -227 -28 173 1 91 -84 121 283 -91 -75 -23 56 -208
4013 -208 -141 -27 53 93 -88 88 -216 -188 21 -143 -25 -385 244 -79 -74 188 18 -362 -6 103 75 -22 48
4036 48 -129 -64 -130 161 142 -65 278 -106 -180 49 -170 96 160 -253 75 -118 -85 -408 161 -26 7 -101 -36
4059 -36 58 170 -168 -21 -162 -118 -186 175 120 -69 -179 216 74 117 -39 -2 133 108 76 106 -294 -142 -52 -194
4083 -194 -59 -95 -371 -174 -75 -14 76 -26 -41 17 -42 8 52 43 1 12 57 110 142 -32 -90 -88 29 -192 -8 -50 120
4110 120 -233 49 155 148 -62 5 -85 -4 91 21 22 -138 216 -61 -91 -51 2 -195 -45 -231 67 150 149 129 23
$$ packed form
3944F7k52K31k25O1J55Ok35kM69j28j02p8J42j13k10M78j40k5j12J66K1l40J92
3967B6R3k29K48o8m9O0J5l4j76j33L47n3k9Q1p4nJ09j83l27N05j87K21k99J51
3991A0l45M52j43K03l23K88Q9l04L82n36J99K01j72R0j75K05J62l74J6N2P9k64
4013b08O7J14Q0M0j81J76l04K8K09j64J18l60O29l23NK62j70l80L56J09k8r7P0
4036D8j77O5o6K91j9k07L43l84p4K29k19K66O4m13L28j93L3l23N69j87L3j08O5
4059c6R4J12l38J47j41M4o8L61n5j89j10L95j42M3j56L7J35k5l2L0m00J52R0j42
4083a94J35l6k76J97R9O1R0j02j5N8n9N0M4rm2J1M5N3L2j74n8KJ17k21J84m2J70
4110A20l53K82J06pk10O7r0Q1R5p0Jj60L54k77l0M0N3j97J50j86K98Q3jk0j06
$$ plain form
4135 23 -40 -352 -25 -80 203 14 330 32 -170 -85 201 -178 -237 -279 -44 97 52 102 -127 10 -51 41 -40 -17
4159 -17 100 128 -111 94 1 -108 25 99 -71 0 58 189 -138 -254 -171 4 -216 -227 194 -42 -50 140 47 -95
4183 -95 110 146 -82 341 177 15 124 25 52 -269 -123 -239 -251 56 -209 -6 -383 126 -67 18 101 -34
4205 -34 193 -131 -264 53 25 -136 -125 -198 155 81 82 -104 87 22 -19 -186 -84 94 74 14 10 -80 41 -127 -59
4230 -59 82 -88 -25 239 -50 103 170 -166 -94 -154 -187 322 162 94 -98 -76 16 81 -294 -45 174 24 282
4253 282 -64 92 97 -132 54 85 273 77 -159 132 3 -68 -129 179 150 94 140 -102 198 225 204 -270 -231 119
4277 119 400 -52 -53 -19 109 -41 41 -66 -358 -121 159 93 61 67 70 -262 -23 102 -159 256 58 105 152 -108
4301 -108 -50 -295 242 -66 -44 194 -123 -50 -86 -67 242 63 60 134 290 197 -103 14 -18 224 -164 63 -28 -172
$$ packed form
4135B3o3l12L27n5K83j89L16k98k02Q5K86l79n9m2K35J41m5N0k29J37o1R2q1K3
4159a7J17K8k39K05r3j09J33P4j70P1N8J31l27j16Q3J75k20j1M21k36qJ90r3j42
4183i5K05L6k28M23j64j62J09r9K7l21J46j16j2L07k65K03l77N09j93Q5Q3j35
4205c4K27l24j33L17k8j61J1p3L53p4Jj86J91o5m1j67J02J78k0o0mr0J21j68O8
4230e9J41j70O3K64k89J53O7l36P2o0l3N09j60o8j92K2R2O5l75K49K19j50K58
4253B82l46J56Nk29J86L1J88j96k36K91j29p1o1L08k9n6M6k42L00K7k1m74L9L50
4277A19K81m52jL4J28j50Q2j07k92K37K80o6l2OLl32K39J25k61M15j98M7M7k60
4301a08N8k45N37l08K2K38l17P3l6J9L09j79lP4J56r3l00J17l2K42l88K27r1j44
$$ plain form
4325 -172 42 -33 -64 -176 -169 -190 -56 -260 144 112 112 -14 107 40 190 -109 7 -57 281 -55 63 -167 -80 132
4349 132 -133 74 -192 -172 -255 -101 -234 -80 -10 242 -63 -101 -180 -59 165 -91 -74 114 -227 26 -49 -38 147
4372 147 116 63 -62 -69 -130 -429 -17 13 346 154 -261 132 -92 32 -133 -78 140 24 192 150 118 252 55
4395 55 0 -176 22 184 124 200 56 -242 49 -244 -160 32 -8 -33 -91 102 124 -59 26 -91 -297 181 269 -15
4419 -15 54 116 -164 -29 -302 140 -12 243 121 -13 111 214 286 314 -164 253 -68 43 -170 -190 62 100
4441 100 73 90 98 -22 155 78 -197 -159 -185 53 -113 84 -106 21 230 0 118 -214 -306 -61 -125 50 5
4464 5 -201 167 120 40 11 -34 16 -93 -134 -69 -111 -146 218 -20 -15 119 -107 -45 49 11 -208 34 13 171 -78 -34
4490 -34 -75 194 124 -47 -2 83 155 104 -166 -41 -46 0 187 -272 7 156 397 -162 -58 -407 -329 -51 117 -18
$$ packed form
4325a72K14p5l1j12Pk1J34k04M04l2%j26J21o7J50k99J16o4L38l36J18k30Q7K12
4349A32k65K07k66K0q3J54j33J54P0K52l05l8p9J21K24k56J7J88l41K53p5J1J85
4372A47l1n3j25po1k99M12L0L33j92m15L93k24J24j65N5K18j16J68m2l2J34j97
4395E5n5j76J98J62o0P6j44k98K91k93Q4J92m0k5n8J93K2j83Q5j17k06M78Q8k84
4419a5O9O2k80J35k73M42j52K55j22j34J24J03P2K8m78M17l21J11k13k0K52L8
4441A00k7J7Qj20J77p7k75L8k6K38j66J97j90J27K09k30J18l32r2K45o4J75m5
4464Ek06L68m7q0k9m5N0j09m1O5m2l5L64k38NJ34k26O2R4l8k19K42k1J58k49M4
4490c4m1K69p0j71M5Q5P2n1k70J25nM6J87m59K79J49K41n59J04l49P8K78J68j35
$$ plain form
4514 -18 -125 -95 80 82 -18 -160 22 174 242 -50 -14 30 44 -25 224 147 -56 -109 -174 18 -249 -226 94 219
4538 219 178 54 -118 -63 224 -75 109 -269 -210 -198 125 191 -241 -56 -309 -98 105 -227 23 226 -73 75
4560 75 61 -78 54 31 131 179 122 -206 -310 293 25 -57 55 -338 236 13 4 21 -187 -139 -4 74 -56 28
4584 28 -111 285 92 -119 69 -73 86 38 -89 -114 -145 30 218 -191 55 15 -381 -85 73 108 -56 51
4606 51 -19 3 237 147 -139 270 101 219 5 257 -77 14 -27 31 47 44 77 -101 -138 158 -91 -9 -115 124
4630 124 -108 303 113 156 -35 156 89 -157 15 0 87 87 162 156 117 17 -173 144 113 11 -274 -64 -35 366
4654 366 -218 18 -1 118 -35 153 -89 19 -68 115 -1 -257 -28 -244 -129 172 102 -96 10 -189 110
4675 110 163 -5 68 156 -17 88 -134 2 310 178 -312 61 72 136 -77 -44 -166 78 254 -37 -92 333
$$ packed form
4514a8j07L0J75Kj00j42J82J52O8k92L6M4J4o9K49p7k03n3o5J92k67K3L20J25
4538B19m1j24j72N5K87k99J84l78N9J2L23O6m32J85k53K11K03l32K50K03k99J48
4560G5j4j39J32k3J00M8n7l28j04O03k68q2J12l93N74k23rJ7k08M8J35P8j30Q4
4584B8j39L96j93k11J88j42J59m8j27k5l1J75J88m09K46m0l96K96J58L5j64J07
4606E1p0K2K34r0k86M09j69J18k14K52l34R1m1N8J6lL3j78l7K96k49Q2j06K39
4630A24k32M11j90M3j91J91o7k46J72j5Q7%P5ol9j00j90L17l1j02k85K10K9M01
4654C66n84K36j9J19j53J88k42J08q7J83j16k56K29k16J15L01p0j98J06j99K99
4675A10N3j68P3Q8j73J05k22J36L08j32m90L73J1O4k13L3j22K44J76k91n5M25
$$ plain form
4697 333 -66 156 175 -75 236 -2 119 38 -218 77 -74 23 -154 82 -234 -40 35 -44 1 -42 -139 181 -26
4720 -26 -16 211 -179 117 -24 168 15 -116 -98 -206 -3 123 -182 -263 121 -5 -136 1 157 104 -39 196
4742 196 -85 -104 -103 164 15 -101 178 131 91 115 31 -72 -114 -174 -6 -6 25 34 119 -118 -110 101 -83 114 -176 -77
4768 -77 124 -122 -195 42 67 14 -66 -129 152 382 58 -115 -18 111 189 -119 264 223 8 -23 93 45 100 -29
4792 -29 -121 -26 3 -10 -259 -66 81 -78 -287 12 -191 -168 341 36 262 -95 95 211 247 242 -88 105 -273
4815 -273 -172 88 -42 -85 -102 47 -125 34 -39 113 -151 121 -13 -117 -142 -76 -121 -318 145 397 -140 85
4837 85 112 137 -94 84 148 108 -21 195 40 -99 -234 -113 -48 -149 -84 -67 -113 -81 -44 -157 -35 13 139 177
4861 177 -275 128 127 58 -95 -203 107 8 -107 113 117 -93 17 -144 1 32 -11 -131 174 -318 -205 241 189
$$ packed form
4697C33l99K22J9k50L11k38J21q1k56K95j51R7j77K36l16J94P5p9M5m3r7L20k07
4720b6J0K27l90K96j41J92j53j31J8j08K03J26l05q1L84j26j31J37J56n3j43K35
4742A96k81j9JK67j49j16K79m7m0K4q4j03m2o0J68%L1RQ5k37QK11j84J97k90R9
4768g7K01k46p3K37K5n3q0o3K81K30l24j73R7J29P8l08L83m1k15l1J16m8N5j29
4792b9r2R5K9j3k49J93J47j59k09K99k03K3N09l05K26l57J90J16L6nl30J93l78
4815b73J01K60j30m3j7J49j72J59p3J52k64K72j34j04k5O6m5j97M63K52n37K25
4837H5K7K5k31J78O4m0j29K16j55j39j35J21O5j01O5J7m6L2L7j13J22M8J26L8
4861A77m52M03jo9j53j08L10r9j15K20Mk10J10j61J45L1m3j20L05m92J13M46n2
$$ plain form
4884 189 -79 29 126 70 -49 42 103 -128 197 -155 37 134 -33 -186 32 30 1 248 -148 79 -29 131 -39
4907 -39 137 -186 -331 -28 86 9 139 -147 -277 18 -52 105 -147 109 79 71 62 95 -36 -69 -31 83 -117 -180
4931 -180 107 -237 -253 -159 158 142 -53 130 152 -103 -73 219 1 -264 -215 -90 218 366 178 41 322 -119
4953 -119 273 20 -137 -100 56 198 -60 -23 -22 135 1 7 211 -58 98 7 -119 0 392 116 -250 -42
4975 -42 -54 -69 -253 -13 89 88 -3 296 127 -91 -171 113 -106 -134 50 -17 -161 -97 -95 79 -321 113 -266 114
4999 114 -41 54 -127 -126 30 -214 219 -121 61 -107 62 -24 -111 114 -86 -54 -29 207 87 111 422 55 -244
5022 -244 -161 -101 -19 222 -263 -200 59 -164 83 -85 125 35 -42 52 -86 -121 49 274 114 -47 16 -286 209
5045 209 -247 155 170 30 -97 -218 1 11 75 -8 26 -418 54 63 -51 57 90 -17 -229 -100 84 -187 122
$$ packed form
4884A89k68J08R7n6j19R1O1k31L25l52J92R7j67j53K18kk9K47l96K27j08J60j70
4907c9J76l23j45L03J14p7J30k86j30K95p0J57k52K56l0qrL3j31l3L8J14k00o3
4931a80K87l44j6R4L17j6j95J83K2k55L0K92k18k65M9J25L08J48j88j37K81m41
4953a19L92k53j57L7J56J42k58L7JJ57j34OK04k69J56r1j26J19L92k76l66K08
4975d2j2j5j84K40J02jr1K99j69k18q0K84k19k8J84o7j44O4KJ74m00M34l79L80
4999A14j55R5j81JJ56k44M33l40J82j68J69q6q7K25k00L2K5K36j20K4L11l67k99
5022b44Q3O0Q2K41m85O3K59k23K47j68K10r0p7R4j38l5J70K25j60j61O3l02M95
5045B09m56M02J5j40j27j21K19J0O4q3L4m44M72Rj14J08L3j07k12J29J84k71L09
$$ plain form
5068 122 -53 -383 -79 -98 -16 -144 6 -2 -158 38 382 -298 267 60 -98 136 320 107 -59 -202 -116 94
5090 94 -77 -262 -242 128 -68 77 -88 -51 -30 -70 -110 -226 -57 155 177 69 125 38 -55 7 172 -58 38 15
5114 15 320 -201 -188 44 102 -42 -75 -186 79 -319 95 0 77 212 -59 185 249 -130 -15 -344 117 48 -116
5137 -116 -40 76 -135 -167 155 206 -183 10 83 54 186 103 -242 -26 276 82 48 26 156 -130 -116 113 60
5160 60 -211 -231 63 -165 203 242 171 -13 182 -133 5 -106 -323 -12 -30 -118 -231 -169 -117 -41 45 -208 -61
5183 -61 -173 115 11 -17 -191 -51 50 99 316 129 -18 46 -158 12 -98 -89 317 266 41 221 -77 -104 -146
5206 -146 19 95 -51 201 308 104 -27 183 -16 208 -188 -56 -86 -133 35 -80 201 -78 -107 -71 4 29
5228 29 49 132 44 9 28 -2 80 -117 166 -99 66 -352 60 -454 -344 -11 122 -4 110 181 -128 317 31
$$ packed form
5068A22j75l30L04j9Q2j28J50qj56J96L44o80N65k07j58K34J84k13j66j43Q6K10
5090I4j71j85K0L70j96J45j65L7K1m0m0j16J69K12K2j08N6q7r3O2J65k30R6k3
5114A5L05n21J3K32N8j44l3j11K65l98M14r5P7J35k71K44O4l79J15l29M61o9j64
5137a16P6J16k11l2L22N1l89J93P3k9J32q3l45K16L02j94l4k2J30k86J4K29n3
5160F0k71k0K94k28L68L9p1j84J95l15J38j11k17L11j8q8j13O2N2P6Q6k53J47
5183f1j12K88j04k8j74J40J01M9K17j87j47O4k04J70j10RM06n1k25J80k98k7m2
5206a46J65P6j46K52J07k04j31K10j99K24l96J32l0m7J68j15K81k79k9L6P5K5
5228B9K0Q3q8l5J9l0Q2j97K83k65J65m18M12n14J10L33J33j26J14P1l09M45k86
$$ plain form
5251 31 -170 -112 -35 231 293 -255 132 -75 -82 72 31 -248 35 219 71 -15 214 -111 28 -58 -12 -36 -102 85
5275 85 -96 257 109 -77 -23 117 188 -19 -54 35 -14 31 214 -97 40 -201 -155 -8 -166 -49 -21 -188 -127
5298 -127 -346 75 -239 38 155 110 133 357 -53 -36 -190 28 -71 104 -158 -143 -38 -135 31 -97 -179 86
5320 86 67 167 243 -118 -161 -56 -167 265 153 -234 -185 -111 161 -14 25 -21 220 -56 -2 24 -138 -131 -52 -50 102
5345 102 -117 -195 113 224 -80 10 123 80 13 -287 -295 -107 -79 -121 95 -63 112 226 -22 126 -244 -117 -208
5368 -208 180 258 -72 49 -73 143 -77 -231 80 -126 45 16 -182 153 134 -22 -82 137 183 -13 260 -262
5390 -262 -38 -48 -181 142 54 46 -66 113 -396 140 -207 -198 80 -69 -124 -159 127 119 108 -9 125 7 193 -166
5414 -166 -49 126 164 -60 215 269 -145 59 -63 94 198 -89 -112 -47 -45 42 -91 -118 -249 348 -118 -123 7
$$ packed form
5251C1k01N8P7K66O2n48L87k07pJ54m1k79K83J84j48q6K29l25J39q6M6k4o6J87
5275H5j81L53j48j86N4J40P1k07l5Q9m9M5J83l11J37k41M6J47j58J17K8j67O1
5298a27k19M21l14K77J17m5K3K24m10J7j54K18r9J75k62J5J05r7J66j28q2K65
5320H6j9J00P6l61m3J05j11M32j12l87M9P4K72j75L9m6K41k76N4K6j62PP9KJ52
5345A02k19p8L08J11l04R0J13m3o7l00qJ88K8m2K16j58J75J14k48J48l70J27r1
5368b08L88P8l30J21j22K16k20j54L11k06J71k9j98L35j9j56o0K19M6j96K73n22
5390b62K24j0j33L23q8qj12J79n09N36l47RK78j49n5l5K86qj1j17J34j18J86l59
5414a66J17J75L8k24K75N4m14K04j22J57J04k87k3O5KQ7j33k7j31N97m66nJ30
$$ plain form
5437 7 44 21 16 209 316 -34 69 -39 -86 -113 -145 -90 -81 -68 158 309 54 6 259 137 301 103 151 36 48
5462 48 206 117 20 -7 58 -50 286 -39 -7 102 13 94 200 -65 6 -103 -3 -68 132 155 279 -68 -191 -28
5486 -28 40 43 -65 129 71 104 40 213 396 24 -103 205 125 -176 157 -180 -73 227 241 174 2 76 52 -24
5510 -24 5 49 -438 6 -10 189 -140 -38 -30 -142 26 24 348 139 94 223 398 -201 86 95 18 71 21 -89 221
5535 221 74 143 135 -125 144 -6 132 -41 49 -88 143 -153 -135 327 5 -2 -76 -95 141 62 253 218 -10 263
5559 263 97 -105 36 220 96 -215 94 -7 207 -70 24 -46 -122 272 -80 126 -32 -149 -36 -128 178
5580 178 -25 144 -96 257 226 171 -139 -254 -181 -242 -77 139 5 55 -59 -68 -197 97 56 96 -68 111 175
5603 175 -74 -41 -246 62 -9 103 150 2 82 73 -49 -30 258 -139 178 342 204 57 123 2 226 -3 154
$$ packed form
5437GL7k3nJ93J07l50J03j08m7k7l2N5RJ3K26J51k55m8K53j22J64j98M8j15J2
5462D8J58q9r7k7O5j08L36l25L2J09q9Q1J06k65P1j09J00o5K00K3J24l47j23J63
5486b8O8Lj08J94n8L3o4J73J83l72j27L08q0l01L33l37J07L00J4o7j72P4k4p6
5510b4K9M4m87M44j6J99l29J02Qj12J68kL24k09m5J29J75n99K87Rp7N3n0j10L10
5535B21j47O9qk60K69j50J38j73R0j37K31k96J8M62l22pp4j9K36p9J91l5k28K73
5559B63j66k02J41J84j24l11L09j01K14k77R4p0p6L94l52K06j58j17J13r2L06
5580A78k03J69k40L53l1n5l10j15P3o1J65K16j34N0j14rj29K94m1M0j64J79O4
5603A75k49L3k05L08p1J12M7j48Q0rj22J9K88l97L17J64j38j47O6j21K24k29J57
$$ plain form
5626 154 -3 -62 -61 41 49 -65 133 56 42 -225 -70 -163 142 57 -23 28 123 107 151 -62 100 83 115 -210 -46
5651 -46 -104 -28 38 -106 105 -38 -24 81 34 -120 8 -87 50 43 46 62 -11 -59 16 -46 -39 194 51 -54 182 -2
5677 -2 -258 -80 -128 40 -110 100 96 162 4 -142 -20 111 21 16 22 -39 93 222 -127 -126 182 -105 112 0 -26
5702 -26 -93 -157 -159 132 30 120 132 -135 16 50 98 10 165 -183 -117 146 55 -294 -136 19 -63 -112 168 0 24
5727 24 150 64 221 225 69 151 -105 164 -49 -116 50 11 -31 31 -63 37 78 -44 92 -113 218 108 226 -97
5751 -97 84 74 -115 265 -232 -213 -188 219 -93 -47 107 -8 -102 -47 -51 -58 -10 -36 -191 352 -6 263 5 70 59
5776 59 -122 141 7 70 303 -68 149 167 238 112 -76 -120 -157 -77 31 179 60 54 172 -57 -286 -15 -99
5799 -99 92 299 -192 245 23 -158 233 92 -106 -299 210 -292 181 96 -137 24 -204 -230 100 -142 -131
$$ packed form
5626A54j57n9JJ02Qj14J98p7j4k67J55r3L05q5q0N1R5j6M4k13J62j7L2l25J64
5651d6n8P6O6j44K11j43J4J05m7j54J28r5J37pLJ6p3m8P5o2PK33j43j05K36j84
5677bk56J78m8J68j50K10mO6j58j46J22J31r0nOo1J32J29l49JL08k87K17j12k6
5702b6o7o4kK91j02R0J2k67J51L4M8q8J55l48O6K63r1l49J58J55q2m9K80j68K4
5727B4J26q6J57Mj56Q2k56K69k13o7J66l9m2O2r4J00M1j22J36k05L31j10J18l23
5751i7J81j0j89L80m97J9K5M07l12M6J54j15r4N5mpM8k6j55N43l58K69k58O5j1
5776E9j81K63j34O3K33l71K17J8P1j26j88m4l7Q0J08J48j19oJ18k29k29K71q4
5799i9J91K07m91M37k22j81L91j41j98j93N09n02M73q5k33J61k28k6L30k42J1
$$ plain form
5820 -131 -177 55 -165 325 -90 7 -190 91 78 120 115 -137 -206 227 -45 16 193 87 100 -172 37 -3 65 -32
5844 -32 26 91 -131 50 5 -24 -82 94 65 9 -130 105 163 84 -251 153 78 116 77 9 -77 44 -168 15 -58
5869 -58 7 -151 -187 40 74 45 126 38 184 -171 173 -145 -133 -2 -225 141 106 -137 60 119 -122 112 102 -63
5893 -63 -129 -57 -186 -93 355 156 -39 -134 46 206 55 -88 -146 -156 254 0 134 -55 151 -69 -5 -17 -192
5916 -192 -224 28 -98 190 -15 -387 149 -93 194 -134 92 2 391 52 -253 -139 103 7 -222 47 36
5937 36 291 -22 -253 -176 -58 127 -144 153 -31 -178 105 -2 -27 45 55 461 32 -200 0 111 164 -100
$$ packed form
5820a31m6K32k20M90m15R7j97K81j3M2nk52o9M33k72O1J77j06J3k72K09m0O8r7
5844c2N8O5k22J81m5k9n8J76k9n6j39K35N8p9l35M04p5L8l9o8q6J21k12J83p3
5869e8O5j58l6K27L4k9Q1q8J46l55L44l18J2J31k23L66l5k43J97N9k41K34j0j65
5893f3o6P2j29R3M48j99j95r5J80J60j51j43n8j0M10k54J34j89K06k20O4j2j75
5916a92l2K52j26K88k05l72N36k42K87l28K26r0L89l39l05J14K42r6k29K69j1
5937C6K55l13k31P7J18J85k71K97j84j47K83j07k5P2J0M06m29k32K00J11N3k64
$$ [...]
8191E1
##END NTUPLES=NMR FID
##END=
